Unconstrained properties
type: Ontology
description: Properties that are derived from the elements of all of the RDA entities with semantics that are independent of the IFLA Library Reference Model.
preferred namespace prefix: rdau
rights: Copyright © 2020 American Library Association, Canadian Federation of Library Associations, and CILIP: Chartered Institute of Library and Information Professionals
licence: deed.en US
creator: RDA Steering Committee
contributor: RSC Technical Working Group
publisher: ALA Digital Reference
type: http://rdaregistry.info/termList/RDALinkedDataWork/1003
issued: 2014-01-18
title: Rajoittamattomat RDA-ominaisuudet @fi
description: RDA-elementeistä johdetut ominaisuudet ilman erityisiä tai implisiittisiä rajoituksia RDA-entiteeteille. @fi
version info: v5.4.2
modified: 2025-05-16

has abbreviated title
status: Published
definition: Relates a resource to a title that is abbreviated for purposes of indexing or identification.
type: Property
sub property of: has title
lexical alias: abbreviatedTitle.en
label: har forkortet titel @da
definition: Relaterer en ressource til en titel, der er forkortet mhp. indeksering eller identifikation. @da
inverse of: is abbreviated title of
label: heeft afgekorte titel @nl
label: aineiston lyhennetty nimeke @fi
label: له عنوان مُختصر @ar
definition: يربط بين مصدر وعنوان تم اختصاره لأغراض التكشيف أو التحديد. @ar
definition: Liittää aineiston nimekkeeseen, joka on lyhennetty indeksointia tai tunnistamista varten. @fi
label: hat Kurztitel @de
definition: Setzt eine Ressource in Beziehung zu einem Titel, der zum Zwecke der Indexierung oder der Identifizierung gekürzt ist. @de
label: 有缩略题名 @zh-hans
definition: 将一种资源与为索引或标识的目的而被缩略的一个题名关联起来。 @zh-hans
label: rövidített címe a következő: @hu
definition: Hozzákapcsol egy forrást egy címhez, amelyet indexelési vagy azonosítási célokból rövidítettek. @hu
label: kısaltılmış başlık ile ilişkilidir @tr
definition: Bir kaynağı, dizinleme veya tanımlama amacıyla kısaltılmış bir başlıkla ilişkilendirir. @tr

is abbreviated title of
status: Published
lexical alias: abbreviatedTitleOf.en
definition: Relates a nomen to a resource that has a title of resource that has been abbreviated for purposes of indexing or identification.
type: Property
inverse of: has abbreviated title
label: is afgekorte titel van @nl
label: هو عنوان مختصر لـ @ar
definition: يربط تسمية بمصدر له عنوان مصدر تم اختصاره لغرض التكشيف أو التعريف. @ar
label: er forkortet titel af @da
definition: Relaterer ett nomen til en ressource, som har en ressourcetitel, der er blevet forkortet med henblik på indeksering eller identifikation. @da
label: aineiston lyhennetty nimeke @fi
definition: Liittää nomenin aineistoon, jolla on indeksointia tai tunnistamista varten lyhennetty nimeke. @fi
label: ist Kurztitel von @de
definition: Setzt ein Nomen in Beziehung zu einer Ressource, die einen Titel einer Manifestation hat, der zum Zwecke der Indexierung oder der Identifizierung gekürzt wurde. @de
label: 是……的缩略题名 @zh-hans
definition: 将一个命名与有用于索引或标识目的被缩略的资源题名的一种资源关联起来。 @zh-hans
label: rövidített címe a következőnek: @hu
definition: Hozzákapcsol egy noment egy forráshoz, amelynek címét indexelés vagy azonosítás céljából rövidítették. @hu
label: kısaltımış başlığıdır @tr
definition: Bir ismi, dizin oluşturma veya tanımlama amacıyla kısaltılmış kaynak başlığına sahip bir kaynakla ilişkilendirir. @tr

is abridged as
status: Published
definition: Relates a resource to a resource that shortens a related resource without changing the general meaning or manner of presentation.
type: Property
sub property of: has derivative
inverse of: is abridgement of
lexical alias: abridgedAs.en
label: er forkortet til @da
definition: Relaterer en ressource til en ressource, der forkorter en oprindelig ressource uden at ændre den overordnede betydning eller præsentationsmåde. @da
label: is ingekort als @nl
label: lyhennelmä (aineisto) @fi
label: هو مختصر كـ @ar
definition: يربط بين مصدر ومصدر يختصر مصدرًا ذو صلة دون تغيير المعنى العام أو طريقة العرض. @ar
definition: Liittää aineiston aineistoon, joka lyhentää toista aineistoa muuttamatta esityksen yleistä sisältöä tai tyyliä. @fi
label: ist gekürzt als @de
definition: Setzt eine Ressource in Beziehung zu einer Ressource, die eine in Beziehung stehende Ressource ohne Änderung der allgemeinen Bedeutung oder Darstellungsweise kürzt. @de
label: 被缩编 @zh-hans
definition: 将一种资源与缩短一种相关资源而不改变其总体意义或呈现方式的一种资源关联起来。 @zh-hans
label: rövidítve a következőként: @hu
definition: Hozzákapcsol egy forrást egy forráshoz, amely egy kapcsolódó forrást tömörít, azaz lerövidít anélkül, hogy általános jelentését vagy előadásmódját megváltoztatná. @hu
label: olarak özetlenmiştir @tr
definition: Bir kaynağı, genel anlamını veya sunum şeklini değiştirmeden ilgili bir kaynağı kısaltan başka bir kaynakla ilişkilendirir. @tr

is abridgement of
status: Published
definition: Relates a resource to a resource that is shortened as a related resource without changing the general meaning or manner of presentation.
type: Property
sub property of: has source
inverse of: is abridged as
lexical alias: abridgementOf.en
label: er forkortelse af @da
definition: Relaterer en ressource til en ressource, der er blevet forkortet, dvs. afkortet, uden at der er ændret på en oprindelig ressources overordnede betydning eller præsentationsmåde. @da
label: is inkorting van @nl
label: lyhennelmä aineistosta @fi
label: هو اختصار لـ @ar
definition: يربط بين مصدر ومصدر تم اختصاره كمصدر ذي صلة دون تغيير المعنى العام أو طريقة العرض. @ar
definition: Liitää aineiston aineistoon, jota on lyhennetty toiseksi, liittyväksi aineistoksi muuttamatta yleistä merkitystä tai esitystapaa. @fi
label: ist Kurzfassung von @de
definition: Setzt eine Ressource in Beziehung zu einer in Beziehung stehenden Ressource, die gekürzt wurde, ohne die allgemeine Bedeutung oder Art der Darstellung der ursprünglichen Ressource zu verändern. @de
label: 是……的缩编 @zh-hans
definition: 将一种资源与被缩短为一种相关资源而不改变其总体意义或呈现方式的一种资源关联起来。 @zh-hans
label: rövidítése a következőnek: @hu
definition: Hozzákapcsol egy forrást egy forráshoz, amelyet kapcsolódó forrássá tömörítettek, azaz lerövidítettek anélkül, hogy általános jelentését vagy prezentációját megváltoztatták volna. @hu
definition: Relaciona un recurs amb un recurs que és escurçat com un recurs relacionat sense canviar el significat general o la forma de presentació. @ca
label: özetlenmiş halidir @tr
definition: Bir kaynağı, genel anlamı veya tanıtım şeklini değiştirmeden ilgili kaynak olarak kısaltılmış bir kaynakla ilişkilendirir. @tr

has abridger
status: Published
definition: Relates a resource to an agent who contributes to a resource by shortening a resource of a related resource without changing the general meaning or manner of presentation.
type: Property
sub property of: has contributor (Deprecated)
inverse of: is abridger of
lexical alias: abridger.en
scope note: Substantial modification that results in the creation of a new resource is excluded.
see also: has author
label: har forkorter @da
definition: Relaterer en ressource til en agent, der har bidraget til en ressource ved at forkorte eller komprimere en originalressource, men som i alt væsentligt har ladt originalens karakter og indhold uændret. @da
scope note: Væsentlige ændringer, der resulterer i skabelsen af en ny ressource, er ikke omfattet. @da
label: heeft inkorter @nl
label: aineiston lyhentäjä @fi
label: له مُلَخِص @ar
definition: يربط مصدر بوكيل يُساهم في مصدر من خلال تلخيص مصدر ذو صلة دون تغيير المعنى العام أو طريقة العرض. @ar
scope note: يُستبعد التعديل الجوهري الذي ينتج عنه إنشاء مصدر جديد. @ar
definition: Liittää aineiston toimijaan, joka on aineistossa osallisena lyhentämällä siihen liittyvää aineistoa muuttamatta esityksen yleistä sisältöä tai tyyliä. @fi
scope note: Ei koske oleellista muokkausta, joka johtaa uuden aineiston luomiseen. @fi
label: hat Kürzende/Kürzenden @de
definition: Setzt eine Ressource in Beziehung zu einem Akteur, der zu einer Ressource beiträgt, indem er eine in Beziehung stehende Ressource kürzt, ohne die allgemeine Bedeutung oder Art der Darstellung zu ändern. @de
scope note: Darunter fallen keine substantiellen Veränderungen, die zur Schaffung einer neuen Ressource führen. @de
label: 有缩编者 @zh-hans
definition: 将一种资源与通过缩短一种相关资源的一种资源而不改变其总体意义或呈现方式而对一种资源有贡献的一个行为者关联起来。 @zh-hans
scope note: 不包括导致一种新资源创作的实质性修改。 @zh-hans
definition: Relaciona un recurs amb un agent que contribueix a un recurs escurçant un recurs d’un recurs relacionat sense canviar el significat general o la forma de presentació. @ca
label: rövidítője a következő: @hu
definition: Hozzákapcsol egy forrást egy ágenshez, amely egy kapcsolódó forrás lerövidítésével hozzájárul egy forráshoz úgy, hogy a prezentáció általános jelentése vagy módja nem változik. @hu
scope note: Nem tartoznak ide az egy új forrás létrehozását eredményező lényegi változtatások. @hu
label: özetleyen ile ilişkilidir @tr
definition: Bir kaynağı, genel anlamını veya sunum şeklini değiştirmeden ilgili bir kaynağı kısaltarak bir kaynağa katkıda bulunan bir temsilci ile ilişkilendirir. @tr
scope note: Yeni bir kaynağın oluşturulmasıyla sonuçlanan önemli değişiklikler hariç tutulur. @tr

is abridger of
status: Published
definition: Relates an agent to a resource that includes a contribution by an agent of shortening another resource without changing the general meaning or manner of presentation.
type: Property
sub property of: is contributor of (Deprecated)
inverse of: has abridger
lexical alias: abridgerOf.en
see also: is author of
label: er forkorter af @da
definition: Relaterer en agent, der har bidraget til en ressource ved at forkorte eller komprimere den oprindelige ressource, men som i alt væsentligt har ladt den oprindelige ressources karakter og indhold være uændret til en ressource. @da
label: is inkorter van @nl
label: هو مُلَخِّص لـ @ar
definition: يربط بين وكيل ومصدر يتضمن إسهام وكيل في تلخيص مصدرًا آخر دون تغيير المعنى العام أو طريقة العرض. @ar
label: lyhentäjä (toimija) aineistossa @fi
definition: Liittää toimijan aineistoon, jossa toimija on osallisena lyhentämällä siihen liittyvää aineistoa muuttamatta esityksen yleistä sisältöä tai tyyliä. @fi
label: ist Kürzende/Kürzender von @de
definition: Setzt einen Akteur in Beziehung zu einer Ressource, zu der ein Akteur beiträgt, indem er eine andere Ressource kürzt, ohne die allgemeine Bedeutung oder Art der Darstellung zu verändern. @de
label: 是……的缩编者 @zh-hans
definition: 将一个行为者与包括缩短另一种资源而不改变其总体意义或呈现方式的一个行为者的贡献的一种资源关联起来。 @zh-hans
label: rövidítője a következőnek: @hu
definition: Hozzákapcsol egy ágenst egy forráshoz, amely magában foglalja az ágens közreműködését egy másik forrás lerövidítésével úgy, hogy a prezentáció általános jelentése vagy módja nem változik. @hu
label: özetleyenidir @tr
definition: Bir temsilciyi, genel anlamı veya sunum şeklini değiştirmeden başka bir kaynağı kısaltan temsilcinin katkısını içeren bir kaynakla ilişkilendirir. @tr

has absorbed agent
status: Published
type: Property
lexical alias: absorbedAgent.en
definition: Relates an agent to an agent who was absorbed by another agent.
inverse of: has absorbing agent
label: har absorberet agent @da
definition: Relaterer en agent til en agent, der var absorberet af en anden agent. @da
label: heeft opgenomen actor @nl
label: له وكيل مستحوذ عليه @ar
definition: يربط بين وكيل ووكيل مستحوذ عليه من قبل وكيل أخر. @ar
label: sulautunut toimija @fi
definition: Liittää toimijan toimijaan, joka on sulautunut toiseen toimijaan. @fi
label: hat übernommenen Akteur @de
definition: Setzt einen Akteur in Beziehung zu einem Akteur, der von einem anderen Akteur übernommen wird. @de
label: 有被吸收行为者 @zh-hans
definition: 将一个行为者与被另一个行为者吸收的一个行为者关联起来。 @zh-hans
label: magába olvasztott ágense a következő: @hu
definition: Hozzákapcsol egy ágenst egy ágenshez, amelyet magába olvasztott egy másik ágens. @hu
label: kapsanmış temsilci ile ilişkilidir @tr
definition: Bir temsilciyi, başka bir temsilci tarafından kapsanan bir temsilciyle ilişkilendirir. @tr

is absorbed by
status: Published
definition: Relates a resource to a resource whose content incorporates the content of another resource.
type: Property
sub property of: is succeeded by
inverse of: is absorption of
lexical alias: absorbedBy.en
label: er indlemmet af @da
definition: Relaterer en ressource til en ressource, der inkorporerer en anden ressource. @da
label: is opgenomen door @nl
label: sulautunut aineistoon @fi
label: هو مستوعَب عن طريق @ar
definition: يربط بين مصدر ومصدر يشتمل محتواه على محتوى مصدر آخَر. @ar
definition: Liittää aineiston aineistoon, jonka sisältöön lukeutuu toisen aineiston sisältö. @fi
label: ist aufgegangen in @de
definition: Setzt eine Ressource in Beziehung zu einer Ressource, deren Inhalt den Inhalt einer anderen Ressource umfasst. @de
label: 被……吸收 @zh-hans
definition: 将一种资源与其内容纳入另一种资源之内容的一种资源关联起来。 @zh-hans
label: magába olvasztja a következő: @hu
definition: Hozzákapcsol egy forrást egy forráshoz, amelynek tartalma egy másik forrás tartalmát magába olvasztja. @hu
label: tarafından kapsanmıştır @tr
definition: Bir kaynağı, içeriği başka bir kaynağın içeriğini barındıran bir kaynakla ilişkilendirir. @tr

is absorbed in part by
status: Published
definition: Relates a resource to a resource whose content incorporates the partial content of another resource.
type: Property
sub property of: is succeeded by
inverse of: is absorption in part of
lexical alias: absorbedInPartBy.en
label: er delvis indlemmet af @da
definition: Relaterer en ressource til en ressource, der delvis inkorporerer en anden ressources indhold. @da
label: is gedeeltelijk opgenomen door @nl
label: osittain sulautunut aineistoon @fi
label: هو مستوعب جزئيا عن طريق @ar
definition: يربط بين مصدر ومصدر يتضمن محتواه المحتوى الجزئي لمصدر آخر. @ar
definition: Liittä aineiston aineistoon, jonka sisältöön lukeutuu toisen aineiston osittainen sisältö. @fi
label: ist teilweise aufgegangen in @de
definition: Setzt eine Ressource in Beziehung zu einer Ressource, deren Inhalt teilweise den Inhalt einer anderen Ressource umfasst. @de
label: 被……部分吸收 @zh-hans
definition: 将一种资源与其内容纳入另一种资源之部分内容的一种资源关联起来。 @zh-hans
label: részben magába olvasztva @hu
definition: Hozzákapcsol egy forrást egy forráshoz, amelynek tartalma egy másik forrás tartalmának egy részét magába olvasztja. @hu
label: tarafından kısmen kapsanmıştır @tr
definition: Bir kaynağı, içeriği başka bir kaynağın kısmi içeriğini barındıran bir kaynakla ilişkilendirir. @tr

has absorbing agent
status: Published
type: Property
lexical alias: absorbingAgent.en
definition: Relates an agent to an agent who absorbed another agent.
inverse of: has absorbed agent
label: har indlemmende agent @da
definition: Relaterer en agent til en agent, der indlemmede en anden agent. @da
label: heeft opnemende actor @nl
label: له وكيل مستحوذ @ar
definition: يربط بين وكيل ووكيل يستحوذ على وكيل آخر. @ar
label: sulautunut toimija @fi
definition: Liittää toimijan toimijaan, joka on sulauttanut itseensä toisen toimijan. @fi
label: hat übernehmenden Akteur @de
definition: Setzt einen Akteur in Beziehung zu einem Akteur, der einen anderen Akteur übernimmt. @de
label: 有吸收行为者 @zh-hans
definition: 将一个行为者与吸收另一个行为者的一个行为者关联起来。 @zh-hans
label: magába olvasztó ágense a következő: @hu
definition: Hozzákapcsol egy ágenst egy ágenshez, amely magába olvaszt egy másik ágenst. @hu
label: kapsayan temsilci ile ilişkilidir @tr
definition: Bir temsilciyi, başka bir temsilciyi kapsayan bir temsilci ile ilişkilendirir. @tr

is absorption in part of
status: Published
definition: Relates a resource to a resource whose partial content is incorporated in the content of another resource.
type: Property
sub property of: is preceded by
inverse of: is absorbed in part by
lexical alias: absorptionInPartOf.en
label: er delvis absorbering af @da
definition: Relaterer en ressource til en ressource, der er delvis inkorporeret i en anden ressource. @da
label: is gedeeltelijke opname van @nl
label: هو احتواء في جزء لـ @ar
definition: يربط بين مصدر ومصدر يكون محتواه الجزئي مدمجًا في محتوى مصدر آخر. @ar
label: osittain sulautunut aineisto @fi
definition: Liittää aineiston aineistoon, jonka osittainen sisältö on yhdistynyt toisen aineiston sisältöön. @fi
label: ist teilweise darin aufgegangen @de
definition: Setzt eine Ressource in Beziehung zu einer Ressource, deren Inhalt teilweise in den Inhalt einer anderen Ressource eingeflossen ist. @de
label: 是……的部分吸收 @zh-hans
definition: 将一种资源与其部分内容被纳入另一种资源之内容的一种资源关联起来。 @zh-hans
label: beolvasztása részben a következőnek: @hu
definition: Hozzákapcsol egy forrást egy forráshoz, amelynek részleges tartalma beolvad egy másik forrás tartalmába. @hu
label: kısmen kapsanmasıdır @tr
definition: Bir kaynağı, kısmi içeriği başka bir kaynağın içeriğine dahil edilen bir kaynakla ilişkilendirir. @tr

is absorption of
status: Published
definition: Relates a resource to a resource whose content is incorporated in the content of another resource.
type: Property
sub property of: is preceded by
inverse of: is absorbed by
lexical alias: absorptionOf.en
label: er absorbering af @da
definition: Relaterer en ressource til en ressource, der er blevet inkorporeret i en anden ressource. @da
label: is opname van @nl
label: هو احتواء لـ @ar
definition: يربط بين مصدر ومصدر يكون محتواه مدمجًا في محتوى مصدر آخر. @ar
label: sulautunut aineisto @fi
definition: Liittää aineiston aineistoon, jonka sisältö on yhdistynyt toisen aineiston sisältöön. @fi
label: ist darin aufgegangen @de
definition: Setzt ein Ressource in Beziehung zu einer Ressource, deren Inhalt in den Inhalt einer anderen Ressource eingeflossen ist. @de
label: 是……的吸收 @zh-hans
definition: 将一种资源与其内容被纳入另一种资源之内容的一种资源关联起来。 @zh-hans
label: beolvasztása a következőnek: @hu
definition: Hozzákapcsol egy forrást egy forráshoz, amelynek tartalma beolvad egy másik forrás tartalmába. @hu
label: kapsanmasıdır @tr
definition: Bir kaynağı, içeriği başka bir kaynağın içeriğine dahil edilen bir kaynakla ilişkilendirir. @tr

has abstract
status: Published
definition: Relates a resource to a resource that is an objective summary of a resource.
type: Property
inverse of: is abstract of
label: er sammenfattet som @da
definition: Relaterer en ressource til en ressource, der forkorter en oprindelig ressource på en kortfattet, objektiv måde. @da
alternative label: is abstracted as
sub property of: has summary
lexical alias: abstract.en
label: is geabstraheerd als @nl
label: aineiston abstrakti @fi
label: هو مستخلص كـ @ar
definition: يربط بين مصدر ومصدر يختصر مصدرًا آخر بطريقة موجزة موضوعية. @ar
definition: Liittää aineiston aineistoon, joka on objektiivinen tiivistelmä aineistosta. @fi
alternative label: abstraktin perustana oleva aineisto @fi
label: ist Abstract als @de
definition: Setzt eine Ressource in Beziehung zu einer Ressource, die eine andere Ressource auf eine kurze, sachliche Art verkürzt. @de
alternative label: 被摘要为 @zh-hans
label: 有摘要 @zh-hans
definition: 将一种资源与作为一种资源之客观提要的一种资源关联起来。 @zh-hans
alternative label: és resumit com @ca
label: té resum @ca
definition: Relaciona un recurs amb un recurs que és un sumari objectiu d’un recurs. @ca
label: referátuma a következő: @hu
definition: Hozzákapcsol egy forrást egy forráshoz, amely egy másik forrást rövid, objektív módon lerövidít. @hu
alternative label: olarak özetlenir @tr
label: özet ile ilişkilidir @tr
definition: Bir kaynağı, bir kaynağın tarafsız bir özeti olan bir kaynakla ilişkilendirir. @tr

is abstracted in
status: Published
definition: Relates a resource to a resource that abstracts the contents of another resource.
type: Property
sub property of: has derivative
inverse of: is abstracts for
lexical alias: abstractedIn.en
label: er sammenfattet i @da
definition: Relaterer en ressource til en ressource, der er en abstracts- og indekseringsservice, der sammenfatter en oprindelig kildes indehold. @da
label: is geabstraheerd in @nl
label: abstraktit aineistosta @fi
label: هو مُستخلص في @ar
definition: يربط بين مصدر ومصدر يستخلص محتويات مصدر آخر. @ar
definition: Liittää aineiston aineistoon, joka on tiivistelmä toisen aineiston sisällöstä. @fi
label: ist Abstract in @de
definition: Setzt eine Ressource in Beziehung zu einer Ressource, die den Inhalt einer anderen Ressource zusammenfasst. @de
label: 被摘要于 @zh-hans
definition: 将一种资源与为另一种资源的内容编制摘要的一种资源关联起来。 @zh-hans
label: referálva a következőben: @hu
definition: Hozzákapcsol egy forrást egy forráshoz, amely egy másik forrás tartalmait absztrahálja. @hu
label: özetlenmiştir @tr
definition: Bir kaynağı, başka bir kaynağın içeriğini özetleyen bir kaynakla ilişkilendirir. @tr

is abstract of
status: Published
definition: Relates a resource to a resource that is summarized in an objective manner.
type: Property
inverse of: has abstract
lexical alias: abstractOf.en
label: er sammenfatning af @da
definition: Relaterer en ressource til en ressource, der er sammenfattet, dvs. forkortet på en kortfattet, objektiv måde. @da
sub property of: is summary of
label: is abstract van @nl
label: abstrakti aineistosta @fi
label: هو مُستخلص لـ @ar
definition: يربط بين مصدر ومصدر يتم اختصاره بطريقة موجزة موضوعية. @ar
definition: Liittää aineiston aineistoon, josta on tehty yhteenveto objektiivisella tavalla. @fi
label: ist Abstract von @de
definition: Setzt eine Ressource in Beziehung zu einer Ressource, die auf eine kurze, sachliche Art gekürzt ist. @de
label: 是……的摘要 @zh-hans
definition: 将一种资源与被客观提要的一种资源关联起来。 @zh-hans
definition: Relaciona un recurs amb un recurs que se sumaritza de manera objectiva. @ca
label: referátuma a következőnek: @hu
definition: Hozzákapcsol egy forrást egy forráshoz, amelyet rövid, objektív módon lerövidítettek. @hu
label: özetidir @tr
definition: Bir kaynağı, tarafsız bir biçimde özetlenmiş olan kaynakla ilişkilendirir. @tr

is abstracts for
status: Published
definition: Relates a resource to a resource that is abstracted by another resource.
type: Property
sub property of: has source
inverse of: is abstracted in
lexical alias: abstractsFor.en
label: er sammenfatninger af @da
definition: Relaterer en ressource til en ressource, hvis indhold er blevet sammenfattet af en abstract- og indekseringsservice. @da
label: is abstracts voor @nl
label: abstraktin perustana oleva aineisto @fi
label: هو مخلص لـ @ar
definition: يربط مصدر بمصدر تم تلخيصه من مصدر آخر @ar
definition: Liittää aineiston aineistoon, jonka toinen aineisto tiivistää. @fi
label: ist Abstracts für @de
definition: Setzt eine Ressource in Beziehung zu einer Ressource, die durch eine andere Ressource zusammengefasst wird. @de
label: 是……的摘要 @zh-hans
definition: 将一种资源与被另一种资源编制摘要的一种资源关联起来。 @zh-hans
label: referátum a következőhöz: @hu
definition: Hozzákapcsol egy forrást egy forráshoz, amelyet egy másik forrás absztrahált. @hu
label: özetler @tr
definition: Bir kaynağı başka bir kaynak tarafından soyutlanmış bir kaynakla ilişkilendirir. @tr

has academic degree
status: Published
definition: Relates a resource to a rank conferred as a guarantee of academic proficiency.
type: Property
lexical alias: academicDegree.en
label: har akademisk grad @da
definition: Relaterer en ressource til en rang, der tildeles som garanti for akademisk færdighed. @da
label: heeft academische graad @nl
label: akateeminen oppiarvo @fi
label: له درجة أكاديمية @ar
definition: يربط بين مصدر ورتبة تُمنح كضمان للكفاءة الأكاديمية. @ar
definition: Liittää aineiston akateemisen pätevyyden takeeksi myönnettyyn arvoon. @fi
label: hat akademischen Grad @de
definition: Setzt eine Ressource in Beziehung zu einem Rang, der als Bestätigung für wissenschaftliche Leistungen verliehen wird. @de
label: 有学位 @zh-hans
definition: 将一种资源与作为学术能力担保的一种等级关联起来。 @zh-hans
label: tudományos fokozata a következő: @hu
definition: Hozzákapcsol egy forrást egy ranghoz, amelyet tudományos jártasság garanciájaként adományoznak. @hu
label: akademik derece ile ilişkilidir @tr
definition: Bir kaynağı, akademik yeterliliğin kanıtı olarak verilen bir dereceyle ilişkilendirir. @tr

has academic supervisor
status: Published
lexical alias: academicSupervisor.en
definition: Relates a resource to an agent who is responsible for overseeing academic activity of any kind that results in a resource, including theses, research, and projects.
type: Property
label: heeft academische begeleider @nl
label: له مُشرف أكاديمي @ar
definition: يربط مصدر بوكيل مسؤول عن الإشراف على نشاط أكاديمي من أي نوع يسفر عن مصدر، ويشمل ذلك الأطروحات والبحوث والمشاريع. @ar
label: har akademisk vejleder @da
definition: Relaterer en ressource til en agent, som er ansvarlig for at føre tilsyn med akademisk aktivitet af enhver art, der resulterer i en ressource, herunder afhandlinger, forskning og projekter. @da
label: akateeminen ohjaaja (toimija) aineistossa @fi
definition: Liittää aineiston toimijaan, joka vastaa kaikenlaisen aineistoon johtavan akateemisen toiminnan valvonnasta, mukaan lukien tutkielmat, tutkimukset ja projektit. @fi
label: hat akademische Betreuerin/akademischen Betreuer @de
definition: Setzt eine Ressource in Beziehung zu einem Akteur, der akademische Tätigkeiten jeglicher Art betreut, die zu einer Ressource führen. Darunter fallen Hochschulschriften, Forschungen und Projekte. @de
label: 有学术主管 @zh-hans
definition: 将一种资源与负责导致一种资源的各种学术活动（包括论文、研究和项目）之监督的一个行为者关联起来。 @zh-hans
label: tudományos témavezetője a következő: @hu
definition: Hozzákapcsol egy forrást egy ágenshez, amely felelős bármilyen tudományos tevékenység felügyeletéért, amelynek eredménye egy forrás, szakdolgozatokat, kutatást és projekteket is beleértve. @hu
label: akademik danışman ile ilişkilidir @tr
definition: Tezler, araştırmalar ve projeler de dahil olmak üzere bir kaynağı, kaynakla sonuçlanan her türlü akademik faaliyeti denetlemekten sorumlu olan bir temsilci ile ilişkilendirir. @tr

has accessibility content
status: Published
definition: Relates a resource to an indication of the kinds of resource that provide alternative sensory modes to perceive the main resources that are embodied by an augmentation aggregate.
type: Property
lexical alias: accessibilityContent.en
scope note: Accessibility content includes accessible labels, audio description, captioning, image description, sign language, and subtitles. Accessibility content does not include subtitles in a language different from the spoken content.
label: har tilgængelighedsfremmende indhold @da
definition: Relaterer en ressource til en indikation af indhold, der giver alternative sansemåder for at forstå en ressources primære indhold. @da
scope note: Omfatter lydbeskrivelser, rubrikker, billedbeskrivelser, tegnsprog, og undertekster. Omfatter ikke undertekster på et andet sprog end det talte. @da
label: heeft toegankelijkheidscontent @nl
label: aineiston saavutettavuussisältö @fi
label: له محتوى تَسهيلي/ محتوى إتاحة @ar
definition: يربط بين مصدر ومؤشر لأنواع المصادر التي تُوفر أنماطًا حسية بديلة لإدراك المصادر الرئيسية التي يتم تجسيدها بواسطة إضافة تجميعة. @ar
scope note: يتضمن المحتوى التَسهيلي الآتي: ملصقات يمكن الوصول إليها، وصف صوتي، تعليق، وصف صورة، لغة إشارة، وترجمات. ولا يتضمن المحتوى التَسهيلي ترجمة بلغة مختلفة عن المحتوى المنطوق. @ar
definition: Liittää aineiston ilmaukseen niistä aineistoista, jotka tarjoavat vaihtoehtoisia aistintatapoja laajennusaggregaatin sisältämien pääaineistojen vastaanottamiseksi. @fi
scope note: Saavutettavuussisältö sisältää saavutettavat nimikkeet, kuunneltavan kuvauksen, otsikoinnin, kuvien kuvauksen, viittomakielen ja tekstityksen. Saavutettavuussisältö ei sisällä tekstitystä, joka eroaa puhutusta sisällöstä. @fi
label: hat barrierefreien Inhalt @de
definition: Setzt eine Ressource in Beziehung zu einer Angabe der Ressourcenarten, die alternative, sensorische Formen liefern, um die Hauptressource wahrzunehmen, welche durch ein Erweiterungsaggregat verkörpert werden. @de
scope note: Zum barrierefreien Inhalt gehören barrierefreie Labels, eine Audiodeskription, Untertitel für Hörgeschädigte, Bildbeschreibungen, Gebärdensprache und Untertitel. Zum barrierefreien Inhalt gehören nicht die Untertitel in einer Sprache, die von dem gesprochenen Inhalt abweichen. @de
label: 有无障碍内容 @zh-hans
definition: 将一种资源与提供用于感知被一种附增合集具体的主要资源的交替感官模式的资源的类型的指示关联起来。 @zh-hans
scope note: 无障碍内容包括无障碍标签、音频描述、说明文字、图像描述、记号语言和字幕。无障碍内容不包括不同于口语内容的另一种语言的字幕。 @zh-hans
label: akadálymentesítési tartalma a következő: @hu
definition: Hozzákapcsol egy forrást egy forrás azon típusainak a jelöléséhez, amelyek alternatív érzékelési módokat nyújtanak a bővülésből eredő aggregátumban megtestesülő fő források észleléséhez. @hu
scope note: Az akadálymentesítési tartalmak magukban foglalnak akadálymentes címkéket, hangzó leírást, képleírást, jelnyelvet és feliratozást. Nem tartoznak ide az egy új zenei forrás létrehozását eredményező lényegi változtatások. @hu
label: erişilebilinir içeriği ile ilişkilidir @tr
definition: Bir kaynağı, bir çoğaltma topluluğu tarafından somutlaştırılan ana kaynakları algılamak için alternatif duyusal modeller sağlayan kaynak türlerinin göstergesiyle ilişkilendirir. @tr
scope note: Erişilebilirlik içeriği, erişilebilir etiketler, sesli açıklama, resim açıklamaları, işaret dili ve altyazıları içerir. Erişilebilirlik içeriği, konuşulan içerikten farklı bir dilde altyazı içermez. @tr

has access point for entity
status: Published
sub property of: has appellation of entity
type: Property
lexical alias: accessPointForEntity.en
definition: Relates an entity to a nomen that is an appellation of entity in natural language that is taken from a vocabulary encoding scheme or is constructed using a string encoding scheme.
inverse of: is access point for entity of
label: heeft ingang voor entiteit @nl
label: له نقطة وصول لكيان @ar
definition: يربط بين كيان وتسمية كيان باللغة الطبيعية المأخوذة من مخطط ترميز مفردات أو مبنية باستخدام خطة ترميز سلسلة تمثيلات. @ar
label: har søgeindgang for entitet @da
definition: Relaterer en entitet til en entitetsbenævnelse på naturligt sprog, der er hentet fra et vokabularkodningsskema eller er konstrueret ved hjælp af et strengkodningsskema. @da
label: entiteetin hakutieto @fi
definition: Liittää entiteetin luonnollisella kielellä olevaan entiteetin nimitykseen, joka on otettu sanaston merkintäjärjestelmästä tai on muodostettu käyttämällä merkkijonon merkintäjärjestelmää. @fi
label: hat Sucheinstieg für eine Entität @de
definition: Setzt eine Entität in Beziehung zu einer Bezeichnung für eine Entität in natürlicher Sprache, die einem Vocabulary Encoding Scheme entnommen oder mit einem String Encoding Scheme konstruiert wird. @de
label: 有实体的检索点 @zh-hans
definition: 将一个实体与作为一个实体的称谓、取自一个词表编码体系或者用一个串编码体系构建、用自然语言的一个命名关联起来。 @zh-hans
definition: Relaciona una entitat amb un nomen que és una apel·lació d’entitat en llenguatge natural que s’obté d’un esquema de codificació de vocabulari o s’elabora usant un esquema de codificació de cadenes. @ca
label: entitás hozzáférési pontja a következő: @hu
definition: Hozzákapcsol egy entitást egy entitás olyan természetes nyelvű megnevezéséhez, amely egy szótárkódolási sémából származik, vagy egy karakterlánc-kódolási séma használatával szerkesztett. @hu
has subproperty: has authorized access point for entity
has subproperty: has variant access point for entity
has subproperty: has access point for agent
has subproperty: has access point for place
has subproperty: has access point for resource
has subproperty: has access point for timespan
label: varlık için erişim noktası ile ilişkilidir @tr
definition: Bir varlığı, bir kelime kodlama şemasından alınan veya bir dizi kodlama şeması kullanılarak oluşturulan doğal dildeki bir varlığın unvanıyla ilişkilendirir. @tr

is access point for entity of
status: Published
sub property of: is appellation of entity of
type: Property
lexical alias: accessPointForEntityOf.en
definition: Relates a nomen to an entity that has an appellation in natural language that is taken from a vocabulary encoding scheme or is constructed using a string encoding scheme.
inverse of: has access point for entity
label: is ingang voor entiteit van @nl
label: هو نقطة وصول لكيان لـ @ar
definition: يربط بين تسمية وكيان له اسم في لغة طبيعية مأخوذة من خطة ترميز مفردات أو مبنية باستخدام خطة ترميز سلسلة تمثيلات. @ar
label: er søgeindgang for entitet af @da
definition: Relaterer et nomen til en entitet, der har en benævnelse på naturligt sprog, der er hentet fra et vokabularkodningsskema eller er konstrueret ved hjælp af et strengkodningsskema. @da
label: entiteetin hakutieto @fi
definition: Liittää nomenin entiteettiin, jolla on luonnollisella kielellä oleva nimitys, joka on otettu sanaston merkintäjärjestelmästä tai on muodostettu käyttämällä merkkijonon merkintäjärjestelmää. @fi
label: ist Sucheinstieg für eine Entität von @de
definition: Setzt ein Nomen in Beziehung zu einer Entität, die eine Bezeichnung in natürlicher Sprache hat, die einem Vocabulary Encoding Scheme entnommen oder mit einem String Encoding Scheme konstruiert wird. @de
label: 是……的实体的检索点 @zh-hans
definition: 将一个命名与有取自一个词表编码体系或者用一个串编码体系构建、用自然语言的一个称谓的一个实体关联起来。 @zh-hans
label: hozzáférési pont a következő entitás számára: @hu
definition: Hozzákapcsol egy noment egy entitáshoz, amelynek van egy olyan természetes nyelvű megnevezése, amely egy szótárkódolási sémából származik, vagy egy karakterlánc-kódolási séma használatával szerkesztett. @hu
has subproperty: is authorized access point for entity of
has subproperty: is variant access point for entity of
has subproperty: is access point for agent of
has subproperty: is access point for place of
has subproperty: is access point for resource of
has subproperty: is access point for timespan of
label: varlığı için erişim noktasıdır @tr
definition: Bir ismi, bir kelime kodlama şemasından alınan veya bir dizi kodlama şeması kullanılarak oluşturulan doğal dilde bir unvana sahip olan bir varlıkla ilişkilendirir. @tr

is accompanied by
status: Published
definition: Relates a resource to a resource that is a part of the same resource as another part resource.
type: Property
sub property of: has accompanying resource relationship with (Deprecated)
lexical alias: accompaniedBy.en
label: er ledsaget af @da
definition: Relaterer en ressource til en ressource udgivet sammen med en anden ressource uden nogen relation til dens indhold. @da
label: is begeleid door @nl
label: aineiston mukana ilmestynyt @fi
label: هو مُرفق بـ @ar
definition: يربط بين مصدر ومصدر صَدر مع مصدر ذي صلة، بدون أي علاقة بمحتواه. @ar
definition: Liittää aineiston aineistoon, joka on ilmestynyt yhdessä toisen aineiston kanssa, mutta ei liity siihen sisällöllisesti. @fi
label: ist begleitet von einem @de
definition: Setzt eine Ressource in Beziehung zu einer Ressource, die mit einer in Beziehung stehenden Ressource erscheint, ohne eine Beziehung zu deren Inhalt zu haben. @de
label: 被……伴随 @zh-hans
definition: 将一种资源与作为另一种部分资源的同一种资源之一部分的一种资源关联起来。 @zh-hans
definition: Relaciona un recurs amb un recurs que és una part del mateix recurs com un altre recurs de part. @ca
label: kíséri a következő: @hu
definition: Hozzákapcsol egy forrást egy forráshoz, amelyet egy kapcsolódó forrással együtt adtak ki, a tartalmához való bármely kapcsolódás nélkül. @hu
has subproperty: is bound with
has subproperty: is on carrier unit with
label: eşliğindedir @tr
definition: Bir kaynağı, farklı bir kaynak parçası ile aynı kaynağın bir parçası olan kaynakla ilişkilendirir. @tr

has accompanying resource relationship with (Deprecated)
status: Deprecated
type: Property
definition: Relates a resource to a resource that is an augmentation of, or is augmented by, or is complemented by, or accompanies, or is accompanied by a resource. (Deprecated)
lexical alias: accompanyingResourceRelationshipWith.en
label: har ledsaget ressource-relation med @da
definition: Relaterer en ressource til en ressource, der er en berigelse af, eller er beriget af, eller er komplementeret af en ressource. @da
has subproperty: is accompanied by
has subproperty: is augmentation of
has subproperty: is augmented by
has subproperty: is complemented by
has subproperty: is held with

has actor
status: Published
definition: Relates a resource to an agent who is a performer who contributes to a resource by acting as a cast member or player in a musical or dramatic presentation.
type: Property
sub property of: has performer
inverse of: is actor of
lexical alias: actor.en
label: har skuespiller @da
definition: Relaterer en ressource til en performer, der har bidraget til en ressource ved at fungere som rolleindehaver eller aktør i en musikalsk eller dramatisk præsentation etc. @da
label: heeft acteur @nl
label: näyttelijä aineistossa @fi
label: له ممثل @ar
definition: يربط مصدر بوكيل يُمثل مؤدِ يُساهم في مصدر من خلال عمله كعضو فريق تمثيل أو كعازف في عرض موسيقي أو درامي. @ar
definition: Liittää aineiston henkilöön, joka on aineistossa osallisena esiintyjänä näyttelemällä tai soittamalla musiikki- tai näytelmäesityksessä. @fi
label: hat Schauspielerin/Schauspieler @de
definition: Setzt eine Ressource in Beziehung zu einer Ausführenden/einem Ausführenden, die/der zu einer Ressource als Ensemble-Mitglied oder Darstellerin/Darsteller in einer musikalischen oder dramatischen Darbietung und so weiter beiträgt. @de
label: 有演员 @zh-hans
definition: 将一种资源与作为一个表演者通过在音乐或戏剧呈现中扮演角色或演奏（演唱）对一种资源有贡献的一个行为者关联起来。 @zh-hans
label: színésze a következő: @hu
definition: Hozzákapcsol egy forrást egy előadó ágenshez, amely hozzájárul egy forráshoz azzal, hogy szereposztás tagjaként vagy előadóként működik közre egy zenei, drámai stb. bemutatóban. @hu
has subproperty: has voice actor
label: aktör ile ilişkilidir @tr
definition: Bir kaynağı, müzikal veya dramatik gösterimde oyuncu veya kast olarak kaynağa katkıda bulunan bir sanatçı olan temsilci ile ilişkilendirir. @tr

is actor of
status: Published
definition: Relates an agent to a resource that includes a contribution by an agent of acting as a cast member or player in a musical or dramatic presentation.
type: Property
sub property of: is performer of
inverse of: has actor
lexical alias: actorOf.en
label: er skuespiller i @da
definition: Relaterer en udøver, der bidrager til en ressource ved at være skuespiller eller musiker i en musikalsk eller dramatisk præsentation etc. til en ressource. @da
label: is acteur van @nl
label: näyttelijänä aineistossa @fi
label: هو ممثل لـ @ar
definition: يربط بين وكيل ومصدر يتضمن إسهام وكيل يعمل كعضو فريق تمثيل أو كعازف في عرض موسيقي أو درامي. @ar
definition: Liittää toimijan aineistoon, jonka tekemiseen hän osallistuu näyttelemällä musiikki- tai näytelmäesityksessä. @fi
label: ist Schauspielerin/Schauspieler von @de
definition: Setzt einen Akteur in Beziehung zu einer Ressource, zu der ein Akteur beiträgt, indem er als Ensemble-Mitglied oder Darstellerin/Darsteller in einer musikalischen oder dramatischen Darbietung fungiert. @de
label: 是……的演员 @zh-hans
definition: 将一个行为者与包括在音乐或戏剧呈现中扮演角色或演奏的一个行为者的贡献的一种资源关联起来。 @zh-hans
label: színésze a következőnek: @hu
definition: Hozzákapcsol egy ágenst egy forráshoz, amely magában foglalja egy ágensnek, mint a szereposztás egy tagjának vagy előadójának a közreműködését egy zenei vagy drámai bemutatóban. @hu
has subproperty: is voice actor of
label: aktörüdür @tr
definition: Bir temsilciyi, bir temsilcinin müzikal veya dramatik bir sunumda oyuncu olarak rol alan temsilcinin katkısını içeren bir kaynakla ilişkilendirir. @tr

is adaptation of
status: Published
definition: Relates a resource to a resource that is modified for a purpose, use, or medium other than that for which it was originally intended.
type: Property
sub property of: has source
inverse of: is adapted as
lexical alias: adaptationOf.en
scope note: This relationship applies to changes in form or to resources completely rewritten in the same form.
label: er bearbejdelse af @da
definition: Relaterer en ressource til en ressource, der er blevet ændret til et andet formål, en anden brug eller et andet medium end det, det oprindeligt var beregnet til. @da
scope note: Gælder for ændringer i form eller for ressourcer, der er omskrevet fuldstændigt i samme form. @da
label: is bewerking van @nl
label: mukaelma aineistosta @fi
label: هو اقتباس لـ @ar
definition: يربط بين مصدر ومصدر تم تعديله لغرض، استخدام، أو وسيط بخلاف ذلك الغرض الذي كان مخصصًا له في الأصل. @ar
scope note: تنتطبق هذه العلاقة على التغييرات في الشكل أو في المصادر المعاد كتابتها بالكامل بنفس الشكل. @ar
definition: Liittää aineiston aineistoon, jota on muokattu jotain muuta kuin alkuperäistä tarkoitusta, käyttöä tai esitysmuotoa varten. @fi
scope note: Tämä suhde koskee muutoksia aineiston muodossa tai samassa muodossa kokonaan uudelleenkirjoitettuja aineistoja. @fi
label: ist Bearbeitung von @de
definition: Setzt eine Ressource in Beziehung zu einer Ressource, die für einen anderen Zweck, eine andere Nutzung oder ein anderes Medium, als den/die/das, wofür sie ursprünglich konzipiert wurde, bearbeitet ist. @de
scope note: Diese Beziehung bezieht sich auf Änderungen der Form oder auf Ressourcen, die in derselben Form vollständig neu geschrieben sind. @de
label: 是……的改编 @zh-hans
definition: 将一种资源与以不同于起初意图的目的、使用或媒介被修改的一种资源关联起来。 @zh-hans
scope note: 这个关系适用于形式上的变化或者适用于以同样形式完全重写的资源。 @zh-hans
label: feldolgozása a következőnek: @hu
definition: Hozzákapcsol egy forrást egy forráshoz, amelyet olyan célra, használatra vagy médiumra módosítottak, amely eltér az eredetileg tervezettől @hu
scope note: Ez a kapcsolat érvényes a formai változásokra, vagy az ugyanabban a formában teljesen újraírt forrásokra. @hu
has subproperty: is dramatization of
has subproperty: is graphic novelization of
has subproperty: is motion picture adaptation of
has subproperty: is musical theatre adaptation of
has subproperty: is novelization of
has subproperty: is opera adaptation of
has subproperty: is radio adaptation of
has subproperty: is radio script based on
has subproperty: is screenplay based on
has subproperty: is television adaptation of
has subproperty: is verse adaptation of
has subproperty: is video adaptation of
has subproperty: is video game adaptation of
label: uyarlamasıdır @tr
definition: Bir kaynağı, orijinal olarak tasarlandığından farklı bir amaç, kullanım veya ortam için değiştirilmiş bir kaynakla ilişkilendirir. @tr
scope note: Bu ilişki, şekil değişiklikleri veya tamamen aynı biçimde yeniden yazılan kaynaklar için geçerlidir. @tr

is adapted as
status: Published
definition: Relates a resource to a resource that modifies another resource for a purpose, use, or medium other than that for which it was originally intended.
type: Property
sub property of: has derivative
inverse of: is adaptation of
lexical alias: adaptedAs.en
scope note: This relationship applies to changes in form or to resources completely rewritten in the same form.
label: er bearbejdet som @da
definition: Relaterer en ressource til en ressource, der modificerer en oprindelig ressource til et andet formål, en anden brug eller et andet medium end det, det oprindeligt var beregnet til. @da
scope note: Denne relation gælder for ændringer i form eller for ressourcer, der er omskrevet fuldstændigt i samme form. @da
label: is bewerkt als @nl
label: sovitettu (aineisto) @fi
label: هو مُقتبس كـ @ar
definition: يربط بين مصدر ومصدر يقوم بتعديل مصدر آخر لغرض، أو استخدام، أو وسيط بخلاف ذلك الغرض الذي كان مخصصًا له في الأصل. @ar
scope note: تنتطبق هذه العلاقة على التغييرات في الشكل أو في المصادر المعاد كتابتها بالكامل بنفس الشكل. @ar
definition: Liittää aineiston aineistoon, joka muokkaa toista aineistoa muuta kuin aineistolle alun perin suunniteltua tarkoitusta, käyttöä tai esitysmuotoa varten. @fi
scope note: Koskee muodon muutoksia tai aineiston kattavaa uudelleenkirjoittamista samassa muodossa. @fi
label: ist bearbeitet als @de
definition: Setzt eine Ressource in Beziehung zu einer Ressource, die eine andere Ressource für einen anderen Zweck, eine andere Nutzung oder ein anderes Medium bearbeitet als den/die/das, wofür sie ursprünglich konzipiert war. @de
scope note: Diese Beziehung bezieht sich auf Änderungen der Form oder auf Ressourcen, die in derselben Form vollständig neu geschrieben sind. @de
label: 被改编为 @zh-hans
definition: 将一种资源与以不同于起初意图的目的、使用或媒介修改另一资源的一种资源关联起来。 @zh-hans
scope note: 这个关系适用于形式上的变化或者适用于以同样形式完全重写的资源。 @zh-hans
label: feldolgozása a következőként: @hu
definition: Hozzákapcsol egy forrást egy forráshoz, amely egy másik forrást olyan célra, használatra vagy médiumra módosít, amely más, mint amit eredetileg terveztek. @hu
scope note: Ez a kapcsolat érvényes a formai változásokra, vagy az ugyanabban a formában teljesen újraírt forrásokra. @hu
has subproperty: is adapted as graphic novel
has subproperty: is adapted as motion picture
has subproperty: is adapted as musical theatre
has subproperty: is adapted as novel
has subproperty: is adapted as opera
has subproperty: is adapted as radio program
has subproperty: is adapted as radio script
has subproperty: is adapted as screenplay
has subproperty: is adapted as television program
has subproperty: is adapted as video
has subproperty: is adapted as video game
has subproperty: is adapted in verse as
has subproperty: is dramatized as
label: olarak uyarlanmıştır @tr
definition: Bir kaynağı, başlangıçta amaçlanandan farklı bir amaç, kullanım veya ortam için uyarlayan başka bir kaynakla ilişkilendirir. @tr
scope note: Bu ilişki, şekil değişiklikleri veya tamamen aynı biçimde yeniden yazılan kaynaklar için geçerlidir. @tr

is adapted as choreography
status: Published
definition: Relates a resource to a choreographic resource based on another resource.
type: Property
sub property of: has derivative
inverse of: is choreographic adaptation of
lexical alias: adaptedAsChoreography.en
label: er bearbejdet til koreografi @da
definition: Relaterer en ressource til en ressource, der består af bevægelse baseret på en oprindelig ressource. @da
label: is bewerkt als choreografie @nl
label: koreografiasovitus aineistosta @fi
label: هو مقتبَس كفن تصميم الرقصات @ar
definition: يربط بين مصدر ومصدر راقص اعتمد على مصدر آخر. @ar
definition: Liittää aineiston koreografiseen aineistoon, joka perustuu toiseen aineistoon. @fi
label: ist bearbeitet als Choreografie @de
definition: Setzt eine Ressource in Beziehung zu einer choreografischen Ressource, die auf einer anderen Ressource basiert. @de
label: 被改编为编舞 @zh-hans
definition: 将一种资源与基于另一种资源的一种编舞资源关联起来。 @zh-hans
label: koreográfiaként való feldolgozása a következő: @hu
definition: Hozzákapcsol egy forrást egy koreografikus forráshoz, amely egy másik forráson alapul. @hu
label: koreografi olarak uyarlanmıştır @tr
definition: Bir kaynağı, farklı bir kaynaktan uyarlanan koreografi ile ilişkilendirir. @tr

is adapted as graphic novel
status: Published
type: Property
lexical alias: adaptedAsGraphicNovel.en
definition: Relates a resource to a graphic novel based on another resource
inverse of: is graphic novelization of
sub property of: is adapted as
label: er bearbejdet til graphic novel @da
definition: Relaterer en ressource til en graphic novel baseret på en oprindelig ressource. @da
label: is bewerkt als stripboek @nl
label: هو مقتبس كرواية مصورة @ar
definition: يربط بين مصدر ورواية مصورة تعتمد على مصدر آخر. @ar
label: sarjakuvaversio (aineisto) @fi
definition: Liittää aineiston toiseen aineistoon perustuvaan sarjakuva-aineistoon. @fi
label: ist bearbeitet als Graphic Novel @de
definition: Setzt eine Ressource in Beziehung zu einer Graphic Novel, die auf einer anderen Ressource basiert. @de
label: 被改编为图解小说 @zh-hans
definition: 将一种资源与基于另一种资源的一种图解小说关联起来。 @zh-hans
label: képregényként való feldolgozása a következő: @hu
definition: Hozzákapcsol egy forrást egy képregényhez, amely egy másik forráson alapul. @hu
label: çizgi roman olarak uyarlanmıştır @tr
definition: Bir kaynağı, başka bir kaynağa dayalı olarak bir grafik romanla ilişkilendirir. @tr

is adapted as libretto
status: Published
definition: Relates a resource to a musical or choreographic resource such as an opera, a ballet, or other resource for the musical stage, or an oratorio
type: Property
sub property of: has derivative
inverse of: is libretto based on
lexical alias: adaptedAsLibretto.en
label: er bearbejdet til libretto @da
definition: Relaterer en ressource til en ressource, der består af tekst til en opera eller en anden ressource for den musikalske scene eller et oratorium baseret på en oprindelig ressource. @da
label: is bewerkt als libretto @nl
label: sovitettu libretoksi (aineisto) @fi
label: هو مقتبس كنص أوبرالي @ar
definition: يربط بين مصدر ومصدر موسيقي أو راقص مثل الأوبرا، الباليه، أو مصدر آخر للمسرح الموسيقي، أو موسيقى دينية. @ar
definition: Liittää aineiston musiikkiaineistoon tai koreografiseen aineistoon kuten oopperaan, balettiin tai muuhun musiikilliseen näyttämöteokseen tai oratorioon. @fi
label: ist bearbeitet als Libretto @de
definition: Setzt eine Ressource in Beziehung zu einer Musikressource oder choreografischen Ressource, wie zum Beispiel einer Oper, einem Ballett oder einer anderen Musikressource für die Bühne, oder zu einem Oratorium. @de
label: 被改编为台本 @zh-hans
definition: 将一种资源与诸如歌剧、芭蕾或其他舞台音乐资源或清唱剧的一种音乐或编舞资源关联起来。 @zh-hans
label: librettóként való feldolgozása a következő: @hu
definition: Hozzákapcsol egy forrást egy olyan zenei vagy koreografikus forráshoz, mint egy opera, vagy egyéb zenés színpadi forrás, vagy egy oratórium. @hu
label: libretto olarak uyarlanmıştır @tr
definition: Bir kaynağı opera, bale veya müzik sahnesi için başka bir kaynak ya da oratoryo gibi müzikal veya koreografik bir kaynakla ilişkilendirir @tr

is adapted as motion picture
status: Published
definition: Relates a resource to a motion picture that is based on another resource.
type: Property
sub property of: is adapted as
inverse of: is motion picture adaptation of
lexical alias: adaptedAsMotionPicture.en
label: er bearbejdet som film @da
definition: Relaterer en ressource til en film baseret på en oprindelig ressource. @da
label: is bewerkt als speelfilm @nl
label: aineiston elokuvaversio @fi
label: هو مقتبَس كفيلم سينمائي @ar
definition: يربط بين مصدر وفيلم سينمائي اعتمد على مصدر آخر. @ar
definition: Liittää aineiston toiseen aineistoon perustuvaan liikkuvan kuvan käsikirjoitukseen. @fi
label: ist bearbeitet als Film @de
definition: Setzt eine Ressource in Beziehung zu einem Film, der auf einer anderen Ressource basiert. @de
label: 被改编成电影 @zh-hans
definition: 将一种资源与基于另一种资源的一种电影关联起来。 @zh-hans
label: mozgóképként való feldolgozása a következő: @hu
definition: Hozzákapcsol egy forrást egy mozgóképhez, amely egy másik forráson alapul. @hu
label: sinema filmi olarak uyarlanmıştır @tr
definition: Bir kaynağı, başka kaynağa dayalı bir sinema filmi ile ilişkilendirir. @tr

is adapted as motion picture screenplay
status: Published
definition: Relates a resource to a resource that consists of a screenplay for a motion picture, based on another resource.
type: Property
sub property of: is adapted as screenplay
inverse of: is motion picture screenplay based on
lexical alias: adaptedAsMotionPictureScreenplay.en
label: er bearbejdet som film @da
definition: Relaterer en ressource til en ressource, der består af en drejebog til en film, baseret på en oprindelig ressource. @da
label: is bewerkt als speelfilmscenario @nl
label: sovitettu elokuvakäsikirjoitukseksi (aineisto) @fi
label: هو مقتبَس كسيناريو فيلم سينمائي @ar
definition: يربط بين مصدر ومصدر يتكون من سيناريو لفيلم سينمائي، اعتمد على مصدر آخَر. @ar
definition: Liittää aineiston aineistoon, joka on toiseen aineistoon perustuva elokuvan käsikirjoitus. @fi
label: ist bearbeitet als Filmdrehbuch @de
definition: Setzt eine Ressource in Beziehung zu einer Ressource, die aus dem Drehbuch für einen Film besteht und auf einer anderen Ressource basiert. @de
label: 被改编为电影剧本 @zh-hans
definition: 将一种资源与由基于另一种资源的一种动态图像作品的剧本组成的一种资源关联起来。 @zh-hans
label: mozgóképforgatókönyvként való feldolgozása a következő: @hu
definition: Hozzákapcsol egy forrást egy forráshoz, amely egy másik forráson alapuló mozgókép forgatókönyvéből áll. @hu
label: sinema filmi senaryosu olarak uyarlanmıştır @tr
definition: Bir kaynağı, başka bir kaynak temel alınarak sinema filmi senaryosundan oluşan bir kaynakla ilişkilendirir. @tr

is adapted as musical theatre
status: Published
definition: Relates a resource to a musical theatre resource based on another resource.
type: Property
sub property of: is adapted as
inverse of: is musical theatre adaptation of
lexical alias: adaptedAsMusicalTheatre.en
label: er bearbejdet til musikteater @da
definition: Relaterer en ressource til en musikteater-ressource baseret på en oprindelig ressource. @da
label: is bewerkt als muziektheater @nl
label: هو مقتبس كمسرح موسيقي @ar
definition: يربط بين مصدر ومصدر مسرحي موسيقي يعتمد على مصدر آخر. @ar
label: musikaaliversio (aineisto) @fi
label: ist bearbeitet als Musiktheaterstück @de
definition: Setzt eine Ressource in Beziehung zu einer Musiktheaterressource, die auf einer anderen Ressource basiert. @de
definition: Liittää aineiston musiikkiteatteriaineistoon, joka perustuu toiseen aineistoon. @fi
label: 被改编为音乐戏剧 @zh-hans
definition: 将一种资源与基于另一种资源的一种音乐戏剧资源的一种资源关联起来。 @zh-hans
label: zeneszínházi feldolgozása a következőként: @hu
definition: Hozzákapcsol egy forrást egy zeneszínházi forráshoz, amely egy másik forráson alapul. @hu
label: müzikal tiyatro olarak uyarlanmıştır @tr
definition: Bir kaynağı, başka bir kaynağa dayalı olarak bir müzikal tiyatro kaynağıyla ilişkilendirir. @tr

is adapted as novel
status: Published
definition: Relates a resource to a novel adapted from another resource.
type: Property
sub property of: is adapted as
inverse of: is novelization of
lexical alias: adaptedAsNovel.en
label: er bearbjdet til roman @da
definition: Relaterer en ressource til en roman bearbejdet ud fra en oprindelig ressource. @da
label: is bewerkt als roman @nl
label: romaanimukaelma-aineisto @fi
label: هو مقتبس كرواية @ar
definition: يربط بين مصدر ورواية مقتبسة من مصدر آخر. @ar
definition: Liittää aineiston toisesta aineistosta sovitettuun romaaniin. @fi
label: ist bearbeitet als Roman @de
definition: Setzt eine Ressource in Beziehung zu einem Roman, der auf einer anderen Ressource basiert. @de
label: 被改编为小说 @zh-hans
definition: 将一种资源与改编自另一种资源的一种小说关联起来。 @zh-hans
label: regényként való feldolgozása a következő: @hu
definition: Hozzákapcsol egy forrást egy regényhez, amelyet egy másik forrásból dolgoztak át. @hu
label: roman olarak uyarlanmıştır @tr
definition: Bir kaynağı, başka kaynaktan uyarlanan roman ile ilişkilendirir. @tr

is adapted as opera
status: Published
definition: Relates a resource to an opera based on another resource.
type: Property
sub property of: is adapted as
inverse of: is opera adaptation of
lexical alias: adaptedAsOpera.en
label: er bearbejdet til opera @da
definition: Relaterer en ressource til en opera baseret på en oprindelig ressource. @da
label: is bewerkt als opera @nl
label: هو مقتبس كأوبرا @ar
definition: يربط بين مصدر وأوبرا تعتمد على مصدر آخر. @ar
label: oopperasovitus (aineisto) @fi
definition: Liittää aineiston ooppera-aineistoon, joka perustuu toiseen aineistoon. @fi
label: ist bearbeitet als Oper @de
definition: Setzt eine Ressource in Beziehung zu einer Oper, die auf einer anderen Ressource basiert. @de
label: 被改编为歌剧 @zh-hans
definition: 将一种资源与基于另一种资源的一种歌剧关联起来。 @zh-hans
label: operaként való feldolgozása a következő: @hu
definition: Hozzákapcsol egy forrást egy operához, amely egy másik forráson alapul. @hu
label: opera olarak uyarlanmıştır @tr
definition: Bir kaynağı, başka bir kaynağa dayanan bir operay ile ilişkilendirir. @tr

is adapted as oratorio
status: Published
type: Property
lexical alias: adaptedAsOratorio.en
definition: Relates a resource to an oratorio based on another resource.
inverse of: is oratorio adaptation of
sub property of: has derivative
label: er bearbejdet til oratorium @da
definition: Relaterer en ressource til et oratorium baseret på en oprindelig ressource. @da
label: is bewerkt als oratorium @nl
label: هو مُقتبس كموسيقى دينية لـ @ar
definition: يربط بين مصدر وموسيقى دينية تعتمد على مصدر آخر. @ar
label: oratoriosovitus (aineisto) @fi
definition: Liittää aineiston oratorioon, joka perustuu toiseen aineistoon. @fi
label: ist bearbeitet als Oratorium @de
definition: Setzt eine Ressource in Beziehung zu einem Oratorium, das auf einer anderen Ressource basiert. @de
label: 被改编为清唱剧 @zh-hans
definition: 将一种资源与基于另一种资源的一种清唱剧关联起来。 @zh-hans
label: oratóriumként való feldolgozása a következő: @hu
definition: Hozzákapcsol egy forrást egy oratóriumhoz, amely egy másik forráson alapul. @hu
label: oratoryo olarak uyarlanmıştır @tr
definition: Bir kaynağı, başka bir kaynağa dayanan bir oratoryo ile ilişkilendirir. @tr

is adapted as radio program
status: Published
definition: Relates a resource to a radio program based on another resource.
type: Property
sub property of: is adapted as
inverse of: is radio adaptation of
lexical alias: adaptedAsRadioProgram.en
label: er bearbejdet til radioprogram (udtryk) @da
definition: Relaterer en ressource til et radioprogram baseret på et oprindeligt udtryk. @da
label: is bewerkt als radioprogramma @nl
label: radiosovitus aineistosta @fi
label: هو مقتبَس كبرنامج إذاعي @ar
definition: يربط بين مصدر وبرنامج إذاعي اعتمد على مصدر آخر. @ar
definition: Liittää aineiston radio-ohjelmaan, joka perustuu toiseen aineistoon. @fi
label: ist bearbeitet als Hörfunksendung @de
definition: Setzt eine Ressource in Beziehung zu einer Hörfunksendung, die auf einer anderen Ressource basiert. @de
label: 被改编为广播节目 @zh-hans
definition: 将一种资源与基于另一种资源的一种广播节目关联起来。 @zh-hans
label: rádióműsorként való feldolgozása a következő: @hu
definition: Hozzákapcsol egy forrást egy rádióműsorhoz, amely egy másik forráson alapul. @hu
label: radyo programı olarak uyarlanmıştır @tr
definition: Bir kaynağı farklı bir kaynaktan uyarlanan radyo programıyla ilişkilendirir. @tr

is adapted as radio script
status: Published
definition: Relates a resource to a resource that consists of a script for a radio program, based on another resource.
type: Property
sub property of: is adapted as
inverse of: is radio script based on
lexical alias: adaptedAsRadioScript.en
label: er bearbejdet til radiomanuskript @da
definition: Relaterer en ressource til en ressource, der består af et manuskript til et radioprogram, baseret på en oprindelig ressource. @da
label: is bewerkt als radioscript @nl
label: sovitettu radiokäsikirjoitukseksi (aineisto) @fi
label: هو مقتبَس كنص إذاعي @ar
definition: يربط بين مصدر ومصدر يتكون من نص لبرنامج إذاعي، اعتمد على مصدر آخَر. @ar
definition: Liittää aineiston aineistoon, joka on toiseen aineistoon perustuva radio-ohjelman käsikirjoitus. @fi
label: ist bearbeitet als Hörfunkskript @de
definition: Setzt eine Ressource in Beziehung zu einer Ressource, die aus einem Skript für eine Hörfunksendung besteht und auf einer anderen Ressource basiert. @de
label: 被改编为广播文稿 @zh-hans
definition: 将一种资源与由基于另一种资源的一种广播节目的文稿组成的一种资源关联起来。 @zh-hans
label: rádiósszövegkönyvként való feldolgozása a következő: @hu
definition: Hozzákapcsol egy forrást egy forráshoz, amely egy másik forráson alapuló rádióműsor forgatókönyvéből áll. @hu
label: radyo metni olarak uyarlanmıştır @tr
definition: Bir kaynağı, başka bir kaynaktan uyarlanan bir radyo programı senaryosundan oluşan bir kaynakla ilişkilendirir. @tr

is adapted as screenplay
status: Published
definition: Relates a resource to a resource that consists of a screenplay for a motion picture, television program, or video, based on another resource.
type: Property
sub property of: is adapted as
inverse of: is screenplay based on
lexical alias: adaptedAsScreenplay.en
label: er bearbejdet som drejebog @da
definition: Relaterer en ressource til en ressource, der består af et manuskript til en film, et tv-program eller en video, baseret på en oprindelig ressource. @da
label: is bewerkt als scenario @nl
label: sovitettu käsikirjoitukseksi (aineisto) @fi
label: هو مقتبَس كسيناريو @ar
definition: يربط بين مصدر ومصدر يتكون من سيناريو فيلم سينمائي، برنامج تليفزيوني، أو فيديو، اعتمد على مصدر آخَر. @ar
definition: Liittää aineiston aineistoon, joka on toiseen aineistoon perustuva elokuvan, televisio-ohjelman tai videon käsikirjoitus. @fi
label: ist bearbeitet als Drehbuch @de
definition: Setzt eine Ressource in Beziehung zu einer Ressource, die aus einem Drehbuch für einen Film, eine Fernsehsendung oder ein Video besteht, das/die auf einer anderen Ressource basiert. @de
label: 被改编为影视剧本 @zh-hans
definition: 将一种资源与由基于资源的一种电影、电视节目或视频的剧本组成的一种资源关联起来。 @zh-hans
label: forgatókönyvként való feldolgozása a következő: @hu
definition: Hozzákapcsol egy forrást egy forráshoz, amely egy másik forráson alapuló mozgókép, televízióműsor vagy videó forgatókönyvéből áll. @hu
has subproperty: is adapted as motion picture screenplay
has subproperty: is adapted as television screenplay
has subproperty: is adapted as video screenplay
label: senaryo olarak uyarlanmıştır @tr
definition: Bir kaynağı, başka bir kaynaktan uyarlanan sinema filmi, televizyon programı veya video senaryosundan oluşan bir kaynakla ilişkilendirir. @tr

is adapted as television program
status: Published
definition: Relates a resource to a television program based on another resource.
type: Property
sub property of: is adapted as
inverse of: is television adaptation of
lexical alias: adaptedAsTelevisionProgram.en
label: er bearbejdet til tv-program @da
definition: Relaterer en ressource til et TV-program baseret på en oprindelig ressource. @da
label: is bewerkt als televisieprogramma @nl
label: televisiosovitus aineistosta @fi
label: هو مقتبَس كبرنامج تليفزيوني @ar
definition: يربط بين مصدر وبرنامج تلفزيوني اعتمد على مصدر آخر. @ar
definition: Liittää aineiston toiseen aineistoon perustuvaan televisio-ohjelmaan. @fi
label: ist bearbeitet als Fernsehsendung @de
definition: Setzt eine Ressource in Beziehung zu einer Fernsehsendung, die auf einer anderen Ressource basiert. @de
label: 被改编为电视节目 @zh-hans
definition: 将一种资源与基于另一种资源的一种电视节目关联起来。 @zh-hans
label: televízióműsorként való feldolgozása a következő: @hu
definition: Hozzákapcsol egy forrást egy televízióműsorhoz, amely egy másik forráson alapul. @hu
label: televizyon programı olarak uyarlanmıştır @tr
definition: Bir kaynağı, başka bir kaynağı temel alan bir televizyon programıyla ilişkilendirir. @tr

is adapted as television screenplay
status: Published
definition: Relates a resource to a resource that consists of a screenplay for a television program, based on another resource.
type: Property
sub property of: is adapted as screenplay
inverse of: is television screenplay based on
lexical alias: adaptedAsTelevisionScreenplay.en
label: er bearbejdet til tv-manuskript @da
definition: Relaterer en ressource til en ressource, der består af et manuskript til et tv-program, baseret på en oprindelig ressource. @da
label: is bewerkt als televisiescenario @nl
label: sovitettu televisiokäsikirjoitukseksi (aineisto) @fi
label: هو مقتبَس كسيناريو تلفزيون @ar
definition: يربط بين مصدر ومصدر يتكون من سيناريو فيلم سينمائي لبرنامج تليفزيوني، اعتمد على مصدر آخَر. @ar
definition: Liittää aineiston aineistoon, joka on toiseen aineistoon perustuva televisio-ohjelman käsikirjoitus. @fi
label: ist bearbeitet als Fernsehdrehbuch @de
definition: Setzt eine Ressource in Beziehung zu einer Ressource, die aus dem Drehbuch für eine Fernsehsendung besteht und auf einer anderen Ressource basiert. @de
label: 被改编为电视剧本 @zh-hans
definition: 将一种资源与由基于另一种资源的一种电视节目的剧本组成的一种资源关联起来。 @zh-hans
label: tévésforgatókönyvként való feldolgozása a következő: @hu
definition: Hozzákapcsol egy forrást egy forráshoz, amely egy másik forráson alapuló televízióműsor forgatókönyvéből áll. @hu
label: televizyon senaryosu olarak uyarlanmıştır @tr
definition: Bir kaynağı, başka bir kaynaktan uyarlanan televizyon programı senaryosundan oluşan bir kaynakla ilişkilendirir. @tr

is adapted as video
status: Published
definition: Relates a resource to a video based on another resource.
type: Property
sub property of: is adapted as
inverse of: is video adaptation of
lexical alias: adaptedAsVideo.en
label: er bearbejdet til video @da
definition: Relaterer en ressource til en video baseret på en oprindelig ressource. @da
label: is bewerkt als video @nl
label: videosovitus (aineisto) @fi
label: هو مقتبَس كفيديو @ar
definition: يربط بين مصدرً وفيديو مبني على مصدر آخر. @ar
definition: Liittää aineiston videoon, joka perustuu toiseen aineistoon. @fi
label: ist bearbeitet als Video @de
definition: Setzt eine Ressource in Beziehung zu einem Video, das auf einer anderen Ressource basiert. @de
label: 被改编为视频 @zh-hans
definition: 将一种资源与基于另一种资源的一种视频关联起来。 @zh-hans
label: videóként való feldolgozása a következő: @hu
definition: Hozzákapcsol egy forrást egy videóhoz, amely egy másik forráson alapul. @hu
label: video olarak uyarlanmıştır @tr
definition: Bir kaynağı başka bir kaynağı temel alan bir video ile ilişkilendirir @tr

is adapted as video game
status: Published
type: Property
lexical alias: adaptedAsVideoGame.en
definition: Relates a resource to a resource that is a video game based on another resource.
inverse of: is video game adaptation of
sub property of: is adapted as
label: er bearbejdet som computerspil @da
definition: Relaterer en ressource til en videospilsressource baseret på en oprindelig ressource. @da
label: is bewerkt als computerspel @nl
label: هو مقتبس كلعبة فيديو @ar
definition: يربط بين مصدر ولعبة فيديو تعتمد على مصدر آخر. @ar
label: videopelisovitus (aineisto) @fi
definition: Liittää aineiston toiseen aineistoon perustuvaan videopeliaineistoon. @fi
label: ist bearbeitet als Videospiel @de
definition: Setzt eine Ressource in Beziehung zu einem Videospiel, das auf einer anderen Ressource basiert. @de
label: 被改编为视频游戏 @zh-hans
definition: 将一种资源与基于另一种资源的一种视频游戏关联起来。 @zh-hans
label: videójátékként való feldolgozása a következő: @hu
definition: Hozzákapcsol egy forrást egy videójátékhoz, amely egy másik forráson alapul. @hu
definition: Relaciona un recurs amb un recurs que és un videojoc basat en un altre recurs. @ca
label: video oyunu olarak uyarlanmıştır @tr
definition: Bir kaynağı, başka bir kaynağa dayanan bir video oyunu olan kaynakla ilişkilendirir. @tr

is adapted as video screenplay
status: Published
definition: Relates a resource to a resource that consists of a screenplay for a video, based on another resource.
type: Property
sub property of: is adapted as screenplay
inverse of: is video screenplay based on
lexical alias: adaptedAsVideoScreenplay.en
label: er bearbejdet til videomanuskript @da
definition: Relaterer en ressource til en ressource, der består af et manuskript til en video, baseret på en oprindelig ressource. @da
label: is bewerkt als videoscenario @nl
label: sovitettu videokäsikirjoitukseksi (aineisto) @fi
label: هو مقتبَس كسيناريو فيديو @ar
definition: يربط بين مصدر ومصدر يتكون من سيناريو فيلم سينمائي لفيديو، اعتمد على مصدر آخَر. @ar
definition: Liittää aineiston aineistoon, joka on toiseen aineistoon perustuva videon käsikirjoitus. @fi
label: ist bearbeitet als Videodrehbuch @de
definition: Setzt eine Ressource in Beziehung zu einer Ressource, die aus dem Drehbuch für ein Video besteht und auf einer anderen Ressource basiert. @de
label: 被改编为视频剧本 @zh-hans
definition: 将一种资源与由基于另一种资源的一种视频的剧本组成的一种资源关联起来。 @zh-hans
label: videóforgatókönyv-feldolgozása a következő: @hu
definition: Hozzákapcsol egy forrást egy forráshoz, amely egy másik forráson alapuló videó forgatókönyvéből áll. @hu
label: video senaryosu olarak uyarlanmıştır @tr
definition: Bir kaynağı, başka bir kaynaktan uyarlanan video senaryosundan oluşan bir kaynakla ilişkilendirir. @tr

is adapted in verse as
status: Published
definition: Relates a resource to a literary composition in verse form adapted from another resource.
type: Property
sub property of: is adapted as
inverse of: is verse adaptation of
lexical alias: adaptedInVerseAs.en
label: bearbejdet i versform som @da
definition: Relaterer en ressource til en litterær komposition i versform, bearbejdet ud fra en oprindelig ressource. @da
label: is bewerkt in versvorm als @nl
label: aineiston runomukaelma @fi
label: هو مقتبَس شعريًا كـ @ar
definition: يربط بين مصدر وتركيب أدبي في شكل شعر مُقتبس من مصدر آخر. @ar
definition: Liittää aineiston runomuodossa olevaan aineistoon, joka on sovitettu toisesta aineistosta. @fi
label: ist bearbeitet als Gedicht @de
definition: Setzt eine Ressource in Beziehung zu einer literarischen Dichtung in Versform, die auf einer anderen Ressource basiert. @de
label: 被改编成韵文作为 @zh-hans
definition: 将一种资源与被改编自另一种资源的一种文学韵文写作关联起来。 @zh-hans
label: verses feldolgozása a következőként: @hu
definition: Hozzákapcsol egy forrást egy másik forrásból adaptált verses formájú irodalmi alkotáshoz. @hu
label: manzum olarak uyaralnmıştır @tr
definition: Bir kaynağı, başka kaynaktan uyarlanan manzum biçimdeki bir edebi kompozisyon ile ilişkilendirir. @tr

has addenda
status: Published
definition: Relates a resource to a resource that consists of brief content that is essential for the completeness of a related resource.
type: Property
sub property of: is augmented by
inverse of: is addenda to
lexical alias: addenda.en
label: er tillæg @da
definition: Relaterer en ressource til en ressource, der består af kortfattet indhold, som er væsentligt for fuldstændigheden af en anden ressource. @da
label: heeft toevoegingen @nl
label: lisäykset aineistossa @fi
label: له إضافات @ar
definition: يربط بين مصدر ومصدر يتكون من محتوى موجز يُعَد ضروريًا لاستكمال مصدر ذي صلة. @ar
definition: Liittää aineiston aineistoon, joka koostuu suppeasta sisällöstä, joka on olennainen siihen liittyvän aineiston kokonaisuudelle. @fi
label: hat Ergänzung @de
definition: Setzt eine Ressource in Beziehung zu einer Ressource, die aus kurzem Inhalt besteht, der für die Vollständigkeit einer in Beziehung stehenden Ressource notwendig ist. @de
label: 有补遗 @zh-hans
definition: 将一种资源与由简要内容组成并对一种相关资源的完整性必不可少的一种资源关联起来。 @zh-hans
label: pótlása a következő: @hu
definition: Hozzákapcsol egy forrást egy rövid tartalomból álló forráshoz, amely nélkülözhetetlen egy kapcsolódó forrás teljességéhez. @hu
label: ek ile ilişkilidir @tr
definition: Bir kaynağı, ilgili kaynağın bütünlüğü için gerekli olan kısa içerikten oluşan kaynakla ilişkilendirir. @tr

is addenda to
status: Published
definition: Relates a resource to a resource whose content is completed with brief content from a related resource.
type: Property
sub property of: is augmentation of
inverse of: has addenda
lexical alias: addendaTo.en
label: er tillæg til @da
definition: Relaterer en ressource til en ressource, hvortil der er tilføjet kortfattet ekstra materiale fra en anden ressource. @da
label: is toevoegingen bij @nl
label: lisäykset aineistoon @fi
label: هو إضافة لـ @ar
definition: يربط بين مصدر ومصدر يكتمل محتواه بمحتوى موجز من مصدر ذي صلة. @ar
definition: Liittää aineiston aineistoon, jonka sisältöä täydennetään suppealla sisällöllä siihen liittyvän aineiston sisällöstä. @fi
label: ist Ergänzung zu @de
definition: Setzt eine Ressource in Beziehung zu einer Ressource, deren Inhalt durch kurzen Inhalt einer in Beziehung stehenden Ressource vervollständigt wird. @de
label: 是……的补遗 @zh-hans
definition: 将一种资源与其内容加上一种相关资源的简要内容后就完整的一种资源关联起来。 @zh-hans
label: pótlással ellátott: @hu
definition: Hozzákapcsol egy forrást egy forráshoz, amelynek tartalmát egy kapcsolódó forrás rövid tartalmával teszik teljessé. @hu
label: ektir @tr
definition: Bir kaynağı, içeriği ilgili bir kaynağın kısa içeriğiyle tamamlanmış bir kaynakla ilişkilendirir. @tr

has additional scale information
status: Published
definition: Relates a resource to an indication of supplemental information about scale.
type: Property
sub property of: has scale
lexical alias: additionalScaleInformation.en
scope note: Statement of comparative measurements or limitation of the scale to particular parts of the content of a resource are included.
label: har supplerende målestoksforhold @da
definition: Relaterer en ressource til en indikation af supplerende oplysninger om målestoksforhold. @da
scope note: Supplerende målestoksforhold omfatter angivelse i flere måleenheder eller som begrænsning af målestoksforholdet til visse dele af ressourcen. @da
label: heeft aanvullende schaalinformatie @nl
label: له معلومات إضافية لمقياس @ar
definition: يربط بين مصدر ومؤشر لمعلومات تكلميلية بشأن مقياس. @ar
scope note: تتضمن بيان قياسات مقارنة أو قيود لمقياس لأجزاء محددة من محتوى المصدر. @ar
label: lisätieto aineiston mittakaavasta @fi
definition: Liittää aineiston mittakaavaan lisättyjen tietojen merkintään. @fi
scope note: Lisätieto mittakaavasta tarkoittaa merkintöä vertailevista mitoista tai mittakaavan rajauksesta aineiston sisällön tiettyihin osiin yms. @fi
label: hat zusätzliche Informationen zu einem Maßstab @de
definition: Setzt eine Ressource in Beziehung zu ergänzenden Informationen zu einem Maßstab. @de
scope note: Darunter fällt eine Angabe von Vergleichsmaßen oder eine Begrenzung des Maßstabs auf bestimmte Teile des Inhalts einer Ressource. @de
label: 有附加比例尺信息 @zh-hans
definition: 将一种资源与关于比例尺的补充信息表示关联起来。 @zh-hans
scope note: 包括一种资源之内容的比较测量的说明或对资源内容特定部分的比例尺限制 @zh-hans
label: további méretarány-információja a következő: @hu
definition: Hozzákapcsol egy forrást egy a méretarányról szóló kiegészítő információ jelöléséhez. @hu
scope note: Az összehasonlító mérések vagy egy forrástartalom adott részeinek méretarányra vonatkozó korlátozásainak közlése is idetartozik. @hu
label: ek ölçek bilgisi ile ilişkilidir @tr
definition: Bir kaynağı, ölçekle ilgili ek bilgilerin göstergesiyle ilişkilendirir. @tr
scope note: Karşılaştırmalı ölçümlerin bildirimi veya ölçeğin bir kaynağın içeriğinin belirli bölümleriyle sınırlandırılması da dahildir. @tr

has addressee
status: Published
definition: Relates a resource to an agent to whom a resource or a portion of a resource is addressed.
type: Property
sub property of: has other agent associated with resource (Deprecated)
inverse of: is addressee of
lexical alias: addressee.en
label: har adressat @da
definition: Relaterer en ressource til en agent, som en ressource eller en del af en ressource er adresseret til. @da
label: heeft geadresseerde @nl
label: aineiston vastaanottaja @fi
label: له مُرسل إليه @ar
definition: يربط مصدر بوكيل أُرسل إليه مصدر أو جزء من مصدر. @ar
definition: Liittää aineiston toimijaan, jolle aineisto tai osa aineistosta on osoitettu. @fi
label: hat Adressatin/Adressat @de
definition: Setzt eine Ressource in Beziehung zu einem Akteur, an den eine Ressource oder ein Teil einer Ressource adressiert ist. @de
label: 有接受者 @zh-hans
definition: 将一种资源与一种资源或资源的一部分要被其接受的一个行为者关联起来。 @zh-hans
definition: Relaciona un recurs amb un agent al qual s’adreça un recurs o una part d’un recurs. @ca
label: címzettje a következő: @hu
definition: Hozzákapcsol egy forrást egy ágenshez, amelynek egy forrást vagy egy forrás egy részét címeztek. @hu
label: muhatap ile ilişkilidir @tr
definition: Bir kaynağı, kaynağın veya kaynağın bir kısmının muhatap olduğu bir temsilci ile ilişkilendirir. @tr

is addressee of
status: Published
definition: Relates an agent to a resource or a portion of a resource that is addressed to an agent.
type: Property
sub property of: is other agent associated with resource of (Deprecated)
inverse of: has addressee
lexical alias: addresseeOf.en
label: er adressat i @da
definition: Relaterer en agent, som en ressource eller en del af en ressource er adresseret til til en ressource. @da
label: is geadresseerde van @nl
label: هو مُرسل إليه لـ @ar
definition: يربط بين وكيل ومصدر أو بجزء من مصدر مرسل إلى وكيل. @ar
label: aineiston vastaanottaja (toimija) @fi
definition: Liittää toimijan aineistoon, jolle aineisto tai osa aineistosta on osoitettu. @fi
label: ist Adressatin/Adressat von @de
definition: Setzt einen Akteur in Beziehung zu eine Ressource oder einem Teil einer Ressource, die/der an einen Akteur adressiert ist. @de
label: 是……的接受者 @zh-hans
definition: 将一个行为者与要被一个行为者接受的一种资源或资源的一部分关联起来。 @zh-hans
label: címzettje a következőnek: @hu
definition: Hozzákapcsol egy ágenst egy forráshoz vagy egy forrás egy részéhez, amelyet az ágensnek címeztek. @hu
label: muhatabıdır @tr
definition: Bir temsilciyi, bir temsilciye muhatap olduğu kaynağın bir parçası veya bir kaynakla ilişkilendirir. @tr

has address of agent
status: Published
definition: Relates an agent to an address of an agent.
type: Property
lexical alias: addressOfAgent.en
label: har adresse på agent @da
definition: Relaterer en ressourcetil en agents bopælsadresse, forretningsadresse eller arbejdsgivers adresse og/eller en e-mail- eller internetadresse. @da
inverse of: is address of agent of (Deprecated)
label: heeft adres van actor @nl
label: له عنوان مراسلة لوكيل @ar
definition: يربط بين وكيل وعنوان مراسلة خاص بوكيل. @ar
label: toimijan osoite @fi
definition: Liittää aineiston toimijan osoitteeseen. @fi
label: hat Adresse eines Akteurs @de
definition: Setzt einen Akteur in Beziehung zu einer Adresse eines Akteurs. @de
label: 有行为者的地址 @zh-hans
definition: 将一个行为者与一个行为者的一个地址关联起来。 @zh-hans
label: ágens címe a következő: @hu
definition: Hozzákapcsol egy ágenst egy ágens címéhez. @hu
label: temsilcinin adresi ile ilişkilidir @tr
definition: Bir temsilciyi, bir temsilcinin adresiyle ilişkilendirir. @tr

is address of agent of (Deprecated)
status: Deprecated
type: Property
lexical alias: addressOfAgentOf.en
inverse of: has address of agent

has affiliation (Deprecated)
definition: Relates a resource to a group with which an agent is affiliated or is affiliated through employment, membership, cultural identity, etc. (Deprecation)
type: Property
lexical alias: affiliation.en
label: har tilhørsforhold @da
definition: Relaterer en ressource til en gruppe, som en agent er eller har været tilknyttet via beskæftigelse, medlemskab, kulturel identitet etc. @da
status: Deprecated

has agent history
status: Published
definition: Relates an agent to a summary of information about the history of an agent.
type: Property
lexical alias: agentHistory.en
label: har agenthistorie @da
definition: Relaterer en ressource til biografiske eller historiske oplysninger om en agent. @da
label: heeft actor geschiedenis @nl
label: toimijan historia @fi
label: له وكيل تاريخ @ar
definition: يربط بين وكيل ومعلومات متعلقة بالسيرة الذاتية أو معلومات تاريخية عن وكيل ما. @ar
definition: Liittää toimijan biografiseen tai historialliseen informaatioon toimijasta. @fi
label: hat Geschichte eines Akteurs @de
definition: Setzt einen Akteur in Beziehung zu biografischen oder historischen Informationen über einen Akteur. @de
label: 有行为者历史 @zh-hans
definition: 将一个行为者与关于一个行为者历史的信息提要关联起来。 @zh-hans
definition: Relaciona un agent amb un sumari d’informació sobre la història d’un agent. @ca
label: ágens története a következő: @hu
definition: Hozzákapcsol egy ágenst egy ágensre vonatkozó életrajzi vagy történeti információhoz. @hu
label: temsilci geçmişi ile ilişkilidir @tr
definition: Bir temsilciyi, temsilciye ait bibliografik ya da tarihi bilgiyle ilişkilendirir @tr

is aggregated by
status: Published
lexical alias: aggregatedBy.en
definition: Relates a resource to a resource that aggregates a resource as part of the plan of an aggregating resource.
type: Property
inverse of: aggregates
label: is geaggregeerd door @nl
label: هو مُجَمَّع بواسطة @ar
definition: يربط بين مصدر ومصدر يقوم بتجميع مصدر كجزء تجميع مصدر. @ar
label: er samlet af @da
definition: Relaterer en ressource til en ressource, som samler en ressource som en del af en samlende ressource. @da
label: aggregoitu aineisto @fi
definition: Liittää aineiston aineistoon, joka aggregoi aineiston osaksi aggregoivan aineiston suunnitelmaa. @fi
label: ist aggregiert von @de
definition: Setzt eine Ressource in Beziehung zu einer Ressource, die eine Ressource als Teil des Konzepts einer aggregierenden Ressource aggregiert. @de
label: 被……编制合集 @zh-hans
definition: 将一种资源与把一种资源编制合集作为一种合集性资源的计划之部分的一种资源关联起来。 @zh-hans
label: aggregáltja a következőnek: @hu
definition: Hozzákapcsol egy forrást egy forráshoz, amely aggregál egy olyan forrást, amely az aggregáló forrás tervének a része. @hu
label: tarafından toplanmıştır @tr
definition: Bir kaynağı, toplu bir kaynağın planının bir parçası olarak bir kaynağı toplayan bir kaynakla ilişkilendirir. @tr

aggregates
status: Published
lexical alias: aggregates.en
definition: Relates a resource to a resource that is chosen as part of the plan of an aggregating resource.
type: Property
label: aggregeert @nl
label: متجمعات @ar
definition: يربط بين مصدر ومصدر تم اختياره كجزء من خطة تجميع مصدر. @ar
label: samlinger @da
definition: Relaterer en ressource til en ressource, som er valgt som en del af en plan for en samlende ressource. @da
label: aggregoiva aineisto @fi
definition: Liittää aineiston aineistoon, joka on valittu aggregoivan aineiston suunnitelmaan. @fi
label: Aggregate @de
definition: Setzt eine Ressource in Beziehung zu einer Ressource, die als Teil des Konzepts einer aggregierenden Ressource ausgewählt wird. @de
label: 合集 @zh-hans
definition: 将一种资源与被选为一种合集性资源的计划之部分的一种资源关联起来。 @zh-hans
label: aggregálja @hu
definition: Hozzákapcsol egy forrást egy forráshoz, amelyet egy aggregáló forrás tervének részeként választanak. @hu
label: toplama @tr
definition: Bir kaynağı, toplayıcı bir kaynağın planının bir parçası olarak seçilen bir kaynakla ilişkilendirir. @tr

has aggregator
status: Published
lexical alias: aggregator.en
definition: Relates a resource to an agent who is responsible for creating an aggregating resource by selecting and arranging other resources.
type: Property
inverse of: is aggregator of
label: heeft aggregator @nl
label: له مجمع @ar
definition: يربط مصدر بوكيل مسؤول عن إنشاء مصدر مجمع عن طريق اختيار وترتيب مصادر أخرى. @ar
label: har samler @da
definition: Relaterer en ressource til en agent, som er ansvarlig for at skabe en samlende ressource, ved at udvælge og ordne andre ressourcer. @da
label: aineiston aggregaattori @fi
definition: Liittää aineiston toimijaan, joka vastaa aggregoivan teoksen luomisesta valitsemalla ja järjestämällä muita aineistoja. @fi
label: hat Aggregator @de
definition: Setzt eine Ressource in Beziehung zu einem Akteur, der für die Erstellung einer aggregierenden Ressource verantwortlich ist, indem er andere Ressourcen auswählt und zusammenstellt. @de
sub property of: has creator
label: 有合集编者 @zh-hans
definition: 将一种资源与负责把其他资源选择和整理后创建一种合集性资源的一个行为者关联起来。 @zh-hans
label: aggregátora a következő: @hu
definition: Hozzákapcsol egy forrást egy ágenshez, amely felelős egy aggregáló forrás létrehozásáért, más források kiválasztása és elrendezése révén. @hu
has subproperty: has compiler
label: toplayıcı ile ilişkilidir @tr
definition: Bir kaynağı, diğer kaynakları seçerek ve düzenleyerek bir toplama kaynağı oluşturmaktan sorumlu olan bir temsilci ile ilişkilendirir. @tr

is aggregator of
status: Published
lexical alias: aggregatorOf.en
definition: Relates an agent to a resource that involves a responsibility of an agent for aggregation by selecting and arranging other resources.
type: Property
label: is aggregator van @nl
label: هو مجمع لـ @ar
definition: يربط بين وكيل ومصدر ينطوي على مسؤولية وكيل عن اختيار وترتيب مصادر أخرى. @ar
label: er samler af @da
definition: Relaterer en agent til en ressource, som involverer et ansvar af at være agent for en samling ved at udvælge og ordne andre ressourcer. @da
label: aggregaattori (toimija) aineistossa @fi
definition: Liittää toimijan aineistoon, jossa toimija vastaa aggregoivan teoksen luomisesta valitsemalla ja järjestämällä muita aineistoja. @fi
label: ist Aggregator von @de
definition: Setzt einen Akteur in Beziehung zu einer Ressource, bei der ein Akteur für die Aggregation verantwortlich ist, indem er andere Ressourcen auswählt und zusammenstellt. @de
sub property of: is court reporter of
label: 是……的合集编者 @zh-hans
definition: 将一个行为者与涉及把其他资源选择和整理后编制合集的一个行为者的责任的一种资源关联起来。 @zh-hans
label: aggregátora a következőnek: @hu
definition: Hozzákapcsol egy ágenst egy forráshoz, amelyhez hozzátartozik egy ágens felelőssége a más források kiválasztásával és elrendezésével járó aggregálásért. @hu
has subproperty: is compiler of
label: toplayıcısıdır @tr
definition: Bir temsilciyi diğer kaynakları seçerek ve düzenleyerek toplamakla görevli bir temsilcinin sorumluluğunu içeren bir kaynakla ilişkilendirir. @tr

is also issued as
status: Published
definition: Relates a resource to a resource that carries the same content of a resource in a different format.
type: Property
sub property of: has equivalent
lexical alias: alsoIssuedAs.en
label: er også udgivet som @da
definition: Relaterer en ressource til en ressource, der omfatter det samme indehold af en ressource i et andet format. @da
label: is ook uitgevaardigd als @nl
label: aineiston muu julkaisumuoto @fi
label: هو صدر أيضًا كـ @ar
definition: يربط بين مصدر ومصدر يحمل نفس المحتوى لمصدر في شكل مختلف. @ar
definition: Liittää aineiston samansisältöiseen aineistoon, joka on eri julkaisumuodossa. @fi
label: ist auch erschienen als @de
definition: Setzt eine Ressource in Beziehung zu einer Ressource, die denselben Inhalt einer Ressource in einem anderen Format enthält. @de
label: 也被发行为 @zh-hans
definition: 将一种资源与用不同格式承载和一种资源同样内容的一种资源关联起来。 @zh-hans
label: szintén kiadva a következőként: @hu
definition: Hozzákapcsol egy forrást egy forráshoz, amely egy forrás ugyanazon tartalmát hordozza eltérő formátumban. @hu
label: olarak da piyasaya çıkarılmaktadır @tr
definition: Bir kaynağı, kaynağın aynı içeriğini farklı bir biçimde sunan bir kaynakla ilişkilendirir. @tr

has alternate identity
status: Published
definition: Relates an agent to a nomen that is a pseudonym or other appellation used by an agent.
type: Property
lexical alias: alternateIdentity.en
label: har alternativ identitet @da
definition: Relaterer en pseudonym eller anden identitet antaget af en person til en agent. @da
label: heeft alternatieve identiteit @nl
label: vaihtoehtoinen identiteetti @fi
label: له هوية بديلة @ar
definition: يربط بين وكيل وتسمية قد تكون اسما مستعارا أو أي تسمية أخرى يستخدمها وكيل. @ar
definition: Liittää toimijan nomeniin, joka on pseudonyymi tai toimijan käyttämä muu nimitys. @fi
label: hat andere Identität @de
definition: Setzt einen Akteur in Beziehung zu einem Nomen, bei dem es sich um ein Pseudonym oder eine andere, von einem Akteur verwendete, Bezeichnung handelt. @de
label: 有交替身份 @zh-hans
definition: 将一个行为者与作为一个行为者所使用的一个化名或其他称谓的命名关联起来。 @zh-hans
label: alternatív identitása: @hu
definition: Hozzákapcsol egy ágenst egy nomenhez, amely egy álnév vagy más, egy ágens által használt megnevezés. @hu
label: alternatif kimlik ile ilişkilidir @tr
definition: Bir temsilciyi, bir temsilci tarafından kullanılan bir takma ad veya başka bir unvan ile ilişkilendirir. @tr

is alternate identity of
status: Published
lexical alias: alternateIdentityOf.en
definition: Relates a nomen to an agent who has an appellation of agent that is a pseudonym or other assumed identity.
type: Property
label: is alternatieve identiteit van @nl
label: هي هوية بديلة لشخص لـ @ar
definition: يربط بين تسمية ووكيل له تسمية وكيل عبارة عن اسم مستعار أو أي هوية مفترضة أخرى. @ar
label: er alternativ identitet til @da
definition: Relaterer et nomen til en agent, som har en benævnelse for agent, der er et pseudonym eller anden antaget identitet. @da
label: toinen identiteetti @fi
definition: Liittää nomenin toimijaan, jonka nimitys on pseudonyymi tai muu omaksuttu identiteetti. @fi
label: ist andere Identität von @de
definition: Setzt ein Nomen in Beziehung zu einem Akteur, der über eine Bezeichnung für einen Akteur verfügt, bei der es sich um ein Pseudonym oder eine andere angenommene Identität handelt. @de
label: 是……的交替身份 @zh-hans
definition: 将一个命名与有化名或其他假定身份作为行为者称谓的一个行为者关联起来。 @zh-hans
label: alternatív identitása a következőnek: @hu
definition: Hozzákapcsol egy noment egy ágenshez, amelynek olyan ágensmegnevezése van, amely álnév vagy más feltételezett identitás. @hu
label: alternatif kimliğidir @tr
definition: Bir ismi, takma isim veya başka bir varsayılan kimlik olan bir temsilci unvanına sahip bir temsilciyle ilişkilendirir. @tr

is analysed in
status: Published
definition: Relates a resource to a resource that describes the structure and composition of another resource.
type: Property
sub property of: is described by
inverse of: is analysis of
lexical alias: analysedIn.en
label: er analyseret i @da
definition: Relaterer en ressource til en ressource, der undersøger en oprindelig ressource for at identificere dets dele og deres relationer. @da
label: is geanalyseerd in @nl
label: analysoitu aineisto @fi
label: هو مُحَلَّل في @ar
definition: يربط بين مصدر ومصدر يصف بنية وتكوين مصدر آخر. @ar
definition: Liitttää aineiston aineistoon, joka kuvaa toisen aineiston rakennetta. @fi
label: ist analysiert in @de
definition: Setzt eine Ressource in Beziehung zu einer Ressource, die den Aufbau und die Zusammensetzung einer anderen Ressource beschreibt. @de
label: 被分析于 @zh-hans
definition: 将一种资源与描述另一种资源的结构和创作的一种资源关联起来。 @zh-hans
label: elemezve a következőben: @hu
definition: Hozzákapcsol egy forrást egy forráshoz, amely egy másik forrást vizsgál, hogy leírhassa annak alkotóelemeit és azok viszonyait. @hu
label: içinde analiz edilmiştir @tr
definition: Bir kaynağı başka bir kaynağın yapısını ve bileşimini anlatan bir kaynakla ilişkilendirir. @tr

is analysis of
status: Published
definition: Relates a resource to a resource whose structure is described by a resource.
type: Property
sub property of: is description of
inverse of: is analysed in
lexical alias: analysisOf.en
label: er analyse af @da
definition: Relaterer en ressource til en ressource, der er blevet undersøgt for at identificere dets bestanddele og deres relationer. @da
label: is analyse van @nl
label: analyysi aineistosta @fi
label: هو تحليل لـ @ar
definition: يربط بين مصدر ومصدر تم وصف بنيته بواسطة مصدر. @ar
definition: Liittää aineiston aineistoon, jonka rakenne on kuvattu toisessa aineistossa. @fi
label: ist Analyse von @de
definition: Setzt eine Ressource in Beziehung zu einer Ressource, deren Struktur von einer Ressource beschrieben wird. @de
label: 是……的分析 @zh-hans
definition: 将一种资源与其结构被一种资源描述的一种资源关联起来。 @zh-hans
label: elemzése a következőnek: @hu
definition: Hozzákapcsol egy forrást egy forráshoz, amelynek alkotóelemeit leírja egy forrás. @hu
label: analizidir @tr
definition: Bir kaynağı, yapısının bir kaynak tarafından tanımlandığı bir kaynakla ilişkilendirir. @tr

has animator
status: Published
definition: Relates a resource to an agent who contributes to a resource by giving apparent movement to inanimate objects or drawings.
type: Property
sub property of: has contributor (Deprecated)
inverse of: is animator of
lexical alias: animator.en
scope note: Creation of the drawings that are animated is excluded.
see also: has artist
label: har animator @da
definition: Relaterer en ressource til en agent, der har bidraget til en ressource af et levende billedværk eller et computerprogram ved at give en illusion af bevægelse til livløse genstande eller tegninger. @da
scope note: Skabelse af tegninger, der er animeret, er ikke omfattet. @da
label: heeft animator @nl
label: aineiston animaattori @fi
label: له فنان رسوم متحركة @ar
definition: يربط مصدر بوكيل يُساهم في مصدر من خلال إعطاء حركة واضحة للأجسام غير الحية أو الرسومات . @ar
scope note: يُستبعد إنشاء الرسومات المتحركة. @ar
definition: Liittää aineiston toimijaan, joka on aineistossa osallisena tuottamalla näennäistä liikettä elottomiin esineisiin tai piirroksiin. @fi
scope note: Ei koske animaatiopiirrosten tekijää. @fi
label: hat Trickfilmzeichnerin/Trickfilmzeichner @de
definition: Setzt eine Ressource in Beziehung zu einem Akteur, der zu einer Ressource beiträgt, indem er unbelebte Objekte oder Zeichnungen in scheinbare Bewegung versetzt. @de
scope note: Darunter fällt nicht die Schaffung der Zeichnungen, die animiert werden. @de
label: 有动画师 @zh-hans
definition: 将一种资源与通过给予无生命对象或绘画以貌似运动而对一种资源有贡献的一个行为者关联起来。 @zh-hans
scope note: 不包括动画图的创作。 @zh-hans
label: animátora a következő: @hu
definition: Hozzákapcsol egy forrást egy ágenshez, amely élettelen tárgyak vagy rajzok látszólagos mozgatásával járul hozzá a forráshoz. @hu
scope note: Az animált rajzok megalkotása nem tartozik ide. @hu
label: animatör ile ilişkilidir @tr
definition: Bir kaynağı, cansız nesnelere veya çizimlere görünür hareket vererek bir kaynağa katkıda bulunan bir temsilci ile ilişkilendirir. @tr
scope note: Animasyonlu çizimlerin oluşturulması hariçtir @tr

is animator of
status: Published
definition: Relates an agent to a resource that includes a contribution by an agent of giving apparent movement to inanimate objects or drawings.
type: Property
sub property of: is contributor of (Deprecated)
inverse of: has animator
lexical alias: animatorOf.en
scope note: Creation of the drawings that are animated is excluded.
see also: is artist of
label: er animator til @da
definition: Relaterer en agent der der har bidraget til en levende billed-ressource eller et computerprogram ved at give en illusion af bevægelse til livløse genstande eller tegninger til en ressource. @da
label: is animator van @nl
label: هو فنان رسوم متحركة لـ @ar
definition: يربط بين وكيل ومصدر يتضمن إسهام وكيل لإعطاء حركة واضحة لكائنات غير حية أو رسومات. @ar
scope note: يُستبعد إنشاء الرسومات المتحركة. @ar
scope note: Skabelse af de tegninger der er animeret er ikke omfattet. @da
label: animaattori (toimija) aineistossa @fi
definition: Liittää toimijan aineistoon, jossa toimija on osallisena tuottamalla näennäistä liikettä elottomiin esineisiin tai piirroksiin. @fi
scope note: Ei koske animaatiopiirrosten tekijää. @fi
label: ist Trickfilmzeichnerin/Trickfilmzeichner von @de
definition: Setzt einen Akteur in Beziehung zu einer Ressource, zu der ein Akteur beiträgt, indem er unbelebte Objekte oder Zeichnungen in scheinbare Bewegung versetzt. @de
scope note: Darunter fällt nicht die Schaffung der Zeichnungen, die animiert werden. @de
label: 是……的动画师 @zh-hans
definition: 将一个行为者与包括一个行为者对给予无生命对象或绘画以貌似运动之贡献的一种资源关联起来。 @zh-hans
scope note: 不包括动画图的创作。 @zh-hans
label: animátora a következőnek: @hu
definition: Hozzákapcsol egy ágenst egy forráshoz, amely magában foglalja az ágens közreműködését élettelen tárgyak vagy rajzok látszólagos mozgatásában. @hu
scope note: Az animált rajzok megalkotása nem tartozik ide. @hu
label: animatörüdür @tr
definition: Bir temsilciyi, hareketsiz nesnelere veya çizimlere görünür hareket veren temsilcinin katkısını içeren bir kaynakla ilişkilendirir. @tr
scope note: Animasyonlu çizimlerin oluşturulması hariçtir. @tr

has annotator
status: Published
definition: Relates a resource to an agent who adds notes and other information to a resource by hand.
type: Property
sub property of: has other agent associated with resource (Deprecated)
inverse of: is annotator of
lexical alias: annotator.en
label: har annotationsskriver @da
definition: Relaterer en ressource til en agent, der laver manuskriptnotater på et eksemplar. @da
label: heeft annotator @nl
label: lisähuomautusten kirjoittaja aineistossa @fi
label: له مُعَلِّق @ar
definition: يربط مصدر بوكيل يُضيف حواشي ومعلومات أخرى لمصدر يدويًا. @ar
definition: Liittää aineiston toimijaan, joka kirjoittaa käsinkirjoitettuja huomautuksia ja muita selityksiä. @fi
label: hat Annotierende/Annotierenden @de
definition: Setzt eine Ressource in Beziehung zu einem Akteur, der handschriftlich Anmerkungen und andere Informationen in eine Ressource hinzufügt. @de
label: 有手写批注者 @zh-hans
definition: 将一种资源与在一种资源上手加批注和其他信息的一个行为者关联起来。 @zh-hans
label: jegyzetekkel ellátója a következő: @hu
definition: Hozzákapcsol egy forrást egy ágenshez, aki jegyzeteket és más, kézzel írott információt fűz a foráshoz. @hu
label: yorumlayıcı ile ilişkilidir @tr
definition: Bir kaynağı, bir kaynağa elle notlar ve diğer bilgiler ekleyen bir temsilci ile ilişkilendirir. @tr

is annotator of
status: Published
definition: Relates an agent to a resource that carries notes and other information added by hand.
type: Property
sub property of: is other agent associated with resource of (Deprecated)
inverse of: has annotator
lexical alias: annotatorOf.en
label: er annotationsforfatter i @da
definition: Relaterer en agent der skriver annotationer i hånden på en ressource til en ressource. @da
label: is annotator van @nl
label: هو مُعَلِّق على @ar
definition: يربط بين وكيل ومصدر يشتمل على ملاحظات ومعلومات أخرى أضيفت بخط اليد. @ar
label: lisähuomautusten kirjoittaja (toimija) aineistossa @fi
definition: Liittää toimijan aineistoon, joka sisältää käsinkirjoitettuja huomautuksia ja muita selityksiä. @fi
label: ist annotierender Akteur von @de
definition: Setzt einen Akteur in Beziehung zu einer Ressource, die handschriftlich Anmerkungen und andere Informationen beinhaltet. @de
label: 是……的手写批注者 @zh-hans
definition: 将一个行为者与载有手加批注和其他信息的一种资源关联起来。 @zh-hans
label: jegyzetekkel ellátója a következőnek: @hu
definition: Hozzákapcsol egy ágenst egy forráshoz, amely jegyzeteket és más, kézzel írott információt hordoz. @hu
label: yorumlayıcısıdır @tr
definition: Bir temsilciyi, elle eklenen notları ve diğer bilgileri taşıyan bir kaynakla ilişkilendirir. @tr

has appellant
status: Published
definition: Relates a resource to an agent who appeals a decision of a lower court recorded in a legal resource of a higher court.
type: Property
sub property of: has other agent associated with resource (Deprecated)
inverse of: is appellant of
lexical alias: appellant.en
label: har appellerende @da
definition: Relaterer en ressource til en agent der gør indsigelse mod en underrets beslutning, der er registreret i et juridisk værk fra en højere retsinstans. @da
label: heeft aanklager in beroep @nl
label: muutoksenhakija aineistossa @fi
label: له مُستأنف @ar
definition: يربط مصدر بوكيل يستأنف حكم صادر عن محكمة أدنى مسجل في مصدر قانوني لمحكمة أعلى. @ar
definition: Liittää aineiston toimijaan, joka hakee muutosta alemman oikeusasteen päätökseen. @fi
label: hat Berufungsklagende/Berufungsklagenden/Revisionsklagende/Revisionsklagenden @de
definition: Setzt eine Ressource in Beziehung zu einem Akteur, der gegen ein Gerichtsurteil einer unteren Instanz, das in einer juristischen Ressource einer höheren Instanz erfasst ist, Rechtsmittel (Berufung/Revision) einlegt. @de
label: 有上诉者 @zh-hans
definition: 将一种资源与记录在上级法院的一种法律资源中起诉一个下级法院决定的一个行为者关联起来。 @zh-hans
label: fellebezője a következő: @hu
definition: Hozzákapcsol egy forrást egy ágenshez, amely egy magasabb rendű bíróság jogi forrásában rögzített alacsonyabb rendű bíróság döntése ellen fellebbez. @hu
label: temyiz eden ile ilişkilidir @tr
definition: Bir kaynağı, bir üst mahkemenin yasal kaynağında kayıtlı bir alt mahkemenin kararını temyize götüren bir temsilci ile ilişkilendirir. @tr

is appellant of
status: Published
definition: Relates an agent to a resource of a higher court recording a decision of a lower court that is appealed by an agent.
type: Property
sub property of: is other agent associated with resource of (Deprecated)
inverse of: has appellant
lexical alias: appellantOf.en
label: er appellerende af @da
definition: Relaterer en agent der appellerer en underrets beslutning i en juridisk ressource til en højere retsinstans til et værk. @da
label: is aanklager in beroep van @nl
label: هو مستأنف لـ @ar
definition: يربط بين وكيل ومصدر لمحكمة أعلى درجة تسجل قرار محكمة أدنى درجة يستأنفه وكيل. @ar
label: muutoksenhakija (toimija) aineistossa @fi
definition: Liittää toimijan ylemmän oikeusasteen aineistoon, jossa toimija hakee muutosta alemman oikeusasteen päätökseen. @fi
label: ist Berufungsklagende/Berufungsklagender/Revisionsklagende/Revisionsklagender von @de
definition: Setzt einen Akteur in Beziehung zu einer Ressource einer höheren Instanz, die ein Gerichtsurteil einer unteren Instanz erfasst, gegen das ein Akteur Rechtsmittel (Berufung/Revision) einlegt. @de
label: 是……的上诉者 @zh-hans
definition: 将一个行为者与一种记录下级法院被一个行为者起诉的决定的上级法院的一种资源关联起来。 @zh-hans
label: fellebezője a következőnek: @hu
definition: Hozzákapcsol egy ágenst egy felsőbb bíróság jogi forrásához, amely rögzíti egy alsóbb szintű bíróságnak azt az ítéletét, amelyet egy ágens megfellebbezett. @hu
label: temyiz edenidir @tr
definition: Bir temsilciyi, temsicli tarafından temyiz edilen bir alt mahkeme kararını kaydeden bir yüksek mahkemenin bir kararı ile ilişkilendirir @tr

has appellation of entity
status: Published
type: Property
lexical alias: appellationOfEntity.en
definition: Relates an entity to a nomen that is used within a given scheme or context to refer to an entity.
inverse of: is appellation of entity of
label: heeft benaming van entiteit @nl
label: له تسمية لكيان @ar
definition: يربط بين كيان وتسمية مستخدمة ضمن خطة أو سياق معين للإشارة إلى كيان. @ar
label: har benævnelse på entitet @da
definition: Relaterer en entitet til et nomen, som er anvendt indenfor et givet skema eller en given kontekst for at henvise til en entitet. @da
label: entiteetin nimitys @fi
definition: Liittää entiteetin nomeniin, jota on käytetty tietyssä järjestelmässä tai kontekstissa viittaamaan entiteettiin. @fi
label: hat Bezeichnung für eine Entität @de
definition: Setzt eine Entität in Beziehung zu einem Nomen, das in einem bestimmten Schema oder Kontext verwendet wird, um eine Entität zu referenzieren. @de
label: 有实体的称谓 @zh-hans
definition: 将一个实体与在一个给定的体系或语境中指称一个实体所用的一个命名关联起来。 @zh-hans
label: entitás megnevezése a következő: @hu
definition: Hozzákapcsol egy entitást egy nomenhez, amelyet egy adott sémán vagy kontextuson belül használnak egy entitásra való hivatkozásra. @hu
has subproperty: has access point for entity
has subproperty: has identifier for entity
has subproperty: has manufacturer
has subproperty: has name of agent
has subproperty: has name of distributor
has subproperty: has name of entity
has subproperty: has name of manufacturer
has subproperty: has name of producer
has subproperty: has name of publisher
has subproperty: has title
label: varlığın unvanı ile ilişkilidir @tr
definition: Bir varlığı, bir varlığa atıfta bulunmak için belirli bir şema veya bağlam içinde kullanılan bir isimle ilişkilendirir. @tr

is appellation of entity of
status: Published
type: Property
lexical alias: appellationOfEntityOf.en
definition: Relates a nomen to an entity that is referred to by a nomen used within a given scheme or context.
inverse of: has appellation of entity
label: is benaming van entiteit van @nl
label: هي تسمية لكيان لـ @ar
definition: يربط بين تسمية وكيان يشار إليه بتسمية مستخدمة ضمن خطة أو سياق معين. @ar
label: er benævnelse af en entitet af @da
definition: Relaterer et nomen til en entitet, der er henvist til af et nomen brugt indenfor et givet skema eller et givet sammehhæng. @da
label: entiteetin nimitys @fi
definition: Liittää nomenin entiteettiin, johon tietyssä järjestelmässä tai kontekstissa käytetyllä nomenilla viitataan. @fi
label: ist Bezeichnung für eine Entität von @de
definition: Setzt ein Nomen in Beziehung zu einer Entität, auf die mit einem Nomen referenziert wird, das in einem bestimmten Schema oder Kontext verwendet wird. @de
label: 是……的实体的称谓 @zh-hans
definition: 将一个命名与在一个给定的体系或语境中用一个命名指称的一个实体关联起来。 @zh-hans
label: megnevezése a következő entitásnak: @hu
definition: Hozzákapcsol egy noment egy entitáshoz, amelyre egy adott sémában vagy kontextusban használt nomen hivatkozik. @hu
has subproperty: is access point for entity of
has subproperty: is identifier for entity of
has subproperty: is manufacturer of
has subproperty: is name of agent of
has subproperty: is name of distributor of
has subproperty: is name of entity of
has subproperty: is name of manufacturer of
has subproperty: is name of producer of
has subproperty: is name of publisher of
has subproperty: is title of resource of
label: varlığının unvanıdır @tr
definition: Bir ismi, belirli bir şema veya bağlamda kullanılan bir ad tarafından atıfta bulunulan bir varlıkla ilişkilendirir. @tr

has appellee
status: Published
definition: Relates a resource to an agent against whom an appeal is taken on a decision of a lower court recorded in a legal resource of a higher court.
type: Property
sub property of: has other agent associated with resource (Deprecated)
inverse of: is appellee of
lexical alias: appellee.en
label: har indstævnet @da
definition: Relaterer en ressource mod hvilken en indsigelse er gjort gennem en underrets beslutning, der er registreret i en juridisk ressource fra en højere retsinstans. @da
label: heeft gedaagde @nl
label: muutoksenhakijan vastapuoli aineistossa @fi
label: له مُستأنف ضده @ar
definition: يربط مصدر بوكيل مستأنف ضده بحكم صادر عن محكمة أدنى مسجل في مصدر قانوني لمحكمة أعلى. @ar
definition: Liittää aineiston toimijaan, johon kohdistuu hakemus, jolla haetaan muutosta alemman oikeusasteen päätökseen. @fi
label: hat Berufungsbeklagte/Berufungsbeklagten/Revisionsbeklagte/Revisionsbeklagten @de
definition: Setzt eine Ressource in Beziehung zu einem Akteur, gegen den Rechtsmittel (Berufung/Revision) gegen ein Gerichtsurteil einer unteren Instanz, das in einer juristischen Ressource einer höheren Instanz erfasst ist, eingelegt werden. @de
label: 有被上诉者 @zh-hans
definition: 将一种资源与在上级法院的一种法律资源中记录下级法院起诉该行为者之决定的一个行为者关联起来。 @zh-hans
label: fellebezési alperese a következő: @hu
definition: Hozzákapcsol egy forrást egy ágenshez, aki ellen fellebbezést nyújtanak be egy magasabb fokú bíróság jogi forrásában rögzített alacsonyabb fokú bírósági döntéssel kapcsolatban. @hu
label: temyiz edilen ile ilişkilidir @tr
definition: Bir kaynağı, bir üst mahkemenin yasal kaynağında kayıtlı bir alt mahkemenin kararına karşı temyize giden bir temsilci ile ilişkilendirir. @tr

is appellee of
status: Published
definition: Relates an agent to a legal resource of a higher court that records a decision of a lower court that appeals against an agent.
type: Property
sub property of: is other agent associated with resource of (Deprecated)
inverse of: has appellee
lexical alias: appelleeOf.en
label: er indstævnet af @da
definition: Relaterer en agent mod hvem der er gjort indsigelse over en underrets beslutning, der er registreret i en juridisk ressource fra en højere retsinstans til en ressource. @da
label: is gedaagde van @nl
label: له مُستأنف ضده @ar
definition: يربط بين وكيل ومصدر قانوني لمحكمة أعلى تُقر حكمًا صادرًا عن محكمة أدنى يُستأنف ضد وكيل. @ar
label: muutoksenhakijan (toimijan) vastapuoli @fi
definition: Liittää toimijan ylemmän oikeusasteen aineistoon, johon sisältyy toimijan alemmasta oikeusasteesta saama langettava päätös. @fi
label: ist Berufungsbeklagte/Berufungsbeklagter/Revisionsbeklagte/Revisionsbeklagter von @de
definition: Setzt einen Akteur in Beziehung zu einer juristischen Ressource einer höheren Instanz, das ein Gerichtsurteil festhält, bei dem gegen einen Akteur Rechtsmittel gegen ein Gerichtsurteil einer unteren Instanz eingelegt werden. @de
label: 是……的被上诉者 @zh-hans
definition: 将一个行为者与一种记录下级法院起诉一个行为者的决定的上级法院的法律资源关联起来。 @zh-hans
label: fellebezési alperese a következőnek: @hu
definition: Hozzákapcsol egy ágenst egy felsőbb bíróság jogi forrásához, amely rögzíti egy alsóbb szintű bíróságnak azt az ítéletét, amely egy ágens ellenében fellebbez. @hu
label: temyiz edilenidir @tr
definition: Bir temsilciyi, bir temsilciye itiraz eden bir alt mahkemenin kararını kaydeden bir yüksek mahkemenin yasal kaynağıyla ilişkilendirir. @tr

has appendix
status: Published
definition: Relates a resource to a resource whose content augments a related resource.
type: Property
sub property of: is augmented by
inverse of: is appendix to
lexical alias: appendix.en
label: er bilag @da
definition: Relaterer en ressource til en ressource, der udgør en berigende del af en anden ressource. @da
label: heeft appendix @nl
label: aineiston lite @fi
label: له مُلحَق @ar
definition: يربط بين مصدر ومصدر يزيد محتواه من مصدر ذي صلة. @ar
definition: Liittää aineiston aineistoon, jonka sisältö täydentää toista, liittyvää aineistoa. @fi
label: hat Anhang @de
definition: Setzt eine Ressource in Beziehung zu einer Ressource, deren Inhalt eine in Beziehung stehende Ressource erweitert. @de
label: 有附录 @zh-hans
definition: 将一种资源与其内容附增一种相关资源的一种资源达关联起来。 @zh-hans
label: függeléke a következő: @hu
definition: Hozzákapcsol egy forrást egy forráshoz, amelynek a tartalma kibővít egy kapcsolódó forrást. @hu
label: ek ile ilişkilidir @tr
definition: Bir kaynağı, içeriği ilgili bir kaynağı artıran bir kaynakla ilişkilendirir. @tr

is appendix to
status: Published
definition: Relates a resource to a resource whose content is augmented with content from a related resource.
type: Property
sub property of: is augmentation of
inverse of: has appendix
lexical alias: appendixTo.en
label: er bilag til @da
definition: Relaterer en ressource til en ressource, der er beriget med inhold af en anden ressource. @da
label: is appendix bij @nl
label: liite aineistoon @fi
definition: يربط بين مصدر ومصدر زُيِد محتواه بمحتوى من مصدر ذي صلة. @ar
definition: Liittää aineiston aineistoon, jonka sisältöä on laajennettu siihen liittyvän aineiston sisällöllä. @fi
label: ist Anhang zu @de
definition: Setzt eine Ressource in Beziehung zu einer Ressource, deren Inhalt durch Inhalt einer in Beziehung stehenden Ressource erweitert wird. @de
label: 是……的附录 @zh-hans
definition: 将一种资源与用一种相关资源的内容附增其内容的一种资源关联起来。 @zh-hans
label: függelékkel ellátott @hu
definition: Hozzákapcsol egy forrást egy forráshoz, amelynek tartalmát egy kapcsolódó forrás tartalmával bővítenek. @hu
label: ekidir @tr
definition: Bir kaynağı, içeriği ilgili bir kaynağın içeriğiyle artırılmış bir kaynakla ilişkilendirir. @tr

has applied material
status: Published
definition: Relates a resource to a physical or chemical substance applied to a base material of a resource.
type: Property
lexical alias: appliedMaterial.en
label: har anvendt materiale @da
definition: Relaterer en ressource til fysisk eller kemisk stof, der er påført en ressources basismateriale. @da
sub property of: has material
label: heeft bevestigd materiaal @nl
label: aineiston päällimateriaali @fi
label: له مادة مُستخدمة @ar
definition: يربط بين مصدر ومادة فيزيائية أو كيميائية مستخدمة كمادة أساسية لمصدر. @ar
definition: Liittää aineiston fysikaaliseen tai kemialliseen aineeseen, jota on laitettu aineiston pohjamateriaalin päälle. @fi
label: hat aufgebrachtes Material @de
definition: Setzt eine Ressource in Beziehung zu einer physischen oder chemischen Substanz, die auf ein Trägermaterial einer Ressource aufgebracht wird. @de
label: 有施加材料 @zh-hans
definition: 将一种资源与施加于一种资源基底材料上的物理或化学物质关联起来。 @zh-hans
label: alkalmazott anyaga a következő: @hu
definition: Hozzákapcsol egy forrást egy fizikai vagy kémiai anyaghoz, amelyet egy forrás alapanyagaként alkalmaznak. @hu
has subproperty: has emulsion on microfilm and microfiche
label: uygulanan malzeme ile ilişkilidir @tr
definition: Bir kaynağı, bir kaynağın temel malzemesine uygulanan fiziksel veya kimyasal bir maddeyle ilişkilendirir. @tr

has architect
status: Published
definition: Relates a resource to an agent who is responsible for an architectural design, including a pictorial representation intended to show how a building or other structure will look when completed.
type: Property
sub property of: has creator
inverse of: is architect of
lexical alias: architect.en
label: har arkitekt @da
definition: Relaterer en ressource til en agent, der er ansvarlig for at have skabt et arkitektonisk design, inkl. en billedrepræsentation, der er beregnet til at vise, hvordan en bygning etc. vil se ud, når den er færdig. @da
label: heeft architect @nl
label: aineiston arkkitehti @fi
label: له مهندس معماري @ar
definition: يربط مصدر بوكيل مسؤول عن تصميم معماري، ويشمل ذلك عمل تمثيل تصويري لبيان كيف سيبدو مبنى أو هيكل آخر عند اكتماله. @ar
label: hat Architektin/Architekt @de
definition: Setzt eine Ressource in Beziehung zu einem Akteur, der für einen architektonischen Entwurf verantwortlich ist, einschließlich einer bildlichen Darstellung, die zeigt, wie ein Gebäude oder eine andere Konstruktion nach der Fertigstellung aussehen soll. @de
definition: Liittää aineiston toimijaan, joka vastaa arkkitehtonisen suunnitelman luomisesta, mukaan lukien kuvaesityksestä, jonka tarkoitus on näyttää, miltä rakennus tai muu rakennelma näyttää valmiina. @fi
label: 有建筑师 @zh-hans
definition: 将一种资源与负责建筑设计（包括用于展示建筑或其他结构完成之后外观效果的绘画作品）的一个行为者关联起来。 @zh-hans
label: építésze a következő: @hu
definition: Hozzákapcsol egy forrást egy ágenshez, amely felelős egy építészeti tervért, beleértve egy képi ábrázolást, melynek célja bemutatni, hogy egy épület, vagy egyéb szerkezet, az elkészülte után hogyan fog kinézni. @hu
has subproperty: has landscape architect
label: mimar ile ilişkilidir @tr
definition: Bir kaynağı, bir binanın veya diğer bir yapının tamamlandığında nasıl görüneceğini göstermeyi amaçlayan resimsel bir temsili de dahil olmak üzere mimari bir tasarımın oluşturulmasından sorumlu olan bir temsilci ile ilişkilendirir. @tr

is architect of
status: Published
definition: Relates an agent to a resource that involves a responsibility of an agent for creating an architectural design, including a pictorial representation intended to show how a building or other structure will look when completed.
type: Property
sub property of: is creator of
inverse of: has architect
lexical alias: architectOf.en
label: er arkitekt til @da
definition: Relaterer en agent, der er ansvarlig for at have skabt et arkitektonisk design, inkl. en billedrepræsentation, der er beregnet til at vise, hvordan en bygning etc. vil se ud, når den er færdig til et værk. @da
label: is architect van @nl
label: هو مهندس معماري لـ @ar
definition: يربط بين وكيل ومصدر ينطوي على مسؤولية وكيل عن إنشاء تصميم معماري، ويشمل ذلك عمل تمثيل تصويري لبيان كيف سيبدو مبنى أو هيكل آخر عند اكتماله. @ar
label: arkkitehti (toimija) aineistossa @fi
definition: Liittää toimijan aineiston, jossa toimija vastaa arkkitehtisuunnitelman luomisesta, mukaan lukien kuvaesityksestä, jonka tarkoitus on näyttää, miltä rakennus tai muu rakennelma näyttää valmiina. @fi
label: ist Architektin/Architekt von @de
definition: Setzt einen Akteur in Beziehung zu einer Ressource, bei der ein Akteur für einen architektonischen Entwurf verantwortlich ist, einschließlich einer bildlichen Darstellung, die zeigt, wie ein Gebäude oder eine andere Konstruktion nach der Fertigstellung aussehen soll. @de
label: 是……的建筑设计师 @zh-hans
definition: 将一个行为者与涉及建筑设计（包括用于展示建筑或其他结构完成之后外观效果的绘画作品）创作的一个行为者的责任的一种资源关联起来。 @zh-hans
label: építésze a következőnek: @hu
definition: Hozzákapcsol egy ágenst egy forráshoz, amelyhez hozzátartozik egy ágens felelőssége egy építészeti terv létrehozásáért, beleértve egy képi reprezentációt, amely bemutatja, hogy egy épület vagy más szerkezet hogyan fog kinézni, amikor elkészül. @hu
has subproperty: is landscape architect of
label: mimarıdır @tr
definition: Bir temsilciyi, bir binanın veya başka bir yapının tamamlandığında nasıl görüneceğini göstermeyi amaçlayan resimli bir sunum da dahil olmak üzere, bir mimari tasarım oluşturmakla görevli bir temsilcinin sorumluluğunu içeren bir kaynakla ilişkilendirir. @tr

is arranged as
status: Published
definition: Relates a resource to a resource whose medium of performance is a modification of another resource.
type: Property
sub property of: has derivative
inverse of: is arrangement of
lexical alias: arrangedAs.en
label: er arrangeret som @da
definition: Relaterer en ressource til en musikressource, hvor den oprindelige ressource er blevet omskrevet til en anden besætning end den, ressource oprindeligt var beregnet for. @da
label: is gearrangeerd als @nl
label: sovitus (aineisto) @fi
label: هي مُرتبة كـ @ar
definition: يربط بين مصدر ومصدر تم إعادة كتابته كلحن موسيقي لوسيط أداء يختلف عن الوسيط الذي كان المصدر مقررا له أصلاً. @ar
definition: Liittää aineiston aineistoon, jonka esityskokoonpano on muunnelma toisesta aineistosta. @fi
label: ist arrangiert als @de
definition: Setzt eine Ressource in Beziehung zu einer Ressource, die als musikalische Komposition für eine bestimmte Besetzung umgeschrieben wird, die sich von der Originalbesetzung, für die eine Ressource konzipiert ist, unterscheidet. @de
label: 被改编为 @zh-hans
definition: 将一种资源与其表演媒介是另一种资源之修改的一种资源关联起来。 @zh-hans
definition: Relaciona un recurs amb un recurs el repartiment d’execució del qual és una modificació d’un altre recurs. @ca
label: elrendezve a következőként: @hu
definition: Hozzákapcsol egy forrást egy forráshoz, amely átír egy zenei kompozíciót olyan előadásmédiumra, amely különbözik a forrásnak eredetileg szánt médiumtól. @hu
label: olarak düzenlenmişitir @tr
definition: Bir kaynağı, performans ortamı başka bir kaynağın değiştirilmesi olan bir kaynakla ilişkilendirir. @tr

is arrangement of
status: Published
definition: Relates a resource to a resource whose medium of performance is modified to create a new resource that is different from another resource.
type: Property
sub property of: has source
inverse of: is arranged as
lexical alias: arrangementOf.en
label: er arrangement af @da
definition: Relaterer en ressource til en musikressource, der er blevet omskrevet til en anden besætning end den, ressourcen oprindeligt var beregnet til. @da
label: is arrangement van @nl
label: sovituksen perusta (aineisto) @fi
label: هو تنسيق لـ @ar
definition: يربط بين مصدر ومصدر تم إعادة كتابته كلحن موسيقي لوسيط أداء يختلف عن الوسيط الذي كان المصدر مقررا له أصلاً. @ar
definition: Liittää aineiston aineistoon, jonka esityskokoonpanoa on muutettu ja näin luotu uusi, erilainen aineisto. @fi
label: ist Arrangement von @de
definition: Setzt eine Ressource in Beziehung zu einer Ressource, die als musikalische Komposition für eine bestimmte Besetzung umgeschrieben wird, die sich von der Originalbesetzung, für die eine Ressource konzipiert ist, unterscheidet. @de
label: 是……的改编 @zh-hans
definition: 将一种资源与其表演媒介被修改而创建与另一种资源不同的新资源的一种资源关联起来。 @zh-hans
definition: Relaciona un recurs amb un recurs el repartiment d’execució del qual es modifica per crear un nou recurs que és diferent d’un altre recurs. @ca
label: elrendezése a következőnek: @hu
definition: Hozzákapcsol egy forrást egy forráshoz, amelyet olyan előadásmédiumra szánt zenei kompozícióként írtak át, amely különbözik a forrásnak eredetileg szánt médiumtól. @hu
label: düzenlemesidir @tr
definition: Bir kaynağı, başka bir kaynaktan farklı yeni bir kaynak oluşturmak için performans ortamı değiştirilen kaynakla ilişkilendirir. @tr

has arranger of music
status: Published
definition: Relates a resource to an agent who contributes to a resource by rewriting a composition for a medium of performance different from that for which a resource was originally intended.
type: Property
sub property of: has contributor (Deprecated)
inverse of: is arranger of music of
lexical alias: arrangerOfMusic.en
scope note: Modification of the resource for the same medium of performance, etc., keeping the musical substance of the original composition essentially unchanged, is included. Substantial modification that results in the creation of a new musical resource is excluded.
see also: has composer
label: har musikarrangør @da
definition: Relaterer en ressource til en agent, der har bidraget til en musikressource ved at omskrive kompositionen til en anden besætning end den, ressourcen oprindeligt var beregnet til. @da
scope note: Bidrag omfatter ændring af en ressource for den samme besætning etc., der i alt væsentligt bevarer den originale kompositions musikalske substans uændret, og omfatter ikke væsentlige ændringer der resulterer i skabelsen af en ny musikressource. @da
label: heeft arrangeur van muziek @nl
label: aineiston sovittaja @fi
label: له موزع موسيقى @ar
definition: يربط مصدر بوكيل يُساهم في مصدر من خلال إعادة كتابة لحن موسيقي لوسيط أداء يختلف عن الوسيط الذي كان المصدر مقررا له أصلاً. @ar
scope note: يتضمن تعديل المصدر لنفس وسيط أداء، إلخ.، مع الإبقاء على اللحن الأصلي دون تغيير جوهري.يُستبعد التعديل الجوهري الذي ينتج عنه إنشاء مصدر موسيقي جديد. @ar
definition: Liittää aineiston toimijaan, joka on aineistossa osallisena muokkaamalla sävellyksen alkuperäisteoksesta poikkeavalle esityskokoonpanolle. @fi
scope note: Sovittaja voi myös muokata aineistoa samalle esityskokoonpanolle tms. säilyttäen alkuperäisen sävellyksen musiikillisen sisällön olennaisilta osin muuttumattomana. Tähän ei sisälly laaja muokkaaminen, joka johtaa uuden musiikkiaineiston luomiseen. @fi
label: hat Arrangeurin/Arrangeur @de
definition: Setzt eine Ressource in Beziehung zu einem Akteur, der zu einer Ressource beiträgt, indem er eine Komposition für eine bestimmte Besetzung umschreibt, die sich von der Originalbesetzung, für die eine Ressource konzipiert ist, unterscheidet. @de
scope note: Darunter fallen auch Varianten einer Ressource für die gleiche Besetzung und so weiter, solange die musikalische Substanz der Originalkomposition im Wesentlichen unverändert bleibt. Darunter fallen keine substantiellen Veränderungen, die zur Schaffung einer neuen Musikressource führen. @de
label: 有音乐改编者 @zh-hans
definition: 将一种资源与通过改写音乐作曲用于不同于其最初意图的一个表演媒介而对一种资源有贡献的一个行为者关联起来。 @zh-hans
scope note: 包括保留原作曲基本内容为同一个表演媒体等所作的资源的修改。不包括导致创作一种新的资源的大幅度修改。 @zh-hans
label: zenei hangszerelője a következő: @hu
definition: Hozzákapcsol egy forrást egy ágenshez, amely hozzájárul egy forráshoz egy zenei kompozíció olyan előadásmédiumra átírásával, amely különbözik a forrásnak eredetileg szánt médiumtól. @hu
scope note: A forrás módosítása egyező előadásmédiumra, stb., amikor alapvetően változatlanul megtartja az eredeti kompozíció zenei lényegét, is idetartozik. Nem tartoznak ide az egy új zenei forrás létrehozását eredményező lényegi változtatások. @hu
label: müzik aranjörü ile ilişkilidir @tr
definition: Bir kaynağı, kaynağın orijinal olarak amaçlandığından farklı bir performans ortamı için bir kompozisyonu yeniden yazarak bir kaynağa katkıda bulunan bir temsilci ile ilişkilendirir. @tr
scope note: Orijinal bestenin müzikal özünü değiştirmeden, kaynağın aynı icra ortamı vb. için değiştirilmesi dahildir. Yeni bir müzikal kaynağın yaratılmasıyla sonuçlanan önemli değişiklikler hariç tutulmuştur. @tr

is arranger of music of
status: Published
definition: Relates an agent to a resource that includes a contribution by an agent of rewriting a musical composition for a medium of performance different from that for which the resource was originally intended.
type: Property
sub property of: is contributor of (Deprecated)
inverse of: has arranger of music
lexical alias: arrangerOfMusicOf.en
see also: is composer of
label: er musikarrangør af @da
definition: Relaterer en agent der har bidraget til en musikressource ved at omskrive kompositionen til en anden besætning end den, ressourcen oprindeligt var beregnet til til et ressource. @da
label: is arrangeur van muziek van @nl
label: هو موزع موسيقي لـ @ar
definition: يربط بين وكيل ومصدر يتضمن إسهام وكيل في إعادة كتابة لحن موسيقي لوسيط أداء يختلف عن الوسيط الذي كان العمل مقررا له أصلاً. @ar
label: sovittaja (toimija) aineistossa @fi
definition: Liittää toimijan aineistoon, jossa toimija on osallisena muokkaamalla sävellyksen alkuperäisteoksesta poikkeavalle esityskokoonpanolle. @fi
label: ist Arrangeurin/Arrangeur von @de
definition: Setzt einen Akteur in Beziehung zu einer Ressource, zu der ein Akteur beiträgt, indem er eine Komposition für eine bestimmte Besetzung umschreibt, die sich von der Originalbesetzung unterscheidet, für die die Ressource ursprünglich konzipiert war. @de
label: 是……的音乐改编者 @zh-hans
definition: 将一个行为者与包括一个改写音乐作曲用于不同于资源最初意图的一个表演媒介的一个行为者的贡献的一种资源关联起来。 @zh-hans
label: zenei hangszerelője a következőnek: @hu
definition: Hozzákapcsol egy ágenst egy forráshoz, amely magában foglalja az ágens közreműködését zenei kompozíció újraírásában, amikor az előadásmédiuma különbözik attól, mint amelyre a forrást eredetileg szánták. @hu
label: müziğinin aranjörüdür @tr
definition: Bir temsilciyi, kaynağın başlangıçta amaçlandığından farklı bir performans ortamı için bir müzik bestesini yeniden yazan temsilcinin katkısını içeren bir kaynakla ilişkilendirir. @tr

has art director
status: Published
definition: Relates a resource to an agent who contributes to a resource by overseeing artists and craftspeople who build sets for moving image productions.
type: Property
sub property of: has contributor (Deprecated)
inverse of: is art director of
lexical alias: artDirector.en
label: har kunstnerisk leder @da
definition: Relaterer en ressource til en agent, der har bidraget til en ressource ved at føre tilsyn med de kunstnere og håndværkere, der har bygget kulisserne til levende billedproduktioner. @da
label: heeft artdirector @nl
label: له مخرج فني @ar
definition: يربط مصدر بوكيل يُساهم في مصدر من خلال الإشراف على الفنيين والحرفيين الذين يبنون مواقع لإنتاج الأفلام. @ar
label: lavastaja @fi
definition: Liittää aineiston toimijaan, joka on aineistossa osallisena valvomalla taiteilijoita ja käsityöläisiä, jotka rakentavat lavasteita elokuvatuotantoihin. @fi
label: hat Art Director @de
definition: Setzt eine Ressource in Beziehung zu einem Akteur, der zu einer Ressource beiträgt, indem er Künstlerinnen/Künstler und Kunsthandwerkerinnen/Kunsthandwerker betreut, die Sets für Bewegtbildproduktionen aufbauen. @de
label: 有艺术总监 @zh-hans
definition: 将一种资源与通过监督为动态图像制作建造布景的艺术家和艺人而对一种资源有贡献的一个行为者关联起来。 @zh-hans
label: művészeti vezetője a következő: @hu
definition: Hozzákapcsol egy forrást egy ágenshez, amely hozzájárul egy forráshoz azzal, hogy művészeket és mesterembereket irányít és felügyel, akik mozgókép-produkciókhoz díszleteket építenek. @hu
label: sanat yönetmeni ile ilişkilidir @tr
definition: Bir kaynağı, hareketli görüntü yapımları için set inşa eden sanatçıları ve zanaatkârları denetleyerek bir kaynağa katkıda bulunan bir temsilci ile ilişkilendirir. @tr

is art director of
status: Published
definition: Relates an agent to a resource that includes a contribution by an agent of overseeing artists and craftspeople who build sets for moving image productions.
type: Property
sub property of: is contributor of (Deprecated)
inverse of: has art director
lexical alias: artDirectorOf.en
label: er kunstnerisk leder for @da
definition: Relaterer en agent, der har bidraget til en ressource ved at føre tilsyn med de kunstnere og håndværkere, der har bygget kulisserne til levende billedproduktioner til en ressource. @da
label: is artdirector van @nl
label: هو مخرج فني لـ @ar
definition: يربط بين وكيل ومصدر يتضمن إسهام وكيل بالإشراف على الفنيين والحرفيين الذين يبنون مواقع لإنتاج الأفلام. @ar
label: lavastaja (toimija) aineistossa @fi
definition: Liittää toimijan aineistoon, jossa toimija on osallisena valvomalla taiteilijoita ja käsityöläisiä, jotka rakentavat lavasteita elokuvatuotantoihin. @fi
label: ist Art Director von @de
definition: Setzt einen Akteur in Beziehung zu einer Ressource, zu der ein Akteur beiträgt, indem er Künstlerinnen/Künstler und Kunsthandwerkerinnen/Kunsthandwerker betreut, die Sets für Bewegtbildproduktionen aufbauen. @de
label: 是……的艺术总监 @zh-hans
definition: 将一个行为者与包括监督为动态图像制作建造布景的艺术家和艺人的一个行为者的贡献的一种资源关联起来。 @zh-hans
label: művészeti vezetője a következő: @hu
definition: Hozzákapcsol egy ágenst egy forráshoz, amely magában foglalja egy ágens közreműködését, aki művészeket és mozgókép-produkciókhoz díszletépítőket és mesterembereket felügyel. @hu
label: sanat yönetmenidir @tr
definition: Bir temsilciyi, hareketli görüntü yapımları için setler oluşturan sanatçıları ve zanaatkarları denetleyen temsilcinin katkısını içeren bir kaynakla ilişkilendirir. @tr

has artist
status: Published
definition: Relates a resource to an agent who is responsible for creating an original graphic design, drawing, painting, etc.
type: Property
sub property of: has creator
inverse of: is artist of
lexical alias: artist.en
label: har kunstner @da
definition: Relaterer en ressource til en agent, der er ansvarlig for at have skabt et værk ved at udtænke, og ofte udføre originalgrafik, en original tegning, et originalt maleri etc. @da
label: heeft kunstenaar @nl
label: taiteilija aineistossa @fi
label: له فنان @ar
definition: يربط مصدر بوكيل مسؤول عن إنشاء تصميم رسومي أصلي، رسم، تصوير زيتي...إلخ. @ar
definition: Liittää aineiston toimijaan, joka vastaa alkuperäisen graafisen suunnittelun, piirroksen, maalauksen tms. luomisesta. @fi
label: hat Künstlerin/Künstler @de
definition: Setzt eine Ressource in Beziehung zu einem Akteur, der für die Schaffung einer originalen grafischen Gestaltung, einer Zeichnung, eines Gemäldes und so weiter verantwortlich ist. @de
label: 有美术家 @zh-hans
definition: 将一种资源与负责完成原创图形设计、绘图、绘画等的一个行为者关联起来。 @zh-hans
label: művésze a következő: @hu
definition: Hozzákapcsol egy forrást egy ágenshez, amely felelős egy eredeti grafikai terv, rajz, festmény, stb. megalkotásáért. @hu
has subproperty: has book artist
has subproperty: has calligrapher
has subproperty: has sculptor
label: sanatçı ile ilişkilidir @tr
definition: Bir kaynağı, özgün bir grafik tasarım, çizim, boyama vb. oluşturmaktan sorumlu olan bir temsilci ile ilişkilendirir. @tr

has artistic or technical credit (Deprecated)
status: Deprecated
definition: Relates a resource to a listing of agents, families, or corporate bodies making contributions to the artistic and/or technical production of a resource. (Deprecated)
lexical alias: artisticAndOrTechnicalCredit.en
type: Property

is artist of
status: Published
definition: Relates an agent to a resource that involves a responsibility of an agent for conceiving, and often implementing, an original graphic design, drawing, painting, etc.
type: Property
sub property of: is creator of
inverse of: has artist
lexical alias: artistOf.en
label: er kunstner til @da
definition: Relaterer en agent, der er ansvarlig for at have skabt en ressource ved at udtænke, og ofte udføre, et originalt grafisk design, en original tegning, et originalt maleri etc. til en ressource. @da
label: is kunstenaar van @nl
label: هو فنان لـ @ar
definition: يربط بين وكيل ومصدر ينطوي على مسؤولية وكيل عن وضع تصور لتصميم جرافيكي، أو لرسم، أو للوحة زيتية أصلية، إلخ وغالباً تنفيذها. @ar
label: taiteilija (toimija) aineistossa @fi
definition: Liittää toimijan aineistoon, jossa toimija vastaa alkuperäisen graafisen suunnittelun, piirroksen, maalauksen tms. luomisesta. @fi
label: ist Künstlerin/Künstler von @de
definition: Setzt einen Akteur in Beziehung zu einer Ressource, bei der ein Akteur für die Konzeption und oft auch Umsetzung einer originalen grafischen Gestaltung, einer Zeichnung oder eines Gemäldes und so weiter verantwortlich ist. @de
label: 是……的美术家 @zh-hans
definition: 将一个行为者与涉及构思并经常是完成原创图形设计、绘图、绘画等的一个行为者的责任的一种资源关联起来。 @zh-hans
label: művésze a következőnek: @hu
definition: Hozzákapcsol egy ágenst egy forráshoz, amelyhez hozzátartozik egy ágens felelőssége egy eredeti grafikai terv, rajz, festmény stb. elgondolásáért és gyakran kivitelezéséért is. @hu
has subproperty: is book artist of
has subproperty: is calligrapher of
has subproperty: is sculptor of
label: sanatçısıdır @tr
definition: Bir temsilciyi, özgün bir grafik tasarım, çizim, resim…vb tasarlamak ve sıklıkla uygulamakla görevli bir temsilcinin sorumluluğu içeren bir kaynakla ilişkilendirir. @tr

has aspect ratio
status: Published
definition: Relates a resource to a numerical ratio of the width to the height of a moving image.
type: Property
lexical alias: aspectRatio.en
label: har billedformat @da
definition: Relaterer en ressource til et numerisk forhold mellem bredde og højde i et levende billede. @da
label: heeft aspectratio @nl
label: له نسبة باعية @ar
definition: يربط بين مصدر ونسبة عددية من العرض إلى ارتفاع لصورة متحركة. @ar
label: kuvasuhde aineistossa @fi
definition: Liittää aineiston liikkuvan kuvan leveyden ja korkeuden väliseen numeeriseen suhteeseen. @fi
label: hat Bildformat @de
definition: Setzt eine Ressource in Beziehung zu einem Zahlenverhältnis von der Breite zur Höhe einer Bewegtbildressource. @de
label: 有宽高比 @zh-hans
definition: 将一种资源与一种动态图像的宽度和高度的数字比关联起来。 @zh-hans
label: képaránya a következő: @hu
definition: Hozzákapcsol egy forrást egy arányszámhoz, amely egy mozgókép szélességét viszonyítja annak magasságához. @hu
label: en boy oranı ile ilişkilidir @tr
definition: Bir kaynağı, hareketli bir görüntünün genişliğinin yüksekliğine olan sayısal oranıyla ilişkilendirir. @tr

has aspect ratio designation
status: Published
type: Property
lexical alias: aspectRatioDesignation.en
definition: Relates a resource to a general designation of the ratio of the width to the height of a moving image.
label: har billedformatbetegnelse @da
definition: Relaterer en ressource til en almindelig betegnelse for det numeriske forhold mellem bredde og højde i et levende billede. @da
label: heeft aspectratio-aanduiding @nl
label: له تسمية نسب باعية @ar
definition: يربط بين مصدر وتسمية عامة لنسبة من العرض إلى ارتفاع لصورة متحركة. @ar
label: kuvasuhdemäärite aineistolle @fi
definition: Liittää aineiston liikkuvan kuvan aineiston leveyden ja korkeuden välisen suhteen yleiseen määritteeseen. @fi
label: hat Bezeichnung eines Bildformats @de
definition: Setzt eine Ressource in Beziehung zu einer allgemeinen Bezeichnung des Verhältnisses von Breite zu Höhe eines Bewegtbilds. @de
label: 有宽高比标识 @zh-hans
definition: 将一种资源与一种动态图像的宽和高的比之一般标识关联起来。 @zh-hans
label: képarányjelölése a következő: @hu
definition: Hozzákapcsol egy forrást egy mozgókép szélességének a magassághoz való arányáról szóló általános megjelöléshez. @hu
label: en boy oranı tanımı ile ilişkilidir @tr
definition: Bir kaynağı, hareketli bir görüntünün genişliğinin yüksekliğine oranının genel bir tanımıyla ilişkilendirir. @tr

is assigned by agent
status: Published
type: Property
lexical alias: assignedByAgent.en
definition: Relates a nomen to an agent who assigns a nomen to an entity.
inverse of: is assigner agent of
label: is toegekend door actor @nl
label: هو مخصص من قبل وكيل @ar
definition: يربط بين تسمية ووكيل خصص اسمًا لكيانًا. @ar
label: er tildelt af agent @da
definition: Relaterer et nomen til en agent, som tildeler et nomen til en entitet. @da
label: toimijan antama nomen @fi
definition: Liittää nomenin toimijaan, joka antaa entiteetille nomenin. @fi
label: ist von einem Akteur zugewiesen @de
definition: Setzt ein Nomen in Beziehung zu einem Akteur, der einer Entität ein Nomen zuweist. @de
label: 被一个行为者分配 @zh-hans
definition: 将一个命名与把一个命名分配给一个实体的一个行为者关联起来。 @zh-hans
label: hozzárendelve a következő ágens által: @hu
definition: Hozzákapcsol egy noment egy ágenshez, amely hozzárendel egy noment egy entitáshoz. @hu
label: temsilci tarafından atanmıştır @tr
definition: Bir ismi, bir varlığa isim atayan temsilciyle ilişkilendirir. @tr

is assigner agent of
status: Published
type: Property
lexical alias: assignerAgentOf.en
definition: Relates an agent to a nomen that is assigned to an entity by an agent.
inverse of: is assigned by agent
label: is toekenner-actor van @nl
label: هو وكيل مخصص لـ @ar
definition: يربط بين وكيل وتسمية خصصها وكيل لكيان. @ar
label: er agent der tildeler af @da
definition: Relaterer en agent til et nomen der er tildelt en entitet af en agent @da
label: nimeäjä (toimija) @fi
definition: Liittää toimijan nomeniin, jonka toimija on antanut entiteetille. @fi
label: ist Akteur als Zuweisende/Zuweisender von @de
definition: Setzt einen Akteur in Beziehung zu einem Nomen, das von einem Akteur einer Entität zugewiesen ist. @de
label: 是……的分配者行为者 @zh-hans
definition: 将一个行为者与被一个行为者分配给一个实体的一个命名关联起来。 @zh-hans
label: hozzárendelő ágense a következőnek: @hu
definition: Hozzákapcsol egy ágenst egy nomenhez, amelyet egy ágens rendel hozzá egy entitáshoz. @hu
label: atayan temsilcisidir @tr
definition: Bir temsilciyi, temsilci tarafından varlığa atanan isimle ilişkilendirir. @tr

has assistant
status: Published
type: Property
lexical alias: assistant.en
definition: Relates an agent to an agent who is a colleague who helps another agent.
inverse of: has preferred title of resource
sub property of: has colleague
label: har assistent @da
definition: Relaterer en agent til en kollega, der hjælper en anden agent. @da
label: heeft assistent @nl
label: له مساعد @ar
definition: يربط بين وكيل ووكيل هو زميل يساعد وكيلًا آخر. @ar
label: assistentti (toimija) @fi
definition: Liittää toimijan toimijaan, joka on kollega, joka avustaa toista toimijaa. @fi
label: hat Assistentin/Assistenten @de
definition: Setzt einen Akteur in Beziehung zu einer Kollegin/einem Kollegen, die/der einen anderen Akteur unterstützt. @de
label: 有助理 @zh-hans
definition: 将一个行为者与作为帮助另一个行为者的同事的一个行为者关联起来。 @zh-hans
label: asszisztense a következő: @hu
definition: Hozzákapcsol egy ágenst egy kolléga ágenshez, aki egy másik ágensnek segít. @hu
label: asistan ile ilişkilidir @tr
definition: Bir temsilciyi, başka bir temsilciye yardım eden bir meslektaş olan bir temsilciyle ilişkilendirir. @tr

is assistant to
status: Published
type: Property
lexical alias: assistantTo.en
definition: Relates an agent to an agent who is a colleague who is helped by another agent.
inverse of: has encoded bitrate
sub property of: has colleague
label: er assistent for @da
definition: Relaterer en agent til en kollega, der bliver hjulpet af en anden agent. @da
label: is assistent van @nl
label: هو مساعد لـ @ar
definition: يربط بين وكيل ووكيل هو زميل تلقى مساعدة من وكيلًا آخر. @ar
label: assistentti (toimija) @fi
definition: Liittää toimijan toimijaan, joka on kollega, jota toinen toimija avustaa. @fi
label: ist Assistentin/Assistent von @de
definition: Setzt einen Akteur in Beziehung zu einer Kollegin/einem Kollegen, der/dem von einem anderen Akteur geholfen wird. @de
label: 是……的助理 @zh-hans
definition: 将一个行为者与作为另一个行为者帮助的同事的一个行为者关联起来。 @zh-hans
label: asszisztense a következőnek: @hu
definition: Hozzákapcsol egy ágenst egy kolléga ágenshez, akit egy másik ágens segít. @hu
label: asistanıdır @tr
definition: Bir temsilciyi, başka bir temsilcinin yardım ettiği bir meslektaş olan bir temsilciyle ilişkilendirir. @tr

has associated institution (Deprecated)
definition: Relates an agent to an institution commonly associated with an agent. (Deprecated)
type: Property
lexical alias: associatedInstitution.en
label: har tilknyttet institution @da
definition: Relaterer en ressource til en institution der almindeligvis opfattes knyttet til en agent. @da
status: Deprecated

has audio engineer
status: Published
type: Property
lexical alias: audioEngineer.en
definition: Relates a resource to an agent who contributes to a resource by managing the technical aspects of sound during the processes of recording, mixing, and reproduction.
inverse of: is audio engineer of
sub property of: has contributor (Deprecated)
label: har lydtekniker @da
definition: Relaterer en ressource til en agent der bidrager til en ressources lydindhold ved at overvåge de tekniske lydaspekter under optagelse, mixing og reproduktion. @da
label: heeft geluidstechnicus @nl
label: له مهندس صوت @ar
definition: يربط مصدر بوكيل يُساهم في مصدر من خلال إدارة الجوانب الفنية للصوت أثناء عمليات التسجيل والمزج والاستنساخ. @ar
label: ääniteknikko aineistossa @fi
definition: Liittää aineiston toimijaan, joka on osallisena aineiston tekemisessä huolehtimalla äänen teknisistä näkökohdista äänitys-, miksaus- ja äänentoistoprosessien aikana. @fi
label: hat Tontechnikerin/Tontechniker @de
definition: Setzt eine Ressource in Beziehung zu einem Akteur, der zu einer Ressource beiträgt, indem er die technischen Aspekte für den Ton während der Aufnahme, des Misch-Verfahrens und der Vervielfältigung handhabt. @de
label: 有音频工程师 @zh-hans
definition: 将一种资源与通过声音的录制、合成和复制过程技术方面管理而对一种资源有贡献的一个行为者关联起来。 @zh-hans
label: hangmestere a következő: @hu
definition: Hozzákapcsol egy forrást egy ágenshez, amely egy forráshoz hozzájárul azzal, hogy a felvétel, a keverés és reprodukálás folyamatai alatt a hang technikai vonatkozásait kezeli. @hu
has subproperty: has mixing engineer
label: ses mühendisi ile ilişkilidir @tr
definition: Bir kaynağı, kayıt, miksaj ve yeniden üretim süreçleri sırasında sesin teknik yönlerini yöneterek bir kaynağa katkıda bulunan bir aracıyla ilişkilendirir. @tr

is audio engineer of
status: Published
type: Property
lexical alias: audioEngineerOf.en
definition: Relates an agent to a resource that includes a contribution by an agent of managing the technical aspects of sound during the processes of recording, mixing, and reproduction.
inverse of: has audio engineer
sub property of: has other agent associated with a resource (Deprecated)
label: er lydtekniker i @da
definition: Relaterer en agent til een ressource, der inkorporerer et bidrag til lydindholdet ved overvågning af de tekniske lydaspekter under processen med indspilning, mixning og reproduktion. @da
label: is geluidstechnicus van @nl
label: هو مهندس صوت لـ @ar
definition: يربط بين وكيل ومصدر يتضمن إسهام وكيل في إدارة الجوانب الفنية للصوت أثناء عمليات التسجيل والمزج والاستنساخ. @ar
label: ääniteknikko (toimija) aineistossa @fi
definition: Liittää toimijan aineistoon, jossa toimija on osallisena valvomalla äänen teknisiä ominaisuuksia äänityksen, miksauksen ja toiston aikana. @fi
label: ist Tontechnikerin/Tontechniker von @de
definition: Setzt einen Akteur in Beziehung zu einer Ressource, zu der ein Akteur beiträgt, indem er die technischen Aspekte für den Ton während der Aufnahme, des Misch-Verfahrens und der Vervielfältigung handhabt. @de
label: 是……的音频工程师 @zh-hans
definition: 将一个行为者与包括声音的录制、合成和复制过程技术方面管理的一个行为者的贡献的一种资源关联起来。 @zh-hans
label: hangmestere a következőnek: @hu
definition: Hozzákapcsol egy ágenst egy forráshoz, amely magában foglalja az ágens közreműködését a hang technikai vonatkozásainak kezelésében a rögzítés, a keverés és a sokszorosítás folyamatában. @hu
has subproperty: is mixing engineer of
label: ses mühendisidir @tr
definition: Bir temsilciyi, kayıt, miksaj ve yeniden üretim süreçleri sırasında sesin teknik yönlerini yöneten bir temsilcinin katkısını içeren bir kaynakla ilişkilendirir. @tr

has audio producer
status: Published
type: Property
lexical alias: audioProducer.en
definition: Relates a resource to an agent who is a producer who is responsible for managing most of the business aspects of an audio recording.
inverse of: is audio producer of
sub property of: has producer
label: har lydproducer @da
definition: Relaterer en ressource til en producer der er ansvarlig for de fleste forretningsmæssige aspekter af en lydoptagelse. @da
label: heeft geluidsproducent @nl
label: له منتج مواد صوتية @ar
definition: يربط مصدر بوكيل منتج مسؤول عن إدارة معظم جوانب الأعمال التجارية للتسجيل الصوتي. @ar
label: äänituottaja aineistossa @fi
definition: Liittää aineiston toimijaan, joka on osallisena aineiston tekemisessä huolehtimalla äänen teknisistä näkökohdista äänitys-, miksaus- ja äänentoistoprosessien aikana. @fi
label: hat Produzentin/Produzenten einer Tonaufnahme @de
definition: Setzt eine Ressource in Beziehung zu einer Produzentin/einem Produzenten, die/der für die meisten geschäftlichen Aspekte einer Audioaufnahme verantwortlich ist. @de
label: 有音频制作者 @zh-hans
definition: 将一种资源与作为一个制作者并负责音频录制工作大多数方面商业运作之管理的一个行为者关联起来。 @zh-hans
label: audióproducere a következő: @hu
definition: Hozzákapcsol egy forrást egy producer ágenshez, aki felelős egy hangfelvétel üzleti vonatkozásainak a zöméért. @hu
label: ses yapımcısı ile ilişkilidir @tr
definition: Bir kaynağı, bir ses kaydının ticari yönlerinin çoğunu yönetmekten sorumlu yapımcı olan bir temsilci ile ilişkilendirir. @tr

is audio producer of
status: Published
type: Property
lexical alias: audioProducerOf.en
definition: Relates an agent to a resource that involves a responsibility of an agent for managing most of the business aspects of an audio recording.
inverse of: has audio producer
sub property of: is producer of
label: er lydproducer for @da
definition: Relaterer en agent til en ressource, der involverer et ansvar for de fleste forretningsmæssige aspekter af en lydoptagelse. @da
label: is geluidsproducent van @nl
label: هو منتج مواد صوتية لـ @ar
definition: يربط بين وكيل ومصدر ينطوي على مسؤولية وكيل عن إدارة معظم جوانب الأعمال التجارية للتسجيل الصوتي. @ar
label: äänituottaja (toimija) aineistossa @fi
definition: Liittää toimijan aineistoon, jossa toimija vastaa useimpien äänitteen liiketoiminnallisten tehtävien hoitamisesta. @fi
label: ist Produzentin/Produzent einer Tonaufnahme von @de
definition: Setzt einen Akteur in Beziehung zu einer Ressource, bei der ein Akteur für die meisten geschäftlichen Aspekte einer Audioaufnahme verantwortlich ist. @de
label: 是……的音频制作者 @zh-hans
definition: 将一个行为者与涉及音频录制工作大多数方面之管理的一个行为者的责任的一种资源关联起来。 @zh-hans
label: audio-producere a következőnek: @hu
definition: Hozzákapcsol egy ágenst egy forráshoz, amelyhez hozzátartozik egy ágens felelőssége egy audiofelvétel legtöbb üzleti vonatkozásának menedzseléséért. @hu
label: ses yapımcısıdır @tr
definition: Bir temsilciyi, bir ses kaydının ticari yönlerinin çoğunu yönetmekle görevli bir temsilcinin sorumluluğunu içeren bir kaynakla ilişkilendirir. @tr

is augmentation of
status: Published
definition: Relates a resource to a resource whose content is added to by a related resource.
type: Property
sub property of: has accompanying resource relationship with (Deprecated)
inverse of: is augmented by
lexical alias: augmentationOf.en
label: er berigelse af @da
definition: Relaterer en ressource til en ressource, hvis indhold udbygges af en anden ressource. @da
label: is aanvulling van @nl
label: laajennus aineistoon @fi
label: هو إضافة لـ @ar
definition: يربط بين مصدر ومصدر تم إضافة محتواه بواسطة مصدر ذي صلة. @ar
definition: Liittää aineiston aineistoon, jonka sisältöä siihen liittyvä aineisto täydentää. @fi
label: ist Erweiterung von @de
definition: Setzt eine Ressource in Beziehung zu einer Ressource, deren Inhalt durch ein in Beziehung stehendes Werk ergänzt wird. @de
label: 是……的附增 @zh-hans
definition: 将一种资源与其内容被一种相关资源增加的一种资源关联起来。 @zh-hans
label: bővítése a következőnek: @hu
definition: Hozzákapcsol egy forrást egy forráshoz, amelynek tartalmát egy kapcsolódó forrás adja hozzá. @hu
has subproperty: is addenda to
has subproperty: is appendix to
has subproperty: is cadenza composed for
has subproperty: is errata to
has subproperty: is guide to
has subproperty: is illustrations for
has subproperty: is supplement to
label: arttırılmasıdır @tr
definition: Bir kaynağı, içeriği ilgili bir kaynak tarafından eklenen bir kaynakla ilişkilendirir. @tr

is augmented by
status: Published
definition: Relates a resource to a resource that adds to the content of a predominant resource.
type: Property
sub property of: has accompanying resource relationship with (Deprecated)
inverse of: is augmentation of
lexical alias: augmentedBy.en
label: er beriget med @da
definition: Relaterer en ressource til en ressource, der føjer noget til en hovedressources indhold. @da
label: is aangevuld door @nl
label: laajennettu aineistolla @fi
label: هو مُعَزَّز بـ @ar
definition: يربط بين مصدر ومصدر يُضاف إلى محتوى مصدر سائد. @ar
definition: Liittää aineiston aineistoon, joka täydentää vallitsevan aineiston sisältöä. @fi
label: ist erweitert durch @de
definition: Setzt eine Ressource in Beziehung zu einer Ressource, die den Inhalt einer Hauptressource ergänzt. @de
label: 被……附增 @zh-hans
definition: 将一种资源与增加到一种主要资源之内容中去的一种资源关联起来。 @zh-hans
label: bővíti a következő: @hu
definition: Hozzákapcsol egy forrást egy forráshoz, amely egy domináns forrás tartalmát gyarapítja. @hu
has subproperty: has addenda
has subproperty: has appendix
has subproperty: has cadenza
has subproperty: has errata
has subproperty: has guide
has subproperty: has illustrations
has subproperty: has supplement
label: ile arttırılmıştır @tr
definition: Bir kaynağı, baskın bir kaynağın içeriğine eklenen kaynakla ilişkilendirir. @tr

has author
status: Published
definition: Relates a resource to an agent who is responsible for a textual resource.
type: Property
sub property of: has creator
inverse of: is author of
lexical alias: author.en
label: har forfatter @da
definition: Relaterer en ressource til en agent, der er ansvarlig for at have skabt en ressource, hvis indhold primært består af tekst, uanset hvilken medietype eller genre der er tale om. @da
label: heeft auteur @nl
label: aineiston kirjoittaja @fi
label: له مؤلف @ar
definition: يربط بين مصدرووكيل مسؤول عن مصدر نصي. @ar
definition: Liittää aineiston toimijaan, joka vastaa tekstiaineistosta. @fi
label: hat Verfasserin/Verfasser @de
definition: Setzt eine Ressource in Beziehung zu einem Akteur, der für eine textliche Ressource verantwortlich ist. @de
label: 有著者 @zh-hans
definition: 将一种资源与负责一种文字资源的一个行为者关联起来。 @zh-hans
label: szerzője a következő: @hu
definition: Hozzákapcsol egy forrást egy ágenshez, amely felelős egy szöveges forrás megalkotásáért. @hu
has subproperty: has librettist
has subproperty: has lyricist
has subproperty: has rapporteur
has subproperty: has screenwriter
label: yazar ile ilişkilidir @tr
definition: Bir kaynağı, metinsel bir kaynaktan sorumlu olan bir temsilci ile ilişkilendirir. @tr

has authorized access point for entity
status: Published
sub property of: has access point for entity
type: Property
lexical alias: authorizedAccessPointForEntity.en
definition: Relates an entity to an access point for entity that is selected for preference in a specific vocabulary encoding scheme.
inverse of: is authorized access point for entity of
label: heeft geautoriseerde ingang voor entiteit @nl
label: له نقطة اتاحة مقننة لكيان @ar
definition: يربط بين كيان ونقطة إتاحة لكيان اُختيرت نقطة اتاحة مقننة مُفضلة في خطة ترميز مفردات محددة. @ar
label: har autoriseret søgeindgang for entitet @da
definition: Relaterer en entitet til en søgeindgang for entitet, der er valgt som foretrukken i et specifikt vokabularkodningsskema. @da
label: entiteetin auktorisoitu hakutieto @fi
definition: Liittää entiteetin entiteetin hakutietoon, joka on valittu ensisijaiseksi tietyssä sanaston merkintäjärjestelmässä. @fi
label: hat normierten Sucheinstieg für eine Entität @de
definition: Setzt eine Entität in Beziehung zu einem Sucheinstieg für eine Entität, der in einem bestimmten Vocabulary Encoding Scheme als Vorzugsform bestimmt wird. @de
label: 有实体的规范检索点 @zh-hans
definition: 将一个实体与在一个特定的词表编码体系中被首选的一个实体的检索点关联起来。 @zh-hans
label: entitás autorizált hozzáférési pontja a következő: @hu
definition: Hozzákapcsol egy entitást egy entitás hozzáférési pontjához, amelyet egy adott szótárkódolási sémából választanak ki előnyben részesítettként. @hu
has subproperty: has authorized access point for agent
has subproperty: has authorized access point for place
has subproperty: has authorized access point for resource
has subproperty: has authorized access point for timespan
label: tüzel kişi için yetkili erişim noktası ile ilişkilidir @tr
definition: Bir varlığı, belirli bir sözcük kodlama şemasında tercih için seçilen varlığa ilişkin bir erişim noktasıyla ilişkilendirir. @tr

is authorized access point for entity of
status: Published
sub property of: is access point for entity of
type: Property
lexical alias: authorizedAccessPointForEntityOf.en
definition: Relates a nomen to an entity that has an access point for entity that is selected for preference in a specific vocabulary encoding scheme.
inverse of: has authorized access point for entity
label: is geautoriseerde ingang voor entiteit van @nl
label: هو نقطة إتاحة مقننة لكيان لـ @ar
definition: يربط بين تسمية وكيان له نقطة إتاحة لكيان اُختيرت نقطة اتاحة مقننة في خطة ترميز مفردات محددة. @ar
label: er autoriseret søgeindgang for entitet af @da
definition: Relaterer et nomen til en entitet, der har en søgeindgang for entitet, der er valgt som foretrukken i et særskilt vokabularkodningsskema. @da
label: entiteetin auktorisoitu hakutieto @fi
definition: Liittää nomenin entiteettiin, jolla on hakutieto, joka on valittu ensisijaiseksi tietyssä sanaston merkintäjärjestelmässä. @fi
label: ist normierter Sucheinstieg für eine Entität von @de
definition: Setzt ein Nomen in Beziehung zu einer Entität, die über einen Sucheinstieg für eine Entität verfügt, der in einem bestimmten Vocabulary Encoding Scheme als Vorzugsform bestimmt wird. @de
label: 是……的实体的规范检索点 @zh-hans
definition: 将一个命名与有在一个特定的词表编码体系中被首选的实体检索点的一种实体关联起来。 @zh-hans
label: autorizált hozzáférési pont a következő entitás számára: @hu
definition: Hozzákapcsol egy noment egy entitáshoz, amelynek van egy olyan hozzáférési pontja az entitás számára, amelyet egy adott szótárkódolási sémából kiválasztva előnyben részesítenek. @hu
has subproperty: is authorized access point for agent of
has subproperty: is authorized access point for place of
has subproperty: is authorized access point for resource of
has subproperty: is authorized access point for timespan of
label: varlığı için yetkili erişim noktasıdır @tr
definition: Bir ismi, belirli bir kelime kodlama şemasında tercih edilmek üzere seçilen bir varlık için erişim noktası olan bir varlıkla ilişkilendirir. @tr

is author of
status: Published
definition: Relates an agent to a resource that involves a responsibility of an agent for creating a textual resource.
type: Property
sub property of: is creator of
inverse of: has author
lexical alias: authorOf.en
label: er forfatter til @da
definition: Relaterer en agent, der er ansvarlig for at have skabt en ressource hvis indhold primært består af tekst, uanset hvilken medietype eller genre der er tale om til en ressource. @da
label: is auteur van @nl
label: هو مؤلف لـ @ar
definition: يربط بين وكيل ومصدر ينطوي على مسؤولية وكيل عن إنشاء مصدر نصي. @ar
label: kirjoittaja (toimija) aineistossa @fi
definition: Liittää toimijan aineistoon, jossa toimija vastaa tekstiaineiston luomisesta. @fi
label: ist Verfasserin/Verfasser von @de
definition: Setzt einen Akteur in Beziehung zu einer Ressource, bei der ein Akteur für die Erschaffung einer textlichen Ressource verantwortlich ist. @de
label: 是……的著者 @zh-hans
definition: 将一个行为者与涉及创作一种文字资源的一个行为者的责任的一种资源关联起来。 @zh-hans
label: szerzője a következőnek: @hu
definition: Hozzákapcsol egy ágenst egy forráshoz, amelyhez hozzátartozik egy ágens felelőssége egy szöveges forrás létrehozásáért. @hu
has subproperty: is librettist of
has subproperty: is lyricist of
has subproperty: is rapporteur of
has subproperty: is screenwriter of
label: yazarıdır @tr
definition: Bir temsilciyi, bir metin kaynağı oluşturmakla görevli bir temsilcinin sorumluluğunu içeren bir kaynakla ilişkilendirir @tr

has reviser
status: Published
lexical alias: reviser.en
definition: Relates a resource to an agent who contributes to a resource by making changes to the content.
type: Property
label: heeft herziener @nl
label: له مُراجع @ar
definition: يربط مصدر بوكيل يُساهم في مصدر من خلال إجراء تغييرات في المحتوى. @ar
label: har reviderere @da
definition: Relaterer en ressource til en agent, som bidrager til en ressource ved at lave ændringer til indholdet. @da
label: aineiston tarkastaja @fi
definition: Liittää aineiston toimijaan, joka on aineistossa osallisena tekemällä muokkauksia aineiston sisältöön. @fi
label: hat Überarbeiterin/Überarbeiter @de
definition: Setzt eine Ressource in Beziehung zu einem Akteur, der zu einer Ressource beiträgt, indem er am Inhalt Veränderungen vornimmt. @de
label: 有修订者 @zh-hans
definition: 将一种资源与通过对内容作改动而对一种资源出贡献的一个行为者关联起来。 @zh-hans
label: átdolgozója a következő: @hu
definition: Hozzákapcsol egy forrást egy ágenshez, amely a tartalom megváltoztatásával hozzájárul a forráshoz. @hu
label: gözden geçiren ile ilişkilidir @tr
definition: Bir kaynağı, içerikte değişiklik yaparak bir kaynağa katkıda bulunan bir temsilci ile ilişkilendirir. @tr

has autographer
status: Published
definition: Relates a resource to an agent whose manuscript signature appears on a resource.
type: Property
sub property of: has other agent associated with resource (Deprecated)
inverse of: is autographer of
lexical alias: autographer.en
label: har autografskriver @da
definition: Relaterer en ressource til en agent, der laver manuskriptnotater på en ressource. @da
label: heeft handtekeningzetter @nl
label: nimikirjoituksen kirjoittaja aineistossa @fi
label: له موقِّع @ar
definition: يربط مصدر بوكيل يظهر توقيعه بخط اليد على مصدر. @ar
definition: Liittää aineiston toimijaan, jonka käsinkirjoitettu nimikirjoitus aineistossa on. @fi
label: hat Unterzeichnerin/Unterzeichner @de
definition: Setzt eine Ressource in Beziehung zu einem Akteur, dessen handschriftliche Unterschrift auf einer Ressource steht. @de
label: 有亲笔签名者 @zh-hans
definition: 将一种资源与在一种资源上亲笔签名的个人关联起来。 @zh-hans
label: aláírója a következő: @hu
definition: Hozzákapcsol egy forrást egy ágenshez, akinek a kézírásos aláírása megjelenik a forráson. @hu
label: imza sahibi ile ilişkilidir @tr
definition: Bir kaynağı, el yazması imzası bir kaynakta görünen bir temsilci ile ilişkilendirir. @tr

is autographer of
status: Published
definition: Relates an agent to a resource that involves a responsibility of an agent for a manuscript signature appearing on it.
type: Property
sub property of: is other agent associated with resource of (Deprecated)
inverse of: has autographer
lexical alias: autographerOf.en
label: er autografskriver i @da
definition: Relaterer en agent hvis håndskrivne signatur forekommer på en ressource til en ressource. @da
label: is handtekening-zetter van @nl
label: هو موقِّع على @ar
definition: يربط بين وكيل ومصدر ينطوي على مسؤولية وكيل عن توقيع مخطوط يظهر عليه. @ar
label: nimikirjoituksen kirjoittaja (toimija) aineistossa @fi
definition: Liittää toimijan aineistoon, jossa on toimijan käsinkirjoitettu nimikirjoitus. @fi
label: ist Unterzeichnerin/Unterzeichner von @de
definition: Setzt einen Akteur in Beziehung zu einer Ressource mit einer handschriftlichen Unterschrift. @de
label: 是……的亲笔签名者 @zh-hans
definition: 将一个行为者与涉及在手稿上出现的签名的行为者的责任的一种资源关联起来。 @zh-hans
label: aláírója a következőnek: @hu
definition: Hozzákapcsol egy ágenst egy forráshoz, amelyhez hozzátartozik az ágens felelőssége az azon megjelenő kézírásos aláírásért. @hu
label: imza sahibidir @tr
definition: Bir temsilciyi, üzerinde görünen el yazması imzaya ilişkin bir temsilcinin sorumluluğunu içeren bir kaynakla ilişkilendirir. @tr

has award
status: Published
definition: Relates a resource to a formal recognition of excellence or other merit given by an award- or prize-granting body, for the content of a resource.
type: Property
lexical alias: award.en
label: har udmærkelse @da
definition: Relaterer en ressource til en formel anerkendelse af fortræffelig kvalitet etc., givet af en pristildelende institution for indholdet af en ressource. @da
label: heeft prijs @nl
label: palkinto aineistolle @fi
label: له منحة @ar
definition: يربط بين مصدر وإقرار رسمي بإمتياز أو أي استحقاق آخر يُمنح بواسطة هيئة مانحة للمكافأت -الجوائز-، لمحتوى أحد المصادر. @ar
definition: Liittää aineiston tunnustuksen tai palkinnon myöntävän tahon antamaan laadukkuuden tai muiden ansioiden muodolliseen tunnustukseen aineiston sisällöstä. @fi
label: hat Auszeichnung @de
definition: Setzt eine Ressource in Beziehung zu einer formalen Anerkennung von herausragenden Fähigkeiten oder Leistungen, die durch eine auszeichnende oder Preis vergebende Körperschaft für den Inhalt einer Ressource verliehen wird. @de
label: 有奖项 @zh-hans
definition: 将一种资源与颁奖或奖金发放机构对资源的优秀性等给予的正式认可关联起来。 @zh-hans
label: kitüntetése a következő: @hu
definition: Hozzákapcsol egy forrást a kiválóság vagy más érdem hivatalos elismeréséhez, amelyet egy kitüntetés- vagy díjosztó testület ad egy forrás tartalmáért. @hu
label: ödül ile ilişkilidir @tr
definition: Bir kaynağı, bir kaynağın içeriği için bir ödül veya ödül veren kuruluş tarafından verilen mükemmelliğin veya diğer değerlerin resmi olarak tanınmasıyla ilişkilendirir. @tr

has source
status: Published
definition: Relates a resource to a resource that is modified to create a new resource
type: Property
sub property of: has derivative resource relationship with (Deprecated)
inverse of: has derivative
label: er baseret på @da
definition: Relaterer en ressource til en ressource, der er anvendt som kilde til en afledt ressource. @da
lexical alias: hasSource.en
label: is gebaseerd op @nl
label: perustana aineistolle @fi
label: هو معتمد على @ar
definition: يربط بين مصدر ومصدر يُستخدم كمصدر لمصدر مشتق. @ar
definition: Liittää aineiston aineistoon, jota on muokattu uuden aineiston luomiseksi. @fi
label: ist basiert auf @de
definition: Setzt eine Ressource in Beziehung zu einer Ressource, die als Ursprung einer abgeleiteten Ressource verwendet wird. @de
label: 有源 @zh-hans
definition: 将一种资源与被修改以创建一种新资源的一种资源关联起来。 @zh-hans
label: té font @ca
definition: Relaciona un recurs amb un recurs que es modifica per crear un nou recurs @ca
label: a következőn alapul: @hu
definition: Hozzákapcsol egy forrást egy forráshoz, amelyet egy származékos forrás alapjaként használnak. @hu
has subproperty: is abridgement of
has subproperty: is abstracts for
has subproperty: is adaptation of
has subproperty: is arrangement of
has subproperty: is choreographic adaptation of
has subproperty: is digest of
has subproperty: is expanded version of
has subproperty: is free translation of
has subproperty: is imitation of
has subproperty: is indexing for (Deprecated)
has subproperty: is inspired by
has subproperty: is libretto based on
has subproperty: is musical setting of
has subproperty: is oratorio adaptation of
has subproperty: is paraphrase of
has subproperty: is remake of
has subproperty: is revision of
has subproperty: is translation of
has subproperty: is variations based on
label: kaynak ile ilişkilidir @tr
definition: Bir kaynağı, yeni bir kaynak oluşturmak için değiştirilen bir kaynakla ilişkilendirir. @tr

has base material
status: Published
definition: Relates a resource to an underlying physical material of a resource.
type: Property
lexical alias: baseMaterial.en
label: har basismateriale @da
definition: Relaterer en ressource til en manifestations underliggende fysiske materiale. @da
sub property of: has material
label: heeft basismateriaal @nl
label: له مادة أساسية @ar
definition: يربط بين مصدر ومادة ملموسة أساسية لمصدر. @ar
label: aineiston pohjamateriaali @fi
definition: Liittää aineiston aineiston fyysiseen pohjamateriaaliin. @fi
label: hat Trägermaterial @de
definition: Setzt eine Ressource in Beziehung zu einem zugrunde liegenden, physischen Material einer Ressource. @de
label: 有基底材料 @zh-hans
definition: 将一种资源与一种资源的下层物理材料关联起来。 @zh-hans
label: alapanyaga a következő: @hu
definition: Hozzákapcsol egy forrást egy forrás mögöttes fizikai anyagához. @hu
label: temel malzeme ile ilişkilidir @tr
definition: Bir kaynağı, kaynağın altında yatan fiziksel bir malzemeyle ilişkilendirir. @tr

has base material for microfilm, microfiche, photographic film, and motion picture film (Deprecated)
status: Deprecated
definition: Relates a resource to the underlying physical material of a microfilm, microfiche, photographic film, or motion picture film resource. (Deprecated)
lexical alias: baseMaterialForMicrofilmMicrofichePhotographicFilmAndMotionPictureFilm.en
type: Property

has beginning
status: Published
lexical alias: beginning.en
definition: Relates a timespan to a timespan that is the time at which a timespan starts.
type: Property
scope note: A time may be represented at different levels of granularity by a calendrical timespan.
inverse of: is beginning of
label: heeft begin @nl
label: له بداية @ar
definition: يربط بين فترة زمنية وزمن حيث تبدأ فيه فترة زمنية. @ar
scope note: يمكن تمثيل الوقت عند مستويات مختلفة من التجميع بواسطة فترة زمنية تقويمية. @ar
label: har begyndelse @da
definition: Relaterer et tidsforløb til et tidsforløb, der der det tidspunkt hvor et tidsforløb starter. @da
scope note: Et tidspunkt kan repræsenteres på forskellige granularitetsniveauer ved et kalendrisk tidsrum. @da
label: ajanjakson alku @fi
definition: Liittää ajanjakson ajanjaksoon, joka on ajanjakson alkamisaika. @fi
scope note: Aika voidaan esittää kalenterin ajanjakson eri tarkkustasoilla. @fi
label: hat Anfang @de
definition: Setzt einen Zeitraum in Beziehung zu einem Zeitraum, bei dem es sich um den Zeitpunkt handelt, an dem ein Zeitraum beginnt. @de
scope note: Ein Zeitpunkt kann durch einen kalendarischen Zeitraum auf verschiedenen Ebenen der Granularität dargestellt werden. @de
label: 有开始 @zh-hans
definition: 将一个时间段与作为一个时间段开始时间的一个时间段关联起来。 @zh-hans
scope note: 一个时间可以用日历时间段的不同颗粒度层级表示。 @zh-hans
label: kezdete a következő: @hu
definition: Hozzákapcsol egy időtartamot ahhoz az időponthoz, amikor az időtartam kezdődik. @hu
scope note: Különböző szintű részletességgel, naptári időtartammal ábrázolt idő. @hu
label: başlangıç ile ilişkilidir @tr
definition: Bir zaman aralığını, zaman aralığının başladığı zaman olan bir zaman aralığıyla ilişkilendirir. @tr
scope note: Zaman, takvimsel bir zaman aralığı ile farklı ayrıntı düzeylerinde temsil edilebilir. @tr

has bibliographic format
status: Published
definition: Relates a resource to a proportional relationship between a whole sheet in a printed or manuscript resource, and the individual leaves that result if that sheet is left full, cut, or folded.
type: Property
lexical alias: bibliographicFormat.en
label: har bibliografisk format @da
definition: Relaterer en ressource til detaljer om resultatet af at folde et trykt ark, så der dannes en samling af blade. @da
label: heeft boekformaat @nl
label: له شكل ببليوجرافي @ar
definition: يربط بين مصدر وعلاقة نسبية بين ورقة كاملة في مصدر مطبوع أو مخطوط، والأوراق الفردية التي تنتج إذا تركت الورقة كاملة، أو مقطوعة، أو مطوية. @ar
label: aineiston bibliografinen koko @fi
definition: Liittää aineiston painetussa tai käsikirjoitusaineistossa kokonaisen arkin ja yksittäisten lehtien väliseen kokosuhteeseen, joka riippuu siitä, onko arkki kokonainen, leikattu tai taitettu. @fi
label: hat bibliografisches Format @de
definition: Setzt eine Ressource in Beziehung zu einem proportionalen Verhältnis zwischen einem ganzen Bogen in einer gedruckten oder handschriftlichen Ressource und den einzelnen Blättern, die resultieren, wenn der Bogen im Ganzen gelassen, geschnitten oder gefaltet wird. @de
label: 有书目格式 @zh-hans
definition: 将一种资源与印刷或手稿资源的一个整张和导致在一种资源中是否完整、裁切或折叠的单独页之间的比例关系关联起来。 @zh-hans
label: bibliográfiai formátuma a következő: @hu
definition: Hozzákapcsol egy forrást egy aránybeli viszonyhoz, amely egy nyomtatott vagy kéziratos forrás teljes lapja és az egyes lapok között jön létre, ha a lapot teljesnek hagyják, elvágják vagy összehajtják. @hu
label: bibliyografik format ile ilişkilidir @tr
definition: Bir kaynağı, basılı veya el yazması bir kaynaktaki bütün bir sayfa ile o sayfanın dolu bırakılması, kesilmesi veya katlanması durumunda ortaya çıkan yapraklar arasındaki orantılı bir bağlantıyla ilişkilendirir. @tr

has binder
status: Published
definition: Relates a resource to an agent who binds a resource.
type: Property
sub property of: has other agent associated with resource (Deprecated)
inverse of: is binder of
lexical alias: binder.en
label: har bogbinder @da
definition: Relaterer en ressource til en agent, der indbinder en ressource. @da
label: heeft binder @nl
label: aineiston sitoja @fi
label: له مسؤول عن التجليد @ar
definition: يربط مصدر بوكيل يقوم بتجليد مصدر. @ar
definition: Liittää aineiston sen sidonnan tekevään toimijaan. @fi
label: hat Buchbinderin/Buchbinder @de
definition: Setzt eine Ressource in Beziehung zu einem Akteur, der eine Ressource bindet. @de
label: 有装订者 @zh-hans
definition: 将一种资源与装订一种资源的一个行为者关联起来。 @zh-hans
label: könyvkötője a következő: @hu
definition: Hozzákapcsol egy forrást egy ágenshez, amely beköt egy forrást. @hu
label: ciltleyici ile ilişkilidir @tr
definition: Bir kaynağı, bir kaynağı bağlayan bir temsilci ile ilişkilendirir. @tr

is binder of
status: Published
definition: Relates an agent to a resource that involves a responsibility of an agent for binding.
type: Property
sub property of: is other agent associated with resource of (Deprecated)
inverse of: has binder
lexical alias: binderOf.en
label: er bogbinder af @da
definition: Relaterer en agent der indbinder en ressource til en ressource. @da
label: is binder van @nl
label: هو مسؤول عن تجليد لـ @ar
definition: يربط بين وكيل ومصدر ينطوي على مسؤولية وكيل عن التجليد @ar
label: sitoja (toimija) aineistossa @fi
definition: Liittää toimijan aineistoon, jossa toimija vastaa sidonnasta. @fi
label: ist Buchbinderin/Buchbinder von @de
definition: Setzt einen Akteur in Beziehung zu einer Ressource, bei der ein Akteur für das Binden verantwortlich ist. @de
label: 是……的装订者 @zh-hans
definition: 将一个行为者与涉及一个装订行为者的责任的一种资源关联起来。 @zh-hans
label: könyvkötője a következőnek: @hu
definition: Hozzákapcsol egy ágenst egy forráshoz, amelyhez hozzátartozik az ágens felelőssége a kötésért. @hu
label: ciltleyicisidir @tr
definition: Bir temsilciyi, bağlamakla görevli bir temsilcinin sorumluluğunu içeren bir kaynakla ilşkilendirir @tr

has binding of resource
status: Published
lexical alias: bindingOfResource.en
definition: Relates a resource to a resource that is a binding of a resource.
type: Property
sub property of: heeft gerelateerde resource van resource
inverse of: is binding of resource of
label: heeft bindwijze van resource @nl
label: له تجليد لمصدر @ar
definition: يربط بين مصدر ومصدر هو تجليد لمصدر. @ar
label: har indbinding af ressource @da
definition: Relaterer en ressource til en ressource, der er en indbinding af en ressource. @da
label: sidos aineistona @fi
definition: Liittää aineiston aineistoon, joka on aineiston sidos. @fi
label: hat Einband einer Ressource @de
definition: Setzt eine Ressource in Beziehung zu einer Ressource, bei der es sich um den Einband einer Ressource handelt. @de
label: 有资源的装订 @zh-hans
definition: 将一种资源与作为一种资源的装订的一种资源关联起来。 @zh-hans
label: forrás kötése a következő: @hu
definition: Hozzákapcsol egy forrást egy forráshoz, amely egy forrás kötése. @hu
label: kaynağın ciltlenmesi ile ilişkilidir @tr
definition: Bir kaynağı, kaynağın bağlantısı olan bir kaynakla ilişkilendirir. @tr

is binding of resource of
status: Published
lexical alias: bindingOfResourceOf.en
definition: Relates a resource to a resource that is bound.
type: Property
sub property of: heeft gerelateerde resource van resource
inverse of: has binding of resource
label: is bindwijze van resource van @nl
label: هو تجليد مصدر لـ @ar
definition: يربط بين مصدر ومصدر تم تجليده. @ar
label: er indbinding af ressource af @da
definition: Relaterer en ressourece til en ressource, der er indbundet. @da
label: aineiston sidos @fi
definition: Liittää aineiston aineistoon, joka on sidottu. @fi
label: ist Einband einer Ressource von @de
definition: Setzt eine Ressource in Beziehung zu einer gebundenen Ressource. @de
label: 是……的资源的装订 @zh-hans
definition: 将一种资源与一种被装订的资源关联起来。 @zh-hans
label: kötése a következő forrásnak: @hu
definition: Hozzákapcsol egy forrást egy forráshoz, amely maga a kötés. @hu
label: kaynağının ciltleyicisidir @tr
definition: Bir kaynağı, bağlı olduğu bir kaynakla ilişkilendirir. @tr

has biographical information (Deprecated)
definition: Relates an agent to a summary of information about the life or history of an agent. (Deprecated)
type: Property
lexical alias: biographicalInformation.en
label: har biografiske oplysninger @da
definition: Relaterer en agent til en opsummering af oplysninger om en persons liv eller historie. @da
status: Deprecated

has book artist
status: Published
type: Property
lexical alias: bookArtist.en
definition: Relates a resource to an agent who is an artist who is responsible for exploiting the book form or altering its physical structure.
inverse of: is book artist of
sub property of: has artist
label: har bogkunstner @da
definition: Relaterer en ressource til en kunstner, der er ansvarlig for at have skabt kunstressourcer, der udnytter bogformen eller ændrer dens fysiske struktur som en del af en ressources indhold. @da
label: heeft boekkunstenaar @nl
label: له رَسّام كتب @ar
definition: يربط مصدر بوكيل فنان مسؤول عن توظيف شكل الكتاب أو تغيير بنيته المادية. @ar
label: kirjataiteilija aineistossa @fi
definition: Liittää aineiston toimijaan, jossa toimija vastaa kirjan muodon hyödyntämisestä tai sen fyysisen rakenteen muuttamisesta. @fi
label: hat Buchkünstlerin/Buchkünstler @de
definition: Setzt eine Ressource in Beziehung zu einer Künstlerin/einem Künstler (Akteur), die/der für die Verwertung der Buchform oder für die Veränderung ihrer physischen Struktur verantwortlich ist. @de
label: 有图书美术家 @zh-hans
definition: 将一种资源与作为一个艺术家负责开发图书外形或改变其物理结构的一个行为者关联起来。 @zh-hans
label: könyvművésze a következő: @hu
definition: Hozzákapcsol egy forrást egy művész ágenshez, aki felelős a könyvforma kiaknázásáért vagy fizikai szerkezetének a megváltoztatásáért. @hu
label: kitap sanatçısı ile ilişkilidir @tr
definition: Bir kaynağı, kitabın biçimini kullanmaktan veya fiziksel yapısını değiştirmekten sorumlu bir sanatçı olan bir temsilci ile ilişkilendirir. @tr

is book artist of
status: Published
type: Property
lexical alias: bookArtistOf.en
definition: Relates an agent to a resource that involves a responsibility of an agent for exploiting the book form or altering its physical structure
inverse of: has book artist
sub property of: is artist of
label: er bogkunstner til @da
definition: Relaterer en kunstner, der er ansvarlig for at have skabt kunstressourcer, der udnytter bogformen eller ændrer dens fysiske struktur som en del af en ressources indhold til en ressource. @da
label: is boekkunstenaar van @nl
label: هو رَسّام كتب لـ @ar
definition: يربط بين وكيل ومصدر ينطوي على مسؤولية وكيل عن توظيف شكل الكتاب أو تغيير بنيته المادية. @ar
label: kirjataiteilija (toimija) aineistossa @fi
definition: Liittää toimijan aineistoon, jossa toimija vastaa kirjan muodon hyödyntämisestä tai sen fyysisen rakenteen muuttamisesta. @fi
label: ist Buchkünstlerin/Buchkünstler von @de
definition: Setzt einen Akteur in Beziehung zu einer Ressource, bei der ein Akteur für die Verwertung der Buchform oder für die Veränderung ihrer physischen Struktur verantwortlich ist. @de
label: 是……的图书美术家 @zh-hans
definition: 将一个行为者与涉及开发图书外形或改变其物理结构的一个行为者的责任的一种资源关联起来。 @zh-hans
label: könyvművésze a következőnek: @hu
definition: Hozzákapcsol egy forrást egy ágenshez, amelyhez hozzátartozik az ágens felelőssége a könyvforma kiaknázásáért vagy fizikai szerkezetének megváltoztatásáért. @hu
label: kitap sanatçısıdır @tr
definition: Bir temsilciyi, fiziksel yapısını değiştirmek veya kitap biçiminden yararlanmakla görevli bir temsilcinin sorumluluğunu içeren bir kaynakla ilişkilendirir. @tr

has book designer
status: Published
definition: Relates a resource to an agent who is responsible for creating a resource by being responsible for the entire graphic design of a book, including arrangement of type and illustration, choice of materials, and process used.
type: Property
inverse of: is book designer of
lexical alias: bookDesigner.en
label: har bogdesigner @da
definition: Relaterer en ressource til en agent, der har været involveret i fremstillingen af en ressource ved at være ansvarlig for hele en bogs grafiske design, inkl. opsætning af tekst og illustrationer, materialevalg og anvendt proces. @da
label: heeft boekontwerper @nl
label: aineiston graafinen suunnittelija @fi
sub property of: has creator
label: له مُصمم كتاب @ar
definition: يربط مصدربوكيل مسؤول عن إنتاج مصدر بالتصميم الجرافيكي لكتاب بالكامل، ويشمل ذلك تنسيق الحروف، والإيضاحيات، واختيار المواد، والعمليات المستخدمة. @ar
definition: Liittää aineiston toimijaan, joka on vastuussa aineiston valmistamisesta vastaamalla kirjan graafisesta suunnittelusta, taitosta, materiaalien valinnasta ja käytettävistä valmistusmenetelmistä. @fi
label: hat Buchgestalterin/Buchgestalter @de
definition: Setzt eine Ressource in Beziehung zu einem Akteur, der für die Herstellung einer Ressource verantwortlich ist, indem er für das gesamte grafische Design eines Buchs, einschließlich Schriftbild, Bildgestaltung, Materialwahl und angewandter Verfahren, verantwortlich ist. @de
label: 有图书设计者 @zh-hans
definition: 将一种资源与通过负责图书的整体图形设计（包括字体和插图的编排、材料的选取和工艺流程的使用等）对资源创建负责的一个行为者关联起来。 @zh-hans
definition: Relaciona un recurs amb un agent que és responsable de la creació d’un recurs amb la responsabilitat de tot el disseny gràfic d’un llibre, inclosa la composició tipogràfica i la il·lustració, la tria dels materials i el procés utilitzat. @ca
label: könyvtervezője a következő: @hu
definition: Hozzákapcsol egy forrást egy ágenshez, amely felelős egy forrás gyártásáért oly módon, hogy felelős egy könyv teljes grafikai tervezéséért, beleértve a nyomdai betűtípus és az illusztrációk elrendezését, az anyagválasztást és az alkalmazott eljárást. @hu
label: kitap tasarımcısı ile ilişkilidir @tr
definition: Bir kaynağı, yazı ve çizim düzenlemesi, malzeme seçimi ve kullanılan süreç dahil olmak üzere bir kitabın tüm grafik tasarımından sorumlu olarak kaynak oluşturmaktan sorumlu olan bir temsilci ile ilişkilendirir. @tr

is book designer of
status: Published
definition: Relates an agent to a resource that involves a responsibility of an agent for the entire graphic design of a book, including arrangement of type and illustration, choice of materials, and process used.
type: Property
inverse of: has book designer
lexical alias: bookDesignerOf.en
label: er bogdesigner for @da
definition: Relaterer en agent, der har været involveret i fremstillingen af en ressource ved at være ansvarlig for hele en bogs grafiske design, inkl. opsætning af tekst og illustrationer, materialevalg og anvendt proces til en ressource. @da
label: is boekontwerper van @nl
sub property of: is creator of
label: هو مُصمم كتاب لـ @ar
definition: يربط بين وكيل ومصدر ينطوي على مسؤولية وكيل عن التصميم الجرافيكي لكتاب بالكامل، ويشمل ذلك تنسيق الحروف والإيضاحيات، واختيار المواد، والعمليات المستخدمة. @ar
label: graafinen suunnittelija (toimija) aineistossa @fi
definition: Liittää toimijan aineistoon, jossa toimija vastaa kirjan graafisesta suunnittelusta, taitosta, materiaalien valinnasta ja käytettävistä valmistusmenetelmistä. @fi
label: ist Buchgestalterin/Buchgestalter von @de
definition: Setzt einen Akteur in Beziehung zu einer Ressource, bei der ein Akteur für das gesamte grafische Design eines Buchs, einschließlich Schriftbild, Bildgestaltung, Materialwahl und angewandter Verfahren, verantwortlich ist. @de
label: 是……的图书设计者 @zh-hans
definition: 将一个行为者与涉及一种图书的整体平面设计（包括字体和插图的设计、材料的选取和工艺流程的使用等）的一个行为者的责任的一种资源关联起来。 @zh-hans
label: könyvtervezője a következőnek: @hu
definition: Hozzákapcsol egy ágenst egy forráshoz, amelyhez hozzátartozik az ágens felelőssége egy könyv teljes grafikai tervezéséért, beleértve a nyomdai betűtípus és az illusztrációk elrendezését, az anyagválasztást és az alkalmazott eljárást. @hu
label: kitap tasarımcısıdır @tr
definition: Bir temsilciyi, harf ve illüstrasyon düzenlemesi, malzeme seçimi ve kullanılan süreç dahil olmak üzere bir kitabın tüm grafik tasarımından sorumlu bir temsilcinin sorumluluğunu içeren bir kaynakla ilişkilendirir. @tr

is bound with
status: Published
definition: Relates a resource to a resource that is physically combined with a resource to form a collection resource.
type: Property
sub property of: is accompanied by
lexical alias: boundWith.en
label: er indbundet sammen med @da
definition: Relaterer en ressource til en ressource, der er indbundet i den samme indbinding som den ressource, der beskrives. @da
scope note: Each resource originally exemplifies a resource that is a sheet or volume.
label: is gebonden met @nl
label: yhteensidottu (aineisto) @fi
label: مجلد مع @ar
definition: يربط بين مصدر ومصدر مدمج أو مرتبط مادياً بمصدر. @ar
definition: Liittää aineiston aineistoon, josta on muodostettu kokoelma-aineisto toisen aineiston kanssa sitomalla aineistot fyysisesti yhteen. @fi
scope note: Kumpikin aineisto ilmentää alunperin aineistoa, joka on arkki tai numero @fi
label: ist eingebunden mit @de
definition: Setzt eine Ressource in Beziehung zu einer Ressource, die physisch mit einer Ressource verbunden ist. @de
label: 与……合订 @zh-hans
definition: 将一种资源与和一种资源在物理上结合起来形成一种收藏资源的一种资源关联起来。 @zh-hans
scope note: 每种资源起初都例证作为一张或一卷的一种资源。 @zh-hans
definition: Relaciona un recurs amb un recurs que es combina físicament o que s’uneix amb un recurs per formar un recurs de col·lecció de recursos. @ca
scope note: Cada recurs originalment exemplifica un recurs que és un full o volum. @ca
label: egybekötve a következővel: @hu
definition: Hozzákapcsol egy forrást egy forráshoz, amelyet fizikailag hozzákapcsolnak vagy egyesítenek egy forrással. @hu
label: ile bağlanmıştır @tr
definition: Bir kaynağı, bir koleksiyon içeriği oluşturmak üzere bir kaynakla fiziksel olarak birleşen bir kaynakla ilişkilendirir. @tr
scope note: Her kaynak, başlangıçta bir sayfa veya cilt olan bir kaynağı örnekler. @tr

has braille embosser
status: Published
definition: Relates a resource to an agent who is responsible for manufacturing a resource by embossing braille cells using a stylus, special embossing printer, or other device.
type: Property
sub property of: has manufacturer
inverse of: is braille embosser of
lexical alias: brailleEmbosser.en
label: har braillepræger @da
definition: Relaterer en ressource til en agent, der har været involveret i fremstillingen af en ressource ved at præge brailleceller vha. en stift, særlig prægeprinter eller andet apparatur. @da
label: heeft brailleerder @nl
label: aineiston pistekirjoituksen tekijä @fi
label: له نقاش حروف بطريقة برايل @ar
definition: يربط مصدر بوكيل مسؤول عن إنتاج مصدر عن طريق نقش حروف برايل باستخدام قلم أو طابعة خاصة للنقش أو أي أداة أخرى. @ar
definition: Liittää aineiston toimijaan, joka on vastuussa aineiston valmistamisesta tuottamalla pistekirjoitusmerkkejä piirtimen, erityistulostimen tai muun laitteen avulla. @fi
label: hat Brailleschriftprägerin/Brailleschriftpräger @de
definition: Setzt eine Ressource in Beziehung zu einem Akteur, der für die Herstellung einer Ressource in Form von Braillezeichen verantwortlich ist, indem er einen Griffel, einen speziellen Brailledrucker oder ein anderes Gerät zum Prägen verwendet. @de
label: 有布莱叶盲文点字制作者 @zh-hans
definition: 将一种资源与涉及通过使用刻写针、专门的压纹机或其他设备压印布莱叶盲文而对一种资源的生产负责的一个行为者关联起来。 @zh-hans
label: Braille-dombornyomója a következő: @hu
definition: Hozzákapcsol egy forrást egy ágenshez, amely felelős egy forrás gyártásáért oly módon, hogy domborítja a Braille-cellákat íróvessző, speciális domborítónyomtató vagy más készülék használatával. @hu
label: braille kabartmacısı ile ilişkilidir @tr
definition: Bir kaynağı, bir kalem, özel kabartma yazıcı veya başka bir cihaz kullanarak braille hücrelerini kabartarak bir kaynak üretmekten sorumlu olan bir temsilci ile ilişkilendirir. @tr

is braille embosser of
status: Published
definition: Relates an agent to a resource that involves a responsibility of an agent for embossing braille cells using a stylus, special embossing printer, or other device.
type: Property
sub property of: is manufacturer of
inverse of: has braille embosser
lexical alias: brailleEmbosserOf.en
label: er punktskriftspræger af @da
definition: Relater en agent, der har været involveret i fremstillingen af en ressource ved at præge punktskriftsceller vha. en stift, særlig prægeprinter eller anden anordning til en ressource. @da
label: is brailleerder van @nl
label: هو نقاش حروف بطريقة برايل لـ @ar
definition: يربط بين وكيل ومصدر ينطوي على مسؤولية وكيل عن نقش حروف برايل باستخدام قلم، طابعة خاصة للنقش، أو أي أداة أخرى. @ar
label: pistekirjoituksen tekijä (toimija) aineistossa @fi
definition: Liittää toimijan aineistoon, jossa toimija vastaa pistekirjoitusmerkkien tuottamisesta piirtimen, erityistulostimen tai muun laitteen avulla @fi
label: ist Brailleschriftprägerin/Brailleschriftpräger von @de
definition: Setzt einen Akteur in Beziehung zu einer Ressource, bei der ein Akteur für das Prägen von Braillezeichen verantwortlich ist, indem er einen Griffel, einen speziellen Brailledrucker oder ein anderes Gerät verwendet. @de
label: 是……的布莱叶盲文点字制作者 @zh-hans
definition: 将一个行为者与涉及通过使用刻写针、专门的压纹机或其他设备压印布莱叶盲文的一个行为者的责任的一种资源关联起来。 @zh-hans
label: Braille-dombornyomója a következőnek: @hu
definition: Hozzákapcsol egy ágenst egy forráshoz, amelyhez hozzátartozik az ágens felelőssége braille-cellák dombornyomásáért íróvessző, speciális dombornyomtató vagy más eszköz használatával. @hu
label: braille kabartmacısıdır @tr
definition: Bir temsilciyi, bir kalem, özel kabartma yazıcı veya başka bir aygıt kullanarak braille hücrelerini kabartmakla görevli bir temsilcinin sorumluluğunu içeren bir kaynakla ilişkilendirir. @tr

has broadcaster
status: Published
definition: Relates a resource to an agent who is responsible for broadcasting a resource to an audience via radio, television, webcast, or other transmission media.
type: Property
sub property of: has publisher
inverse of: is broadcaster of
lexical alias: broadcaster.en
label: har broadcaster @da
definition: Relaterer en ressource til en agent, der har været involveret i transmissionen af en ressource til et publikum via radio, tv, webcast etc. @da
label: heeft uitzender @nl
label: lähetyksestä vastaava henkilö aineistossa @fi
label: له مُذيع @ar
definition: يربط مصدر بوكيل مسؤول عن بث مصدر إلى جمهور عبر إذاعة، تلفزيون، إنترنت، أو وسائط نقل أخرى. @ar
definition: Liittää aineiston toimijaan, joka vastaa radio-, televisio-, suoratoisto- tms. lähetyksen välittämisestä yleisölle. @fi
label: hat Sender @de
definition: Setzt eine Ressource in Beziehung zu einem Akteur, der für die Ausstrahlung einer Ressource über Hörfunk, Fernsehen oder Webcast oder andere Übertragungsmedien verantwortlich ist. @de
label: 有广播者 @zh-hans
definition: 将一种资源与负责通过广播、电视、网络直播或其他传输媒介向受众广播一种资源的一个行为者关联起来。 @zh-hans
label: műsorszolgáltatója a következő: @hu
definition: Hozzákapcsol egy forrást egy ágenshez, amely felelős egy forrás rádión, televízión, webközvetítésen, vagy egyéb adatátviteli médiumon keresztül közönséghez történő műsorszórásában. @hu
label: yayıncı ile ilişkilidir @tr
definition: Bir kaynağı radyo, televizyon, web yayını veya diğer iletim ortamları aracılığıyla kaynağı bir kitleye yayınlamaktan sorumlu olan bir temsilci ile ilişkilendirir. @tr

is broadcaster of
status: Published
definition: Relates an agent to a resource that involves a responsibility of an agent for broadcasting to an audience via radio, television, webcast, etc.
type: Property
sub property of: is publisher of
inverse of: has broadcaster
lexical alias: broadcasterOf.en
label: er broadcaster af @da
definition: Relaterer en agent, der har været involveret i transmission af en ressource til et publikum via radio, tv, webcast etc til en ressource. @da
label: is uitzender van @nl
label: هو مذيع لـ @ar
definition: يربط بين وكيل ومصدر ينطوي على مسؤولية وكيل عن البث إلى جمهور عبر الإذاعة والتلفزيون والإنترنت، الخ. @ar
label: lähetyksestä vastaava henkilö (toimija) aineistossa @fi
definition: Liittää toimijan aineistoon, jossa toimija vastaa radio-, televisio-, suoratoisto- tms. lähetyksen välittämisestä yleisölle. @fi
label: ist Sender von @de
definition: Setzt einen Akteur in Beziehung zu einer Ressource, bei der ein Akteur für die Ausstrahlung über Hörfunk, Fernsehen oder Webcast und so weiter verantwortlich ist. @de
label: 是……的广播者 @zh-hans
definition: 将一个行为者与涉及一个通过广播、电视、网路直播等向听众播音的一个行为者的责任的一种资源关联起来。 @zh-hans
label: műsorszolgáltatója a következőnek: @hu
definition: Hozzákapcsol egy ágenst egy forráshoz, amelyhez hozzátartozik az ágens felelőssége műsorszórásért, amely a közönség felé rádión, televízión, webes közvetítésen stb. keresztül történik. @hu
label: yayıncısıdır @tr
definition: Bir temsilciyi, radyo, televizyon, web yayını vb. yoluyla bir izleyiciye yayın yapmakla görevli bir temsilcinin sorumluluğunu içeren bir kaynakla ilişkilendirir. @tr

has broadcast standard
status: Published
definition: Relates a resource to a system used to format a video resource for television broadcast.
type: Property
sub property of: has video characteristic
lexical alias: broadcastStandard.en
label: har transmissionsstandard @da
definition: Relaterer en ressource til et system, der anvendes til at formatere en videoressource til tv-transmission. @da
label: heeft uitzendstandaard @nl
label: lähetysstandardi aineistossa @fi
label: له معيار بث @ar
definition: يربط بين مصدر ونظام مستخدم لتهيئة مصدر فيديو للبث التلفزيوني. @ar
label: hat Sendestandard @de
definition: Setzt eine Ressource in Beziehung zu einem System, das zur Formatierung einer Videoressource für eine Fernsehsendung verwendet wird. @de
definition: Liittää aineiston järjestelmään, jonka mukaisesti videoaineisto muunnetaan televisiolähetystä varten. @fi
label: 有广播标准 @zh-hans
definition: 将一种资源与用于电视广播的一种视频资源的格式的一个体系关联起来。 @zh-hans
label: műsorszórási szabványa a következő: @hu
definition: Hozzákapcsol egy forrást egy rendszerhez, amelyet egy videóforrás formátumaként használnak televíziós műsorszóráshoz. @hu
label: yayın standardı ile ilişkilidir @tr
definition: Bir kaynağı, televizyon yayını için bir video kaynağını biçimlendirmek için kullanılan bir sistemle ilişkilendirir. @tr

has broader affiliated agent
status: Published
type: Property
lexical alias: broaderAffiliatedAgent.en
definition: Relates an agent to an agent who acts for a local affiliated body and others at a broader organizational level.
label: har bredere tilknyttet agent @da
definition: Relaterer en agent der agerer for en lokalt tilknyttet agent og andre på et bredere organisatorisk niveau til en agent. @da
label: heeft breder aangesloten actor @nl
label: له وكيل تابع على نطاق أوسع @ar
definition: يربط بين وكيل ووكيل يعمل لصالح هيئة محلية تابعة وهيئات أخرى على مستوى تنظيمي أوسع. @ar
label: laajempi emoyhtiö @fi
definition: Liittää yhteistoimijan laajempaan yhteistoimijaan, jolla on yhteys paikallisiin tytäryhtiöihin organisaatiorakenteen kautta. @fi
label: hat Dachverband @de
definition: Setzt einen Akteur in Beziehung zu einem Akteur, der für eine lokale Filiale und für andere, auf einer größeren organisatorischen Ebene, handelt. @de
label: 有更广泛的隶属行为者 @zh-hans
definition: 将一个行为者与为一个本地隶属团体行为并为一个更广泛的组织层次其他团体行为的一个行为者关联起来。 @zh-hans
label: tágabb értelmű tagágense a következő: @hu
definition: Hozzákapcsol egy ágenst egy ágenshez, amely helyi tagszervezete és mások érdekében tágabb szervezeti szinten jár el. @hu
label: daha geniş bağlı temsilci ile ilişkilidir @tr
definition: Bir temsilciyi, yerel bir bağlı kuruluş adına hareket eden bir temsilciyle ve daha geniş bir organizasyon düzeyindeki diğer kişilerle ilişkilendirir. @tr

has cadenza
status: Published
definition: Relates a resource to a resource that is a musical resource that is an ornamental passage for a soloist added to a musical resource, such as a concerto, by the same or a different composer.
type: Property
sub property of: is augmented by
inverse of: is cadenza composed for
lexical alias: cadenza.en
label: er kadence @da
definition: Relaterer en ressource til en musikressource, der består af en nedskreven improvisation for solist, som er føjet til en musikressource såsom en koncert, enten af den samme eller af en anden komponist. @da
label: heeft cadens @nl
label: kadenssiaineisto @fi
label: له كادنزا @ar
definition: يربط بين مصدر ومصدر موسيقي يُمثل فقرة مصاحبة لعازف منفرد تُضاف إلى مصدر موسيقي مثل، كونشيرتو، للملحن نفسة أو لملحن مختلف. @ar
definition: Liittää aineiston musiikkiaineistoon, joka koostuu solistille tarkoitetusta koristeellisesta osasta ja on lisätty saman tai eri säveltäjän musiikkiteokseen, kuten konserttoon. @fi
label: hat Kadenz @de
definition: Setzt eine Ressource in Beziehung zu einer Musikressource, die aus einer ausgeschmückten Passage für eine Solistin/einen Solisten besteht, die einer Musikressource, wie zum Beispiel einem Konzert, entweder von derselben/demselben oder einer/einem anderen Komponistin/Komponisten hinzugefügt wird. @de
label: 有华彩 @zh-hans
definition: 将一种资源与由同一个或不同的作曲家附加在诸如协奏曲等一种音乐资源中独奏（唱）表演的装饰性乐段作为一种音乐资源的一种资源关联起来。 @zh-hans
definition: Relaciona un recurs amb un recurs que és un recurs musical que és un passatge ornamental per a un solista afegit a un recurs musical, com ara un concert, del mateix compositor o d’un compositor diferent. @ca
label: kadenciája a következő: @hu
definition: Hozzákapcsol egy forrást egy zenei forráshoz, amely egy szólista számára alkotott díszítő szakaszból áll, amelyet egy versenyműhöz hasonló zenei forráshoz ad hozzá ugyanaz vagy egy másik zeneszerző. @hu
label: kadans ile ilişkilidir @tr
definition: Bir kaynağı, bir soliste ait süs notaları olan bir müzik kaynağına aynı veya farklı besteci tarafından eklenen konçerto gibi bir müzik kaynağı ile ilişkilendirir. @tr

is cadenza composed for
status: Published
definition: Relates a resource to a musical resource, such as a concerto, to which is added a musical resource that is an ornamental passage for a soloist by the same or a different composer.
type: Property
sub property of: is augmentation of
inverse of: has cadenza
lexical alias: cadenzaComposedFor.en
label: er kadence komponeret til @da
definition: Relaterer en ressource til en musikressource, såsom en koncert, hvortil der er komponeret en nedskreven improvisation for solist, enten af den samme eller af en anden komponist. @da
label: is cadens gecomponeerd voor @nl
label: هو كادنزا مؤلَفة لـ @ar
definition: يربط بين مصدر ومصدر موسيقي مثل كونشيرتو يضاف إلي مصدر موسيقي يمثل فقرة مصاحبة لعازف منفرد للملحن نفسه أو لملحن مختلف. @ar
label: kadenssi aineistoon @fi
definition: Liittää aineiston musiikkiaineistoon, joka koostuu solistille tarkoitetusta koristeellisesta osasta ja on lisätty saman tai eri säveltäjän musiikkiaineistoon. @fi
label: ist Kadenz komponiert für @de
definition: Setzt eine Ressource in Beziehung zu einer Musikressource, zum Beispiel einem Konzert, dem eine Musikressource, das aus einer ausgeschmückten Passage für eine Solistin/einen Solisten besteht, entweder von derselben/demselben oder einer/einem anderen Komponistin/Komponisten hinzugefügt wird. @de
label: 是为……作曲的华彩段 @zh-hans
definition: 将一种资源与由同一个或不同的作曲家附加的独奏（唱）表演的装饰性乐段的一种音乐资源于其中的诸如协奏曲等的一种音乐资源关联起来。 @zh-hans
label: kadencia a következőhöz komponálva: @hu
definition: Hozzákapcsol egy forrást egy versenyműhöz hasonló zenei forráshoz, amelyhez egy szólistának szánt díszítő szakaszt alkotott ugyanaz vagy egy másik zeneszerző. @hu
label: için bestelenmiş kadanstır @tr
definition: Bir kaynağı, bir soliste ait süs notaları olan bir müzik kaynağına aynı veya farklı besteci tarafından eklenen konçerto gibi bir müzik kaynağı ile ilişkilendirir. @tr

has calligrapher
status: Published
type: Property
lexical alias: calligrapher.en
definition: Relates a resource to an agent who is an artist who is responsible for calligraphy where the focus of interest lies in the aesthetic value of the penmanship or graphic artistry, regardless of whether the same agent is also responsible for the inscribed text.
inverse of: is calligrapher of
sub property of: has artist
label: har kalligraf @da
definition: Relaterer en ressource til en kunstner, der er ansvarlig for at have skabt en kalligrafisk ressource, hvor fokus ligger på den æstetiske værdi af skrivekunsten eller den kunstneriske grafiske dygtighed, uanset om den samme agent etc. også har forfattet den indskrevne tekst. @da
label: heeft kalligraaf @nl
label: له خَطَّاط @ar
definition: يربط مصدر بوكيل فنانً مسؤول عن الخط حيث يكمن تركيز الاهتمام في القيمة الجمالية للخط أو فن الرسم، بغض النظر عما إذا كان الوكيل نفسه مسؤولاً أيضًا عن النص المدرج. @ar
label: kalligrafi aineistossa @fi
definition: Liittää aineiston toimijaan, joka vastaa kalligrafiasta, jossa pääpaino on käsin kirjoittamisen tai graafisen taiteen esteettisissä arvoissa, riippumatta siitä, vastaako sama toimija myös kirjoitetusta tekstistä. @fi
label: ist Kalligrafin/Kalligraf @de
definition: Setzt eine Ressource in Beziehung zu einer Künstlerin/einem Künstler (Akteur), die/der für die Kalligrafie verantwortlich ist, bei der im Mittelpunkt des Interesses der ästhetische Wert dessen Schreibkunst oder die grafische Kunstfertigkeit liegt, unabhängig davon, ob derselbe Akteur auch für den aufgeschriebenen Text verantwortlich ist. @de
label: 有书法者 @zh-hans
definition: 将一种资源与作为一个艺术家负责书法（其中兴趣重点是书法或图形艺术的美学价值，不管同一行为者是否负责题写文字）的一个行为者关联起来。 @zh-hans
label: kalligráfusa a következő: @hu
definition: Hozzákapcsol egy forrást egy művész ágenshez, aki felelős egy kalligráfia megalkotásáért, amelyben a szépírás esztétikai értéke vagy a grafika művészisége áll az érdeklődés fókuszában, tekintet nélkül arra, hogy ugyanaz az ágens a lejegyzett szöveg szerzője is egyben vagy sem. @hu
label: kaligraf ile ilişkilidir @tr
definition: Bir kaynağı, aynı temsilcinin yazılı metinden de sorumlu olup olmadığına bakılmaksızın, hattatlığın veya grafik sanatının estetik değerinin ön plana çıktığı kaligrafiden sorumlu sanatçı olan bir temsilci ile ilişkilendirir @tr

is calligrapher of
status: Published
type: Property
lexical alias: calligrapherOf.en
definition: Relates an agent to a resource that involves a responsibility of an agent for calligraphy where the focus of interest lies in the aesthetic value of the penmanship or graphic artistry, regardless of whether the same agent is also responsible for the inscribed text.
inverse of: has calligrapher
sub property of: is artist of
label: er kalligraf til @da
definition: Relaterer en kunstner, der er ansvarlig for at have skabt en kalligrafisk ressource, hvor interessefokusset ligger på den æstetiske værdi af dets skønskrift eller kunstneriske grafiske dygtighed, uanset om den samme agent etc. også har forfattet den indskrevne tekst til et ressource. @da
label: is kalligraaf van @nl
label: هو خَطَّاط لـ @ar
definition: يربط بين وكيل ومصدر ينطوي على مسؤولية وكيل عن الخط حيث ينصب الاهتمام على القيمة الجمالية لفن الخط أو فن الرسم، بغض النظر عما إذا كان الوكيل نفسه مسؤولًا أيضًا عن النص المكتوب أم لا. @ar
label: kalligrafi (toimija) aineistossa @fi
definition: Liittää toimijan aineistoon, jossa toimija vastaa kalligrafiasta, jossa pääpaino on käsin kirjoittamisen tai graafisen taiteen esteettisissä arvoissa, riippumatta siitä, vastaako sama toimija myös kirjoitetusta tekstistä. @fi
label: ist Kalligrafin/Kalligraf von @de
definition: Setzt einen Akteur in Beziehung zu einer Ressource, bei der ein Akteur für die Kalligrafie verantwortlich ist, bei der im Mittelpunkt des Interesses der ästhetische Wert dessen Schreibkunst oder die grafische Kunstfertigkeit liegt, unabhängig davon, ob derselbe Akteur auch für den aufgeschriebenen Text verantwortlich ist. @de
label: 是……的书法者 @zh-hans
definition: 将一个行为者与涉及书法（其中兴趣重点是书法或图形艺术的美学价值，不管同一行为者是否负责题写文字）的一个行为者的责任的一种资源关联起来。 @zh-hans
label: kalligráfusa a következőnek: @hu
definition: Hozzákapcsol egy forrást egy ágenshez, amelyhez hozzátartozik az ágens szépírással kapcsolatos felelőssége, ahol az érdeklődés középpontjában a kézírás esztétikai értéke vagy a grafika művészisége áll, tekintet nélkül arra, hogy ugyanaz az ágens a lejegyzett szöveg szerzője is egyben vagy sem. @hu
label: kaligrafıdır @tr
definition: Bir temsilciyi, yazılı metinden sorumlu olup olmadığına bakmadan ilgi odağı grafik sanatı veya hattatlığın estetik değerinde yer alan hat sanatından sorumlu bir temsilcinin sorumluluğunu içeren bir kaynakla ilişkilendirir. @tr

has capture information
status: Published
definition: Relates a resource to a place, date, or other information that is associated with the recording, filming, or other method of obtaining the content of a resource.
type: Property
lexical alias: captureInformation.en
label: har sted, år eller dato for optagelse @da
definition: Relaterer en ressource til et sted og år eller dato, hvor et udtryks indhold blev optaget, indspillet etc. @da
label: heeft vastleginformatie @nl
label: له معلومات مُلتقطة @ar
definition: يربط بين مصدر ومكان، تاريخ، أو أية معلومات أخرى مرتبطة بتسجيل، تصوير، إلخ.، محتوى مصدر. @ar
label: tallennusinformaatio aineistosta @fi
definition: Liittää aineiston paikkaan, päivämäärään tai muuhun informaatioon, joka liittyy aineiston sisällön äänittämiseen, filmaamiseen tms. @fi
label: hat Information zur Aufzeichnung @de
definition: Setzt eine Ressource in Beziehung zu einem Geografikum, einem Datum oder anderen Informationen, das/die mit der Aufnahme, dem Filmen und so weiter des Inhalts einer Ressource in Verbindung steht/stehen. @de
label: 有摄录信息 @zh-hans
definition: 将一种资源与和一种资源的内容的录制、拍摄或其他获取方法有关的地点、日期或其他信息关联起来。 @zh-hans
definition: Relaciona un recurs amb un lloc, data o altra informació que s’associa amb l’enregistrament, la filmació o un altre mètode per obtenir el contingut d’un recurs. @ca
label: rögzítési információja a következő: @hu
definition: Hozzákapcsol egy forrást egy helyhez, időhöz vagy egyéb információhoz, amelyet egy forrás tartalmának rögzítéséhez, filmezéséhez, stb. társítanak. @hu
label: kaydetme bilgisi ile ilişkilidir @tr
definition: Bir kaynağı, bir yer, tarih veya bir kaydın içeriğinin kaydedilmesi, filme alınması vb. ile bağlantılı olan diğer bilgilerle ilişkilendirir. @tr

has carrier type
status: Published
definition: Relates a resource to a categorization reflecting the format of the storage medium and housing of a carrier in combination with the type of intermediation device required to view, play, run, or otherwise access the content of a resource.
type: Property
lexical alias: carrierType.en
label: har bærertype @da
definition: Relaterer en manifestation til en kategorisering der specifikt afspejler lagringsmediet og dets udstyr i kombination med den type af afspilningsudstyr, som kræves for at se, spille, fremvise eller på anden måde give adgang til en manifestations indhold. @da
label: heeft type drager @nl
label: aineiston tallennetyyppi @fi
label: له نوع الحامل @ar
definition: يربط بين مصدر وفئة تعكس شكل وسيط التخزين ومكان الحامل المصاحب لنوع الجهاز الوسيط المطلوب لعرض، لتشغيل، أو لمعالجة أو للوصول إلى محتوى مصدر. @ar
definition: Liittää aineiston kategorisointiin, joka ilmaisee säilytysvälineen ja tallenteen koteloinnin formaatin yhdessä aineiston sisällön katsomiseen, toistamiseen, suorittamiseen tai muuhun toimintaan tarvittavan välittävän laitteen tyypin kanssa. @fi
label: hat Datenträgertyp @de
definition: Setzt eine Ressource in Beziehung zu einer Kategorisierung, die das Format des Speichermediums und das Gehäuse eines Datenträgers widerspiegelt, in Kombination mit der Art des Hilfsmittels, das benötigt wird, um den Inhalt einer Ressource anzuschauen, abzuspielen oder laufen zu lassen und so weiter. @de
label: 有载体类型 @zh-hans
definition: 将一种资源与反映存储媒介格式和载体装置并结合资源内容的浏览、播放、运行或其他存取方式等所需中间设备的类型的分类关联起来。 @zh-hans
label: hordozótípusa a következő: @hu
definition: Hozzákapcsol egy forrást egy kategorizáláshoz, amely tükrözi a tároló médium formátumát és a hordozó burkolatát a közvetítőkészülék azon típusával kombináltan, amely egy forrás tartalmának megtekintéséhez, lejátszásához, futtatásához, stb. szükséges. @hu
label: taşıyıcı türü ile ilişkilidir @tr
definition: Bir kaynağı, bir kaynağın içeriğini görüntülemek, oynatmak, çalıştırmak veya başka bir şekilde erişmek için gereken aracı cihaz türüyle kombinasyon halinde depolama ortamının biçimini ve bir taşıyıcının yerini yansıtan bir sınıflandırmayla ilişkilendirir. @tr

has carrier version
status: Published
lexical alias: carrierVersion.en
definition: Relates a resource to a resource that is created by changing the carrier of a resource.
type: Property
sub property of: has transformation by audience
label: heeft dragerversie @nl
label: له إصدارة ناقل @ar
definition: يربط بين مصدر ومصدر تم إنشاؤه عن طريق تغيير ناقل لمصدر. @ar
label: har bærerversion @da
definition: Relaterer en ressource til en ressource, der er skabt ved at ændre en ressources bærere. @da
label: aineiston tallenneversio @fi
definition: Liittää aineiston tallennetta muuttamalla luotuun versioon. @fi
label: hat Datenträgerversion @de
definition: Setzt eine Ressource in Beziehung zu einer Ressource, die durch Änderung des Datenträgers einer Ressource geschaffen wird. @de
label: 有载体版本 @zh-hans
definition: 将一种资源与通过改变一种资源的载体而创建的一种资源关联起来。 @zh-hans
label: hordozóváltozata a következő: @hu
definition: Hozzákapcsol egy forrást egy forráshoz, amely egy forrás hordozójának megváltozása következtében jött létre. @hu
label: taşıyıcı sürümü ile ilişkilidir @tr
definition: Bir kaynağı, bir kaynağın taşıyıcısı değiştirilerek oluşturulan bir kaynakla ilişkilendirir. @tr

is carrier version of
status: Published
lexical alias: carrierVersionOf.en
definition: Relates a resource to a resource that has a carrier that is changed to create a resource.
type: Property
sub property of: is transformation by audience of
inverse of: has carrier version
label: is dragerversie van @nl
label: هو إصدارة ناقل لـ @ar
definition: يربط بين مصدر ومصدر به ناقل تم تغييره لإنشاء مصدر. @ar
label: er bærerversion af @da
definition: Relaterer en ressource til en ressource, som har en bærer, der ændres for at skabe en ressurce. @da
label: tallenneversio (aineisto) @fi
definition: Liittää aineiston tallennemuotoa muuttamalla luotuun versioon. @fi
label: ist Datenträgerversion von @de
definition: Setzt eine Ressource in Beziehung zu einer Ressource, deren Datenträger geändert wird, um eine Ressource zu schaffen. @de
label: 是……的载体版本 @zh-hans
definition: 将一种资源与有载体并被改变以创建一种资源的一种资源关联起来。 @zh-hans
label: hordozóváltozata a következőnek: @hu
definition: Hozzákapcsol egy forrást egy forráshoz, amelynek a hordozója megváltozott egy forrás létrejövetele érdekében. @hu
label: taşıyıcı sürümüdür @tr
definition: Bir kaynağı, bir kaynak oluşturmak için değiştirilen bir taşıyıcıya sahip bir kaynakla ilişkilendirir. @tr

has cartographer
status: Published
definition: Relates a resource to an agent who is responsible for a cartographic resource.
type: Property
sub property of: has creator
inverse of: is cartographer of
lexical alias: cartographer.en
label: har kartograf @da
definition: Relaterer en ressource til en agent, der er ansvarlig for at have skabt et kort, et atlas, en globus eller en anden kartografisk ressource. @da
label: heeft cartograaf @nl
label: aineiston kartografi @fi
label: له رسام خرائط @ar
definition: يربط مصدر بوكيل مسؤول عن مصدر خرائطي @ar
definition: Liittää aineiston toimijaan, joka vastaa kartografisesta aineistosta. @fi
label: hat Kartografin/Kartograf @de
definition: Setzt eine Ressource in Beziehung zu einem Akteur, der für eine kartografische Ressource verantwortlich ist. @de
label: 有地图绘制者 @zh-hans
definition: 将一种资源与负责一种地图资源的一个行为者关联起来。 @zh-hans
label: térképésze a következő: @hu
definition: Hozzákapcsol egy forrást egy ágenshez, amely felelős egy kartográfiai forrás megalkotásáért. @hu
label: kartograf ile ilişkilidir @tr
definition: Bir kaynağı, kartografik bir kaynaktan sorumlu olan bir temsilci ile ilişkilendirir. @tr

is cartographer of
status: Published
definition: Relates an agent to a resource that involves a responsibility of an agent for a cartographic resource.
type: Property
sub property of: is creator of
inverse of: has cartographer
lexical alias: cartographerOf.en
label: er kartograf til @da
definition: Relaterer en agent, der er ansvarlig for at have skabt et kort, et atlas, en globus eller et andet kartografisk værk til en ressource. @da
label: is cartograaf van @nl
label: هو رسام خرائط لـ @ar
definition: يربط بين وكيل ومصدر ينطوي على مسؤولية وكيل عن مصدر رسم خرائط. @ar
label: kartografi (toimija) aineistossa @fi
definition: Liittää toimijan aineistoon, jossa toimija vastaa kartografisesta aineistosta. @fi
label: ist Kartografin/Kartograf von @de
definition: Setzt einen Akteur in Beziehung zu einer Ressource, bei der ein Akteur für eine kartografische Ressource verantwortlich ist. @de
label: 是……的地图绘制者 @zh-hans
definition: 将一个行为者与涉及一个行为者对一种地图资源的责任的一种资源关联起来。 @zh-hans
label: térképésze a következőnek: @hu
definition: Hozzákapcsol egy ágenst egy forráshoz, amelyhez hozzátartozik egy ágens felelőssége egy kartográfiai forrásért. @hu
label: kartografıdır @tr
definition: Bir temsilciyi, bir kartografik kaynağa ilişkin bir temsilcinin sorumluluğunu içeren bir kaynakla ilişkilendirir. @tr

has cartographic data type
status: Published
type: Property
lexical alias: cartographicDataType.en
definition: Relates a resource to a machine-readable representation of geospatial features.
label: har kartografisk datatype @da
definition: Relaterer en ressource til en maskinlæsbar repræsentation af geospatiale træk. @da
label: heeft cartografisch datatype @nl
sub property of: has digital representation of cartographic content
label: له نوع بيانات خرائطية @ar
definition: يربط بين مصدر وتمثيل مقروء آليًا لملامح جغرافية مكانية. @ar
label: aineiston kartografinen tietotyyppi @fi
definition: Liittää aineiston maantieteellisten ominaisuuksien konelukuiseen esitykseen. @fi
label: hat kartografischen Datentyp @de
definition: Setzt eine Ressource in Beziehung zu einer maschinenlesbaren Darstellung von Geodaten. @de
label: 有地图数据类型 @zh-hans
definition: 将一种资源与地理空间特征的机器可读表现关联起来。 @zh-hans
label: kartográfiai adattípusa a következő: @hu
definition: Hozzákapcsol egy forrást térinformatikai jellemzők géppel olvasható ábrázolásához. @hu
label: kartografik veri türü ile ilişkilidir @tr
definition: Bir kaynağı, jeo-uzamsal özelliklerin makine tarafından okunabilen bir temsiliyle ilişkilendirir. @tr

has caster
status: Published
definition: Relates a resource to an agent who is responsible for creating a resource by pouring a liquid or molten substance into a mold and leaving it to solidify to take the shape of the mold.
type: Property
inverse of: is caster of
lexical alias: caster.en
label: har støber @da
definition: Relaterer en ressource til en agent, der har været involveret i fremstillingen af en ressourcer ved at hælde en væske eller et varmt, flydende stof i en form og lade det størkne, så det har taget facon efter formen. @da
label: heeft gieter @nl
label: aineiston valaja @fi
sub property of: has creator
label: له عامل صب @ar
definition: يربط مصدر بوكيل مسؤول عن إنتاج مصدر بصب مادة سائلة أو مصهورة في قالب وتركها للتصلب لأخذ شكل القالب. @ar
definition: Liittää aineiston toimijaan, joka on vastuussa aineiston valmistamisesta muovaamalla sulatettua tai nestemäistä ainetta muotin avulla. @fi
label: hat Formgießerin/Formgießer @de
definition: Setzt eine Ressource in Beziehung zu einem Akteur, der für die Herstellung einer Ressource verantwortlich ist, indem er eine Flüssigkeit oder eine geschmolzenen Substanz in eine Form gießt, die in der Gießform verbleibt, bis sie ausgehärtet ist. @de
label: 有铸造者 @zh-hans
definition: 将一种资源与通过将液体或融化的物质倒入模具中使其按模具固化成型而对一种资源的创建负责的一个行为者关联起来。 @zh-hans
definition: Relaciona un recurs amb un agent que és resposable de la creació d’un recurs mitjançant l’abocament d’un líquid o una substància fosa en un motlle tot deixant que se solidifiqui perquè prengui la forma del motlle. @ca
label: öntvénykészítője a következő: @hu
definition: Hozzákapcsol egy forrást egy ágenshez, amely felelős egy forrás gyártásáért oly módon, hogy folyékony vagy olvasztott anyagot önt egy öntőformába és hagyja, hogy az megszilárduljon és az öntőforma formáját felvegye. @hu
label: dökümcü ile ilişkilidir @tr
definition: Bir kaynağı, sıvı veya erimiş bir maddeyi bir kalıba dökerek ve kalıbın şeklini alması için katılaşmaya bırakarak bir kaynak oluşturmaktan sorumlu olan bir temsilci ile ilişkilendirir. @tr

is caster of
status: Published
definition: Relates an agent to a resource that involves a responsibility of an agent for pouring a liquid or molten substance into a mold and leaving it to solidify to take the shape of the mold.
type: Property
inverse of: has caster
lexical alias: casterOf.en
label: er støber af @da
definition: Relaterer en agent, der har været involveret i fremstillingen af en ressource ved at hælde en væske eller et varmt, flydende stof i en form og lade det størkne, så det har taget form efter formen til en ressource. @da
label: is gieter van @nl
sub property of: is creator of
label: هو عامل صب لـ @ar
definition: يربط بين وكيل ومصدر ينطوي على مسؤولية وكيل عن صب مادة سائلة أو مصهورة في قالب وتركها للتصلب لأخذ شكل القالب. @ar
label: valaja (toimija) aineistossa @fi
definition: Liittää toimijan aineistoon, jossa toimija vastaa aineiston valmistamisesta muovaamalla sulatettua tai nestemäistä ainetta muotin avulla. @fi
label: ist Formgießerin/Formgießer von @de
definition: Setzt einen Akteur in Beziehung zu einer Ressource, bei der ein Akteur dafür verantwortlich ist, eine Flüssigkeit oder eine geschmolzene Substanz in eine Form zu gießen, die in der Gießform verbleibt, bis sie ausgehärtet ist. @de
label: 是……的铸造者 @zh-hans
definition: 将一个行为者与涉及将液体或融化的物质倒入模具中使其按模具固化成型的一个行为者的责任的一种资源关联起来。 @zh-hans
label: öntvénykészítője a következőnek: @hu
definition: Hozzákapcsol egy ágenst egy forráshoz, amelyhez hozzátartozik az ágens felelőssége folyékony vagy olvasztott anyag öntőformába öntéséért, hogy az ott megszilárduljon és fölvegye az öntőforma formáját. @hu
label: dökümcüsüdür @tr
definition: Bir temsilciyi, bir maddenin bir kalıba sıvı veya erimiş bir maddeyi dökmesi ve kalıbın şeklini alması için katılaşmaya bırakmakla görevli bir temsilcinin sorumluluğunu içeren bir kaynakla ilişkilendirir. @tr

has casting director
status: Published
type: Property
lexical alias: castingDirector.en
definition: Relates a resource to an agent who is responsible for most aspects of assigning parts and duties to performers.
inverse of: is casting director of
sub property of: has other agent associated with a resource (Deprecated)
label: har casting director @da
definition: Relaterer en ressource til en agent ansvarlig for de fleste aspekter af at tildele roller og ansvar til performere. @da
label: heeft castingdirector @nl
label: له مدير لطاقم التمثيل @ar
definition: يربط مصدر بوكيل مسؤول عن معظم الجوانب المتعلقة بأدوار الممثلين ومهامهم. @ar
label: roolittaja aineistossa @fi
definition: Liittää aineiston toimijaan, joka vastaa useimmista esiintyjien roolien ja tehtävien antamiseen kuuluvista tehtävistä. @fi
label: hat Casting Director @de
definition: Setzt eine Ressource in Beziehung zu einem Akteur, der für die meisten Aspekte der Rollenvergabe und Aufgabenzuteilung an Ausführende verantwortlich ist. @de
label: 有角色导演 @zh-hans
definition: 将一种资源与负责给演员分配角色和任务的大多数工作的一个行为者关联起来。 @zh-hans
label: szereposztó rendezője a következő: @hu
definition: Hozzákapcsol egy forrást egy ágenshez, aki felelős a szerepek és feladatok előadókra osztásának legtöbb vonatkozásáért. @hu
label: kast yönetmeni ile ilişkilidir @tr
definition: Bir kaynağı, sanatçılara rol ve görev atamanın çoğu yönünden sorumlu olan bir temsilci ile ilişkilendirir. @tr

is casting director of
status: Published
type: Property
lexical alias: castingDirectorOf.en
definition: Relates an agent to a resource that involves a responsibility of an agent for most aspects of assigning parts and duties to performers.
inverse of: has casting director
sub property of: is creator of
label: er casting director for @da
definition: Relaterer en agent til en ressource, der inkorporerer et bidrag ved ansvar for de fleste aspekter af at tildele roller og opgaver til performere. @da
label: is castingdirector van @nl
label: هو مدير طاقم التمثيل لـ @ar
definition: يربط بين وكيل ومصدر ينطوي على مسؤولية وكيل عن تحديد معظم الجوانب المتعلقة بأدوار الممثلين ومهامهم. @ar
label: roolittaja (toimija) aineistossa @fi
definition: Liittää toimijan aineistoon, jossa toimija vastaa useimmista esiintyjien roolien ja tehtävien antamiseen kuuluvista tehtävistä. @fi
label: ist Casting Director von @de
definition: Setzt einen Akteur in Beziehung zu einer Ressource, bei der ein Akteur für die meisten Aspekte der Rollenvergabe und Aufgabenzuteilung an Ausführende verantwortlich ist. @de
label: 是……的角色导演 @zh-hans
definition: 将一个行为者与涉及给演员分配角色和任务的大多数工作的一个行为者的责任的一种资源关联起来。 @zh-hans
label: szereposztó rendezője a következőnek: @hu
definition: Hozzákapcsol egy ágenst egy forráshoz, amelyhez hozzátartozik egy ágens felelőssége a szerepek és feladatok előadókra osztásának legtöbb vonatkozásáért. @hu
label: cast yönetmenidir @tr
definition: Bir temsilciyi, performans gösterenlere parça ve görev atamanın çoğu yönünden sorumlu bir temsilcinin sorumluluğunu içeren bir kaynakla ilişkilendirir. @tr

has catalogue
status: Published
definition: Relates a resource to a resource that is a metadata description set for the resources that are held by a collection resource.
type: Property
inverse of: is catalogue of
lexical alias: catalogue.en
label: er katalog @da
definition: Relaterer en ressource til en ressource, der består af en komplet fortegnelse over ressourcer, der er arrangeret systematisk. @da
sub property of: has finding aid
label: heeft catalogus @nl
label: kokoelmaluettelo @fi
label: له فِهرِس @ar
definition: يربط بين مصدر ومصدر يتكون من حصر كامل لمصادر مرتبة بشكل منهجي. @ar
definition: Liittää aineiston aineistoon, joka on kokoelma-aineistoon kuuluvan aineiston metatietokokonaisuus. @fi
label: hat Katalog @de
definition: Setzt eine Ressource in Beziehung zu einer Ressource, die aus einer vollständigen Aufzählung von Ressourcen besteht, die systematisch angeordnet sind. @de
label: 有目录 @zh-hans
definition: 将一种资源与作为一种收藏资源所收入的各种资源的元数据描述集合的一种资源关联起来。 @zh-hans
definition: Relaciona un recurs amb un recurs que és un conjunt de descripció de metadades per als recursos que s’apleguen en un recurs de col·lecció de recursos. @ca
label: katalógusa a következő: @hu
definition: Hozzákapcsol egy forrást egy forráshoz, amely szisztematikusan elrendezett források teljes felsorolásából áll. @hu
label: katalog ile ilişkilidir @tr
definition: Bir kaynağı, bir koleksiyon kaynağı tarafından sahip olunan kaynaklar için bir üstveri seti olan kaynakla ilişkilendirir. @tr

is catalogue of
status: Published
definition: Relates a resource to a resource that is a collection resource that has a metadata description set for the resources that it holds.
type: Property
inverse of: has catalogue
lexical alias: catalogueOf.en
label: er katalog over @da
definition: Relaterer en ressource til en ressource, der er anvendt som grundlag for en katalog, dvs. en komplet fortegnelse over eksemplarer, der er arrangeret systematisk. @da
sub property of: is finding aid of
label: is catalogus van @nl
label: kokoelmaluettelo aineistoista @fi
label: هو فهرس لـ @ar
definition: يربط بين مصدر ومصدر يُستخدم كأساس لحصر كامل للمصادر المرتبة بشكل منهجي. @ar
definition: Liittää aineiston kokoelma-aineistoon, johon sisältyvistä aineistoista on metatietokokonaisuus. @fi
label: ist Katalog von @de
definition: Setzt eine Ressource in Beziehung zu einer Ressource, die als Grundlage für eine vollständige Aufzählung von systematisch angeordneten Ressourcen verwendet wird. @de
label: 是……的目录 @zh-hans
definition: 将一种资源与作为一种收藏资源并有所收入的各种资源的元数据描述集合的一种资源关联起来。 @zh-hans
definition: Relaciona un recurs amb un recurs d’un recurs de col·lecció de recursos que té un conjunt de descripció de metadades per als recursos que aplega. @ca
label: katalógusa a következőnek: @hu
definition: Hozzákapcsol egy forrást egy forráshoz, amelyet alapként használnak szisztematikusan elrendezett források teljes felsorolásához. @hu
label: kataloğudur @tr
definition: Bir kaynağı, sahip olduğu kaynaklar için bir üstveri setine sahip bir koleksiyon kaynağı olan bir kaynakla ile ilişkilendirir. @tr

has category of agent
status: Published
definition: Relates an agent to a type to which an agent belongs.
type: Property
lexical alias: categoryOfAgent.en
label: har type af agent @da
definition: Relaterer en ressource til en kategorisering eller almindelig beskrivelse på en type af agent. @da
alternative label: type of agent
label: heeft categorie van actor @nl
label: toimijan kategoria @fi
alternative label: toimijan tyyppi @fi
label: له فئة لوكيل @ar
definition: يربط بين وكيل والنوع الذي ينتمي إليه وكيل. @ar
alternative label: نوع الوكيل @ar
definition: Liittää toimijan tyyppiin tai jaotteluun, johon toimija kuuluu. @fi
label: hat Kategorie eines Akteurs @de
definition: Setzt einen Akteur in Beziehung zu einer Art, zu der ein Akteur gehört. @de
alternative label: 行为者的类型 @zh-hans
label: 有行为者的类别 @zh-hans
definition: 将一个行为者与一个行为者所属于的一个类型关联起来。 @zh-hans
alternative label: ágenstípus @hu
label: ágens kategóriája a következő: @hu
definition: Hozzákapcsol egy ágenst ahhoz a típushoz, amelyhez az ágens tartozik. @hu
alternative label: temsilcinin türü @tr
label: temsilcinin kategorisi ile ilişkilidir @tr
definition: Bir temsilciyi, temsilcinin ait olduğu bir tür ilişkilendirir. @tr

has category of entity
status: Published
type: Property
lexical alias: categoryOfEntity.en
definition: Relates an entity to a type to which an entity belongs.
label: heeft categorie van entiteit @nl
label: له فئة لكيان @ar
definition: يربط بين كيان ونوع ينتمي إليه كيان. @ar
label: har kategori af entitet @da
definition: Relaterer en entitet til en type som en entitet tilhører. @da
label: entiteetin kategoria @fi
definition: Liittää entiteetin tyyppiin tai jaotteluun, johon entiteetti kuuluu. @fi
label: hat Kategorie einer Entität @de
definition: Setzt eine Entität in Beziehung zu einer Art, zu der eine Entität gehört. @de
label: 有实体的类别 @zh-hans
definition: 将一个实体与一个实体所属于的类型关联起来。 @zh-hans
label: entitás kategóriája a következő: @hu
definition: Hozzákapcsol egy entitást ahhoz a típushoz, amelyhez az entitás tartozik. @hu
has subproperty: has category of resource
label: varlığın kategorisi ile ilişkilidir @tr
definition: Bir varlığı, varlığın ait olduğu tür ile ilişkilendirir @tr

has category of resource
status: Published
definition: Relates a resource to a type to which a resource belongs.
type: Property
lexical alias: categoryOfResource.en
label: har ressources art eller form @da
definition: Relaterer en ressource til en art, form eller genre, som en ressource tilhører. @da
alternative label: has form of resource
sub property of: has category of entity
label: heeft categorie van resource @nl
label: له فئة لمصدر @ar
definition: يربط بين مصدر ونوع ينتمي إليه مصدر. @ar
alternative label: له شكل لمصدر @ar
alternative label: har form af ressource @da
label: aineiston kategoria @fi
definition: Liittää aineiston aineistolajiin, johon aineisto kuuluu. @fi
alternative label: aineiston muoto @fi
label: hat Kategorie einer Ressource @de
definition: Setzt eine Ressource in Beziehung zu einer Art, zu der eine Ressource gehört. @de
alternative label: hat Form einer Ressource @de
alternative label: 有资源的形式 @zh-hans
label: 有资源的类别 @zh-hans
definition: 将一种资源与一种资源所属于的一个类型关联起来。 @zh-hans
alternative label: forrás formája a következő: @hu
label: forrás kategóriája a következő: @hu
definition: Hozzákapcsol egy forrást ahhoz a típushoz, amelyhez a forrás tartozik. @hu
alternative label: kaynak biçimi ile ilişkilidir @tr
label: kaynağın kategorisi ile ilişkilidir @tr
definition: Bir kaynağı, kaynağın ait olduğu bir türle ilişkilendirir. @tr

has censor
status: Published
type: Property
lexical alias: censor.en
definition: Relates a resource to an agent who contributes to a resource by revising the content of another resource for the purpose of suppressing content deemed objectionable on moral, political, military, or other grounds, but leaving the nature and general content substantially unchanged.
inverse of: is censor of
scope note: Substantial modification that results in the creation of a new resource is excluded.
sub property of: has contributor (Deprecated)
see also: has author
label: har censor @da
definition: Relaterer en ressource til en agent, der bidrager til en ressource ved at revidere indholdet med henblik på at undertrykke dele, der anses for at være moralsk, politisk, militært eller af anden årsag stødende, men som i alt væsentligt lader originalværkets karakter og indhold være uændret. @da
scope note: Væsentlige ændringer, der resulterer i skabelsen af et nyt værk er ikke omfattet. @da
label: heeft censor @nl
label: له رقيب من طرف الرقابة @ar
definition: يربط مصدر بوكيل يُساهم في مصدر من خلال مراجعة محتوى بغرض حذف المحتوى الذي قد يُرفض لأسباب أخلاقية أو سياسية أو عسكرية أو لاعتبارت أخرى، دون إحداث تغيير جوهري في طابعه العام أو في مضمونه. @ar
scope note: يُستبعد إجراء تعديل جوهري ينتج عنه إنشاء مصدر جديد. @ar
label: sensori (toimija) aineistossa @fi
definition: Liittää aineiston toimijaan, joka tarkastaa aineiston sisältöä kiistanalaisen sisällön salaamiseksi moraalisin, poliittisin, sotilaallisin tai muin perustein, mutta jättäen alkuperäisen teoksen luonteen ja yleisen sisällön olennaisilta osiltaan muuttumattomaksi. @fi
scope note: Ei koske oleellista muokkausta, joka johtaa uuden aineiston luomiseen. @fi
label: hat Zensorin/Zensor @de
definition: Setzt eine Ressource in Beziehung zu einem Akteur, der zu einer Ressource beiträgt, indem er den Inhalt überarbeitet, um Teile zu unterdrücken, die aus moralischen, politischen, militärischen oder anderen Gründen unerwünscht sind, ohne den Charakter und den Inhalt substantiell zu verändern. @de
scope note: Darunter fallen keine substantiellen Veränderungen, die zur Schaffung einer neuen Ressource führen. @de
label: 有审查者 @zh-hans
definition: 将一种资源与通过修订另一种资源的内容以禁止视为不符合道德、政治、军事或其他背景的内容但却保持性质和总体内容不变而对一种资源有贡献的一个行为者关联起来。 @zh-hans
scope note: 不包括导致一种新资源创作的实质性修改。 @zh-hans
definition: Relaciona un recurs amb un agent que contribueix a un recurs revisant el contingut d’un altre recurs amb el propòsit de suprimir el contingut considerat objectable per motius ètics, polítics, militars o altres motius, però deixant la natura i el contingut general sense canvis substancials. @ca
label: cenzora a következő: @hu
definition: Hozzákapcsol egy forrást egy ágenshez, amely hozzájárul egy forráshoz azzal, hogy a tartalmat felülvizsgálja morális, politikai, katonai vagy egyéb alapon kifogásolható részek kiküszöbölése céljából, ugyanakkor a jellegzetességeket és a tartalmat lényegében változatlanul hagyja. @hu
scope note: Nem tartoznak ide az egy új forrás létrehozását eredményező lényegi változtatások. @hu
label: sansür ile ilişkilidir @tr
definition: Bir kaynağı, ahlaki, politik, askeri veya diğer gerekçelerle sakıncalı görülen kısımları bastırmak amacıyla içeriği revize ederek, ancak niteliğini ve içeriğini büyük ölçüde değiştirmeden bırakarak bir kaynağa katkıda bulunan bir temsilci ile ilişkilendirir. @tr
scope note: Yeni bir kaynağın oluşturulmasıyla sonuçlanan önemli değişiklikler hariç tutulur. @tr

is censor of
status: Published
type: Property
lexical alias: censorOf.en
definition: Relates an agent to a resource that includes a contribution for revising the content for the purpose of suppressing parts deemed objectionable on moral, political, military, or other grounds, but leaving the nature and content substantially unchanged.
inverse of: has censor
scope note: Substantial modification that results in the creation of a new resource is excluded.
sub property of: is contributor of (Deprecated)
see also: is author of
label: er censor i @da
definition: Relaterer en agent, der har bidraget til en ressource ved at revidere indholdet med henblik på at undertrykke dele, der anses for at være moralsk, politisk, militært eller af anden årsag stødende, men som i alt væsentligt har ladt det oprindelige værks karakter og indhold være uændret til en ressource @da
scope note: Væsentlige ændringer, der resulterer i skabelsen af et nyt værk er ikke omfattet. @da
label: is censor van @nl
label: هو رقيب من طرف الرقابة لـ @ar
definition: يربط بين وكيل ومصدر يتضمن المُساهمة في مراجعة محتوى بغرض حذف المحتوى الذي قد يُرفض لأسباب أخلاقية أو سياسية أو عسكرية أو لاعتبارت أخرى، دون إحداث تغيير جوهري في طابعه العام أو في مضمونه. @ar
scope note: يُستبعد إجراء تعديل جوهري ينتج عنه إنشاء مصدر جديد. @ar
label: sensori (toimija) aineistossa @fi
definition: Liittää toimijan aineistoon, jossa toimija tarkastaa aineiston sisältöä kiistanalaisen sisällön salaamiseksi moraalisin, poliittisin, sotilaallisin tai muin perustein, mutta jättäen alkuperäisen teoksen luonteen ja yleisen sisällön olennaisilta osiltaan muuttumattomaksi. @fi
scope note: Ei koske oleellista muokkausta, joka johtaa uuden aineiston luomiseen. @fi
label: ist Zensorin/Zensor von @de
definition: Setzt einen Akteur in Beziehung zu einer Ressource, zu der ein Akteur beiträgt, indem er den Inhalt überarbeitet, um Teile zu unterdrücken, die aus moralischen, politischen, militärischen oder anderen Gründen unerwünscht sind, ohne den Charakter und den Inhalt substantiell zu verändern. @de
scope note: Darunter fallen keine substantiellen Veränderungen, die zur Schaffung einer neuen Ressource führen. @de
label: 是……的审查者 @zh-hans
definition: 将一个行为者与包括修订内容以禁止视为不符合道德、政治、军事或其他背景的内容但却保持性质和总体内容不变的一个行为者的贡献的资源关联起来。 @zh-hans
scope note: 不包括导致一种新资源创作的实质性修改。 @zh-hans
label: cenzora a következőnek: @hu
definition: Hozzákapcsol egy ágenst egy forráshoz, amely magában foglalja az ágens közreműködését egy másik forrás tartalmának a felülvizsgálatában, morális, politikai, katonai vagy egyéb alapon kifogásolható részek kiküszöbölése céljából, ugyanakkor a jellegzetességeket és a tartalmat lényegében változatlanul hagyja. @hu
scope note: Nem tartoznak ide az egy új forrás létrehozását eredményező lényegi változtatások. @hu
label: sansürcüsüdür @tr
definition: Bir temsilciyi, ahlaki, politik, askeri veya diğer gerekçelerle sakıncalı görülen kısımları bastırmak amacıyla içeriği revize etmeye yönelik bir katkı içeren, ancak niteliğini ve içeriğini büyük ölçüde değiştirmeden bırakan bir kaynakla ilişkilendirir. @tr
scope note: Yeni bir kaynağın oluşturulmasıyla sonuçlanan önemli değişiklikler hariç tutulur. @tr

has chief executive
status: Published
type: Property
lexical alias: chiefExecutive.en
definition: Relates an agent to an officer who is a top ranking official of an agent.
inverse of: is chief executive of
sub property of: has officer
label: har virksomhedsleder @da
definition: Relaterer en agent til en embedsmand, der har den højeste stilling i en agent. @da
label: heeft directeur @nl
label: له رئيس تنفيذي @ar
definition: يربط بين وكيل ومسؤول رفيع المستوى لدى وكيل. @ar
label: pääjohtaja (toimija) @fi
definition: Liittää yhteistoimijan toimijan toimihenkilöön, joka kuuluu yhteisön ylimpiin viranhaltijoihin. @fi
label: hat Geschäftsführerin/Geschäftsführer @de
definition: Setzt einen Akteur in Beziehung zu einer leitenden Angestellten/einem leitenden Angestellten, die/der das höchste Amt innehat. @de
label: 有总裁 @zh-hans
definition: 将一个行为者与作为一个行为者顶级官员的一个任职者关联起来。 @zh-hans
label: felsővezetője a következő: @hu
definition: Hozzákapcsol egy ágenst egy tisztviselőhöz, aki egy ágens rangidős tisztviselője. @hu
label: genel müdür ile ilişkilidir @tr
definition: Bir temsilciyi, bir temsilcinin en üst düzey yetkilisi olan bir memurla ilişkilendirir. @tr

is chief executive of
status: Published
type: Property
lexical alias: chiefExecutiveOf.en
definition: Relates an agent to an agent in which an officer is a top ranking official.
inverse of: has chief executive
sub property of: is officer of
label: er virksomhedsleder for @da
definition: Relaterer en agent til en agent, hvor en embedsmand har den højeste stilling. @da
label: is directeur van @nl
label: هو رئيس تنفيذي لـ @ar
definition: يربط بين وكيل ووكيل يكون فيه المسؤول رفيع المستوى. @ar
label: pääjohtaja (toimija) @fi
definition: Liittää toimijan yhteistoimijaan, jossa toimija kuuluu ylimpiin viranhaltijoihin. @fi
label: ist Geschäftsführerin/Geschäftsführer von @de
definition: Setzt einen Akteur in Beziehung zu einem Akteur, bei dem eine leitende Angestellte/ein leitender Angestellter das höchste Amt innehat. @de
label: 是……的总裁 @zh-hans
definition: 将一个行为者与一个任职者在其中任顶级官员的一个行为者关联起来。 @zh-hans
label: felsővezetője a következőnek: @hu
definition: Hozzákapcsol egy ágenst egy ágenshez, amelyben a tisztviselő a rangidős. @hu
label: genel müdürüdür @tr
definition: Bir temsilciyi, bir temsilcinin üst düzey bir memur olduğu bir temsilci ile ilişkindir. @tr

has choral conductor
status: Published
type: Property
lexical alias: choralConductor.en
definition: Relates a resource to an agent who contributes to a resource by leading a choral performing group in a musical or dramatic presentation.
inverse of: is choral conductor of
sub property of: has conductor
label: har kordirigent @da
definition: Relaterer en ressource til en dirigent, der har bidraget til en musikressource ved at lede et optrædende kor i en musikalsk eller dramatisk præsentation etc. @da
label: heeft koordirigent @nl
label: له مايِسترو كورالي @ar
definition: يربط بين مصدر ومايِسترو يُساهم في مصدر موسيقي من خلال قيادة فريق كورال في عرض موسيقي أو درامي. @ar
label: kuoronjohtaja @fi
definition: Liittää aineiston toimijaan, joka on osallisena aineistossa johtamalla kuoroa musiikki- tai näytelmäesityksessä. @fi
label: hat Chorleiterin/Chorleiter @de
definition: Setzt eine Ressource in Beziehung zu einer Dirigentin/einem Dirigenten, die/der zu einer musikalischen Ressource beiträgt, indem sie/er einen Chor in einer musikalischen oder dramatischen Darbietung leitet. @de
label: 有合唱指挥 @zh-hans
definition: 将一种资源与通过在音乐或戏剧呈现中领导一个合唱表演团体而对一种资源作出贡献的一个行为者关联起来。 @zh-hans
definition: Relaciona un recurs amb un agent que contribueix a una expressió dirigint una coral en una representació musical o dramàtica. @ca
label: kórusvezetője a következő: @hu
definition: Hozzákapcsol egy forrást egy karmesterhez, amely hozzájárul egy zenei forráshoz azzal, hogy énekkari előadói csoportot vezet egy zenei vagy drámai bemutatóban. @hu
label: koro şefi ile ilişkilidir @tr
definition: Bir kaynağı, müzikal veya dramatik bir sunumda bir koro icra eden gruba liderlik ederek müzikal bir kaynağa katkıda bulunan bir orkestra şefiyle ilişkilendirir. @tr

is choral conductor of
status: Published
type: Property
lexical alias: choralConductorOf.en
definition: Relates an agent to a musical resource that includes a contribution by an agent of leading a choral performing group in a musical or dramatic presentation.
inverse of: has choral conductor
sub property of: is conductor of
label: er kordirigent i @da
definition: Relaterer en dirigent, der har bidraget til en musikressource ved at lede et optrædende kor i en musikalsk eller dramatisk præsentation etc. til en ressource. @da
label: is koordirigent van @nl
label: هو مايِسترو كورالي لـ @ar
definition: يربط بين وكيل ومصدر موسيقي يتضمن إسهام وكيل في قيادة فريق كورال في عرض موسيقي أو درامي. @ar
label: kuoronjohtaja (toimija) aineistossa @fi
definition: Liittää toimijan aineistoon, jossa toimija on osallisena johtamalla kuoroa musiikki- tai näytelmäesityksessä. @fi
label: ist Chorleiterin/Chorleiter von @de
definition: Setzt einen Akteur in Beziehung zu einer musikalischen Ressource, zu der ein Akteur beiträgt, indem er einen Chor in einer musikalischen oder dramatischen Darbietung leitet. @de
label: 是……的合唱指挥 @zh-hans
definition: 将一个行为者与包括在音乐或戏剧呈现中领导一个合唱表演团体的一个行为者的贡献的一种音乐资源关联起来。 @zh-hans
label: kórusvezetője a következőnek: @hu
definition: Hozzákapcsol egy ágenst egy zenei forráshoz, amely magában foglalja egy zenei vagy drámai bemutatóban énekkari előadó csoportot vezető ágens közreműködését. @hu
label: koro şefidir @tr
definition: Bir temsilciyi, müzikal veya dramatik bir sunumda bir koro performans grubuna liderlik eden bir temsilcinin katkısını içeren bir müzik kaynağıyla ilişkilendirir. @tr

has choreographer
status: Published
definition: Relates a resource to an agent who is responsible for creating a choreographic resource.
type: Property
sub property of: has creator
inverse of: is choreographer of
lexical alias: choreographer.en
label: har koreograf @da
definition: Relaterer en ressource til en agent, der er ansvarlig for at have skabt en ressource bestående af bevægelser. @da
label: heeft choreograaf @nl
label: aineiston koreografi @fi
label: له مصمم رقصات @ar
definition: يربط مصدر بوكيل مسؤول عن مصدر لتصميم الرقصات. @ar
definition: Liittää aineiston toimijaan, joka vastaa koreografisesta aineistosta. @fi
label: hat Choreografin/Choreograf @de
definition: Setzt eine Ressource in Beziehung zu einem Akteur, der für eine choreografische Ressource verantwortlich ist. @de
label: 有编舞者 @zh-hans
definition: 将一种资源与负责创建一种编舞资源的一个行为者关联起来。 @zh-hans
definition: Relaciona un recurs amb un agent que és responsable de la creació d’una obra coreogràfica. @ca
label: koreográfusa a következő: @hu
definition: Hozzákapcsol egy forrást egy ágenshez, amely felelős egy koreográfiai forrás megalkotásáért. @hu
label: koreograf ile ilişkilidir @tr
definition: Bir kaynağı, koreografik bir kaynaktan sorumlu olan bir temsilci ile ilişkilendirir. @tr

is choreographer of
status: Published
definition: Relates an agent to a choreographic resource that involves a responsibility of an agent for choreography.
type: Property
sub property of: is creator of
inverse of: has choreographer
lexical alias: choreographerOf.en
label: er koreograf til @da
definition: Relaterer en agent, der er ansvarlig for at have skabt en ressource af bevægelser til en ressource. @da
label: is choreograaf van @nl
label: هو مصمم رقصات لـ @ar
definition: يربط بين وكيل ومصدر رقص ينطوي على مسؤولية وكيل عن تصميم الرقصات. @ar
label: koreografi (toimija) aineistossa @fi
definition: Liittää toimijan aineistoon, jossa toimija vastaa koreografisesta aineistosta. @fi
label: ist Choreografin/Choreograf von @de
definition: Setzt einen Akteur in Beziehung zu einer choreografischen Ressource, bei der ein Akteur für die Choreografie verantwortlich ist. @de
label: 是……的编舞者 @zh-hans
definition: 将一个行为者与涉及一个行为者的编舞责任的一种编舞资源关联起来。 @zh-hans
label: koreográfusa a következőnek: @hu
definition: Hozzákapcsol egy ágenst egy koreografikus forráshoz, amelyhez hozzátartozik egy ágens felelőssége a koreográfiáért. @hu
label: koreografıdır @tr
definition: Bir temsilciyi, koreografi için bir temsilcinin sorumluluğunu içeren bir koreografik kaynak ile ilişkilendirir @tr

is choreographic adaptation of
status: Published
definition: Relates a resource to a resource that is adapted as a choreographic resource.
type: Property
sub property of: has source
inverse of: is adapted as choreography
lexical alias: choreographicAdaptationOf.en
label: er koreografisk bearbejdelse af @da
definition: Relaterer en ressource til en ressource, der er blevet bearbejdet til en ressource, der består af bevægelse. @da
label: is choreografische bewerking van @nl
label: koreografinen sovitus aineistosta @fi
label: هو اقتباس راقص لـ @ar
definition: يربط بين مصدر ومصدر تم تحويره كعمل راقص. @ar
definition: Liittää aineiston koreografiseksi aineistoksi sovitettuun aineistoon. @fi
label: ist choreografische Bearbeitung von @de
definition: Setzt eine Ressource in Beziehung zu einer Ressource, die als choreografische Ressource bearbeitet ist. @de
label: 是……的编舞改编 @zh-hans
definition: 将一种资源与被改编为一种编舞资源的一种资源关联起来。 @zh-hans
label: koreografikus feldolgozása a következőnek: @hu
definition: Hozzákapcsol egy forrást egy forráshoz, amelyet koreografikus forrásként adaptáltak. @hu
label: koreografik uyarlamasıdır @tr
definition: Bir kaynağı, koreografik kaynak olarak uyarlanmış bir kaynakla ilişkilendirir. @tr

has choreography
status: Published
type: Property
lexical alias: choreography.en
definition: Relates a resource to a resource that is a choreographic resource that complements a resource.
inverse of: is choreography for
sub property of: is complemented by
label: er koregorafi @da
definition: Relaterer en ressource til en ressource, der giver koreografien til brug i en relateret ressource. @da
label: heeft choreografie @nl
label: له فن تصميم الرقصات @ar
definition: يربط بين مصدر ومصدر يُمثل مصدر تصميم الرقصات. @ar
label: koreografia-aineisto @fi
definition: Liittää aineiston aineistoon, joka on koreografinen aineisto. @fi
label: hat Choreografie @de
definition: Setzt eine Ressource in Beziehung zu einer choreografischen Ressource. @de
label: 有编舞 @zh-hans
definition: 将一种资源与作为一种编舞资源并补充一种资源的一种资源关联起来。 @zh-hans
definition: Relaciona un recurs amb un recurs que és un recurs coreogràfic que complementa un recurs. @ca
label: koreográfiája a következő: @hu
definition: Hozzákapcsol egy forrást egy koreografikus forráshoz. @hu
label: koreografi ile ilişkilidir @tr
definition: Bir kaynağı koreografik bir kaynak olan bir kaynakla ilişkilendirir. @tr

is choreography for
status: Published
type: Property
lexical alias: choreographyFor.en
definition: Relates a resource to a resource that is complemented by a choreographic resource.
inverse of: has choreography
sub property of: is complemented by
label: er koreografi til @da
definition: Relaterer en ressource til en ressource, der anvender en relateret ressources koreografi. @da
label: is choreografie voor @nl
label: هو فن تصميم الرقصات لـ @ar
definition: يربط بين مصدر ومصدر يُكمله مصدر تصميم الرقصات. @ar
label: koreografia aineistoon @fi
definition: Liittää aineiston koreografisella aineistolla täydennettyn aineistoon. @fi
label: ist Choreografie für @de
definition: Setzt eine Ressource in Beziehung zu einer Ressource, die durch eine choreografische Ressource vervollständigt wird. @de
label: 是用于……的编舞 @zh-hans
definition: 将一种资源与被一种编舞资源补充的一种资源关联起来。 @zh-hans
label: koreográfia a következőhöz: @hu
definition: Hozzákapcsol egy forrást egy forráshoz, amelyet egy koreografikus forrás egészít ki. @hu
label: koreografisidir @tr
definition: Bir kaynağı, koreografik bir kaynakla tamamlanan bir kaynakla ilişkilendirir. @tr

has civil defendant
status: Published
lexical alias: civilDefendant.en
definition: Relates a resource to an agent who is sued in a civil proceeding.
type: Property
sub property of: has defendant
label: heeft burgerlijke verweerder @nl
label: له مُدَّعَى عليه مدنيًا @ar
definition: يربط مصدر بوكيل رُفعت ضده دعوى مدنية. @ar
label: har civilretligt sagsøgt @da
definition: Relaterer en ressource til en agent, som er sagsøgt i en civilretlig sag. @da
label: vastaaja siviilioikeudessa @fi
definition: Liittää aineiston toimijaan, joka on syytettynä siviilioikeusprosessissa. @fi
label: hat Beklagte/Beklagten in einem Zivilverfahren @de
definition: Setzt eine Ressource in Beziehung zu einem Akteur, der in einem Zivilverfahren verklagt wird. @de
label: 有民事被告 @zh-hans
definition: 将一种资源与在一项民事诉讼中被指控的一个行为者关联起来。 @zh-hans
label: polgári eljárás vádlottja a következő: @hu
definition: Hozzákapcsol egy forrást egy ágenshez, akit egy polgári eljárásban perbe fognak. @hu
label: sivil davalı ile ilişkilidir @tr
definition: Bir kaynağı, bir hukuk davasında dava edilen temsilci ile ilişkilendirir. @tr

is civil defendant of
status: Published
lexical alias: civilDefendantOf.en
definition: Relates an agent to a resource that involves a responsibility of an agent for being sued in a civil proceeding.
type: Property
sub property of: is defendant of
inverse of: has civil defendant
label: is burgerlijke verweerder van @nl
label: هو مُدَّعَى عليه مدنيًا لـ @ar
definition: يربط بين وكيل ومصدر ينطوي على مسؤولية وكيل عن مقاضاته في دعوى مدنية. @ar
label: er civilretligt sagsøgt af @da
definition: Relaterer en agent til en ressource, som involverer et agentansvar af at være sagsøgt i en civilretlig sag. @da
label: toimija vastaajana siviilioikeudessa @fi
definition: Liittää toimijan aineistoon, johon liittyy toimijan asema siviilioikeusprosessin syytettynä. @fi
label: ist Beklagte/Beklagter in einem Zivilverfahren von @de
definition: Setzt einen Akteur in Beziehung zu einer Ressource, die mit einer Verantwortung verbunden ist, als Akteur in einem Zivilverfahren verklagt zu werden. @de
label: 是……的民事被告 @zh-hans
definition: 将一个行为者与涉及在一项民事诉讼中被控告的一个行为者的责任的一种资源关联起来。 @zh-hans
label: polgári eljárás alperese a következőnek: @hu
definition: Hozzákapcsol egy ágenst egy forráshoz, amelyhez hozzátartozik annak felelőssége, hogy egy ágenst egy polgári jogi eljárásban beperelnek. @hu
label: hukuki davalısıdır @tr
definition: Bir temsilciyi, bir hukuk davasında dava edilmeye ilişkin bir temsilcinin sorumluluğunu içeren bir kaynakla ilişkilendirir. @tr

has colleague
status: Published
type: Property
lexical alias: colleague.en
definition: Relates an agent to an agent who is a fellow member of a profession, staff, or academic faculty.
sub property of: has related agent of agent
label: har kollega @da
definition: Relaterer en agent til en medlem af samme profession, personale, eller akademisk fakultet. @da
label: heeft collega @nl
label: له زميل @ar
definition: يربط بين وكيل وزميل عضو في مهنة، في هيئة تدريس، أو في كلية أكاديمية. @ar
label: kollega (toimija) @fi
definition: Liittää toimijan toimijaan, joka on saman ammattikunnan, henkilöstön tai tieteenalan jäsen. @fi
label: hat Kollegin/Kollegen @de
definition: Setzt einen Akteur in Beziehung zu jemandem der mit anderen zusammen im gleichen Beruf, im gleichen Betrieb, in der gleichen Einrichtung oder Organisation und so weiter tätig ist. @de
label: 有同事 @zh-hans
definition: 将一个行为者与作为从业、行政或教学的同事的一个行为者关联起来 @zh-hans
definition: Relaciona un agent amb un agent que és un company de professió, del personal o del professorat acadèmic. @ca
label: kollégája a következő: @hu
definition: Hozzákapcsol egy ágenst ugyanannak a szakmának, személyzetnek vagy felsőoktatási karnak a tagjához. @hu
has subproperty: has assistant
has subproperty: is assistant to
has subproperty: has co-worker
has subproperty: has partner
label: meslektaş ile ilişkilidir @tr
definition: Bir temsilciyi bir mesleğin, personelin veya akademik fakültenin bir üyesiyle ilişkilendirir. @tr

has collection registrar
status: Published
definition: Relates a resource to an agent who is responsible for creating an analytic finding aid.
type: Property
inverse of: is collection registrar of
lexical alias: collectionRegistrar.en
label: har samlingsregistrator @da
definition: Relaterer en ressource til en samler der lister eller opstiller ressourcerne i et samlingsRessource, som fx en samling af ressourcer. @da
sub property of: has compiler
label: heeft collectieregistrator @nl
label: kokoelman luetteloija @fi
label: له مسجل مجموعة @ar
definition: يربط بين مصدر وأَمِين معرض يقوم بتسجيل مصادر أو جردها لمجموعة مجمعة من المصادر @ar
definition: Liittää aineiston toimijaan, jossa toimija vastaa metatietoteoksen luomisesta. @fi
label: hat Registrarin/Registrar @de
definition: Setzt eine Ressource in Beziehung zu einer Kuratorin/einem Kurator, die/der Ressourcen in einer aggregierten Ressource verzeichnet oder inventarisiert, wie zum Beispiel eine Sammlung von Ressourcen. @de
label: 有收藏登记者 @zh-hans
definition: 将一种资源与负责创建一种分析查询工具的一个行为者关联起来。 @zh-hans
definition: Relaciona un recurs amb un agent que és responsable de la creació d’un instrument de descripció analític. @ca
label: gyűjtemény-nyilvántartója a következő: @hu
definition: Hozzákapcsol egy forrást egy kurátorhoz, amely felsorol vagy leltárba vesz egy aggregáló forrásba, mint források gyűjteményébe. @hu
label: koleksiyon kayıt görevlisi ile ilişkilidir @tr
definition: Bir kaynağı, analitik rehber bilgisi oluşturmaktan sorumlu olan bir temsilci ile ilişkilendirir. @tr

is collection registrar of
status: Published
definition: Relates an agent to a resource that involves a responsibility of an agent for creating a metadata resource.
type: Property
inverse of: has collection registrar
lexical alias: collectionRegistrarOf.en
label: er samlingsregistrator af @da
definition: Relaterer en kurator der lister eller opstiller ressourcerne i en samlingsressource, som fx en samling af ressourcer til en ressource. @da
sub property of: is compiler of
label: is collectieregistrator van @nl
label: kokoelman luetteloija (toimija) aineistossa @fi
label: هو مسجل مجموعة لــ @ar
definition: يربط بين أَمِين معرض ومصدر مدرج في القائمة أو تم جرده في مصدر تجميعي مثل مجموعة من المصادر. @ar
definition: Liittää aineistoon toimijan, joka vastaa metatietoteoksen luomisesta. @fi
label: ist Registrarin/Registrar von @de
definition: Setzt eine Kuratorin/einen Kurator in Beziehung zu einer Ressource, die als aggregierte Ressource verzeichnet oder inventarisiert wird, wie zum Beispiel eine Sammlung von Ressourcen. @de
label: 是……的收藏登记者 @zh-hans
definition: 将一个行为者与涉及创建一种元数据资源的一个行为者的责任的一种资源关联起来。 @zh-hans
definition: Relaciona un agent amb un recurs que implica una responsabilitat d’un agent de la creació un recurs de metadades. @ca
label: gyűjtemény-nyilvántartója a következőnek: @hu
definition: Hozzákapcsol egy kurátort egy forráshoz, amelyet felsorol vagy leltárba vesz egy aggregáló forrás, mint például források gyűjteményét. @hu
label: koleksiyon kayıt görevlisidir @tr
definition: Bir temsilciyi, üstveri kaynağı oluşturmakla görevli bir temsilcinin sorumluluğunu içeren bir kaynakla ilişkilendirir. @tr

has collector
status: Published
definition: Relates a resource to an agent who is responsible for creating a collection resource by selecting and arranging resources that are other resources.
type: Property
inverse of: is collector of
lexical alias: collector.en
label: har samler @da
definition: Relaterer en ressource til en samler der sammenfører ressourcer fra forskellige kilder, som så bliver arrangeret, beskrevet og katalogiseret som en samling. @da
sub property of: has creator
label: heeft verzamelaar @nl
label: kokoelman muodostaja @fi
label: له جامع @ar
definition: يربط بين مصدر وأَمِين معرض يقوم بجمع مصادر من مصادر مختلفة رُتبت، وُوصفت، وفُهرست كمجموعة. @ar
definition: Liittää aineiston toimijaan, joka vastaa uuden teoksen, kuten bibliografian tai hakemiston luomisesta valitsemalla, järjestämällä, koostamalla ja toimittamalla dataa, informaatiota tms. @fi
label: hat Sammlerin/Sammler @de
definition: Setzt eine Ressource in Beziehung zu einer Kuratorin/einem Kurator, der Ressourcen aus unterschiedlichen Quellen zusammenträgt, die dann als Sammlung geordnet, beschrieben oder katalogisiert werden. @de
label: 有收藏者 @zh-hans
definition: 将一种资源与通过选择和整理作为其他资源的资源而对创建一种收藏资源负责的一个行为者关联起来。 @zh-hans
definition: Relaciona un recurs amb un agent que és responsable de la creació d’un recurs de col·lecció de recursos de recursos que són altres recursos mitjançant la selecció i arranjament. @ca
label: kollektora a következő: @hu
definition: Hozzákapcsol egy forrást egy kurátorhoz, amely különböző forrásokból származó, gyűjteményként rendezett, leírt és katalogizált forrásokat fog össze. @hu
label: koleksiyon oluşturucu ile ilişkilidir @tr
definition: Bir kaynağı, diğer kaynaklar olan kaynakları seçerek ve düzenleyerek bir koleksiyon kaynağı oluşturmaktan sorumlu olan bir temsilci ile ilişkilendirir. @tr

is collector of
status: Published
definition: Relates an agent to a resource that involves a responsibility of an agent for collecting by selecting and arranging resources that are other resources.
type: Property
inverse of: has collector
lexical alias: collectorOf.en
label: er samler af @da
definition: Relaterer en kurator der sammenfører ressourcer fra forskellige kilder, som så bliver arrangeret, beskrevet og katalogiseret som en samling til en ressource. @da
sub property of: is creator of
label: is verzamelaar van @nl
label: aineiston kokoaja (toimija) @fi
label: هو جامع لـ @ar
definition: يربط بين وكيل ومصدر تم تجميعه مع مصادر من مصادر مختلفة رُتبت، وُصفت، وفُهرست كمجموعة. @ar
definition: Liittää toimijan aineistoon, jossa hän vastaa uuden teoksen, kuten bibliografian tai hakemiston luomisesta valitsemalla, järjestämällä, koostamalla ja toimittamalla dataa, informaatiota tms. @fi
label: ist Sammlerin/Sammler von @de
definition: Setzt einen Akteur in Beziehung zu einer Ressource, die von einem Akteur mit Ressourcen aus unterschiedlichen Quellen zusammengetragen wird, die dann als Sammlung geordnet, beschrieben oder katalogisiert werden. @de
label: 是……的收藏者 @zh-hans
definition: 将一个行为者与涉及一个行为者通过选择和整理作为其他资源的资源而对收藏负责的一种资源关联起来。 @zh-hans
definition: Relaciona un agent amb un recurs que implica una responsabilitat d’un agent en la col·lecció de recursos que són altres recursos mitjançant la selecció i arranjament. @ca
label: kollektora a következőnek: @hu
definition: Hozzákapcsol egy ágenst egy forráshoz, amely különböző forrásokból származó, rendezett, leírt és katalogizált források gyűjteménye. @hu
label: koleksiyoncusudur @tr
definition: Bir temsilciyi, diğer kaynaklar olan kaynakları seçerek ve düzenleyerek toplayan bir temsilcinin sorumluluğunu içeren bir kaynakla ilişkilendirir. @tr

has collotyper
status: Published
definition: Relates a resource to an agent who is responsible for creating a resource by preparing a hardened film of gelatin or other colloid that has ink-receptive and ink-repellent surfaces and that is used to make prints using a photomechanical process.
type: Property
inverse of: is collotyper of
lexical alias: collotyper.en
label: har lystrykker @da
definition: Relaterer en ressource til en agent, der har været involveret i fremstillingen af en ressource vha. en fotomekanisk proces, hvorved der er blevet lavet tryk direkte fra et hærdet gelatinelag eller andet kolloid, der har blækmodtagelige og blækafvisende overflader. @da
label: heeft collotype-maker @nl
label: kunnioitettu henkilö aineistossa @fi
sub property of: has printmaker
label: طبّاع صور فوتوغرافية @ar
definition: يربط مصدر بوكيل مسؤول عن إنتاج مصدر من خلال استخدام عمليات ميكانيكية ضوئية لإنتاج المطبوعات مباشرة من فيلم صلد من الجيلاتين أو من غيره من المواد الغروية التي تحتوي على أسطح مستقبلة أو طاردة للحبر. @ar
label: hat Lichtdruckerin/Lichtdrucker @de
definition: Setzt eine Ressource in Beziehung zu einem Akteur, der für die Herstellung einer Ressource verantwortlich ist, indem er ein fotomechanisches Verfahren zur Herstellung von Abzügen direkt von einem gehärteten Film aus Gelatine oder einem anderen Kolloid verwendet, der druckerfarbenaufnehmende und -abweisende Oberflächen aufweist. @de
definition: Liittää aineiston toimijaan, joka osallistuu aineiston luomiseen tekemällä vedoksia suoraan kovettuneelta gelatiinifilmiltä tai muulta materiaalilta, jossa on mustetta imeviä ja hylkiviä pintoja. @fi
label: 有珂罗版制作者 @zh-hans
definition: 将一种资源与通过利用一面吸墨而另一面不吸墨的明胶或其他硬胶片进行影印对一种资源的创建负责的一个行为者关联起来。 @zh-hans
definition: Relaciona un recurs amb un agent que és responsable de la creació d’un recurs mitjançant la preparació d’una pel·lícula endurida de gelatina o d’un altre col·loide que té superfícies que accepten o rebutgen la tinta i que s’usa per fer gravats usant un procés fotomecànic. @ca
label: fénynyomatkészítője a következő: @hu
definition: Hozzákapcsol egy forrást egy ágenshez, amely felelős egy forrás gyártásáért oly módon, hogy fotómechanikai eljárás alkalmazásával nyomtatványokat állít elő közvetlenül olyan zselatin vagy más kolloid megkeményedett filmjéből, amelynek tintafelvevő és tintataszító felülete van. @hu
label: kolotip baskıcı ile ilişkilidir @tr
definition: Bir kaynağı, bir fotomekanik işlem kullanarak baskı yapmak için kullanılan, mürekkep alıcı ve mürekkep itici yüzeylere sahip sertleştirilmiş bir jelatin veya diğer kolloid filmi hazırlayarak bir kaynak oluşturmaktan sorumlu olan bir temsilci ile ilişkilendirir. @tr

is collotyper of
status: Published
definition: Relates an agent to a resource that involves a responsibility of an agent for preparing a hardened film of gelatin or other colloid that has ink-receptive and ink-repellent surfaces and that is used to make prints using a photomechanical process.
type: Property
inverse of: has collotyper
lexical alias: collotyperOf.en
label: er lystrykker af @da
definition: Relaterer en agent, der har været involveret i fremstillingen af en ressource vha. en fotomekanisk proces, hvorved der er blevet lavet tryk direkte fra et hærdet gelatinelag eller andet kolloid, der har blækmodtagelige og blækafvisende overflader til en ressource. @da
label: is lichtdrukker van @nl
sub property of: is printmaker of
label: هو طبّاع صور فوتوغرافية لـ @ar
definition: يربط بين وكيل ومصدر ينطوي على مسؤولية وكيل عن استخدام عمليات ميكانيكية ضوئية لإنتاج المطبوعات مباشرة من فيلم صلد من الجيلاتين أو من غيره من المواد الغروية التي تحتوي على أسطح مستقبلة أو طاردة للحبر. @ar
label: kollotypian valmistaja (toimija) aineistossa @fi
definition: Liittää toimijan aineistoon, jonka valmistamisesta toimija on vastuussa tekemällä vedoksia suoraan kovettuneelta gelatiinifilmiltä tai muulta materiaalilta, jossa on mustetta imeviä ja hylkiviä pintoja. @fi
label: ist Lichtdruckerin/Lichtdrucker von @de
definition: Setzt einen Akteur in Beziehung zu einer Ressource, bei der ein Akteur für die Verwendung eines fotomechanischen Verfahrens zur Herstellung von Abzügen direkt von einem gehärteten Film aus Gelatine oder einem anderen Kolloid, der druckerfarbenaufnehmende und -abweisende Oberflächen aufweist, verantwortlich ist. @de
label: 是……的珂罗版制作者 @zh-hans
definition: 将一个行为者与涉及利用一面吸墨而另一面不吸墨的明胶或其他硬胶片进行影印的一个行为者的责任的一种资源关联起来。 @zh-hans
definition: Relaciona un agent amb un recurs que implica una responsabilitat d’un agent en la preparació d’una pel·lícula endurida de gelatina o d’un altre col·loide que té superfícies que accepten o rebutgen la tinta i que s’usa per fer gravats usant un procés fotomecànic. @ca
label: fénynyomatkészítője a következőnek: @hu
definition: Hozzákapcsol egy ágenst egy forráshoz, amelyhez hozzátartozik az ágens felelőssége nyomtatványok fotómechanikai eljárással történő közvetlen előállításáért, amihez festékfelvevő és festéktaszító felülettel rendelkező zselatin vagy más kolloid megkeményedett filmjét használja. @hu
label: kolotip baskıcısıdır @tr
definition: Bir temsilciyi, fotomekanik işlem kullanarak baskılar yapmak için kullanılan, mürekkep alıcı ve mürekkep itici yüzeylere sahip sertleştirilmiş bir jelatin veya diğer kolloid filmi hazırlamakla görevli bir temsilcinin sorumluluğu içeren bir kaynakla ilişkilendirir @tr

has colour content
status: Published
definition: Relates a resource to an indication of the presence of colour or tone in a resource.
type: Property
lexical alias: colourContent.en
scope note: Black, white, single colour shades of black, single colour tints of white, and single colour tones of gray are considered to be single colours. Colour content applies to a resource with a content type of "cartographic image", "cartographic moving image", "cartographic three-dimensional form", "notated movement", "notated music", "performed movement", "still image", "text", "three-dimensional moving image", "three-dimensional form", or "two-dimensional moving image".
label: har farveindhold @da
definition: Relaterer en ressource til en tilstedeværelse af farve, nuance etc. i en ressources indhold. @da
scope note: Sort, hvid, enkeltfarvede skygger af sort, enkeltfarvede nuancer af hvidt og enkeltfarvede toner af gråt anses for at være enkelte farver. @da
label: heeft kleurcontent @nl
label: له محتوى ملون @ar
definition: يربط بين مصدر ومؤشر وجود اللون أو درجة اللون في مصدر. @ar
scope note: تعتبر الألوان التالية: الأسود، الأبيض، تدرجات أحادية اللون من الأسود، صبغات أحادية اللون من الأبيض، ودرجات أحادية اللون من الرمادي من الألوان الفردية. ينطبق محتوى اللون على مصدر له نوع محتوى من "صورة خرائطية"، "صورة متحركة خرائطية"، "شكل خرائطي ثلاثي الأبعاد"، "حركة مدونة"، "موسيقى مدونة"، "حركة مؤداة"، "صورة ثابتة"، "نص"، "صورة متحركة ثُلاثية الأبعاد"، "شكل ثلاثي الأبعاد"، أو "صورة متحركة ثنائية الأبعاد" @ar
label: aineiston värisisältö @fi
definition: Liittää aineiston aineistoon sisältyvän värin tai sävyn ilmaukseen. @fi
scope note: Musta, valkoinen, yksiväriset mustan sävyt, yksiväriset valkoisen sävyt ja yksiväriset harmaan sävyt lasketaan yksivärisiksi. Värisisältöä sovelletaan aineistoon jonka sisältötyypin arvo on "kartografinen kuva", "kartografinen liikkuva kuva", "kartografinen kolmiulotteinen muoto", "liikenotaatio", "nuottiaineisto", "esitetty liike", "stillkuva", "teksti", " kolmiulotteinen liikkuva kuva", "kolmiulotteinen muoto" tai "kaksiulotteinen liikkuva kuva". @fi
label: hat Farbinhalt @de
definition: Setzt eine Ressource in Beziehung zu einer Angabe über das Vorhandensein von Farbe oder Tönung in einer Ressource. @de
scope note: Schwarz, Weiß, einfarbige Schwarztöne, einfarbige Weißtönungen und einfarbige Grauschattierungen werden als einfarbig angesehen. Farbinhalt gibt es in einer Ressource mit dem Inhaltstyp kartografisches Bild, kartografisches Bewegtbild, kartografische dreidimensionale Form, Bewegtnotation, Noten, aufgeführte Bewegung, unbewegtes Bild, Text, dreidimensionales Bewegtbild, dreidimensionale Form oder zweidimensionales Bewegtbild. @de
label: 有颜色内容 @zh-hans
definition: 将一种资源与一种资源的颜色或色调是否出现的指示关联起来。 @zh-hans
scope note: 黑色、白色、单色黑阴影、单色白色调、单色灰色调都被认为是单色。颜色内容适用于有如下内容类型值的内容表达：“地图图像”、“地图动态图像”、“地图三维形式”、“动作谱”、“乐谱”、“表演动作”、“静止图像”、“文本”、“三维动态图像”、“三维形式”、或“二维动态图像”。 @zh-hans
label: színtartalma a következő: @hu
definition: Hozzákapcsol egy forrást egy forrásban megtestesülő, a hang színét vagy színárnyalatát mutató jelöléshez. @hu
scope note: Alapszíneknek tekinthetők a fekete, a fehér, valamint az alapszínek feketével, fehérrel és szürkével kevert árnyalatai. A színtartalom azon forrásokra vonatkozik, amelyeknek a tartalomtípusa kartográfiai kép, kartográfiai mozgókép, háromdimenziós kartográfiai forma, mozgásírás; zenei lejegyzés, előadott mozgás, állókép, szöveg, háromdimenziós mozgókép, háromdimenziós forma vagy kétdimenziós mozgókép. @hu
label: renk içeriği ile ilişkilidir @tr
definition: Bir kaynağı, bir kaynaktaki renk veya tonun varlığına ilişkin bir gösterge ile ilişkilendirir. @tr
scope note: Siyah, beyaz, siyahın tek renk tonları, beyazın tek renk tonları ve grinin tek renk tonları tek renk olarak kabul edilir. Renk içeriği, "kartografik görüntü", "kartografik hareketli görüntü", "kartografik üç boyutlu form", "notalı hareket", "notalı müzik", "icra edilen hareket", "sabit görüntü", "metin", "üç boyutlu hareketli görüntü", "üç boyutlu form" veya "iki boyutlu hareketli görüntü" içerik türüne sahip bir kaynak için geçerlidir. @tr

has colourist
status: Published
type: Property
lexical alias: colourist.en
definition: Relates a resource to an agent who contributes to a resource by applying colour to drawings, prints, photographs, maps, moving images, or other content.
inverse of: is colourist of
sub property of: has contributor (Deprecated)
label: har farvelægger @da
definition: Relaterer en ressource til en agent, der har bidraget til en ressource ved at farvelægge tegninger, tryk, fotos, kort, levende billeder etc. @da
label: heeft inkleurder @nl
label: له فني تلوين @ar
definition: يربط مصدر بوكيل يُساهم في مصدر من خلال تلوين الرسومات، المطبوعات، الصور الفوتوغرافية، الخرائط، الصور المتحركة، وأي محتوى مرئي آخر. @ar
label: värittäjä aineistossa @fi
definition: Liittää aineiston toimijaan, joka on osallisena aineistossa värittämällä piirustuksia, vedoksia, valokuvia, karttoja, elokuvia tms. @fi
label: hat Koloristin/Kolorist @de
definition: Setzt eine Ressource in Beziehung zu einem Akteur, der zu einer Ressource beiträgt, indem er Farben auf Zeichnungen, Drucke, Fotografien, Karten, Bewegtbilder und so weiter aufbringt. @de
label: 有着色者 @zh-hans
definition: 将一种资源与通过将颜色施加于图画、印刷品、照片、地图、动态图像或其他内容上而对一种资源作出贡献的一个行为者关联起来。 @zh-hans
label: coloristja a következő: @hu
definition: Hozzákapcsol egy forrást egy ágenshez, amely hozzájárul a forráshoz azzal, hogy színt hord fel rajzokra, nyomtatványokra, fényképekre, térképekre, mozgóképekre és más vizuális tartalmakra. @hu
label: renklendirici ile ilişkilidir @tr
definition: Bir kaynağı, çizimlere, baskılara, fotoğraflara, haritalara, hareketli görüntülere veya diğer içeriğe renk uygulayarak kaynağa katkıda bulunan bir temsilci ile ilişkilendirir. @tr

is colourist of
status: Published
type: Property
lexical alias: colouristOf.en
definition: Relates an agent to a resource that includes a contribution by an agent of applying colour to drawings, prints, photographs, maps, moving images, etc.
inverse of: has colourist
sub property of: is contributor of (Deprecated)
label: er farvelægger til @da
definition: Relaterer en agent, der har bidraget til en ressource ved at farvelægge tegninger, tryk, fotos, kort, levende billeder etc. til en ressource. @da
label: is inkleurder van @nl
label: هو فني تلوين لـ @ar
definition: يربط بين وكيل ومصدر يتضمن إسهام وكيل في تلوين الرسومات، المطبوعات، الصور الفوتوغرافية، الخرائط، الصور المتحركة...إلخ. @ar
label: värittäjä (toimija) aineistossa @fi
definition: Liittää toimijan aineistoon, jossa toimija on osallisena värittämällä piirustuksia, vedoksia, valokuvia, karttoja, elokuvia tms. @fi
label: ist Koloristin/Kolorist von @de
definition: Setzt einen Akteur in Beziehung zu einer Ressource, zu der ein Akteur beiträgt, indem er Farben auf Zeichnungen, Drucke, Fotografien, Karten, Bewegtbilder und so weiter aufbringt. @de
label: 是……的着色者 @zh-hans
definition: 将一个行为者与包括将颜色施加于图画、印刷品、照片、地图、动态图像等上的一个行为者的贡献的一种资源关联起来。 @zh-hans
label: coloristja a következőnek: @hu
definition: Hozzákapcsol egy ágenst egy forráshoz, amely magában foglalja az ágens közreműködését szín felhordásában rajzokra, nyomtatványokra, fényképekre, térképekre, mozgóképekre és más vizuális tartalmakra. @hu
label: renklendiricidir @tr
definition: Bir temsilciyi, bir temsilcinin çizimlere, baskılara, fotoğraflara, haritalara, hareketli görüntülere vb. renk uygulayan bir temsilcinin katkısını içeren bir kaynakla ilişkilendirir. @tr

has commemoration
status: Published
type: Property
lexical alias: commemoration.en
definition: Relates a resource to a resource created to commemorate an earlier resource.
inverse of: is commemoration of
sub property of: has referential resource relationship with (Deprecate)
label: har mindemarkering @da
definition: Relaterer en ressource til en ressource, der er skabt for at mindes en tidligere ressource. @da
label: heeft herdenking @nl
label: له إحْياء ذِكْرى أو تكريم @ar
definition: يربط بين مصدر ومصدر تم إنشاؤه للاحتفاء بمصدر سابق. @ar
label: muistoaineisto @fi
definition: Liittää aineiston aineistoon, joka on luotu aiemman aineiston muistoksi. @fi
label: hat Gedenkschrift @de
definition: Setzt eine Ressource in Beziehung zu einer Ressource, die erstellt wurde, um einer früheren Ressource zu gedenken. @de
label: 有纪念 @zh-hans
definition: 将一种资源与被创建以纪念一种较早资源的一种资源关联起来。 @zh-hans
label: megemlékezik róla a következő: @hu
definition: Hozzákapcsol egy forrást egy forráshoz, amelyet egy korábbi forrásra való megemlékezés céljából hoztak létre. @hu
label: anma ile ilişkilidir @tr
definition: Bir kaynağı, daha önceki bir kaynağı anmak için oluşturulan bir kaynakla ilişkilendirir. @tr

is commemoration of
status: Published
type: Property
lexical alias: commemorationOf.en
definition: Relates a resource to a resource commemorated in a later resource.
inverse of: has commemoration
sub property of: has referential resource relationship with (Deprecate)
label: er mindemarkering af @da
definition: Relaterer n ressource til en ressource, der mindes i en senere ressource. @da
label: is herdenking van @nl
label: هو إحْياء ذِكْرى أو تكريم لـ @ar
definition: يربط بين مصدر ومصدر تم الاحتفاء به في عمل لاحق. @ar
label: muistoaineisto @fi
definition: Liittää aineiston aineistoon, jota muistetaan myöhemmässä aineistossa. @fi
label: ist Gedenkschrift für @de
definition: Setzt eine Ressource in Beziehung zu einer Ressource, der durch eine spätere Ressource gedacht wird. @de
label: 是……的纪念 @zh-hans
definition: 将一种资源与被一种较晚资源纪念的一种资源关联起来。 @zh-hans
label: megemlékezés a következőről: @hu
definition: Hozzákapcsol egy forrást egy forráshoz, amelyről egy későbbi forrásban emlékeznek meg. @hu
label: anılmasıdır @tr
definition: Bir kaynağı, daha sonraki bir kaynakta anılan bir kaynakla ilişkilendirir. @tr

is commentary in
status: Published
definition: Relates a resource to a resource that is a set of explanatory or critical notes on a resource
type: Property
sub property of: is described by
inverse of: is commentary on
lexical alias: commentaryIn.en
label: er kommentar i @da
definition: Relaterer en ressource til en ressource, der indeholder et sæt af forklarende eller kritiske noter om en beskreven ressource. @da
label: is commentaar in @nl
label: kommentaari aineistosta @fi
label: هو مُعلق عليه في @ar
definition: يربط بين مصدر ومصدر يحتوي على مجموعة من الملاحظات الشارحة أو الناقدة لمصدر. @ar
definition: Liittää aineiston aineistoon, joka on selittävä tai kriittinen huomautus aineistosta. @fi
label: ist kommentiert in @de
definition: Setzt eine Ressource in Beziehung zu einer Ressource, bei der es sich um eine Reihe von erläuternden oder kritischen Anmerkungen zu einer Ressource handelt. @de
label: 是……中的评注 @zh-hans
definition: 将一种资源与作为关于一种资源的解释性或评论性附注之集合的一种资源关联起来。 @zh-hans
label: kommentálva a következőben: @hu
definition: Hozzákapcsol egy forrást egy forráshoz, amely egy forrás magyarázó vagy kritikai jegyzeteinek a halmaza. @hu
label: yorumdur @tr
definition: Bir kaynağı, kaynakla ilgili açıklayıcı veya eleştirel notlar seti olan bir kaynakla ilişkilendirir @tr

is commentary on
status: Published
definition: Relates a resource to a resource used as a basis for a set of explanatory or critical notes.
type: Property
sub property of: is description of
inverse of: is commentary in
lexical alias: commentaryOn.en
label: er kommentar til @da
definition: Relaterer en ressource til en ressource, der bruges som basis for et sæt af forklarende eller kritiske kommentarer. @da
label: is commentaar op @nl
label: kommentaari aineistosta @fi
label: هو تعليق على @ar
definition: يربط بين مصدر ومصدر يُستخدم كأساس لمجموعة من الملاحظات التفسيرية أو النقدية. @ar
definition: Liittää aineiston selittävien tai kritisoivien huomautusten perustana käytettyyn aineistoon. @fi
label: ist Kommentar zu @de
definition: Setzt eine Ressource in Beziehung zu einer Ressource, die als Grundlage für eine Reihe von erläuternden oder kritischen Anmerkungen verwendet wird. @de
label: 是关于……的评注 @zh-hans
definition: 将一种资源与被用作一个解释性或评论性附注之集合的基础的一种资源关联起来。 @zh-hans
label: kommentár a következőhöz: @hu
definition: Hozzákapcsol egy forrást egy forráshoz, amelyet magyarázó vagy kritikai jegyzetek halmazának alapjaként használnak. @hu
label: hakkında yorumdur @tr
definition: Bir kaynağı, bir dizi açıklayıcı veya eleştiri notlar seti için temel olarak kullanılan bir kaynakla ilişkilendirir. @tr

has commentator
status: Published
definition: Relates a resource to a performer who contributes to a resource by providing interpretation, analysis, or a discussion of the subject matter on a recording, film, or other audiovisual medium.
type: Property
sub property of: has performer
inverse of: is commentator of
lexical alias: commentator.en
label: har kommentator @da
definition: Relaterer en ressource til en optrædende, der har bidraget til en ressource ved at forestå en fortolkning, analyse eller diskussion af det emne, der behandles i en optagelse, film eller andet audiovisuelt medium. @da
label: heeft commentator @nl
label: kommentaattorina aineistossa @fi
label: له مُعلِق @ar
definition: يربط بين مصدر ومؤدِ يُساهم بأحد المصادر من خلال تقديم تفسير للموضوع، أو تحليله، أو مناقشته على تسجيل أو على فيلم، أو على أي وسيط سمعي بصري آخر. @ar
definition: Liittää toimijan aineistoon, jonka tekemiseen hän osallistuu tulkitsemalla tai analysoimalla äänitteen, elokuvan tai muun audiovisuaalisen aineiston aihetta tai keskustelemalla siitä. @fi
label: hat Kommentatorin/Kommentator @de
definition: Setzt eine Ressource in Beziehung zu einer Ausführenden/einem Ausführenden, die/der zu einer Ressource beiträgt, indem sie/er in einer Aufnahme, in einem Film oder in einem anderen audiovisuellen Medium eine Interpretation, eine Analyse oder eine Diskussion des Themas präsentiert. @de
label: 有解说员 @zh-hans
definition: 将一种资源与通过提供关于录像、电影或其他视听媒介中的主要内容之解释、分析或讨论而对一种资源有贡献的一个表演者关联起来。 @zh-hans
label: kommentátora a következő: @hu
definition: Hozzákapcsol egy forrást egy előadóhoz, aki hozzájárul egy forráshoz azzal, hogy a forrás témáihoz értelmezést, elemzést nyújt vagy megvitatja azt egy felvételen, filmen vagy más audiovizuális médiumon. @hu
label: yorumcu ile ilişkilidir @tr
definition: Bir kaynağı, bir kayıt, film veya başka görsel-işitsel ortamda konuya dair yorum, analiz ya da konu hakkında tartışma yaparak kaynağa katkıda bulunan sanatçı ile ilişkilendirir. @tr

is commentator of
status: Published
definition: Relates a performer who contributes to a resource by providing interpretation, analysis, or a discussion of the subject matter on a recording, film, or other audiovisual medium to a resource.
type: Property
sub property of: is performer of
inverse of: has commentator
lexical alias: commentatorOf.en
label: er kommentator i @da
definition: Relaterer en udøver der bidrager til en ressource ved at give en fortolkning, analyse, eller diskussion af det emne, der behandles i en optagelse, film eller andet audiovisuelt medium til en ressource. @da
label: is commentator van @nl
label: kommentaattorina aineistossa @fi
label: هو مُعلِق لـ @ar
definition: يربط بين مصدر ومؤدِ يُساهم بأحد المصادر من خلال تقديم تفسير للموضوع، أو تحليله، أو مناقشته على تسجيل أو على فيلم، أو على أي وسيط سمعي بصري آخر. @ar
definition: Liittää toimijan aineistoon, jonka tekemiseen hän osallistuu tulkitsemalla tai analysoimalla äänitteen, elokuvan tai muun audiovisuaalisen aineiston aihetta tai keskustelemalla siitä. @fi
label: ist Kommentatorin/Kommentator von @de
definition: Setzt eine Ausführende/einen Ausführenden in Beziehung zu einer Ressource, indem sie/er zu einer Ressource beiträgt, indem sie/er in einer Aufnahme, in einem Film oder in einem anderen audiovisuellen Medium eine Interpretation, eine Analyse oder eine Diskussion des Themas präsentiert. @de
label: 是……的解说员 @zh-hans
definition: 将一个通过提供关于录像、电影或其他视听媒介中的主要内容之解释、分析或讨论的而对一种资源有贡献的一个表演者与一种资源关联起来。 @zh-hans
label: kommentátora a következőnek: @hu
definition: Hozzákapcsol egy előadót, aki hozzájárul egy forráshoz azzal, hogy a forrás témáihoz értelmezést, elemzést nyújt vagy megvitatja azt egy felvételen, filmen vagy más audiovizuális médiumon. @hu
label: yorumcusudur @tr
definition: Bir kayıt, film veya diğer görsel-işitsel ortamdaki konu hakkında yorum, analiz veya tartışma sağlayarak bir kaynağa katkıda bulunan bir sanatçıyı bir kaynakla ilişkilendirir. @tr

has commissioning agent
status: Published
type: Property
definition: Relates a resource to an agent who is responsible for commissioning a resource.
inverse of: is commissioning agent of
sub property of: has creator
label: har bestillende institution @da
definition: Relaterer en ressource til en agent, der er ansvarlig for at have bestilt en ressource. @da
lexical alias: commissioningAgent.en
label: heeft opdrachtgever-actor @nl
label: له وكيل جهة تكليف @ar
definition: يربط مصدر بوكيل مسؤول عن التكليف بمصدر. @ar
label: toimeksiantaja aineistossa @fi
definition: Liittää aineiston toimijaan, joka vastaa aineiston teettämisestä. @fi
label: hat Auftraggeberin/Auftraggeber @de
definition: Setzt eine Ressource in Beziehung zu einem Akteur, der eine Ressource in Auftrag gibt. @de
label: 有委托行为者 @zh-hans
definition: 将一种资源与负责委托一种资源的一个行为者关联起来。 @zh-hans
label: megrendelő ágense a következő: @hu
definition: Hozzákapcsol egy forrást egy ágenshez, amely felelős egy forrás megrendeléséért. @hu
label: görevlendiren temsilci ile ilişkilidir @tr
definition: Bir kaynağı, bir kaynağı görevlendirmekten sorumlu olan bir temsilci ile ilişkilendirir. @tr

is commissioning agent of
status: Published
type: Property
definition: Relates an agent to a resource that involves a responsibility of an agent for commissioning a resource.
inverse of: has commissioning agent
sub property of: is creator of
label: er bestillende institution for @da
definition: Relaterer en agent der er ansvarlig for at have bestilt en ressource til en ressource. @da
lexical alias: commissioningAgentOf.en
label: is opdrachtgever van @nl
label: هو وكيل جهة تكليف لـ @ar
definition: يربط بين وكيل ومصدر ينطوي على مسؤولية وكيل عن التكليف بمصدر. @ar
label: toimeksiantaja (toimija) aineistossa @fi
definition: Liittää toimijan aineistoon, jossa toimija vastaa aineiston teettämisestä. @fi
label: ist Auftraggeberin/Auftraggeber von @de
definition: Setzt einen Akteur in Beziehung zu einer Ressource, bei der ein Akteur dafür verantwortlich ist, eine Ressource in Auftrag zu geben. @de
label: 是……的委托行为者 @zh-hans
definition: 将一个行为者与涉及委托一种资源的一个行为者的责任的一种资源关联起来。 @zh-hans
label: megrendelő ágense a következőnek: @hu
definition: Hozzákapcsol egy ágenst egy forráshoz, amelyhez hozzátartozik az ágens felelőssége egy forrás megrendeléséért. @hu
label: görevlendiren temsilcisidir @tr
definition: Bir temsilciyi, bir kaynağı görevlendiren bir temsilcinin sorumluluğunu içeren bir kaynakla ilişkilendirir. @tr

has compiler
status: Published
definition: Relates a resource to an agent who is responsible for creating a metadata description set.
type: Property
inverse of: is compiler of
lexical alias: compiler.en
scope note: A metadata description set includes a bibliography of resources, a directory of agents and places, and an analytic finding aid.
see also: has editor (Deprecated
label: har kompilator @da
definition: Relaterer en ressource til en agent, der er ansvarlig for at have skabt en ny ressource, fx en bibliografi eller en fortegnelse, ved at udvælge, arrangere, samle og redigere data, information etc. @da
scope note: Revisioner eller indholdspræciseringer, eller udvælgelse og sammensætning af værker og dele af ressourcer, af et eller flere ophav er ikke omfattet. @da
sub property of: has aggregator
label: heeft samensteller @nl
label: aineiston kokoaja @fi
label: له جامع @ar
definition: يربط مصدر بوكيل مسؤول عن إنشاء مصدر جديد مثل ببليوجرافية أو دليل عن طريق اختيار البيانات والمعلومات وترتيبها وتجميعها وتحريرها، إلخ. @ar
scope note: يُستبعد مراجعة أو توضيح محتوى، أو اختيار وتجميع مصادر أو أجزاء من المصادر معًا، بواسطة واحد أو أكثر من المبدعين. @ar
definition: Liittää aineiston toimijaan, joka vastaa metatietokokonaisuuden luomisesta. @fi
scope note: Metatietokokonaisuus sisältää aineistojen bibliografian, toimijoiden ja paikkojen hakemiston sekä luettelon. @fi
label: hat Zusammenstellende/Zusammenstellenden @de
definition: Setzt eine Ressource in Beziehung zu einem Akteur, der durch Selektieren, Gliedern, Aggregieren und Editieren von Daten und Informationen und so weiter für die Schaffung einer neuen Ressource, zum Beispiel einer Bibliografie oder eines Verzeichnisses, verantwortlich ist. @de
scope note: Darunter fallen keine Überarbeitungen oder Erläuterungen des Inhalts oder die Auswahl und das Zusammenstellung von Ressourcen oder Teilen von Ressourcen durch eine geistige Schöpferin/einen geistigen Schöpfer oder mehrere geistige Schöpferinnen/geistiger Schöpfer. @de
label: 有编纂者 @zh-hans
definition: 将一种资源与负责创建一个元数据描述集的一个行为者关联起来。 @zh-hans
scope note: 元数据描述集包括资源的书目、行为者和地点的名录、以及分析查询工具。 @zh-hans
definition: Relaciona un recurs amb un agent que és responsable de la creació d’un conjunt de descripció de metadades. @ca
scope note: Un conjunt de descripció de metadades inclou una bibliografia de recursos, un directori d’agents i llocs i un instrument de descripció analític. @ca
label: összeállítója a következő: @hu
definition: Hozzákapcsol egy forrást egy ágenshez, amely adatok, információk stb. kiválasztása, elrendezése, aggregálása és szerkesztése révén felelős egy olyan új forrás létrehozásáért, mint például egy bibliográfia vagy adattár. @hu
scope note: Nem tartozik bele sem a tartalom felülvizsgálata, sem az egy vagy több létrehozótól származó források vagy részforrások kiválasztása és összeállítása. @hu
has subproperty: has collection registrar
label: derleyen ile ilişkilidir @tr
definition: Bir kaynağı, bir üstveri seti oluşturmaktan sorumlu olan bir temsilciyle ilişkilendirir. @tr
scope note: Bir üstveri seti, kaynakların bir bibliyografyasını, temsilciler ve yerler dizinini ve analitik rehber bilgi içerir. @tr

is compiler of
status: Published
definition: Relates an agent to a resource that involves a responsibility of an agent for creating a metadata description set.
type: Property
inverse of: has compiler
lexical alias: compilerOf.en
see also: is editor of
label: er kompilator af @da
definition: Relaterer en agent, der er ansvarlig for at have skabt et nyt værk såsom en bibliografi eller fortegnelse ved at udvælge, arrangere, sammenlægge og redigere data, oplysninger etc. til en ressource. @da
scope note: A metadata description set includes a bibliography of resources, a directory of agents and places, and an analytic finding aid.
sub property of: is aggregator of
label: is samensteller van @nl
label: هو جامع لـ @ar
definition: يربط بين وكيل ومصدر ينطوي على مسؤولية وكيل عن اختيار البيانات والمعلومات لمصدر وترتيبها، وتجميعها، وتحريرها، في ببليوجرافية أو في دليل. @ar
label: kokoaja (toimija) aineistossa @fi
definition: Liittää toimijan aineistoon, jossa toimija vastaa metatietokokonaisuuden luomisesta. @fi
scope note: Metatietokokonaisuus sisältää aineistojen bibliografian, toimijoiden ja paikkojen hakemiston sekä hakemiston. @fi
label: ist Zusammenstellende/Zusammenstellender von @de
definition: Setzt einen Akteur in Beziehung zu einer Ressource, bei der ein Akteur für das Selektieren, Gliedern, Aggregieren und Editieren von Daten und Informationen für eine Ressource, zum Beispiel einer Bibliografie oder eines Verzeichnisses, verantwortlich ist. @de
label: 是……的编纂者 @zh-hans
definition: 将一个行为者与涉及创建一个元数据描述集的一个行为者的责任的一种资源关联起来。 @zh-hans
scope note: 元数据描述集包括资源的书目、行为者和地点的名录、以及分析查询工具。 @zh-hans
definition: Relaciona un agent amb un recurs que implica una responsabilitat d’un agent en la creació d’un conjunt de descripció de metadades @ca
scope note: Un conjunt de descripció de metadades inclou una bibliografia de recursos, un directori d’agents i llocs, i un instrument de descripció analític. @ca
label: összeállítója a következőnek: @hu
definition: Hozzákapcsol egy ágenst egy forráshoz, amelyhez hozzátartozik egy ágens felelőssége a kiválasztásáért, elrendezésért, aggregálásért, adatok és információk szerkesztéséért egy olyan forrás számára, mint egy bibliográfia vagy egy címtár. @hu
has subproperty: is collection registrar of
label: derleyicisidir @tr
definition: Bir temsilciyi, bir üstveri seti oluşturmakla görevli bir temsilcinin sorumluluğunu içeren bir kaynak ile ilişkilendirir @tr
scope note: Bir üstveri seti; kaynakların bir bibliografyasını, temsilciler ve yerler dizini ve analitik rehber bilgi içerir. @tr

is complemented by
status: Published
definition: Relates a resource to a resource paired with a related resource without either resource being considered to be predominant.
type: Property
sub property of: has accompanying resource relationship with (Deprecated)
lexical alias: complementedBy.en
label: er komplementeret af @da
definition: Relaterer en ressource til en ressource, der er parret med en anden ressource, uden at én af ressourcerne betragtes som værende vigtigst. @da
label: is gecomplementeerd door @nl
label: هو مُكَمَّل بـ @ar
definition: يربط بين مصدر ومصدر مقترن بمصدر ذي صلة دون اعتبار أحدهما هو المصدر السائد. @ar
label: taydentävä aineisto @fi
definition: Liittää aineiston teokseen, joka on yhdistetty siihen liittyvään teokseen ilman, että kumpaakaan teosta pidetään ensisijaisena. @fi
label: ist vervollständigt durch @de
definition: Setzt eine Ressource in Beziehung zu einer Ressource, die mit einer in Beziehung stehenden Ressource zusammengebracht wird, ohne dass eine der beiden als Hauptressource angesehen wird. @de
label: 被……补充 @zh-hans
definition: 将一种资源与和一种相关资源配对而两者都不被认为占主导地位的一种资源关联起来。 @zh-hans
label: kiegészíti, kiegészítése a következő: @hu
definition: Hozzákapcsol egy forrást egy másik forrással párosított forráshoz, anélkül, hogy bármelyiket dominánsnak kellene tekinteni. @hu
has subproperty: has choreography
has subproperty: is choreography for
has subproperty: has libretto
has subproperty: is libretto for
has subproperty: has music
has subproperty: is music for
has subproperty: has radio script
has subproperty: has screenplay
has subproperty: is screenplay for
has subproperty: is script for radio program
has subproperty: has sounds
has subproperty: is sounds for
has subproperty: is spoken word for resource
has subproperty: has spoken word resource
has subproperty: is text for resource
has subproperty: has text resource
label: ile tamamlanmıştır @tr
definition: Bir kaynağı, her iki kaynak da baskın olarak kabul edilmeksizin ilgili bir kaynakla eşleştirilmiş bir kaynakla ilişkilendirir. @tr

has component of merger
status: Published
definition: Relates an agent to an agent who forms another agent by merging with one or more other agents.
type: Property
inverse of: has product of merger
lexical alias: componentOfMerger.en
label: har del af sammenlægning @da
definition: Relaterer en agent der har dannet en anden agent gennem sammenlægning med en eller flere andre agenter til en agent. @da
label: heeft onderdeel van fusie @nl
label: له مكون الإندماج @ar
definition: يربط بين وكيل ووكيل قام بتشكيل وكيل ذو صلة عن طريق الاندماج مع وكيل أو وكلاء آخرين. @ar
label: yhdistynyt yhteistoimija @fi
definition: Liittää yhteistoimijaan, joka muodostaa uuden yhdistymällä yhden tai useamman muun yhteistoimijan kanssa. @fi
label: hat Beteiligte/Beteiligten an einer Fusion @de
definition: Setzt einen Akteur in Beziehung zu einem Akteur, der durch Fusion mit einem anderen Akteur oder mehreren anderen Akteuren einen in Beziehung stehenden Akteur gebildet hat. @de
label: 有合并的组成部分 @zh-hans
definition: 将一个行为者与通过与一个或多个行为者合并而形成另一个行为者的一个行为者关联起来。 @zh-hans
definition: Relaciona un agent amb un agent que forma un altre agent fusionant-se amb un o més agents. @ca
label: beolvadás alkotóeleme a következő: @hu
definition: Hozzákapcsol egy ágenst, amely egy vagy több más ágenssel egyesülve alkotott kapcsolódó ágenst, egy ágenshez. @hu
label: birleşme bileşeni ile ilişkilidir @tr
definition: Bir veya daha fazla diğer temsilciyle birleşerek ilgili bir temsilci oluşturan bir temsilciyi bir temsilciyle ilişkilendirir. @tr

has composer
status: Published
definition: Relates a resource to an agent who is responsible for creating a musical resource.
type: Property
sub property of: has creator
inverse of: is composer of
lexical alias: composer.en
scope note: Adaptation of another musical resource to form a distinct alteration, paraphrasing a resource or creating a resource in the general style of another composer, or creating a resource that is based on the music of another composer, is included.
label: komponist @da
definition: Relaterer en ressource til en agent, der er ansvarlig for at have skabt en musikressource. @da
scope note: Bearbejdninger af en anden musikressource for at danne en distinkt forandring ved at parafrasere en ressource eller skabe en ressource i en anden komponists typiske stil, eller skabe en ressource, der er baseret på en anden komponists musik, er omfattet. @da
label: heeft componist @nl
label: aineiston säveltäjä @fi
label: له مُلحن @ar
definition: يربط مصدر بوكيل مسؤول عن إنشاء مصدر موسيقي. @ar
scope note: يتم تضمين تكييف مصدر موسيقي آخر لتشكيل تغيير مميز، أو إعادة صياغة مصدر أو إنشاء مصدر بالأسلوب العام لمؤلف موسيقي آخر، أو إنشاء مصدر يعتمد على موسيقى مُلحن آخر. @ar
definition: Liitää aineiston toimijaan, joka vastaa musiikkiaineiston luomisesta. @fi
scope note: Koskee toisen musiikkiaineiston muuttamista erillisen muunnoksen muodostamiseksi, mukailua, aineiston luomista toisen säveltäjän tyylillä taitai toisen säveltäjän musiikkiin perustuvan aineiston luomista. @fi
label: hat Komponistin/Komponist @de
definition: Setzt eine Ressource in Beziehung zu einem Akteur, der für die Schaffung einer Musikressource verantwortlich ist. @de
scope note: Darunter fallen Adaptionen anderer Musikressourcen, die sich deutlich vom Original unterscheiden, Paraphrasierungen von Ressourcen oder Schaffungen neuer Ressourcen im Stil einer anderen Komponistin/eines anderen Komponisten oder Schaffungen von Ressourcen, die auf der Musik einer anderen Komponistin/eines anderen Komponisten basieren. @de
label: 有作曲者 @zh-hans
definition: 将一种资源与负责创建一种音乐资源的一个行为者关联起来。 @zh-hans
scope note: 包括将另一种音乐资源改编以形成一种不同的变化形式、将一种资源演绎或用另一个作曲者的一般风格创建一种新的资源、或者基于另一个作曲者的音乐创建一种新的资源。 @zh-hans
label: zeneszerzője a következő: @hu
definition: Hozzákapcsol egy forrást egy ágenshez, amely felelős egy zenei forrás megalkotásáért. @hu
scope note: Beletartozik egy másik zenei forrás adaptálása egy eltérő alterációs formára, egy forrás parafrazeálása, vagy egy forrás megalkotása egy másik zeneszerző általános stílusában, vagy egy olyan forrás megalkotása, amely egy másik zeneszerző zenéjén alapul. @hu
label: besteci ile ilişkilidir @tr
definition: Bir kaynağı, müzikal bir kaynak oluşturmaktan sorumlu olan bir temsilci ile ilişkilendirir. @tr
scope note: Başka bir müzik kaynağının belirgin bir değişiklik oluşturacak şeklde uyarlanması, bir kaynağın başka sözcüklerle ifade edilmesi veya başka bir bestecinin genel üslubunda bir kaynak oluşturulması veya başka bir bestecinin müziğine dayalı bir kaynak oluşturulması dahildir. @tr

is composer of
status: Published
definition: Relates an agent to a musical resource that involves a responsibility of an agent for music.
type: Property
sub property of: is creator of
inverse of: has composer
lexical alias: composerOf.en
label: er komponist til @da
definition: Relaterer en agent der er ansvarlig for at have skabt et musikværk til en ressource. @da
label: is componist van @nl
label: هو مُلحن لـ @ar
definition: يربط وكيل بمصدر موسيقي ينطوي على مسؤولية وكيل عن موسيقى. @ar
label: säveltäjä (toimija) aineistossa @fi
definition: Liittää toimijan aineistoon, jossa toimija vastaa musiikkiaineiston luomisesta. @fi
label: ist Komponistin/Komponist von @de
definition: Setzt einen Akteur in Beziehung zu einer Musikressource, bei dem ein Akteur für die Musik verantwortlich ist. @de
label: 是……的作曲者 @zh-hans
definition: 将一个行为者与涉及一个行为者对音乐的责任的一种音乐资源关联起来。 @zh-hans
label: zeneszerzője a következőnek: @hu
definition: Hozzákapcsol egy ágenst egy zenei forráshoz, amelyhez hozzátartozik egy ágens felelőssége a zenéért. @hu
label: bestecisidir @tr
definition: Bir temsilciyi, müzik için bir temsilcinin sorumluluğunu içeren bir müzikal bir kaynak ile ilişkilendirir @tr

has concordance
status: Published
definition: Relates a resource to a resource that is a systematic guide of all or selected words that occur in a textual resource.
type: Property
inverse of: is concordance for
lexical alias: concordance.en
label: er konkordans @da
definition: Relaterer en ressource til en ressource, der består af et indeks over alle ordene i en hovedressource. @da
sub property of: heeft gerelateerde resource van resource
label: heeft concordantie @nl
label: aineiston konkordanssihakemisto @fi
label: له كشاف نصوص @ar
definition: يربط بين مصدر ومصدر يتكون من كشاف لكل الكلمات أو لكلمات محددة والتي تظهر في مصدر نصي. @ar
definition: Liittää aineiston aineistoon, joka on kaikkien tai valikoitujen tekstiaineiston toteutuksessa esiintyvien sanojen hakemisto. @fi
label: hat Konkordanz @de
definition: Setzt eine Ressource in Beziehung zu einer Ressource, die aus einem Index aller oder ausgewählter Wörter besteht, die in einer textlichen Ressource vorkommen. @de
label: 有词语索引 @zh-hans
definition: 将一种资源与作为一种文字资源中出现的所有或所选词语的系统指南的一种资源关联起来。 @zh-hans
definition: Relaciona un recurs amb un recurs que és una guia sistemàtica de totes les paraules o d’una selecció de les paraules que apareixen en un recurs textual. @ca
label: konkordanciája a következő: @hu
definition: Hozzákapcsol egy forrást egy forráshoz, amely egy szöveges forrás összes szavának vagy válogatott szavak mutatójából áll. @hu
label: konkordans ile ilişkilidir @tr
definition: Bir kaynağı, metinsel kaynakta geçen bütün veya seçilmiş kelimelerin dizini olan bir kaynakla ilişkilendirir. @tr

is concordance for
status: Published
definition: Relates a resource to a resource of a textual resource that is the basis of an index of all or selected words that occur.
type: Property
inverse of: has concordance
label: er konkordans til @da
definition: Relaterer en ressource til en ressource, der er anvendt som grundlag for en konkordans, dvs. et indeks over alle ordene i hovedressourcen. @da
label: is concordantie op @nl
alternative label: is concordance to
sub property of: heeft gerelateerde resource van resource
lexical alias: concordanceFor.en
label: konkordanssihakemisto aineistosta @fi
label: هو كشاف نصوص لـ @ar
definition: يربط بين مصدر ومصدر يُستخدم كأساس لكشاف لكل الكلمات أو لكلمات محددة والتي تظهر في مصدر نصي. @ar
definition: Liittää aineiston tekstiaineistoon, joka koostuu kaikkien tai valikoitujen aineistossa esiintyvien sanojen hakemistosta. @fi
label: ist Konkordanz zu @de
definition: Setzt eine Ressource in Beziehung zu einer Ressource, die als Grundlage für einen Index aller oder ausgewählter Wörter verwendet wird, die in einer textlichen Ressource vorkommen. @de
label: 是……的词语索引 @zh-hans
definition: 将一种资源与作为一种文字资源并且是所出现的所有或所选词语的索引之基础的一种资源关联起来。 @zh-hans
alternative label: és concordança de @ca
label: és concordança per @ca
definition: Relaciona un recurs amb un recurs d’un recurs textual que és la base d’un índex de totes les paraules o de paraules seleccionades que apareixen. @ca
label: konkordanciával ellátott: @hu
definition: Hozzákapcsol egy forrást egy forráshoz, amelyet alapként használnak egy szöveges forrás összes szavának vagy válogatott szavak mutatójához. @hu
label: dizin eşleştirmesidir @tr
definition: Bir kaynağı, seçilmiş veya tüm kelimelerin dizini olan bir metin kaynağı ile ilişkilendirir. @tr

has conductor
status: Published
definition: Relates a resource to an agent who is a performer who contributes to a musical resource by leading a performing group in a musical or dramatic presentation.
type: Property
sub property of: has performer
inverse of: is conductor of
lexical alias: conductor.en
label: har dirigent @da
definition: Relaterer en ressource til en performer, der har bidraget til en musikressource af ved at lede en udøvende gruppe i en musikalsk eller dramatisk præsentation etc. @da
label: heeft dirigent @nl
label: johtaja aineistossa @fi
label: له قائد @ar
definition: يربط مصدر بوكيل يُمثل مؤدِ يُساهم في مصدر موسيقي من خلال قيادة فرقة عزف في عرض موسيقي أو درامي. @ar
definition: Liittää aineiston toimijaan, joka on osallisena musiikkiaineistoon johtamalla esiintyjäryhmää musiikki- tai näytelmäesityksessä. @fi
label: hat Dirigentin/Dirigent @de
definition: Setzt eine Ressource in Beziehung zu einer Ausführenden/einem Ausführenden, die/der zu einer Musikressource beiträgt, indem sie/er ein aufführendes Ensemble in einer musikalischen oder dramatischen Darbietung leitet. @de
label: 有指挥 @zh-hans
definition: 将一种资源与作为一个表演者对一种音乐资源有领导音乐或戏剧呈现中表演团体的贡献的一个行为者关联起来。 @zh-hans
label: karmestere a következő: @hu
definition: Hozzákapcsol egy forrást egy előadó ágenshez, amely hozzájárul egy zenei forráshoz azzal, hogy előadói csoportot vezet egy zenei vagy drámai stb. bemutatóban. @hu
has subproperty: has choral conductor
has subproperty: has instrumental conductor
label: orkestra şefi ile ilişkilidir @tr
definition: Bir kaynağı, müzikal veya dramatik gösterimde performans sergileyen bir gruba liderlik ederek müzikal kaynağa katkıda bulunan bir sanatçı olan temsilci ile ilişkilendirir. @tr

is conductor of
status: Published
definition: Relates an agent to a resource that includes a contribution by an agent of leading of a performing group in a musical or dramatic presentation, etc.
type: Property
sub property of: is performer of
inverse of: has conductor
lexical alias: conductorOf.en
label: er dirigent af @da
definition: Relaterer en udøver, der bidrager til en musikalsk ressource ved at lede en udøvende gruppe i en musikalsk eller dramatisk præsentation etc. til en ressource. @da
label: is dirigent van @nl
label: johtajana aineistossa @fi
label: هو مايسترو لـ @ar
definition: يربط بين وكيل ومصدر يتضمن إسهام وكيل في قيادة فرقة عزف في عرض موسيقي أو درامي...إلخ. @ar
definition: Liittää toimijan aineistoon, jonka tekemisessä toimija on osallisena johtamalla esiintyjäryhmän esiintymistä musiikki- tai näytelmäesityksessä. @fi
label: ist Dirigentin/Dirigent von @de
definition: Setzt einen Akteur in Beziehung zu einer Ressource, zu der ein Akteur beiträgt, indem er ein aufführendes Ensemble in einer musikalischen oder dramatischen Darbietung und so weiter leitet. @de
label: 是……的指挥 @zh-hans
definition: 将一个行为者与包括领导音乐或戏剧呈现中的一个表演团体的一个行为者的贡献的一种资源关联起来。 @zh-hans
label: karmestere a következőnek: @hu
definition: Hozzákapcsol egy ágenst egy forráshoz, amely magában foglalja egy zenei vagy drámai bemutatóban, stb. előadói csoportot vezető ágens közreműködését. @hu
has subproperty: is choral conductor of
has subproperty: is instrumental conductor of
label: orkestra şefidir @tr
definition: Bir temsilciyi, müzikal veya dramatik vb. bir sunumda bir performans grubuna liderlik eden bir temsilcinin katkısını içeren bir kaynakla ilişkilendirir. @tr

has configuration of playback channels
status: Published
definition: Relates a resource to a number of sound channels used to make a recording.
type: Property
sub property of: has sound characteristic
lexical alias: configurationOfPlaybackChannels.en
label: har konfiguration af afspilningskanaler @da
definition: Relaterer en ressource til et antal lydkanaler, der blev anvendt til at lave en indspilning. @da
label: heeft configuratie van afspeelkanalen @nl
label: له إعدادات قنوات التشغيل @ar
definition: يربط بين مصدر ورقم قنوات الصوت المستخدمة في تسجيل. @ar
label: toistokanavien määrä aineistossa @fi
definition: Liittää aineiston äänityksessä käytettyjen äänikanavien määrään. @fi
label: hat Konfiguration von Wiedergabekanälen @de
definition: Setzt eine Ressource in Beziehung zu einer Anzahl von Tonkanälen, die für die Wiedergabe einer Aufnahme verwendet werden. @de
label: 有回放声道的配置 @zh-hans
definition: 将一种资源与用于制作一个录音制品的声道数关联起来。 @zh-hans
label: visszajátszási csatornák konfigurációja a következő: @hu
definition: Hozzákapcsol egy forrást a hangcsatornák számához, amelyeket lemezfelvétel készítésekor használnak. @hu
label: oynatma kanallarının konfigürasyonu ile ilişkilidir @tr
definition: Bir kaynağı, kayıt yapmak için kullanılan bir dizi ses kanalıyla ilişkilendirir. @tr

has consultant
status: Published
definition: Relates a resource to an agent who provides consultation services, and often makes recommendations, for a related agent who is represented as a creator of a resource.
type: Property
sub property of: has creator
inverse of: is consultant of
lexical alias: consultant.en
label: har rådgiver @da
definition: Relaterer en ressource til en agent, der yder rådgivning, og ofte kommer med anbefalinger, til en anden agent, der er repræsenteret som ophav til en ressource. @da
label: heeft consultant @nl
label: asiantuntija @fi
label: له استشاري @ar
definition: يربط مصدر بوكيل يُقدم خدمات استشارية، وغالبًا ما يقدم مقترحات، لوكيل ذي صلة يُقدم على أنه منشيء مصدر. @ar
definition: Liittää teoksen toimijaan, joka on vastuussa asiantuntijapalveluiden tarjoamisesta ja suositusten antamisesta teoksen tekijänä pidetylle henkilölle. @fi
label: hat Beraterin/Berater @de
definition: Setzt eine Ressource in Beziehung zu einem Akteur, der Beratungsdienste anbietet und häufig einem in Beziehung stehenden Akteur, der als geistiger Schöpfer einer Ressource repräsentiert wird, Empfehlungen macht. @de
label: 有顾问 @zh-hans
definition: 将一种资源与向表现为资源创作者的一个相关行为者提供咨询服务并经常提供建议的一个行为者关联起来。 @zh-hans
label: tanácsadója a következő: @hu
definition: Hozzákapcsol egy forrást egy ágenshez, amely tanácsadási szolgáltatásokat nyújt és gyakran javaslatokat ad a forrás létrehozójaként megjelenő ágensnek. @hu
label: danışman ile ilişkilidir @tr
definition: Bir kaynağı, bir kaynağın yaratıcısı olarak temsil edilen ilgili bir temsilci için danışma hizmetleri sağlayan ve genellikle tavsiyelerde bulunan bir temsilci ile ilişkilendirir. @tr

is consultant of
status: Published
definition: Relates an agent to a resource that involves a responsibility of an agent for providing consultation services, and often making recommendations, to a creator of a resource.
type: Property
sub property of: is creator of
inverse of: has consultant
lexical alias: consultantOf.en
label: er rådgiver for @da
definition: Relaterer en agent, der yder rådgivning, og ofte kommer med anbefalinger, til en anden agent, der er repræsenteret som ophav til en ressource til en ressource. @da
label: is consultant van @nl
label: هو استشاري لـ @ar
definition: يربط بين وكيل ومصدر ينطوي على مسؤولية وكيل عن تقديم خدمات استشارية، وغالبًا ما يقدم مقترحات، لمُنشيء مصدر. @ar
label: asiantuntija (toimija) aineistossa @fi
definition: Liittää toimijan aineistoon, jossa toimija on vastuussa asiantuntijapalveluiden tarjoamisesta ja suositusten antamisesta aineiston tekijälle. @fi
label: ist Beraterin/Berater von @de
definition: Setzt einen Akteur in Beziehung zu einer Ressource, bei der ein Akteur einer geistigen Schöpferin/einem geistigen Schöpfer einer Ressource Beratungsdienste anbietet und Empfehlungen macht. @de
label: 是……的顾问 @zh-hans
definition: 将一个行为者与涉及向资源创作者提供咨询服务并经常提供建议的一个行为者的责任的一种资源关联起来。 @zh-hans
label: tanácsadója a következőnek: @hu
definition: Hozzákapcsol egy ágenst egy forráshoz, amelyhez hozzátartozik az ágens felelőssége tanácsadó szolgáltatásért és gyakran egy forrás létrehozójának tett ajánlatért is. @hu
label: danışmanıdır @tr
definition: Bir temsilciyi, bir kaynağın yaratıcısına danışma hizmetleri sağlama ve genellikle tavsiyelerde bulunmakta görevli bir temsilcinin sorumluluğunu içeren bir kaynakla ilişkilendirir. @tr

has contact information
status: Published
definition: Relates a resource to a name, address, or other means of communicating with an agent from which a resource may be obtained.
type: Property
lexical alias: contactInformation.en
scope note: Contact information includes the name, address, etc. of the publisher, distributor, etc. of a published resource, or of the archival repository that holds the resource.
label: har kontaktoplysninger @da
definition: Relaterer en ressource til et navn, en adresse, etc. for en organisation etc. hvorfra en ressource kan fremskaffes. @da
scope note: Kontaktoplysninger inkluderer navn adresse, etc. på en udgiven ressources udgiver, distributør, etc., eller på det arkiv som ejer ressourcen. @da
label: heeft contactinformatie @nl
label: له بيانات اتصال @ar
definition: يربط بين مصدر وإسم، عنوان، أو غيرها من بيانات الاتصال لوكيل يمكن الحصول منه على مصدر. @ar
scope note: تتضمن بيانات الاتصال اسم وعنوان الناشر، الموزع، إلخ. وغيرها من بيانات الاتصال الخاصة بمصدر منشور، أو بالمستودع الأرشيفي الذي يحتفظ بالمصدر. @ar
label: yhteystiedot @fi
definition: Liitää aineiston toimijan, jolta aineisto on saatavissa, nimeen, osoitteeseen tai muuhun yhteystietoon. @fi
scope note: Yhteystietoon sisältyy julkaistun aineiston kustantajan, jakelijan jne. tai säilyttävän arkiston nimi, osoite jne. @fi
label: hat Kontaktinformationen @de
definition: Setzt eine Ressource in Beziehung zu einem Namen, einer Adresse oder einem anderen Kommunikationsmittel eines Akteurs, von dem eine Ressource erworben werden kann. @de
scope note: Darunter fällt der Name, die Adresse und so weiter des Verlags, Vertriebs und so weiter eine veröffentlichten Ressource oder des Archivrepositorys, das die Ressource aufbewahrt. @de
label: 有联络信息 @zh-hans
definition: 将一种资源与资源可以通过其获得的一个行为者的名称、地址或其他通讯方式关联起来。 @zh-hans
scope note: 联络信息包括出版资源的出版者、发行者等或者收藏该资源的档案资料库的名称和地址等。 @zh-hans
label: kapcsolati információja a következő: @hu
definition: Hozzákapcsol egy forrást egy ágens nevéhez, címéhez vagy a vele folytatott kommunikáció egyéb módjához, amely révén egy forrás elérhető. @hu
scope note: A kapcsolati információ magában foglalja egy kiadott forrás kiadójának, terjesztőjének, stb., illetve a forrást megőrző archiváló repozitóriumnak a nevét, címét, stb. @hu
label: iletişim bilgisi ile ilişkilidir @tr
definition: Bir kaynağı, bir kaynağın elde edilebileceği bir temsilci ile bir isim, adres veya diğer iletişim araçlarıyla ilişkilendirir. @tr
scope note: İletişim bilgileri, yayımlanmış bir kaynağın yayıncısı, dağıtıcısı vb. ile bu kaynağı elinde bulunduran arşiv deposunun adı, adresi vb. bilgileri içerir. @tr

has content type
status: Published
definition: Relates a resource to a categorization reflecting a fundamental form of communication in which a content is expressed and a human sense through which it is intended to be perceived.
type: Property
lexical alias: contentType.en
scope note: Content type also reflects the number of spatial dimensions and the presence or absence of movement in which content expressed in the form of an image or images is intended to be perceived.
label: har indholdstype @da
definition: Relaterer en ressource til en kategorisering, der afspejler den grundlæggende kommunikationsform, hvorigennem indholden ressourcekes, og den menneskelige sans, hvorigennem det er meningen, at det skal opfattes. @da
scope note: Hvad angår indhold, der udtrykkes i form af et eller flere billeder, afspejler indholdstype desuden antallet af rumlige dimensioner, som indholdet skal opfattes i, samt opfattelsen af tilstedeværelse eller fravær af bevægelse. @da
label: heeft type content @nl
scope note: Type content geeft ook het aantal ruimtelijke dimensies weer en de aanwezigheid of afwezigheid van beweging waarmee content uitgedrukt in de vorm van een beeld of beelden geacht wordt waargenomen. @nl
label: له نوع محتوى @ar
definition: يربط بين مصدر وفئة تعكس الشكل الأساسي للتواصل الذي يتم فيه التعبير عن المحتوى والحس الإنساني الذي من المفترض أن يُنظر إليها من خلاله. @ar
scope note: يعكس نوع المحتوى أيضًا عدد الأبعاد المكانية ووجود أو عدم وجود الحركة التي يُقصد من خلالها إدراك المحتوى المعبر عنه في شكل صورة أو صور. @ar
label: aineiston sisältötyyppi @fi
definition: Liittää aineiston viestintämuotoon, jolla aineiston sisältö on ilmaistu sekä aistiin, jolla se on tarkoitus vastaanottaa. @fi
label: hat Inhaltstyp @de
definition: Setzt eine Ressource in Beziehung zu einer Kategorisierung, die zum einen die grundlegende Form der Kommunikation widerspiegelt, in der der Inhalt ausgedrückt wird, und zum andern die menschliche Wahrnehmung wiedergibt, durch die diese wahrgenommen werden soll. @de
scope note: Für Inhalt, der in Form eines Bilds oder mehrerer Bilder ausgedrückt wird, spiegelt der Inhaltstyp auch die Anzahl räumlicher Dimensionen wider, in denen der Inhalt wahrgenommen werden soll, sowie die Wahrnehmung von vorhandener oder nicht vorhandener Bewegung. @de
scope note: Sisältötyyppi kuvaa myös mahdollista kuvasisällön hahmottamiseen vaikuttavaa moniulotteisuutta ja liikettä. @fi
label: 有内容类型 @zh-hans
definition: 将一种资源与反映一个内容被表达所用通讯的基本形式和设计被感知的人类感觉的分类关联起来。 @zh-hans
scope note: 对于被设计以一种或多种被感知图像形式表达的内容，内容类型还反映空间维度数以及感知运动是否存在。 @zh-hans
label: tartalomtípusa a következő: @hu
definition: Hozzákapcsol egy forrást egy kategorizáláshoz, amely tükrözi a kommunikáció azon alapvető formáját, melyen a tartalom kifejezésre kerül, és amelyet emberi érzékszerven keresztüli érzékelésére szántak. @hu
scope note: A tartalomtípus a térbeli dimenziók számát és a mozgás jelenlétét vagy hiányát is tükrözi, amelyben kép vagy képek alakjában kifejezett tartalmat kívánnak érzékeltetni. @hu
label: İçerik türü ile ilişkilidir @tr
definition: Bir kaynağı, bir içeriğin ifade edildiği temel iletişim biçimini ve bunun algılanmasının amaçlandığı bir insan duyusunu yansıtan bir sınıflandırmayla ilişkilendirir. @tr
scope note: İçerik türü, ayrıca bir veya birden fazla görüntü biçiminde ifade edilen içeriğin algılanması amacıyla tasarlandığı mekânsal boyut sayısını ve hareketin varlığını veya yokluğunu yansıtır. @tr

has context of use
status: Published
lexical alias: contextOfUse.en
definition: Relates a nomen to the circumstances or situation in which an appellation of an entity is used.
type: Property
label: heeft context van gebruik @nl
label: له سياق للاستخدام @ar
definition: يربط بين تسمية وظروف أو موقف تم فيه استخدام تسمية لكيان. @ar
label: har kontekst for brug @da
definition: Relaterer et nomen til de omstændigheder eller situationer, hvor en betegnelse for en entitet bruges. @da
label: käyttökonteksti aineistolle @fi
definition: Liittää nomenin olosuhteeseen tai tilanteeseen, jossa entiteetin nimitystä käytetään. @fi
label: hat Verwendungskontext @de
definition: Setzt ein Nomen in Beziehung zu den Umständen oder der Situation, in denen/der eine Bezeichnung für eine Entität verwendet wird. @de
label: 有使用语境 @zh-hans
definition: 将一个命名与一个命名被使用的环境和情况关联起来。 @zh-hans
label: használati környezete a következő: @hu
definition: Hozzákapcsol egy noment egy körülményhez vagy szituációhoz, amelyben egy entitás megnevezését használják. @hu
label: kullanım bağlamı ile ilişkilidir @tr
definition: Bir ismi, bir varlığın adının kullanıldığı koşul veya durumla ilişkilendirir. @tr

is continuation of
status: Published
definition: Relates a resource to a resource that is a diachronic resource that is completed whose content is continued by another diachronic resource.
type: Property
sub property of: is preceded by
inverse of: is continued by
lexical alias: continuationOf.en
scope note: This element applies in general to a successive resource.
label: er fortsættelse af @da
definition: Relaterer en ressource til en ressource, der fortsættes af en senere ressources indhold. @da
scope note: Denne relation anvends generelt for periodika. @da
label: is voortzetting van @nl
label: هو استمرار لـ @ar
definition: يربط بين مصدر ومصدر ممتد زمنيًا ومكتمل، ومحتواه مستمر من خلال مصدر آخر ممتد زمنيًا. @ar
scope note: ينطبق هذا العنصر بشكل عام على مصدر متتالي. @ar
label: jatkoa aineistolle @fi
definition: Liittää aineiston aineistoon, joka on valmis diakroninen aineisto, jonka sisältöä jatkaa toinen diakroninen aineisto. @fi
scope note: Tämä elementti soveltuu yleensä peräkkäisesti ilmestyvään aineistoon. @fi
label: ist Fortsetzung von @de
definition: Setzt eine Ressource in Beziehung zu einer abgeschlossenen diachronen Ressource, deren Inhalt durch eine andere diachrone Ressource fortgeführt wird. @de
scope note: Im Allgemeinen trifft dieses Element auf eine sukzessive Ressource zu. @de
label: 是……的继承 @zh-hans
definition: 将一种资源与作为一种已完成的历时资源而且其内容被另一种历时资源继承的一种资源关联起来。 @zh-hans
scope note: 该元素一般适用于一种相继资源。 @zh-hans
label: folytatása a következőnek: @hu
definition: Hozzákapcsol egy forrást egy befejezett diakronikus forráshoz, amelynek tartalmát egy másik diakronikus forrás folytatja. @hu
scope note: Ez az elem általában a folyamatos forrásokra vonatkozik. @hu
label: devamıdır @tr
definition: Bir kaynağı, içeriği başka bir art zamanlı kaynak tarafından sürdürülen, tamamlanmış artzamanlı bir kaynak olan kaynakla ilişkilendirir. @tr
scope note: Bu öğe, genel olarak ardışık bir kaynak için geçerlidir. @tr

is continued by
status: Published
definition: Relates a resource to a resource that is a diachronic resource that continues the content of another diachronic resource that is completed.
type: Property
sub property of: is succeeded by
inverse of: is continuation of
lexical alias: continuedBy.en
scope note: This element applies in general to a successive resource.
label: er fortsat af @da
definition: Relaterer en ressource til en ressource, hvis indhold fortsætter en tidligere ressource med en ny titel. @da
scope note: Denne relation anvendes generelt for periodika. @da
label: is voortgezet door @nl
label: jatkettu aineisto @fi
label: هو مستمر عن طريق @ar
definition: يربط بين مصدر ومصدر ممتد زمنيًا ومستمر في محتوى مصدر آخر ممتد زمنيًا ومكتمل. @ar
scope note: ينطبق هذا العنصر بشكل عام على مصدر متتالي. @ar
definition: Liittää aineiston diakroniseen aineistoon, joka jatkaa toisen, valmiin diakronisen aineiston sisältöä. @fi
scope note: Tämä elementti soveltuu yleensä peräkkäisesti ilmestyvään aineistoon. @fi
label: ist fortgesetzt durch @de
definition: Setzt eine Ressource in Beziehung zu einer diachronen Ressource, die den Inhalt einer anderen abgeschlossenen diachronen Ressource fortführt. @de
scope note: Im Allgemeinen trifft dieses Element auf eine sukzessive Ressource zu. @de
label: 被……继承 @zh-hans
definition: 将一种资源与作为一种历时资源并继承另一种已经完成了的历时资源的内容的一种资源关联起来。 @zh-hans
scope note: 该元素一般适用于一种相继资源。 @zh-hans
label: folytatja a következő: @hu
definition: Hozzákapcsol egy forrást egy diakronikus forráshoz, amely egy másik, befejezett diakronikus forrás tartalmát folytatja. @hu
scope note: Ez az elem általában a folyamatos forrásokra vonatkozik. @hu
label: ile devam ettirilmiştir @tr
definition: Bir kaynağı, tamamlanmış başka bir artzamanlı kaynağın içeriğini sürdüren art zamanlı bir kaynak olan bir kaynakla ilişkilendirir. @tr
scope note: Bu öğe, genel olarak ardışık bir kaynak için geçerlidir. @tr

has contributor (Deprecated)
definition: Relates a resource to an agent who contributes to a resource. (Deprecated)
type: Property
scope note: Contributors include editors, translators, arrangers of music, performers, etc.. (Deprecated)
inverse of: is contributor of (Deprecated)
lexical alias: contributor.en
label: har bidragyder @da
definition: Relaterer en ressource til en agent, der bidrager til en ressource. @da
scope note: Bidragydere omfatter bl.a. redaktører, oversættere, musikarrangører, performere. @da
status: Deprecated
has subproperty: has abridger
has subproperty: has animator
has subproperty: has arranger of music
has subproperty: has art director
has subproperty: has audio engineer
has subproperty: has censor
has subproperty: has colourist
has subproperty: has contributor agent of still image
has subproperty: has costume designer
has subproperty: has court reporter
has subproperty: has DJ
has subproperty: has draftsman
has subproperty: has dubbing director
has subproperty: has editor (Deprecated
has subproperty: has editor of moving image resource
has subproperty: has lighting designer
has subproperty: has makeup artist
has subproperty: has minute taker
has subproperty: has musical director
has subproperty: has music programmer
has subproperty: has onscreen participant
has subproperty: has performer
has subproperty: has presenter
has subproperty: has production designer
has subproperty: has recording engineer
has subproperty: has recordist
has subproperty: has software developer
has subproperty: has sound designer
has subproperty: has special effects provider
has subproperty: has stage director
has subproperty: has surveyor
has subproperty: has transcriber
has subproperty: has translator
has subproperty: has visual effects provider
has subproperty: has writer of foreword (Deprecated)
has subproperty: has writer of supplementary textual content (Deprecated)

has contributor agent of cartography
status: Published
lexical alias: contributorAgentOfCartography.en
definition: Relates a resource to an agent who is a contributor to aggregate who creates a cartographic resource that is embodied by an aggregate.
type: Property
label: heeft bijdrager-actor van cartografie @nl
label: له وكيل مساهم برسم خرائط @ar
definition: يربط مصدر بوكيل مُساهم في التجميع الذي ينشأ عنه مصدر خرائطي تجسده تجميعية. @ar
label: har agent, som er bidragsyder til kartografi @da
definition: Relaterer en ressource til en agent, som er bidragsyder til en samling, der skaber en kartografisk ressource, der er omfattet af et aggregat. @da
label: kartografiaan osallinen toimija aineistossa @fi
definition: Liittää aineiston toimijaan, joka on osallinen aggregaattiin luomalla aggregaattiin sisältyvän kartografisen aineiston @fi
label: hat Beiträgerin/Beiträger einer Kartografie @de
definition: Setzt eine Ressource in Beziehung zu einer Beiträgerin/einem Beiträger zu einem Aggregat, die/der eine kartografische Ressource erstellt, die durch ein Aggregat verkörpert wird. @de
label: 有地图绘制贡献者行为者 @zh-hans
definition: 将一种资源与作为合集的一个贡献者并创建被一种合集具体化的一种地图资源的一个行为者关联起来。 @zh-hans
label: kartográfia közreműködő ágense a következő: @hu
definition: Hozzákapcsol egy forrást egy ágenshez, amely aggregátum közreműködőjeként olyan kartográfiai forrást hoz létre, amely egy aggregátumban testesül meg. @hu
label: kartografiye katkıda bulunan temsilci ile ilişkilidir @tr
definition: Bir kaynağı, bir topluluk tarafından somutlaştırılan bir kartografik kaynak oluşturan topluluğa katkıda bulunan bir temsilci ile ilişkilendirir. @tr

is contributor agent of cartography of
status: Published
definition: Relates an agent to a resource that is an aggregate that embodies a cartographic resource created by an agent.
type: Property
lexical alias: contributorAgentOfCartographyOf.en
label: is bijdrager-actor van cartografie van @nl
label: هو وكيل مساهم في رسم خرائط لـ @ar
definition: يربط بين وكيل ومصدر عبارة عن تجميعة تجسد مصدرًا رسم خرائطي أنشأه وكيل. @ar
label: er agent, som er bidragsyder til karotgrafi af @da
definition: Relaterer en agent til en ressource, som er en samling, der omfatter en kartografisk ressource, der er skabt af en agent. @da
label: kartografiaan osallinen toimija aineistossa @fi
definition: Liittää toimijan aineistoon, joka on toimijan luoman kartografisen aineiston sisältävä aggregaatti. @fi
label: ist Akteur als Beiträgerin/Beiträger einer Kartografie von @de
definition: Setzt einen Akteur in Beziehung zu einer Ressource, bei der es sich um ein Aggregat handelt, das eine von einem Akteur erschaffene kartografische Ressource verkörpert. @de
label: 是……的地图绘制的贡献者行为者 @zh-hans
definition: 将一个行为者与作为一种合集、把一个行为者所创作的一种地图资源具体化的一种资源关联起来。 @zh-hans
label: közreműködő ágense a következő kartográfiának: @hu
definition: Hozzákapcsol egy ágenst egy aggregátum forráshoz, amely egy ágens által létrehozott kartográfiai forrást testesít meg. @hu
label: kartografisinin katkıda bulunan temsilcisidir @tr
definition: Bir temsilciyi, bir temsilci tarafından oluşturulan kartografik bir kaynağı somutlaştıran toplayıcı bir kaynakla ilişkilendirir. @tr

has contributor agent of choreography
status: Published
lexical alias: contributorAgentOfChoreography.en
definition: Relates a resource to an agent who is a contributor to aggregate who creates a choreographic resource that is embodied by an aggregate.
type: Property
label: heeft bijdrager-actor van choreografie @nl
label: له وكيل مساهم بتصميم رقصات @ar
definition: يربط مصدر بوكيل مُساهم في التجميع الذي ينشأ عنه مصدر تصميم الرقصات تجسده تجميعية. @ar
label: har agent, som er bidragsyder til koreografi @da
definition: Relaterer en ressource til en agent, som er bidragsyder til en samling, der skaber en koreografisk ressource, der er omfattet af et aggregat. @da
label: koreografiaan osallinen toimija aineistossa @fi
definition: Liittää aineiston toimijaan, joka on osallinen aggregaattiin luomalla aggregaattiin sisältyvän koreografisen aineiston. @fi
label: hat Beiträgerin/Beiträger einer Choreografie @de
definition: Setzt eine Ressource in Beziehung zu einer Beiträgerin/einem Beiträger zu einem Aggregat, die/der eine choreografische Ressource erstellt, die durch ein Aggregat verkörpert wird. @de
label: 有编舞贡献者行为者 @zh-hans
definition: 将一种资源与作为合集的一个贡献者并创建被一种合集具体化的一种编舞资源的一个行为者关联起来。 @zh-hans
label: koreográfia közreműködő ágense a következő: @hu
definition: Hozzákapcsol egy forrást egy ágenshez, amely aggregátum közreműködőjeként olyan koreografikus forrást hoz létre, amely egy aggregátumban testesül meg. @hu
label: koreografiye katkıda bulunan temsilci ile ilişkilidir @tr
definition: Bir kaynağı, bir topluluk tarafından somutlaştırılan bir koreografik kaynak oluşturan topluluğa katkıda bulunan bir temsilci ile ilişkilendirir. @tr

is contributor agent of choreography of
status: Published
definition: Relates an agent to a resource that is an aggregate that embodies a choreographic resource created by an agent.
type: Property
lexical alias: contributorAgentOfChoreographyOf.en
label: is bijdrager-actor van choreografie van @nl
label: هو وكيل مساهم في فن تصميم الرقصات لـ @ar
definition: يربط بين وكيل ومصدر عبارة عن تجميعة تجسد مصدرًا راقص أنشأه وكيل @ar
label: er agent, som er bidragsyder til koreografi af @da
definition: Relaterer en agent til en ressource, som er en samling, der omfatter en koreografisk ressource, der er skabt af en agent. @da
label: koreografiaan osallinen toimija aineistossa @fi
definition: Liittää toimijan aineistoon, joka on toimijan luoman koreografisen aineiston sisältävä aggregaatti @fi
label: ist Akteur als Beiträgerin/Beiträger einer Choreografie von @de
definition: Setzt einen Akteur in Beziehung zu einer Ressource, bei der es sich um ein Aggregat handelt, das eine von einem Akteur erschaffene choreografische Ressource verkörpert. @de
label: 是……的编舞的贡献者行为者 @zh-hans
definition: 将一个行为者与作为一种合集、把一个行为者所创作的一种编舞资源具体化的一种资源关联起来。 @zh-hans
label: közreműködő ágense a következő koreográfiának: @hu
definition: Hozzákapcsol egy ágenst egy aggregátum forráshoz, amely egy ágens által létrehozott koreografikus forrást testesít meg. @hu
label: koreografisinin katkıda bulunan temsilcisidir @tr
definition: Bir temsilciyi, bir temsilci tarafından oluşturulan koreografik bir kaynağı somutlaştıran toplayıcı bir kaynakla ilişkilendirir. @tr

has contributor agent of computer content
status: Published
lexical alias: contributorAgentOfComputerContent.en
definition: Relates a resource to an agent who is a contributor to aggregate who creates computer content that is embodied by an aggregate.
type: Property
label: heeft bijdrager-actor van computercontent @nl
label: له وكيل مساهم بمحتوى كمبيوتر @ar
definition: يربط مصدر بوكيل مُساهم في التجميع الذي ينشأ عنه مصدر كمبيوتر تجسده تجميعية. @ar
label: har agent, som er bidragsyder til computerindhold @da
definition: Relaterer en ressource til en agent, som er bidragsyder til en samling, der skaber computerindhold, der er omfattet af en samling. @da
label: digitaaliseen sisältöön osallinen toimija aineistossa @fi
definition: digitaaliseen sisältöön osallinen toimija aineistossa @fi
label: hat Beiträgerin/Beiträger von Computer Content @de
definition: Setzt eine Ressource in Beziehung zu einer Beiträgerin/einem Beiträger zu einem Aggregat, die/der Computer Content erstellt, der durch ein Aggregat verkörpert wird. @de
label: 有计算机内容贡献者行为者 @zh-hans
definition: 将一种资源与作为合集的一个贡献者并创建被一种合集具体化的一种计算机内容的一个行为者关联起来。 @zh-hans
label: számítógépes tartalom közreműködő ágense a következő: @hu
definition: Egy megjelenési formát hozzákapcsol egy ágenshez, amely aggregátum közreműködőjeként olyan számítógépes tartalmat hoz létre, amely egy aggregátumban testesül meg. @hu
label: bilgisayar içeriğine katkıda bulunan temsilci ile ilişkilidir @tr
definition: Bir kaynağı, bir topluluk tarafından somutlaştırılan bir bir bilgisayar içeriği oluşturan topluluğa katkıda bulunan bir temsilci ile ilişkilendirir. @tr

is contributor agent of computer content of
status: Published
lexical alias: contributorAgentOfComputerContentOf.en
definition: Relates an agent to a resource that is an aggregate that embodies computer content created by an agent.
type: Property
label: is bijdrager-actor van computercontent van @nl
label: هو وكيل مساهم في محتوى حاسب آلي لـ @ar
definition: يربط بين وكيل ومصدر عبارة عن تجميعة تجسد محتوى حاسب آلي أنشأه وكيل. @ar
label: er agent, som er bidragsyder for computerindhold af. @da
definition: Relaterer en agent til en ressource, som er en samling, der omfatter computerindhold, der er skabt af en agent. @da
label: digitaaliseen sisältöön osallinen toimija aineistossa @fi
definition: Liittää toimijan aineistoon, joka on aggregaatti, joka sisältää toimjan luoman digitaalisen sisällön. @fi
label: ist Akteur ist Beiträgerin/Beiträger von Computer Content von @de
definition: Setzt einen Akteur in Beziehung zu einer Ressource, bei der es sich um ein Aggregat handelt, das von einem Akteur erschaffenen Computer Content verkörpert. @de
label: 是……的计算机内容贡献者行为者 @zh-hans
definition: 将一个行为者与作为一种合集、把一个行为者所创作的一种计算机内容具体化的一种资源关联起来。 @zh-hans
label: közreműködő ágense a következő számítógépes tartalomnak: @hu
definition: Hozzákapcsol egy ágenst egy aggregátum forráshoz, amely egy ágens által létrehozott számítógépes tartalmat testesít meg. @hu
label: bilgisayar içeriğinin katkıda bulunan temsilcisidir @tr
definition: Bir temsilciyi, bir temsilci tarafından oluşturulan bilgisayar içeriğini somutlaştıran toplayıcı bir kaynakla ilişkilendirir. @tr

has contributor agent of moving image
status: Published
lexical alias: contributorAgentOfMovingImage.en
definition: Relates a resource to an agent who is a contributor to aggregate who creates a moving image resource that is embodied by an aggregate.
type: Property
label: heeft bijdrager-actor van bewegend beeld @nl
label: له وكيل مساهم بصور متحركة @ar
definition: يربط مصدر بوكيل مُساهم في التجميع الذي ينشأ عنه مصدر من صور متحركة تجسده تجميعية. @ar
label: har agent, som er bidragsyder til levende billeder @da
definition: Relaterer en ressource til en agent, som er bidragsyder til en samling, der skaber en ressource med levende billeder, der omfattes af en samling. @da
label: liikkuvaan kuvaan osallinen toimija aineistossa @fi
definition: Liittää aineiston toimijaan, joka osallistuu aggregaattiin luomalla aggregaattiin sisältyvän liikkuvan kuvan aineiston. @fi
label: hat Beiträgerin/Beiträger von einem Bewegtbild @de
definition: Setzt eine Ressource in Beziehung zu einer Beiträgerin/einem Beiträger zu einem Aggregat, die/der eine Bewegtbildressource erstellt, die durch ein Aggregat verkörpert wird. @de
label: 有动态图像的贡献者行为者 @zh-hans
definition: 将一种资源与作为合集的一个贡献者并创建被一种合集具体化的一种动态图像资源的一个行为者关联起来。 @zh-hans
label: mozgókép közreműködő ágense a következő: @hu
definition: Hozzákapcsol egy forrást egy ágenshez, amely aggregátum közreműködőjeként olyan mozgóképforrást hoz létre, amely egy aggregátumban testesül meg. @hu
label: hareketli görüntüye katkıda bulunan temsilci ile ilişkilidir @tr
definition: Bir kaynağı, bir topluluk tarafından somutlaştırılan bir hareketli görüntü oluşturan topluluğa katkıda bulunan bir temsilci ile ilişkilendirir. @tr

is contributor agent of moving image of
status: Published
lexical alias: contributorAgentOfMovingImageOf.en
definition: Relates an agent to a resource that is an aggregate that embodies a moving image resource created by an agent.
type: Property
label: is bijdrager-actor van bewegend beeld van @nl
label: هو وكيل مساهم في صور متحركة لـ @ar
definition: يربط بين وكيل ومصدر عبارة عن تجميعة تجسد مصدر صور متحركة أنشأه وكيل. @ar
label: er agent, som er bidragsyder for levende billeder af. @da
definition: Relaterer en agent til en ressource, som er en samling, der omfatter en ressource med levende billeder, der er skabt af en agent. @da
label: liikkuvaan kuvaan osallinen toimija aineistossa @fi
definition: Liittää toimijan aineistoon, joka on aggregaatti, joka sisältää toimijan luoman liikkuvan kuvan aineiston. @fi
label: ist Akteur als Beiträgerin/Beiträger von einem Bewegtbild von @de
definition: Setzt einen Akteur in Beziehung zu einer Ressource, bei der es sich um ein Aggregat handelt, das eine von einem Akteur erschaffene Bewegtbildressource verkörpert. @de
label: 是……的动态图像的贡献者行为者 @zh-hans
definition: 将一个行为者与作为一种合集、把一个行为者所创作的一种动态图像资源具体化的一种资源关联起来。 @zh-hans
label: közreműködő ágense a következő mozgóképnek: @hu
definition: Hozzákapcsol egy ágenst egy aggregátum forráshoz, amely egy ágens által létrehozott mozgóképforrást testesít meg. @hu
label: hareketli görüntüsünün katkıda bulunan temsilcisidir @tr
definition: Bir temsilciyi, bir temsilci tarafından oluşturulan hareketli bir görüntü kaynağını somutlaştıran toplayıcı kaynakla ilişkilendirir. @tr

has contributor agent of music
status: Published
lexical alias: contributorAgentOfMusic.en
definition: Relates a resource to an agent who is a contributor to aggregate who creates a musical resource that is embodied by an aggregate.
type: Property
label: heeft bijdrager-actor van muziek @nl
label: له وكيل مساهم بموسيقى @ar
definition: يربط مصدر بوكيل مُساهم في التجميع الذي ينشأ عنه مصدر موسيقي تجسده تجميعية. @ar
label: har agent, som er bidragsyder til musik @da
definition: Relaterer en ressource til en agent, som er bidragsyder til en samling, der skaber en musikressource, der er omfattet af en samling. @da
label: musiikkiin osaallinen toimija aineistossa @fi
definition: Liittää aineiston toimijaan, joka osallistuu aggregaattiin luomalla aggregaattiin sisältyvän musiikkiaineiston @fi
label: hat Beiträgerin/Beiträger einer Musik @de
definition: Setzt eine Ressource in Beziehung zu einer Beiträgerin/einem Beiträger zu einem Aggregat, die/der eine Musikressource erstellt, die durch ein Aggregat verkörpert wird. @de
label: 有音乐的贡献者行为者 @zh-hans
definition: 将一种资源与作为合集的一个贡献者并创建被一种合集具体化的一种音乐资源的一个行为者关联起来。 @zh-hans
label: zene közreműködő ágense a következő: @hu
definition: Hozzákapcsol egy forrást egy ágenshez, amely aggregátum közreműködőjeként olyan zenei forrást hoz létre, amely egy aggregátumban testesül meg. @hu
label: müziğe katkıda bulunan temsilci ile ilişkilidir @tr
definition: Bir kaynağı, bir topluluk tarafından somutlaştırılan bir müzikal kaynak oluşturan topluluğa katkıda bulunan bir temsilci ile ilişkilendirir. @tr

is contributor agent of music of
status: Published
lexical alias: contributorAgentOfMusicOf.en
definition: Relates an agent to a resource that is an aggregate that embodies a musical resource created by an agent.
type: Property
label: is bijdrager-actor van muziek van @nl
label: هو وكيل مساهم في موسيقى لـ @ar
definition: يربط بين وكيل ومصدر عبارة عن تجميعة تجسد مصدرًا موسيقيًا ألفه وكيل. @ar
label: er agent, som er bidragsyder til musik af @da
definition: Relaterer en agent til en ressource, som er en samling, der omfatter en musikressource, der er skabt af en agent. @da
label: musiikkiin osallinen toimija aineistossa @fi
definition: Liittää toimijan aineistoon, joka on toimijan luoman musiikkiaineiston sisältävä aggregaatti. @fi
label: ist Akteur als Beiträgerin/Beiträger einer Musik von @de
definition: Setzt einen Akteur in Beziehung zu einer Ressource, bei der es sich um ein Aggregat handelt, das eine von einem Akteur erschaffene Musikressource verkörpert. @de
label: 是……的音乐的贡献者行为者 @zh-hans
definition: 将一个行为者与作为一种合集、把一个行为者所创作的一种音乐资源具体化的一种资源关联起来。 @zh-hans
label: közreműködő ágense a következő zenének: @hu
definition: Hozzákapcsol egy ágenst egy aggregátum forráshoz, amely egy ágens által létrehozott zenei forrást testesít meg. @hu
label: müziğinin katkıda bulunan temsilcisidir @tr
definition: Bir temsilciyi, bir temsilci tarafından oluşturulan müzikal bir kaynağı somutlaştıran toplayıcı bir kaynakla ilişkilendirir. @tr

has contributor agent of object
status: Published
lexical alias: contributorAgentOfObject.en
definition: Relates a resource to an agent who is a contributor to aggregate who creates an object resource that is embodied by an aggregate.
type: Property
label: heeft bijdrager-actor van object @nl
label: له وكيل مساهم بكائن @ar
definition: يربط مصدر بوكيل مُساهم في التجميع الذي ينشأ عنه مصدر كائن تجسده تجميعية. @ar
label: har agent, som er bidragsyder til objekt @da
definition: Relaterer en ressource til en agent, som er bidragsyder til en samling, der skaber en ressource, som er et objekt, der er omfattet af en samling @da
label: esineeseen osallinen toimija aineistossa @fi
definition: Liittää aineiston toimijaan, joka osallistuu aggregaattiin luomalla aggregaattiin sisältyvän esineaineiston. @fi
label: hat Beiträgerin/Beiträger von einem Gegenstand @de
definition: Setzt eine Ressource in Beziehung zu einer Beiträgerin/einem Beiträger zu einem Aggregat (Akteur), die/der eine gegenständliche Ressource erstellt, die durch ein Aggregat verkörpert wird. @de
label: 有物体的贡献者行为者 @zh-hans
definition: 将一种资源与作为合集的一个贡献者并创建被一种合集具体化的一种物体资源的一个行为者关联起来。 @zh-hans
label: objektum közreműködő ágense a következő: @hu
definition: Hozzákapcsol egy forrást egy ágenshez, amely aggregátum közreműködőjeként olyan objektumforrást hoz létre, amely egy aggregátumban testesül meg. @hu
label: nesneye katkıda bulunan temsilci ile ilişkilidir @tr
definition: Bir kaynağı, bir topluluk tarafından somutlaştırılan bir nesne kaynağı oluşturan topluluğa katkıda bulunan bir temsilciile ilişkilendirir. @tr

is contributor agent of object of
status: Published
lexical alias: contributorAgentOfObjectOf.en
definition: Relates an agent to a resource that is an aggregate that embodies an object resource created by an agent.
type: Property
label: is bijdrager-actor van object van @nl
label: هو وكيل مساهم في كائن لـ @ar
definition: يربط بين مصدر ومصدر عبارة عن تجميعة تجسد مصدرًا كائنًا أنشأه وكيل. @ar
label: er agent, som er bidragsyder for objekt af @da
definition: Relaterer en agent til en ressourece, som er en samling, der omfatter en ressource, der er et objekt, der er skabt af en agent. @da
label: esineeseen osallinen toimija aineistossa @fi
definition: Liittää toimijan aineistoon, joka on toimijan luoman esineaineiston sisältävä aggregaatti. @fi
label: ist Akteur als Beiträgerin/Beiträger von einem Gegenstand von @de
definition: Setzt einen Akteur in Beziehung zu einer Ressource, bei der es sich um ein Aggregat handelt, das eine von einem Akteur erschaffene gegenständliche Ressource verkörpert. @de
label: 是……的物体的贡献者行为者 @zh-hans
definition: 将一个行为者与作为一种合集、把一个行为者所创作的一种物体资源具体化的一种资源关联起来。 @zh-hans
label: közreműködő ágense a következő objektumnak: @hu
definition: Hozzákapcsol egy ágenst egy aggregátum forráshoz, amely egy ágens által létrehozott objektumforrást testesít meg. @hu
label: nesnesinin katkıda bulunan temsilcisidir @tr
definition: Bir temsilciyi, bir temsilci tarafından oluşturulan bir nesne kaynağını somutlaştıran toplayıcı bir kaynakla ilişkilendirir. @tr

has contributor agent of speech
status: Published
lexical alias: contributorAgentOfSpeech.en
definition: Relates a resource to an agent who is a contributor to aggregate who creates a spoken word resource that is embodied by an aggregate.
type: Property
label: heeft bijdrager-actor van spraak @nl
label: له وكيل مساهم بحديث @ar
definition: يربط مصدر بوكيل مُساهم في التجميع الذي ينشأ عنه مصدر من كلمات منطوقة تجسده تجميعية. @ar
label: har agent, som er bidragsyder til tale @da
definition: Relaterer en ressource til en agent, som er bidragsyder til en samling, der skaber en ressource med talet ord, der er omfattet af en samling. @da
label: puheeseen osallinen toimija aineistossa @fi
definition: Liittää aineiston toimijaan, joka on osallinen aggregaattiin luomalla aggregaattiin sisältyvän puheaineiston. @fi
label: hat Beiträgerin/Beiträger von einer Rede @de
definition: Setzt eine Ressource in Beziehung zu einer Beiträgerin/einem Beiträger zu einem Aggregat (Akteur), die/der eine gesprochene Ressource erstellt, die durch ein Aggregat verkörpert wird. @de
label: 有讲话的贡献者行为者 @zh-hans
definition: 将一种资源与作为合集的一个贡献者并创建被一种合集具体化的一种口语资源的一个行为者关联起来。 @zh-hans
label: beszéd közreműködő ágense a következő: @hu
definition: Hozzákapcsol egy forrást egy ágenshez, amely aggregátum közreműködőjeként olyan beszélt forrást hoz létre, amely egy aggregátumban testesül meg. @hu
label: konuşmaya katkıda bulunan temsilci ile ilişkilidir @tr
definition: Bir kaynağı, bir topluluk tarafından somutlaştırılan bir söylenen söz kaynağı oluşturan topluluğa katkıda bulunan bir temsilci ile ilişkilendirir. @tr

is contributor agent of speech of
status: Published
lexical alias: contributorAgentOfSpeechOf.en
definition: Relates an agent to a resource that is an aggregate that embodies a spoken word resource created by an agent.
type: Property
label: is bijdrager-actor van spraak van @nl
label: هو وكيل مساهم في حديث لـ @ar
definition: يربط بين وكيل ومصدر عبارة عن تجميعة تجسد مصدرًا بكلمات منطوقة أنشأه وكيل. @ar
label: er agent, som er bidragsyder til tale af @da
definition: Relaterer en agent til en ressource, som er en samling, der omfatter en ressource med talt ord, der er skabt af en agent. @da
label: Liittää aineiston toimijaan, joka on osallinen aggregaattiin luomalla aggregaattiin sisältyvän liikkuvan puheaineiston. @fi
definition: Liittää toimijan aineistoon, joka on toimijan luoman puheaineiston sisältävä aggregaatti. @fi
label: ist Akteur als Beiträgerin/Beiträger von einer Rede von @de
definition: Setzt einen Akteur in Beziehung zu einer Ressource, bei der es sich um ein Aggregat handelt, das eine von einem Akteur erschaffene gesprochene Ressource verkörpert. @de
label: 是……的讲话的贡献者行为者 @zh-hans
definition: 将一个行为者与作为一种合集、把一个行为者所创作的一种口语资源具体化的一种资源关联起来。 @zh-hans
label: közreműködő ágense a következő beszédnek: @hu
definition: Hozzákapcsol egy ágenst egy aggregátum forráshoz, amely egy ágens által létrehozott beszélt forrást testesít meg. @hu
label: konuşmasının katkıda bulunan temsilcisidir @tr
definition: Bir temsilciyi, bir temsilci tarafından oluşturulan sözlü bir kaynağı somutlaştıran toplayıcı bir kaynakla ilişkilendirir. @tr

is contributor of (Deprecated)
definition: Relates an agent to a resource that includes a contribution. (Deprecated)
type: Property
inverse of: has contributor (Deprecated)
lexical alias: contributorOf.en
label: er bidragyder til @da
definition: Relaterer en agent der bidrager til en ressource til en ressource. @da
status: Deprecated
has subproperty: is abridger of
has subproperty: is animator of
has subproperty: is arranger of music of
has subproperty: is art director of
has subproperty: is censor of
has subproperty: is colourist of
has subproperty: is contributor agent of still image of
has subproperty: is costume designer of
has subproperty: is court reporter of
has subproperty: is draftsman of
has subproperty: is editor of
has subproperty: is editor of moving image resource of
has subproperty: is lighting designer of
has subproperty: is makeup artist of
has subproperty: is minute taker of
has subproperty: is musical director of
has subproperty: is onscreen participant of
has subproperty: is performer of
has subproperty: is presenter of
has subproperty: is production designer of
has subproperty: is recording engineer of
has subproperty: is recordist of
has subproperty: is software developer of
has subproperty: is sound designer of
has subproperty: is special effects provider of
has subproperty: is stage director of
has subproperty: is surveyor of
has subproperty: is transcriber of
has subproperty: is translator of
has subproperty: is visual effects provider of
has subproperty: is writer of foreword of (Deprecated)
has subproperty: is writer of supplementary content of (Deprecated)

has contributor agent of still image
status: Published
definition: Relates a resource to an agent who is a contributor to aggregate who creates a still image resource that is embodied by an aggregate.
type: Property
sub property of: has contributor (Deprecated)
inverse of: is contributor agent of still image of
lexical alias: contributorAgentOfStillImage.en
label: har illustrator @da
definition: Relaterer en ressource til en agent, der har bidraget til en ressource ved at supplere hovedindholdet med tegninger, diagrammer, fotos etc. @da
scope note: Skabelse af primært kunstnerisk indhold er ikke omfattet. @da
label: heeft bijdrager-actor van stilstaand beeld @nl
label: stillkuvaan osallinen toimija aineistossa @fi
label: له وكيل مساهم في صور ثابتة @ar
definition: يربط مصدر بوكيل مُساهم في عمل تجميعي بإنشاء مصدر صور ثابتة يتجسد في تجميعية. @ar
definition: Liittää aineiston toimijaan, joka joka on luonut aggregaattiin sisältyvän stillkuva-aineiston. @fi
label: hat Illustratorin/Illustrator @de
definition: Setzt eine Ressource in Beziehung zu einer Beiträgerin/einem Beiträger zu einem Aggregat, die/der eine unbewegte Bildressource erstellt, die durch ein Aggregat verkörpert wird. @de
label: 有静态图像的贡献者行为者 @zh-hans
definition: 将一种资源与作为合集的一个贡献者并创建被一种合集具体化的一种静态图像资源的一个行为者关联起来。 @zh-hans
label: állókép közreműködő ágense a következő: @hu
definition: Hozzákapcsol egy forrást egy ágenshez, amely aggregátum közreműködőjeként olyan állóképforrást hoz létre, amely egy aggregátumban testesül meg. @hu
has subproperty: has letterer
label: durağan görüntüye katkıda bulunan temsilci ile ilişkilidir @tr
definition: Bir kaynağı, bir topluluk tarafından somutlaştırılan bir durağan görüntü kaynağı oluşturan topluluğa katkıda bulunan bir temsilci ile ilişkilendirir. @tr

is contributor agent of still image of
status: Published
definition: Relates an agent to a resource that is an aggregate that embodies a still image resource created by an agent.
type: Property
sub property of: is contributor of (Deprecated)
inverse of: has contributor agent of still image
lexical alias: contributorAgentOfStillImageOf.en
see also: is artist of
label: er illustrator til @da
definition: Relaterer en agent, der har bidraget til en ressource ved at supplere hovedindholdet med tegninger, diagrammer, fotos etc. til en ressource. @da
label: is bijdrager-actor van stilstaand beeld van @nl
label: هو وكيل مساهم في صور ثابتة لـ @ar
definition: يربط بين وكيل ومصدر عبارة عن تجميعة تجسد مصدر صور ثابتة أنشأه وكيل. @ar
label: stillkuvaan osallinen (toimija) aineistossatoimija @fi
definition: Liittää toimijan aineistoon, jossa toimija on osallisena luomalla aggregaattiin sisältyvän stillkuva-aineiston. @fi
label: ist Akteur als Illustratorin/Illustrator von @de
definition: Setzt einen Akteur in Beziehung zu einer Ressource, bei der es sich um ein Aggregat handelt, das eine von einem Akteur erschaffene unbewegte Bildressource verkörpert. @de
label: 是……的静态图像的贡献者行为者 @zh-hans
definition: 将一个行为者与作为一种合集、把一个行为者所创作的一种静态图像资源具体化的一种资源关联起来。 @zh-hans
label: közreműködő ágense a következő állóképnek: @hu
definition: Hozzákapcsol egy ágenst egy aggregátum forráshoz, amely egy ágens által létrehozott állóképforrást testesít meg. @hu
has subproperty: is letterer of
label: durağan görüntüsüne katkıda bulunan temsilcisidir @tr
definition: Bir temsilciyi, bir temsilci tarafından oluşturulan hareketsiz bir görüntü kaynağını somutlaştıran toplayıcı bir kaynakla ilişkilendirir. @tr

has contributor agent of text
status: Published
lexical alias: contributorAgentOfText.en
definition: Relates a resource to an agent who is a contributor to aggregate who creates a textual resource that is embodied by an aggregate.
type: Property
label: heeft bijdrager-actor van tekst @nl
label: له وكيل مساهم بنص @ar
definition: يربط مصدر بوكيل مُساهم في التجميع الذي ينشأ عنه مصدر نصي تجسده تجميعية. @ar
label: har agent, som er bidragsyder til tekst @da
definition: Relaterer en ressource til en agent, som er bidragsyder til en samling, der skaber en tekstressource, der er omfattet af en samling. @da
label: tekstiin osallinen toimija aineistossa @fi
definition: Liittää aineiston toimijaan, joka on osallinen aggregaattiin luomalla aggregaattiin sisältyvän tekstiaineiston. @fi
label: hat Beiträgerin/Beiträger von ergänzendem Text @de
definition: Setzt eine Ressource in Beziehung zu einer Beiträgerin/einem Beiträger zu einem Aggregat, die/der eine textliche Ressource erstellt, die durch ein Aggregat verkörpert wird. @de
label: 有文本的贡献者行为者 @zh-hans
definition: 将一种资源与作为合集的一个贡献者并创建被一种合集具体化的一种文字作品的一个行为者关联起来。 @zh-hans
label: szöveg közreműködő ágense a következő: @hu
definition: Hozzákapcsol egy forrást egy ágenshez, amely aggregátum közreműködőjeként olyan szöveges forrást hoz létre, amely egy aggregátumban testesül meg. @hu
label: metne katkıda bulunan temsilci ile ilişkilidir @tr
definition: Bir kaynağı, bir topluluk tarafından somutlaştırılan bir metin kaynağı oluşturan topluluğa katkıda bulunan bir temsilci ile ilişkilendirir. @tr

is contributor agent of text of
status: Published
definition: Relates an agent to a resource that is an aggregate that embodies a textual resource created by an agent.
type: Property
lexical alias: contributorAgentOfTextOf.en
label: is bijdrager-actor van tekst van @nl
label: هو وكيل مساهم في نص لـ @ar
definition: يربط بين وكيل ومصدر عبارة عن تجميعية تجسد مصدر نصي أنشأه وكيل. @ar
label: er agent, som er bidragsyder til tekst af @da
definition: Relaterer en agent til en ressource, som er en samling, der omfatter en tekstressource, der er skabt af en agent. @da
label: tekstiin osallinen toimija aineistossa @fi
definition: Liittää toimijan aineistoon, joka on toimijan luoman tekstiaineiston sisältävä aggregaatti. @fi
label: ist Akteur als Beiträgerin/Beiträger von ergänzendem Text von @de
definition: Setzt einen Akteur in Beziehung zu einer Ressource, bei der es sich um ein Aggregat handelt, das eine von einem Akteur erschaffene textliche Ressource verkörpert. @de
label: 是……的文本的贡献者行为者 @zh-hans
definition: 将一个行为者与作为一种合集、把一个行为者所创作的一种文字资源具体化的一种资源关联起来。 @zh-hans
label: közreműködő ágense a következő szövegnek: @hu
definition: Hozzákapcsol egy ágenst egy aggregátum forráshoz, amely egy ágens által létrehozott szöveges forrást testesít meg. @hu
label: metninin katkıda bulunan temsilcisidir @tr
definition: Bir temsilciyi, bir temsilci tarafından oluşturulan metinsel bir kaynağı somutlaştıran toplayıcı bir kaynakla ilişkilendirir. @tr

has contributor agent to aggregate
status: Published
lexical alias: contributorAgentToAggregatedContent.en
definition: Relates a resource to an agent who is responsible for creating a resource that is embodied by an aggregate.
type: Property
inverse of: is contributor agent to aggregate of
label: heeft bijdrager-actor aan aggregaat @nl
label: له كيل مساهم في تجميعة @ar
definition: يربط مصدر بوكيل مسؤول عن إنشاء مصدر يتجسد في تجميعية. @ar
label: har agent, som er bidragsyder til samling @da
definition: Relaterer en ressource til en agent, som er ansvarlig for at skabe en ressource der er indeholdt i en samling. @da
label: aggregaattiin osallinen toimija @fi
definition: Liittää aineiston toimijaan, joka vastaa aggregaattiin sisältyvän aineiston luomisesta. @fi
label: hat Beiträgerin/Beiträger zu einem Aggregat @de
definition: Setzt eine Ressource in Beziehung zu einem Akteur, der für die Schaffung einer Ressource verantwortlich ist, die durch ein Aggregat verkörpert wird. @de
label: 有合集的贡献者行为者 @zh-hans
definition: 将一种资源与负责创建被一种合集具体化的一种资源的一个行为者关联起来。 @zh-hans
label: aggregátum közreműködő ágense a következő: @hu
definition: Hozzákapcsol egy forrást egy ágenshez, amely egy aggregátumban megtestesülő forrást hoz létre. @hu
label: toplamaya katkıda bulunan temsilci ile ilişkilidir @tr
definition: Bir kaynağı, bir topluluk tarafından somutlaştırılan bir kaynak oluşturmaktan sorumlu olan temsilci ile ilişkilendirir. @tr

is contributor agent to aggregate of
status: Published
lexical alias: contributorAgentToAggregateOf.en
definition: Relates an agent to a resource that is an aggregate that includes a contribution by an agent.
type: Property
label: is bijdrager-actor aan aggregaat van @nl
label: هو وكيل مساهم في تجميعة لـ @ar
definition: يربط بين وكيل ومصدر عبارة عن تجميعة تتضمن إسهام وكيل. @ar
label: er agent som er bidragsyder til samling af @da
definition: Relaterer en agent til en ressource, som er en samling, der omfatter et bidrag af en agent. @da
label: aggregaattiaineistoon osallinen toimija @fi
definition: Liittää toimijan aineistoon, jossa toimija on osallisena sellaisen aineiston tekemisessä, joka on aggregaatti. @fi
label: ist Akteur als Beiträgerin/Beiträger zu einem Aggregat von @de
definition: Setzt einen Akteur in Beziehung zu einem Aggregat (Ressource), das einen Beitrag eines Akteurs enthält. @de
label: 是……的合集的贡献者行为者 @zh-hans
definition: 将一个行为者与作为一种合集并包括一个行为者之贡献的一种资源关联起来。 @zh-hans
label: közreműködő ágense a következő aggregátumnak: @hu
definition: Hozzákapcsol egy ágenst egy aggregátum forráshoz, amely magában foglalja az ágens közreműködését. @hu
label: toplanmasına katkıda bulunan temsilcidir @tr
definition: Bir temsilciyi, bir temsilcinin katkısını içeren toplayıcı bir kaynakla ilişkilendirir. @tr

has contributor agent to amalgamation
status: Published
definition: Relates a resource to an agent who contributes to a resource that is a seamless mix of kinds of content.
type: Property
inverse of: is contributor agent to amalgamation of
lexical alias: contributorAgentToAmalgamation.en
label: heeft bijdrager-actor aan amalgamering @nl
label: له وكيل مساهم في دمج @ar
definition: يربط مصدر بوكيل يُساهم في مصدر من خلال مزج سلس لأنواع من المحتوى. @ar
label: har agent, som er bidragsyder til sammensmæltning @da
definition: Relaterer en ressource til en agent, som bidrager til en ressource, der er en sømløs blandning af ityper af indhold. @da
label: yhdistymään osallinen toimija aineistossa @fi
definition: Liittää aineiston toimijaan, joka osallistuu sellaisen aineiston tekemiseen, joka on saumaton yhdistelmä erilaisia sisältöjä. @fi
label: hat Beiträgerin/Beiträger zu einer Verschmelzung @de
definition: Setzt eine Ressource in Beziehung zu einem Akteur, der zu einer Ressource, die eine nahtlose Mischung von Inhalten darstellt, beiträgt. @de
label: 有融合体的贡献者行为者 @zh-hans
definition: 将一种资源与对作为各种内容无缝融合的一种资源作出贡献的一个行为者关联起来。 @zh-hans
label: vegyes tartalom közreműködő ágense a következő: @hu
definition: Hozzákapcsol egy forrást egy ágenshez, amely egy olyan forráshoz járul hozzá, amely egy tartalom fajtáinak szabad keveréke. @hu
label: birleşmeye katkıda bulunan temsilci ile ilişkilidir @tr
definition: Bir kaynağı, içerik türlerinin kesintisiz bir karışımı olan bir kaynağa katkıda bulunan bir temsilci ile ilişkilendirir. @tr

is contributor agent to amalgamation of
status: Published
lexical alias: contributorAgentToAmalgamationOf.en
definition: Relates an agent to a resource that includes a contribution by an agent to a seamless mix of kinds of content
type: Property
label: is bijdrager-actor aan amalgamering van @nl
label: هو وكيل مساهم في دمج لـ @ar
definition: يربط بين وكيل ومصدر يتضمن إسهام وكيل في مزج سلس لأنواع من المحتوى. @ar
label: er agent som er bidragsyder til sammensmæltning af @da
definition: Relaterer en agent til en ressource, som omfatter et bidrag af en agent til en sømløs blanding af typer af indhold. @da
label: aineiston yhdistymään osallinen toimija @fi
definition: Liittää toimijan aineistoon, jossa toimija on osallisena sellaisen aineiston tekemiseen, joka on saumaton yhdistelmä erilaisia sisältöjä. @fi
label: Akteur als Beiträgerin/Beiträger zu einer Verschmelzung von @de
definition: Setzt einen Akteur in Beziehung zu einer Ressource, bei der ein Akteur zu einer nahtlosen Mischung von Inhalten beiträgt. @de
label: 是……的融合体的贡献者行为者 @zh-hans
definition: 将一个行为者与包括将各种内容无缝融合的一个行为者的贡献的一种资源关联起来。 @zh-hans
label: közreműködő ágense a következő vegyes tartalomnak: @hu
definition: Hozzákapcsol egy ágenst egy forráshoz, amely magában foglalja egy ágens közreműködését a tartalom fajtáinak szabad keverésében. @hu
label: birleşimine katkıda bulunan temsilcidir @tr
definition: Bir temsilciyi, bir temsilcinin içerik türlerinin kesintisiz bir birleşimine yaptığı katkıyı içeren bir kaynakla ilişkilendirir. @tr

has contributor agent to performance
status: Published
lexical alias: contributorAgentToPerformanceContent.en
definition: Relates a resource to an agent who contributes to a resource that is a performance.
type: Property
inverse of: is contributor agent to performance of
label: heeft bijdrager-actor aan uitvoering @nl
label: له وكيل مساهم في أداء @ar
definition: يربط مصدر بوكيل يساهم في مصدر عبارة عن أداء. @ar
label: har agent, som er bidragsyder til performance @da
definition: Relaterer en ressource til en agent, wom bidrager til en ressource, der er en performance. @da
label: esitykseen osallinen toimija aineistossa @fi
definition: Liittää aineiston toimijaan, joka osallistuu sellaisen aineiston tekemiseen, joka on esitys. @fi
label: hat Beiträgerin/Beiträger zu einer Darbietung @de
definition: Setzt eine Ressource in Beziehung zu einem Akteur, der zu einer Darbietung beiträgt. @de
label: 有表演的贡献者行为者 @zh-hans
definition: 将一种资源与对作为一种表演的一种资源作出贡献的一个行为者关联起来。 @zh-hans
label: előadás közreműködő ágense a következő: @hu
definition: Hozzákapcsol egy forrást egy ágenshez, amely hozzájárul egy forráshoz, amely egy előadás. @hu
label: performansa katkıda bulunan temsilci ile ilişkilidir @tr
definition: Bir kaynağı, performans olan bir kaynağa katkıda bulunan bir temsilci ile ilişkilendirir. @tr

is contributor agent to performance of
status: Published
lexical alias: contributorAgentToPerformanceOf.en
definition: Relates an agent to a resource that includes a contribution by an agent to a performance.
type: Property
label: is bijdrager-actor aan uitvoering van @nl
label: هو وكيل مساهم في أداء لـ @ar
definition: يربط بين وكيل ومصدر يتضمن إسهام وكيل في أداء. @ar
label: er agent som er bidragsyder til performance af @da
definition: Relaterer en agent til en ressource, som omfatter et bidrag af en agent til en performance. @da
label: aineiston esitykseen osallinen toimija @fi
definition: Liittää toimijan aineistoon, jossa toimija on osallisena sellaisen aineiston tekemisessä, joka on esitys. @fi
label: ist Akteur als Beiträgerin/Beiträger zu einer Darbietung von @de
definition: Setzt einen Akteur in Beziehung zu einer Ressource, bei der ein Akteur zu einer Darbietung beiträgt @de
label: 是……的表演的贡献者行为者 @zh-hans
definition: 将一个行为者与包括一个行为者对一个表演之贡献的一种资源关联起来。 @zh-hans
label: közreműködő ágense a következő előadásnak: @hu
definition: Hozzákapcsol egy ágenst egy forráshoz, amely magában foglalja az ágens közreműködését egy előadásban. @hu
label: performansına katkıda bulunan temsilcidir @tr
definition: Bir temsilciyi, bir temsilcinin bir performansa katkısını içeren bir kaynakla ilişkilendirir. @tr

has coordinates of cartographic content
status: Published
definition: Relates a resource to a place that is the area of coverage of a cartographic resource that is described using a mathematical system to identify its boundaries or location.
type: Property
lexical alias: coordinatesOfCartographicContent.en
label: har koordinater for kartografisk indhold @da
definition: Relaterer en ressource til et matematisk system til identificering af det område, der dækkes af en ressources kartografiske indhold. @da
inverse of: is coordinates of cartographic content of
label: heeft coördinaten van cartografische content @nl
label: kartografisen sisällön koordinaatit aineistolle @fi
label: له إحداثيات لمحتوى خرائطي @ar
definition: يربط بين مصدر ونظام رياضي يقوم بتحديد مكان مُغطى بواسطة محتوى رسم خرائطي لمصدر. @ar
definition: Liittää aineiston matemaattiseen järjestelmään, jolla identifioidaan aineiston kartografisen sisällön kattama paikka. @fi
label: hat Koordinaten von kartografischem Inhalt @de
definition: Setzt eine Ressource in Beziehung zu einem mathematischen System zur Identifizierung eines Gebiets, das durch den kartografischen Inhalt einer Ressource abgedeckt wird. @de
label: 有地图内容的坐标 @zh-hans
definition: 将一种资源与作为一种地图资源的覆盖范围、并被使用一个数学体系描述以标识其边界或位置的一个地点关联起来。 @zh-hans
definition: Relaciona un recurs amb un lloc que és l’àrea d'abast d’un recurs cartogràfic que es descriu usant un sistema matemàtic per identificar els seus límits o localització. @ca
label: kartografikus tartalomhoz tartozó koordináták a következők: @hu
definition: Hozzákapcsol egy forrást egy matematikai rendszerhez, amely egy forrás kartográfiai tartalma által lefedett hely azonosítására szolgál. @hu
has subproperty: has longitude and latitude
has subproperty: has right ascension and declination
has subproperty: has strings of coordinate pairs
label: kartografik içeriğin koordinatları ile ilişkilidir @tr
definition: Bir kaynağı, bir kaynağın kartografik içeriğinin kapsamındaki bir yeri belirlemeye yönelik matematiksel sistem ile ilişkilendirir. @tr

has copyright date
status: Published
definition: Relates a resource to a timespan associated with a claim of protection under copyright or a similar regime.
type: Property
lexical alias: copyrightDate.en
label: har copyrightår @da
definition: Relaterer en ressource til et år knyttet til et krav om beskyttelse i henhold til ophavsret eller et lignende system. @da
inverse of: is copyright date of
label: heeft copyrightdatum @nl
label: aineiston tekijänoikeusvuosi @fi
label: له تاريخ حقوق الطبع والنشر @ar
definition: يربط بين مصدر وفترة زمنية مرتبطة بفترة حماية حقوق الطبع والنشر أو أي نظام حماية آخر. @ar
definition: Liittää aineiston ajanjaksoon, joka liittyy copyright-säädösten tai vastaavien säädösten alaiseen copyright-suojaukseen. @fi
label: hat Copyright-Datum @de
definition: Setzt eine Ressource in Beziehung zu einem Zeitraum, der mit einem Schutzanspruch nach dem Urheberrecht oder einem ähnlichen Regelwerk in Verbindung steht. @de
label: 有版权日期 @zh-hans
definition: 将一种资源与和根据版权或类似管理制度的保护声明有关的一个时间段关联起来。 @zh-hans
label: copyright időpontja a következő: @hu
definition: Hozzákapcsol egy forrást egy időtartamhoz, amely egy copyright vagy hasonló rendszer alatti védelmi igényhez kapcsolódik. @hu
label: telif hakkı tarihi ile ilişkilidir @tr
definition: Bir kaynağı, telif hakkı veya benzer bir sistem kapsamında koruma talebiyle bağlantılı bir zaman aralığıyla ilişkilendirir. @tr

is copyright date of
status: Published
lexical alias: copyrightDateOf.en
definition: Relates a timespan to a resource that is associated with a claim of protection under copyright or a similar regime during a timespan.
type: Property
inverse of: has copyright date
label: is copyrightdatum van @nl
label: هو تاريخ حقوق نشر لـ @ar
definition: يربط بين فترة زمنية ومصدر مرتبط بطلب حماية تحت حقوق نشر أو نظام مشابه خلال فترة زمنية. @ar
label: er copyrightdato for @da
definition: Relaterer et tidsforløb til en ressource, som er forbundet med et krav om beskyttelse under ophavsret eller en lignende ordning under et tidsforløb. @da
label: aineiston copyright-vuosi @fi
label: ist Copyright-Datum von @de
definition: Setzt einen Zeitraum in Beziehung zu einer Ressource, die mit einem Schutzanspruch nach dem Urheberrecht oder einem ähnlichen Regelwerk während eines Zeitraums in Verbindung steht. @de
definition: Liittää ajanjakson aineistoon, johon liittyy copyright-säädösten tai vastaavien säädösten alainen copyright-suojaus ajanjakson aikana. @fi
label: 是……的版权日期 @zh-hans
definition: 将一个时间段与和在一个时间段中根据版权或类似管理制度的保护声明有关的一种资源关联起来。 @zh-hans
label: copyright éve a következőnek: @hu
definition: Hozzákapcsol egy időtartamot egy forráshoz, amelyet a copyright vagy egy hasonló szabályrendszer alapján egy időtartam alatt támasztott védelmi igényhez társítanak. @hu
label: telif tarihidir @tr
definition: Bir zaman aralığını, bir zaman aralığı boyunca telif hakkı veya benzer bir sistem kapsamında koruma talebiyle bağlantılı olan bir kaynakla ilişkilendirir. @tr

has costume designer
status: Published
definition: Relates a resource to an agent who contributes to a resource by designing costumes for a moving image production or for a musical or dramatic presentation or entertainment.
type: Property
sub property of: has contributor (Deprecated)
inverse of: is costume designer of
lexical alias: costumeDesigner.en
label: har kostumedesigner @da
definition: Relaterer en ressource til en agent, der har bidraget til en ressource ved at designe kostumer til en levende billedproduktion eller til en musikalsk eller dramatisk præsentation eller til underholdning. @da
label: heeft kostuumontwerper @nl
label: puvustaja aineistossa @fi
label: له مصمم أزياء @ar
definition: يربط مصدر بوكيل يُساهم في مصدر من خلال تصميم أزياء لإنتاج فيلم؛ أو لعرض موسيقي أو درامي أو ترفيهي. @ar
definition: Liittää aineiston toimijaan, joka on aineistossa osallisena suunnittelemalla elokuvatuotannon tai musiikki- tai näytelmäesityksen puvustuksen. @fi
label: hat Kostümbildnerin/Kostümbildner @de
definition: Setzt eine Ressource in Beziehung zu einem Akteur, der zu einer Ressource beiträgt, indem er die Kostüme für eine Bewegtbildproduktion oder für eine musikalische oder dramatische Darbietung oder Aufführung entwirft. @de
label: 有服装设计者 @zh-hans
definition: 将一种资源与通过为动态图像制作或者为音乐或戏剧呈现或娱乐设计服装而对一种资源有贡献的一个行为者关联起来。 @zh-hans
label: jelmeztervezője a következő: @hu
definition: Hozzákapcsol egy forrást egy ágenshez, amely mozgókép-produkciók, zenei vagy drámai előadások vagy szórakoztató műsorok számára jelmezek tervezésével járul hozzá egy forráshoz. @hu
label: kostüm tasarımcısı ile ilişkilidir @tr
definition: Bir kaynağı, hareketli bir görüntü yapımı veya müzikal ya da dramatik bir sunum veya eğlence için kostüm tasarlayarak bir kaynağa katkıda bulunan bir temsilci ile ilişkilendirir. @tr

is costume designer of
status: Published
definition: Relates an agent to a resource that includes a contribution by an agent of designing costumes for a moving image production or for a musical or dramatic presentation or entertainment.
type: Property
sub property of: is contributor of (Deprecated)
inverse of: has costume designer
lexical alias: costumeDesignerOf.en
label: er kostumedesigner til @da
definition: Relaterer en agent, der har bidraget til en ressource ved at designe kostumer til en levende billedproduktion eller til en musikalsk eller dramatisk præsentation eller underholdning til en ressource. @da
label: is kostuumontwerper van @nl
label: هو مصمم أزياء لـ @ar
definition: يربط بين وكيل ومصدر يتضمن إسهام وكيل في تصميم الأزياء لإنتاج صورة متحركة أو لعرض موسيقي أو درامي أو ترفيهي. @ar
label: puvustaja (toimija) aineistossa @fi
definition: Liittää toimijan aineistoon, jossa toimija on osallisena suunnittelemalla elokuvatuotannon tai musiikki- tai näytelmäesityksen puvustuksen. @fi
label: ist Kostümbildnerin/Kostümbildner von @de
definition: Setzt einen Akteur in Beziehung zu einer Ressource, zu der ein Akteur beiträgt, indem er die Kostüme für eine Bewegtbildproduktion oder für eine musikalische oder dramatische Darbietung oder Aufführung entwirft. @de
label: 是……的服装设计者 @zh-hans
definition: 将一个行为者与包括为动态图像制作或者为音乐或戏剧呈现或娱乐设计服装的一个行为者的贡献的一种资源关联起来。 @zh-hans
label: jelmeztervezője a következőnek: @hu
definition: Hozzákapcsol egy ágenst egy forráshoz, amely magában foglalja az ágens közreműködését jelmezek tervezésében mozgókép-produkciókhoz, zenei vagy drámai előadásokhoz vagy szórakoztató műsorokhoz. @hu
label: kostüm tasarımcısıdır @tr
definition: Bir temsilciyi, hareketli bir görüntü yapımı veya müzikal veya dramatik bir sunum ya da eğlence için kostüm tasarlayan bir temsilcisinin katkısını içeren bir kaynakla ilişkilendirir. @tr

has country associated with agent
status: Published
definition: Relates an agent to a place that is a country with which an agent is identified.
type: Property
label: har land knyttet til agent @da
definition: Relaterer en ressource til et land som en agent forbindes med. @da
inverse of: is country associated with agent of
label: heeft land geassocieerd met actor @nl
label: toimijaan liittyvä maa aineistossa @fi
label: له بلد مرتبط بوكيل @ar
definition: يربط بين مصدر وبلد يُستدل به على وكيل. @ar
definition: Liittää aineston maahan, johon toimija yhdistetään. @fi
label: hat Land, das mit einem Akteur in Verbindung steht @de
definition: Setzt eine Ressource in Beziehung zu einem Land, mit dem einem Akteur identifiziert wird. @de
lexical alias: countryAssociatedWithAgent.en
label: 有和行为者有关的国家 @zh-hans
definition: 将一个行为者与作为一个国家并被用来标识一个行为者的一个地点关联起来。 @zh-hans
definition: Relaciona un agent amb un lloc que és un país amb el qual un agent s’identifica. @ca
label: az ágenshez kapcsolódó ország a következő: @hu
definition: Hozzákapcsol egy forrást egy országhoz, amellyel egy ágenst azonosítanak. @hu
label: temsilciyle bağlantılı olan ülke ile ilişkilidir @tr
definition: Bir kaynağı, bir temsilcinin tanımlandığı bir ülkeyle ilişkilendirir. @tr

is country associated with agent of
status: Published
lexical alias: countryAssociatedWithAgent.en
definition: Relates a place to an agent who is identified with a country.
type: Property
inverse of: has country associated with agent
label: is land geassocieerd met actor van @nl
label: هي بلد مرتبط بوكيل لـ @ar
definition: يربط بين مكان ووكيل يُستدل به على بلد. @ar
label: er land tilknyttet agent af @da
definition: Relaterer et sted til en agent, som er identificeret med et land. @da
label: toimijaan liittyvä maa @fi
definition: Liittää paikan toimijaan, joka yhdistetään tiettyyn maahan. @fi
label: ist Land, das mit einem Akteur in Verbindung steht von @de
definition: Setzt ein Geografikum in Beziehung zu einem Akteur, der mit einem Land identifiziert wird. @de
label: 是和……的行为者有关的国家 @zh-hans
definition: 将一个地点与被一个国家标识的一个行为者关联起来。 @zh-hans
label: kapcsolódó országa a következő ágensnek: @hu
definition: Hozzákapcsol egy helyet egy ágenshez, amelyet egy országgal azonosítanak. @hu
label: temsilcisinin ülkesi ile ilişkilidir @tr
definition: Bir yeri, bir ülke ile özdeşleşmiş bir temsilciyle ilişkilendirir. @tr

has court governed
status: Published
definition: Relates a resource to an agent that is a court governed by court rules, regardless of their official nature.
type: Property
sub property of: has other agent associated with resource (Deprecated)
inverse of: is court governed of
lexical alias: courtGoverned.en
label: har retsinstans underlagt @da
definition: Relaterer en ressource til en retsinstans, der er underlagt retsregler, uanset hvad deres officielle art er. @da
label: heeft hof geregeerd @nl
label: sääntöjen ohjaama tuomioistuin @fi
label: له محكمة خاضعة @ar
definition: يربط بين مصدر ومحكمة تخضع لقواعد محكمة، بغض النظر عن طبيعتها الرسمية. @ar
definition: Liittää aineiston sääntöjen ohjaamaan tuomioistuimeen riippumatta säännön virallisesta luonteesta. @fi
label: hat durch Verfahrensvorschriften geregeltes Gericht @de
definition: Setzt eine Ressource in Beziehung zu einem Gericht, das durch gerichtliche Verfahrensvorschriften geregelt wird, unabhängig von deren förmlicher Rechtsnatur. @de
label: 有受管辖的法院 @zh-hans
definition: 将一种资源与作为通过法院规则（不管其正式性质）受管辖的一个法院的一个行为者关联起来。 @zh-hans
definition: Relaciona un recurs amb un agent que és un tribunal regit per regles de procediment, independentment de la seva naturalesa oficial. @ca
label: Irányított bírósága a következő: @hu
definition: Hozzákapcsol egy forrást egy bírósági szabályzatok által irányított bírósághoz, függetlenül a forrás hivatalos természetétől. @hu
label: mahkeme tarafından yönetilen ile ilişkilidir @tr
definition: Bir kaynağı, resmi niteliğine bakılmaksızın, mahkeme kuralları tarafından yönetilen bir mahkeme ile ilişkilendirir. @tr

is court governed of
status: Published
definition: Relates an agent to a resource of a court governed by court rules, regardless of their official nature to a resource.
type: Property
sub property of: is other agent associated with resource of (Deprecated)
inverse of: has court governed
lexical alias: courtGovernedOf.en
label: er retsinstans underlagt @da
definition: Relaterer en retsinstans underlagt retsregler, uanset hvad deres officiele art er til en ressource. @da
label: is hof geregeerd van @nl
label: sääntöjen ohjaaman tuomioistuimen päätös aineistossa @fi
label: هي محكمة خاضعة لـ @ar
definition: يربط بين وكيل ومصدر من مصادر المحكمة يخضع للوائح المحاكم، دون النظر إلى الطابع الرسمي بأحد المصادر. @ar
definition: Liittää toimijan tuomioistuimen sääntöjen ohjaamaan tuomioistuinaineistoon riippumatta siitä, mikä on sääntöjen virallinen suhde aineistoon. @fi
label: ist durch Verfahrensvorschriften geregeltes Gericht von @de
definition: Setzt einen Akteur in Beziehung zu einer Ressource eines Gerichts, das durch gerichtliche Verfahrensvorschriften geregelt wird, unabhängig von deren förmlicher Rechtsnatur. @de
label: 是……的受管辖的法院 @zh-hans
definition: 将一个行为者与一个通过法院规则（不管其与资源的正式性质）受管辖的法院的资源关联起来。 @zh-hans
label: irányított bírósága a következőnek: @hu
definition: Hozzákapcsol egy ágenst egy forráshoz, amely bírósági szabályzatok által irányított bíróság hatálya alá tartozik, függetlenül a forrás hivatalos természetétől. @hu
label: mahkeme yönetimindedir @tr
definition: Bir temsilciyi, resmi niteliğine bakılmaksızın, mahkeme kurallarla yönetilen bir mahkemenin bir kaynağıyla ilişkilendirir. @tr

has court reporter
status: Published
definition: Relates a resource to an agent who contributes to a resource by preparing a court's opinions for publication.
type: Property
sub property of: has contributor (Deprecated)
inverse of: is court reporter of
lexical alias: courtReporter.en
label: har retsstenograf @da
definition: Relaterer en ressource til en agent, der har bidraget til en ressource ved at klargøre en domstols afgørelser til publicering. @da
label: heeft rechtbankverslaggever @nl
label: aineiston kirjuri oikeudenkäyntiasiakirjoissa @fi
label: له كاتب محكمة @ar
definition: يربط مصدر بوكيل يُساهم في مصدر من خلال إعداد رأي محكمة للنشر. @ar
definition: Liittää aineiston toimijaan, joka on aineistossa osalllisena valmistelemalla tuomioistuimen lausunnon julkaistavaksi. @fi
label: hat Gerichtsstenografin/Gerichtsstenograf @de
definition: Setzt eine Ressource in Beziehung zu einem Akteur, der zu einer Ressource beiträgt, indem er eine Urteilsbegründung zur Veröffentlichung vorbereitet. @de
label: 有法院书记官 @zh-hans
definition: 将一种资源与通过准备用于公布的法院意见而对一种资源有贡献的一个行为者关联起来。 @zh-hans
label: bírósági jegyzőkönyvvezetője a következő: @hu
definition: Hozzákapcsol egy forrást egy ágenshez, amely hozzájárul egy forráshoz azzal, hogy egy bíróság ítéleteit készíti elő közlésre. @hu
label: yazman ile ilişkilidir @tr
definition: Bir kaynağı, bir mahkemenin kararlarını yayınlanmak üzere hazırlayarak bir kaynağa katkıda bulunan bir temsilci ile ilişkilendirir. @tr

is court reporter of
status: Published
definition: Relates an agent who contributes to a resource by preparing a court's opinions for publication to a resource.
type: Property
sub property of: is contributor of (Deprecated)
inverse of: has court reporter
lexical alias: courtReporterOf.en
label: er retsstenograf i @da
definition: Relaterer en agent, der har bidraget til en ressource ved at klargøre en domstols afgørelser til publicering til en ressource. @da
label: is rechtbankverslaggever van @nl
label: هو كاتب محكمة لـ @ar
definition: يربط وكيلًا يُساهم في مصدر من خلال إعداد رأي محكمة للنشر في أحد المصادر. @ar
label: kirjuri (toimija) aineistossa oikeudenkäyntiasiakirjoissa @fi
definition: Liittää toimijan aineistoon, jossa toimija on osallisena osalllisena valmistelemalla tuomioistuimen lausunnon julkaistavaksi. @fi
label: ist Gerichtsstenografin/Gerichtsstenograf von @de
definition: Setzt einen Akteur in Beziehung zu einer Ressource, zu der er beiträgt, indem er eine Urteilsbegründung zur Veröffentlichung vorbereitet. @de
label: 是……的法院书记官 @zh-hans
definition: 将一个通过准备用于公布的法院意见而对一种资源作出贡献的一个行为者与一种资源关联起来。 @zh-hans
label: bírósági jegyzőkönyvvezetője a következőnek: @hu
definition: Hozzákapcsol egy ágenst, amely hozzájárul egy forráshoz azzal, hogy egy bíróság ítéleteit készíti elő közlésre. @hu
has subproperty: is aggregator of
label: yazmanıdır @tr
definition: Bir mahkemenin kararlarını yayınlanmak üzere hazırlayarak bir kaynağa katkıda bulunan bir temsilciyi bir kaynakla ilişkilendirir. @tr

has coverage of content
status: Published
definition: Relates a resource to a chronological or geographic coverage of the content of a resource.
type: Property
lexical alias: coverageOfContent.en
label: har indholdsdækning @da
definition: Relaterer en ressource til en kronologisk eller geografisk dækning af en ressources indhold. @da
label: heeft bereik van content @nl
label: له تغطية المحتوى @ar
definition: يربط بين مصدرًا وتغطية زمنية أو جغرافية لمحتوى مصدر. @ar
label: aineiston sisällön kattavuus @fi
definition: Liittää aineiston ajalliseen tai maantieteelliseen kattavuuteen aineiston sisällössä. @fi
label: hat inhaltlichen Bezugsrahmen @de
definition: Setzt eine Ressource in Beziehung zu einem chronologischen oder geografischen Bezugsrahmen des Inhalts einer Ressource. @de
label: 有内容的覆盖面 @zh-hans
definition: 将一种资源与一种资源之内容的时间覆盖面或地理覆盖面关联起来。 @zh-hans
label: tartalmi vonatkozása a következő: @hu
definition: Hozzákapcsol egy forrást egy forrás tartalmának kronológiai vagy földrajzi vonatkozásához. @hu
label: içerik kapsamı ile ilişkilidir @tr
definition: Bir kaynağı, bir kaynağın içeriğinin kronolojik veya coğrafi kapsamıyla ilişkilendirir. @tr

has co-worker
status: Published
type: Property
lexical alias: coworker.en
definition: Relates an agent to an agent who is a colleague who works with or shares a task with another agent.
sub property of: has colleague
label: har arbejdskollega @da
definition: Relaterer en agent til en kollega, der arbejder sammen med eller deler opgaver med en anden agent. @da
label: heeft naaste collega @nl
label: له زميل عمل @ar
definition: يربط بين وكيل ووكيل هو زميل يعمل مع وكيلًا ذي صلة أو يشاركه مهمة. @ar
label: työtoveri (toimija) @fi
definition: Liittää toimijan, toimijan, joka on joka on kollega, joka työskentelee tai jakaa tehtävän liittyvän toimijan kanssa. @fi
label: hat Arbeitskollegin/Arbeitskollegen @de
definition: Setzt einen Akteur in Beziehung zu einer Kollegin/einem Kollegen, die/der mit einem in Beziehung stehenden Akteur zusammenarbeitet oder mit ihm eine Aufgabe teilt. @de
label: 有共事者 @zh-hans
definition: 将一个行为者与作为同事与另一个行为者一起工作或分担一个任务的一个行为者关联起来。 @zh-hans
definition: Relaciona un agent amb un agent que és un col·lega que treballa amb o comparteix una tasca amb un altre agent. @ca
label: munkatársa a következő: @hu
definition: Hozzákapcsol egy ágenst egy kolléga ágenshez, aki egy másik ágenssel együtt dolgozik vagy egy feladatot oszt meg vele. @hu
label: iş arkadaşı ile ilişkilidir @tr
definition: Bir temsilciyi, ilgili bir temsilciyle çalışan veya onunla görev paylaşan bir meslektaş olan bir temsilciyle ilişkilendirir. @tr

has creator
status: Published
definition: Relates a resource to an agent who is responsible for a resource
type: Property
inverse of: is creator of
lexical alias: creator.en
scope note: Creators include agents who are jointly responsible for the creation of a resource either performing the same role, such as in a collaboration between two writers, or performing different roles, such as in a collaboration between a composer and a lyricist.
label: har ophav @da
definition: Relaterer en ressource til en agent, der er ansvarlig for en ressources tilblivelse. @da
scope note: Ophav inkluderer agenter der har fælles ansvar for at have skabt en ressource, enten ved at udføre den samme rolle, som i et samarbejde mellem to forfattere, eller udføre forskellige roller, som i et samarbejde mellem fx en komponist og en sangskriver. @da
label: heeft maker @nl
label: aineiston tekijä @fi
label: له مُبدع @ar
definition: يربط مصدر بوكيل مسؤول عن مصدر. @ar
scope note: يشمل المبدعون وكلاء يكونون مسؤولين بشكل مشترك عن إنشاء مصدر إما عن طريق أداء نفس الدور الذي يؤديه وكيل آخر كما هو الحال في التعاون بين كاتبين، أو عن طريق أداء دور مختلف كما هو الحال في التعاون بين ملحن ومؤلف أغاني @ar
definition: Liittää aineiston toimijaan, joka vastaa aineistosta. @fi
scope note: Koskee toimijoita, jotka yhdessä vastaavat teoksen luomisesta joko toimimalla samassa roolissa kuin toinen toimija, kuten kahden kirjoittajan välisessä yhteistyössä, tai toimimalla eri rooleissa, kuten säveltäjän ja sanoittajan välisessä yhteistyössä. @fi
label: hat geistige Schöpferin/geistigen Schöpfer @de
definition: Setzt eine Ressource in Beziehung zu einem Akteur, der für eine Ressource verantwortlich ist. @de
scope note: Darunter fallen Akteure, die für die Schaffung einer Ressource mitverantwortlich sind, wenn sie entweder dieselbe Rolle ausführen, wie bei einer Zusammenarbeit zwischen zwei Schriftstellerinnen/Schriftstellern, oder unterschiedliche Rollen ausführen, wie bei einer Zusammenarbeit zwischen einer Komponistin/einem Komponisten und einer Textdichterin/einem Textdichter. @de
label: 有创作者 @zh-hans
definition: 将一种资源与负责一种资源的一个行为者关联起来。 @zh-hans
scope note: 创作者包括对资源的创建联合负责的行为者，他们或者行使同样的角色（例如两个写作者之间的合作）或者行使不同角色（例如作曲者和词作者之间的合作）。 @zh-hans
label: létrehozója a következő: @hu
definition: Hozzákapcsol egy forrást egy ágenshez, amely felelős egy forrás megalkotásáért. @hu
scope note: Az alkotókhoz tartoznak azok az ágensek, amelyek közösen felelősek egy forrás létrehozásáért akár ugyanabban a közreműködői szerepben, mint például két író közötti együttműködés, akár eltérő közreműködői szerepben, mint például egy zeneszerző és egy szövegíró közötti együttműködés. @hu
has subproperty: has aggregator
has subproperty: has architect
has subproperty: has artist
has subproperty: has author
has subproperty: has book designer
has subproperty: has cartographer
has subproperty: has caster
has subproperty: has choreographer
has subproperty: has collector
has subproperty: has commissioning agent
has subproperty: has composer
has subproperty: has consultant
has subproperty: has degree supervisor
has subproperty: has designer
has subproperty: has enacting government
has subproperty: has filmmaker
has subproperty: has interviewee
has subproperty: has interviewer
has subproperty: has inventor
has subproperty: has photographer
has subproperty: has praeses
has subproperty: has printmaker
has subproperty: has programmer
has subproperty: has remix artist
has subproperty: has respondent
label: yaratıcı ile ilişkilidir @tr
definition: Bir kaynağı, bir kaynaktan sorumlu olan bir temsilci ile ilişkilendirir. @tr
scope note: Yaratıcılar, bir kaynağın oluşturulmasından ortaklaşa sorumlu olan ajanları içerir; bu, iki yazarın iş birliğinde olduğu gibi aynı rolü üstlenmeleri ya da bir besteci ile bir söz yazarının iş birliğinde olduğu gibi farklı rolleri üstlenmeleri şeklinde olabilir. @tr

is creator of
status: Published
definition: Relates an agent to a resource that involves a creation responsibility.
type: Property
inverse of: has creator
lexical alias: creatorOf.en
label: er ophav til @da
definition: Relaterer en agent der er ansvarlig for skabelse af en ressource til en ressource. @da
label: is maker van @nl
label: هو مُبدع لـ @ar
definition: يربط بين وكيل مصدر يتضمن مسؤولية إبداعية. @ar
label: tekijä (toimija) aineistossa @fi
definition: Liittää toimijan aineistoon, jossa toimija vastaa aineiston luomisesta. @fi
label: ist Geistige Schöpferin/Geistiger Schöpfer von @de
definition: Setzt einen Akteur in Beziehung zu einer Ressource, die mit einer Verantwortung bei der Erstellung verbunden ist. @de
label: 是……的创作者 @zh-hans
definition: 将一个行为者与涉及一个创作责任的一种资源关联起来。 @zh-hans
label: létrehozója a következőnek: @hu
definition: Hozzákapcsol egy ágenst egy forráshoz, amelyhez hozzátartozik egy ágens felelőssége a létrehozásért. @hu
has subproperty: is architect of
has subproperty: is artist of
has subproperty: is author of
has subproperty: is book designer of
has subproperty: is cartographer of
has subproperty: is caster of
has subproperty: is casting director of
has subproperty: is choreographer of
has subproperty: is collector of
has subproperty: is commissioning agent of
has subproperty: is composer of
has subproperty: is consultant of
has subproperty: is degree supervisor of
has subproperty: is designer of
has subproperty: is enacting government of
has subproperty: is filmmaker of
has subproperty: is interviewee of
has subproperty: is interviewer of
has subproperty: is inventor of
has subproperty: is photographer of
has subproperty: is praeses of
has subproperty: is printmaker of
has subproperty: is programmer of
has subproperty: is remix artist of
has subproperty: is respondent of
label: yaratıcısıdır @tr
definition: Bir temsilciyi, bir oluşumun sorumluluğunu içeren bir kaynakla ilişkilendirir @tr

has criminal defendant
status: Published
lexical alias: criminalDefendant.en
definition: Relates a resource to an agent who is accused in a criminal proceeding.
type: Property
sub property of: has defendant
label: heeft criminele verdachte @nl
label: له مُدَّعَى عليه جنائيًا @ar
definition: يربط مصدر بوكيل متهم في دعوى جنائية. @ar
label: har sagsøgt @da
definition: Relaterer en ressource til en agent, som er sagsøgt i en straffesag. @da
label: vastaaja rikosoikeudessa @fi
definition: Liittää aineiston toimijaan, joka on syytettynä rikosprosessissa. @fi
label: hat Angeklagte/Angeklagten in einem Strafverfahren @de
definition: Setzt eine Ressource in Beziehung zu einem Akteur, der in einem Strafverfahren angeklagt ist. @de
label: 有刑事被告 @zh-hans
definition: 将一种资源与在一项刑事诉讼中被指控的一个行为者关联起来。 @zh-hans
label: büntetőeljárás vádlottja a következő: @hu
definition: Hozzákapcsol egy forrást egy ágenshez, akit egy büntetőeljárásban vádolnak. @hu
label: sanık ile ilişkilidir @tr
definition: Bir kaynağı, ceza davasında suçlanan bir temsilci ile ilişkilendirir. @tr

is criminal defendant of
status: Published
lexical alias: criminalDefendantOf.en
definition: Relates an agent to a resource that involves a responsibility of an agent for being accused in a criminal proceeding.
type: Property
sub property of: is defendant of
inverse of: has criminal defendant
label: is criminele verdachte van @nl
label: هو مُدَّعَى عليه جنائيًا @ar
definition: يربط بين وكيل ومصدر ينطوي على مسؤولية وكيل عن اتهامه في دعوى جنائية. @ar
label: er sagsøgt af @da
definition: Relaterer en agent til en ressource, som involverer et agentansvar af at være sagsøgt i en straffesag. @da
label: toimija vastaajana rikosoikeudessa @fi
definition: Liittää toimijan aineistoon, johon liittyy toimijan asema rikosprosessin syytettynä. @fi
label: ist Angeklagte/Angeklagter in einem Strafverfahren von @de
definition: Setzt einen Akteur in Beziehung zu einer Ressource, die mit einer Verantwortung verbunden ist, als Akteur in einem Strafverfahren angeklagt zu sein. @de
label: 是……的刑事被告 @zh-hans
definition: 将一个行为者与涉及在一项刑事诉讼中被指控的一个行为者的责任的一种资源关联起来。 @zh-hans
label: bűnvádi eljárás alperese a következőnek: @hu
definition: Hozzákapcsol egy ágenst egy forráshoz, amelyhez hozzátartozik annak felelőssége, hogy egy ágenst egy büntetőeljárásban megvádolnak. @hu
label: sanığıdır @tr
definition: Bir temsilciyi, bir ceza davasında suçlanmaya ilişkin bir temsilcinin sorumluluğunu içeren bir kaynakla ilişkilendirir. @tr

is critiqued by
status: Published
definition: Relates a resource to a resource that is a critical evaluation of a resource.
type: Property
inverse of: is critique of
label: er kritiseret i @da
definition: Relaterer en ressource til en ressource, der indeholder en kritisk vurdering af en beskreven ressource. @da
alternative label: is critiqued in
sub property of: is evaluated by
lexical alias: critiquedBy.en
label: is bekritiseerd in @nl
label: aineiston arvostelu @fi
label: هو مُنتقد في @ar
definition: يربط بين مصدر ومصدر يحتوي على تقييم نقدي لمصدر. @ar
definition: Liittää aineiston aineistosta tehtyyn kriittiseen arviointiin. @fi
alternative label: arvosteltu aineisto @fi
label: ist Kritik in @de
definition: Setzt eine Ressource in Beziehung zu einer Ressource, bei der es sich um eine kritische Untersuchung einer Ressource handelt. @de
alternative label: 被批评于 @zh-hans
label: 被……批评 @zh-hans
definition: 将一种资源与作为一种资源之批评性评价的一种资源关联起来。 @zh-hans
alternative label: és criticat en @ca
label: és criticat per @ca
definition: Relaciona un recurs amb un recurs que és una avaluació crítica d’un recurs. @ca
label: bírálva a következőben: @hu
definition: Hozzákapcsol egy forrást egy forráshoz, amely egy forrás kritikai értékelése. @hu
alternative label: içinde eleştirilmiştir @tr
label: tarafından eleştirilmiştir @tr
definition: Bir kaynağı, bir kaynağın değerlendirmesi olan bir kaynakla ilişkilendirir. @tr

is critique of
status: Published
definition: Relates a resource to a resource used as a basis for a critical evaluation.
type: Property
sub property of: is description of
inverse of: is critiqued by
lexical alias: critiqueOf.en
label: er kritik af @da
definition: Relaterer en ressource til en ressource brugt som basis for en kritisk evaluering. @da
label: is kritiek van @nl
label: kritiikki aineistosta @fi
label: هو نقد لـ @ar
definition: يربط بين مصدر ومصدر يُستخدم كأساس لتقييم نقدي. @ar
definition: Liittää aineiston aineistoon, johon kriittinen arviointi perustuu. @fi
label: ist Kritik von @de
definition: Setzt eine Ressource in Beziehung zu einer Ressource, die als Grundlage für eine kritische Untersuchung verwendet wird. @de
label: 是……的批评 @zh-hans
definition: 将一种资源与被用作一种批评性评价之基础的一种资源关联起来。 @zh-hans
label: bírálata a következőnek: @hu
definition: Hozzákapcsol egy forrást egy forráshoz, amelyet egy kritikai kiértékelés alapjaként használnak. @hu
label: eleştirisidir @tr
definition: Bir kaynağı, kritik bir değerlendirme için temel olarak kullanılan bir kaynakla ilişkilendirir. @tr

has curator (Deprecated)
definition: Relates a resource to an agent who conceives, aggregates, or organizes an exhibition or collection of a resource. (Deprecated)
type: Property
sub property of: has other agent associated with resource (Deprecated)
inverse of: is curator of (Deprecated)
lexical alias: curator.en
label: har kurator @da
definition: Relaterer en ressource til en agent der har udtænkt, samlet og/eller arrangeret en udstilling, samling eller en anden ressource. @da
status: Deprecated
label: heeft curator @nl
label: kuraattori @fi
label: له أمين معرض @ar
definition: يربط مصدر بوكيل يبتكر، أو يجمع، أو ينظم معرضًا أو مجموعة من المصادر. @ar
label: hat Kuratorin/Kurator @de
definition: Setzt eine Ressource in Beziehung zu einem Akteur, der eine Ausstellung oder Sammlung einer Ressource konzipiert, zusammenstellt oder organisiert. @de
definition: Liittää aineiston siitä näyttelyn tai kokoelman suunnittelevaan, kokoavaan tai järjestävään toimijaan. @fi
label: kurátora a következő: @hu
definition: Hozzákapcsol egy forrást egy ágenshez, amely kigondolja, aggregálja vagy megszervezi egy forrás kiállítássá vagy gyűjteménnyé szervezését. @hu

is curator of (Deprecated)
definition: Relates an agent to a resource that is aggregated or organized in an exhibition or collection. (Deprecated)
type: Property
sub property of: is other agent associated with resource of (Deprecated)
inverse of: has curator (Deprecated)
lexical alias: curatorOf.en
label: er kurator af @da
definition: Relaterer en agent der har udtænkt, samlet og/eller arrangeret en udstilling, samling eller et andet eksemplar til en ressource. @da
status: Deprecated
label: is curator van @nl
label: هو أَمِين معرض لـ @ar
definition: يربط بين وكيل ومصدر تم تجميعه أو تنظيمه في معرض أو مجموعة. @ar
label: ist Kuratorin/Kurator von @de
definition: Setzt einen Akteur in Beziehung zu einer Ressource, die in einer Ausstellung oder Sammlung aggregiert oder organisiert ist. @de
label: kuraattori aineistossa @fi
definition: Liittää toimijan aineistoon, joka on koottu tai järjestetty näyttelyksi tai kokoelmaksi. @fi
label: kurátora a következőnek: @hu
definition: Hozzákapcsol egy ágenst egy forráshoz, amelyet egy kiállításba vagy gyűjteménybe aggregáltak vagy szerveztek. @hu

has current owner
status: Published
definition: Relates a resource to an agent currently having legal possession of a resource.
type: Property
sub property of: has owner
inverse of: is current owner of
lexical alias: currentOwner.en
label: har nuværende ejer @da
definition: Relaterer en ressource til en agent, der p.t. er i lovlig besiddelse af en ressource. @da
label: heeft huidige eigenaar @nl
label: aineiston nykyinen omistaja @fi
label: له مالك حالي @ar
definition: يربط مصدر بوكيل يمتلك حاليًا ملكية قانونية لمصدر. @ar
definition: Liittää aineiston toimijaan, jolla on aineiston tämänhetkinen laillinen omistus. @fi
label: hat gegenwärtige Eigentümerin/gegenwärtigen Eigentümer @de
definition: Setzt eine Ressource in Beziehung zu einem Akteur, der derzeit im rechtmäßigen Besitz einer Ressource ist. @de
label: 有当前拥有者 @zh-hans
definition: 将一资源与拥有对一种资源当前法定所有权的一个行为者关联起来。 @zh-hans
label: jelenlegi tulajdonosa a következő: @hu
definition: Hozzákapcsol egy forrást egy ágenshez, amelynek jelenleg jogszerű tulajdonában van egy forrás. @hu
has subproperty: has depositor
label: mevcut sahip ile ilişkilidir @tr
definition: Bir kaynağı, o anda bir kaynağın yasal mülkiyetine sahip olan bir temsilci ile ilişkilendirir. @tr

is current owner of
status: Published
definition: Relates an agent to a resource that involves a responsibility of an agent for current legal possession.
type: Property
sub property of: is owner of
inverse of: has current owner
lexical alias: currentOwnerOf.en
label: er nuværende ejer af @da
definition: Relaterer en agent, der p.t. er i lovlig besiddelse af en ressource til en ressource. @da
label: is huidige eigenaar van @nl
label: هو مالك حالي لـ @ar
definition: يربط بين وكيل ومصدر ينطوي على مسؤولية وكيل عن الملكية القانونية الحالية. @ar
label: nykyinen omistaja (toimija) aineistossa @fi
definition: Liittää toimijan aineistoon, jonka toimija tällä hetkellä laillisesti omistaa. @fi
label: ist gegenwärtige Eigentümerin/gegenwärtiger Eigentümer von @de
definition: Setzt einen Akteur in Beziehung zu einer Ressource, die sich derzeit im rechtmäßigen Besitz eines Akteurs befindet. @de
label: 是……的当前拥有者 @zh-hans
definition: 将一个行为者与涉及一个当前法定所有权的一个行为者的责任的一种资源关联起来。 @zh-hans
label: jelenlegi tulajdonosa a következőnek: @hu
definition: Hozzákapcsol egy ágenst egy forráshoz, amelyhez hozzátartozik az ágens jelenlegi tulajdonjog iránti felelőssége. @hu
has subproperty: is depositor of
label: mevcut sahibidir @tr
definition: Bir temsilciyi, mevcut yasal mülkiyet için bir temsilcinin sorumluluğunu içeren bir kaynakla ilişkilendirir. @tr

has custodial history of resource
status: Published
definition: Relates a resource to a record of previous ownership or custodianship of a resource, including agent, place, and timespan.
type: Property
lexical alias: custodialHistoryOfResource.en
label: proveniens @da
definition: Relaterer en ressource til en optegnelse over tidligere ejerskab eller opbevaring af en ressource. @da
label: heeft bewaargeschiedenis van resource @nl
label: له تاريخ وصاية لمصدر @ar
definition: يربط بين مصدر وسجل ملكية سابقة أو بوصاية على مصدر، يتضمن وكيلًا، مكانا، وفترة زمنية. @ar
label: aineiston omistushistoria @fi
definition: Liittää aineiston tietoihin sen omistus- tai säilytyshistoriasta, mukaanlukien tiedot toimijoista, paikoista ja ajanjaksoista. @fi
label: hat Besitzhistorie einer Ressource @de
definition: Setzt eine Ressource in Beziehung zu einem Bericht über frühere Eigentümerinnen/Eigentümer oder Verwahrerinnen/Verwahrer einer Ressource, einschließlich eines Akteurs, eines Geografikums und eines Zeitraums. @de
label: 有资源的保管历史 @zh-hans
definition: 将一种资源与一种资源的先前拥有或保管的记录（包括行为者、地点和时间段）关联起来。 @zh-hans
label: forrás őrzési története a következő: @hu
definition: Hozzákapcsol egy forrást a forrás korábbi tulajdoni vagy letéti őrzési feljegyzéséhez, amely tartalmaz ágenst, helyet és időtartamot. @hu
label: kaynak koruma geçmişi ile ilişkilidir @tr
definition: Bir kaynağı, temsilci, yer ve zaman aralığı da dahil olmak üzere, bir kaynağın önceki sahipliğine veya gözetimine ilişkin bir kayıtla ilişkilendirir. @tr

has custodian
status: Published
definition: Relates a resource to an agent having legal custody of a resource.
type: Property
inverse of: is custodian of
lexical alias: custodian.en
label: har forvalter @da
definition: Relaterer en ressource til en agent, der lovligt har en ressource i forvaring. @da
label: heeft curatele @nl
label: aineiston säilyttäjä @fi
label: له وَصِيّ @ar
definition: يربط مصدر بوكيل يمتلك وصاية قانونية لمصدر @ar
definition: Liittää aineiston toimijaan, joka on aineiston laillinen säilyttäjä. @fi
label: hat Verwahrerin/Verwahrer @de
definition: Setzt eine Ressource in Beziehung zu einem Akteur, dem die rechtmäßige Verwahrung einer Ressource obliegt. @de
label: 有保管者 @zh-hans
definition: 将一种资源与对一种资源拥有合法保管权的一个行为者关联起来。 @zh-hans
label: letétkezelője a következő: @hu
definition: Hozzákapcsol egy forrást egy ágenshez, amely egy forrás törvényes megőrzője. @hu
label: koruyucu ile ilişkilidir @tr
definition: Bir kaynağı, kaynağın yasal velayetine sahip bir temsilci ile ilişkilendirir. @tr

is custodian of
status: Published
definition: Relates an agent to a resource that involves a responsibility of an agent for legal custody.
type: Property
inverse of: has custodian
lexical alias: custodianOf.en
label: er forvalter af @da
definition: Relaterer en agent, der er lovligt berettiget til at have en ressource i depot til en ressource. @da
label: is bewaarder van @nl
label: هو وَصِيّ لـ @ar
definition: يربط بين وكيل ومصدر ينطوي على مسؤولية وكيل عن الوصاية القانونية. @ar
label: säilyttäjä (toimija) aineistossa @fi
definition: Liittää toimijan aineistoon, jonka laillinen säilyttäjä toimija on. @fi
label: ist Verwahrerin/Verwahrer von @de
definition: Setzt einen Akteur in Beziehung zu einer Ressource, die sich in der rechtmäßigen Verwahrung eines Akteurs befindet. @de
label: 是……的保管者 @zh-hans
definition: 将一个行为者与涉及合法保管的一个行为者的责任的一种资源关联起来。 @zh-hans
label: letétkezelője a következőnek: @hu
definition: Hozzákapcsol egy ágenst egy forráshoz, amelyhez hozzátartozik az ágens megőrzés iránti felelőssége. @hu
label: koruyucusudur @tr
definition: Bir temsilciyi, yasal velayete ilişkin bir temsilcinin sorumluluğunu içeren bir kaynakla ilişkilendirir. @tr

has dancer
status: Published
definition: Relates a resource to an agent who is a performer who contributes to a resource by dancing in a musical or dramatic presentation.
type: Property
sub property of: has performer
inverse of: is dancer of
lexical alias: dancer.en
label: har danser @da
definition: Relaterer en ressource til en performer, der har bidraget til en ressource ved at danse i en musikalsk eller dramatisk præsentation etc. @da
label: heeft danser @nl
label: tanssija aineistossa @fi
label: له راقص @ar
definition: يربط مصدر بوكيل يُمثل مؤدِ يُساهم في مصدر من خلال الرقص في عرض موسيقي أو درامي. @ar
label: hat Tänzerin/Tänzer @de
definition: Setzt eine Ressource in Beziehung zu einer Ausführenden/einem Ausführenden, die/der zu einer Ressource beiträgt, indem sie/er in einer musikalischen, dramatischen oder ähnlichen Darbietung tanzt. @de
definition: Liittää aineiston toimijaan, joka on aineistossa osallisena esiintyjänä tanssimalla musiikki-, näytelmä-tms. esityksessä. @fi
label: 有舞蹈者 @zh-hans
definition: 将一种资源作为一个表演者通过在音乐或戏剧呈现中舞蹈对一种资源有贡献的一个行为者关联起来。 @zh-hans
label: táncosa a következő: @hu
definition: Hozzákapcsol egy forrást egy előadó ágenshez, aki hozzájárul egy forráshoz azzal, hogy egy zenei, drámai stb. bemutatóban táncol. @hu
label: dansçı ile ilişkilidir @tr
definition: Bir kaynağı, müzikal veya dramatik gösterimde dans ederek müzikal kaynağa katkıda bulunan bir sanatçı olan temsilci ile ilişkilendirir. @tr

is dancer of
status: Published
definition: Relates an agent to a resource that includes a contribution by an agent of dancing in a musical or dramatic presentation.
type: Property
sub property of: is performer of
inverse of: has dancer
lexical alias: dancerOf.en
label: er danser i @da
definition: Relaterer en udøver, der bidrager til en ressource ved at danse i en musikalsk, dramatisk etc. præsentation til en ressource. @da
label: is danser van @nl
label: tanssijana aineistossa @fi
label: هو راقص لـ @ar
definition: يربط بين وكيل ومصدر يتضمن إسهام وكيل بالرقص في عرض موسيقي أو درامي. @ar
definition: Liittää toimijan aineistoon jonka tekemiseen hän osallistuu tanssimalla musiikki- tai näyttämöesityksessä. @fi
label: ist Tänzerin/Tänzer von @de
definition: Setzt einen Akteur in Beziehung zu einer Ressource, zu der ein Akteur beiträgt, indem er in einer musikalischen oder dramatischen Darbietung tanzt. @de
label: 是……的舞蹈者 @zh-hans
definition: 将一个行为者与包括在音乐或戏剧呈现中舞蹈的行为者的贡献的一种资源关联起来。 @zh-hans
label: táncosa a következőnek: @hu
definition: Hozzákapcsol egy ágenst egy forráshoz, amely magában foglalja egy zenei vagy drámai bemutatóban táncoló ágens közreműködését. @hu
label: dansçısıdır @tr
definition: Bir temsilciyi, müzikal veya dramatik bir sunumda dans eden bir temsilcinin katkısını içeren bir kaynakla ilişkilendirir. @tr

has date associated with agent (Deprecated)
definition: Relates a resource to a significant date associated with the history of an agent, or the date or range of dates on which a conference, etc., was held, or a date with which an agent is otherwise associated. (Deprecated)
type: Property
lexical alias: dateAssociatedWithAgent.en
label: har dato knyttet til agenten @da
definition: Relaterer en ressource til en væsentlig datering forbundet med en agents historie, eller et dato som en agent ellers forbindes med. @da
inverse of: is date associated with agent of (Deprecated)
sub property of: has related timespan of resource
status: Deprecated
has subproperty: has date of birth
has subproperty: has date of conference
has subproperty: has date of death
has subproperty: has date of establishment
has subproperty: has date of termination
has subproperty: has period of activity of agent

is date associated with agent of (Deprecated)
type: Property
lexical alias: dateAssociatedWithAgentOf.en
inverse of: has date associated with agent (Deprecated)
definition: Relates a timespan to an agent who has a significant association with a timespan. (Deprecated)
sub property of: has related agent of timespan
status: Deprecated
has subproperty: is date of birth of
has subproperty: is date of conference of
has subproperty: is date of death of
has subproperty: is date of establishment of
has subproperty: is date of termination of
has subproperty: is period of activity of agent of

has date of birth
status: Published
definition: Relates an agent to a timespan during which an agent was born.
type: Property
sub property of: has date associated with agent (Deprecated)
lexical alias: dateOfBirth.en
label: har fødselsår @da
definition: Relaterer en ressource til det år en agent blev født. @da
inverse of: is date of birth of
label: heeft geboortedatum @nl
label: له تاريخ ميلاد @ar
definition: يربط بين وكيل وعام وُلِد فيه وكيل. @ar
label: toimijan syntymäaika @fi
definition: Liittää toimijan vuoteen, jona toimija syntyi. @fi
label: hat Geburtsdatum @de
definition: Setzt einen Akteur in Beziehung zu einem Jahr, in dem ein Akteur geboren wurde. @de
label: 有出生日期 @zh-hans
definition: 将一个行为者与一个行为者出生的时间段关联起来。 @zh-hans
definition: Relaciona un agent amb un interval de temps durant el qual un agent va néixer. @ca
label: születésének ideje a következő: @hu
definition: Hozzákapcsol egy ágenst egy évhez, amikor az ágens született. @hu
label: doğum tarihi ile ilişkilidir @tr
definition: Bir temsilciyi, bir temsilcinin doğduğu yılla ilişkilendirir. @tr

is date of birth of
status: Published
type: Property
lexical alias: dateOfBirthOf.en
inverse of: has date of birth
definition: Relates a timespan to an agent who was born during a timespan.
sub property of: is date associated with agent of (Deprecated)
label: is geboortedatum van @nl
label: هو تاريخ ميلاد لـ @ar
definition: يربط بين فترة زمنية ووكيل وُلد خلال فترة زمنية. @ar
label: er fødested af @da
definition: Relaterer et tidsforløb til en agent, som var født i løbet af et tidforløb. @da
label: toimijan syntymäaika @fi
definition: Liittää ajanjakson toimijaan, joka on syntynyt ajanjakson aikana. @fi
label: ist Geburtsdatum von @de
definition: Setzt einen Zeitraum in Beziehung zu einem Akteur, der in einem Zeitraum geboren wurde. @de
label: 是……的出生日期 @zh-hans
definition: 将一个时间段与在一个时间段出生的一个行为者关联起来。 @zh-hans
label: születési időpontja a következőnek: @hu
definition: Hozzákapcsol egy időtartamot egy ágenshez, aki egy időtartam alatt született. @hu
label: doğum tarihidir @tr
definition: Bir zaman aralığını, bir zaman aralığı sırasında doğmuş bir temsilciyle ilişkilendirir. @tr

has date of capture
status: Published
definition: Relates a resource to a timespan associated with recording, filming, etc., the content of a resource.
type: Property
lexical alias: dateOfCapture.en
label: har optagelsestidspunkt/indspilningstidspunkt @da
definition: Relaterer en ressource til et år eller dato, der er knyttet til en indspilning, filmoptagelse, etc., af en ressources indhold. @da
inverse of: is date of capture of
label: heeft datum van vastleggen @nl
label: aineiston tallennusajankohta @fi
label: له تاريخ التقاط @ar
definition: يربط بين مصدر وفترة زمنية مرتبطة بتسجيل، تصوير، الخ.، محتوى مصدر. @ar
definition: Liittää aineiston ajanjaksoon, joka liittyy aineiston sisällön äänitykseen, filmaukseen tms. @fi
label: ist Aufzeichnungsdatum @de
definition: Setzt eine Ressource in Beziehung zu einem Zeitraum, der mit der Aufnahme, dem Filmen und so weiter des Inhalts einer Ressource in Verbindung steht. @de
label: 有摄录日期 @zh-hans
definition: 将一种资源与和一种资源的内容的录制、摄制等有关的一个时间段关联起来。 @zh-hans
label: felvétel időpontja a következő: @hu
definition: Hozzákapcsol egy forrást egy időtartamhoz, amely egy forrás tartalmának rögzítéséhez, filmezéséhez, stb. kapcsolódik. @hu
label: kayıt tarihi ile ilişkilidir @tr
definition: Bir kaynağı, bir kaynağın içeriğinin kaydedilmesi, filme alınması vb. ile bağlantılı bir zaman aralığıyla ilişkilendirir. @tr

is date of capture of
status: Published
type: Property
lexical alias: dateOfCaptureOf.en
inverse of: has date of capture
definition: Relates a timespan to a resource that is recorded, filmed, etc., during a timespan.
sub property of: has related resource of timespan
label: is datum van vastleggen van @nl
label: هو تاريخ التقاط لـ @ar
definition: يربط بين فترة زمنية ومصدر مُسجل، مصور...إلخ، خلال فترة زمنية. @ar
label: er optagelsessted af @da
definition: Relaterer et tidsforløb til en resource, somer indspillet, filmet, etc. i løbet af et tidforløb. @da
label: aineiston tallennusaika @fi
definition: Liittää ajanjakson aineistoon, jonka sisältö on äänitetty, kuvattu tms. paikassa. @fi
label: ist Aufzeichnungsdatum von @de
definition: Setzt einen Zeitraum in Beziehung zu einer Ressource, die in einem Zeitraum aufgenommen, verfilmt und so weiter wird. @de
label: 是……的摄录日期 @zh-hans
definition: 将一个时间段与在一个时间段录制、摄影等的一种资源关联起来。 @zh-hans
label: rögzítési időpontja a következőnek: @hu
definition: Hozzákapcsol egy időtartamot egy forráshoz, amelyet egy időtartam alatt rögzítettek, vettek filmre, stb. @hu
label: kaydının tarihidir @tr
definition: Bir zaman aralığını, bir zaman aralığı boyunca kaydedilen, filme alınan vb. bir kaynakla ilişkilendirir. @tr

has date of conference
status: Published
definition: Relates an agent to a timespan during which a conference, exhibition, or other formally named and convened event is held.
type: Property
sub property of: has date associated with agent (Deprecated)
lexical alias: dateOfConference.en
label: har datering af konference etc. @da
definition: Relaterer en ressource til et år eller en dato eller en række heraf, hvor en konference, en kongres, et møde, en udstilling, en messe, en festival etc. blev afholdt. @da
inverse of: is date of conference of
label: heeft datum van conferentie @nl
label: له تاريخ مؤتمر @ar
definition: يربط بين مصدر وتاريخ أو نطاق تواريخ تم فيها عقد مؤتمر، اِجتماع، لقاء، معرض فني، مهرجان، اِحتِفَال، إلخ. @ar
label: konferenssin aika @fi
definition: Liittää aineiston päivämäärään tai päivämääriin, jolloin konferenssi, kongressi, kokous, näyttely, messut, festivaalit tms. pidettiin. @fi
label: hat Datum einer Konferenz @de
definition: Setzt eine Ressource in Beziehung zu einem Datum oder einem Datumsbereich, zu dem eine Konferenz, ein Kongress, eine Ausstellung, eine Messe, ein Festival und so weiter stattfindet. @de
label: 有会议的日期 @zh-hans
definition: 将一个行为者与会议、展览或其他正式命名并举办的活动的时间跨度关联起来。 @zh-hans
definition: Relaciona un agent amb un interval de temps durant el qual se celebra un congrés, una exposició o qualsevol altre esdeveniment formalment esmentat i convocat. @ca
label: konferencia időpontja a következő: @hu
definition: Hozzákapcsol egy forrást egy dátumhoz vagy dátumtartományhoz, amikor konferenciát, kongresszust, találkozót, kiállítást, vásárt, fesztivált, stb. tartottak. @hu
label: konferans tarihi ile ilişkilidir @tr
definition: Bir kaynağı, bir konferansın, kongrenin, toplantının, serginin, fuarın, festivalin vb. düzenlendiği tarihi veya tarih aralığıyla ilişkilendirir. @tr

is date of conference of
status: Published
type: Property
lexical alias: dateOfConferenceOf.en
inverse of: has date of conference
definition: Relates a timespan to a conference, exhibition, or other event that gives rise to a resource that is held during a timespan.
sub property of: is date associated with agent of (Deprecated)
label: is datum van conferentie van @nl
label: هو تاريخ مؤتمر لـ @ar
definition: يربط بين فترة زمنية ومؤتمر، معرض، أو حدث آخر أسفر عن مصدر انعقد خلال فترة زمنية. @ar
label: er dato for konference af @da
definition: Relaterer et tidsforløb til en konference, udstilling eller andet event, der giver ophav til en ressource, som afholdes i løbet af et tidsforløb. @da
label: konferenssin ajankohta @fi
definition: Liittää ajanjakson ajanjakson aikana pidettyyn konferenssiin, näyttelyyn tai muuhun tapahtumaan, jonka seurauksena sntyy aineisto. @fi
label: ist Datum einer Konferenz von @de
definition: Setzt einen Zeitraum in Beziehung zu einer Konferenz, Ausstellung oder eine andere formal benannte und einberufene Veranstaltung, aus der eine Ressource hervorgeht und die in einem Zeitraum stattfindet. @de
label: 是……的会议的日期 @zh-hans
definition: 将一个时间段与在一个时间段中举行并导致一种资源的一次会议、展览或其他活动关联起来。 @zh-hans
label: időpontja a következő konferenciának: @hu
definition: Hozzákapcsol egy időtartamot egy konferenciához, kiállításhoz vagy más eseményhez, ami egy forrás létrejöttét eredményezi egy időtartam alatt. @hu
label: konferansının tarihidir @tr
definition: Bir zaman aralığını, bir zaman aralığında düzenlenen bir kaynağa olanak sağlayan bir konferans, sergi veya başka bir etkinlikle ilişkilendirir. @tr

has date of death
status: Published
definition: Relates an agent to a timespan during which an agent died.
type: Property
sub property of: has date associated with agent (Deprecated)
lexical alias: dateOfDeath.en
label: har dødsår @da
definition: Relaterer en ressource til det år en agent døde. @da
inverse of: is date of death of
label: heeft datum van overlijden @nl
label: له تاريخ وفاة @ar
definition: يربط بين وكيل وعام توفى فيه وكيل. @ar
label: toimijan kuolinaika @fi
definition: Liittää toimijan vuoteen, jona toimija kuoli. @fi
label: hat Sterbedatum @de
definition: Setzt einen Akteur in Beziehung zu einem Jahr, in dem ein Akteur gestorben ist. @de
label: 有去世日期 @zh-hans
definition: 将一个行为者与一个行为者去世的时间段关联起来。 @zh-hans
definition: Relaciona un agent amb un interval de temps durant el qual un agent mor. @ca
label: halálozásának ideje a következő: @hu
definition: Hozzákapcsol egy ágenst egy évhez, amikor az ágens elhunyt. @hu
label: ölüm tarihi ile ilişkilidir @tr
definition: Bir temsilciyi, bir temsilcinin öldüğü yılla ilişkilendirir. @tr

is date of death of
status: Published
type: Property
lexical alias: dateOfDeathOf.en
inverse of: has date of death
definition: Relates a timespan to an agent who died during a timespan.
sub property of: is date associated with agent of (Deprecated)
label: is sterfdatum van @nl
label: هو تاريخ وفاة لـ @ar
definition: يربط بين فترة زمنية ووكيل توفي خلال فترة زمنية. @ar
label: er dødsdato af @da
definition: Relaterer et tidsforløb til en agent, som døde under et tidsforløb. @da
label: toimjan kuolinaika @fi
definition: Liittää ajanjakson toimijaan, joka on kuollut ajanjakson aikana. @fi
label: ist Sterbedatum von @de
definition: Setzt einen Zeitraum in Beziehung zu einem Akteur, der in einem Zeitraum gestorben ist. @de
label: 是……的死亡日期 @zh-hans
definition: 将一个时间段与在一个时间段死亡的一个行为者关联起来。 @zh-hans
label: halálozási időpontja a következőnek: @hu
definition: Hozzákapcsol egy időtartamot egy ágenshez, aki egy időtartam alatt hunyt el. @hu
label: ölüm tarihidir @tr
definition: Bir zaman aralığını, bir zaman aralığı sırasında ölen bir temsilciyle ilişkilendirir. @tr

has date of distribution
status: Published
definition: Relates a resource to a timespan during which a published resource is distributed.
type: Property
lexical alias: dateOfDistribution.en
label: har distributionsår @da
definition: Relaterer en ressource til et år eller dato knyttet til distributionen af en ressource i publiceret form. @da
inverse of: is date of distribution of
sub property of: has related timespan of resource
label: heeft datum van distributie @nl
label: aineiston jakeluaika @fi
label: له تاريخ توزيع @ar
definition: يربط بين مصدر وفترة زمنية يتم خلالها توزيع مصدر منشور. @ar
definition: Liittää aineiston julkaistun aineiston jakeluun liittyvään ajanjaksoon. @fi
label: hat Vertriebsdatum @de
definition: Setzt eine Ressource in Beziehung zu einem Zeitraum, in dem eine veröffentlichte Ressource vertrieben wird. @de
label: 有发行日期 @zh-hans
definition: 将一种资源与一种出版资源被发行的时间段关联起来。 @zh-hans
label: terjesztés időpontja a következő: @hu
definition: Hozzákapcsol egy forrást egy időtartamhoz, amely alatt egy kiadott forrást terjesztenek. @hu
label: dağıtım tarihi ile ilişkilidir @tr
definition: Bir kaynağı, yayınlanan bir kaynağın dağıtıldığı bir zaman aralığıyla ilişkilendirir. @tr

is date of distribution of
status: Published
type: Property
lexical alias: dateOfDistributionOf.en
inverse of: has date of distribution
definition: Relates a timespan to a resource that is a published resource that is distributed during a timespan.
sub property of: has related resource of timespan
label: is datum van distributie van @nl
label: هو تاريخ توزيع لـ @ar
definition: يربط بين فترة زمنية ومصدر عبارة عن مصدر منشور تم توزيعه خلال فترة زمنية. @ar
label: er distributionsdato af @da
definition: Relaterer et tidsforløb til en ressource, som er en udgiven ressource, der er distribueret i løbet af et tidsforløb. @da
label: aineiston jakeluaika @fi
definition: Liittää ajanjakson julkaistuun aineistoon, jota jaellaan ajanjakson aikana. @fi
label: ist Vertriebsdatum von @de
definition: Setzt einen Zeitraum in Beziehung zu einer veröffentlichten Ressource, die in einem Zeitraum vertrieben wird. @de
label: 是……的发行的日期 @zh-hans
definition: 将一个时间段与作为一种出版资源在一个时间段内被发行的一种资源关联起来。 @zh-hans
label: terjesztési időpontja a következőnek: @hu
definition: Hozzákapcsol egy időtartamot egy kiadott forráshoz, amelyet egy időtartam alatt terjesztettek. @hu
label: dağıtım tarihidir @tr
definition: Bir zaman aralığını, bir zaman aralığı boyunca dağıtılan yayınlanmış bir kaynak olan bir kaynakla ilişkilendirir. @tr

has date of establishment
status: Published
definition: Relates an agent to a timespan during which an agent is established or founded.
type: Property
sub property of: has date associated with agent (Deprecated)
lexical alias: dateOfEstablishment.en
label: har etableringsår @da
definition: Relaterer en ressource til et år eller en dato hvor en agent blev etableret eller grundlagt. @da
inverse of: is date of establishment of
label: heeft datum van oprichting @nl
label: له تاريخ تأسيس @ar
definition: يربط بين مصدر وتاريخ أنشئ أو تأسس خلاله وكيل. @ar
label: aineistoon liittyvä toimijan perustamisaika @fi
definition: liittää aineiston ajanjaksoon, jonka aikana toimija on perustettu. @fi
label: hat Gründungsdatum @de
definition: Setzt eine Ressource in Beziehung zu einem Datum, zu dem ein Akteur eingeführt oder gegründet wurde. @de
label: 有成立日期 @zh-hans
definition: 将一个行为者与一个行为者成立或创办的时间段关联起来。 @zh-hans
definition: Relaciona un agent amb un interval de temps durant el qual un agent es crea o es funda. @ca
label: alapítási időpontja a következő: @hu
definition: Hozzákapcsol egy forrást egy időponthoz, amikor az ágenst alapították. @hu
label: kuruluş tarihi ile ilişkilidir @tr
definition: Bir kaynağı, bir temsilcinin kurulduğu veya oluşturulduğu tarihle ilişkilendirir. @tr

is date of establishment of
status: Published
type: Property
lexical alias: dateOfEstablishmentOf.en
definition: Relates a timespan to an agent who is established or founded during a timespan.
sub property of: is date associated with agent of (Deprecated)
label: is datum van oprichting van @nl
label: هو تاريخ إنشاء لـ @ar
definition: يربط بين فترة زمنية ووكيل أُنشئ أو تأسس خلال فترة زمنية. @ar
label: er dato for etablering af @da
definition: Relaterer et tidsforløb til en agent, som er etableret eller grundlagt i løbet af et tidsforløb. @da
label: yhteistoimijan perustamisaika @fi
definition: Liittää ajanjakson toimijaan, joka on perustettu ajanjakson aikana. @fi
label: ist Gründungsdatum von @de
definition: Setzt einen Zeitraum in Beziehung zu einem Akteur, der in einem Zeitraum eingeführt oder gegründet wurde. @de
label: 是……的成立的日期 @zh-hans
definition: 将一个时间段与在一个时间段中成立或创办的一个行为者关联起来。 @zh-hans
label: alapítási időpontja a következőnek: @hu
definition: Hozzákapcsol egy időtartamot egy ágenshez, amelyet egy időtartam alatt alapítottak vagy létesítettek. @hu
label: kuruluşunun tarihidir @tr
definition: Bir zaman aralığını, bir zaman aralığı sırasında tesis edilen veya kurulan bir temsilciyle ilişkilendirir. @tr

has date of manufacture
status: Published
definition: Relates a resource to a timespan during which a published resource is printed, duplicated, cast, or otherwise manufactured.
type: Property
lexical alias: dateOfManufacture.en
label: har fremstillingsår @da
definition: Relaterer en ressource til et år eller dato knyttet til trykning, duplikering, støbning etc. af en ressource i publiceret form. @da
inverse of: is date of manufacture of
sub property of: has related timespan of resource
label: heeft datum van vervaardiging @nl
label: aineiston valmistusaika @fi
label: له تاريخ تصنيع @ar
definition: يربط بين مصدر وفترة زمنية يتم خلالها طباعة مصدر منشور، أو نسخه، أو صياغته، أو إنتاجه بطريقة أخرى. @ar
definition: Liittää aineiston julkaistun aineiston painamiseen, monistamiseen, kirjasinten valamiseen tai muuhun valmistamiseen liittyvään ajanjaksoon. @fi
label: ist Herstellungsdatum @de
definition: Setzt eine Ressource in Beziehung zu einem Zeitraum, in dem eine veröffentlichte Ressource gedruckt, vervielfältigt, gegossen oder anderweitig hergestellt wird. @de
label: 有生产日期 @zh-hans
definition: 将一种资源与一种出版资源被印刷、复制、铸造或其他方式生产的一个时间段关联起来。 @zh-hans
label: gyártás időpontja a következő: @hu
definition: Hozzákapcsol egy forrást egy időtartamhoz, amely alatt egy kiadott forrást nyomtattak, sokszorosítottak, öntöttek vagy egyéb módon gyártotak. @hu
label: imalat tarihi ile ilişkilidir @tr
definition: Bir kaynağı, yayınlanan bir kaynağın basıldığı, çoğaltıldığı, yayınlandığı veya başka bir şekilde imal edildiği bir zaman aralığıyla ilişkilendirir. @tr

is date of manufacture of
status: Published
type: Property
lexical alias: dateOfManufactureOf.en
inverse of: has date of manufacture
definition: Relates a timespan to a resource that is a published resource that is printed, duplicated, cast, etc., during a timespan.
sub property of: has related resource of timespan
label: is datum van vervaardiging van @nl
label: له تاريخ تصنيع لـ @ar
definition: يربط بين فترة زمنية ومصدر عبارة عن مصدر منشور طُبع، ونسخ، وبث...إلخ، خلال فترة زمنية. @ar
label: er fremstillingsdato af @da
definition: Relaterer et tidsforløb til en ressource, som er en udgiven ressource, der er trykt, duplicert, støbt etc. i løbet af et tidsforløb. @da
label: aineiston valmistusaika @fi
definition: Liittää ajanjakson julkaistuun aineistoon, joka on painettu, monistettu, valettu kirjasinten osalta tms. ajanjakson aikana. @fi
label: ist Herstellungsdatum von @de
definition: Setzt einen Zeitraum in Beziehung zu einer veröffentlichten Ressource, die in einem Zeitraum gedruckt, vervielfältigt, gegossen und so weiter wird. @de
label: 是……的生产日期 @zh-hans
definition: 将一个时间段与作为一种出版资源并在一个时间段被印刷、复制、铸造等的一种资源关联起来。 @zh-hans
label: gyártási időpontja a következőnek: @hu
definition: Hozzákapcsol egy időtartamot egy kiadott forráshoz, amelyet egy időtartam alatt nyomtattak, sokszorosítottak, öntöttek, stb. @hu
label: üretim tarihidir @tr
definition: Bir zaman aralığını, bir zaman aralığı boyunca basılan, çoğaltılan, yayınlanan vb. yayınlanmış bir kaynak olan bir kaynakla ilişkilendirir. @tr

has date of production
status: Published
definition: Relates a resource to a timespan during which an unpublished resource is inscribed, fabricated, constructed, or otherwise produced.
type: Property
lexical alias: dateOfProduction.en
label: har produktionsår @da
definition: Relaterer en ressource til et år eller dato knyttet til indgravering, fremstilling, konstruktion etc. af en ressource i upubliceret form. @da
inverse of: is date of production of
sub property of: has related timespan of resource
label: heeft datum van productie @nl
label: aineiston tuotantoaika @fi
label: له تاريخ إنتاج @ar
definition: يربط بين مصدر وفترة زمنية يتم خلالها تدوين مصدر غير منشور، أو تأليفه، أو تجميعه، أو إنتاجه بطريقة أخرى. @ar
definition: Liittää aineiston julkaisemattoman aineiston kaivertamiseen, valmistamiseen, kokoamiseen tai muuhan tuottamiseen liittyvään ajanjaksoon. @fi
label: ist Entstehungsdatum @de
definition: Setzt eine Ressource in Beziehung zu einem Zeitraum, in dem eine unveröffentlichte Ressource beschriftet, erschaffen, konstruiert oder anderweitig produziert wird. @de
label: 有制作日期 @zh-hans
definition: 将一种资源与一种非出版资源被镌刻、制造、构建或其他方式制作的时间段关联起来。 @zh-hans
label: létrehozás időpontja a következő: @hu
definition: Hozzákapcsol egy forrást egy időtartamhoz, amely alatt egy nem kiadatlan forrást írnak, készítenek, szerkesztenek vagy egyéb módon előállítanak. @hu
label: üretim tarihi ile ilişkilidir @tr
definition: Bir kaynağı, yayınlanmamış bir kaynağın tescil edildiği, imal edildiği, yapılandırıldığı veya başka bir şekilde üretildiği bir zaman aralığıyla ilişkilendirir. @tr

is date of production of
status: Published
type: Property
lexical alias: dateOfProductionOf.en
inverse of: has date of production
definition: Relates a timespan to a resource that is an unpublished resource that is inscribed, fabricated, constructed, etc., during a timespan.
sub property of: has related resource of timespan
label: is datum van productie van @nl
label: هو تاريخ إنتاج لـ @ar
definition: يربط بين فترة زمنية ومصدر عبارة عن مصدر غير منشور تم تأليفه، تجميعه، إنتاجه...إلخ، خلال فترة زمنية. @ar
label: er produktionsdato af @da
definition: Relaterer et tidsforløb til en ressource, som er en ikke publiceret ressource, der er indskrevet, fremstillet, konstrueret etc. i løbet af et tidsforløb. @da
label: aineiston tuotantoaika @fi
definition: Liittää ajanjakson julkaisemattomaan aineistoon, joka on kaiverrettu, valmistettu, koottu tms. ajanjakson aikana. @fi
label: ist Entstehungsdatum von @de
definition: Setzt einen Zeitraum in Beziehung zu einer unveröffentlichten Ressource, die in einem Zeitraum beschriftet, fabriziert, konstruiert und so weiter wird. @de
label: 是……的制作日期 @zh-hans
definition: 将一个时间段与作为一种非出版资源并在一个时间段镌刻、制造、构建等的一种资源关联起来。 @zh-hans
label: létrehozási időpontja a következőnek: @hu
definition: Hozzákapcsol egy időtartamot egy kiadatlan forráshoz, amelyet egy időtartam alatt írtak, készítettek, szerkesztettek stb. @hu
label: yapım tarihidir @tr
definition: Bir zaman aralığını, bir zaman aralığında yazılmış, üretilmiş, oluşturulmuş, vb. yayınlanmamış bir kaynak olan kaynakla ilişkilendirir. @tr

has date of publication
status: Published
definition: Relates a resource to a timespan during which a published resource is published, released, or issued.
type: Property
lexical alias: dateOfPublication.en
label: har udgivelsesår @da
definition: Relaterer en ressource til et år eller dato knyttet til publicering, offentliggørelse eller udgivelse af en ressource. @da
inverse of: is date of publication of
sub property of: has related timespan of resource
label: heeft datum van publicatie @nl
label: aineiston julkaisuaika @fi
label: له تاريخ نشر @ar
definition: يربط بين مصدر وفترة زمنية يتم خلالها نشر مصدر منشور، أو إطلاقه، أو إصداره. @ar
definition: Liittää aineiston aineiston kustantamiseen, julkaisemiseen tai ilmestymiseen liittyvään ajanajaksoon. @fi
label: hat Erscheinungsdatum @de
definition: Setzt eine Ressource in Beziehung zu einem Zeitraum, in dem eine veröffentlichte Ressource veröffentlicht, freigeschaltet oder herausgegeben wird. @de
label: 有出版日期 @zh-hans
definition: 将一种资源与一种出版资源被出版、发布、发行的时间段关联起来。 @zh-hans
label: kiadás időpontja a következő: @hu
definition: Hozzákapcsol egy forrást egy időtartamhoz, amely alatt egy kiadott forrást kiadnak, kibocsájtanak vagy megjelentetnek. @hu
label: yayın tarihi ile ilişkilidir @tr
definition: Bir kaynağı, yayınlanan bir kaynağın yayınlandığı, piyasaya sürüldüğü veya çıkarıldığı bir zaman aralığıyla ilişkilendirir. @tr

is date of publication of
status: Published
type: Property
lexical alias: dateOfPublicationOf.en
inverse of: has date of publication
definition: Relates a timespan to a resource that is published, released, or issued in a published form during a timespan.
sub property of: has related resource of timespan
label: is datum van publicatie van @nl
label: هو تاريخ نشر لـ @ar
definition: يربط بين فترة زمنية ومصدر تم نشره، بثه، أو إصداره في شكل منشور خلال فترة زمنية. @ar
label: er publiceringsdato af @da
definition: Relaterer et tidsforløb til en ressource, som er publiceret, frigivet,eller udgivet i publiceret form i løbet af et tidsforløb. @da
label: aineiston julkaisuaika @fi
definition: Liittää ajanjakson aineistoon, joka on kustannettu, julkaistu tai ilmestynyt ajanjakson aikana. @fi
label: ist Erscheinungsdatum von @de
definition: Setzt einen Zeitraum in Beziehung zu einer Ressource, die in einem Zeitraum in veröffentlichter Form veröffentlicht, freigeschaltet oder herausgegeben wird. @de
label: 是……的出版日期 @zh-hans
definition: 将一个时间段与在一个时间段以出版形式被出版、发布或发行的一种资源关联起来。 @zh-hans
label: kiadási időpontja a következőnek: @hu
definition: Hozzákapcsol egy időtartamot egy kiadott forráshoz, amelyet egy időtartam alatt publikált formában kiadtak, kibocsájtottak vagy megjelentettek. @hu
label: yayınlanma tarihidir @tr
definition: Bir zaman aralığını, bir zaman aralığı boyunca yayınlanan, piyasaya sürülen veyayayınlanmış bir biçimde piyasaya çıkarılan bir kaynakla ilişkilendirir. @tr

has date of resource
status: Published
definition: Relates a resource to a timespan that is the earliest associated with a resource.
type: Property
lexical alias: dateOfResource.en
label: har datering af ressource @da
definition: Relaterer en ressource til tidligste dato knyttet til en ressource. @da
inverse of: is date of resource of
sub property of: has related timespan of resource
label: heeft datum van resource @nl
label: له تاريخ مصدر @ar
definition: يربط بين مصدر ونطاق زمني يمثل أقرب تاريخ مرتبط بمصدر. @ar
label: aineiston ajankohta @fi
definition: Liittää aineiston varhaisimpaan aineistoon liittyvään ajankohtaan. @fi
label: hat Datum einer Ressource @de
definition: Setzt eine Ressource in Beziehung zu einem Zeitraum, der am frühesten mit einer Ressource in Verbindung steht. @de
label: 有资源的日期 @zh-hans
definition: 将一种资源与和一种资源有关的最早的时间段关联起来。 @zh-hans
label: forráshoz kapcsolódó idő a következő: @hu
definition: Hozzákapcsol egy forrást egy legkorábbi időtartamhoz, ami egy forrással társítható. @hu
has subproperty: has year degree granted
label: kaynak tarihi ile ilişkilidir @tr
definition: Bir kaynağı, bir kaynakla en erken ilişkilendirilen zaman aralığıyla ilişkilendirir. @tr

is date of resource of
status: Published
type: Property
lexical alias: dateOfResourceOf.en
inverse of: has date of resource
definition: Relates a timespan to a resource associated with an earliest timespan.
sub property of: has related resource of timespan
label: is datum van resource van @nl
label: هو تاريخ مصدر لـ @ar
definition: يربط بين فترة زمنية ومصدر مرتبط بأقرب فترة زمنية. @ar
label: er dato for ressource af @da
definition: Relaterer et tidsforløb til en ressource, der er knyttet til et tidligste tidsforløb. @da
label: aineiston ajankohta @fi
definition: Liittää ajanjakson aineistoon, johon ajanjakso aikaisintaan liittyy. @fi
label: ist Datum einer Ressource von @de
definition: Setzt einen Zeitraum in Beziehung zu einer Ressource, die mit dem frühesten Zeitraum in Verbindung steht. @de
label: 是……的资源的日期 @zh-hans
definition: 将一个时间段与和一个最早时间段有关的一种资源关联起来。 @zh-hans
label: a következő forráshoz kapcsolódó időpont @hu
definition: Hozzákapcsol egy időtartamot egy korábbi időtartamhoz kapcsolódó forráshoz. @hu
label: kaynağının tarihidir @tr
definition: Bir zaman aralığını, en erken bir zaman aralığıyla bağlantılı olan bir kaynakla ilişkilendirir. @tr

has date of termination
status: Published
definition: Relates an agent to a timespan during which an agent is terminated or dissolved.
type: Property
sub property of: has date associated with agent (Deprecated)
lexical alias: dateOfTermination.en
label: har ophørsår @da
definition: Relaterer en ressource til år eller dato, hvor en agent ophørte eller blev opløst. @da
inverse of: is date of termination of
label: heeft datum van opheffing @nl
label: له تاريخ توقف @ar
definition: يربط بين مصدر وتاريخ توقف الوكيل خلاله أو حُلّ. @ar
label: aineistoon liittyvä toimijan lakkauttamisaika @fi
definition: liittää aineiston ajanjaksoon, jonka aikana toimija on lakkautettu tai hajotettu. @fi
label: hat Auflösungsdatum @de
definition: Setzt eine Ressource in Beziehung zu einem Datum, zu dem ein Akteur aufgehoben oder aufgelöst wurde. @de
label: 有终止日期 @zh-hans
definition: 将一个行为者与一个行为者终止或解散的时间段关联起来。 @zh-hans
definition: Relaciona un agent amb un interval de temps durant el qual un agent cessa o es dissol. @ca
label: megszüntetés időpontja a következő: @hu
definition: Hozzákapcsol egy forrást egy időponthoz, amikor az ágenst megszüntették vagy feloszlatták. @hu
label: sonlanma tarihi ile ilişkilidir @tr
definition: Bir kaynağı, bir temsilcinin sonlandırıldığı veya feshedildiği tarihle ilişkilendirir. @tr

is date of termination of
status: Published
type: Property
lexical alias: dateOfTerminationOf.en
inverse of: has date of termination
definition: Relates a timespan to an agent who is terminated or dissolved during a timespan.
sub property of: is date associated with agent of (Deprecated)
label: is datum van opheffing van @nl
label: هو تاريخ توقف لـ @ar
definition: يربط بين فترة زمنية ووكيل توقف أو حُلَّ خلال فترة زمنية. @ar
label: er ophørsdato af @da
definition: Relaterer et tidsforløb til en agent, som er ved at ophøre eller opløses i løbet af et tidsforløb. @da
label: yhteistoimijan lakkauttamisajankohta @fi
definition: Liittää ajanjakson yhteistoimijaan, joka on lakkautettu tai hajotettu ajanjakson aikana. @fi
label: ist Auflösungsdatum von @de
definition: Setzt einen Zeitraum in Beziehung zu einem Akteur, der in einem Zeitraum aufgehoben oder aufgelöst wurde. @de
label: 是……的终止的日期 @zh-hans
definition: 将一个时间段与在一个时间段中终止或解散的一个行为者关联起来。 @zh-hans
label: megszűnési időpontja a következőnek: @hu
definition: Hozzákapcsol egy időtartamot egy ágenshez, amelyet egy időtartam alatt szüntettek meg vagy oszlattak fel. @hu
label: sonlanma tarihidir @tr
definition: Bir zaman aralığını, bir zaman aralığı sırasında sonlandırılan veya feshedilen bir temsilciyle ilişkilendirir. @tr

has date of usage (Deprecated)
status: Deprecated
lexical alias: dateOfUsage.en
definition: Relates a nomen to a date or range of dates that is associated with the use of an appellation of an entity. (Deprecated)
type: Property

has date of usage
status: Published
definition: Relates a nomen to a timespan that is a date or range of dates that is associated with the use of a nomen.
type: Property
lexical alias: dateOfUsage.en
label: har anvendelsesperiode @da
definition: Relaterer et navn til et år eller dato eller række af år eller datoer datoer knyttet til brugen af det navn, der er valgt som det foretrukne navn for en agent. @da
inverse of: is date of usage of
label: heeft datum van gebruik @nl
label: aineiston käyttöajankohta @fi
label: له تاريخ استخدام @ar
definition: يربط بين تسمية وتاريخ أو نطاق تواريخ مرتبطة باستخدام اسم كيان. @ar
definition: iittää nomenin ajanjaksoon, joka on entiteetin nimityksen käyttöön liittyvä ajankohta tai aikaväli. @fi
label: hat Verwendungsdatum @de
definition: Setzt ein Nomen in Beziehung zu einem Datum oder einem Datumsbereich, das/der mit der Verwendung von einer Bezeichnung für eine Entität in Verbindung steht. @de
label: 有利用日期 @zh-hans
definition: 将一个命名与作为和一个命名的使用有关的一个日期或者日期范围的一个时间段关联起来。 @zh-hans
definition: Relaciona un nomen amb un interval de temps que és una data o un rang de dates que s’associa amb l’ús d’un nomen. @ca
label: használat időpontja a következő: @hu
definition: Hozzákapcsol egy noment egy dátumhoz vagy dátumtartományhoz, amely egy entitás megnevezésének a használatához kapcsolódik. @hu
label: kullanım tarihi ile ilişkilidir @tr
definition: Bir ismi, bir varlığın ünvanının kullanımıyla bağlantılı bir tarih veya tarih aralığıyla ilişkilendirir. @tr

is date of usage of
status: Published
type: Property
lexical alias: dateOfUsageOf.en
inverse of: has date of usage
definition: Relates a timespan to a nomen that is an appellation of an entity used during a timespan.
label: is datum van gebruik van @nl
label: هو تاريخ استخدام لـ @ar
definition: يربط بين فترة زمنية وتسمية لكيان مستخدم خلال فترة زمنية @ar
label: er dato for brug af @da
definition: Relaterer et tidsforløb til en benævnelse på en entitet brugt i løbet af et tidsforløb. @da
label: entiteetin käyttöajankohta @fi
definition: Liittää ajanjakson ajanjakson aikana käytössä olleen entiteetin nimitykseen. @fi
label: ist Verwendungsdatum von @de
definition: Setzt einen Zeitraum in Beziehung zu einer Bezeichnung für eine Entität, die in einem Zeitraum verwendet wird. @de
label: 是……的使用日期 @zh-hans
definition: 将一个时间段与用于一个时间段并作为一个实体之称谓的一个命名关联起来。 @zh-hans
definition: Relaciona un interval de temps amb un nomen que és una apel·lació d’una entitat usada durant un interval de temps. @ca
label: használati időpontja a következőnek: @hu
definition: Hozzákapcsol egy időtartamot egy időtartam alatt használt entitás megnevezéséhez. @hu
label: kullanım tarihidir @tr
definition: Bir zaman aralığını, bir zaman aralığı boyunca kullanılan bir varlığın unvanıyla ilişkilendirir. @tr

has declination
status: Published
type: Property
lexical alias: declination.en
definition: Relates a resource to the angular distance of a celestial body that is measured north or south through 90° from the celestial equator along the hour circle through the body.
label: har deklination @da
definition: Relaterer en ressource til en vinkelafstand til et himmellegeme, målt nord eller syd gennem 90° fra himmelækvator langs himmellegemets timekrans. @da
label: heeft declinatie @nl
label: له زاوية ميل أو انحراف @ar
definition: يربط بين مصدر ومسافة زاوية لجسم على الكرة السماوية مقاسة شمالًا أو جنوبًا خلال 90 درجة من خط الاستواء السماوي على طول دائرة ساعة الجسم. @ar
label: deklinaatio aineistossa @fi
label: hat Deklination @de
definition: Setzt eine Ressource in Beziehung zu einem Winkelabstand eines Himmelskörpers vom Himmelsäquator, der nördlich oder südlich durch 90° vom Himmelsäquator entlang des Stundenkreises des Körpers gemessen wird. @de
definition: Liittää aineiston taivaankappaleen kulmaetäisyyteen, joka on mitattu taivaanekvaattorista pohjoiseen tai etelään 90°:een läpi kappaleen tuntiympyrää pitkin. @fi
label: 有赤纬 @zh-hans
definition: 将一种资源与从天球赤道沿天体时圈通过90度向北或向南度量的角距离关联起来。 @zh-hans
definition: Relaciona un recurs amb la distància angular d’un cos celeste que es mesura al nord o al sud a 90º de l’equador celeste al llarg del cercle horari passant pel cos. @ca
label: deklinációja a következő: @hu
definition: Hozzákapcsol egy forrást az égi egyenlítőtől az éggömbön lévő égitesthez 90°-ban északra vagy délre mért szögtávolsághoz az égitest óraköre mentén. @hu
label: eğim ile ilişkilidir @tr
definition: Bir kaynağı, bir cismin içinden geçen saat dairesi boyunca gök ekvatorundan 90° ile kuzeyde veya güneyde ölçülen gök cisminin açısal mesafesi ile ilişkilendirir. @tr

has dedicatee
status: Published
definition: Relates a resource to an agent to whom a resource is dedicated.
type: Property
sub property of: has other agent associated with resource (Deprecated)
inverse of: is dedicatee of
lexical alias: dedicatee.en
label: har tilegnet @da
definition: Relaterer en ressource til en agent, som en ressource er tilegnet. @da
label: heeft opgedragene @nl
label: aineiston omistuksen kohde @fi
label: له مُهدَى إليه @ar
definition: يربط مصدر بوكيل أُهدي إليه مصدر. @ar
definition: Liittää aineiston toimijaan, jolle se on omistettu. @fi
label: hat Widmungsempfängerin/Widmungsempfänger @de
definition: Setzt eine Ressource in Beziehung zu einem Akteur, dem eine Ressource gewidmet ist. @de
label: 有被题献者 @zh-hans
definition: 将一种资源与一种资源被题献的一个行为者关联起来。 @zh-hans
label: dedikáltja a következő: @hu
definition: Hozzákapcsol egy forrást egy ágenshez, amelynek a forrást dedikálják. @hu
label: ithaf edilen ile ilişkilidir @tr
definition: Bir kaynağı, kendisine kaynağın ithaf edildiği bir temsilci ile ilişkilendirir. @tr

is dedicatee of
status: Published
definition: Relates an agent to a resource that involves a responsibility of an agent for being commemorated.
type: Property
sub property of: is other agent associated with resource of (Deprecated)
inverse of: has dedicatee
lexical alias: dedicateeOf.en
label: er tilegnet i @da
definition: Relaterer en agent som en ressource er tilegnet til en ressource. @da
label: is opgedragene van @nl
label: هو مُهدَى إليه لـ @ar
definition: يربط بين وكيل ومصدر ينطوي على مسؤولية وكيل عن الاحتفال به. @ar
label: omistuksen kohde (toimija) aineistossa @fi
definition: Liittää toimijan aineistoon, joka on omistettu toimijalle. @fi
label: ist Widmungsempfängerin/Widmungsempfänger von @de
definition: Setzt einen Akteur in Beziehung zu einer Ressource, die einem Akteur gewidmet ist. @de
label: 是……的被题献者 @zh-hans
definition: 将一个行为者与涉及被纪念的一个行为者的责任的一种资源关联起来。 @zh-hans
label: dedikáltja a következőnek: @hu
definition: Hozzákapcsol egy ágenst egy forráshoz, amely magában foglalja az ágensnek azt a felelősségét, amiért megemlékeznek róla. @hu
label: ithaf edilenidir @tr
definition: Bir temsilciyi, anılmış olmaya ilişkin bir temsilcinin sorumluluğunu içeren bir kaynakla ilişkilendirir @tr

has dedicator
status: Published
definition: Relates a resource to an agent who assigns a resource as an acknowledgement of the inspiration or support of a related agent.
type: Property
sub property of: has other agent associated with resource (Deprecated)
inverse of: is dedicator of
lexical alias: dedicator.en
label: har tilegner @da
definition: Relaterer en ressource til en agent, som har tilegnet en ressource. @da
label: heeft opdrager @nl
label: omistuksen tekijä aineistossa @fi
label: له مُهدي كتاب @ar
definition: يربط مصدر بوكيل خصص مصدر كإقرار بإلهام أو دعم وكيل ذو صلة. @ar
definition: Liittää aineiston toimijaan, joka omistaa aineiston liittyvälle toimijalle kiitoksena inspiraatiosta tai tuesta. @fi
label: hat Widmende/Widmenden @de
definition: Setzt eine Ressource in Beziehung zu einem Akteur, der eine Ressource als Zeichen der Anerkennung oder Unterstützung einem in Beziehung stehenden Akteur widmet. @de
label: 有题献者 @zh-hans
definition: 将一种资源与指定一种资源作为一个相关行为者的启发或支持之感谢的一个行为者关联起来。 @zh-hans
label: dedikálója a következő: @hu
definition: Hozzákapcsol egy forrást egy ágenshez, amely köszönetképpen megjelöl egy forrást egy kapcsolódó ágens inspirációjáért, támogatásáért cserébe. @hu
label: ithaf eden ile ilişkilidir @tr
definition: Bir kaynağı, ilgili bir temsilcinin ilhamı veya desteğinin bir teşekkürü olarak bir eseri atfeden bir temsilci ilişkilendirir. @tr

is dedicator of
status: Published
definition: Relates an agent to a resource that is assigned as an acknowledgement of the inspiration or support of a related agent.
type: Property
sub property of: is other agent associated with resource of (Deprecated)
inverse of: has dedicator
lexical alias: dedicatorOf.en
label: er tilegner af @da
definition: Relaterer en agent, som har tilegnet en ressource til en ressource. @da
label: is opdrager van @nl
label: هو مُهدي كتاب @ar
definition: يربط بين وكيل ومصدر تم تعيينه باعتباره إقرارًا بإلهام أو دعم وكيل ذي صلة. @ar
label: omistuskirjoitus aineistossa @fi
definition: Liittää toimijan aineistoon, joka on omistettu liittyvälle toimijalle kiitoksena inspiraatiosta tai tuesta. @fi
label: ist Widmende/Widmender von @de
definition: Setzt einen Akteur in Beziehung zu einer Ressource, die als Zeichen der Anerkennung oder Unterstützung einem in Beziehung stehenden Akteur gewidmet ist. @de
label: 是……的题献者 @zh-hans
definition: 将一个行为者与被指定对一个相关行为者的启发或支持之感谢的一种资源关联起来。 @zh-hans
label: dedikálója a következőnek: @hu
definition: Hozzákapcsol egy ágenst egy forráshoz, amelyet a forráshoz kapcsolódó ágens ösztönzésének vagy támogatásának köszöneteként jelölnek meg. @hu
label: ithaf edenidir @tr
definition: Bir temsilciyi, ilgili bir temsilcinin ilhamının veya desteğinin onayı olarak atanan bir kaynakla ilişkilendirir. @tr

has defendant
status: Published
definition: Relates a resource to an agent who is accused in a criminal proceeding or sued in a civil proceeding.
type: Property
sub property of: has other agent associated with resource (Deprecated)
inverse of: is defendant of
lexical alias: defendant.en
label: har sagsøgt @da
definition: Relaterer en ressource til en agent, der er anklaget i en straffesag eller sagsøgt i en civilsag. @da
label: heeft verweerder @nl
label: henkilövastaaja @fi
label: له مُدَّعَى عليه @ar
definition: يربط مصدر بوكيل متهم في دعوى جنائية أو يحاكم في دعوى مدنية. @ar
definition: Liittää aineiston henkilöön, joka on syytteessä rikosoikeudenkäynnissä tai haastettuna siviilioikeudenkäynnissä. @fi
label: hat Angeklagte/Angeklagten/Beklagte/Beklagten @de
definition: Setzt eine Ressource in Beziehung zu einem Akteur, der in einem Strafverfahren angeklagt oder in einem Zivilverfahren verklagt ist. @de
label: 有被告 @zh-hans
definition: 将一种资源与在刑事或民事诉讼中被控告的一个行为者关联起来。 @zh-hans
label: alperese a következő: @hu
definition: Hozzákapcsol egy forrást egy ágenshez, amelyet büntetőjogi eljárásban vádolnak, vagy polgári jogi eljárásban perelnek. @hu
has subproperty: has civil defendant
has subproperty: has criminal defendant
label: davalı ile ilişkilidir @tr
definition: Bir kaynağı, ceza davasında suçlanan veya bir hukuk davasında dava edilen bir temsilci ile ilişkilendirir. @tr

is defendant of
status: Published
definition: Relates an agent to a resource that involves a responsibility of an agent for being accused in a criminal proceeding or sued in a civil proceeding.
type: Property
sub property of: is other agent associated with resource of (Deprecated)
inverse of: has defendant
lexical alias: defendantOf.en
label: er sagsøgt af @da
definition: Relaterer en agent der er anklaget i en straffesag eller sagsøgt i en civil sag til en ressource. @da
label: is verweerder van @nl
label: هو مُدَّعَى عليه لـ @ar
definition: يربط بين وكيل ومصدر ينطوي على مسؤولية وكيل عن اتهامه في دعوى جنائية أو مقاضاته في دعوى مدنية. @ar
label: vastaaja (toimija) aineistossa @fi
definition: Liittää toimijan aineistoon, jossa toimija on syytettynä rikosoikeudenkäynnissä tai haastetuna siviilioikeudenkäynnissä. @fi
label: ist Angeklagte/Angeklagter von @de
definition: Setzt einen Akteur in Beziehung zu einer Ressource, die mit einer Verantwortung verbunden ist, als Akteur in einem Strafverfahren angeklagt oder in einem Zivilverfahren verklagt zu werden. @de
label: 是……的被告 @zh-hans
definition: 将一个行为者与涉及在刑事或民事诉讼中被控告的一个行为者的责任的一种资源关联起来。 @zh-hans
label: alperese a következőnek: @hu
definition: Hozzákapcsol egy ágenst egy forráshoz, amelyhez hozzátartozik annak felelőssége, hogy egy ágenst egy büntetőeljárásban megvádolnak, vagy egy polgári perben beperelnek. @hu
has subproperty: is civil defendant of
has subproperty: is criminal defendant of
label: davalısıdır @tr
definition: Bir temsilciyi, bir ceza davasında suçlanmak veya bir hukuk davasında dava edilmeye ilişkin bir temsilcinin sorumluluğunu içeren bir kaynakla ilişkilendirir. @tr

has degree committee member
status: Published
type: Property
lexical alias: degreeCommitteeMember.en
definition: Relates a resource to an agent who serves on a committee that supervises a thesis or dissertation of a student.
inverse of: is degree committee member of
sub property of: has other agent associated with resource (Deprecated)
label: har medlem af kandidatudvalg @da
definition: Relaterer en ressource til en agent, der er medlem af et udvalg, der fører tilsyn med en studerendes speciale eller afhandling. @da
label: heeft graad commissie-lid @nl
label: له عضو لجنة تمنح درجة أكاديمية @ar
definition: يربط مصدر بوكيل يعمل في لجنة تشرف على رسالة جامعية أو أطروحة لطالب. @ar
label: opinnäytteen tarkastaja @fi
definition: Liittää aineiston toimijaan, joka toimii opiskelijan akateemisen opinnäytteen tai väitöskirjan tarkastaneessa komiteassa. @fi
label: hat Mitglied eines Graduierungsausschusses @de
definition: Setzt eine Ressource in Beziehung zu einem Akteur, der Mitglied eines Ausschusses ist, der eine Hochschulschrift von einer Studentin/einem Studenten beaufsichtigt. @de
label: 有学位委员会成员 @zh-hans
definition: 将一种资源与在一个委员会中任职并指导一个学生论文的一个行为者关联起来。 @zh-hans
definition: Relaciona un recurs amb un agent que forma part d’un comitè que supervisa una tesi o una dissertació d’un estudiant. @ca
label: diplomabizottsági tagja a következő: @hu
definition: Hozzákapcsol egy forrást egy ágenshez, aki egy olyan bizottságban szolgál, amely felügyeli egy hallgató szakdolgozatát vagy disszertációját. @hu
label: tez komitesi üyesi ile ilişkilidir @tr
definition: Bir kaynağı, bir öğrencinin tezini veya bitirme tezini denetleyen bir komitede görev yapan bir temsilci ile ilişkilendirir. @tr

is degree committee member of
status: Published
type: Property
lexical alias: degreeCommitteeMemberOf.en
definition: Relates an agent to a resource that involves a responsibility of an agent for serving on a committee that supervises a thesis or dissertation of a student.
inverse of: has degree committee member
sub property of: is other agent associated with resource of (Deprecated)
label: er medlem af kandidatudvalg i @da
definition: Relaterer en agent, der er medlem i et udvalg der fører tilsyn med en students speciale eller afhandling til en ressource. @da
label: is graad commissie-lid van @nl
label: هي عضو لجنة تمنح درجة أكاديمية لـ @ar
definition: يربط بين وكيل ومصدر ينطوي على مسؤولية وكيل عن العمل في لجنة تشرف على رسالة جامعية أو أطروحة لطالب. @ar
label: opinnäytteen tarkastaja (toimija) aineistossa @fi
definition: Liittää toimijan aineistoon, jossa toimija vastaa opiskelijan akateemisen opinnäytteen tai väitöskirjan tarkastaneessa komiteassa. @fi
label: ist Mitglied eines Graduierungsausschusses von @de
definition: Setzt einen Akteur in Beziehung zu einer Ressource, die mit einer Verantwortung verbunden ist, Mitglied eines Ausschusses zu sein, der eine Hochschulschrift von einer Studentin/einem Studenten beaufsichtigt. @de
label: 是……的学位委员会成员 @zh-hans
definition: 将一个行为者与涉及指导学生论文的一个委员会中的责任的一种资源关联起来。 @zh-hans
label: diplomabizottsági tagja a következőnek: @hu
definition: Hozzákapcsol egy ágenst egy forráshoz, amelyhez hozzátartozik egy ágens olyan bizottságban való szolgálatának felelőssége, amely felügyeli egy hallgató szakdolgozatát vagy disszertációját. @hu
label: tez komitesi üyesidir @tr
definition: Bir temsilciyi, bir öğrencinin tezini veya doktora tezini denetleyen bir komitede görev yapmaya ilişkin bir temsilcinin sorumluluğunu içeren bir kaynakla ilişkilendirir. @tr

has degree granting institution
status: Published
definition: Relates a resource to an agent who approves a resource that is a thesis or dissertation associated with an academic degree.
type: Property
sub property of: has other agent associated with resource (Deprecated)
inverse of: is degree granting institution of
lexical alias: degreeGrantingInstitution.en
label: har tildelende institution @da
definition: Relaterer en ressource til en korporation der tildeler en akademisk grad. @da
label: heeft graadverlenende instantie @nl
label: oppiarvon myöntävä instituutio @fi
label: له مؤسسة مانحة لدرجة @ar
definition: يربط مصدر بوكيل يُصادق على مصدر هو أطروحة للحصول على درجة أكاديمية. @ar
definition: Liitää opinnäyte- tai väitöskirja-aineiston akateemisen oppiarvon myöntävään toimijaan. @fi
label: hat grad-verleihende Institution @de
definition: Setzt eine Ressource in Beziehung zu einem Akteur, der eine Hochschulschrift genehmigt, die mit einem akademischen Grad in Verbindung steht. @de
label: 有学位授予机构 @zh-hans
definition: 将一种资源与批准和一个学位相关的一种学位论文的一个行为者关联起来。 @zh-hans
label: tudományos fokozatot adó intézménye a következő: @hu
definition: Hozzákapcsol egy forrást egy ágenshez, aki jóváhagy egy forrást, amely egy tudományos fokozat elnyeréséért benyújtott szakdolgozat vagy disszertáció. @hu
label: tez onaylayan kurum ile ilişkilidir @tr
definition: Bir kaynağı, akademik bir dereceyle ilişkili bir tez veya bitirme tezi olan bir kaynağı onaylayan bir temsilci ile ilişkilendirir. @tr

is degree granting institution of
status: Published
definition: Relates an agent to a resource that is a thesis or dissertation associated with an academic degree that is approved by an agent.
type: Property
sub property of: is other agent associated with resource of (Deprecated)
inverse of: has degree granting institution
lexical alias: degreeGrantingInstitutionOf.en
label: er tildelende institution for @da
definition: Relaterer en korporation der tildeler en akademisk grad til en ressource. @da
label: is graadverstrekkende instantie van @nl
label: oppiarvon myöntävä yhteisö (aineistoon liittyvä yhteistoimija) @fi
label: هي مؤسسة مانحة درجة لـ @ar
definition: يربط بين وكيل ومصدر عبارة عن أطروحة للحصول على درجة أكاديمية معتمدة من وكيل. @ar
definition: Liittää toimijan aineistoon, joka on yhteisön hyväksymä akateemisen oppiarvon opinnäyte tai väitöskirja. @fi
label: ist grad-verleihende Institution von @de
definition: Setzt einen Akteur in Beziehung zu einer Ressource, bei der es sich um eine Hochschulschrift handelt, die von einem Akteur genehmigt wird und mit einem akademischen Grad in Verbindung steht. @de
label: 是……的学位授予机构 @zh-hans
definition: 将一个行为者与作为和被一个行为者批准的学位有关的有一篇学位论文的一种资源关联起来。 @zh-hans
label: tudományos fokozatot adó intézménye a következőnek: @hu
definition: Hozzákapcsol egy ágenst egy forráshoz, amely egy tudományos fokozat elnyeréséért benyújtott szakdolgozat vagy disszertáció, amelyet az ágens jóváhagyott. @hu
label: tez onaylayan kurumudur @tr
definition: Bir temsilciyi, bir temsilci tarafından onaylanmış bir akademik derece ile ilişkili bir tez veya doktora tezi olan bir kaynakla ilişkilendirir. @tr

has degree supervisor
status: Published
definition: Relates a resource to an agent who is an academic supervisor who is responsible for advising or overseeing thesis or dissertation research for an academic degree that results in a resource.
type: Property
sub property of: has creator
inverse of: is degree supervisor of
lexical alias: degreeSupervisor.en
label: har vejleder @da
definition: Relaterer en ressource til en agent, der vejleder ved udarbejdelsen af afhandlingen til enten en akademisk grad eller et speciale. @da
label: heeft graad-begeleider @nl
label: opinnäytteen ohjaaja aineistossa @fi
label: مشرف على درجة أكاديمية @ar
definition: يربط مصدر بمشرف أكاديمي مسؤول عن تقديم المشورة أو الإشراف على أطروحة ماجستير أو دكتوراه للحصول على درجة علمية تسفر عن مصدر. @ar
definition: Liittää aineiston toimijaan, joka vastaa akateemisen opinnäytteen tai väitöskirjan ohjaamisesta tai valvomisesta. @fi
label: hat Betreuerin/Betreuer einer Hochschulschrift @de
definition: Setzt eine Ressource in Beziehung zu einer akademischen Betreuerin/einem akademischen Betreuer, die/der für die Beratung und Aufsicht von Forschungstätigkeiten im Rahmen einer Hochschulschrift verantwortlich ist, die zur Erlangung eines akademischen Grads und zu einer Ressource führen. @de
label: 有学位导师 @zh-hans
definition: 将一种资源与作为学术主管、负责对导致一种资源的学位论文提出建议或进行监督的一个行为者关联起来。 @zh-hans
definition: Relaciona un recurs amb un agent que és un supervisor acadèmic que és responsable d’assessorar o supervisar la recerca de tesis o dissertacions per a una titulació acadèmica que dona com a resultat un recurs. @ca
label: témavezetője a következő: @hu
definition: Hozzákapcsol egy forrást egy szakdolgozati vagy disszertációs kutatás tanácsadójához vagy felügyelőjéhez, aki egy tudományos fokozatot vagy értekezést ellenőriz. @hu
label: tez danışmanı ile ilişkilidir @tr
definition: Bir kaynağı, bir kaynak olarak sonuçlanan akademik bir derece için tez veya bitirme tezi araştırmasına danışmanlık yapmaktan veya denetlemekten sorumlu olan bir akademik danışmanla ilişkilendirir. @tr

is degree supervisor of
status: Published
definition: Relates an agent to a resource that involves a responsibility as an advisor or supervisor of thesis or dissertation research, overseeing either an academic degree or thesis.
type: Property
sub property of: is creator of
inverse of: has degree supervisor
lexical alias: degreeSupervisorOf.en
label: er vejleder i @da
definition: Relaterer en person, som fx en speciale- eller forskningsafhandlingsvejleder, der har ført tilsyn med enten en akademisk grad eller et speciale til en ressource. @da
label: is graad-begeleider van @nl
label: هو مشرف على درجة أكاديمية لـ @ar
definition: يربط بين وكيل ومصدر ينطوي على تحمل المسؤولية بصفته مستشار أو مشرف على أطروحة ماجستير أو دكتوراه أو أبحاث متعلقة بأطروحة، والإشراف على إما درجة أكاديمية أو أطروحة. @ar
label: opinnäytteen ohjaaja (toimija) aineistossa @fi
definition: Liittää aineiston toimijaan, joka vastaa akateemisen opinnäytteen tai väitöskirjan ohjaamisesta tai valvomisesta. @fi
label: ist Betreuerin/Betreuer einer Hochschulschrift von @de
definition: Setzt einen Akteur in Beziehung zu einer Ressource, bei der eine Beraterin/ein Berater oder eine Betreuerin/ein Betreuer für die Beratung und Aufsicht von Forschungstätigkeiten im Rahmen einer Hochschularbeit verantwortlich ist. @de
label: 是……的学位导师 @zh-hans
definition: 将一个行为者与涉及作为学位论文研究的导师的责任（监督学位或者论文）的资源关联起来。 @zh-hans
label: fokozat témavezetője a következőnek: @hu
definition: Hozzákapcsol egy ágenst egy forráshoz, amelyhez hozzátartozik az ágens felelőssége szakdolgozati vagy disszertációs kutatás tanácsadójaként vagy felügyelőjeként, aki egy tudományos fokozatot vagy értekezést ellenőriz. @hu
label: tez danışmanıdır @tr
definition: Bir temsilciyi, akademik dereceyi veya tezi denetleyen, tez veya doktora tezi araştırmasının danışmanı veya denetmeni olarak sorumluluk içeren bir kaynakla ilişkilendirir. @tr

has depositor
status: Published
definition: Relates a resource to an agent who is a current owner of a resource who deposits the resource into the custody of another agent without transferring ownership.
type: Property
sub property of: has current owner
inverse of: is depositor of
lexical alias: depositor.en
label: har depositor @da
definition: Relaterer en ressource til en nuværende ejer af en ressource deponeret i forvaring hos en anden agent, men beholder det oprindelige ejerskab. @da
label: heeft bruikleengever @nl
label: aineiston tallettaja @fi
label: له مُودِع @ar
definition: يربط مصدر بوكيل هو المالك الحالي لمصدر قام بإيداع مصدر تحت وصاية وكيل آخر دون نقل ملكيتها. @ar
definition: Liittää aineiston toimijaan, joka on aineiston nykyinen omistaja ja luovuttanut aineiston toisen toimijan haltuun siirtämättä omistajuutta @fi
label: hat Leihgeberin/Leihgeber @de
definition: Setzt eine Ressource in Beziehung zu einer gegenwärtigen Eigentümerin/einem gegenwärtigen Eigentümer (Akteur) einer Ressource, die/der die Ressource in die Obhut eines anderen Akteurs gibt, ohne das Eigentumsrecht zu übertragen. @de
label: 有托存者 @zh-hans
definition: 将一种资源与作为资源当前拥有者并将资源委托给另一个行为者保管但未转让所有权的一个行为者关联起来。 @zh-hans
label: letétbe helyezője a következő: @hu
definition: Hozzákapcsol egy forrást egy ágenshez, amely a forrás jelenlegi tulajdonosa, és amely egy másik ágens megőrzésébe letétként helyezi el a forrást anélkül, hogy a tulajdonjogot átruházná. @hu
label: mevduatçı ile ilişkilidir @tr
definition: Bir kaynağı, kaynağın mevcut sahibi olan ve sahipliğini devretmeden kaynağı başka bir temsilcinin gözetimine bırakan bir temsilci ile ilişkilendirir. @tr

is depositor of
status: Published
definition: Relates an agent to a resource that is deposited into the custody of another agent without transferring ownership.
type: Property
sub property of: is current owner of
inverse of: has depositor
lexical alias: depositorOf.en
label: er depositor af @da
definition: Relaterer en nuværende ejer af en ressource deponeret i forvaring hos en anden agent, men der beholder det oprindelige ejerskab til en ressource. @da
label: is bruikleengever van @nl
label: aineiston tallettaja (toimija) @fi
label: هو مُودِع لـ @ar
definition: يربط بين وكيل ومصدر تم إيداعه في عهدة وكيل آخَر دون نقل الملكية. @ar
definition: Liittää toimijan aineistoon, jokaon luovutettu toisen toimijan haltuun siirtämättä omistajuutta. @fi
label: ist Leihgeberin/Leihgeber von @de
definition: Setzt einen Akteur in Beziehung zu einer Ressource, die in die Obhut eines anderen Akteurs gegeben wird, ohne das Eigentumsrecht zu übertragen. @de
label: 是……的托存者 @zh-hans
definition: 将一个行为者与被委托给另一个行为者保管但未转让所有权的一种资源关联起来。 @zh-hans
label: letétbe helyezője a következőnek: @hu
definition: Hozzákapcsol egy ágenst egy forráshoz, amelyet egy másik ágens felügyelete alá helyez anélkül, hogy a tulajdonjogot átruházná. @hu
label: mevduatçısıdır @tr
definition: Bir temsilciyi, mülkiyeti devretmeden başka bir temsilcinin gözetimine bırakılan bir kaynakla ilişkilendirir. @tr

has derivation
status: Published
lexical alias: derivation.en
definition: Relates a nomen to a nomen that is based on another nomen.
type: Property
label: heeft afleiding @nl
label: له اشتقاق @ar
definition: يربط بين تسمية وتسمية مبنية على تسمية آخرى. @ar
label: har afledning @da
definition: Relaterer et nomen til et nomen der er baseret på et andet nomen. @da
label: johdos @fi
definition: Liittää nomenin nomeniin, joka perustuu toiseen nomeniin. @fi
label: hat Ableitung @de
definition: Setzt ein Nomen in Beziehung zu einem Nomen, das auf einem anderen Nomen basiert. @de
label: 有衍生命名 @zh-hans
definition: 将一个命名与基于另一个命名的一个命名关联起来。 @zh-hans
label: leágazása a következő: @hu
definition: Hozzákapcsol egy noment egy nomenhez, amely egy másik nomenen alapul. @hu
label: türetim ile ilişkilidir @tr
definition: Bir ismi, başka bir isimi kaynak alan bir isimle ilişkilendirir. @tr

is derivation of
status: Published
lexical alias: derivationOf.en
definition: Relates a nomen to a nomen that is used as the basis of another nomen.
type: Property
label: is afgeleid van @nl
label: هو اشتقاق لـ @ar
definition: يربط تسمية بتسمية استخدمت كأساس لتسمية أخرى. @ar
label: er afledning af @da
definition: Relaterer et nomen til et nomen, som bruges som grundlag for et andet nomen. @da
label: johdos nomenista @fi
definition: Liittää nomenin nomeniin, johon toinen johdos perustuu. @fi
label: ist Ableitung von @de
definition: Setzt ein Nomen in Beziehung zu einem Nomen, das als Grundlage für ein anderes Nomen verwendet wird. @de
label: 是……的衍生命名 @zh-hans
definition: 将一个命名与被用作另一个命名之基础的一个命名关联起来。 @zh-hans
label: leágazása a következőnek: @hu
definition: Hozzákapcsol egy noment egy nomenhez, amelyet egy másik nomen alapjaként használnak. @hu
label: türevidir @tr
definition: Bir ismi, başka bir isime kaynak olan bir isimle ilişkilendirir. @tr

has derivative
status: Published
definition: Relates a resource to a resource that is a modification of another resource.
type: Property
sub property of: has derivative resource relationship with (Deprecated)
inverse of: has source
lexical alias: derivative.en
label: er afledning @da
definition: Relaterer en ressource til en ressource, der er en ændring af en oprindelig ressource. @da
label: heeft afgeleide @nl
label: له اشتقاق @ar
definition: يربط بين مصدر ومصدر يعد تعديلًا لمصدر آخر. @ar
label: johdannaisaineisto @fi
definition: Liittää aineiston aineistoon, joka on johdettu toisesta aineistosta. @fi
label: hat Ableitung @de
definition: Setzt eine Ressource in Beziehung zu einer Ressource, die eine Variante einer anderen Ressource darstellt. @de
label: 有衍生 @zh-hans
definition: 将一种资源与作为另一种资源之修改的一种资源关联起来。 @zh-hans
label: származéka a következő: @hu
definition: Hozzákapcsol egy forrást egy forráshoz, amely egy másik forrás módosítása. @hu
has subproperty: is abridged as
has subproperty: is abstracted in
has subproperty: is adapted as
has subproperty: is adapted as choreography
has subproperty: is adapted as libretto
has subproperty: is adapted as oratorio
has subproperty: is arranged as
has subproperty: is digested as
has subproperty: is expanded as
has subproperty: is freely translated as
has subproperty: is imitated as
has subproperty: is indexed in (Deprecated)
has subproperty: is inspiration for
has subproperty: is modified by variation as
has subproperty: is paraphrased as
has subproperty: is remade as
has subproperty: is revised as
has subproperty: is set to music as
has subproperty: is translated as
label: türev ile ilişkilidir @tr
definition: Bir kaynağı, başka bir kaynağın değiştirilmiş hali ile olan başka bir kaynakla ilişkilendirir. @tr

has derivative resource relationship with (Deprecated)
status: Deprecated
type: Property
definition: Relates a resource to a resource that is based on or is a derivative of a related resource. (Deprecated)
lexical alias: derivativeResourceRelationshipWith.en
label: har afledt ressource-relation med @da
definition: Relaterer en ressource til en ressource, der er baseret på eller er en afledning af en ressource. @da
has subproperty: has source
has subproperty: has derivative

is described by
status: Published
definition: Relates an entity to a resource that is a description of an entity.
type: Property
sub property of: is subject of
inverse of: is description of
label: er beskrevet i @da
definition: Relaterer en ressource til en ressource, der beskriver en beskreven entitet. @da
alternative label: is described in
lexical alias: describedBy.en
label: is beschreven in @nl
label: aineistoa kuvaava @fi
label: هو موصوف في @ar
definition: يربط كيانًا بمصدر يصف كيان. @ar
definition: Liitttää aineiston aineistoon, joka on kuvaus entiteetistä. @fi
alternative label: kuvattu @fi
label: ist beschrieben in @de
definition: Setzt eine Entität in Beziehung zu einer Ressource, die eine Entität beschreibt. @de
alternative label: 被描述于 @zh-hans
label: 被……描述 @zh-hans
definition: 将一个实体与作为一个实体之描述的一种资源关联起来。 @zh-hans
alternative label: és descrit en @ca
label: és descrit per @ca
definition: Relaciona una entitat amb un recurs que és una descripció d’una entitat. @ca
label: leírása ebben: @hu
definition: Hozzákapcsol egy entitást egy forráshoz, amely egy entitást ír le. @hu
has subproperty: is analysed in
has subproperty: is commentary in
has subproperty: has summary
has subproperty: is described with metadata by
alternative label: içinde tanımlanmıştır @tr
label: tarafından tanımlanmıştır @tr
definition: Bir varlığı, varlığın tanımı olan bir kaynakla ilişkilendirir. @tr

is description of
status: Published
definition: Relates a resource to an entity that is described by a resource.
type: Property
sub property of: has subject
inverse of: is described by
lexical alias: descriptionOf.en
label: er beskrivelse af @da
definition: Relaterer en ressource til en ressource, der beskrives af en beskrivende entitet. @da
label: is beschrijving van @nl
label: aineiston kuvaus @fi
label: هو وصف لـ @ar
definition: يربط بين مصدر وكيان موصوف بواسطة مصدر. @ar
definition: Liittää aineiston entiteettiin, jota aineisto kuvaa. @fi
label: ist Beschreibung von @de
definition: Setzt eine Ressource in Beziehung zu einer Entität, die von einer Ressource beschrieben wird. @de
label: 是……的描述 @zh-hans
definition: 将一种资源与被一种资源描述的一个实体关联起来。 @zh-hans
label: leírása a következőnek: @hu
definition: Hozzákapcsol egy forrást egy entitáshoz, amelyet a forrás leír. @hu
has subproperty: is analysis of
has subproperty: is commentary on
has subproperty: is critique of
has subproperty: is evaluation of
has subproperty: is finding aid of
has subproperty: is review of
has subproperty: is summary of
has subproperty: is metadata description of entity
label: tanımıdır @tr
definition: Bir kaynağı, bir kaynak tarafından tanımlanan bir varlıkla ilişkilendirir. @tr

has descriptive resource relationship with (Deprecated)
status: Deprecated
definition: Relates a resource to a resource that is described in or is a description of the resource. (Deprecated)
lexical alias: descriptiveResourceRelationshipWith.en
type: Property

has designation of edition
status: Published
definition: Relates a resource to a word, character or group of words or characters, identifying an edition to which a resource belongs.
type: Property
lexical alias: designationOfEdition.en
label: har udgavebetegnelse @da
definition: Relaterer en ressource til et ord, tegn eller en gruppe af ord og/eller tegn, der identificerer en udgave som en ressource tilhører. @da
label: heeft aanduiding van editie @nl
label: painosmäärite aineistossa @fi
label: له تسمية لطبعة @ar
definition: يربط بين مصدر وكلمة، حرف، أو مجموعة من الكلمات أو تمثيلات، تحدد طبعة ينتمي لها مصدر. @ar
definition: Liittää aineiston sanaan, merkkiin tai ryhmään sanoja ja/tai merkkejä, jotka identifioivat aineiston painoksen. @fi
label: hat Ausgabebezeichnung @de
definition: Setzt eine Ressource in Beziehung zu einem Wort, einem Zeichen oder einer Gruppe von Wörtern oder Zeichen, das/die die Ausgabe identifiziert, zu der eine Ressource gehört. @de
label: 有版本标识 @zh-hans
definition: 将一种资源与标识一种资源所属于的一个版本的词、字符或者词或字符的组合关联起来。 @zh-hans
label: kiadásjelölése a következő: @hu
definition: Hozzákapcsol egy forrást egy szóhoz, karakterhez, vagy szavak vagy karakterek egy csoportjához, amely azonosít egy kiadást, amelyhez egy forrás tartozik. @hu
label: basım ile ilişkilidir @tr
definition: Bir kaynağı bir kelime, karakter veya kelime ya da karakter grubuyla ilişkilendirerek kaynağın ait olduğu basımı tanımlar. @tr

has designation of named revision of edition
status: Published
definition: Relates a resource to a word, character or group of words or characters, identifying a particular revision of a named edition.
type: Property
lexical alias: designationOfNamedRevisionOfEdition.en
label: har betegnelse for en navngivet revision af en udgave @da
definition: Relaterer en ressource til et ord, tegn eller en gruppe af ord og/eller tegn, der identificerer en bestemt revision af en navngiven udgave. @da
label: heeft aanduiding van een benoemde herziening van editie @nl
label: له تسمية لمراجعة مسماة لطبعة @ar
definition: يربط بين مصدر وكلمة، أو حرف، أو مجموعة من الكلمات، أو تمثيلات، تحدد مراجعة محددة لطبعة مسماة. @ar
label: uudistetun painoksen määrite aineistossa @fi
definition: Liittää aineiston sanaan, merkkiin tai sanojen tai merkkien joukkoon, jotka identifioivat aineiston tietyn uudistetun painoksen. @fi
label: hat Ausgabebezeichnung einer näher erläuterten Überarbeitung @de
definition: Setzt eine Ressource in Beziehung zu einem Wort, einem Zeichen oder einer Gruppe von Wörtern oder Zeichen, das/die eine bestimmte Überarbeitung einer näher erläuterten Ausgabe identifiziert. @de
label: 有版本的命名修订的标识 @zh-hans
definition: 将一种资源与标识一个命名版本的特定修订的词、字符或者词或字符的组合关联起来。 @zh-hans
label: kiadás nevesített átdolgozásának jelölése a következő: @hu
definition: Hozzákapcsol egy forrást egy szóhoz, karakterhez, vagy szavak vagy karakterek egy csoportjához, amely azonosítja egy nevesített kiadás egy adott átdolgozását. @hu
label: adlandırılmış basım revizyonu ile ilişkilidir @tr
definition: Bir kaynağı bir kelime, karakter veya kelime ya da karakter grubuyla ilişkilendirerek adlandırılmış bir basımın ayrıntılı bir gözden geçirmeyle tanımlar. . @tr

has designation of version
status: Published
lexical alias: designationOfVersion.en
definition: Relates a resource to a word or phrase that distinguishes a resource from another resource.
type: Property
label: heeft aanduiding van versie @nl
label: له تسمية لنسخة @ar
definition: يربط بين مصدر وكلمة أو عبارة تميز مصدر عن مصدر آخر. @ar
label: har betegnelse for version @da
definition: Relaterer en ressource til et ord eller en frase, som adskiller en ressource fra en anden ressource. @da
label: aineiston version määrite @fi
definition: Liittää aineiston sanaan tai ilmaukseen, joka erottaa aineiston toisesta aineistosta. @fi
label: hat Ausgabebezeichnung @de
definition: Setzt eine Ressource in Beziehung zu einem Wort oder einer Phrase, die dazu dient, eine Ressource von einer anderen Ressource zu unterscheiden. @de
label: 有版本标识 @zh-hans
definition: 将一种资源与区分一种资源和另一种资源的一个词或短语关联起来。 @zh-hans
label: verziójelölése a következő: @hu
definition: Hozzákapcsol egy forrást egy olyan szóhoz vagy kifejezéshez, amely megkülönböztet egy forrást egyik másiktól. @hu
label: sürüm ile ilişkilidir @tr
definition: Bir kaynağı başka bir kaynaktan ayıran bir kelime veya ifadeyle ilişkilendirir. @tr

has designer
status: Published
definition: Relates a resource to an agent who is responsible for creating a design for an object.
type: Property
sub property of: has creator
inverse of: is designer of
lexical alias: designer.en
label: har designer @da
definition: Relaterer en ressource til en agent, der er ansvarlig for ideen bag designet for et objekt. @da
label: heeft ontwerper @nl
label: له مُصمم @ar
definition: يربط مصدر بوكيل مسؤول عن إعداد تصميم لكائن ما. @ar
label: aineiston suunnittelija @fi
definition: Liittää aineiston toimijaan, joka vastaa esineen suunnittelusta. @fi
label: hat Designerin/Designer @de
definition: Setzt eine Ressource in Beziehung zu einem Akteur, der für die Gestaltung des Designs eines Objekts verantwortlich ist. @de
label: 有设计者 @zh-hans
definition: 将一种资源与负责创建一个物体的设计的一个行为者关联起来。 @zh-hans
label: tervezője a következő: @hu
definition: Hozzákapcsol egy forrást egy ágenshez, amely felelős egy tárgy tervezetének a megalkotásáért. @hu
label: tasarımcı ile ilişkilidir @tr
definition: Bir kaynağı, bir nesne için tasarım oluşturmaktan sorumlu olan bir temsilci ile ilişkilendirir. @tr

is designer of
status: Published
definition: Relates an agent to a resource that involves a responsibility of an agent for design of an object.
type: Property
sub property of: is creator of
inverse of: has designer
lexical alias: designerOf.en
label: er designer af @da
definition: Relaterer en agent, der er ansvarlig for at have skabt et design for en genstand til en ressource. @da
label: is ontwerper van @nl
label: هو مصمم لـ @ar
definition: يربط بين وكيل ومصدر ينطوي على مسؤولية وكيل عن تصميم كائن. @ar
label: suunnittelija (toimija) aineistossa @fi
definition: Liittää toimijan aineistoon, jossa toimija vastaa esineen suunnittelusta. @fi
label: ist Designerin/Designer von @de
definition: Setzt einen Akteur in Beziehung zu einer Ressource, bei der ein Akteur für die Gestaltung eines Objekts verantwortlich ist. @de
label: 是……的设计者 @zh-hans
definition: 将一个行为者与涉及设计一个物体的一个行为者的责任的一种资源关联起来。 @zh-hans
label: tervezője a következőnek: @hu
definition: Hozzákapcsol egy ágenst egy forráshoz, amelyhez hozzátartozik egy ágens felelőssége egy tárgy tervezéséért. @hu
label: tasarımcısıdır @tr
definition: Bir temsilciyi, bir nesnenin tasarımıyla görevli bir temsilcinin sorumluluğunu içeren bir kaynakla ilişkilendirir. @tr

has details of applied material
status: Published
type: Property
lexical alias: detailsOfAppliedMaterial.en
definition: Relates a resource to details of a physical or chemical substance applied to a base material of a resource.
label: har detaljer om anvendt materiale @da
definition: Relaterer en ressource til detaljer om et fysisk eller kemisk stof, der er påført en ressources basismateriale. @da
label: heeft details van aangebracht materiaal @nl
label: له تفاصيل عن مادة مُستخدمة @ar
definition: يربط بين مصدر وتفاصيل عن مادة فيزيائية أو كيميائية مستخدمة كمادة أساسية لمصدر. @ar
label: aineiston päällimateriaali @fi
definition: Liittää aineiston fysikaaliseen tai kemialliseen aineeseen, jota on laitettu aineiston pohjamateriaalin päälle. @fi
label: hat Details zu aufgebrachtem Material @de
definition: Setzt eine Ressource in Beziehung zu Details zu einer physischen oder chemischen Substanz, die auf ein Trägermaterial einer Ressource aufgebracht ist. @de
label: 有施加材料的细节 @zh-hans
definition: 将一种资源与施加于一种资源的基底材料上的物理或化学物质的细节关联起来。 @zh-hans
label: az alkalmazott anyag részletei a következők: @hu
definition: Hozzákapcsol egy forrást egy forrás alapanyagaként alkalmazott fizikai vagy kémiai anyag részleteihez. @hu
has subproperty: has details of emulsion on microfilm and microfiche
label: uygulanan materyalin ayrıntıları ile ilişkilidir @tr
definition: Bir kaynağı, bir kaynağın temel malzemesine uygulanan fiziksel veya kimyasal bir maddenin ayrıntılarıyla ilişkilendirir. @tr

has details of aspect ratio designation
status: Published
type: Property
lexical alias: detailsOfAspectRatioDesignation.en
definition: Relates a resource to details of a ratio of the width to the height of a moving image.
label: har detaljer om billedformatbetegnelse @da
definition: Relaterer en ressource til detaljer om forholdet mellem bredde og højde i et levende billede. @da
label: heeft details van aspectratio-aanduiding @nl
label: له تفاصيل لنسب باعية لتسمية @ar
definition: يربط بين مصدر وتفاصيل عن نسبة العرض إلى ارتفاع لصورة المتحركة. @ar
label: aineiston kuvasuhdemääritteen tarkemmat tiedot @fi
definition: Liittää aineiston tarkempiin tietoihin liikkuvan kuvan leveyden suhteesta korkeuteen. @fi
label: hat Details zur Bezeichnung eines Bildformats @de
definition: Setzt eine Ressource in Beziehung zu Details zu einem Verhältnis von der Breite zu der Höhe eines Bewegtbilds. @de
label: 有宽高比标识细节 @zh-hans
definition: 将一种资源与一种动态图像的宽和高的比之细节关联起来。 @zh-hans
label: vetületarány-jelölés részletei a következők: @hu
definition: Hozzákapcsol egy forrást egy mozgókép szélességi-magassági vetületarányának a részleteihez. @hu
label: en-boy oranı ile ilişkilidir @tr
definition: Bir kaynağı, bir hareketli görüntünün genişliğinin yüksekliğine oranını ayrıntılarıyla ilişkilendirir. @tr

has details of base material
status: Published
type: Property
lexical alias: detailsOfBaseMaterial.en
definition: Relates a resource to details of an underlying physical material of a resource.
label: har detaljer om basismateriale @da
definition: Relaterer en ressource til detaljer om en ressources underliggende fysiske materiale til en ressource. @da
label: heeft details van basismateriaal @nl
label: له تفاصيل عن مادة أساسية @ar
definition: يربط بين مصدر وتفاصيل عن مادة ملموسة أساسية لمصدر. @ar
label: aineiston pohjamateriaalin tarkemmat tiedot @fi
definition: Liittää aineiston tarkempiin tietoihin aineiston fyysisestä pohjamateriaalista. @fi
label: hat Details zum Trägermaterial @de
definition: Setzt eine Ressource in Beziehung zu Details zu einem zugrunde liegenden, physischen Material einer Ressource. @de
label: 有基底材料的细节 @zh-hans
definition: 将一种资源与一种资源的下层物理材料的细节关联起来。 @zh-hans
label: alapanyag részletei a következők: @hu
definition: Hozzákapcsol egy forrást egy forrás mögöttes fizikai anyagának részleteihez. @hu
label: temel materyalin ayrıntıları ile ilişkilidir @tr
definition: Bir kaynağı, bir kaynağın altında yatan fiziksel materyalin ayrıntılarıyla ilişkilendirir. @tr

has details of bibliographic format
status: Published
type: Property
lexical alias: detailsOfBibliographicFormat.en
definition: Relates a resource to details of the proportional relationship between a whole sheet in a printed or manuscript resource, and the individual leaves that result if that sheet is left full, cut, or folded.
label: har detaljer om bogformat @da
definition: Relaterer en ressource til detaljer om resultatet af at folde et trykt ark, så der dannes en samling af blade. @da
label: heeft details van boekformaat @nl
label: له تفاصيل عن شكل ببليوجرافي @ar
definition: يربط بين مصدر وتفاصيل عن علاقة نسبية بين ورقة كاملة في مصدر مطبوع أو مخطوط، والأوراق الفردية التي تنتج إذا تركت الورقة كاملة، مقطوعة، أو مطوية. @ar
label: aineiston bibliografisen koon tarkemmat tiedot @fi
definition: Liittää aineiston tarkempiin tietoihin aineiston tai käsikirjoitusaineiston kokonaisen arkin ja erillisten lehtien välisestä kokosuhteesta, joka riippuu siitä, onko arkki kokonainen, leikattu tai taitettu. @fi
label: hat Details zum bibliografischen Format @de
definition: Setzt eine Ressource in Beziehung zu Details zu dem proportionalen Verhältnis zwischen einem ganzen Bogen in einer gedruckten oder handschriftlichen Ressource und den einzelnen Blättern, die resultieren, wenn der Bogen im Ganzen gelassen, geschnitten oder gefaltet wird. @de
label: 有书目格式细节 @zh-hans
definition: 将一种资源与导致在一种印刷或手稿资源中是否完整、裁切或折叠的一个整张和单独页之间的比例关系的细节关联起来。 @zh-hans
label: bibliográfiai formátum részletei a következők: @hu
definition: Hozzákapcsol egy forrást egy aránybeli viszonyhoz, amely egy nyomtatott vagy kézírásos forrás teljes lapja és az egyes lapok között van, amelyek akkkor keletkeznek, ha a lapot hagyják megtelni, elvágják vagy összehajtják. @hu
label: bibliyografik formatın ayrıntıları ile ilişkilidir @tr
definition: Bir kaynağı, basılı veya el yazması bir kaynaktaki bütün bir sayfa ile o sayfanın dolu bırakılması, kesilmesi veya katlanması durumunda ortaya çıkan yapraklar arasındaki orantılı bir bağlantının ayrıntılarıyla ilişkilendirir. @tr

has details of broadcast standard
status: Published
type: Property
lexical alias: detailsOfBroadcastStandard.en
definition: Relates a resource to details of a system used to format a video resource for television broadcast.
sub property of: has details of video characteristic
label: har detaljer om transmissionsstandard @da
definition: Relaterer en ressource til detaljer om system, der anvendes til at formatere en videoressource til tv-transmission @da
label: heeft details van uitzendstandaard @nl
label: له تفاصيل عن معيار بث @ar
definition: يربط بين مصدر وتفاصيل عن نظام مستخدم لتهيئة مصدر فيديو للبث التلفزيوني. @ar
label: aineiston lähetysstandardin tarkemmat tiedot @fi
definition: Liittää aineiston tarkempiin tietoihin järjestelmästä, jonka mukaisesti videoaineisto muunnetaan televisiolähetystä varten. @fi
label: hat Details zum Sendestandard @de
definition: Setzt eine Ressource in Beziehung zu Details zu einem System, das zur Formatierung einer Videoressource für eine Fernsehsendung verwendet wird. @de
label: 有广播标准细节 @zh-hans
definition: 将一种资源与用于电视广播的视频格式的一个体系的细节关联起来。 @zh-hans
label: műsorszórási szabvány részletei a következők: @hu
definition: Hozzákapcsol egy forrást egy videóforrás-formátum televíziós műsorszórásához használt rendszer részleteihez. @hu
label: yayın standardının ayrıntıları ile ilişkilidir @tr
definition: Bir kaynağı, televizyon yayını için bir video kaynağı biçimi için kullanılan bir sistemin ayrıntılarıyla ilişkilendirir. @tr

has details of cartographic content
status: Published
definition: Relates a resource to an indication of mathematical data and other features of the cartographic content of a resource not recorded in statements of scale, projection, and coordinates.
type: Property
lexical alias: detailsOfCartographicContent.en
label: har andre detaljer om kartografisk indhold @da
definition: Relaterer en ressource til en indikation af matematiske data og andre karakteristika ved en ressources kartografiske indhold, der ikke er registreret som del af målestoks-, projicerings- eller koordinatoplysninger. @da
label: heeft details van cartografische content @nl
label: له تفاصيل محتوى رسم الخرائط @ar
definition: يربط بين مصدر ومؤشر لبيانات رياضية ومعالم أخرى لمحتوى رسم خرائط لمصدر لم يتم تسجيله في بيانات مقياس، عَرض، وإحداثيات. @ar
label: aineiston kartografisen sisällön tarkemmat tiedot @fi
definition: Merkintä matemaattisista tiedoista ja muista aineiston kartografisen sisällön ominaisuuksista, joita ei ole merkitty mittakaava-, projektio- tai koordinaatiomerkintöihin. @fi
label: hat Details zu kartografischem Inhalt @de
definition: Setzt eine Ressource in Beziehung zu einer Angabe von mathematische Daten und sonstigen Besonderheiten des kartografischen Inhalts einer Ressource, die nicht in Maßstabs-, Projektions- und Koordinatenangaben erfasst werden. @de
label: 有地图内容的细节 @zh-hans
definition: 将一种资源与在比例尺、投影和坐标说明中未记录的一种资源的地图内容的数学数据和其他特征的表示关联起来。 @zh-hans
label: kartográfiai tartalom részletei a következők: @hu
definition: Hozzákapcsol egy forrást egy forrás kartográfiai tartalmának matematikai adatait és más sajátosságait mutató jelöléshez, amely nincs rögzítve a méretarányról, vetületről és koordinátákról szóló közlésekben. @hu
label: kartografik içeriğin ayrıntıları ile ilişkilidir @tr
definition: Bir kaynağı, matematiksel verilerin ve bir kaynağın kartografik içeriğinin ölçek, projeksiyon ve koordinat bildirimlerinde kaydedilmeyen diğer özelliklerinin bir göstergesiyle ilişkilendirir. @tr

has details of cartographic data type
status: Published
type: Property
lexical alias: detailsOfCartographicDataType.en
definition: Relates a resource to details of a machine-readable representation of geospatial features.
label: har detaljer om kartografisk datatype @da
definition: Relaterer en ressource til detaljer om en maskinlæsbar repræsentation af geospatiale træk. @da
label: heeft details van cartografisch datatype @nl
label: له تفاصيل عن نوع بيانات خرائطية @ar
definition: يربط بين مصدر وتفاصيل عن تمثيل مقروء آليًا لملامح جغرافية مكانية. @ar
label: aineiston kartografisen tietotyypin tarkemmat tiedot @fi
definition: Liittää aineiston tarkempiin tietoihin maantieteellisten ominaisuuksien konelukuisesta esityksestä. @fi
label: hat Details zum kartografischen Datentyp @de
definition: Setzt eine Ressource in Beziehung zu den Details zu einer maschinenlesbaren Darstellung von Geodaten. @de
label: 有地理数据类型的细节 @zh-hans
definition: 将一种资源与地理空间特征的机器可读表现的细节关联起来。 @zh-hans
label: kartográfiai adattípus részletei következők: @hu
definition: Hozzákapcsol egy forrást térinformatikai jellemzők géppel olvasható ábrázolásának részleteihez. @hu
label: kartografik veri türünün ayrıntıları ile ilişkilidir @tr
definition: Bir kaynağı, jeo-uzamsal özelliklerin makine tarafından okunabilir temsilinin ayrıntılarıyla ilişkilendirir. @tr

has details of colour content (Deprecated)
type: Property
lexical alias: detailsOfColourContent.en
definition: Relates a resource to details of a presence of colour, tone, etc., in the content of a resource, and the specific colours, tones, etc., including black and white, present. (Deprecated)
alternative label: has details of color content (Deprecated)
label: har detaljer om farveindhold @da
definition: Relaterer en ressource til detaljer om tilstedeværelse af farve, nuance etc. i en ressources indhold, samt de specifikke farver, nuancer etc., inkl. sort og hvid, der er til stede. @da
status: Deprecated
label: heeft details van kleurcontent @nl
label: له تفاصيل لمحتوى ملون @ar
definition: يربط بين مصدر وتفاصيل عن وجود لون، درجة اللون، إلخ.، في محتوى مصدر، والألوان والدرجات المحددة، إلخ.، بما في ذلك الأسود والأبيض، الحالي. @ar
label: hat Details zum Farbinhalt @de
definition: Setzt eine Ressource in Beziehung zu Details zu dem Vorhandensein von Farbe, Tönung und so weiter im Inhalt einer Ressource und den spezifischen vorhandenen Farben, Tönungen und so weiter (einschließlich Schwarz und Weiß). @de
label: värisisällön tarkemmat tiedot @fi
definition: Liittää aineiston tietoihin, värien, (musta ja valkoinen mukaanlukien), sävyjen jne. esiintymisestä aineiston sisällössä. @fi
label: színtartalom részletei a következők: @hu
definition: Hozzákapcsol egy forrást egy forrás tartalmában megjelenő szín, színárnyalat, stb. részleteihez, illetve a megjelenő adott színekhez, színárnyalatokhoz, stb., beleértve a feketét és a fehéret is. @hu

has details of configuration of playback channels
status: Published
type: Property
lexical alias: detailsOfConfigurationOfPlaybackChannels.en
definition: Relates a resource to details of a number of sound channels used to make a recording.
sub property of: has details of sound characteristic
label: har detaljer om konfiguration af afspilningskanaler @da
definition: Relaterer en ressource til detaljer om et antal af lydkanaler, der blev anvendt til en indspilning @da
label: heeft details van afspeelkanalenconfiguratie @nl
label: له تفاصيل عن إعدادات قنوات التشغيل @ar
definition: يربط بين مصدر وتفاصيل عن رقم قنوات الصوت المستخدمة في تسجيل. @ar
label: toistokanavien määrän tarkemmat tiedot aineistolle @fi
definition: Liittää aineiston tarkempiin tietoihin äänitteen tekoon käytettyjen äänikanavien määrästä. @fi
label: hat Details zur Konfiguration von Wiedergabekanälen @de
definition: Setzt eine Ressource in Beziehung zu Details zur Anzahl von Tonkanälen, die für die Wiedergabe einer Aufnahme verwendet werden. @de
label: 有回放声道的配置的细节 @zh-hans
definition: 将一种资源与用于制作一个录音制品的声道数的细节关联起来。 @zh-hans
label: visszajátszási csatornák konfigurációjának részletei a következők: @hu
definition: Hozzákapcsol egy forrást lemezfelvétel készítésére használt hangcsatornák egy számának részleteihez. @hu
label: oynatma kanalları düzeninin ayrıntıları ile ilişkilidir @tr
definition: Bir kaynağı, bir kaydı yapmak için kullanılan ses kanallarının sayısının ayrıntılarıyla ilişkilendirir. @tr

has details of digital file characteristic
status: Published
type: Property
lexical alias: detailsOfDigitalFileCharacteristic.en
definition: Relates a resource to details of a technical specification relating to a digital encoding of text, image, audio, video, and other types of data in a resource.
label: har detaljer om digitale filkarakteristika @da
definition: Relaterer en ressource til detaljer om teknisk specifikation relateret til den digitale kodning af tekst, billede, audio-, video- og andre datatyper i en ressource. @da
label: heeft details van kenmerken digitaal bestand @nl
label: له تفاصيل عن خاصية ملف رقمي @ar
definition: يربط بين مصدر وتفاصيل عن مواصفات فنية متعلقة بتشفير رقمي لنص، صورة، صوت، فيديو، وأي نوع بيانات آخر في مصدر. @ar
label: aineiston digitaalisen tiedoston ominaisuuksien tarkemmat tiedot @fi
definition: Liittää aineiston tarkempiin tietoihin aineiston sisältämän tekstin, kuvan, äänen, videon tai muun datan digitaalisen koodauksen teknisestä määrityksestä. @fi
label: hat Details zur Eigenschaft einer digitalen Datei @de
definition: Setzt eine Ressource in Beziehung zu Details zu einer technischen Spezifikation, die sich auf die digitale Kodierung von Text, Bild, Audio, Video und anderen Datentypen in einer Ressource bezieht. @de
label: 有数字文件特征的细节 @zh-hans
definition: 将一种资源与和一种资源中的文本、图像、音频、视频或其他类型数据的数字编码有关的一个技术规格的细节关联起来。 @zh-hans
label: digitális fájljellemzők részletei a következők: @hu
definition: Hozzákapcsol egy forrást egy forrás szöveg, kép, hang, videó és más adattípusainak digitális kódolásához kapcsolódó műszaki specifikáció részleteihez. @hu
has subproperty: has details of digital representation of cartographic content
has subproperty: has details of encoding format
has subproperty: has details of file type
has subproperty: has details of regional encoding
label: dijital dosya özelliklerinin ayrıntıları ile ilişkilidir @tr
definition: Bir kaynağı, bir kaynaktaki metin, görüntü, ses, video ve diğer veri türlerinin dijital olarak kodlanmasıyla ilgili teknik özelliğin ayrıntılarıyla ilişkilendirir. @tr

has details of digital representation of cartographic content
status: Published
type: Property
lexical alias: detailsOfDigitalRepresentationOfCartographicContent.en
definition: Relates a resource to details of an encoding of geospatial information in a cartographic resource.
sub property of: has details of digital file characteristic
label: har detaljer om digital repræsentation af kartografisk indhold @da
definition: Relaterer en ressource til detaljer om kodning af geospatiale oplysningerer i en kartografisk ressource. @da
label: heeft details van digitale representatie van cartografische content @nl
label: له تفاصيل عن تمثيل رقمي للمحتوى الجغرافي @ar
definition: يربط بين مصدر وتفاصيل عن معلومات الترميز الجغرافي في مصدر خرائطي. @ar
label: aineiston kartografisen sisällön digitaalisen esitysmuodon tarkemmat tiedot @fi
definition: Liittää aineiston tarkempiin tietoihin aineiston maantieteellisen paikkatiedon koodaamisesta. @fi
label: hat Details zur digitalen Darstellung von kartografischem Inhalt @de
definition: Setzt eine Ressource in Beziehung zu Details zur Kodierung von Geoinformationen in einer kartografischen Ressource. @de
label: 地图内容的数字表现的细节 @zh-hans
definition: 将一种资源与资源中地理空间信息的编码细节关联起来。 @zh-hans
label: kartográfiai tartalom digitális ábrázolásának részletei a következők: @hu
definition: Hozzákapcsol egy forrást a földtérbeli információk kódolásának részleteihez egy kartográfiai forrásban. @hu
label: kartografik içeriğin dijital temsilinin ayrıntıları ile ilişkilidir @tr
definition: Bir kaynağı, bir haritacılık kaynağı içindeki jeo-uzamsal bilginin kodlanmasının ayrıntılarıyla ilişkilendirir. @tr

has details of duration
status: Published
type: Property
lexical alias: detailsOfDuration.en
definition: Relates a resource to aetails of an extent of resource that is a playing time, performance time, running time, or other length of time.
label: har detaljer om spilletid @da
definition: Relaterer en ressource til detaljer om varighed, spilletid, opførelsestid etc. for en ressources indhold. @da
label: heeft details van tijdsduur @nl
label: له تفاصيل عن مدة @ar
definition: يربط بين مصدر وتفاصيل عن مدى مصدر يمثل وقت التشغيل، وقت الأداء، مدة العرض، أو فترة زمنية أخرى. @ar
label: tarkemmat tiedot aineiston kestosta @fi
definition: Tarkemmat tiedot aineiston laajuudesta, joka on soittoaika, esitysaika, toistoaika tai muu ajan pituus. @fi
label: hat Details zur Dauer @de
definition: Setzt eine Ressource in Beziehung zu Details zu dem Umfang einer Ressource, bei dem es sich um eine Wiedergabezeit, eine Aufführungszeit, eine Laufzeit oder eine andere Zeitspanne handelt. @de
label: 有持续时间细节 @zh-hans
definition: 将一种资源与作为播放时间、表演时间、运行时间或其他时间长度的资源的数量的细节关联起来。 @zh-hans
label: időtartam részletei a következők: @hu
definition: Hozzákapcsol egy forrást egy forrás terjedelmének következő részleteihez: játékidő, előadás ideje, futásidő vagy egyéb időtartomány. @hu
label: süre ayrıntıları ile ilişkilidir @tr
definition: Bir kaynağı, oynatma süresi, performans süresi, çalışma süresi veya diğer bir süre uzunluğu olan bir kaynak kapsamının ayrıntılarıyla ilişkilendirir. @tr

has details of emulsion on microfilm and microfiche
status: Published
type: Property
lexical alias: detailsOfEmulsionOnMicrofilmAndMicrofiche.en
definition: Relates a resource to details of a suspension of light-sensitive chemicals used as a coating on a microfilm or microfiche.
sub property of: has details of applied material
label: har detaljer om emulsion på mikrofilm og mikrofiche @da
definition: Relaterer en ressource til detaljer om opslæmmede lysfølsomme kemikalier, der er anvendt som belægning på en mikrofilm eller mikrofiche @da
label: heeft details van de emulsie op microfilm en microfiche @nl
label: له تفاصيل عن الطبقة الحساسة على ميكروفيلم وميكروفيش @ar
definition: يربط بين مصدر وتفاصيل عن نظام تسجيل خاص بالمواد الكيميائية المستخدمة كغطاء على ميكروفيلم أو ميكروفيش. @ar
label: mikrokortin ja mikrofilmin emulsion tarkemmat tiedot aineistolle @fi
definition: Liittää aineiston tarkempiin tietoihin mikrofilmin tai mikrokortin valoherkkiä kemikaaleja sisältävästä pinnoitteesta. @fi
label: hat Details zur Emulsionsschicht auf Mikrofilm und Mikrofiche @de
definition: Setzt eine Ressource in Beziehung zu Details zu einer Suspension aus lichtempfindlichen Chemikalien, die als Beschichtung eines Mikrofilms oder eines Mikrofiches verwendet wird. @de
label: 有缩微胶卷和缩微平片上的乳剂的细节 @zh-hans
definition: 将一种资源与缩微胶卷或缩微平片表面感光化合物的悬浮涂层的细节关联起来。 @zh-hans
label: mikrofilmen és microfiche-en levő emulzió részletei a következők: @hu
definition: Hozzákapcsol egy forrást mikrofilmen vagy mikrofiche-lemezen bevonatként használt fényérzékeny vegyszerek szuszpenziójának részleteihez. @hu
label: mikrofilm ve mikrofiş üzerindeki emülsiyonun ayrıntıları ile ilişkilidir @tr
definition: .Bir kaynağı, bir mikrofilm veya mikrofiş üzerinde kaplama olarak kullanılan ışığa duyarlı kimyasalların süspansiyonunun ayrıntılarıyla ilişkilendirir. @tr

has details of encoding format
status: Published
type: Property
lexical alias: detailsOfEncodingFormat.en
definition: Relates a resource to details of a schema or standard used to encode the digital content of a resource.
sub property of: has details of digital file characteristic
label: har detaljer om kodningsformat @da
definition: Relaterer en ressource til detaljer om skema, standard etc., der anvendes til kodning af en ressources digitale indhold. @da
label: heeft details van coderingsformaat @nl
label: له تفاصيل عن نظام ترميز @ar
definition: يربط بين مصدر وتفاصيل عن خطة أو معيار مستخدم في تشفير المحتوى الرقمي لمصدر. @ar
label: aineiston koodausmuodon tarkemmat tiedot @fi
definition: Liittää aineiston tarkempiin tietoihin aineiston digitaalisen sisällön koodaamiseen käytetystä skeemasta tai standardista. @fi
label: hat Details zum Kodierungsformat @de
definition: Setzt eine Ressource in Beziehung zu Details zu dem Schema, Standard und so weiter, das/der zum Kodieren des digitalen Inhalts einer Ressource verwendet wird. @de
label: 有编码格式的细节 @zh-hans
definition: 将一种资源与用于对一种资源的数字内容进行编码的一种方案或标准的细节关联起来。 @zh-hans
label: kódolási formátum részletei a következők: @hu
definition: Hozzákapcsol egy forrást egy séma, szabvány stb. részleteihez, amelyet egy megjelenési forma digitális tartalmának kódolására használnak. @hu
label: kodlama formatının ayrıntıları ile ilişkilidir @tr
definition: Bir kaynağı, bir kaynağın dijital içeriğini kodlamak için kullanılan bir şema veya standardın ayrıntılarıyla ilişkilendirir. @tr

has details of file type
status: Published
type: Property
lexical alias: detailsOfFileType.en
definition: Relates a resource to details of a general type of data content encoded in a computer file.
sub property of: has details of digital file characteristic
label: har detaljer om filtype @da
definition: Relaterer en ressource til detaljer om typen af dataindhold kodet i en computerfil. @da
label: heeft details van bestandstype @nl
label: له تفاصيل عن نوع الملف @ar
definition: يربط بين مصدر وتفاصيل عن نوع عام لمحتوى بيانات تم تشفيرها في ملف كمبيوتر. @ar
label: aineiston tiedostotyypin tarkemmat tiedot @fi
definition: Liittää aineiston tarkempiin tietoihin tiedostoon koodatun datasisällön yleisestä tyypistä. @fi
label: hat Details zum Dateityp @de
definition: Setzt eine Ressource in Beziehung zu Details zu einer allgemeinen Art von Dateninhalt, der in einer Datei kodiert ist. @de
label: 有文件类型细节 @zh-hans
definition: 将一种资源与计算机文件中编码的数据内容的一般类型的细节关联起来。 @zh-hans
label: fájltípus részletei a következők: @hu
definition: Hozzákapcsol egy forrást egy számítógépes fájlban kódolt adattartalom általános típusának részleteihez. @hu
label: dosya türünün ayrıntıları ile ilişkilidir @tr
definition: Bir kaynağı, bir bilgisayar dosyasında kodlanmış genel bir veri türünün içeriğinin ayrıntılarıyla ilişkilendirir. @tr

has details of font size
status: Published
type: Property
lexical alias: detailsOfFontSize.en
definition: Relates a resource to details of a size of the type used to represent characters and symbols in a resource.
label: har detaljer om skriftstørrelse @da
definition: Relaterer en ressource til detaljer om størrelsen på den skrifttype, der er anvendt til at repræsentere tegn og symboler i en ressource. @da
label: heeft details van lettergrootte @nl
label: له تفاصيل عن حجم خط @ar
definition: يربط بين مصدر وتفاصيل عن حجم الخط المستخدم في تمثيل التمثيلات والرموز في مصدر. @ar
label: aineiston kirjasinkoon tarkemmat tiedot @fi
definition: Liittää aineiston tarkempiin tietoihin aineistossa esiintyvien merkkien ja symbolien koosta. @fi
label: hat Details zur Schriftgröße @de
definition: Setzt eine Ressource in Beziehung zu Details zur Größe der Schrift, die zur Repräsentation von Zeichen und Symbole in einer Ressource verwendet wird. @de
label: 有字体大小细节 @zh-hans
definition: 将一种资源与在一种资源中用于表示字符和符号的字型的大小的细节关联起来。 @zh-hans
label: betűméret részletei a következők: @hu
definition: Hozzákapcsol egy forrást a típusméret részleteihez, amelyet karakterek és jelek ábrázolására használnak egy forrásban. @hu
label: yazı tipi boyutunun ayrıntıları ile ilişkilidir @tr
definition: Bir kaynağı, bir kaynaktaki karakterleri ve sembolleri temsil etmek için kullanılan harfin boyutunun ayrıntılarıyla ilişkilendirir. @tr

has details of format of notated music
status: Published
type: Property
lexical alias: detailsOfFormatOfNotatedMusic.en
definition: Relates a resource to details of a musical or physical layout of the content of a resource that is presented in a form of musical notation.
label: har detaljer om format af noteret musik @da
definition: Relaterer en ressource til detaljer om det musikalske eller fysiske layout af en ressources indhold, der er repræsenteret som musikalsk notation. @da
label: heeft details van format van bladmuziek @nl
label: له صيغة من موسيقى مدونة @ar
definition: يربط بين مصدر وتفاصيل عن تخطيط موسيقي أو مادي لمحتوى مصدر يُعرض في شكل من أشكال التدوين الموسيقي. @ar
label: nuottiaineiston muodon tarkemmat tiedot @fi
definition: Liittää aineiston tarkempiin tietoihin nuottikirjoituksen muodossa esitetyn aineiston sisällön musiikillisesta tai fyysisestä taitosta. @fi
label: hat Details zur musikalischen Ausgabeform @de
definition: Setzt eine Ressource in Beziehung zu Details zu dem musikalischen oder physischen Layout des Inhalts einer Ressource, der in Form einer Musiknotation präsentiert wird. @de
label: 有乐谱格式的细节 @zh-hans
definition: 将一种资源与以乐谱形式呈现的一种资源之内容的音乐或物理布局的细节关联起来。 @zh-hans
label: zenei lejegyzés formátumának részletei a következők: @hu
definition: Hozzákapcsol egy forrást egy forrás tartalmának zenei lejegyzés formájában megjelenő zenei vagy fizikai elrendezésének részleteihez. @hu
label: notaya alınmış müzik formatının ayrıntıları ile ilişkilidir @tr
definition: Bir kaynağı, müzik notasyonu biçiminde sunulan bir kaynağın içeriğinin fiziksel veya müzikal düzeninin ayrıntılarıyla ilişkilendirir. @tr

has details of form of musical notation
status: Published
type: Property
lexical alias: detailsOfFormOfMusicalNotation.en
definition: Relates a resource to details of a set of characters or symbols used to express musical content of a resource.
label: har detaljer om musikalsk notationsform @da
definition: Relaterer en ressource til detaljer om det tegnsæt og/eller symboler der anvendes for at udtrykke en ressources musikalske indhold. @da
label: heeft details van vorm van muzieknotatie @nl
label: له تفاصيل عن شكل من أشكال التدوين الموسيقي @ar
definition: يربط بين مصدر وتفاصيل عن مجموعة من التمثيلات أو الرموز المستخدمة للتعبير عن محتوى موسيقي لمصدر. @ar
label: aineiston nuottikirjoituksen tyypin tarkemmat tiedot @fi
definition: Tarkemmat tiedot merkeistä ja symboleista, joilla aineiston musiikkisisältö on ilmaistu. @fi
label: hat Details zur Form der Musiknotation @de
definition: Setzt eine Ressource in Beziehung zu Details zu dem Satz von Zeichen oder Symbolen der verwendet wird, um den musikalischen Inhalt einer Ressource auszudrücken. @de
label: 有乐谱形式的细节 @zh-hans
definition: 将一种资源与用于表示一种资源之音乐内容的字符或符号的集合的细节关联起来。 @zh-hans
label: zenei lejegyzés formájának részletei a következők: @hu
definition: Hozzákapcsol egy forrást egy forrás zenei tartalmát kifejező karakterek vagy szimbólumok csoportjának részleteihez. @hu
label: müzik notasyonu biçiminin ayrıntıları ile ilişkilidir @tr
definition: Bir kaynağı, bir kaynağın müzikal içeriğini ifade etmek için kullanılan bir dizi karakter veya sembollerin ayrıntılarıyla ilişkilendirir. @tr

has details of form of notated movement
status: Published
type: Property
lexical alias: detailsOfFormOfNotatedMovement.en
definition: Relates a resource to details of a set of characters or symbols used to express movement content of a resource.
label: har detaljer om bevægelsesnotationsform @da
definition: Relaterer en ressource til detaljer om det sæt af tegn og/eller de symboler, der er anvendt til at udtrykke en ressources bevægelsesindhold. @da
label: heeft details van vorm van bewegingsnotatie @nl
label: له تفاصيل عن شكل من أشكال الحركات المدونة @ar
definition: يربط بين مصدر وتفاصيل عن مجموعة من التمثيلات أو الرموز المستخدمة للتعبير عن محتوى حركي لمصدر. @ar
label: aineiston nuottikirjoituksen tyypin tarkemmat tiedot @fi
definition: Liittää aineiston tarkempiin tietoihin merkeistä ja symboleista, joilla aineiston liikesisältö on ilmaistu. @fi
label: hat Details zur Form der Bewegungsnotation @de
definition: Setzt eine Ressource in Beziehung zu Details zu dem Satz von Zeichen oder Symbolen der verwendet wird, um den Bewegungsinhalt einer Ressource auszudrücken. @de
label: 有动作谱形式的细节 @zh-hans
definition: 将一种资源与用于表示一种资源之动作内容的字符或符号的集合的细节关联起来。 @zh-hans
label: mozgásírásforma részletei a következők: @hu
definition: Hozzákapcsol egy forrást egy forrás mozgástartalmát kifejező karakterek vagy szimbólumok egy csoportjának részleteihez. @hu
label: notaya alınmış hareket biçiminin ayrıntıları ile ilişkilidir @tr
definition: Bir kaynağı, bir kaynağın hareket içeriğini ifade etmek için kullanılan bir dizi karakter veya sembollerin ayrıntılarıyla ilişkilendirir. @tr

has details of form of tactile notation
status: Published
type: Property
lexical alias: detailsOfFormOfTactileNotation.en
definition: Relates a resource to details of a set of characters or symbols used to express the content of a resource in a form that can be perceived through touch.
label: har detaljer om taktil notationsform @da
definition: Relaterer en ressource til detaljer om det tegnsæt og/eller symboler, der er anvendt til at udtrykke en ressources indhold på en måde, der kan opfattes ved berøring. @da
label: heeft details van vorm van tactiele notatie @nl
label: له تفاصيل عن شكل من أشكال التدوين عن طريق اللمس @ar
definition: يربط بين مصدر وتفاصيل عن مجموعة من التمثيلات أو الرموز المستخدمة للتعبير عن محتوى مصدر في شكل يمكن إدراكه من خلال اللمس. @ar
label: aineiston taktiilin merkkijärjestelmän tyypin tarkemmat tiedot @fi
definition: Liittää aineiston tarkempiin tietoihin merkeistä ja symboleista, joilla aineiston sisältö on ilmaistu kosketeltavassa muodossa. @fi
label: hat Details zur Form der taktilen Notation @de
definition: Setzt eine Ressource in Beziehung zu Details zu dem Satz von Zeichen oder Symbolen der verwendet wird, um den Inhalt einer Ressource in einer Form auszudrücken, die über den Tastsinn wahrgenommen werden kann. @de
label: 有触摸标记的形式的细节 @zh-hans
definition: 将一种资源与用于通过触摸感知的形式来表达一种资源的内容的字符或符号的集合的细节关联起来。 @zh-hans
label: tapintható lejegyzés formájának részletei a következők: @hu
definition: Hozzákapcsol egy forrást egy forrás tartalmát érintés útján felfogható formában kifejező karakterek vagy szimbólumok egy csoportjának részleteihez. @hu
label: dokunsal notasyon biçiminin ayrıntıları ile ilişkilidir @tr
definition: Bir kaynağı, bir kaynağın içeriğini dokunma yoluyla algılanabilecek bir biçimde ifade etmek için kullanılan bir dizi karakter veya sembollerin ayrıntılarıyla ilişkilendirir. @tr

has details of generation
status: Published
type: Property
lexical alias: detailsOfGeneration.en
definition: Relates a resource to details of a relationship between an original carrier and a carrier of a reproduction made from an original.
label: har detaljer om generation @da
definition: Relaterer en ressource til detaljer om forholdet mellem en oprindelig bærer og bæreren af en reproduktion baseret på originalen. @da
label: heeft details van generatie @nl
label: له تفاصيل عن توليد @ar
definition: يربط بين مصدر وتفاصيل عن علاقة بين حامل أصلي والحامل الخاص بإعادة الإنتاج المصنوع من الأصل. @ar
label: aineiston sukupolven tarkemmat tiedot @fi
definition: Liittää aineiston tarkempiin tietoihin alkuperäisen tallenteen ja siitä tuotetun jäljenteen tallenteen välisestä suhteesta. @fi
label: hat Details zur Kopiengeneration @de
definition: Setzt eine Ressource in Beziehung zu Details zu einer Beziehung zwischen einem Originaldatenträger und einem Datenträger einer Reproduktion, die vom Original erstellt wird. @de
label: 有代的细节 @zh-hans
definition: 将一种资源与原始载体和原件复制品的载体之间的关系的细节关联起来。 @zh-hans
label: generáció részletei a következők: @hu
definition: Hozzákapcsol egy forrást egy eredeti hordozó és az eredetiből készült másolat hordozója közötti viszony részleteihez. @hu
has subproperty: has details of generation of audio recording (Deprecated)
has subproperty: has details of generation of digital resource (Deprecated)
has subproperty: has details of generation of microform (Deprecated)
has subproperty: has details of generation of motion picture film (Deprecated)
has subproperty: has details of generation of videotape (Deprecated)
label: üretim ayrıntıları ile ilişkilidir @tr
definition: Bir kaynağı, orijinal bir taşıyıcı ile orijinalden yapılan bir çoğaltmanın taşıyıcısı arasındaki bağlantının ayrıntılarıyla ilişkilendirir. @tr

has details of generation of audio recording (Deprecated)
status: Deprecated
type: Property
lexical alias: detailsOfGenerationOfAudioRecording.en
definition: Relates a resource to details of the relationship between an original audio carrier and the carrier of a reproduction made from the original (e.g., a tape duplication master, a test pressing). (Deprecated)
sub property of: has details of generation

has details of generation of digital resource (Deprecated)
status: Deprecated
type: Property
lexical alias: detailsOfGenerationOfDigitalResource.en
definition: Relates a resource to details of the relationship between an original carrier of a digital resource and the carrier of a reproduction made from the original (e.g., a derivative master).. (Deprecated)
sub property of: has details of generation

has details of generation of microform (Deprecated)
status: Deprecated
type: Property
lexical alias: detailsOfGenerationOfMicroform.en
definition: Relates a resource to details of the relationship between an original microform carrier and the carrier of a reproduction made from the original (e.g., a printing master).. (Deprecated)
sub property of: has details of generation

has details of generation of motion picture film (Deprecated)
status: Deprecated
type: Property
lexical alias: detailsOfGenerationOfMotionPictureFilm.en
definition: Relates a resource to details of the relationship between an original carrier of a motion picture film resource and the carrier of a reproduction made from the original (e.g., a reference print).. (Deprecated)
sub property of: has details of generation

has details of generation of videotape (Deprecated)
status: Deprecated
type: Property
lexical alias: detailsOfGenerationOfVideotape.en
definition: Relates a resource to details of the relationship between an original carrier of a videotape resource and the carrier of a reproduction made from the original (e.g., a show copy).. (Deprecated)
sub property of: has details of generation

has details of groove characteristic
status: Published
type: Property
lexical alias: detailsOfGrooveCharacteristic.en
definition: Relates a resource to details of a groove width of an analog disc or a groove pitch of an analog cylinder.
sub property of: has details of sound characteristic
label: har detaljer om rillekarakteristika @da
definition: Relaterer en ressource til detaljer om rillebredden på en analog disk eller rilledybden på en analog cylinder. @da
label: heeft details van groefkenmerken @nl
label: له تفاصيل عن خاصية مسار @ar
definition: يربط بين مصدر وتفاصيل عن عرض مسار لقرص تناظري أو مسار لاسطوانة تناظرية. @ar
label: uran ominaisuuksien tarkemmat tiedot aineistolle @fi
definition: Liittää aineiston tarkempiin tietoihin analogisen levyn uran leveydestä tai äänilieriön urajaosta. @fi
label: hat Details zur Rilleneigenschaft @de
definition: Setzt eine Ressource in Beziehung zu Details zur Rillenbreite einer Schallplatte oder zum Rillenabstand eines Phonographenzylinders. @de
label: 有纹槽特征的细节 @zh-hans
definition: 将一种资源与模拟盘的纹槽宽度或模拟筒的纹槽间距的细节关联起来。 @zh-hans
label: barázdajellemzők részletei a következők: @hu
definition: Hozzákapcsol egy forrást egy analóg lemez barázdaszélességének vagy egy analóg henger barázdamélységének részleteihez. @hu
label: oluk özelliğinin ayrıntıları ile ilişkilidir @tr
definition: Bir kaynağı, bir analog silindirin oluk aralığı veya bir analog diskin oluk genişliğinin ayrıntılarıyla ilişkilendirir. @tr

has details of illustrative content (Deprecated)
type: Property
lexical alias: detailsOfIllustrativeContent.en
definition: Relates a resource to details of content intended to illustrate a primary content of a resource. (Deprecated)
label: har detaljer om illustrativt indhold @da
definition: Relaterer en ressource til detaljer om indhold, der er beregnet til at illustrere et udtryks primære indhold. @da
status: Deprecated
label: heeft details van illustratieve content @nl
label: له تفاصيل عن محتوى توضيحي @ar
definition: يربط بين مصدر وتفاصيل عن محتوى يهدف إلى توضيح محتوى أساسي لمصدر. @ar
label: hat Details zu illustrierendem Inhalt @de
definition: Setzt eine Ressource in Beziehung zu Details zum Inhalt, die einen primären Inhalt einer Ressource verdeutlichen sollen. @de
label: kuvituksellisen sisällön tarkemmat tietot @fi
definition: Liittää aineiston lisätietoihin sen ensisijaista sisältöä kuvittamaan tarkoitetusta sisällöstä. @fi
label: illusztratív tartalom részletei a következők: @hu
definition: Hozzákapcsol egy forrást egy forrás elsődleges tartalmát illusztrálni kívánó tartalom részleteihez. @hu

has details of layout
status: Published
type: Property
lexical alias: detailsOfLayout.en
definition: Relates a resource to details of an arrangement of text, images, tactile notation, or other content in a resource.
label: har detaljer om layout @da
definition: Relaterer en ressource til detaljer om opstilling af tekst, billeder, taktil notation etc. i en ressource. @da
label: heeft details van lay-out @nl
label: له تفاصيل عن تصميم طباعي @ar
definition: يربط بين مصدر وتفاصيل عن ترتيب نص، صور، كتابة بارزة، أو أي محتوى آخر في مصدر ما. @ar
label: aineiston layoutin tarkemmat tiedot @fi
definition: Liittää aineiston tarkempiin tietoihin aineistoon sisältyvän tekstin, kuvien, taktiilin nuottikirjoituksen tai muun sisällön sommittelusta. @fi
label: hat Details zum Layout @de
definition: Setzt eine Ressource in Beziehung zu Details zur Anordnung von Text, Bildern, taktiler Notation und so weiter in einer Ressource. @de
label: 有版式细节 @zh-hans
definition: 将一种资源与资源中对文本、图像、触摸标记或其他内容的安排的细节关联起来。 @zh-hans
label: tördelés részletei a következők: @hu
definition: Hozzákapcsol egy forrást szöveg, képek, tapintható lejegyzés vagy egyéb tartalom elrendezésének részleteihez egy forrásban. @hu
label: düzen ayrıntıları ile ilişkilidir @tr
definition: Bir kaynağı, bir kaynaktaki metin, görüntü, dokunsal notayon veya diğer içeriğin düzenlenmesinin ayrıntılarıyla ilişkilendirir. @tr

has details of mount
status: Published
type: Property
lexical alias: detailsOfMount.en
definition: Relates a resource to details of a physical material used for the support or backing to which the base material of a resource is attached.
label: har detaljer om montage @da
definition: Relaterer en ressource til detaljer om det fysiske materiale, der udgør den støtte eller bagbeklædning, som en ressources basismateriale er fastgjort på. @da
label: heeft details van ondersteuning @nl
label: له تفاصيل عن حامل @ar
definition: يربط بين مصدر وتفاصيل عن مادة مادية تُستخدم في تدعيم أو سند مادة القاعدة التي يكون المصدر ملصق بها. @ar
label: aineiston tukimateriaalin tarkemmat tiedot @fi
definition: Liittää aineiston tarkempiin tietoihin materiaalista, johon aineiston pohjamateriaali kiinnitetään aineiston tukemiseksi tai kannattamiseksi. @fi
label: hat Details zur Halterung @de
definition: Setzt eine Ressource in Beziehung zu Details zu einem physischen Material, das für die Halterung oder die Stütze verwendet wird, an dem das Trägermaterial einer Ressource angebracht ist. @de
label: 有衬底/底座细节 @zh-hans
definition: 将一种资源与用于支撑或背衬的资源的基底材料所附着的物理材料的细节关联起来。 @zh-hans
label: foglalat részletei a következők: @hu
definition: Hozzákapcsol egy forrást egy forrás alapanyagához csatolt tartóként vagy támaszként használt fizikai anyag részleteihez. @hu
label: montaj ayrıntıları ile ilişkilidir @tr
definition: Bir kaynağı, bir kaynağın temel malzemesinin bağlı olduğu destek veya taşımak için kullanılan fiziksel bir malzemenin ayrıntılarıyla ilişkilendirir. @tr

has details of playing speed
status: Published
type: Property
lexical alias: detailsOfPlayingSpeed.en
definition: Relates a resource to details of a speed at which an audio carrier must be operated to produce the sound intended.
label: har detaljer om omdrejningshastighed @da
definition: Relaterer en ressource til detaljer om den hastighed, som en lydbærer skal betjenes ved for at producere den ønskede lyd. @da
label: heeft details van afspeelsnelheid @nl
label: له تفاصيل عن سرعة تشغيل @ar
definition: يربط بين مصدر وتفاصيل عن سرعة يجب أن يُشغل بها حامل صوت لكي ينتج الصوت المطلوب. @ar
label: toistonopeuden tarkemmat tiedot aineistolle @fi
definition: Liittää aineiston tarkempiin tietoihin nopeudesta, jolla äänitallenne on toistettava äänen tuottamiseksi tarkoitetulla tavalla. @fi
label: hat Details zur Abspielgeschwindigkeit @de
definition: Setzt eine Ressource in Beziehung zu Details zur Geschwindigkeit, mit der ein Tonträger für die korrekte Wiedergabe abgespielt werden muss. @de
label: 有播放速度细节 @zh-hans
definition: 将一种资源与一种音频载体要产生所期望的声音必须操作的速度的细节关联起来。 @zh-hans
label: lejátszási sebesség részletei a következők: @hu
definition: Hozzákapcsol egy forrást egy sebesség részleteihez, amelyen a hanghordozónak működnie kell, hogy a kívánt hangot elő tudják állítani. @hu
label: oynatma hızı ayrıntıları ile ilişkilidir @tr
definition: Bir kaynağı, amaçlanan sesi üretmek için bir ses taşıyıcısının çalıştırılması gereken bir hızın ayrıntılarıyla ilişkilendirir. @tr

has details of polarity
status: Published
type: Property
lexical alias: detailsOfPolarity.en
definition: Relates a resource to details of a relationship of the colours and tones in an image to the colours and tones of the object reproduced.
label: har detaljer om polaritet @da
definition: Relaterer en ressource til detaljer om forholdet mellem farver og nuancer i et billede samt farver og nuancer i den reproducerede genstand. @da
label: heeft details van polariteit @nl
label: له تفاصيل عن استقطاب ألوان @ar
definition: يربط بين مصدر وتفاصيل عن علاقة خاصة بالألوان ودرجات الألوان في صورة ما بألوان ودرجات شيئًا معاد إنتاجه. @ar
label: polariteetin tarkemmat tiedot aineistolle @fi
definition: Liittää aineiston tarkempiin tietoihin suhteesta, joka kuvan väreillä ja valoisuudella on kuvan kohteen väreihin ja valoisuuteen. @fi
label: hat Details zur Polarität @de
definition: Setzt eine Ressource in Beziehung zu Details zu dem Verhältnis der Farben und Tönungen in einem Bild zu den Farben und Tönungen des reproduzierten Objekts. @de
label: 有极性细节 @zh-hans
definition: 将一种资源与一个图像中色彩和色调与被复制对象的色彩和色调的关系的细节关联起来。 @zh-hans
label: polaritás részletei a következők: @hu
definition: Hozzákapcsol egy forrást egy kép színei és tónusai, valamint a reprodukált tárgy színei és tónusai között fennálló viszony részleteihez. @hu
label: polarite ayrıntıları ile ilişkilidir @tr
definition: Bir kaynağı, bir görüntüdeki renklerin ve tonların, yeniden üretilen nesnenin renkleri ve tonlarıyla olan bağlantısının ayrıntılarıyla ilişkilendirir. @tr

has details of presentation format
status: Published
type: Property
lexical alias: detailsOfPresentationFormat.en
definition: Relates a resource to details of a format used in the production of a projected image.
label: har detaljer om fremvisningsformat @da
definition: Relaterer en ressource til detaljer om det format, der er anvendt ved fremstillingen af et projiceret billede. @da
label: heeft details van presentatieformaat @nl
label: له تفاصيل عن صيغة عرض @ar
definition: يربط بين مصدر وتفاصيل عن صيغة مُستخدمة في إنتاج صورة مرئية. @ar
label: esitysformaatin tarkemmat tiedot aineistolle @fi
definition: Liittää aineiston tarkempiin tietoihin heijastettavan kuvan tuottamisessa käytettävästä formaatista. @fi
label: hat Details zum Wiedergabeformat @de
definition: Setzt eine Ressource in Beziehung zu Details zu dem Format, das bei der Entstehung eines projizierten Bilds verwendet wird. @de
label: 有呈现格式细节 @zh-hans
definition: 将一种资源与用于一个投影图像制作的格式的细节关联起来。 @zh-hans
label: prezentációs formátum részletei a következők: @hu
definition: Hozzákapcsol egy forrást egy kivetített kép előállításánál használt formátum részleteihez. @hu
label: sunum formatının ayrıntıları ile ilişkilidir @tr
definition: Bir kaynağın, yansıtılan bir görüntünün üretiminde kullanılan bir biçimin ayrıntılarıyla ilişkilendirir. @tr

has details of production method
status: Published
type: Property
lexical alias: detailsOfProductionMethod.en
definition: Relates a resource to details of a process used to produce a resource.
label: har detaljer om produktionsmetode @da
definition: Relaterer en ressource til detaljer om den proces, der er anvendt til at fremstille en ressource. @da
label: heeft details van productiemethode @nl
label: له تفاصيل عن طريقة إنتاج @ar
definition: يربط بين مصدر وتفاصيل عن عملية مستخدمة في إنتاج مصدر. @ar
label: valmistusmenetelmän tarkemmat tiedot aineistolle @fi
definition: Liittää aineiston tarkempiin tietoihin aineiston tuottamisessa käytettävästä menetelmästä. @fi
label: hat Details zur Entstehungsmethode @de
definition: Setzt eine Ressource in Beziehung zu Details zu dem Verfahren, das angewendet wird, um eine Ressource zu erzeugen. @de
label: 有制作方法细节 @zh-hans
definition: 将一种资源与用于制作一种资源的一个过程的细节关联起来。 @zh-hans
label: előállítási módszer részletei a következők: @hu
definition: Hozzákapcsol egy forrást egy forrás előállítására használt eljárás részleteihez. @hu
has subproperty: has details of production method for manuscript (Deprecated)
has subproperty: has details of production method for tactile resource (Deprecated)
label: üretim yöntemi ayrıntıları ile ilişkilidir @tr
definition: Bir kaynağı, bir kaynağın yapımı için kullanılan bir sürecin ayrıntılarıyla ilişkilendirir. @tr

has details of production method for manuscript (Deprecated)
status: Deprecated
type: Property
lexical alias: detailsOfProductionMethodForManuscript.en
definition: Relates a resource to details of a process used to produce an original manuscript or a copy. (Deprecated)
sub property of: has details of production method

has details of production method for tactile resource (Deprecated)
status: Deprecated
type: Property
lexical alias: detailsOfProductionMethodForTactileResource.en
definition: Relates a resource to details of a process used to produce a tactile resource. (Deprecated)
sub property of: has details of production method

has details of projection characteristic of motion picture film
status: Published
type: Property
lexical alias: detailsOfProjectionCharacteristicOfMotionPictureFilm.en
definition: Relates a resource to details of a technical specification relating to the projection of a motion picture film.
label: har detaljer om projektionskarakteristika for film @da
definition: Relaterer en ressource til detaljer om teknisk specifikation relateret til projektion af en film. @da
label: heeft details van projectiekenmerken van speelfilm @nl
label: له تفاصيل عن خاصية عرض لفيلم صور متحركة @ar
definition: يربط بين مصدر وتفاصيل عن مواصفات فنية متعلقة بعرض فيلم صور متحركة. @ar
label: elokuvafilmin projisointiominaisuuksien tarkemmat tiedot aineistolle @fi
definition: Liittää aineiston tarkempiin tietoihin elokuvafilmin projisointia koskevasta teknisestä määrityksestä. @fi
label: hat Details zur Projektionseigenschaft eines Films @de
definition: Setzt eine Ressource in Beziehung zu Details zu einer technischen Spezifikation, die sich auf die Projektion eines Films bezieht. @de
label: 有电影胶卷的投影特征的细节 @zh-hans
definition: 将一种资源与和一种电影胶卷的投影有关的技术规格的细节关联起来。 @zh-hans
label: filmvetítési jellemzők részletei a következők: @hu
definition: Hozzákapcsol egy forrást egy mozgófilmhez kapcsolódó műszaki előírás vagy specifikáció részleteihez. @hu
has subproperty: has details of projection speed
label: sinema filminin projeksiyon özelliğinin ayrıntıları ile ilişkilidir @tr
definition: Bir kaynağı, bir sinema filminin planlanması ile ilgili teknik bir özelliğin ayrıntılarıyla ilişkilendirir. @tr

has details of projection speed
status: Published
type: Property
lexical alias: detailsOfProjectionSpeed.en
definition: Relates a resource to details of a speed at which a projected carrier must be operated to produce the moving image intended.
sub property of: has details of projection characteristic of motion picture film
label: har detaljer om projektionshastighed @da
definition: Relaterer en ressource til detaljer om den hastighed, som en projiceret bærer skal betjenes ved for at producere det ønskede levende billede. @da
label: heeft details van projectiesnelheid @nl
label: له تفاصيل عن سرعة عرض @ar
definition: يربط بين مصدر وتفاصيل عن سرعة يجب أن يشغل بها حامل عرض لكي ينتج عنه الصور المتحركة المطلوبة. @ar
label: projisointinopeuden tarkemmat tiedot aineistolle @fi
definition: Liittää aineiston tarkempiin tietoihin nopeudesta, jolla projisoitava tallenne tulee esittää liikkuvan kuvan näyttämiseksi tarkoitetulla tavalla. @fi
label: hat Details zur Projektionsgeschwindigkeit @de
definition: Setzt eine Ressource in Beziehung zu Details zur Geschwindigkeit, mit der ein projizierbarer Datenträger betrieben werden muss, um das beabsichtigte Bewegtbild zu erzeugen. @de
label: 有投影速度细节 @zh-hans
definition: 将一种资源与一种投影载体要产生所期望的动态图像必须操作的速度的细节关联起来。 @zh-hans
label: vetítési sebesség részletei a következők: @hu
definition: Hozzákapcsol egy forrást azon sebesség részleteihez, amelyen egy kivetített hordozónak működnie kell, hogy a kívánt mozgóképet elő tudják állítani. @hu
label: projeksiyon hızı ayrıntıları ile ilişkilidir @tr
definition: Bir kaynağı, amaçlanan hareketli görüntüyü üretmek için planlanmış bir taşıyıcının çalıştırılması gereken bir hızın ayrıntılarıyla ilişkilendirir. @tr

has details of recording medium
status: Published
type: Property
lexical alias: detailsOfRecordingMedium.en
definition: Relates a resource to details of a type of medium used to record sound on an audio carrier.
sub property of: has details of sound characteristic
label: har detaljer om optagemedie @da
definition: Relaterer en ressource til detaljer om det optagemedie, der er anvendt til at optage lyd på en lydbærer. @da
label: heeft details van opnamemedium @nl
label: له تفاصيل عن وسيط تسجيل @ar
definition: يربط بين مصدر وتفاصيل عن نوع وسيط مستخدم في تسجيل الصوت على حامل صوتي. @ar
label: äänen tallennusmedian tyypin tarkemmat tiedot aineistolle @fi
definition: Liittää aineiston tarkempiin tietoihin tallennusmediasta, jolla ääni tallennetaan äänitallenteelle. @fi
label: hat Details zum Aufzeichnungsmedium @de
definition: Setzt eine Ressource in Beziehung zu Details zu einer Art des Mediums, das verwendet wird, um Ton auf einem Tonträger festzuhalten. @de
label: 有录音媒介的细节 @zh-hans
definition: 将一种资源与用于在音频载体上记录声音的媒介类型的细节关联起来。 @zh-hans
label: rögzítőmédium részletei a következők: @hu
definition: Hozzákapcsol egy forrást azon médiumtípus részleteihez, amelyet egy hanghordozóra történő hangrögzítésre használnak. @hu
label: kayıt ortamı ayrıntıları ile ilişkilidir @tr
definition: Bir kaynağı, bir ses taşıyıcısına ses kaydetmek için kullanılan bir ortam türünün ayrıntılarıyla ilişkilendirir. @tr

has details of reduction ratio designation
status: Published
type: Property
lexical alias: detailsOfReductionRatioDesignation.en
definition: Relates a resource to details of a general designation of the size of a micro-image in relation to the original from which it was produced.
label: har detaljer om reduktionsforholdsbetegnelse @da
definition: Relaterer en ressource til detaljer om betegnelsen for størrelse på et mikrobillede i forhold til den original, som det er fremstillet ud fra. @da
label: heeft details van benaming verkleiningsfactor @nl
label: له تفاصيل عن تسمية نسبة تصغير الصور @ar
definition: يربط بين مصدر وتفاصيل عن تسمية عامة لحجم الصورة المصغرة وعلاقتها بالأصل الذي تم إنتاجها منه. @ar
label: pienennyssuhteen määritteen tarkemmat tiedot aineistolle @fi
definition: Liittää aineiston tarkempiin tietoihin yleisestä määritteestä, joka ilmaisee mikrokokoiseksi pienennetyn kuvan suhteen alkuperäiseen kuvaan, josta pienennetty kuva on tuotettu. @fi
label: hat Details zur Bezeichnung eines Verkleinerungsfaktors @de
definition: Setzt eine Ressource in Beziehung zu Details zu einer allgemeinen Bezeichnung für die Größe eines Mikro-Bilds im Verhältnis zum Original, von dem es hergestellt wird. @de
label: 有缩率标识细节 @zh-hans
definition: 将一种资源与缩微图像尺寸和其所复制的原件之间一般关系的标识的细节关联起来。 @zh-hans
label: csökkenési arányjelölés részletei a következők: @hu
definition: Hozzákapcsol egy forrást azon általános megjelölés részleteihez, amely egy mikrokép nagyságát jelzi az eredetihez viszonyítva, amelyből azt előállították. @hu
label: küçültme oranının ayrıntıları ile ilişkilidir @tr
definition: Bir kaynağı, üretildiği orijinali ile ilişkili bir mikro-görüntünün boyutunun genel bir tanımının ayrıntılarıyla ilişkilendirir. @tr

has details of regional encoding
status: Published
type: Property
lexical alias: detailsOfRegionalEncoding.en
definition: Relates a resource to details of a designation for one or more regions of the world for which a videodisc or video game carrier is encoded, indicating that playback is restricted to a device configured to decode it.
sub property of: has details of digital file characteristic
label: har detaljer om regional kodning @da
definition: Relaterer en ressource til detaljer om en kode, der identificerer den region i verden, som en videodisc er kodet til, og som forhindrer, at videodiscen bliver spillet på en afspiller solgt i en anden region. @da
label: heeft details van regiocodering @nl
label: له تفاصيل عن كود منطقة @ar
definition: يربط بين مصدر وتفاصيل عن تسمية لواحدة أو أكثر من مناطق العالم التي تم تشفير حامل الفيديو أو ألعاب الفيديو، يشير إلى أن عملية التشغيل مقصورة على الأجهزة المكودة بكود المنطقة فقط. @ar
label: aineiston aluekoodin lisätiedot @fi
definition: Liittää aineiston lisätietoihin määritteestä, jolla tunnistetaan videolevyn tai videopelitallenteen käyttöalue ja estetään niiden käyttäminen toisella alueella myydyllä soittimella. @fi
label: hat Details zum Regionalcode @de
definition: Setzt eine Manifestation in Beziehung zu Details zu einer Bezeichnung, die die Region(en) der Welt angibt, für die eine Videodisk oder ein Videospiel-Datenträger kodiert ist, und der verhindert, dass die Disk von einem Wiedergabegerät, das in einer anderen Region verkauft wurde, abgespielt werden kann. @de
label: 有地区编码的细节 @zh-hans
definition: 将一种资源与视盘或视频游戏载体被编码后表示对设置解码回放的设备限制的世界上一个或多个地区的标识的细节关联起来。 @zh-hans
label: regionális kódolás részletei a következők: @hu
definition: Hozzákapcsol egy forrást egy a világ egy vagy több régiójára vonatkozó jelölés részleteihez, amelyre egy videólemezt vagy egy videójáték-hordozót kódoltak, jelezve, hogy a visszajátszás annak dekódolására konfigurált készülékre korlátozódik. @hu
label: bölgesel kodlama ayrıntıları ile ilişkilidir @tr
definition: Bir kaynağı, bir videodiskin veya video oyun taşıyıcısının kodlandığı, dünyanın bir veya daha fazla bölgesi için bir atamanın ayrıntılarıyla ilişkilendirir ve oynatmanın kodunu çözmek için yapılandırılmış bir cihazla sınırlı olduğunu belirtir. @tr

has details of script
status: Published
type: Property
lexical alias: detailsOfScript.en
definition: Relates a resource to details of set of characters or symbols used to express written language content of a resource.
label: har detaljer om skriftstørrelse @da
definition: Relaterer en ressource til detaljer om det sæt af tegn og/eller de symboler, der er anvendt til at udtrykke en ressources skriftlige sprogindhold. @da
label: heeft details van schrift @nl
label: له تفاصيل عن نص @ar
definition: يربط بين مصدر وتفاصيل عن مجموعة من التمثيلات أو الرموز المستخدمة للتعبير عن محتوى لغة مكتوبة لمصدر. @ar
label: kirjoitusjärjestelmän tarkemmat tiedotaineiston @fi
definition: Liittää aineiston tarkempiin tietoihin merkki- tai symbolijärjestelmästä, jolla aineiston kirjoitettu kielellinen sisältö on kirjoitettu. @fi
label: hat Details zur Schrift @de
definition: Setzt eine Ressource in Beziehung zu Details zu dem Satz von Buchstaben oder Zeichen der verwendet wird, um den geschriebenen Sprachinhalt einer Ressource auszudrücken. @de
label: 有文字的细节 @zh-hans
definition: 将一种资源与用于表达一种资源的书写语言内容的字符或符号的集合的细节关联起来。 @zh-hans
label: szövegkönyv részletei a következők: @hu
definition: Hozzákapcsol egy forrást egy forrás nyelvi tartalmát kifejező karakterek vagy szimbólumok egy csoportjának részleteihez. @hu
label: alfabenin ayrıntıları ile ilişkilidir @tr
definition: Bir kaynağı, bir kaynağın yazı dili içeriğini ifade etmek için kullanılan bir dizi sembol veya karakterlerin ayrıntılarıyla ilişkilendirir. @tr

has details of sound characteristic
status: Published
type: Property
lexical alias: detailsOfSoundCharacteristic.en
definition: Relates a resource to details of a technical specification relating to the encoding of sound in a resource.
label: har detaljer om lydkarakteristika @da
definition: Relaterer en ressouce til detaljer om teknisk specifikation relateret til kodning af lyd i en ressource. @da
label: heeft details van geluidskenmerken @nl
label: له تفاصيل عن خاصية الصوت @ar
definition: يربط بين مصدر وتفاصيل عن خصائص فنية متعلقة بالترميز لصوت في مصدر. @ar
label: äänen ominaisuuksien tarkemmat tiedot aineistolle @fi
definition: Liittää aineiston tarkempiin tietoihin aineiston sisältämän äänen koodaamisen teknisestä määrityksestä. @fi
label: hat Details zur Toneigenschaft @de
definition: Setzt eine Ressource in Beziehung zu Details zu einer technischen Spezifikation, die sich auf die Kodierung des Tons in einer Ressource bezieht. @de
label: 有声音特征的细节 @zh-hans
definition: 将一种资源与和一种资源中的声音的编码有关的一个技术规格的细节关联起来。 @zh-hans
label: hangjellemzők részletei a következők: @hu
definition: Hozzákapcsol egy forrást azon műszaki előírás vagy specifikáció részleteihez, amely egy forrásban a hang kódolásához kapcsolódik. @hu
has subproperty: has details of configuration of playback channels
has subproperty: has details of groove characteristic
has subproperty: has details of recording medium
has subproperty: has details of special playback characteristic
has subproperty: has details of tape configuration
has subproperty: has details of track configuration
has subproperty: has details of type of recording
label: ses özelliğinin ayrıntıları ile ilişkilidir @tr
definition: Bir kaynağı, bir kaynaktaki sesin kodlanmasıyla ilgili teknik özelliğinin ayrıntılarıyla ilişkilendirir. @tr

has details of special playback characteristic
status: Published
type: Property
lexical alias: detailsOfSpecialPlaybackCharacteristic.en
definition: Relates a resource to details of an equalization system, noise-reduction system, or other processing that is used in making an audio recording.
sub property of: has details of sound characteristic
label: har detaljer om særlige afspilningskarakteristika @da
definition: Relaterer en ressource til detaljer om et equalizersystem, støjdæmpningssystem etc., der er anvendt til at lave en lydoptagelse. @da
label: heeft details van bijzondere afspeelkenmerken @nl
label: له تفاصيل عن خاصية خاصة للتشغيل @ar
definition: يربط بين مصدر وتفاصيل عن نظام موازن الترددات، نظام خفض ضوضاء، أو غيرها من النظم المُستخدمة في إعداد تسجيل صوتي. @ar
label: aineiston äänentoiston erityisominaisuuksien tarkemmat tiedot @fi
definition: Liittää aineiston tarkempiin tietoihin äänitteen äänityksessä käytetystä taajuuskorjausjärjestelmästä, kohinanvaimennusjärjestelmästä tai muusta prosessoinnista. @fi
label: hat Details zu einer besonderen Wiedergabeeigenschaft @de
definition: Setzt eine Ressource in Beziehung zu Details zu einem Ausgleichssystem, einem Störgeräusch-Reduktionssystem und so weiter, das zur Erstellung von Audioaufnahmen verwendet wird. @de
label: 有特别回放特征的细节 @zh-hans
definition: 将一种资源与在一种录音制作中所使用的平衡系统、降噪系统或其他处理的细节关联起来。 @zh-hans
label: speciális visszajátszási jellemzők részletei a következők: @hu
definition: Hozzákapcsol egy forrást azon kiegyenlítő rendszer, zajcsökkentő rendszer stb. részleteihez, amelyeket egy hangfelvétel készítésénél használnak. @hu
label: özel oynatma özelliğinin ayrıntıları ile ilişkilidir @tr
definition: Bir kaynağı, bir ekolayzer sistemi, gürültü azaltma sistemi veya bir ses kaydı yaparken kullanılan diğer işlemlerin ayrıntılarıyla ilişkilendirir. @tr

has details of tape configuration
status: Published
type: Property
lexical alias: detailsOfTapeConfiguration.en
definition: Relates a resource to details of a number of tracks on an audiotape.
sub property of: has details of sound characteristic
label: har detaljer om båndkonfiguration @da
definition: Relaterer en ressource til detaljer om antal spor på et lydbånd. @da
label: heeft details van configuratie geluidsband @nl
label: له تفاصيل عن بنية شريط @ar
definition: يربط بين مصدر وتفاصيل عن عدد المسارات على شريط صوت. @ar
label: ääninauhan raitojen määrän tarkemmat tiedot aineistolle @fi
definition: Liittää aineiston tarkempiin tietoihin ääninauhalla olevien ääniraitojen lukumäärästä. @fi
label: hat Details zur Bandkonfiguration @de
definition: Setzt eine Ressource in Beziehung zu Details zur Anzahl der Spuren auf einem Tonband. @de
label: 有磁带配置的细节 @zh-hans
definition: 将一种资源与录音磁带上的音轨数的细节关联起来。 @zh-hans
label: hangszalagkonfiguráció részletei a következők: @hu
definition: Hozzákapcsol egy forrást egy hangszalagon lévő sávok számának részleteihez. @hu
label: bant yapılandırmasının ayrıntıları ile ilişkilidir @tr
definition: Bir kaynağı, bir ses bandındaki parçaların sayısının ayrıntılarıyla ilişkilendirir. @tr

has details of track configuration
status: Published
type: Property
lexical alias: detailsOfTrackConfiguration.en
definition: Relates a resource to details of a configuration of the audio track on a sound-track film.
sub property of: has details of sound characteristic
label: har detaljer om lydsporskonfiguration @da
definition: Relaterer en ressource til detaljer om konfiguration af lydsporet til en film med soundtrack. @da
label: heeft details van nummerconfiguratie @nl
label: له تفاصيل عن بنية مسار @ar
definition: يربط بين مصدر وتفاصيل عن ضبط مسار صوتي على مسار صوت فيلم. @ar
label: ääniraidan sijainnin tarkemmat tiedot aineistolle @fi
definition: Liittää aineiston tarkempiin tietoihin ääniraidan sijainnista äänifilmissä. @fi
label: hat Details zur Tonspurlage @de
definition: Setzt eine Ressource in Beziehung zu Details zur Positionierung der Tonspur auf einem Film mit Tonspur. @de
label: 有音轨配置的细节 @zh-hans
definition: 将一种资源与原声电影片上的音轨配置的细节关联起来。 @zh-hans
label: sávkonfiguráció részletei a következők: @hu
definition: Hozzákapcsol egy forrást a hangsáv konfigurációjának részleteihez egy hangsávos filmen. @hu
label: parça yapılandırmasının ayrıntıları ile ilişkilidir @tr
definition: Bir kaynağı, bir ses parçası filmi üzerindeki ses parçasının yapılandırmasının ayrıntılarıyla ilişkilendirir. @tr

has details of type of recording
status: Published
type: Property
lexical alias: detailsOfTypeOfRecording.en
definition: Relates a resource to details of a method used to encode audio content for playback.
sub property of: has details of sound characteristic
label: har detaljer om indspilningskarakteristika @da
definition: Relaterer en ressource til detaljer om den metode, der er anvendt til at kode lydindhold til afspilning. @da
label: heeft details van opnamesoort @nl
label: له تفاصيل عن نوع التسجيل @ar
definition: يربط بين مصدر وتفاصيل عن طريقة مستخدمة في تشفير محتوى صوتي مطلوب للتشغيل. @ar
label: äänen tallentamisen tavan tarkemmat tiedot aineistolle @fi
definition: Liittää aineiston tarkempiin tietoihin menetelmästä, jota on käytetty äänen tallentamiseksi äänentoistoa varten. @fi
label: hat Details zur Art einer Aufnahme @de
definition: Setzt eine Ressource in Beziehung zu Details zu einem Verfahren, das zur Kodierung von Audio-Inhalt für die Wiedergabe verwendet wird. @de
label: 有录音的类型的细节 @zh-hans
definition: 将一种资源与用于编码音频内容供回放的方法的细节关联起来。 @zh-hans
label: rögzítéstípus részletei a következők: @hu
definition: Hozzákapcsol egy forrást azon módszer részleteihez, amelyet audiótartalom kódolásához használnak visszajátszás céljára. @hu
label: kayıt türü ayrıntıları ile ilişkilidir @tr
definition: Bir kaynağı, ses içeriğini oynatmak üzere kodlamak için kullanılan bir yöntemin ayrıntılarıyla ilişkilendirir. @tr

has details of video characteristic
status: Published
type: Property
lexical alias: detailsOfVideoCharacteristic.en
definition: Relates a resource to details of a technical specification relating to an encoding of video images in a resource.
label: har detaljer om videokarakteristika @da
definition: Relaterer en ressource til detaljer om teknisk specifikation relateret til kodning af videobilleder i en ressource. @da
label: heeft details van videokenmerken @nl
label: له تفاصيل خاصية فيديو @ar
definition: يربط بين مصدر وتفاصيل عن مواصفات فنية متعلقة بتكويد صور فيديو في مصدر. @ar
label: videon ominaisuuksien tarkemmat tiedot aineistolle @fi
definition: Liittää aineiston tarkempiin tietoihin aineiston sisältämän videon koodauksen teknisestä määrityksestä. @fi
label: hat Details zur Video-Eigenschaft @de
definition: Setzt eine Ressource in Beziehung zu Details zu einer technischen Spezifikation, die sich auf die Kodierung der Videobilder in einer Ressource bezieht. @de
label: 有视频特征的细节 @zh-hans
definition: 将一种资源与和一种资源中的视频图像的编码有关的一个技术规格的细节关联起来。 @zh-hans
label: videójellemző részletei a következők: @hu
definition: Hozzákapcsol egy forrást azon műszaki specifikáció részleteihez, amely egy forrásban videóképek kódolásához kapcsolódik. @hu
has subproperty: has details of broadcast standard
has subproperty: has details of video format
label: video özelliğinin ayrıntıları ile ilişkilidir @tr
definition: Bir kaynağı, bir kaynaktaki video görüntülerinin kodlanmasıyla ilgili teknik özelliğin ayrıntılarıyla ilişkilendirir. @tr

has details of video format
status: Published
type: Property
lexical alias: detailsOfVideoFormat.en
definition: Relates a resource to details of a schema or standard used to encode the analog video content of a resource.
sub property of: has details of video characteristic
label: har detaljer om videoformat @da
definition: Relaterer en ressource til detaljer om standard etc., der anvendes til kodning af en ressources analoge videoindhold. @da
label: heeft details van videoformaat @nl
label: له تفاصيل عن خاصية فيديو @ar
definition: يربط بين مصدر وتفاصيل عن خطة أو معيار مستخدم في تشفير محتوى الفيديو التناظري لمصدر. @ar
label: aineiston videoformaatin tarkemmat tiedot @fi
definition: Tarkemmat tiedot analogisen videon koodaukseen käytetystä skeemasta tai standardista. @fi
label: hat Details zum Videoformat @de
definition: Setzt eine Ressource in Beziehung zu Details zu dem Schema, Standard und so weiter, das/der zur Kodierung des analogen Videoinhalts einer Ressource verwendet wird. @de
label: 有视频格式的细节 @zh-hans
definition: 将一种资源与用于对一种资源的模拟视频内容进行编码的一个方案或标准的细节关联起来。 @zh-hans
label: videóformátum részletei a következők: @hu
definition: Hozzákapcsol egy forrást azon séma vagy szabvány részleteihez, amelyet egy forrás analóg tartalmának kódolására használnak. @hu
label: video formatı ayrıntıları ile ilişkilidir @tr
definition: Bir kaynağı, bir kaynağın analog video içeriğini kodlamak için kullanılan bir şema veya standardın ayrıntılarıyla ilişkilendirir. @tr

is digested as
status: Published
definition: Relates a resource to a resource that systematically and comprehensively condenses a related resource.
type: Property
sub property of: has derivative
inverse of: is digest of
lexical alias: digestedAs.en
label: er sammendraget som @da
definition: Relaterer en ressource til en ressource, der systematisk og gennemgribende komprimerer en oprindelig ressource. @da
label: is digest als @nl
label: mukautettu lyhennelmä (aineisto) @fi
label: هو موجز كـ @ar
definition: يربط بين مصدر ومصدر يكثف بشكل منهجي وشامل مصدرًا ذا صلة. @ar
definition: Liittää aineiston aineistoon, joka systemaattisesti ja kokonaisuudessaan tiivistää toisen aineiston. @fi
label: ist Digest @de
definition: Setzt eine Ressource in Beziehung zu einer Ressource, die eine in Beziehung stehende Ressource systematisch und umfassend verdichtet. @de
label: 被编制文摘为 @zh-hans
definition: 将一种资源与系统而全面压缩一种相关资源的一种资源关联起来。 @zh-hans
label: kivonatolva a következőként: @hu
definition: Hozzákapcsol egy forrást egy forráshoz, amely szabályszerűen és átfogóan tömörít egy kapcsolódó forrást. @hu
label: olarak özetlenmiştir @tr
definition: Bir kaynağı, ilgili bir kaynağı sistematik ve kapsamlı bir şekilde özetleyen bir kaynakla ilişkilendirir. @tr

is digest of
status: Published
definition: Relates a resource to a resource that is a systematic and comprehensive condensing of a related resource.
type: Property
sub property of: has source
inverse of: is digested as
lexical alias: digestOf.en
label: er sammendrag af @da
definition: Relaterer en ressource til en ressource, der er et sammendrag, dvs. der er systematisk og gennemgribende komprimeret. @da
label: is digest van @nl
label: mukautettu lyhennelmä aineistosta @fi
label: هو موجز لـ @ar
definition: يربط بين مصدر ومصدر يعد تكثيفًا منهجيًا وشاملًا لمصدر ذي صلة. @ar
definition: Liittää aineiston aineistoon, joka on systemaattisesti, kokonaisuudessaan ja mukaillen tiivistetty toisesta, liittvästä aineistosta. @fi
label: ist Digest von @de
definition: Setzt eine Ressource in Beziehung zu einer Ressource, die eine systematische und umfassende Verdichtung einer in Beziehung stehenden Ressource darstellt. @de
label: 是……的文摘 @zh-hans
definition: 将一种资源与作为一种相关资源的系统而全面压缩的一种资源关联起来。 @zh-hans
label: tömörítvénye a következőnek: @hu
definition: Hozzákapcsol egy forrást egy forráshoz, amely egy kapcsolódó forrás módszeres és átfogó tömörítése. @hu
label: özetidir @tr
definition: Bir kaynağı, ilgili bir kaynağın sistematik ve kapsamlı bir şekilde derlendiği bir kaynakla ilişkilendirir. @tr

has digital file characteristic
status: Published
definition: Relates a resource to a technical specification relating to a digital encoding of text, image, audio, video, and other types of data in a resource.
type: Property
lexical alias: digitalFileCharacteristic.en
label: har digitale filkarakteristika @da
definition: Relaterer en ressource til en teknisk specifikation relateret til den digitale kodning af tekst, billede, audio-, video- og andre datatyper i en ressource. @da
label: heeft kenmerken digitale bestand @nl
label: digitaalisen tiedoston ominaisuus aineistossa @fi
label: له خاصية ملف رقمي @ar
definition: يربط بين مصدر ومواصفات فنية متعلقة بتشفير رقمي لنص، صورة، صوت، فيديو، وأي نوع بيانات آخر في مصدر. @ar
definition: Liittää aineiston aineiston sisältämän tekstin, kuvan, äänen, videon tai muun datan digitaaliseen koodauksen tekniseen määritykseen. @fi
label: hat Eigenschaft einer digitalen Datei @de
definition: Setzt eine Ressource in Beziehung zu einer technischen Spezifikation, die sich auf die digitale Kodierung von Text, Bild, Audio, Video und anderen Datentypen in einer Ressource bezieht. @de
label: 有数字文件特征 @zh-hans
definition: 将一种资源与和一种资源中的文本、图像、音频、视频或其他类型数据的数字编码有关的一个技术规格关联起来。 @zh-hans
label: digitális fájl jellemzője a következő: @hu
definition: Hozzákapcsol egy forrást egy műszaki specifikációhoz, amely egy forrásban a szöveg, kép, hang, videó és más adattípusok digitális kódolásához kapcsolódik. @hu
has subproperty: has digital representation of cartographic content
has subproperty: has encoded bitrate
has subproperty: has encoding format
has subproperty: has file size
has subproperty: has file type
has subproperty: has regional encoding
has subproperty: has resolution
label: dijital dosya özelliği ile ilişkilidir @tr
definition: Bir kaynağı, bir kaynaktaki metin, görüntü, ses, video ve diğer veri türlerinin dijital olarak kodlanmasıyla ilgili teknik özellik ile ilişkilendirir. @tr

has digital representation of cartographic content
status: Published
definition: Relates a resource to a set of technical details relating to an encoding of geospatial information in a cartographic resource.
type: Property
sub property of: has digital file characteristic
lexical alias: digitalRepresentationOfCartographicContent.en
label: har digital repræsentation af kartografisk indhold @da
definition: Relaterer en ressource til et sæt af tekniske detaljer relateret til kodning af geospatiale oplysningerer i en kartografisk ressource. @da
label: heeft digitale representatie van cartografische content @nl
label: kartografisen sisällön digitaalinen esitysmuoto @fi
label: له تمثيل رقمي للمحتوى الجغرافي @ar
definition: يربط بين مصدر ومجموعة تفاصيل فنية مرتبطة بمعلومات الترميز الجغرافي في مصدر خرائطي @ar
definition: Liittää aineiston aineiston maantieteellisen paikkatiedon koodaamisen tekniseen tietoon. @fi
label: hat digitale Darstellung von kartografischem Inhalt @de
definition: Setzt eine Ressource in Beziehung zu einem Satz von technischen Angaben, die sich auf die Kodierung von Geoinformationen in einer kartografischen Ressource beziehen. @de
label: 有地图内容的数字表现 @zh-hans
definition: 将一种资源与和一种地图资源中地理空间信息编码相关的技术细节的集合关联起来。 @zh-hans
label: kartográfiai tartalom digitális ábrázolása a következő: @hu
definition: Hozzákapcsol egy forrást technikai részletek egy halmazához, amely kapcsolódik a térinformatikai információk kódolásához egy kartográfiai forrásban. @hu
has subproperty: has cartographic data type
label: kartografik içeriğin dijital temsili ile ilişkilidir @tr
definition: Bir kaynağı, bir kartografik kaynaktaki jeo-uzamsal bilgilerin kodlanmasıyla ilgili bir dizi teknik ayrıntıyla ilişkilendirir. @tr

has digital transfer
status: Published
definition: Relates a resource to a resource in a digital format that results from a transfer of a resource in another digital format.
type: Property
sub property of: is reproduced as
inverse of: is digital transfer of
lexical alias: digitalTransfer.en
label: har digital overførsel @da
definition: Relaterer en ressource til en ressource i et digitalt format, der er resultatet af en overførsel af en ressource i et andet digitalt format. @da
label: heeft digitale kopie @nl
label: konvertoinnin tulos (aineisto) @fi
label: له تحويل رقمي @ar
definition: يربط بين مصدر ومصدر فى صيغة رقمية نتج عن تحويل مصدر إلى شكل رقمي آخَر. @ar
definition: Liittää aineiston digitaalisessa muodossa olevaan aineistoon, joka on tulos toisessa digitaalisessa muodossa olevan aineiston muunnoksesta. @fi
label: hat digitale Übertragung @de
definition: Setzt eine Ressource in Beziehung zu einer Ressource in einem digitalen Format, die durch die Übertragung einer Ressource in ein anderes digitales Format entsteht. @de
label: 有数字转储 @zh-hans
definition: 将一种资源与从另一种数字格式的资源转储为一种数字格式而形成的资源关联起来。 @zh-hans
label: digitális átvitele a következő: @hu
definition: Hozzákapcsol egy forrást egy digitális formátumú forráshoz, amely egy másik digitális formátumú forrás átviteléből származik. @hu
label: dijital aktarım ile ilişkilidir @tr
definition: Bir kaynağı, başka bir dijital formattaki bir kaynağın aktarılmasından kaynaklanan dijital formattaki kaynakla ilişkilendirir @tr

is digital transfer of
status: Published
definition: Relates a resource to a resource in a digital format that is transferred to another digital format.
type: Property
sub property of: is reproduction of
inverse of: has digital transfer
lexical alias: digitalTransferOf.en
label: er digital overførsel af @da
definition: Relaterer en ressource til en ressource i et digitalt format, der er overført til et andet digitalt format. @da
label: is digitale kopie van @nl
label: konvertoitava aineisto @fi
label: هو تحويل رقمي لـ @ar
definition: يربط بين مصدر ومصدر في صيغة رقمية تم تحويله لشكل رقمي آخر. @ar
definition: Liittää aineiston digitaalisessa muodossa olevaan aineistoon, joka muunnetaan toiseen digitaaliseen muotoon. @fi
label: ist digitale Übertragung von @de
definition: Setzt eine Ressource in Beziehung zu einer Ressource in einem digitalen Format, die in ein anderes digitales Format übertragen wird. @de
label: 是……的数字转储 @zh-hans
definition: 将一种资源与被转储为另一种数字格式的一种数字格式的一种资源关联起来。 @zh-hans
label: digitális átvitele a következőnek: @hu
definition: Hozzákapcsol egy forrást egy digitális formátumú forráshoz, amelyet egy másik digitális formátumra vittek át. @hu
label: dijital aktarımıdır @tr
definition: Bir kaynağı, başka bir dijital formata aktarılan dijital formattaki bir kaynakla ilişkilendirir. @tr

has dimensions
status: Published
definition: Relates a resource to a measurement of a carrier or a container of a resource.
type: Property
lexical alias: dimensions.en
label: har størrelse @da
definition: Relaterer en ressource til et mål for en ressources bærer eller dens opbevaringsudstyr. @da
label: heeft afmetingen @nl
label: له أبعاد @ar
definition: يربط بين مصدر ومقاييس حامل أو حاوية خاصة بمصدر. @ar
label: aineiston koko @fi
definition: Liittää aineiston tallenteen tai säilytyskotelon mittoihin. @fi
label: hat Maße @de
definition: Setzt eine Ressource in Beziehung zu einer Abmessung eines Datenträgers oder eines Behältnisses einer Ressource. @de
label: 有尺寸 @zh-hans
definition: 将一种资源与一种资源的载体或容器的测量值关联起来。 @zh-hans
label: mérete a következő: @hu
definition: Hozzákapcsol egy forrást egy forrás hordozójának vagy tárolójának méretéhez. @hu
has subproperty: has dimensions of cartographic image
has subproperty: has dimensions of still image
label: boyutlar ile ilişkilidir @tr
definition: Bir kaynağı, bir taşıyıcının veya kaynak deposunun ölçümüyle ilişkilendirir. @tr

has dimensions of cartographic image
status: Published
definition: Relates a resource to a measurement of a face of a map or cartographic diagram, view, profile, or section.
type: Property
sub property of: has dimensions
lexical alias: dimensionsOfCartographicImage.en
label: har størrelse på kort etc. - kartografi @da
definition: Relaterer en ressource til et mål for en billedside af et kort etc. @da
label: heeft afmetingen van cartografisch beeld @nl
label: له أبعاد لصور خرائطية @ar
definition: يربط بين مصدر ومقاييس الوجه الخاص بخريطة، إلخ. @ar
label: kartografisen kuvan koko aineistossa @fi
definition: Liittää aineiston kartan tai muun vastaavan aineiston kuvapuolen mittoihin. @fi
label: hat Maße eines kartografischen Bilds @de
definition: Setzt eine Ressource in Beziehung zu einer Abmessung eines Kartenfelds und so weiter. @de
label: 有地图图像的尺寸 @zh-hans
definition: 将一种资源与地图的一面或地图线图、透视图或截面图的测量值关联起来。 @zh-hans
label: kartográfiai kép mérete a következő: @hu
definition: Hozzákapcsol egy forrást egy térképtükör, stb. méretéhez. @hu
label: kartografik görüntü boyutları ile ilişkilidir @tr
definition: Bir kaynağı haritanın bir yüzünün ölçümü vb. ile ilişkilendirir. @tr

has dimensions of still image
status: Published
definition: Relates a resource to a measurement of the pictorial area of a still image.
type: Property
sub property of: has dimensions
lexical alias: dimensionsOfStillImage.en
label: har størrelse på fast billede @da
definition: Relaterer en ressource til et mål for et fast billedes billedområde. @da
label: heeft afmetingen van stilstaand beeld @nl
label: له أبعاد الصورة الثابتة @ar
definition: يربط بين مصدر ومقاييس المساحة المصورة في صورة ثابتة. @ar
label: stillkuvan koko aineistossa @fi
definition: Liittää aineiston stillkuvan kuva-alueen mittoihin. @fi
label: hat Maße eines unbewegten Bilds @de
definition: Setzt eine Ressource in Beziehung zu einer Abmessung der Bildfläche eines unbewegten Bilds. @de
label: 有静态图像的尺寸 @zh-hans
definition: 将一种资源与一个静态图像的图画区域的测量值关联起来。 @zh-hans
label: állókép mérete a következő: @hu
definition: Hozzákapcsol egy forrást egy állókép képterületének a méretéhez. @hu
label: durağan görüntü boyutları ile ilişkilidir @tr
definition: Bir kaynağı, hareketsiz bir görüntünün resimsel alanının ölçümüyle ilişkilendirir. @tr

has director
status: Published
definition: Relates a resource to an agent who is responsible for the general management and supervision of a filmed performance, a radio or television program, etc.
type: Property
sub property of: has other agent associated with resource (Deprecated)
inverse of: has director of photography
lexical alias: director.en
label: har instruktør @da
definition: Relaterer en ressource til en agent, der er ansvarlig for ledelse af og tilsyn med en filmoptagelse, et radio- eller tv-program etc. @da
label: heeft regisseur @nl
label: aineiston ohjaaja @fi
label: له مخرج @ar
definition: يربط مصدر بوكيل مسؤولا عن الإدارة العامة والإشراف على أداء فيلم، برنامج إذاعي أو برنامج تلفزيوني، إلخ. @ar
definition: Liittää aineiston toimijaan, joka vastaa elokuvaesityksen, radio- tai televisio-ohjelman tms. yleisestä johtamisesta. @fi
label: hat Regisseurin/Regisseur @de
definition: Setzt eine Ressource in Beziehung zu einem Akteur, der für das allgemeine Management und die Leitung einer verfilmten Darbietung, einer Hörfunk- oder Fernsehsendung und so weiter verantwortlich ist. @de
label: 有导演 @zh-hans
definition: 将一种资源与负责电影表演、广播或电视节目等的全面管理和监督的一个行为者关联起来。 @zh-hans
label: rendezője a következő: @hu
definition: Hozzákapcsol egy forrást egy ágenshez, amely felelős egy filmre vett előadás, egy rádió- vagy televízióműsor stb. általános irányításáért és felügyeletéért. @hu
has subproperty: has film director
has subproperty: has radio director
has subproperty: has television director
label: yönetmen ile ilişkilidir @tr
definition: Bir kaynağı, filme alınmış bir performansın, bir radyo veya televizyon programının vb. genel yönetimi ve denetiminden sorumlu olan bir temsilci ile ilişkilendirir. @tr

is director of
status: Published
definition: Relates an agent to a resource that involves a responsibility of an agent for the general management and supervision of a filmed performance, a radio or television program, etc.
type: Property
sub property of: is other agent associated with resource of (Deprecated)
inverse of: has director
lexical alias: directorOf.en
label: er instruktør til @da
definition: Relaterer en agent der er ansvarlig for ledelse af og tilsyn med en filmoptagelse, et radio- eller tv-program etc. til en ressource. @da
label: is regisseur van @nl
label: هو مخرج لـ @ar
definition: يربط بين وكيل ومصدر ينطوي على مسؤولية وكيل عن الإدارة العامة والإشراف على أداء فيلم، برنامج إذاعي أو برنامج تلفزيوني، إلخ. @ar
label: ohjaaja (toimija) aineistossa @fi
definition: Liittää toimijan aineistoon, jossa toimija vastaa a elokuvaesityksen, radio- tai televisio-ohjelman tms. yleisestä johtamisesta. @fi
label: ist Regisseurin/Regisseur von @de
definition: Setzt einen Akteur in Beziehung zu einer Ressource, bei der ein Akteur für das allgemeine Management und die Leitung einer verfilmten Darbietung, einer Hörfunk- oder Fernsehsendung und so weiter verantwortlich ist. @de
label: 是……的导演 @zh-hans
definition: 将一个行为者与涉及电影表演、广播或电视节目等的全面管理和监督的一个行为者的责任的一种资源关联起来。 @zh-hans
label: rendezője a következőnek: @hu
definition: Hozzákapcsol egy ágenst egy forráshoz, amelyhez hozzátartozik az ágens felelőssége egy filmforgatás, egy rádió- vagy televízióműsor, stb. általános menedzseléséért és felügyeletéért. @hu
has subproperty: is film director of
has subproperty: is radio director of
has subproperty: is television director of
label: yönetmenidir @tr
definition: Bir temsilciyi, filme alınmış bir performansın, bir radyo veya televizyon programının vb. genel yönetimi ve denetiminden sorumlu bir temsilcinin sorumluluğunu içeren bir kaynakla ilişkilendirir. @tr

has director of photography
status: Published
definition: Relates a resource to an agent who captures images, either electronically or on film or video stock, and often selects and arranges lighting.
type: Property
sub property of: has other agent associated with resource (Deprecated)
inverse of: is director of photography of
lexical alias: directorOfPhotography.en
label: er filmfotograf til @da
definition: Relaterer en ressource til en agent, der optager billeder, enten elektronisk eller på film eller video og ofte vælger og arrangerer lyssætning. @da
scope note: En filmfotograf kaldes også for cheffotograf. @da
label: heeft cameraregisseur @nl
label: له مدير تصوير @ar
definition: يربط بين مصد ووكيل يلتقط الصور، إما إلكترونيًا أو في فيلم أو فيديو، وغالبًا ما يكون مسئولا عن اختيار الإضاءة وتوزيعها. @ar
label: aineiston kuvaaja @fi
definition: Liittää toimijan aineistoon, jossa hän vastaa kuvien tallentamisesta joko sähköisesti tai filmille tai videolle, usein myös valaistuksen valitsemisesta ja järjestämisestä. @fi
label: hat Kamerafrau/Kameramann @de
definition: Setzt eine Ressource in Beziehung zu einem Akteur, der Bilder aufzeichnet, entweder elektronisch oder auf Film- oder Videomaterial, und häufig Belichtung auswählt und arrangiert. @de
label: 有摄影指导 @zh-hans
definition: 将一种资源与通过电子、胶片或视频存储方式摄录影像、且经常负责灯光的选择和布置的一个行为者关联起来。 @zh-hans
label: operatőre a következő: @hu
definition: Hozzákapcsol egy forrást egy ágenshez, amely elektronikusan, filmen vagy videóállományon képeket rögzít, és gyakran kiválasztja és elrendezi a megvilágítást. @hu
label: görüntü yönetmeni ile ilişkilidir @tr
definition: Bir kaynağı, elektronik olarak veya film veya stok video üzerinde görüntü kaydeden ve genellikle aydınlatmayı seçip düzenleyen bir temsilci ile ilişkilendirir. @tr

is director of photography of
status: Published
definition: Relates an agent to a resource that involves a responsibility of an agent for capturing images, either electronically or on film or video stock, and often selecting and arranging the lighting.
type: Property
sub property of: is other agent associated with resource of (Deprecated)
inverse of: has director of photography
lexical alias: directorOfPhotographyOf.en
label: er filmfotograf til @da
definition: Relaterer en agent, der optager billeder, enten elektronisk eller på film eller video og ofte vælger og arrangerer lyssætning. @da
label: is cameraregisseur van @nl
label: هو مدير التصوير الفوتوغرافي لـ @ar
definition: يربط بين وكيل ومصدر ينطوي على مسؤولية وكيل عن التقاط الصور، إما إلكترونيًا أو في فيلم أو فيديو، وغالبا ما يكون مسئولا عن اختيار الإضاءة وتوزيعها. @ar
label: kuvaaja (toimija) aineistossa @fi
definition: n vastaa kuvien tallentamisesta joko sähköisesti tai filmille tai videolle, usein myös valaistuksen valitsemisesta ja järjestämisestä. @fi
label: ist Kamerafrau/Kameramann von @de
definition: Setzt einen Akteur in Beziehung zu einer Ressource, bei der ein Akteur für die Aufzeichnung von Bildern, entweder elektronisch oder auf Film- oder Videomaterial, verantwortlich ist und häufig die Belichtung auswählt und arrangiert. @de
label: 是……的摄影指导 @zh-hans
definition: 将一个行为者与涉及通过电子、胶片或视频存储方式摄录影像、且经常负责灯光的选择和布置的一个行为者的责任的一种资源关联起来。 @zh-hans
label: operatőre a következőnek: @hu
definition: Hozzákapcsol egy ágenst egy forráshoz, amelyhez hozzátartozik az ágens felelőssége képek elektronikusan, filmen vagy videoállományon történő rögzítéséért, gyakran a világítás kiválasztásáért és elrendezéséért is. @hu
definition: Relaciona un agent amb un recurs que inclou una responsabilitat d’un agent en la captura d’imatges, ja sigui electrònicament o sobre pel·lícula o vídeo, i que sovint selecciona i organitza la il·luminació. @ca
label: görüntü yönetmenidir @tr
definition: Bir temsilciyi, elektronik olarak veya film veya video stoğundaki görüntülerin yakalanması ve genellikle aydınlatmanın seçilmesi ve düzenlenmesi için bir aracının sorumluluğunu içeren bir kaynakla ilişkilendirir. @tr

has dissertation or thesis information
status: Published
definition: Relates a resource to a statement that identifies an academic institution, degree, and year for which a resource was presented.
type: Property
lexical alias: dissertationOrThesisInformation.en
label: har afhandlings- eller specialeoplysninger @da
definition: Relaterer en ressource til en oplysning der identificerer en akademisk institution, en akademisk grad og året hvor ressourcen blev forsvaret. @da
label: heeft dissertatie- of these-informatie @nl
label: له معلومات عن رسالة جامعية دكتوراه أو ماجستير @ar
definition: يربط بين مصدر وبيان يحدد المؤسسة الأكاديمية، والدرجة العلمية، والسَنة التي قُدم فيها المصدر. @ar
label: väitöskirjan tai opinnäytteen tiedot @fi
definition: Liittää aineiston merkintöön akateemisesta instituutiosta, tutkinnosta ja aineiston vuodesta. @fi
label: hat Hochschulschriftenvermerk @de
definition: Setzt eine Ressource in Beziehung zu einer Angabe, die eine akademische Institution, einen Grad oder ein Jahr, in dem eine Arbeit präsentiert wurde, bezeichnet. @de
label: 有学位论文信息 @zh-hans
definition: 将一种资源与标识一种资源被提交的学术机构、学位和年份的说明关联起来。 @zh-hans
label: disszertációja/tézisinformációja a következő: @hu
definition: Hozzákapcsol egy forrást egy közléshez, amely azonosítja egy forrás kapcsolódó tudományos intézményét, fokozatát és az évet amelyben bemutatták. @hu
label: tez bilgisi ile ilişkilidir @tr
definition: Bir kaynağı, bir kaynağın sunulduğu akademik kurumu, dereceyi ve yılı tanımlayan bir bildirim ile ilişkilendirir. @tr

has distribution statement
status: Published
definition: Relates a resource to a statement that identifies a place of distribution, a distributor, or a date of distribution of a published resource.
type: Property
lexical alias: distributionStatement.en
label: har distributionsbeskrivelse @da
definition: Relaterer en ressource til oplysninger, der identificerer distributionssted, distributør, eller et dato for distribution af en ressource i publiceret form. @da
label: heeft distributievermelding @nl
label: aineiston jakelumerkintö @fi
label: له بيان توزيع @ar
definition: يربط بين مصدر وبيان يحدد مكان توزيع، موزع، أو تاريخ توزيع خاص بمصدر منشور. @ar
definition: Liittää aineiston merkintöön, joka identifioi julkaistun aineiston jakelupaikan, jakelijan tai jakeluajan. @fi
label: hat Vertriebsangabe @de
definition: Setzt eine Ressource in Beziehung zu einer Angabe, die einen Vertriebsort, einen Vertrieb oder ein Vertriebsdatum einer veröffentlichten Ressource identifiziert. @de
label: 有发行说明 @zh-hans
definition: 将一种资源与标识一种出版资源的发行地、发行者或发行日期的一个说明关联起来。 @zh-hans
label: terjesztési közlése a következő: @hu
definition: Hozzákapcsol egy forrást egy közléshez, amely azonosítja egy kiadott forrás terjesztési helyét, terjesztőjét, terjesztési időpontját. @hu
label: dağıtım bildirimi ile ilişkilidir @tr
definition: Bir kaynağı, yayınlanmış bir kaynağın dağıtım yerini, dağıtımcısını veya dağıtım tarihini tanımlayan bir bildirim ile ilişkilendirir. @tr

has distributor
status: Published
definition: Relates a resource to an agent who is responsible for distributing a published resource.
type: Property
inverse of: is distributor of
lexical alias: distributor.en
label: har distributør @da
definition: Relaterer en ressource til en agent, der er ansvarlig for distribution af en ressource. @da
label: heeft distributeur @nl
label: aineiston jakelija @fi
label: له موزع @ar
definition: يربط مصدر بوكيل مسؤول عن توزيع مصدر منشور. @ar
definition: Liittää aineiston toimijaan, joka vastaa julkaistun aineiston jakelusta. @fi
label: hat Vertrieb @de
definition: Setzt eine Ressource in Beziehung zu einem Akteur, der für den Vertrieb einer Ressource verantwortlich ist. @de
label: 有发行者 @zh-hans
definition: 将一种资源与负责发行一种出版资源的一个行为者关联起来。 @zh-hans
label: terjesztője a következő: @hu
definition: Hozzákapcsol egy forrást egy ágenshez, amely felelős egy publikált forrás megalkotásáért. @hu
has subproperty: has film distributor
label: dağıtımcı ile ilişkilidir @tr
definition: Bir kaynağı, yayınlanmış bir kaynağın dağıtımından sorumlu olan bir temsilci ile ilişkilendirir. @tr

is distributor of
status: Published
definition: Relates an agent to a resource that involves a responsibility of an agent for distribution.
type: Property
inverse of: has distributor
lexical alias: distributorOf.en
label: er distributør af @da
definition: Relaterer en agent der er ansvarlig for distribution af en manifestation til en ressource. @da
label: is distributeur van @nl
label: هو مُوزع لـ @ar
definition: يربط بين وكيل ومصدر ينطوي على مسؤولية وكيل عن التوزيع. @ar
label: jakelija (toimija) aineistossa @fi
definition: Liittää toimijan aineistoon, jossa toimija vastaa julkaistun aineiston jakelusta. @fi
label: ist Vertrieb von @de
definition: Setzt einen Akteur in Beziehung zu einer Ressource, bei der ein Akteur für den Vertrieb verantwortlich ist. @de
label: 是……的发行者 @zh-hans
definition: 将一个行为者与涉及发行的一个行为者的责任的一种资源关联起来。 @zh-hans
label: terjesztője a következőnek: @hu
definition: Hozzákapcsol egy ágenst egy forráshoz, amelyhez hozzátartozik az ágens felelőssége a terjesztésért. @hu
has subproperty: is film distributor of
label: dağıtımcısıdır @tr
definition: Bir temsilciyi, dağıtımla görevli bir temsilcinin sorumluluğunu içeren bir kaynakla ilişkilendirir @tr

has DJ
status: Published
type: Property
lexical alias: DJ.en
definition: Relates a resource to an agent who contributes to a resource by mixing recorded tracks together during a live performance or in a recording studio to appear as one continuous track.
scope note: Remixing activities that substantially change the nature and content of the original resource, resulting in a new resource, and mixing and assembling the multiple tracks of a recording are excluded.
inverse of: is DJ of
sub property of: has contributor (Deprecated)
see also: has mixing engineer
label: har dj @da
definition: Relaterer en ressource til en agent, der mixer indspillede spor sammen under en live optræden eller i et indspilningsstudie så de fremstår som et uafbrudt spor. @da
scope note: Remixing-aktiviteter der væsentligt forandrer originalressourcens karakter og indhold og derved resulterer i en ny ressource samt mixing og sammensætning af de forskellige spor på en optagelse, er ikke omfattet. @da
label: heeft deejay @nl
label: له منسق دي جي @ar
definition: يربط مصدر بوكيل يمزج ألحان مسجلة أثناء أدائها مباشرة أو أثناء تسجيلها في استوديو لتبدو كمسار واحد مستمر. @ar
scope note: تُستبعد أنشطة إعادة المزج التي تغير بشكل جوهري طبيعة ومحتوى المصدر الأصلي، إلى حد ينتج معه مصدر جديد، ومزج وتجميع المسارات المتعددة للتسجيل. @ar
label: DJ aineistossa @fi
label: hat DJ @de
definition: Setzt eine Ressource in Beziehung zu einem Akteur, der während eines Live-Auftritts oder in einem Aufnahme-Studio aufgenommene Einzelspuren (Kanäle) zu einem scheinbar ununterbrochen durchgehenden Klangerlebnis zusammen mischt. @de
scope note: Darunter fallen keine Nachbearbeitungen, die die Art und den Inhalt der Originalressource substantiell verändern, so dass eine neue Ressource entsteht, sowie das Mischen und Zusammenlegen von mehreren Einzelspuren einer Aufnahme. @de
definition: Liittää aineiston toimijaan, joka osallistuu aineiston tekemiseen miksaamalla ääniraitoja yhteen yhtäjaksoiseksi raidaksi live-esityksessä tai äänitysstudiossa. @fi
scope note: Ei koske uudelleenmiksauksia, jotka olennaisesti muuttavat alkuperäisen aineiston luonnetta ja sisältöä johtaen uuteen aineistoon, eikä äänitteen useampien raitojen miksaamista ja yhdistelyä. @fi
label: 有打碟者 @zh-hans
definition: 将一种资源与通过在现场表演中或在录音工作室中混合已录制音轨使其出现为一个连续的音轨而对一种资源作出贡献的一个行为者关联起来。 @zh-hans
scope note: 不包括实质性改变原资源的性质和内容导致一种新的资源以及混合和聚集一个录音的多个音轨的合成活动。 @zh-hans
definition: Relaciona un recurs amb un agent que contribueix a un recurs mesclant pistes enregistrades conjuntament durant una actuació en directe o en un estudi de gravació perquè sembli una pista continua. @ca
label: DJ-je a következő: @hu
definition: Hozzákapcsol egy forrást egy ágenshez, amely hozzájárul egy forráshoz azzal, hogy felvett hangsávokat kever élő előadás közben vagy egy hangstúdióban, hogy azok folyamatos műsorszámként jelenjenek meg. @hu
scope note: Nem tartoznak ide azok az új forrást eredményező újrakeverési tevékenységek, amelyek jelentősen megváltoztatják az eredeti forrás jellegét és tartalmát, sem a felvétel több sávjának keverése és összeállítása. @hu
label: DJ ile ilişkilidir @tr
definition: Bir kaynağı, canlı bir performans sırasında veya bir kayıt stüdyosunda kaydedilmiş parçaları kesintisiz bir parça olarak görünecek şekilde karıştıran bir temsilci ile ilişkilendirir. @tr
scope note: Orijinal kaynağın niteliğini ve içeriğini önemli ölçüde değiştirerek yeni bir kaynakla sonuçlanan remiks faaliyetleri ve bir kaydın birden çok parçasını karıştırma ve bir araya getirme faaliyetleri hariçtir. @tr

is DJ of
status: Published
type: Property
lexical alias: DJOf.en
definition: Relates an agent to a resource that includes a contribution by an agent of mixing recorded tracks together during a live performance or in a recording studio to appear as one continuous track.
scope note: Remixing activities that substantially change the nature and content of the original resource, resulting in a new resource, and mixing and assembling the multiple tracks of a recording are excluded.
inverse of: has DJ
sub property of: has other agent associated with a resource (Deprecated)
see also: is mixing engineer of
label: er dj i @da
definition: Relaterer en agent til en ressource, der inkorporerer et bidrag ved at mikse indspillede spor sammen under en live-optræden eller i et indspilningsstudie så at de fremstår som et uafbrudt spor. @da
scope note: Remixingaktiviteter der fortrinsvis ændrer natur og indhold på en oprindelig ressource og derved resulterer i en ny ressource og mixe og samle in indspillings forskellige spor, er ikke omfattet. @da
label: is deejay van @nl
label: هو منسق دي جي لـ @ar
definition: يربط بين وكيل ومصدر يتضمن إسهام وكيل في مزج ألحان مسجلة أثناء أدائها مباشرة أو أثناء تسجيلها في استوديو لتبدو كمسار واحد مستمر. @ar
scope note: تُستبعد أنشطة إعادة المزج التي تغير بشكل جوهري طبيعة ومحتوى المصدر الأصلي، إلى حد ينتج معه مصدر جديد، ومزج وتجميع المسارات المتعددة للتسجيل. @ar
label: DJ (toimija) @fi
definition: Liittää toimijan aineistoon, jossa toimija on osallisena miksaamalla ääniraitoja yhteen yhtäjaksoiseksi raidaksi live-esityksessä tai äänitysstudiossa. @fi
scope note: Ei koske uudelleenmiksauksia, jotka olennaisesti muuttavat alkuperäisen aineiston luonnetta ja sisältöä, mikä johtaa uuteen aineistoon. Ei koske useiden raitojen miksaamista ja kokoamista. @fi
label: ist DJ von @de
definition: Setzt einen Akteur in Beziehung zu einer Ressource, zu der ein Akteur beiträgt, indem er während eines Live-Auftritts oder in einem Aufnahme-Studio aufgenommene Einzelspuren (Kanäle) zu einem scheinbar ununterbrochen durchgehenden Klangerlebnis zusammen mischt. @de
scope note: Darunter fallen keine Nachbearbeitungen, die die Art und den Inhalt der Originalressource substantiell verändern, so dass eine neue Ressource entsteht, sowie das Mischen und Zusammenlegen von mehreren Einzelspuren einer Aufnahme. @de
label: 是……的打碟者 @zh-hans
definition: 将一个行为者与包括在现场表演中或在录音工作室中混合已录制音轨使其出现为一个连续的音轨的一个行为者的贡献的一种资源关联起来。 @zh-hans
scope note: 不包括实质性改变原资源的性质和内容导致一种新的资源以及混合和聚集一个录音的多个音轨的合成活动。 @zh-hans
label: DJ-je a következőnek: @hu
definition: Hozzákapcsol egy ágenst egy forráshoz, amely magában foglalja az ágens közreműködését felvett hangsávok élő előadás közben vagy egy hangstúdióban történő keverésében, hogy azok egy folyamatos műsorszámként jelenjenek meg. @hu
scope note: Nem tartoznak ide azok az új forrást eredményező újrakeverési tevékenységek, amelyek jelentősen megváltoztatják az eredeti forrás jellegét és tartalmát, sem a felvétel több sávjának keverése és összeállítása. @hu
label: DJ'idir @tr
definition: Bir temsilciyi, canlı bir performans sırasında veya bir kayıt stüdyosunda kesintisiz bir parça olarak görünmek üzere kaydedilmiş parçaları karıştıran temsilcinin katkısını içeren bir kaynakla ilişkilendirir. @tr
scope note: Orijinal kaynağın niteliğini ve içeriğini önemli ölçüde değiştirerek yeni bir kaynakla sonuçlanan remiks faaliyetleri ve bir kaydın birden çok parçasını karıştırma ve bir araya getirme faaliyetleri hariçtir. @tr

has donor
status: Published
definition: Relates a resource to an agent who is a former owner of a resource who donates the resource to another owner.
type: Property
sub property of: has former owner
inverse of: is donor of
lexical alias: donor.en
label: har donor @da
definition: Relaterer en ressource til en tidligere ejer af en ressource, der har doneret denne ressource til en anden ejer. @da
label: heeft schenker @nl
label: aineiston lahjoittaja @fi
label: له متبرع @ar
definition: يربط بين مصدر ومالك سابق لمصدر قام بالتبرع بهذا المصدر إلى مالك آخر. @ar
definition: Liittää aineiston aiempaan omistajaan, joka on lahjoittanut aineiston toiselle omistajalle. @fi
label: hat Stifterin/Stifter @de
definition: Setzt eine Ressource in Beziehung zu einer früheren Eigentümerin/einem früheren Eigentümer einer Ressource, die/der die Ressource einer anderen Eigentümerin/einem anderen Eigentümer überlässt. @de
label: 有捐赠者 @zh-hans
definition: 将一种资源与作为先前拥有者将资源捐赠给另一个拥有者的一个行为者关联起来。 @zh-hans
definition: Relaciona un recurs amb un agent que és un antic propietari d’un recurs que dona el recurs a un altre propietari. @ca
label: adományozója a következő: @hu
definition: Hozzákapcsol egy forrást egy forrás korábbi tulajdonosához, amely a forrást egy másik tulajdonosnak adományozta. @hu
label: bağışçı ile ilişkilidir @tr
definition: Bir kaynağı, kaynağı başka bir sahibe bağışlamış olan kaynağın eski sahibiyle ilişkilendirir. @tr

is donor of
status: Published
definition: Relates an agent to a resource donated to another owner.
type: Property
sub property of: is former owner of
inverse of: has donor
lexical alias: donorOf.en
label: donor af @da
definition: Relaterer en tidligere ejer af en ressource, der donerede den ressource til en anden ejer til en ressource. @da
label: is schenker van @nl
label: aineiston lahjoittaja (toimija) @fi
label: هو مانح لـ @ar
definition: يربط بين وكيل ومصدر تم التبرع به إلى مالك آخَر. @ar
definition: ittää toimijan aineistoon, jonka toimija on lahjoittanut toiselle omistajalle. @fi
label: ist Stifterin/Stifter von @de
definition: Setzt einen Akteur in Beziehung zu einer Ressource, die einer anderen Eigentümerin/einem anderen Eigentümer überlassen wurde. @de
label: 是……的捐赠者 @zh-hans
definition: 将一个行为者与被捐赠给另一个拥有者的一种资源关联起来。 @zh-hans
label: adományozója a következőnek: @hu
definition: Hozzákapcsol egy ágenst egy forráshoz, amelyet egy másik tulajdonosnak adományoznak. @hu
label: bağışçısıdır @tr
definition: Bir temsilciyi, başka bir sahibine bağışlanan bir kaynakla ilişkilendirir. @tr

has draftsman
status: Published
definition: Relates a resource to an agent who contributes to a resource by an architect, inventor, or other agent by making detailed plans or drawings for buildings, ships, aircraft, machines, objects, or other constructions.
type: Property
sub property of: has contributor (Deprecated)
inverse of: is draftsman of
lexical alias: draftsman.en
label: har teknisk tegner @da
definition: Relaterer en ressource til en agent, der har bidraget til en ressource af et værk af en arkitekt, opfinder etc. ved at lave detaljerede planer eller tegninger til bygninger, skibe, luftfartøjer, maskiner, genstande etc. @da
label: heeft technisch tekenaar @nl
label: aineiston piirtäjä @fi
label: له رسام هندسي @ar
definition: يربط مصدر بوكيل يُساهم في مصدر بواسطة مهندس معماري أو مخترع أو وكيل آخر من خلال وضع خطط أو رسومات مُفصلة للمباني، السفن، الطائرات، الآلات أو الأشياء أو غيرها من الإنشاءات. @ar
label: hat Technische Zeichnerin/Technischen Zeichner @de
definition: Setzt eine Ressource in Beziehung zu einem Akteur, der zu einer Expression einer Architektin/eines Architekten, einer Erfinderin/eines Erfinders oder eines anderen Akteurs beiträgt, indem er detaillierte Pläne oder Zeichnungen für Gebäude, Schiffe, Flugzeuge, Maschinen, Objekte oder andere Konstruktionen anfertigt. @de
definition: Liittää aineiston toimijaan, joka osallistuu arkkitehdin, suunnittelijan tai muun toimijan aineistoon tuottamalla tarkkoja suunnitelmia tai piirroksia rakennuksista, laivoista, lentokoneista, laitteista, esineistä tai muista luomuksista. @fi
label: 有绘图者 @zh-hans
definition: 将一种资源与通过由建筑师、发明者或其他行为者为建筑物、船舶、飞行器、机器、物体或其他结构制作详细平面图或绘制草图而对一种资源有贡献的一个行为者关联起来。 @zh-hans
label: műszaki rajzolója a következő: @hu
definition: Hozzákapcsol egy forrást egy ágenshez, amely hozzájárul egy építész, feltaláló vagy egyéb ágens által létrehozott forráshoz azzal, hogy elkészíti épületek, hajók, repülőgépek, gépek, objektumok vagy egyéb konstrukciók részletes terveit vagy rajzait. @hu
label: teknik ressam ile ilişkilidir @tr
definition: Bir kaynağı, binalar, gemiler, uçaklar, makineler, nesneler veya diğer yapılar için ayrıntılı planlar veya çizimler yaparak bir mimar, mucit veya başka bir temsilci tarafından bir kaynağa katkıda bulunan bir temsilci ile ilişkilendirir. @tr

is draftsman of
status: Published
definition: Relates an agent to a resource that includes a contribution by an agent of making detailed plans or drawings for buildings, ships, aircraft, machines, objects, etc.
type: Property
sub property of: is contributor of (Deprecated)
inverse of: has draftsman
lexical alias: draftsmanOf.en
label: er teknisk tegner af @da
definition: Relaterer en agent, der har bidraget til en ressource af en arkitekt, opfinder etc. ved at lave detaljerede planer eller tegninger til bygninger, skibe, luftfartøjer, maskiner, genstande etc. til en ressource. @da
label: is technisch tekenaar van @nl
label: هو رسام هندسي لـ @ar
definition: يربط بين وكيل ومصدر يتضمن إسهام وكيل في وضع خطط أو رسومات مفصلة للمباني، السفن، الطائرات، الآلات، والأشياء، إلخ. @ar
label: piirtäjä (toimija) aineistossa @fi
definition: Liittää toimijan aineistoon, jossa toimija on osallisena tuottamalla tarkkoja suunnitelmia tai piirroksia rakennuksista, laivoista, lentokoneista, laitteista, esineistä tms. @fi
label: ist technische Zeichnerin/technischer Zeichner von @de
definition: Setzt einen Akteur in Beziehung zu einer Ressource, zu der ein Akteur beiträgt, indem er detaillierte Pläne oder Zeichnungen für Gebäude, Schiffe, Flugzeuge, Maschinen, Objekte oder ähnliches erstellt. @de
label: 是……的绘图者 @zh-hans
definition: 将一个行为者与包括为建筑物、船舶、飞行器、机械装置、物体等制作详细平面图或绘制草图的一个行为者的贡献的一种资源关联起来。 @zh-hans
label: műszaki rajzolója a következő: @hu
definition: Hozzákapcsol egy ágenst egy forráshoz, amely magában foglalja az ágens közreműködését épületek, hajók, repülőgépek, gépek, objektumok, stb. részletes terveinek vagy rajzainak elkészítésében. @hu
label: teknik ressamıdır @tr
definition: Bir temsilciyi, binalar, gemiler, uçaklar, makineler, nesneler vb. için ayrıntılı planlar veya çizimler yapan bir temsilcinin katkısını içeren bir kaynakla ilişkilendirir. @tr

is dramatization of
status: Published
definition: Relates a resource to a resource that is adapted as a drama.
type: Property
sub property of: is adaptation of
inverse of: is dramatized as
lexical alias: dramatizationOf.en
label: er dramatisering som @da
definition: Relaterer en ressource til en ressource, der er blevet bearbejdet som drama. @da
label: is dramatisering van @nl
label: dramatisointi aineistosta @fi
label: هو اقتباس مسرحي لـ @ar
definition: يربط بين مصدر ومصدر تم تحويره كمسرحية. @ar
definition: Liittää aineiston aineistoon, joka on sovitettu näytelmäksi. @fi
label: ist Bühnenbearbeitung von @de
definition: Setzt eine Ressource in Beziehung zu einer Ressource, die als Theaterstück bearbeitet ist. @de
label: 是……的戏剧化 @zh-hans
definition: 将一种资源与被改编为戏剧的一种资源关联起来。 @zh-hans
label: dramatizált feldolgozása a következőnek: @hu
definition: Hozzákapcsol egy forrást egy forráshoz, amelyet drámaként adaptáltak. @hu
label: dramatize edilmesidir @tr
definition: Bir kaynağı, dramaya uyarlanmış bir kaynakla ilişkilendirir. @tr

is dramatized as
status: Published
definition: Relates a resource to a dramatic resource adapted from another resource.
type: Property
sub property of: is adapted as
inverse of: is dramatization of
lexical alias: dramatizedAs.en
label: er dramatiseret som @da
definition: Relaterer en ressource til en dramatisk ressource bearbejdet ud fra en oprindelig ressource. @da
label: is gedramatiseerd als @nl
label: dramatisoitu aineisto @fi
label: هو معدل دراميًا كـ @ar
definition: يربط بين مصدر ومصدر درامي مقتبس من مصدر آخر. @ar
definition: Liittää aineiston toisesta aineistosta sovitettuun aineistoon. @fi
label: ist Bühnenbearbeitung als @de
definition: Setzt eine Ressource in Beziehung zu einer Theaterressource, die auf einer anderen Ressource basiert. @de
label: 被戏剧化为 @zh-hans
definition: 将一种资源与改编自另一种资源的一种戏剧资源关联起来。 @zh-hans
label: dramatizált feldolgozása a következőként: @hu
definition: Hozzákapcsol egy forrást egy drámai forráshoz, amelyet egy másik forrásból adaptáltak. @hu
label: olarak dramatize edilmiştir @tr
definition: Bir kaynağı, başka bir kaynaktan uyarlanan dramatik bir kaynakla ilişkilendirir. @tr

has dubbed version
status: Published
definition: Relates a resource to a moving image resource that translates spoken dialogue of another resource into a different language.
type: Property
sub property of: is translated as
inverse of: is dubbed version of
lexical alias: dubbedVersion.en
label: er synkroniseret version @da
definition: Relaterer en ressource til en ressource af et levende billedværk, der oversætter den originale ressources talte dialog til et andet sprog. @da
label: heeft nagesynchroniseerde versie @nl
label: dubatun version perusta @fi
label: له نسخة مدبلجة @ar
definition: يربط بين مصدر ومصدر لصورة متحركة يتم فيه ترجمة حوار منطوق لمصدر أصلي إلى لغة مختلفة. @ar
definition: Liittää aineiston elokuvateoksen aineistoon, jossa alkuperäisteoksen puhuttu dialogi on käännetty toiselle kielelle. @fi
label: ist Synchronfassung @de
definition: Setzt eine Ressource in Beziehung zu einer Bewegtbildressource, die die Dialoge der Originalressource in eine andere Sprache übersetzt. @de
label: 有配音版 @zh-hans
definition: 将一种资源与把另一种资源的口语对话翻译成另一种不同语言的一种动态图像资源关联起来。 @zh-hans
definition: Relaciona un recurs amb un recurs d’imatge en moviment que tradueix el diàleg parlat d’un altre recurs en una llengua diferent. @ca
label: szinkronizált verziója a következő: @hu
definition: Hozzákapcsol egy forrást egy mozgóképforráshoz, amely az eredeti forrás beszélt dialógusát egy másik nyelvre fordítja. @hu
label: dublajlı sürüm ile ilişkilidir @tr
definition: Bir kaynağı, başka kaynaktaki konuşma diyaloğunu farklı dile çeviren bir film kaynağı ile ilişkilendirir. @tr

is dubbed version of
status: Published
definition: Relates a resource to a moving image resource whose spoken dialogue is translated into a language different from another resource.
type: Property
sub property of: is translation of
inverse of: has dubbed version
lexical alias: dubbedVersionOf.en
label: er synkroniseret version af @da
definition: Relaterer et udtryk til en ressource af et levende billedværk, hvori den talte dialog er blevet oversat til et andet sprog end det, der er anvendt i den originale ressource. @da
label: is nagesynchroniseerde versie van @nl
label: aineiston dubattu versio @fi
label: هي نسخة مدبلجة من @ar
definition: يربط بين مصدر ومصدر لصورة متحركة يتم فيه ترجمة حوار منطوق إلى لغة مختلفة عن لغة المصدر الأصلي. @ar
definition: Liittää aineiston elokuva-aineistoon, jossa alkuperäisteoksen puhuttu dialogi on käännetty toiselle kielelle. @fi
label: ist Synchronfassung von @de
definition: Setzt eine Ressource in Beziehung zu einer Bewegtbildressource, in der die Dialoge in eine Sprache übersetzt wurden, die sich von der der Originalressource unterscheidet. @de
label: 是……的配音版 @zh-hans
definition: 将一种资源与其口语对话被翻译成和另一种资源不同语言的一种动态图像资源关联起来。 @zh-hans
definition: Relaciona un recurs amb un recurs d’imatge en moviment el diàleg parlat de la qual es tradueix a una llengua diferent d’un altre recurs. @ca
label: szinkronizált verziója a következőnek: @hu
definition: Hozzákapcsol egy forrást egy mozgóképforráshoz, amelyben a beszélt dialógus az eredeti forrás nyelvétől eltérő nyelvre van fordítva. @hu
label: dublajlı sürümüdür @tr
definition: Bir kaynağı, konuşma dili başka kaynaktaki dilden farklı bir dile çevrilen film kaynağı ile ilişkilendirir. @tr

has dubbing director
status: Published
type: Property
lexical alias: dubbingDirector.en
definition: Relates a resource to an agent who is responsible for the general management and supervision of the process of adding new dialogue or other sounds to complete a sound track for a resource
inverse of: is dubbing director of
sub property of: has contributor (Deprecated)
label: har dubbinginstruktør @da
definition: Relaterer en ressource til en agent, der er ansvarlig for den generelle ledelse og overvågning af processen med at tilføje ny dialog eller andre lyd for at fuldstændiggøre en ressources soundtrack. @da
label: heeft stemregisseur @nl
label: له مخرج الدبلجة @ar
definition: يربط مصدر بوكيل مسؤول عن الإدارة العامة والإشراف على عملية إضافة حوار جديد أو أصوات أخرى لإكمال مقطع صوتي لمصدر. @ar
label: dubbausohjaaja aineistossa @fi
definition: Liittää aineiston toimijaan, joka vastaa uuden dialogin tai muiden äänien lisäämisprosessin yleisessä johtamisessa ja valvonnassa aineiston ääniraidan täydentämiseksi. @fi
label: hat Synchronregisseurin/Synchronregisseur @de
definition: Setzt eine Ressource in Beziehung zu einem Akteur, der für das allgemeine Management und die Leitung beim Hinzufügen von neuem Dialog oder anderen Geräuschen verantwortlich ist, um die Tonspur einer Ressource zu vervollständigen. @de
label: 有混声导演 @zh-hans
definition: 将一种资源与对一种资源增加对话或其他声音以完成音轨的过程总体管理和监督负责的一个行为者关联起来。 @zh-hans
label: szinkronrendezője a következő: @hu
definition: Hozzákapcsol egy forrást egy ágenshez, amely felelős annak a folyamatnak az általános irányításáért és felügyeletéért, amelyben új dialógust vagy egyéb hangokat adnak hozzá egy forráshoz a hangsávja befejezése, teljessé tétele céljából. @hu
label: dublaj yönetmeni ile ilişkilidir @tr
definition: Bir kaynağı, bir kaynağın film müziğini tamamlamak için yeni diyalog veya başka sesleri ekleme sürecinin genel yönetiminden ve denetiminden sorumlu olan bir temsilci ile ilişkilendirir. @tr

is dubbing director of
status: Published
type: Property
lexical alias: dubbingDirectorOf.en
definition: Relates an agent to a resource that incorporates a contribution by an agent of an agent for the general management and supervision of the process of adding new dialogue or other sounds to complete a sound track.
inverse of: has dubbing director
sub property of: has other agent associated with a resource (Deprecated)
label: dubbinginstruktør @da
definition: Relaterer en agent til en ressource, der inkorporerer et bidrag af ansvar for generel ledelse og tilsyn af processen med at tilføje ny dialog eller andre lyde for at lave lydsporet komplet. @da
label: is stemregisseur van @nl
label: هو مخرج الدبلجة لـ @ar
definition: يربط بين وكيل ومصدر يتضمن إسهام وكيل في الإدارة العامة والإشراف على عملية إضافة حوار جديد أو أصوات أخرى لإكمال مقطع صوتي. @ar
label: dubbausohjaaja (toimija) aineistossa @fi
definition: Liittää toimijan aineistoon, jossa toimija on osallisena uuden dialogin tai muiden äänien lisäämisprosessin yleisessä johtamisessa ja valvonnassa aineiston ääniraidan täydentämiseksi. @fi
label: ist Synchronregisseurin/Synchronregisseur von @de
definition: Setzt einen Akteur in Beziehung zu einer Ressource, zu der ein Akteur beiträgt, indem er das allgemeine Management und die Leitung beim Hinzufügen von neuem Dialog oder anderen Geräuschen übernimmt, um die Tonspur zu vervollständigen. @de
label: 是……的混声导演 @zh-hans
definition: 将一个行为者与包括总体管理和监督增加对话或其他声音以完成音轨的一个责任的一个行为者的贡献的一种资源关联起来。 @zh-hans
label: szinkronrendezője a következőnek: @hu
definition: Hozzákapcsol egy ágenst egy forráshoz, amely magában foglalja egy ágens ágensének közreműködését új párbeszéd vagy más hangok hozzáadási folyamatának általános irányításában és felügyeletében egy hangsáv befejezése, teljessé tétele céljából. @hu
label: dublaj yönetmenidir @tr
definition: Bir temsilciyi, bir ses parçasını tamamlamak için yeni diyalog veya diğer seslerin eklenmesi sürecinin genel yönetimi ve denetimi için bir temsilcinin temsilcisinin katkısını içeren bir kaynakla ilişkilendirir. @tr

has duration
status: Published
definition: Relates a resource to an extent of resource that is a playing time, performance time, running time, or other length of time.
type: Property
lexical alias: duration.en
label: har spilletid @da
definition: Relaterer en ressource til varighed, spilletid, opførelsestid, etc. for en ressources indhold. @da
inverse of: is duration of (Deprecated)
label: heeft tijdsduur @nl
label: له مُدة @ar
definition: يربط بين مصدر ومدى مصدر يمثل وقت التشغيل، وقت الأداء، مدة العرض، أو فترة زمنية أخرى. @ar
label: aineiston kesto @fi
definition: Liittää aineiston aineiston laajuuteen, joka on soittoaika, esitysaika, toistoaika tai muu ajan pituus. @fi
label: hat Dauer @de
definition: Setzt eine Ressource in Beziehung zum Umfang einer Ressource, bei dem es sich um eine Wiedergabezeit, eine Aufführungszeit, eine Laufzeit oder eine andere Zeitspanne handelt. @de
label: 有持续时间 @zh-hans
definition: 将一种资源与作为播放时间、表演时间、运行时间或其他时间长度的资源的数量关联起来。 @zh-hans
label: időtartama a következő: @hu
definition: Hozzákapcsol egy forrást egy forrás terjedelméhez, amely játékidő, előadás ideje, futási idő vagy egyéb időtartomány. @hu
label: süre ile ilişkilidir @tr
definition: Bir kaynağı, oynama süresi, performans süresi, çalışma süresi veya başka bir süre uzunluğu olan kaynak kapsamı ile ilişkilendirir. @tr

is duration of (Deprecated)
lexical alias: durationOf.en
definition: Relates a timespan to a resource that has an extent of resource that is a playing time, performance time, running time, or other timespan. (Deprecated)
type: Property
inverse of: has duration
status: Deprecated
label: kesto @fi
definition: Liittää ajanjakson aineistoon, jolla on soittoaika, esitysaika, toistoaika tai muu kestoaika. @fi

has earlier title proper (Deprecated)
status: Deprecated
definition: Relates a resource to a title proper appearing on an earlier iteration of an integrating resource that differs from that on a current iteration. (Deprecated)
type: Property
sub property of: has title
lexical alias: earlierTitleProper.en
label: har tidligere hovedtitel @da
definition: Relaterer en ressource til en hovedtitel, der forekommer på en tidligere iteration af en integrerende ressource, der afviger fra hovedtitlen på den aktuelle iteration. @da

has edition statement
status: Published
definition: Relates a resource to a statement that identifies an edition to which a resource belongs.
type: Property
lexical alias: editionStatement.en
label: har udgavebeskrivelse @da
definition: Relaterer en ressource til oplysninger, der identificerer den udgave, en ressource hører til. @da
label: heeft editievermelding @nl
label: aineiston painosmerkintö @fi
label: له بيان طبعة @ar
definition: يربط بين مصدر وبيان يحدد طبعة ينتمي إليها مصدر. @ar
definition: Liittää aineiston merkintöön, joka identifioi aineiston painoksen. @fi
label: hat Ausgabevermerk @de
definition: Setzt eine Ressource in Beziehung zu einer Angabe, die eine Ausgabe identifiziert, zu der eine Ressource gehört. @de
label: 有版本说明 @zh-hans
definition: 将一种资源与标识一种资源属于其中的一个版本的说明关联起来。 @zh-hans
definition: Relaciona un recurs amb una menció que identifica una edició a la que pertany un recurs. @ca
label: kiadásjelzése a következő: @hu
definition: Hozzákapcsol egy forrást egy kiadást azonosító közléshez, amelyhez egy forrás tartozik. @hu
label: sürüm bildirimi ile ilişkilidir @tr
definition: Bir kaynağı, bir kaynağın ait olduğu bir basımı tanımlayan bir ifadeyle ilişkilendirir. @tr

has editor (Deprecated
definition: Relates a resource to an agent who contributes to a resource by revising or clarifying the content, or by selecting and putting together resources, or parts of resources, by one or more creators. (Deprecated)
type: Property
sub property of: has contributor (Deprecated)
inverse of: is editor of
lexical alias: editor.en
scope note: Addition of an introduction, notes, or other critical matter, or preparing a resource for production, publication, or distribution is included. Major revision, adaptation, etc., that substantially changes the nature and content of the original resource, resulting in a new resource, is excluded. (Deprecated)
see also: has author
label: har redaktør @da
definition: Relaterer en ressource til en agent, der har bidraget til en ressource ved at revidere eller præcisere indholdet, eller ved at udvælge og sammensætte ressourcer eller dele af ressourcer, af en eller flere ophavspersoner. @da
status: Deprecated
label: leikkaaja @fi
definition: Liittää aineiston toimijaan, joka osallistuu aineiston tekemiseen sisältöä tarkistamalla tai selventämällä tai valitsemalla ja kokoamalla toisen tekijän tai tekijöiden aineistoja tai niiden osia. @fi
scope note: Johdannon, huomautusten tai muun olennaisen sisällön lisääminen, samoin aineiston vamistelu tuotantoa, julkaisua tai jakelua varten. Ei koske uuteen aineistoon johtavia merkittäviä korjauksia, mukautuksia jne, jotka merkittävästi muuttavat alkuperäisen aineiston luonnetta tai sisältöä. @fi

has editorial director
status: Published
type: Property
lexical alias: editorialDirector.en
definition: Relates a resource to an agent who has legal or intellectual responsibility, but not creative responsibility, for the editorial policy and content of a diachronic resource.
inverse of: is editorial director of
sub property of: has other agent associated with resource (Deprecated)
see also: has editor (Deprecated
label: har ansvarshavende redaktør @da
definition: Relaterer en ressource til en agent, der er juridisk og/eller intellektuelt ansvarlig for indholdet, bortset fra dets skabelse, af et periodikum, en integrerende ressource eller et flerbindsværk. @da
label: heeft hoofdredacteur @nl
label: له مدير تحرير @ar
definition: يربط مصدر بوكيل يتحمل مسؤولية قانونية أو مسؤولية فكرية، ولا يتحمل مسؤولية إبداعية، بشأن سياسة تحريرية ومحتوى مصدر ممتد زمنيا. @ar
label: toimituspäällikkö aineistossa @fi
definition: Aineisto, jossa toimija on juridisesti tai tiedollisesti, mutta ei luovasti, vastuussa diakronisen aineiston toimituslinjasta ja sisällöstä. @fi
label: hat Chefredakteurin/Chefredakteur @de
definition: Setzt eine Ressource in Beziehung zu einem Akteur, der die rechtliche oder intellektuelle, aber keine kreative, Verantwortung für die redaktionelle Vorgehensweise und den Inhalt einer diachronen Ressource trägt. @de
label: 有主编 @zh-hans
definition: 将一种资源与有对一种历时资源的编辑政策和内容的法律或知识责任（但非创作责任）的一个行为者关联起来。 @zh-hans
label: főszerkesztője a következő: @hu
definition: Hozzákapcsol egy forrást egy ágenshez, amelynek jogi vagy szellemi, de nem alkotói felelőssége van egy diakronikus forrás szerkesztési politikájáért és tartalmáért. @hu
label: yayın yönetmeni ile ilişkilidir @tr
definition: Bir kaynağı, bir artzamanlı kaynağın içeriği için yasal veya fikri sorumluluğu olan ancak yaratıcı sorumluluğu olmayan bir temsilci ile ilişkilendirir. @tr

is editorial director of
status: Published
type: Property
lexical alias: editorialDirectorOf.en
definition: Relates an agent to a resource that involves a responsibility other than creating for the content of a serial, integrating resource, or multipart monographic resource.
inverse of: has editorial director
sub property of: is other agent associated with resource of (Deprecated)
see also: is editor of
label: er ansvarshavende redaktør af @da
definition: Relaterer en agent, der er juridisk og/eller intellektuelt ansvarlig for indholdet, bortset fra dets skabelse, af et periodikum, en integrerende ressource eller et flerbindsværk til en ressource. @da
label: is hoofdredacteur van @nl
label: هو مدير تحرير لـ @ar
definition: يربط بين وكيل ومصدر ينطوي على مسؤولية تختلف عن إنشاء محتوى تسلسلي، مصدر متكامل، أو مصدر دراسات متعددة الأجزاء. @ar
label: toimituspäällikkö (toimija) @fi
definition: Liittää toimijan aineistoon, jossa toimija on juridisesti tai tiedollisesti, mutta ei luovasti, vastuussa diakronisen aineiston toimituslinjasta ja sisällöstä. @fi
label: ist Chefredakteurin/Chefredakteur von @de
definition: Setzt einen Akteur in Beziehung zu einer Ressource, die mit einer anderen Verantwortung verbunden ist, als den Inhalt einer fortlaufenden, integrierenden oder mehrteiligen monografischen Ressource zu erstellen. @de
label: 是……的主编行为者 @zh-hans
definition: 将一个行为者与涉及对一种连续出版物、集成性资源或多部分单行资源的内容创作以外的责任的一种资源关联起来。 @zh-hans
label: főszerkesztője a következőnek: @hu
definition: Hozzákapcsol egy ágenst egy forráshoz, amelyhez hozzátartozik a tartalom létrehozásán kívüli felelősség egy sorozatért, integráló forrásért vagy többrészes monografikus forrásért. @hu
label: yayın yönetmenidir @tr
definition: Bir temsilciyi, bir seri, bütünleştirici kaynak veya çok parçalı monografik kaynağın içeriği için oluşturma dışında bir sorumluluk içeren bir kaynakla ilişkilendirir. @tr

is editor of
status: Published
definition: Relates an agent to a resource that includes a contribution by an agent of revision or clarification of the content, or selection and aggregation of resources, or parts of resources, by one or more creators.
type: Property
sub property of: is contributor of (Deprecated)
inverse of: has editor (Deprecated
lexical alias: editorOf.en
label: er redaktør af @da
definition: Relaterer en agent, der har bidraget til en ressource ved at revidere eller præcisere indholdet, fx tilføje en introduktion, noter, eller andet vigtigt materiale til en ressource. @da
label: is redacteur van @nl
label: هو مُحرر لـ @ar
definition: يربط بين وكيل ومصدر يتضمن إسهام وكيل في مراجعة المحتوى أو توضيحه، أو اختيار وتجميع مصادر، أو أجزاء من مصادر، بواسطة واحد أو أكثر من المُنشِئُين. @ar
label: toimittaja (toimija) aineistossa @fi
definition: Liittää toimijan aineistoon, jossa toimija on osallisena yhden tai useamman toimijan luoman sisällön tarkistamisessa tai selventämisessä tai resurssien tai resurssien osien valinnassa ja yhdistämisessä. @fi
label: ist Herausgeberin/Herausgeber von @de
definition: Setzt eine Akteur in Beziehung zu einer Ressource, zu der ein Akteur beiträgt, indem er den Inhalt überarbeitet oder erläutert, oder Ressourcen, oder Teile von Ressourcen, von einer geistige Schöpferin/einem geistigen Schöpfer oder mehreren geistigen Schöpferinnen/geistigen Schöpfern auswählt und aggregiert. @de
label: 是……的编者 @zh-hans
definition: 将一个行为者与包括修正或澄清一个或多个创作者完成的内容、或资源的选编和编制合集、或资源的部分的一个行为者的贡献的一种资源关联起来。 @zh-hans
label: szerkesztője a következőnek: @hu
definition: Hozzákapcsol egy ágenst egy forráshoz, amely magában foglalja az ágens közreműködését a tartalom átdolgozásában vagy áttekintésében, vagy az egy vagy több létrehozótól származó források vagy részforrások kiválasztásában és aggregálásában. @hu
label: editörüdür @tr
definition: Bir temsilciyi, içeriği gözden seçiren veya açıklığa kavuşturan veya kaynakların bir kısmının bir veya daha fazla içerik oluşturucu tarafından seçilen ve toplayan temsilcinin katkısını içeren bir kaynakla ilişkilendirir. @tr

has editor of moving image resource
status: Published
definition: Relates a resource to an agent who is responsible for assembling, arranging, and trimming film, video, or other moving image formats, including both visual and audio aspects.
type: Property
sub property of: has contributor (Deprecated)
inverse of: is editor of moving image resource of
lexical alias: editorOfMovingImageResource.en
see also: is author of
label: klipper @da
definition: Relaterer en ressource til en agent, der er ansvarlig for at have sammensat, arrangeret og klippet film, video eller andre levende billedformater, inkl. både visuelle og lydmæssige aspekter. @da
label: heeft filmeditor van bewegend beeld-resource @nl
label: liikkuvan kuvan leikkaaja aineistossa @fi
label: له محرر مصدر صور متحركة @ar
definition: يربط مصدر بوكيل مسؤول عن تجميع أفلام، فيديو أو أشكال الصور المتحركة الأخرى وترتيبها وتشذيبها، بما في ذلك الجوانب المرئية والمسموعة. @ar
definition: Liittää aineiston toimijaan, joka vastaa elokuvan, videon tai muiden elokuvaformaattien kokoamisesta, järjestämisestä ja leikkauksesta sekä kuvan että äänen osalta. @fi
label: hat Filmeditorin/Filmeditor @de
definition: Setzt eine Ressource in Beziehung zu einem Akteur, der für das Zusammensetzen, Arrangieren und Nachschneiden von Film-, Video- oder anderen Bewegtbildformaten zuständig ist. Dies betrifft sowohl Video- als auch Audio-Eigenschaften. @de
label: 有动态图像资源的剪辑师 @zh-hans
definition: 将一种资源与对影片、视频或其他动态图像格式（包括视频和音频方面）的汇编、编排和剪辑负责的一个行为者关联起来。 @zh-hans
label: mozgóképforrás szerkesztője a következő: @hu
definition: Hozzákapcsol egy forrást egy ágenshez, amely felelős film, videó vagy más mozgókép-formátum összeállításáért, elrendezéséért és vágásáért, beleértve mind a vizuális, mind az audió szempontokat. @hu
label: hareketli görüntü kaynağının editörü ile ilişkilidir @tr
definition: Bir kaynağı, hem görsel hem de işitsel yönler dahil olmak üzere film, video veya diğer hareketli görüntü formatlarını bir araya getirmekten, düzenlemekten ve kırpmaktan sorumlu bir temsilci ile ilişkilendirir. @tr

is editor of moving image resource of
status: Published
definition: Relates an agent to a resource that includes a contribution of assembling, arranging, and trimming film, video, or other moving image formats, including both visual and audio aspects.
type: Property
sub property of: is contributor of (Deprecated)
inverse of: has editor of moving image resource
lexical alias: editorOfMovingImageResourceOf.en
label: er klipper af @da
definition: Relaterer en agent, der er ansvarlig for at have samlet, arrangeret og klippet film, video eller andre levende billedformater, inkl. både visuelle og lydmæssige aspekter til en ressource. @da
label: is filmeditor van bewegend beeld-resource van @nl
label: هو محرر مصدر صور متحركة لـ @ar
definition: يربط بين وكيل ومصدر يتضمن المساهمة في تجميع الأفلام أو الفيديو أو أشكال الصور المتحركة الأخرى وترتيبها وتشذيبها، بما في ذلك الجوانب المرئية والمسموعة. @ar
label: liikkuvan kuvan leikkaaja (toimija) aineistossa @fi
definition: Liittää toimijan aineistoon, jossa toimija vastaa elokuvan, videon tai muiden elokuvaformaattien kokoamisesta, järjestämisestä ja leikkauksesta sekä kuvan että äänen osalta. @fi
label: ist Filmeditorin/Filmeditor von @de
definition: Setzt einen Akteur in Beziehung zu einer Ressource, die einen Beitrag zum Zusammensetzen, Arrangieren und Nachschneiden von Film-, Video- oder anderen Bewegtbildformaten beinhaltet. Darunter fallen Video- und Audio-Eigenschaften. @de
label: ……动态图像资源的剪辑师 @zh-hans
definition: 将一个行为者与包括对影片、视频或其他动态图像格式（包括视频和音频方面）的汇编、编排和剪辑的一个贡献的一种资源关联起来。 @zh-hans
label: mozgóképforrás szerkesztője a következőnek: @hu
definition: Hozzákapcsol egy ágenst egy forráshoz, amely magában foglal film, videó vagy más mozgóképformátum összeállításával, elrendezésével és vágásával járó közreműködést, beleértve mind a vizuális, mind az audió szempontokat. @hu
definition: Relaciona un agent amb un recurs que inclou una contribució d’aplegar, arranjar i retallar pel·lícules, vídeos o altres formats d’imatge en moviment, inclosos tant els aspectes visuals com els d’àudio. @ca
label: hareketli görüntü kaynağının editörüdür @tr
definition: Bir temsilciyi, hem görsel hem işitsel yönlerini içeren, film, video veya diğer hareketli görüntü formatlarının montajı, düzenlemesi ve kırpılmasına katkı sunan bir kaynakla ilişkilendirir @tr

has editor
status: Published
definition: Relates a resource to an agent who contributes to a resource by amending text created by other agents in order to meet publication standards such as consistency, clarity, and style,
type: Property
inverse of: is editor of text of (Deprecated)
lexical alias: editor.en
label: heeft redacteur @nl
label: له محرر @ar
definition: يربط مصدر بوكيل يُساهم في مصدر من خلال تعديل النص الذي تم إنشاؤه بواسطة وكلاء آخرين من أجل تلبية معايير النشر مثل الاتساق، الوضوح، والأسلوب. @ar
label: har udgiver @da
definition: Relaterer en ressource til en agent, som bidrager til en ressource ved at ændre tekst skabt af andre agenter for at opfylde publikationsstandarder, som fx konsistens, klarhed og stil. @da
label: aineiston toimittaja @fi
definition: Liittää aineiston toimijaan, joka osallistuu aineiston tekemiseen tarkistamalla muiden toimijoiden luomaa sisältöä julkaisu- tai muiden käyttöstandardien saavuttamiseksi. @fi
label: hat Herausgeberin/Herausgeber @de
definition: Setzt eine Ressource in Beziehung zu einem Akteur, der zu einer Ressource beiträgt, indem er Text verändert, der von anderen Akteuren erstellt wurde, um Publikationsstandards wie Konsistenz, Klarheit und Stil zu erfüllen. @de
label: 有编者 @zh-hans
definition: 将一种资源与通过修正其他行为者创作的内容以满足出版标准（例如一致、清晰、风格）对一种资源作出贡献的一个行为者关联起来。 @zh-hans
label: szerkesztője a következő: @hu
definition: Hozzákapcsol egy forrást egy ágenshez, amely hozzájárul egy forráshoz más ágensek által létrehozott szöveg módosításával, hogy az megfeleljen olyan publikációs szabályoknak, mint a következetesség, az egyértelműség és a stílus. @hu
label: editör ile ilişkilidir @tr
definition: Bir kaynağı, tutarlılık, açıklık ve biçim gibi yayın standartlarını karşılamak için diğer temsilciler tarafından oluşturulan metni değiştirerek bir kaynağa katkıda bulunan bir temsilci ile ilişkilendirir. @tr

is editor of text of (Deprecated)
lexical alias: editorOfTextOf.en
definition: Relates an agent to a resource that includes a contribution by an agent of amending text created by other agents in order to meet publication standards such as consistency, clarity, and style. (Deprecated)
type: Property
status: Deprecated

has electronic reproduction
status: Published
definition: Relates a resource to a resource in a digital format that is a result of a transfer of a resource in an analog format.
type: Property
sub property of: is reproduced as
inverse of: is electronic reproduction of
lexical alias: electronicReproduction.en
label: har elektronisk reproduktion @da
definition: Relaterer en ressource til en ressource i et digitalt format der er resultatet of en overførsel af en ressource i et analogt format. @da
label: heeft elektronische reproductie @nl
label: aineiston digitoitu jäljenne @fi
label: له إنتاج إلكتروني @ar
definition: يربط بين مصدر ومصدر في صيغة رقمية ناتج عن تحويله في شكل تناظري. @ar
definition: Liittää aineiston digitaalisessa muodossa olevaan aineistoon, joka analogisen aineiston muunnoksen tulos. @fi
label: hat elektronische Reproduktion @de
definition: Setzt eine Ressource in Beziehung zu einer Ressource in einem digitalen Format, die ein Ergebnis einer Übertragung einer Ressource in ein analoges Format ist. @de
label: 有电子复制品 @zh-hans
definition: 将一种资源与从一种模拟格式的资源转储为一种数字格式而形成的资源关联起来。 @zh-hans
label: elektronikus másolata a következő: @hu
definition: Hozzákapcsol egy forrást egy digitális formátumban lévő forráshoz, amely egy forrás analóg formátumból történő átviteléből ered. @hu
label: elektronik yeniden üretim ile ilişkilidir @tr
definition: Bir kaynağı, analog biçimdeki bir kaynağın aktarımının sonucu olan dijital biçimdeki bir kaynakla ilişkilendirir. @tr

is electronic reproduction of
status: Published
definition: Relates a resource to a resource in an analog format that is transferred to a digital format.
type: Property
sub property of: is reproduction of
inverse of: has electronic reproduction
lexical alias: electronicReproductionOf.en
label: er elektronisk reproduktion af @da
definition: Relaterer en ressource til en ressource i et analogt format, der er overført til et digitalt format. @da
label: is elektronische reproductie van @nl
label: digitoitu aineisto @fi
label: له إنتاج إلكتروني @ar
definition: يربط بين مصدر ومصدر في صيغة رقمية ناتج عن تحويله في شكل تناظري. @ar
definition: Liittää aineiston digitaalisessa muodossa olevaan aineistoon joka analogisen aineiston muunnoksen tulos. @fi
label: ist elektronische Reproduktion von @de
definition: Setzt eine Ressource in Beziehung zu einer Ressource in einem analogen Format, die in ein digitales Format übertragen wird. @de
label: 是……的电子复制品 @zh-hans
definition: 将一种资源与被转储为一种数字格式的一种模拟格式的资源关联起来。 @zh-hans
label: elektronikus másolata a következőnek: @hu
definition: Hozzákapcsol egy forrást egy analóg formátumú forráshoz, amelyet digitális formátumra visznek át. @hu
label: elektronik yeniden üretimidir @tr
definition: Bir kaynağı, dijital formata aktarılan analog formattaki bir kaynakla ilişkilendirir. @tr

has employee
status: Published
definition: Relates an agent to an agent who is employed by an agent.
type: Property
inverse of: has employer
lexical alias: employee.en
label: har ansat @da
definition: Relaterer en agent der er ansat af en agent til en agent. @da
label: heeft werknemer @nl
label: له موظف @ar
definition: يربط وكيلًا تم توظيفه من قبل وكيل لوكيل. @ar
label: työntekijä (toimija) aineistossa @fi
definition: Liittää toimijan toimijan työllistämään toimijaan. @fi
label: hat Arbeitnehmerin/Arbeitnehmer @de
definition: Setzt einen Akteur in Beziehung zu einem Akteur, der einen Akteur beschäftigt. @de
label: 有雇员 @zh-hans
definition: 将一个行为者与被一个行为者雇用的一个行为者关联起来。 @zh-hans
definition: Relaciona un agent amb un agent que és empleat per un agent. @ca
label: alkalmazottja a következő: @hu
definition: Hozzákapcsol egy ágenst egy ágens alkalmazásában álló ágenshez. @hu
label: çalışan ile ilişkilidir @tr
definition: Bir temsilci tarafından istihdam edilen bir temsilciyi bir temsilciyle ilişkilendirir. @tr

has employer
status: Published
definition: Relates an agent to an agent who employs an agent.
type: Property
inverse of: has employee
lexical alias: employer.en
label: har arbejdsgiver @da
definition: Relaterer en agent der ansætter en agent til en agent. @da
label: heeft werkgever @nl
label: له موظف @ar
definition: يربط بين وكيل يوظف وكيلًا ووكيل @ar
label: työnantaja (toimija) @fi
definition: Liittää toimijan toimijaan, joka työllistää toimijan. @fi
label: hat Arbeitgeberin/Arbeitgeber @de
definition: Setzt einen Akteur in Beziehung zu einem Akteur, der einen Akteur beschäftigt. @de
label: 有雇员 @zh-hans
definition: 将一个行为者与雇用一个行为者的一个行为者关联起来。 @zh-hans
definition: Relaciona un agent amb un agent que emplea un agent. @ca
label: munkaadója a következő: @hu
definition: Hozzákapcsol egy ágenst alkalmazó ágenst egy ágenshez. @hu
label: işveren ile ilişkilidir @tr
definition: Bir temsilci istihdam eden bir temsilciyi bir temsilci ile ilişkilendirir. @tr

has emulsion on microfilm and microfiche
status: Published
definition: Relates a resource to a suspension of light-sensitive chemicals used as a coating on a microfilm or microfiche.
type: Property
sub property of: has applied material
lexical alias: emulsionOnMicrofilmAndMicrofiche.en
label: har emulsion på mikrofilm og mikrofiche @da
definition: Relaterer en ressource til en opslæmning af lysfølsomme kemikalier, der er anvendt som belægning på en mikrofilm eller mikrofiche. @da
label: heeft emulsie op microfilm en microfiche @nl
label: mikrofilmille ja mikrokortille emuloitu aineisto @fi
label: له طبقة حساسة على ميكروفيلم وميكروفيش @ar
definition: يربط بين مصدر ونظام تسجيل خاص بالمواد الكيميائية المستخدمة كغطاء على ميكروفيلم أو ميكروفيش. @ar
definition: Liittää aineiston mikrofilmin tai mikrokortin valoherkkiä kemikaaleja sisältävään pinnoitteeseen. @fi
label: hat Emulsionsschicht auf Mikrofilm und Mikrofiche @de
definition: Setzt eine Ressource in Beziehung zu einer Suspension aus lichtempfindlichen Chemikalien, die als Beschichtung eines Mikrofilms oder eines Mikrofiches verwendet wird. @de
label: 有缩微胶卷和缩微平片上的乳剂 @zh-hans
definition: 将一种资源与缩微胶卷或缩微平片表面感光化合物的悬浮涂层关联起来。 @zh-hans
label: emulziója mikrofilmen és mikrofilmlapon a következő: @hu
definition: Hozzákapcsol egy forrást fényérzékeny vegyszerek szuszpenziójához, amelyet bevonatként használnak mikrofilmen vagy mikrofilmlapon. @hu
label: mikrofilm ve mikrofiş üzerinde emülsiyon ile ilişkilidir @tr
definition: Bir kaynağı, bir mikrofilm veya mikrofiş üzerinde kaplama olarak kullanılan ışığa duyarlı kimyasalların süspansiyonuyla ilişkilendirir. @tr

has enacting government
status: Published
definition: Relates a resource to an agent who is a government enacting a resource that is a law, regulation, constitution, court rule, or other legislation.
type: Property
sub property of: has creator
inverse of: is enacting government of
label: har vedtagende jurisdiktion @da
definition: Relaterer en ressource til en jurisdiktion, der har vedtaget en lov, forordning, forfatning, retsplejeregel etc. @da
label: heeft vaststellende jurisdictie @nl
label: säätävä hallintoelin @fi
label: له سلطة سن القوانين @ar
definition: يربط مصدر بوكيل يُمثل حكومة تسن مصدرًا هو قانون، أو لائحة، أو دستور، أو حكم قضائي، أو تشريع آخر. @ar
definition: Liittää aineiston lainsäädännöllistä aineistoa kuten lakeja, perustuslakia, tuomioistuimen sääntöjä tai muuta lainsäädäntöä säätävään hallinnolliseen toimijaan. @fi
label: Normerlassende Gebietskörperschaft @de
definition: Setzt eine Ressource in Beziehung zu einer Regierung, die eine Ressource erlässt, bei dem es sich um ein Gesetz, eine Verordnung, eine Verfassung, eine Rechtsverordnung oder eine andere Gesetzgebung handelt. @de
lexical alias: enactingGovernment.en
label: 有颁布政府 @zh-hans
definition: 将一种资源与作为一个政府颁布作为法律、法规、宪法、法院规则或其他立法的一种资源的一个行为者关联起来。 @zh-hans
label: té govern promulgador @ca
label: törvényalkotási joghatósága a következő: @hu
definition: Hozzákapcsol egy forrást egy igazgatási szerv ágenshez, amely kiad egy forrást, ami egy törvény, rendelet, alkotmány, törvényszéki szabályzat vagy egyéb jogszabály. @hu
definition: Relaciona un recurs amb un agent que és un govern que promulga un recurs que és una llei, un reglament, una constitució, una regla de funcionament d’un tribunal o qualsevol altra legislació. @ca
label: yasa çıkaran hükümet ile ilişkilidir @tr
definition: Bir kaynağı yasa, yönetmelik, anayasa, mahkeme kararı veya diğer mevzuat olan bir kaynağı yürürlüğe koyan bir hükümet olan bir temsilci ile ilişkilendirir. @tr

is enacting government of
status: Published
definition: Relates an agent to a resource that is a law, regulation, constitution, court rule, etc. enacted by a government body.
type: Property
sub property of: is creator of
inverse of: has enacting government
label: er udøvende jurisdiktion af @da
definition: Relaterer en jurisdiktion der vedtager en lov, forordning, forfatning, retsplejeregel etc. til en ressource. @da
label: is vaststellende jurisdictie van @nl
label: säätävän hallintoelimen päätös @fi
label: هي هيئة سن التشريعات لـ @ar
definition: يربط بين وكيل ومصدر هو قانون، لائحة، دستور، حكم محكمة...إلخ، تسنه هيئة حكومية. @ar
definition: Liittää toimijan valtiovallan aineistoon, kuten lakiin, asetukseen, perustuslakiin, tuomioistuinta koskevaan sääntöön tms. @fi
label: ist normerlassende Gebietskörperschaft von @de
definition: Setzt einen Akteur in Beziehung zu einer Ressource, bei der es sich um ein Gesetz, eine Verordnung, eine Verfassung, eine Rechtsverordnung und so weiter handelt, das/die von einer Regierung erlassen wird. @de
lexical alias: enactingGovernmentOf.en
label: 是……的颁布政府 @zh-hans
definition: 将一个行为者与作为政府机构颁布的法律、法规、法院规则等的一种资源关联起来。 @zh-hans
label: és govern promulgador de @ca
definition: Relaciona un agent amb un recurs que és una llei, un reglament, una constitució, una regla de funcionament d’un tribunal, etc. promulgada per una entitat governamental. @ca
label: rendelkező joghatósága a következőnek: @hu
definition: Hozzákapcsol egy ágenst egy forráshoz, amely egy kormányzati testület által beiktatott törvény, rendelet, alkotmány, bírósági határozat, stb. @hu
label: yasa çıkaran hükümetidir @tr
definition: Bir temsilciyi, bir hükümet organı tarafından çıkarılan bir yasa, yönetmelik, anayasa, mahkeme kuralı vb. olan bir kaynakla ilişkilendirir. @tr

has encoded bitrate
status: Published
definition: Relates a resource to a speed at which streaming audio, video, or other content is designed to play..
type: Property
sub property of: has digital file characteristic
lexical alias: encodedBitrate.en
inverse of: is assistant to
label: har kodet bitrate @da
definition: Relaterer en ressource til en hastighed, som streamet lyd, video etc. er skabt til at spille ved. @da
label: heeft gecodeerde bitsnelheid @nl
label: له معدل للبتات المُشفرة @ar
definition: يربط بين مصدر وسرعة تم بها تصميم بيانات صوتية متدفقة عبر الانترنت، فيديو، أو أي محتوى آخر للتشغيل. @ar
label: koodattu bittinopeus aineistolle @fi
definition: Nopeus, jolla suoratoistoääni, -video tai muu sisältö on suunniteltu toistettavan. @fi
label: hat Bitrate @de
definition: Setzt eine Ressource in Beziehung zu einer Geschwindigkeit, mit der Audio-, Video-Streaming und so weiter abgespielt werden. @de
label: 有编码的比特率 @zh-hans
definition: 将一种资源与流播音频、视频或其他内容被设计播放的速度关联起来。 @zh-hans
definition: Relaciona un recurs amb una velocitat a la qual es dissenya l’estríming d’àudio, vídeo o un altre contingut @ca
label: kódolt bitrátája a következő: @hu
definition: Hozzákapcsol egy forrást egy sebességhez, amelyen egy sztrímelt audió, videó vagy egyéb tartalom terv szerint lejátszódik. @hu
label: kodlanmış bit hızı ile ilişkilidir @tr
definition: Bir kaynağı, ses, video veya diğer içerik akışının oynatılmak üzere tasarlandığı bir hız ile ilişkilendirir. @tr

has encoding format
status: Published
definition: Relates a resource to a schema or standard that is used to encode the digital content of a resource.
type: Property
sub property of: has digital file characteristic
lexical alias: encodingFormat.en
label: har kodningsformat @da
definition: Relaterer en ressource til et skema, standard etc., der anvendes til kodning af en ressources digitale indhold. @da
label: heeft coderingsformaat @nl
label: koodausmuoto @fi
label: له نظام ترميز @ar
definition: يربط بين مصدر وخطة، أو معيار مستخدم في تشفير المحتوى الرقمي لمصدر. @ar
definition: Liittää aineiston sen digitaalisen sisällön koodaamiseen käytettyyn skeemaan rai standardiin. @fi
label: hat Kodierungsformat @de
definition: Setzt eine Ressource in Beziehung zu einem Schema, einem Standard und so weiter, das/der zum Kodieren des digitalen Inhalts einer Ressource verwendet wird. @de
label: 有编码格式 @zh-hans
definition: 将一种资源与用于对一种资源的数字内容进行编码的一种方案或标准关联起来。 @zh-hans
label: kódolási formátuma a következő: @hu
definition: Hozzákapcsol egy forrást egy sémához vagy szabványhoz, amelyet egy forrás digitális tartalmának a kódolására használnak. @hu
label: kodlama formatı ile ilişkilidir @tr
definition: Bir kaynağı, bir kaynağın dijital içeriğini kodlamak için kullanılan bir şema veya standartla ilişkilendirir. @tr

has ending
status: Published
lexical alias: ending.en
definition: Relates a timespan to a timespan that is the time at which a timespan finishes.
type: Property
scope note: A time may be represented at different levels of granularity by a calendrical timespan.
inverse of: is ending of
label: heeft einde @nl
label: له نهاية @ar
definition: يربط بين فترة زمنية وزمن حيث تنتهي فيه فترة زمنية. @ar
scope note: يمكن تمثيل الوقت عند مستويات مختلفة من التجميع بواسطة فترة زمنية تقويمية. @ar
label: har slutning @da
definition: Relaterer et tidsforløb til et tidsforløb, der der det tidspunkt hvor et tidsforløb stopper. @da
scope note: Et tidspunkt kan repræsenteres på forskellige granularitetsniveauer ved et kalendrisk tidsrum. @da
label: ajanjakson loppu @fi
definition: Liittää ajanjakson ajanjaksoon, joka on ajanjakson päättymisaika. @fi
scope note: Aika voidaan esittää kalenterin ajanjakson eri tarkkuustasoilla. @fi
label: hat Ende @de
definition: Setzt einen Zeitraum in Beziehung zu einem Zeitraum, bei dem es sich um den Zeitpunkt handelt, an dem ein Zeitraum endet. @de
scope note: Ein Zeitpunkt kann durch einen kalendarischen Zeitraum auf verschiedenen Ebenen der Granularität dargestellt werden. @de
label: 有结束 @zh-hans
definition: 将一个时间段与作为一个时间段结束时间的一个时间段关联起来。 @zh-hans
scope note: 一个时间可以用日历时间段的不同颗粒度层级表示。 @zh-hans
label: befejezése a következő: @hu
definition: Hozzákapcsol egy időpontot egy időponthoz, amikor az időtartam befejeződik. @hu
scope note: Különböző szintű részletességgel, naptári időtartammal ábrázolt idő. @hu
label: bitiş ile ilişkilidir @tr
definition: Bir zaman aralığını, zaman aralığının bittiği zaman olan bir zaman aralığyla ilişkilendirir. @tr
scope note: Zaman, takvimsel bir zaman aralığı ile farklı ayrıntı düzeylerinde temsil edilebilir. @tr

has engraver
status: Published
definition: Relates a resource to an agent who is responsible for creating a resource by cutting letters, figures, or other marks on a surface such as a wooden or metal plate used for printing.
type: Property
inverse of: is engraver of
lexical alias: engraver.en
label: har gravør @da
definition: Relaterer en ressource til en agent, der har været involveret i fremstillingen af en ressource ved at udskære bogstaver, figurer etc. på en overflade såsom en træ- eller metalplade, der har været anvendt til trykning. @da
label: heeft graveur @nl
label: aineiston kaivertaja @fi
sub property of: has printmaker
label: له نقّاش @ar
definition: يربط مصدر بوكيل مسؤول عن إنتاج مصدر بنقش حروف، أشكال، أو رموز أخرى على سطح مثل لوح خشبي أو معدني يستخدم للطباعة. @ar
definition: Liittää aineiston toimijaan, joka on vastuussa aineiston valmistamisesta kaivertamalla kirjaimia, kuvioita tai muita merkkejä painamisessa käytettävälle pinnalle, kuten puu- tai metallipinnalle. @fi
label: hat Stecherin/Stecher @de
definition: Setzt eine Ressource in Beziehung zu einem Akteur, der für die Herstellung einer Ressource verantwortlich ist, indem er Buchstaben, figürliche Darstellungen und so weiter in eine Oberfläche, wie zum Beispiel eine Holz- oder Metallplatte schneidet, die zum Drucken benutzt wird. @de
label: 有雕版者 @zh-hans
definition: 将一种资源与通过在用于印刷的木版或金属版的表面上雕刻字母、图像或其他记号负责资源的创建的一个行为者关联起来。 @zh-hans
definition: Relaciona un recurs amb un agent que és responsable de la creació d’un recurs mitjançant la gravació de lletres, figures o altres marques sobre una superfície com ara una planxa de fusta o de metall usada en la impressió. @ca
label: vésnöke a következő: @hu
definition: Hozzákapcsol egy forrást egy ágenshez, amely felelős egy forrás gyártásáért oly módon, hogy betűket, ábrákat vagy egyéb jeleket vés nyomtatáshoz használatos fa- vagy fémlemezhez hasonló felületre. @hu
label: gravür sanatçısı ile ilişkilidir @tr
definition: Bir kaynağı, baskı için kullanılan ahşap veya metal plaka gibi bir yüzey üzerinde harfler, şekiller veya diğer işaretleri keserek bir kaynak oluşturmaktan sorumlu olan bir temsilci ile ilişkilendirir. @tr

is engraver of
status: Published
definition: Relates an agent to a resource that involves a responsibility of an agent for cutting letters, figures, etc., on a surface such as a wooden or metal plate used for printing.
type: Property
inverse of: has engraver
lexical alias: engraverOf.en
label: er gravør af @da
definition: Relaterer en agent, der har været involveret i fremstillingen af en ressource ved at udskære bogstaver, figurer etc. på en overflade såsom en træ- eller metalplade, der har været anvendt til trykning til en ressource. @da
label: is graveur van @nl
sub property of: is printmaker of
label: هو نقّاش لـ @ar
definition: يربط بين وكيل ومصدر ينطوي على مسؤولية وكيل عن نقش الحروف، والأشكال، إلخ.، على سطح مثل لوح خشبي أو معدني يستخدم للطباعة. @ar
label: kaivertaja (toimija) aineistossa @fi
definition: Liittää toimijan aineistoon, jossa toimija vastaa kirjainten, kuvioiden tai muiden merkkien painamisessa käytettävälle pinnalle, kuten puu- tai metallipinnalle. @fi
label: ist Stecherin/Stecher von @de
definition: Setzt einen Akteur in Beziehung zu einer Ressource, bei der ein Akteur für das Schneiden von Buchstaben, figürlichen Darstellungen und so weiter in eine Oberfläche, wie zum Beispiel eine Holz- oder Metallplatte, die zum Drucken benutzt wird, verantwortlich ist. @de
label: 是……的雕版者 @zh-hans
definition: 将一个行为者与涉及通过在木版或金属版等表面上雕刻字母、图形等以用于印刷的一个行为者的责任的一种资源关联起来。 @zh-hans
label: vésnöke a következőnek: @hu
definition: Hozzákapcsol egy ágenst egy forráshoz, amelyhez hozzátartozik az ágens felelőssége betűknek, számoknak stb. nyomtatáshoz használt fa- vagy fémlemez felületére történő metszéséért. @hu
label: gravür sanatçısıdır @tr
definition: Bir temsilciyi, baskı için kullanılan ahşap veya metal bir plaka gibi bir yüzey üzerinde harfleri, şekilleri vb. kesmekle görevli bir temsilcinin sorumluluğunu içeren bir kaynakla ilişkilendirir. @tr

has enrolled student
status: Published
type: Property
lexical alias: enrolledStudent.en
definition: Relates an agent to an agent who receives instruction at an educational institution.
inverse of: is student at
sub property of: has related agent of agent
label: har indskreven studerende @da
definition: Relaterer en agent til en agent, der modtager undervisning ved en uddannelsesinstitution. @da
label: heeft ingeschreven student @nl
label: له طالب مسجل @ar
definition: يربط بين وكيل ووكيل يتلقى التعليم في مؤسسة تعليمية. @ar
label: oppilas (toimija) @fi
definition: Liittää toimijan toimijaan, joka saa opetusta oppilaitoksessa. @fi
label: hat immatrikulierte Studentin/immatrikulierten Studenten @de
definition: Setzt einen Akteur in Beziehung zu einem Akteur, der in einer Bildungseinrichtung unterrichtet wird. @de
label: 有注册学生 @zh-hans
definition: 将一个行为者与在一个教育机构里接受教学的一个行为者关联起来。 @zh-hans
label: beiratkozott tanulója a következő: @hu
definition: Hozzákapcsol egy ágenst egy ágenshez, aki egy oktatási intézményben oktatásban részesül. @hu
label: kayıtlı öğrenci ile ilişkilidir @tr
definition: Bir temsilciyi, bir eğitim kurumunda eğitim alan bir temsilciyle ilişkilendirir. @tr

has epoch
status: Published
definition: Relates a resource to a timespan to which measurements of position for a body or orientation for an orbit are referred.
type: Property
lexical alias: epoch.en
label: har epoke @da
definition: Relaterer en ressource til et vilkårligt tidspunkt, som målene for et legemes position eller en banes retning henviser til. @da
inverse of: is epoch of
label: heeft tijdperk @nl
label: epookki aineistossa @fi
label: له مُدّة زمنية @ar
definition: يربط بين مصدر ومدى زمني يُحال إليه قياسات وضع لجسم أو لتوجه مداري. @ar
definition: Liittää aineiston ajanjaksoon, jonka mukaan tähtitaivaan kohteiden sijainnit ja ratojen suunnat on annettu. @fi
label: hat Epoche @de
definition: Setzt eine Ressource in Beziehung zu einem Zeitraum, auf den sich Positionsmessungen für einen Körper oder die Orientierung einer Umlaufbahn beziehen. @de
label: 有历元 @zh-hans
definition: 将一种资源与提及物体位置或运行轨道方位之测量的一个时间段关联起来。 @zh-hans
label: korszaka a következő: @hu
definition: Hozzákapcsol egy forrást egy időtartamhoz, amelyre egy test mérési pozíciója vagy egy keringési pálya orientációja utal. @hu
label: epok ile ilişkilidir @tr
definition: Bir kaynağı, bir cisim için konum veya bir yörünge için yönelim ölçümlerine atıfta bulunulan bir zaman aralığıyla ilişkilendirir. @tr

is epoch of
status: Published
type: Property
lexical alias: epochOf.en
inverse of: has epoch
definition: Relates a timespan to a resource that refers to measurements of position for a body or orientation for an orbit.
label: is tijdperk van @nl
label: له مُدّة زمنية @ar
definition: يربط بين فترة زمنية ومصدر يُحال إليه قياسات وضع لجسم أو لتوجه مداري. @ar
label: er epoke af @da
definition: Relaterer et tidsforløb til en ressource der refererer til målinger af position for et legeme eller retning for en bane. @da
label: epookki aineistossa @fi
definition: Liittää ajanjakson aineistoon, johon tähtitaivaan kohteiden sijaintien ja ratojen suuntien mittajärjestelmä viittaa. @fi
label: ist Epoche von @de
definition: Setzt einen Zeitraum in Beziehung zu einer Ressource, die Positionsmessungen für einen Körper oder eine Orientierung für eine Umlaufbahn referenziert. @de
label: 是……的历元 @zh-hans
definition: 将一个时间段与提及物体位置或运行轨道方位之测量的一种资源关联起来。 @zh-hans
label: korszaka a következőnek: @hu
definition: Hozzákapcsol egy időtartamot egy forráshoz, amely egy test mérési pozíciójára vagy egy keringési pálya orientációjára utal. @hu
label: epoğudur @tr
definition: Bir zaman aralığını, bir cisim için konum veya bir yörünge için yönelim ölçümlerini ifade eden bir kaynakla ilişkilendirir. @tr

has equinox
status: Published
definition: Relates a resource to a timespan that is a point of intersection of the ecliptic and the celestial equator, occupied by the sun when its declination is 0°.
type: Property
lexical alias: equinox.en
label: har jævndøgn @da
definition: Relaterer en ressource til et af himmelsfærens og himmelækvators to skæringspunkter, hvor solen befinder sig, når dens hældning er 0°. @da
inverse of: is equinox of
label: heeft equinox @nl
label: له اعتدال @ar
definition: يربط بين مصدر وفترة زمنية تمثل نقطة تقاطع بين مسار الشمس وخط الاستواء السماوي، تحتله الشمس عندما يكون انحرافها صفر "0". @ar
label: tasauspiste aineistossa @fi
definition: Liittää aineiston ajanjaksoon, joka käyttää ekliptikan ja taivaanekvaattorin leikkauspistettä, jossa aurinko on, kun sen deklinaatio on 0°. @fi
label: hat Äquinoktium @de
definition: Setzt eine Ressource in Beziehung zu einem von zwei Kreuzungspunkten der Sonnenbahn und des Himmelsäquators, die von der Sonne überquert werden, wenn ihre Deklination 0° beträgt. @de
label: 有二分点 @zh-hans
definition: 将一种资源与作为当太阳的赤纬角度为0时其所占黄道和天赤道的一个交叉点的一个时间段关联起来。 @zh-hans
label: napéjegyenlősége a következő: @hu
definition: Hozzákapcsol egy forrást egy időtartamhoz, amely a nappálya és az égi egyenlítő kereszteződési pontja, amelyet a nap akkor foglal el, amikor a deklinációja 0°. @hu
label: ekinoks ile ilişkilidir @tr
definition: Bir kaynağı, güneş sapmasının 0° olduğu anda ekliptik ve gök ekvatorunun kesişme noktası olan bir zaman aralığıyla ilişkilendirir. @tr

is equinox of
status: Published
type: Property
lexical alias: equinoxOf.en
inverse of: has equinox
definition: Relates a timespan to a resource that uses a point of intersection of the ecliptic and the celestial equator, occupied by the sun when its declination is 0°.
label: is equinox van @nl
label: هو اعتدال لـ @ar
definition: يربط بين فترة زمنية ومصدر يستخدم نقطة تقاطع مسار الشمس مع خط الاستواء عندما يكون انحرافها صفر "0". @ar
label: er jævndøgn for @da
definition: Relaterer et tidsforløb til en ressource, som bruger et skæringspunkt mellem ekliptika og himlens ækvator, hvor solen befinder sig, når dens deklination er 0°. @da
label: tasauspiste aineistossa @fi
definition: Liittää ajanjakson aineistoon, joka käyttää ekliptikan ja taivaanekvaattorin leikkauspistettä, jossa aurinko on, kun sen deklinaatio on 0°. @fi
label: ist Äquinoktium von @de
definition: Setzt einen Zeitraum in Beziehung zu einer Ressource, die einen von zwei Kreuzungspunkten der Sonnenbahn und des Himmelsäquators verwendet, die von der Sonne überquert werden, wenn ihre Deklination 0° beträgt. @de
label: 是……的二分点 @zh-hans
definition: 将一个时间段与使用当太阳的赤纬角度为0时其所占黄道和天赤道的一个交叉点的一种资源关联起来。 @zh-hans
label: napéjegyenlősége a következőnek: @hu
definition: Hozzákapcsol egy időtartamot egy forráshoz, amely a nappálya és az egyenlítő metszéspontját használja, amit a nap akkor foglal el, amikor a deklinációja 0°. @hu
label: ekinoksudur @tr
definition: Bir zaman aralığını, güneşin sapmasının 0° olduğu anda ekliptik ve gök ekvatorunun kesişme noktasını kullanan bir kaynakla ilişkilendirir. @tr

has equipment or system requirement
status: Published
definition: Relates a resource to a system or equipment required for access to the content of an electronic analog or digital resource.
type: Property
lexical alias: equipmentOrSystemRequirement.en
label: har afspilningsudstyr eller systemkrav @da
definition: Relaterer en ressource til udstyr eller system, der er påkrævet, for at en analog, digital etc. ressource kan anvendes, afspilles etc. @da
label: heeft apparatuur- of systeemeis @nl
label: له أجهزة أو متطلبات تشغيل @ar
definition: يربط بين مصدر ونظام أو جهاز مطلوب للوصول إلى محتوى مصدر إلكتروني تناظري أو رقمي. @ar
label: aineiston laitteisto- tai järjestelmävaatimukset @fi
definition: Liittää aineiston laitteisiin tai järjestelmiin, joita tarvitaan analogiseen tai digitaaliseen sisältöön pääsemiseksi. @fi
label: hat Geräte- oder Systemanforderung @de
definition: Setzt eine Ressource in Beziehung zu einem Gerät oder einem System, das für die Verwendung, Wiedergabe und so weiter einer elektronisch-analogen oder digitalen Ressource erforderlich ist. @de
label: 有设备或系统要求 @zh-hans
definition: 将一种资源与存取一种电子模拟或数字资源内容所要求的系统或设备关联起来。 @zh-hans
label: eszköz- vagy rendszerkövetelménye a következő: @hu
definition: Hozzákapcsol egy forrást egy rendszerhez vagy eszközhöz, amely egy analóg vagy digitális forrás tartalmához való hozzáféréshez szükséges. @hu
label: ekipman veya sistem gereksinimi ile ilişkilidir @tr
definition: Bir kaynağı, elektronik analog veya dijital bir kaynağın içeriğine erişim için gerekli bir sistem veya ekipmanla ilişkilendirir. @tr

has equivalent
status: Published
definition: Relates a resource to a resource that carries the same content as a resource.
type: Property
sub property of: has equivalent resource relationship with (Deprecated)
lexical alias: equivalent.en
label: har ækvivalent @da
definition: Relaterer en ressource til en ressource, der omfatter det samme indhold som en anden ressouce. @da
label: heeft equivalent @nl
label: vastaava aineisto @fi
label: له مُتَكَافِئ @ar
definition: يربط بين مصدر ومصدر يحمل نفس المحتوى كمصدر. @ar
definition: Liittää aineiston aineistoon, jonka sisältö on sama kuin aineistossa. @fi
label: hat Äquivalent @de
definition: Setzt eine Ressource in Beziehung zu einer Ressource, die den gleichen Inhalt wie die andere Ressource hat. @de
label: 有等同 @zh-hans
definition: 将一种资源与和一种资源承载同样内容的一种资源关联起来。 @zh-hans
label: egyenértékű a következő: @hu
definition: Hozzákapcsol egy forrást egy forráshoz, amely forrásként ugyanazt a tartalmat hordozza. @hu
has subproperty: is also issued as
has subproperty: has mirror site
has subproperty: is reproduced as
has subproperty: is reproduction of
label: eşdeğer ile ilişkilidir @tr
definition: Bir kaynağı, kaynakla aynı içeriği taşıyan bir kaynakla ilişkilendirir. @tr

has equivalent resource relationship with (Deprecated)
status: Deprecated
type: Property
definition: Relates a resource to a resource that is equivalent to a related resource. (Deprecated)
lexical alias: equivalentResourceRelationshipWith.en
label: har ækvivalent ressource @da
definition: Relaterer en ressource til en ressource, der ækvivalent til en anden ressource. @da
has subproperty: has equivalent

is equivalent to
status: Published
lexical alias: equivalentTo.en
definition: Relates a nomen to a nomen that is an appellation of the same entity as another nomen.
type: Property
label: is equivalent aan @nl
label: هو مُكَافِئ لـ @ar
definition: يربط تسمية بتسمية عبارة عن اسم لكيان نفسه كتسمية أخرى. @ar
label: er tilsvarende til @da
definition: Relaterer et nomen til et nomen, som er en benævnelse af den samme entitet som et andet nomen. @da
label: vastaava nomen @fi
definition: Liittää nomenin nomeniin, joka on saman entiteetin nimitys kuin toinen nomen. @fi
label: ist äquivalent zu @de
definition: Setzt ein Nomen in Beziehung zu einem Nomen, das eine Bezeichnung für dieselbe Entität ist wie ein anderes Nomen. @de
label: 是等同于…… @zh-hans
definition: 将一个命名与和另一个命名一样作为同一个实体的一个称谓的一个命名关联起来。 @zh-hans
label: egyenértékű a következővel: @hu
definition: Hozzákapcsol egy noment egy nomenhez, amely ugyanannak az entitásnak a megnevezése, ami a másik nomen. @hu
label: eşdeğeridir @tr
definition: Bir ismi, başka bir isimle aynı varlığın adı olan bir isimle ilişkilendirir. @tr

has errata
status: Published
definition: Relates a resource to a resource that consists of errors discovered after the publication of a predominant resource, with their corrections.
type: Property
sub property of: is augmented by
inverse of: is errata to
lexical alias: errata.en
label: er errata @da
definition: Relaterer en ressource til en ressource, der består af rettelser af fejl, som er blevet opdaget efter publicering af hovedressourcen, med deres rettelser. @da
label: heeft errata @nl
label: aineiston painovirheluettelo @fi
label: له تصويبات @ar
definition: يربط بين مصدر ومصدر يتكون من أخطاء تم اكتشافها بعد نشر مصدر شائع، مع تصويباتها. @ar
definition: Liittää aineiston aineistoon, joka koostuu julkaisemisen jälkeen löytyneistä virheistä ja niiden korjauksista. @fi
label: hat Errata @de
definition: Setzt eine Ressource in Beziehung zu einer Ressource, die aus Fehlern und deren Korrekturen besteht, die nach der Veröffentlichung der Hauptressource entdeckt wurden. @de
label: 有勘误 @zh-hans
definition: 将一种资源与一个主要资源出版后被发现的错误及其更正组成的一种资源关联起来。 @zh-hans
label: hibajegyzéke a következő: @hu
definition: Hozzákapcsol egy forrást egy forráshoz, amely egy domináns forrás megjelentetése után felfedezett hibákból és azok javításaiból áll. @hu
label: düzeltme ile ilişkilidir @tr
definition: Bir kaynağı, baskın bir kaynağın yayınlanmasından sonra keşfedilen hataları düzeltmeleriyle birlikte oluşan bir kaynakla ilişkilendirir. @tr

is errata to
status: Published
definition: Relates a resource to a resource that is augmented by a list of errors in a predominant resource, discovered after publication, with their corrections.
type: Property
sub property of: is augmentation of
inverse of: has errata
lexical alias: errataTo.en
label: er errata til @da
definition: Relaterer en ressource til en ressource, der er beriget med en liste over rettelser af fejl, som er blevet opdaget efter publicering af hovedværket. @da
label: is errata bij @nl
label: aineiston painovirheluettelo @fi
label: هو تصويبات لـ @ar
definition: يربط بين مصدر ومصدر مزيَّد بقائمة أخطاء في مصدر سائد، تم اكتشافها بعد النشر، مع تصويباتها. @ar
definition: Liittää aineiston aineistoon, jota on laajennettu teoksen julkaisemisen jälkeen löytyneiden virheiden luettelolla ja niiden korjauksilla. @fi
label: ist Errata zu @de
definition: Setzt eine Ressource in Beziehung zu einer Ressource, die durch eine Liste von Fehlern, die nach Veröffentlichung der Hauptressource entdeckt wurden, und deren Korrekturen erweitert wird. @de
label: 是……的勘误 @zh-hans
definition: 将一种资源与被一种主要资源出版后发现的错误及其更正列表附增的一种资源关联起来。 @zh-hans
label: hibajegyzékkel ellátott @hu
definition: Hozzákapcsol egy forrást egy forráshoz, amelyet egy domináns forrásban bővítettek a megjelenés után felfedezett hibák listájával, valamint azok javításaival. @hu
label: düzeltmesidir @tr
definition: Bir kaynağı, yayınlandıktan sonra tespit edilen baskın bir kaynaktaki hataları ve düzeltmeleriyle artırılmış başka bir kaynakla ilişkilendirir. @tr

has etcher
status: Published
definition: Relates a resource to an agent who is responsible for creating a resource by subjecting metal, glass, or some other surface used for printing, to acid or another corrosive substance.
type: Property
inverse of: is etcher of
lexical alias: etcher.en
label: har raderer @da
definition: Relaterer en ressource til en agent, der har været involveret i fremstillingen af en ressource ved at udsætte metal, glas eller en anden overflade, der anvendes til trykning, for syre eller et andet ætsende stof. @da
label: heeft etser @nl
label: etsaaja @fi
sub property of: has printmaker
label: له حَفَّارُ بالزِنْكُوغْراف (الكليشيهات) @ar
definition: يربط مصدر بوكيل مسؤول عن إنتاج مصدر من خلال غمر معدن أو زجاج أو أي سطح آخر يستخدم للطباعة، لحامض، أو في أي مادة أخرى كاوية. @ar
definition: Liittää aineiston toimijaan, joka on vastuussa aineiston valmistamisesta etsaamalla metallia, lasia tai muuta pintaa hapon tai muun syövyttävän aineen avulla. @fi
label: hat Radiererin/Radierer @de
definition: Setzt eine Ressource in Beziehung zu einem Akteur, der für die Herstellung einer Ressource verantwortlich ist, indem er Metall, Glas oder eine andere Oberfläche, die zum Drucken benutzt wird, mit Säure oder einer anderen ätzenden Substanz behandelt. @de
label: 有蚀刻者 @zh-hans
definition: 将一种资源与通过使用酸或其他腐蚀性物质施于用来印刷的金属、玻璃或其他表面上而对一种资源的创建负责的一个行为者关联起来。 @zh-hans
definition: Relaciona un recurs amb un agent que és responsable de la creació d’un recurs sotmetent a l’àcid, o a qualsevol altra substància corrosiva, el metall, el vidre o qualsevol altra superfície usada en la impressió. @ca
label: karckészítője a következő: @hu
definition: Hozzákapcsol egy forrást egy ágenshez, amely felelős egy forrás gyártásáért oly módon, hogy nyomtatáshoz használt fém-, üveg- vagy valamilyen más felületet savnak vagy más maró anyagnak vet alá. @hu
label: oymacı ile ilişkilidir @tr
definition: Bir kaynağı, metal, cam veya baskı için kullanılan başka bir yüzeyi asit veya başka bir aşındırıcı maddeye maruz bırakarak bir kaynak oluşturmaktan sorumlu olan bir temsilci ile ilişkilendirir. @tr

is etcher of
status: Published
definition: Relates an agent to a resource that involves a responsibility of an agent for subjecting metal, glass, or some other surface used for printing, to acid or another corrosive substance.
type: Property
inverse of: has etcher
lexical alias: etcherOf.en
label: er raderer af @da
definition: Relaterer en agent, der har været involveret i fremstillingen af en ressource ved at udsætte metal, glas eller en anden overflade, der anvendes til trykning, for syre eller et andet ætsende stof til en ressource. @da
label: is etser van @nl
sub property of: is printmaker of
label: هو حَفَّارُ بالزِنْكُوغْراف (الكليشيهات) لـ @ar
definition: يربط بين وكيل ومصدر ينطوي على مسؤولية وكيل عن غمر معدن أو زجاج أو أي سطح آخر يستخدم للطباعة، في حامض أو في أي مادة أخرى كاوية. @ar
label: etsaaja (toimija) aineistossa @fi
definition: Liittää toimijan aineistoon, jossa toimija vastaa metallin, lasin tai muun pinnan etsaamisesta hapon tai muun syövyttävän aineen avulla. @fi
label: ist Radiererin/Radierer von @de
definition: Setzt einen Akteur in Beziehung zu einer Ressource, bei der ein Akteur dafür verantwortlich ist, Metall, Glas oder eine andere Oberfläche, die zum Drucken benutzt wird, mit Säure oder einer anderen ätzenden Substanz zu behandeln. @de
label: 是……的蚀刻者 @zh-hans
definition: 将一个行为者与涉及使用酸或其他腐蚀性物质施于用来印刷的金属、玻璃或其他表面上的一个行为者的责任的一种资源关联起来。 @zh-hans
label: karckészítője a következőnek: @hu
definition: Hozzákapcsol egy ágenst egy forráshoz, amelyhez hozzátartozik az ágens felelőssége nyomtatáshoz használt fém-, üveg- vagy valamilyen más felület savnak vagy más maró anyagnak történő alávetéséért. @hu
label: oymacısıdır @tr
definition: Bir temsilciyi, metal, cam veya baskı için kullanılan diğer bazı yüzeyleri asit veya başka bir aşındırıcı maddeye maruz bırakmaya ilişkin bir temsilcinin sorumluluğunu içeren bir kaynakla ilişkilendirir @tr

is evaluated by
status: Published
definition: Relates a resource to a resource that is an examination or judgement of a resource.
type: Property
inverse of: is evaluation of
label: er evalueret i @da
definition: Relaterer en ressource til en ressource, der undersøger eller bedømmer en beskreven ressource. @da
alternative label: is evaluated in
sub property of: is subject of
lexical alias: evaluatedBy.en
label: is beoordeeld in @nl
label: arviointi aineistosta @fi
label: هو مُقيم فى @ar
definition: يربط بين مصدر ومصدر يختبر أو يحكم على مصدر. @ar
definition: Liittää aineiston aineistoon, joka on tutkiva arviointi tai arvostelu aineistosta. @fi
alternative label: arvioitu aineisto @fi
label: ist evaluiert in @de
definition: Setzt eine Ressource in Beziehung zu einer Ressource, die eine Ressource untersucht oder beurteilt. @de
alternative label: 被评价于 @zh-hans
label: 被……评价 @zh-hans
definition: 将一种资源与作为一种资源之检查和判断的一种资源关联起来。 @zh-hans
alternative label: és avaluat en @ca
label: és avaluat per @ca
definition: Relaciona un recurs amb un recurs que és un examen o un judici d’un recurs. @ca
label: értékelve a következőben: @hu
definition: Hozzákapcsol egy forrást egy forráshoz, amely egy forrást vizsgál és ítél meg. @hu
has subproperty: is critiqued by
has subproperty: is reviewed by
alternative label: içinde değerlendirilmiştir @tr
label: tarafından değerlendirilmiştir @tr
definition: Bir kaynağı, bir kaynağın incelemesi veya değerlendirmesi olan bir kaynakla ilişkilendirir. @tr

is evaluation of
status: Published
definition: Relates a resource to a resource that is examined or judged.
type: Property
sub property of: is description of
inverse of: is evaluated by
lexical alias: evaluationOf.en
label: er evaluering af @da
definition: Relaterer en ressource til en ressource, der er undersøgt eller vurderet. @da
label: is beschouwing van @nl
label: arviointi aineistosta @fi
label: هو تقييم لـ @ar
definition: يربط بين مصدر ومصدر تم فحصه أو الحكم عليه. @ar
definition: Liittää aineiston tutkittuun tai arvioituun aineistoon. @fi
label: ist Evaluierung von @de
definition: Setzt eine Ressource in Beziehung zu einer Ressource, die geprüft oder beurteilt wird. @de
label: 是……的评价 @zh-hans
definition: 将一种资源与被检查或评判的一种资源关联起来。 @zh-hans
label: értékelése a következőnek: @hu
definition: Hozzákapcsol egy forrást egy forráshoz, amelyet elemeznek és megítélnek. @hu
label: değerlendirmesidir @tr
definition: Bir kaynağı incelenen veya değerlendirilen başka bir kaynakla ilişkilendirir. @tr

is expanded as
status: Published
definition: Relates a resource to a resource that enlarges upon the content of another resource.
type: Property
sub property of: has derivative
inverse of: is expanded version of
lexical alias: expandedAs.en
label: er udvidet til @da
definition: Relaterer en ressource til en ressource, der uddyber en oprindelig ressources indhold. @da
label: is uitgebreid als @nl
label: laajennelma @fi
label: هو مُوَسّع كـ @ar
definition: يربط بين مصدر ومصدر يتوسع في محتوى مصدر آخَر. @ar
definition: Liittää aineiston aineistoon, joka laajentaa toisen aineiston sisältöä. @fi
label: ist erweitert als @de
definition: Setzt eine Ressource in Beziehung zu einer Ressource, die den Inhalt einer anderen Ressource erweitert. @de
label: 被扩充为 @zh-hans
definition: 将一种资源与在另一种资源上扩充的一种资源关联起来。 @zh-hans
label: kibővítve a következőként: @hu
definition: Hozzákapcsol egy forrást egy forráshoz, amely egy másik forrás tartalmát tágítja. @hu
label: olarak genişletilmiştir @tr
definition: Bir kaynağı, başka bir kaynağın içeriğini genişleten kaynakla ilişkilendirir. @tr

is expanded version of
status: Published
definition: Relates a resource to a resource used as a basis for a derivative resource that enlarges upon the content of another resource.
type: Property
sub property of: has source
inverse of: is expanded as
lexical alias: expandedVersionOf.en
label: er udvidet version af @da
definition: Relaterer en ressource til en ressource, der er anvendt som grundlag for en afledt ressource, der uddyber en oprindelig ressources indhold. @da
label: is uitgebreide versie van @nl
label: laajennettu versio aineistosta @fi
label: هو إصدارة موسعة لـ @ar
definition: يربط بين مصدر ومصدر يُستخدم كأساس لمصدر مشتق يتوسع في محتوى مصدر آخَر. @ar
definition: Liittää aineiston aineistoon, jota on käytetty toisen aineiston sisältöä laajentavan johdannaisaineiston perustana. @fi
label: ist erweiterte Ausgabe von @de
definition: Setzt eine Ressource in Beziehung zu einer Ressource, die als Grundlage für eine abgeleitete Ressource verwendet wird, die den Inhalt einer anderen Ressource näher erläutert. @de
label: 是……的扩充版 @zh-hans
definition: 将一种资源与被用作在另一种资源之内容基础上扩充的一种衍生资源的基础的一种资源关联起来。 @zh-hans
label: bővített változata a következőnek: @hu
definition: Hozzákapcsol egy forrást egy forráshoz, amelyet alapként használnak egy másik forrás tartalmát tágító származékos forráshoz. @hu
label: genişletilmiş sürümüdür @tr
definition: Bir kaynağı, başka bir kaynağın içeriğini genişleten türev bir kaynağın temeli olarak kullanılan bir kaynakla ilişkilendirir. @tr

has extension plan
status: Published
lexical alias: extensionPlan.en
definition: Relates a resource to a categorization reflecting an intention to extend the content of a resource.
type: Property
label: heeft extensieplan @nl
label: له خطة توسع @ar
definition: يربط بين مصدر وفئة تعكس نية لتوسيع محتوى مصدر. @ar
label: har udvidelsesplan @da
definition: Relaterer en ressource til en kategorisering, som afspejler en hensigt om at udvide indholdet af en ressource. @da
label: aineiston laajennussuunnitelma @fi
definition: Liitää aineiston kategorisointiin, joka ilmaisee aikomuksen laajentaa aineiston sisältöä. @fi
label: hat Erweiterungsplan @de
definition: Setzt eine Ressource in Beziehung zu einer Kategorisierung der Absicht, ob beziehungsweise wie der Inhalt einer Ressource erweitert werden soll. @de
label: 有扩充计划 @zh-hans
definition: 将一种资源与反映扩充一种资源之内容的意向的一种类别关联起来。 @zh-hans
label: közzétételi terve a következő: @hu
definition: Hozzákapcsol egy forrást egy kategorizáláshoz, amely tükröz egy forrás tartalmának közzétételére vonatkozó szándékot. @hu
label: genişletme planı ile ilişkilidir @tr
definition: Bir kaynağı, bir kaynağın içeriğini genişletme hedefini yansıtan bir sınıflandırmayla ilişkilendirir. @tr

has extent
status: Published
definition: Relates a resource to a type, number, and measurement unit that quantify an aspect of the extent of a resource.
type: Property
lexical alias: extent.en
label: har omfang @da
definition: Relaterer en ressource til antal og type af enheder og/eller underenheder, der udgør en ressource. @da
label: heeft omvang @nl
label: له امتداد @ar
definition: يربط بين مصدر ونوع، رقم، ووحدة القياس التي تحدد جانبًا من مدى مصدر. @ar
label: aineiston laajuus @fi
definition: Liittää aineiston tyyppiin, lukuun ja mittayksikköön, jotka ilmaisevat aineiston laajuutta. @fi
label: hat Umfang @de
definition: Setzt eine Ressource in Beziehung zu einer Art, Nummer und Maßeinheit, die eine Eigenschaft des Umfangs einer Ressource beziffert. @de
label: 有数量 @zh-hans
definition: 将一种资源与把一种资源的一个数量方面定量化的一个类型、数字和计量单位关联起来。 @zh-hans
label: terjedelme a következő: @hu
definition: Hozzákapcsol egy forrást egy típushoz, számhoz és mértékegységhez, amely a forrás terjedelmének számszerű aspektusa. @hu
label: kapsam ile ilişkilidir @tr
definition: Bir kaynağı, kaynağın kapsamının bir yönünü ölçen bir tür, sayı ve ölçüm birimi ile ilişkilendirir. @tr

has facsimile
status: Published
definition: Relates a resource to a resource that exactly reproduces a related resource embodying a resource.
type: Property
sub property of: is reproduced as
inverse of: is facsimile of
lexical alias: facsimile.en
label: har faksimile @da
definition: Relaterer en ressource til en ressource, der er en nøjagtig reproduktion af en anden ressource. @da
label: heeft facsimile @nl
label: näköispainos aineistosta @fi
label: له نسخة طبق الأصل. @ar
definition: يربط بين مصدر ومصدر يستنسخ بشكل تام مصدر ذو صلة يُجسد مصدر. @ar
definition: Liittää aineiston aineistoon, joka on toisen, liittyvän aineiston tarkka jäljennös. @fi
label: ist Faksimile @de
definition: Setzt eine Ressource in Beziehung zu einer Ressource, die eine in Beziehung stehende Ressource, die eine Ressource verkörpert, exakt reproduziert. @de
label: 有摹真品 @zh-hans
definition: 将一种资源与精确复制具体化一种资源的一种关联资源的一种资源关联起来。 @zh-hans
label: hasonmása a következő: @hu
definition: Hozzákapcsol egy forrást egy forráshoz, amely pontos másolata egy forrásban megtestesülő kapcsolódó forrásnak. @hu
has subproperty: has preservation facsimile
label: tıpkıbasım ile ilişkilidir @tr
definition: Bir kaynağı, bir kaynağı bünyesinde barındıran ilgili bir kaynağı birebir yeniden üreten bir kaynakla ilişkilendirir. @tr

is facsimile of
status: Published
definition: Relates a resource to a resource that is used as a basis for an exact reproduction.
type: Property
sub property of: is reproduction of
inverse of: has facsimile
lexical alias: facsimileOf.en
label: er faksimile af @da
definition: Relaterer en ressource til en ressource, der er anvendt som grundlag for en nøjagtig reproduktion. @da
label: is facsimile van @nl
label: aineiston näköispainos @fi
label: هو نسخة طبق الأصل من @ar
definition: يربط بين مصدر ومصدر يُستخدم كأساس لعملية الإستنساخ الدقيق. @ar
definition: Liittää aineiston täsmällisen jäljennöksen perustana olevaan aineistoon. @fi
label: ist Faksimile @de
definition: Setzt eine Ressource in Beziehung zu einer Ressource, die als Grundlage für eine exakte Reproduktion verwendet wird. @de
label: 是……的摹真品 @zh-hans
definition: 将一种资源与被用作一种精确复制品之基础的一种资源关联起来。 @zh-hans
label: hasonmása a következőnek: @hu
definition: Hozzákapcsol egy forrást egy forráshoz, amelyet egy pontos másolat alapjaként használnak. @hu
has subproperty: is preservation facsimile of
label: tıpkıbasımıdır @tr
definition: Bir kaynağı, tam bir yeniden üretim için temel olarak kullanılan bir kaynakla ilişkilendirir. @tr

has facsimile part
status: Published
definition: Relates a resource to a resource used as a basis for an exact reproduction that is a discrete component of a larger entity.
type: Property
sub property of: has part resource
inverse of: is facsimile part of
lexical alias: facsimilePart.en
label: er faksimile der indeholder @da
definition: Relaterer en ressource til en ressource, der er anvendt som grundlag for en nøjagtig reproduktion, som udgør en separat del af en større entitet. @da
label: heeft facsimile deel @nl
label: aineiston näköispainososa @fi
label: له جزء طبق الأصل @ar
definition: يربط بين مصدر ومصدر يُستخدم كأساس لإعادة إنتاج طبق الأصل تكون مكونًا منفصلاً لكيان أكبر. @ar
definition: Liittää aineiston täsmällisen jäljennöksen perustana olevaan aineistoon, joka on laajemman kokonaisuuden erillinen osa. @fi
label: hat enthaltenes Faksimile von @de
definition: Setzt eine Ressource in Beziehung zu einer Ressource, die als Grundlage für eine exakte Reproduktion verwendet wird, die ein eigenständiger Bestandteil einer größeren Entität ist. @de
label: 有摹真品部分 @zh-hans
definition: 将一种资源与被用作一种精确复制品之基础并是一种更大实体的独立组成部分的一种资源关联起来。 @zh-hans
label: hasonmás része a következő: @hu
definition: Hozzákapcsol egy forrást egy forráshoz, amelyet alapként használnak egy nagyobb entitás elkülöníthető alkotóelemének pontos másolatához. @hu
label: tıpkıbasım parçası ile ilişkilidir @tr
definition: Bir kaynağı, daha büyük bir varlığın ayrık bileşeni olan tam bir yeniden üretim için temel olarak kullanılan bir kaynakla ilişkilendirir. @tr

is facsimile part of
status: Published
definition: Relates a resource to a larger resource of which a part is a discrete component that exactly reproduces a related resource embodying a resource.
type: Property
sub property of: is part of resource
inverse of: has facsimile part
lexical alias: facsimilePartOf.en
label: er faksimile indeholdt i @da
definition: Relaterer en ressource til en større ressource, hvoraf en del udgør en separat del, der er en nøjagtig reproduktion af en anden ressource, der omfatter den samme ressource. @da
label: is facsimile deel van @nl
label: näköispainos sisältyy aineistoon @fi
label: هو جزء طبق الأصل لـ @ar
definition: يربط بين مصدر ومصدر أكبر بحيث يُشكل جزء منه عنصرًا منفصلًا يقوم باستنساخ مصدر يجسد المصادر ذات الصلة بشكل حرفي. @ar
definition: Liittää aineiston laajempaan aineistoon, jonka osana on erillinen, liittyvän aineiston tarkasti kopioiva aineisto. @fi
label: ist Faksimile als Teil von @de
definition: Setzt eine Ressource in Beziehung zu einer größeren Ressource, von der ein Teil ein einzelnen Bestandteil ist, der eine in Beziehung stehende Ressource, die eine Ressource verkörpert, exakt reproduziert. @de
label: 是……的摹真品部分 @zh-hans
definition: 将一种资源与有独立组成部分精确复制具体化一种资源的一种关联资源的一种更大的资源关联起来。 @zh-hans
label: hasonmásrésze a következőnek: @hu
definition: Hozzákapcsol egy forrást egy nagyobb forráshoz, amelynek része egy olyan elkülöníthető alkotóelem, amely pontos másolata a forrásban megtestesülő kapcsolódó forrásnak. @hu
label: tıpkıbasım bileşenidir @tr
definition: Bir kaynağı; bir parçanın, içeriğinde kaynak bulunan ilgili bir kaynağı birebir yeniden üreten ayrık bileşen olduğu daha büyük bir kaynak ile ilişkilendirir. @tr

has fellow student
status: Published
type: Property
lexical alias: fellowStudent.en
definition: Relates an agent to an agent who is an associate of another student who is also formally engaged in learning.
sub property of: has related agent of agent
label: har medstuderende @da
definition: Relaterer en agent til en en anden students kollega, der også er formelt beskæftigt med at studere. @da
label: heeft medestudent @nl
label: له زميل دراسة @ar
definition: يربط بين وكيل وزميل طالب آخر ينخرط أيضًا في التعلم بصورة رسمية. @ar
label: opiskelutoveri (toimija) @fi
definition: Liittää toimijan kanssaopiskelijaan, joka myös virallisesti opiskelee. @fi
label: hat Kommilitonin/Kommilitonen @de
definition: Setzt einen Akteur in Beziehung zu einer Studienkollegin/einem Studienkollegen einer anderen Studentin/eines anderen Studenten, die/der sich ebenfalls offiziell mit Studieren befasst. @de
label: 有同学 @zh-hans
definition: 将一个行为者与作为另一个也是正式参加学习的学生的伙伴的一个行为者关联起来。 @zh-hans
definition: Relaciona un agent amb un agent que és un associat d’un altre estudiant que també es dedica formalment a l’aprenentatge. @ca
label: tanulótársa a következő: @hu
definition: Hozzákapcsol egy ágenst egy ágenshez, aki egy másik, a tanulásban szintén formálisan részt vevő tanulónak a társa. @hu
label: okul arkadaşı ile ilişkilidir @tr
definition: Bir temsilciyi, kendisi de resmi olarak öğrenmeyle meşgul olan başka bir öğrencinin bir arkadaşıyla ilişkilendirir. @tr

has field of activity of agent
status: Published
definition: Relates an agent to a field of endeavor, area of competence, or responsibility in which an agent is engaged.
type: Property
lexical alias: fieldOfActivityOfAgent.en
label: har agents virkefelt @da
definition: Relaterer en ressource til det område inden for hvilket en agent er eller var engageret. @da
label: heeft veld van activiteit van actor @nl
label: toimijan toiminta-ala @fi
label: له مجال نشاط لوكيل @ar
definition: يربط بين وكيل ومجال عمل، مجال خبرة، اختصاص، مسؤولية، سلطة إلخ.، الذي يمارسه الوكيل @ar
definition: Liittää toimijan toimijan pyrkimykseen, asiantuntemukseen, kompetenssiin, vastuuseen, toimivaltaan tms @fi
label: hat Betätigungsfeld eines Akteurs @de
definition: Setzt einen Akteur in Beziehung zu einem Tätigkeitsfeld, einem Wissensgebiet, einem Kompetenzbereich, einer Verantwortlichkeitsangabe, einer Zuständigkeit und so weiter, in dem/der ein Akteur aktiv ist. @de
label: 有行为者的活动领域 @zh-hans
definition: 将一个行为者与一个行为者的努力领域、能力范围或担负责任关联起来。 @zh-hans
definition: Relaciona un agent amb un camp d’esforç, àrea de competència o responsabilitat en la qual un agent es compromet. @ca
label: ágens tevékenységi köre a következő: @hu
definition: Hozzákapcsol egy ágenst egy tevékenységhez, szakterülethez, illetékességi, felelősségi, joghatósági, stb. területhez, amely iránt az ágens elkötelezett. @hu
label: temsilcinin faaliyet alanı ile ilişkilidir @tr
definition: Bir temsilciyi, bir temsilcinin dahil olduğu bir uğraş alanı, uzmanlık alanı, yeterlilik, sorumluluk, yetki alanı vb. ile ilişkilendirir. @tr

has file size
status: Published
definition: Relates a resource to a number of bytes in a digital file.
type: Property
sub property of: has digital file characteristic
lexical alias: fileSize.en
label: har filstørrelse @da
definition: Relaterer en ressource til antal bytes i en digital fil. @da
label: heeft bestandsgrootte @nl
label: له حجم ملف @ar
definition: يربط بين مصدر وعدد البايتات في ملف رقمي. @ar
label: aineiston tiedoston koko @fi
definition: Liittää aineiston digitaalisen tiedoston tavumäärään. @fi
label: hat Dateigröße @de
definition: Setzt eine Ressource in Beziehung zu einer Anzahl der Bytes in einer Datei. @de
label: 有文件大小 @zh-hans
definition: 将一种资源与一个数字文件中的字节数关联起来。 @zh-hans
label: fájlmérete a következő: @hu
definition: Hozzákapcsol egy forrást egy digitális fájl bájtjainak számához. @hu
label: dosya boyutu ile ilişkilidir @tr
definition: Bir kaynağı, dijital bir doyadaki bit sayılarıyla ilişkilendirir. @tr

has file type
status: Published
definition: Relates a resource to a general type of data content encoded in a computer file.
type: Property
sub property of: has digital file characteristic
lexical alias: fileType.en
label: har filtype @da
definition: Relaterer en ressource til en betegnelse for type af dataindhold, der er kodet i en computerfil. @da
label: heeft bestandstype @nl
label: aineiston tiedostotyyppi @fi
label: له نوع الملف @ar
definition: يربط بين مصدر ونوع عام لمحتوى بيانات تم تشفيرها في ملف كمبيوتر. @ar
definition: Liittää aineiston tiedostoon koodatun datasisällön yleiseen tyyppiin @fi
label: hat Dateityp @de
definition: Setzt eine Ressource in Beziehung zu den Details zu einer allgemeinen Art von Dateninhalt, der in einer Datei kodiert ist. @de
label: 有文件类型 @zh-hans
definition: 将一种资源与计算机文件中编码的数据内容的一般类型关联起来。 @zh-hans
label: fájltípusa a következő: @hu
definition: Hozzákapcsol egy forrást egy számítógépes fájlban kódolt adattartalom általános típusához. @hu
label: dosya türü ile ilişkilidir @tr
definition: Bir kaynağı, bir bilgisayar dosyasında kodlanmış genel bir veri içeriği türüyle ilişkilendirir. @tr

has film director
status: Published
definition: Relates a resource to an agent who is a director who is responsible for the general management and supervision of a filmed performance.
type: Property
sub property of: has director
inverse of: is film director of
lexical alias: filmDirector.en
label: filminstruktør @da
definition: Relaterer en ressource til en instruktør, der er ansvarlig for ledelse og tilsyn med en filmoptagelse. @da
label: heeft filmregisseur @nl
label: elokuvaohjaaja aineistossa @fi
label: له مخرج فيلم @ar
definition: يربط مصدر بوكيل يعمل بصفته مخرجًا مسؤولًا عن الإدارة العامة والإشراف على أداء الفيلم. @ar
definition: Liittää aineiston toimijaan, joka ohjaajana vastaa elokuvatun esityksen yleisestä johtamisesta ja valvonnasta. @fi
label: hat Filmregisseurin/Filmregisseur @de
definition: Setzt eine Ressource in Beziehung zu einer Regisseurin/einem Regisseur, die/der für das allgemeine Management und die Leitung einer verfilmten Darbietung verantwortlich ist. @de
label: 有电影导演 @zh-hans
definition: 将一种资源与作为一个导演并负责拍摄表演的总体管理和监督的一个行为者关联起来。 @zh-hans
label: filmrendezője a következő: @hu
definition: Hozzákapcsol egy forrást egy ágenshez, amely felelős egy filmre vett előadás általános menedzseléséért és felügyeletéért. @hu
label: film yönetmeni ile ilişkilidir @tr
definition: Bir kaynağı, filme alınmış bir performansın genel yönetimi ve denetiminden sorumlu bir yönetmen olan bir temsilci ile ilişkilendirir. @tr

is film director of
status: Published
definition: Relates an agent to a resource that involves a responsibility of an agent for the general management and supervision of a filmed performance.
type: Property
sub property of: is director of
inverse of: has film director
lexical alias: filmDirectorOf.en
label: er filminstruktør af @da
definition: Relaterer en instruktør der er ansvarlig for ledelse og tilsyn med en filmoptagelse til en ressource. @da
label: is filmregisseur van @nl
label: elokuvan ohjaaja (toimija) aineistossa @fi
label: هو مخرج فيلم لـ @ar
definition: يربط بين وكيل ومصدر ينطوي على مسؤولية وكيل عن الإدارة العامة والإشراف على أداء مصور. @ar
definition: Liittää toimijan aineistoon, jossa toimija vastaa elokuvan yleisestä johtamisesta ja valvonnasta. @fi
label: ist Filmregisseurin/Filmregisseur von @de
definition: Setzt einen Akteur in Beziehung zu einer Ressource, bei der ein Akteur für das allgemeine Management und die Leitung einer verfilmten Darbietung verantwortlich ist. @de
label: 是……的电影导演 @zh-hans
definition: 将一个行为者与涉及拍摄表演的总体管理和监督的一个行为者的责任的一种资源关联起来。 @zh-hans
label: filmrendezője a következőnek: @hu
definition: Hozzákapcsol egy ágenst egy forráshoz, amelyhez hozzátartozik az ágens felelőssége egy filmforgatás általános menedzseléséért és felügyeletéért. @hu
label: filminin yönetmenidir @tr
definition: Bir temsilciyi, filme alınmış bir performansın genel yönetimi ve denetimine ilişkin bir temsilcinin sorumluluğunu içeren bir kaynakla ilişkilendirir. @tr

has film distributor
status: Published
definition: Relates a resource to an agent who is responsible for distributing a moving image resource to theatres or other distribution channels.
type: Property
sub property of: has distributor
inverse of: is film distributor of
lexical alias: filmDistributor.en
label: har filmdistributør @da
definition: Relaterer en ressource til en agent, der har været involveret i distribueringen af en levende billed-ressource til biografer eller andre distributionskanaler. @da
label: heeft filmdistributeur @nl
label: elokuvan jakelija aineistossa @fi
label: له موزع فيلم @ar
definition: يربط مصدر بوكيل مسؤول عن توزيع مصدر فيلم على قاعات العرض أو عبر قنوات أخرى. @ar
definition: Liittää aineiston toimijaan, joka on vastuussa elokuvan tms. aineiston jakamisesta elokuvateattereille tai muille jakelukanaville. @fi
label: hat Filmvertrieb @de
definition: Setzt eine Ressource in Beziehung zu einem Akteur, der für den Vertrieb einer Bewegtbildressource an Kinos oder andere Vertriebskanäle verantwortlich ist. @de
label: 有电影发行者 @zh-hans
definition: 将一种资源与负责向剧院或其他发行渠道发行动态图像资源的一个行为者关联起来。 @zh-hans
label: filmterjesztője a következő: @hu
definition: Hozzákapcsol egy forrást egy ágenshez, amely felelős egy mozgóképforrás terjesztéséért filmszínházak vagy más disztribúciós csatornák számára. @hu
label: film dağıtımcısı ile ilişkilidir @tr
definition: Bir kaynağı, hareketli görüntü kaynağını tiyatrolara veya diğer dağıtım kanallarına dağıtmaktan sorumlu olan bir temsilci ile ilişkilendirir. @tr

is film distributor of
status: Published
definition: Relates an agent to a resource that involves a responsibility of an agent for distribution of a moving image to theatres or other channels.
type: Property
sub property of: is distributor of
inverse of: has film distributor
lexical alias: filmDistributorOf.en
label: er filmdistributør af @da
definition: Relaterer en agent, der har været involveret i distribueringen af en levende billed-ressource til biografer eller andre distributionskanaler til en ressource. @da
label: is filmdistributeur van @nl
label: هو موزع أفلام لـ @ar
definition: يربط بين وكيل ومصدر ينطوي على مسؤولية وكيل عن توزيع فيلم على قاعات العرض أو عبر قنوات أخرى. @ar
label: elokuvan jakelija (toimija) aineistossa @fi
definition: Liittää toimijan aineistoon, jossa toimija vastaa elokuvan tms. aineiston jakelusta elokuvateattereille tai muille jakelukanaville. @fi
label: ist Filmvertrieb von @de
definition: Setzt einen Akteur in Beziehung zu einer Ressource, bei der ein Akteur für den Vertrieb eines Bewegtbilds an Kinos oder andere Vertriebskanäle verantwortlich ist. @de
label: 是……的电影发行者 @zh-hans
definition: 将一个行为者与涉及向剧院或其他渠道发行动态图像的一个行为者的责任的一种资源关联起来。 @zh-hans
label: filmterjesztője a következőnek: @hu
definition: Hozzákapcsol egy ágenst egy forráshoz, amelyhez hozzátartozik az ágens felelőssége mozgóképszínházak vagy más csatornák útján történő terjesztéséért. @hu
label: film dağıtımcısıdır @tr
definition: Bir temsilciyi, hareketli bir görüntünün sinemalara veya diğer kanallara dağıtılmasıyla görevli bir temsilcinin sorumluluğunu içeren bir kaynakla ilişkilendirir. @tr

is filmed with
status: Published
definition: Relates a resource to a resource that is contained on the same microform as a resource.
type: Property
sub property of: is on carrier unit with
lexical alias: filmedWith.en
label: er filmet med @da
definition: Relaterer en ressource til en ressource, der er udgivet på den samme mikroform som en ressource, der beskrives. @da
label: is gefilmd met @nl
label: filmillä myös (aineisto) @fi
label: هو مصور مع @ar
definition: يربط بين مصدر ومصدر موجود على الميكروفورم نفسه كمصدر. @ar
definition: Liittää aineiston samalle mikrofilmille tallennettuun toiseen aineistoon. @fi
label: ist verfilmt mit @de
definition: Setzt eine Ressource in Beziehung zu einer Ressource, die auf derselben Mikroform enthalten ist, wie eine Ressource. @de
label: 与……合拍 @zh-hans
definition: 将一种资源与和一种资源一起包含在同一件缩微品中的一种资源关联起来。 @zh-hans
label: azonos filmen a következővel: @hu
definition: Hozzákapcsol egy forrást egy forráshoz, amely ugyanazon a mikroformátumú hordozón található, mint a forrás. @hu
label: ile birlikte çekilmiştir @tr
definition: Bir kaynağı, kaynakla aynı mikroformda bulunan bir kaynakla ilişkilendirir. @tr

has filmmaker
status: Published
definition: Relates a resource to an agent who is responsible for creating an independent or personal film.
type: Property
sub property of: has creator
inverse of: is filmmaker of
lexical alias: filmmaker.en
label: har filmskaber @da
definition: Relaterer en ressource til en agent, der er ansvarlig for at have skabt en uafhængig eller personlig film. @da
label: heeft filmmaker @nl
label: aineiston elokuvantekijä @fi
label: له صانع أفلام @ar
definition: يربط مصدر بوكيل مسؤول عن إنشاء فيلم مستقل أو شخصي. @ar
definition: Liittää aineiston toimijaan, joka vastaa itsenäisen tai henkilökohtaisen elokuvan luomisesta. @fi
label: hat Filmemacherin/Filmemacher @de
definition: Setzt eine Ressource in Beziehung zu einem Akteur, der für die Schaffung eines unabhängigen oder privaten Films verantwortlich ist. @de
label: 有制片人 @zh-hans
definition: 将一种资源与负责创建一种独立或个人电影的一个行为者关联起来。 @zh-hans
label: filmkészítője a következő: @hu
definition: Hozzákapcsol egy forrást egy ágenshez, amely felelős egy független- vagy egy magánfilm létrehozásáért. @hu
label: film üreticisi ile ilişkilidir @tr
definition: Bir kaynağı, bağımsız veya kişisel bir film oluşturmaktan sorumlu olan bir temsilci ile ilişkilendirir. @tr

is filmmaker of
status: Published
definition: Relates an agent to a resource that involves a responsibility of an agent for an independent or personal film.
type: Property
sub property of: is creator of
inverse of: has filmmaker
lexical alias: filmmakerOf.en
label: er filmskaber til @da
definition: Relaterer en agent der er ansvarlig for at have skabt en uafhængig eller personlig film til en ressource. @da
label: is filmmaker van @nl
label: هو صانع أفلام لـ @ar
definition: يربط بين وكيل ومصدر ينطوي على مسؤولية وكيل عن فيلم مستقل أو شخصي. @ar
label: elokuvantekijä (toimija) aineistossa @fi
definition: Liittää toimijan aineistoon, jossa toimija vastaa itsenäisen tai henkilökohtaisen elokuvan luomisesta. @fi
label: ist Filmemacherin/Filmemacher von @de
definition: Setzt einen Akteur in Beziehung zu einer Ressource, bei der ein Akteur für die Schaffung eines unabhängigen oder privaten Films verantwortlich ist. @de
label: 是……的制片人 @zh-hans
definition: 将一个行为者与涉及创作一部独立或个人电影的一个行为者的责任的一种资源关联起来。 @zh-hans
label: filmkészítője a következőnek: @hu
definition: Hozzákapcsol egy ágenst egy forráshoz, amelyhez hozzátartozik egy ágens felelőssége egy független- vagy magánfilmért. @hu
label: film üreticisidir @tr
definition: Bir temsilciyi, bağımsız veya kişisel bir filme ilişkin bir temsilcinin sorumluluğu içeren bir kaynakla ilişkilendirir. @tr

has film producer
status: Published
definition: Relates a resource to an agent who is a producer who is responsible for most of the business aspects of the production of a film.
type: Property
sub property of: has producer
inverse of: is film producer of
lexical alias: filmProducer.en
label: har filmproducer @da
definition: Relaterer en ressource til en producer, der er ansvarlig for størstedelen af de forretningsmæssige aspekter ved en film. @da
label: heeft filmproducent @nl
label: elokuvatuottaja aineistossa @fi
label: له مُنتِج فيلم @ar
definition: يربط مصدر بوكيل يكون مُنتِجًا مسؤولًا عن معظم الجوانب التجارية لإنتاج فيلم. @ar
definition: Liittää aineiston toimijaan, joka on vastuussa suurimmasta osasta elokuvan liiketoimintaa. @fi
label: hat Filmproduzentin/Filmproduzenten @de
definition: Setzt eine Ressource in Beziehung zu einer Produzentin/einem Produzenten, die/der für die meisten geschäftlichen Aspekte bei der Produktion eines Films verantwortlich ist. @de
label: 有电影制作者 @zh-hans
definition: 将一种资源与作为制作者并负责电影制作的大部分商业运作的一个行为者关联起来。 @zh-hans
label: filmproducere következő: @hu
definition: Hozzákapcsol egy forrást egy producer ágenshez, aki felelős egy filmprodukció üzleti vonatkozásainak a zöméért. @hu
definition: Relaciona un recurs amb un agent que és un productor que és responsable de la majoria dels aspectes comercials de la producció d’una pel·lícula. @ca
label: film yapımcısı ile ilişkilidir @tr
definition: Bir kaynağı, bir filmin yapımının ticari yönlerinin çoğundan sorumlu olan bir yapımcı olan bir temsilci ile ilişkilendirir. @tr

is film producer of
status: Published
definition: Relates an agent to a resource that involves a responsibility of an agent for most of the business aspects of the production of a film.
type: Property
sub property of: is producer of
inverse of: has film producer
lexical alias: filmProducerOf.en
label: er filmproducer af @da
definition: Relaterer en producer, der er ansvarlig for størstedelen af de forretningsmæssige aspekter ved en film til en ressource. @da
label: is filmproducent van @nl
label: elokuvatuottajana aineistossa @fi
label: هو منتج الفيلم لـ @ar
definition: يربط بين وكيل ومصدر ينطوي على مسؤولية وكيل عن معظم الجوانب التجارية لإنتاج فيلم. @ar
definition: Liittää toimijan aineistoon, jossa toimija vastaa suurimmasta osasta elokuvan liiketoimintaa. @fi
label: ist Filmproduzentin/Filmproduzent von @de
definition: Setzt einen Akteur in Beziehung zu einer Ressource, bei der ein Akteur für die meisten geschäftlichen Aspekte bei der Produktion eines Films verantwortlich ist. @de
label: 是……的电影制作人 @zh-hans
definition: 将一个行为者与涉及电影制作的大部分商业运作的一个行为者的责任的一种资源关联起来。 @zh-hans
label: filmproducere a következőnek: @hu
definition: Hozzákapcsol egy ágenst egy forráshoz, amelyhez hozzátartozik egy ágens felelőssége egy filmprodukció legtöbb üzleti vonatkozásáért. @hu
label: film yapımcısıdır @tr
definition: Bir temsilciyi, bir film yapımının ticari yönlerinin çoğu için sorumluluğun bir temsilciye ait olduğu bir kaynakla ilişkilendirir. @tr

has finding aid
status: Published
definition: Relates a resource to a resource that is a metadata description set for a collection resource.
type: Property
inverse of: is finding aid of
lexical alias: findingAid.en
label: er hjælpeverktøj @da
definition: Relaterer en ressource til en ressource, der giver en vejledning til organiseringen, ordningen og indholdet af en arkivsamling. @da
sub property of: is described with metadata by
label: heeft vind-hulpmiddel @nl
label: luettelo (aineisto) @fi
label: له معينات البحث @ar
definition: يربط بين مصدر ومصدر يوفر دليلًا لتنظيم، ترتيب واحتواء مجموعة أرشيفية. @ar
definition: Liittää aineiston aineistoon joka on kokoelma-aineiston metatietokokonaisuus. @fi
label: hat Findmittel @de
definition: Setzt eine Ressource in Beziehung zu einer Ressource, die eine Orientierungshilfe zum Aufbau, zur Anordnung und zu den Inhalten einer Archivsammlung enthält. @de
label: 有查询工具 @zh-hans
definition: 将一种资源与作为一种收藏资源之元数据描述集合的一种资源关联起来。 @zh-hans
definition: Relaciona un recurs amb un recurs que és un conjunt de descripció de metadades d’un recurs de col·lecció de recursos. @ca
label: keresési segédlete a következő: @hu
definition: Hozzákapcsol egy forrást egy forráshoz, amely útmutatóval látja el egy levéltári gyűjtemény szervezetét, elrendezését és tartalmát. @hu
has subproperty: has catalogue
has subproperty: has hierarchic finding aid
label: rehber bilgi ile ilişkilidir @tr
definition: Bir kaynağı, bir koleksiyon kaynağı hakkında üstveri seti olan bir başka bir kaynakla ilişkilendirir. @tr

is finding aid of
status: Published
definition: Relates a resource to a resource that is a collection resource that is described by a metadata description set.
type: Property
inverse of: has finding aid
label: er hjælpeverktøj til @da
definition: Relaterer en ressource til en arkivsamling, der er beskrevet i et hjælpeværktøj, dvs. en vejledning om organisering, ordning og indhold af samlingen. @da
alternative label: is finding aid for
sub property of: is description of
lexical alias: findingAidOf.en
label: is vind-hulpmiddel voor @nl
label: luettelo aineistoon @fi
label: هو معينات البحث لـ @ar
definition: يربط بين مصدر ومصدر يمثل مجموعة أرشيفية موصوفة في دليل لتنظيم، ترتيب، وفهرسة المجموعة. @ar
definition: Liittää aineiston aineistoon, joka on metatietokokonaisuudella kuvailtu kokoelma-aineisto. @fi
alternative label: luettelo aineistolle @fi
label: ist Findmittel für @de
definition: Setzt eine Ressource in Beziehung zu einer Archivsammlung, die in einer Orientierungshilfe zum Aufbau, zur Anordnung und zu den Inhalten beschrieben ist. @de
label: 是……的查询工具 @zh-hans
definition: 将一种资源与作为一种收藏资源并被一种元数据描述集合描述的一种资源关联起来。 @zh-hans
alternative label: és instrument de descripció per @ca
label: és instrument de descripció de @ca
definition: Relaciona un recurs amb un recurs que és un recurs de col·lecció de recursos que és descrit per un conjunt de descripció de metadades. @ca
label: keresési segédlet a következőhöz: @hu
definition: Hozzákapcsol egy forrást egy levéltári gyűjtemény forrásához, amelyet leírnak a gyűjtemény szervezetének, elrendezésének és tartalmának a kalauzában. @hu
has subproperty: is catalogue of
has subproperty: is hierarchic finding aid of
alternative label: için rehber bilgidir @tr
label: rehber bilgisidir @tr
definition: Bir kaynağı, bir üstveri seti tarafından tanımlanmış bir koleksiyon kaynağı olan bir kaynakla ilişkilendirir. @tr

has fingerprint
status: Published
type: Property
lexical alias: fingerprint.en
definition: Relates a resource to an identifier for resource that consists of a group of characters from specified locations in a resource combined with a date of publication or other element.
sub property of: has identifier for resource
inverse of: is fingerprint of
label: heeft vingerafdruk @nl
label: له بصمة @ar
definition: يربط بين مصدر ومعرف لمصدر يتضمن مجموعة تمثيلات من مواقع محددة فى مصدر مدمج مع تاريخ نشر أو عنصر آخر. @ar
label: har fingeraftryk @da
definition: Relaterer en ressource til en identifikator for en ressource, som består af en gruppe tegn fra bestemte steder i en ressource, kombineret med et udgivelsesdato eller et andet element. @da
label: aineiston sormenjälkitunniste @fi
definition: Liittää aineiston tunnisteeseen, muodostuu aineiston tietyistä kohdista poimittujen merkkien yhdistämisestä julkaisuaikaan tai muihin elementteihin. @fi
label: hat Fingerprint @de
definition: Setzt eine Ressource in Beziehung zu einem Identifikator für eine Ressource, der aus einer Kombination von einer Gruppe von Zeichen von bestimmten Stellen einer Ressource und einem Veröffentlichungsdatum oder einem anderen Element besteht. @de
label: 有指纹 @zh-hans
definition: 将一种资源与作为一种资源的标识符、由资源中指定位置选取的一组字符并和出版日期或其他元素一起组成的一个命名关联起来。 @zh-hans
label: ujjlenyomata a következő: @hu
definition: Hozzákapcsol egy forrást egy forrásazonosítóhoz, amely a forrás meghatározott helyeiről származó karakterek csoportjából áll, kombinálva a közzététel időpontjával vagy más elemmel. @hu
label: parmak izi ile ilişkilidir @tr
definition: Bir kaynağı, yayın tarihi veya başka bir öğeyle birleştirilmesinden oluşan kaynaktaki belirli konumlardan bir grup karakteri içeren kaynak tanımlayıcısıyla ilişkilendirir. @tr

is fingerprint of
status: Published
lexical alias: fingerprintOf.en
definition: Relates a nomen to a resource that has an identifier for resource that consists of a group of characters from specified locations in a resource combined with a date of publication or other element.
type: Property
inverse of: has fingerprint
label: is vingerafdruk van @nl
label: هي بصمة لـ @ar
definition: يربط تسمية بمصدر له مُعرِّف لمصدر يتضمن مجموعة تمثيلات من مواقع محددة فى مصدر مدمجة مع تاريخ نشر أو عنصر آخر. @ar
label: er fingeraftryk af @da
definition: Relaterer et nomen til en ressource, som har en identifikator for ressource, der består af en gruppe tegn fra specificerede steder i en ressource kombineret med en udgivelsesdato eller et andet element. @da
label: sormenjälkitunniste @fi
definition: Liittää nomenin aineistoon, jonka tunniste muodostuu aineiston tietyistä kohdista poimittujen merkkien yhdistämisestä julkaisuaikaan tai muihin elementteihin. @fi
label: ist Fingerabdruck von @de
definition: Setzt ein Nomen in Beziehung zu einer Ressource, die über einen Identifikator für eine Ressource verfügt, der aus einer Kombination von einer Gruppe von Zeichen von bestimmten Stellen einer Ressource und einem Veröffentlichungsdatum oder einem anderen Element besteht. @de
label: 是……的指纹 @zh-hans
definition: 将一个命名与有由资源中取自特定位置的一组字符与出版日期或其他元素结合而组成的资源的一个标识符的一种资源关联起来。 @zh-hans
label: ujjlenyomata a következőnek: @hu
definition: Hozzákapcsol egy noment egy forráshoz, amely rendelkezik olyan forrásazonosítóval, amely a forrás meghatározott helyeiről származó karakterek csoportjából áll, kombinálva a kiadás időpontjával vagy más elemmel. @hu
label: parmak izidir @tr
definition: Bir ismi, yayın tarihi veya başka bir öğe ile birleştirilmiş bir kaynakta belirtilen konumlardan bir grup karakterden oluşan kaynak için tanımlayıcıya sahip bir kaynakla ilişkilendirir. @tr

has first alphanumeric designation of alternative sequence
status: Published
type: Property
lexical alias: firstAlphanumericDesignationOfAlternativeSequence.en
definition: Relates a resource to a nomen that is a designation in the form of numbers or alphabetic characters that is used to indicate the first in a concurrent sequence of numbering of the parts or iterations of a resource.
sub property of: has numbering of sequence
label: har alternativ numerisk og/eller alfabetisk betegnelse for første nummer eller del af en sekvens @da
definition: Relaterer en ressource til et andet eller efterfølgende nummereringssystem i numerisk og/eller alfabetisk form på første nummer eller del af nummereringssekvensen for et periodikum. @da
inverse of: is first alphanumeric designation of alternative sequence of
label: heeft eerste alfanumerieke aanduiding van alternatieve reeks @nl
label: له تسمية رقمية أولى لتسلسل بديل @ar
definition: يربط بين مصدر ونظام ترقيم ثانٍ أو تالٍ يُعرض في شكل أرقام أو حروف هجائية على الإصدار الأول أو الجزء الأول لتسلسل الترقيم لدورية. @ar
label: vaihtoehtoisen numerointijakson ensimmäinen numero- tai kirjainmäärite @fi
definition: Liittää aineiston toiseen tai myöhempään numerointijärjestelmään, joka on esitetty numeroin tai aakkosin sarjan ensimmäisessä numerossa tai sarjan numerointisarjan osana. @fi
label: hat alternative alphanumerische Bezeichnung der ersten Ausgabe oder des ersten Teils einer Folge @de
definition: Setzt eine Ressource in Beziehung zu einem zweiten oder nachfolgenden Zählungssystem, das in Form von Nummern oder Buchstaben auf der ersten Ausgabe oder dem ersten Teil einer fortlaufenden Ressource zu finden ist. @de
label: 有交替序列的第一个字母数字标识 @zh-hans
definition: 将一种资源与作为以数字或字母字符形式用于标识一种资源的部分或更新后整体的并存编号序列中第一个的标识的一个命名关联起来。 @zh-hans
definition: Relaciona un recurs amb un nomen que és una designació en la forma de números o caràcters alfabètics que s’usa per indicar la primera en una seqüència concurrent de numeració de les parts o iteracions d’un recurs. @ca
label: alternatív sorrendiségének alfanumerikus kezdőjelölése a következő: @hu
definition: Hozzákapcsol egy forrást egy második vagy más folyamatos számozáshoz, amely számok vagy alfabetikus karakterek formájában jelzi egy sorozat első részét vagy számát. @hu
label: alternatif sıranın ilk alfanümerik tanımlanması ile ilişkilidir @tr
definition: Bir kaynağı, bir seri numaralandırma dizisinin ilk sayısında veya bir bölümünde sayısal veya alfabetik biçimde sunulan ikinci veya sonraki bir numaralandırma sistemiyle ilişkilendirir. @tr

has first alphanumeric designation of sequence
status: Published
definition: Relates a resource to a nomen that is a designation in the form of numbers or alphabetic characters that is used to indicate the first in a sequence of numbering of the parts or iterations of a resource.
type: Property
sub property of: has numbering of sequence
lexical alias: firstAlphanumericDesignationOfSequence.en
label: har numerisk og/eller alfabetisk betegnelse for første nummer eller del af sekvens @da
definition: Relaterer en ressource til en betegnelse i numerisk og/eller alfabetisk form på første nummer eller del af en nummereringssekvens for et periodikum. @da
inverse of: is first alphanumeric designation of sequence of
label: heeft eerste alfanumerieke aanduiding van reeks @nl
label: له تسمية رقمية أولى لتسلسل @ar
definition: يربط بين مصدر وتسمية على شكل رقمي أو أبجدي مُقدمة في عدد أول أو جزء أول من تسلسل صدر في ترقيم متسلسل. @ar
label: numerointijakson ensimmäinen numero- ja/tai kirjainmäärite aineistolle @fi
definition: Liittää aineiston numeroista tai kirjaimista muodostuvaan määritteeseen, joka ilmaisee aineiston osien tai iteraatioiden numerointijakson ensimmäisen määritteen. @fi
label: hat alphanumerische Bezeichnung der ersten Ausgabe einer fortlaufenden Ressource @de
definition: Setzt eine Ressource in Beziehung zu einer Bezeichnung in Form von Nummern oder Buchstaben, die innerhalb einer Zählfolge auf der ersten Ausgabe einer fortlaufenden Ressource erscheint. @de
label: 有序列的第一个字母数字标识 @zh-hans
definition: 将一种资源与作为以数字或字母字符形式用于标识一种资源的部分或更新后整体的编号序列中第一个的标识的一个命名关联起来。 @zh-hans
definition: Relaciona un recurs amb un nomen que és una designació en la forma de números o caràcters alfabètics que s’usa per indicar la primera en una seqüència de numeració de les parts o iteracions d’un recurs. @ca
label: sorrendiségének alfanumerikus kezdőjelölése a következő: @hu
definition: Hozzákapcsol egy forrást egy megjelöléshez, amely egy sorozat számozási sorrendjében, számok vagy alfabetikus karakterek formájában jelzi az első részt vagy számot. @hu
label: sıranın ilk alfanümerik tanımlanması ile ilişkilidir @tr
definition: Bir kaynağı, bir sayı dizisinde yayınlanan bir serinin ilk sayısında veya bir kısmında sunulan sayısal veya alfabetik formdaki tanım ile ilişkilendirir. @tr

has first chronological designation of alternative sequence
status: Published
type: Property
lexical alias: firstChronologicalDesignationOfAlternativeSequence.en
definition: Relates a resource to a nomen that is a designation in the form of a date or other timespan that is used to indicate the first in a concurrent sequence of numbering of the parts or iterations of a resource.
scope note: A designation includes a year; year and month; month, day, and year. A chronological designation of alternative sequence may include a date in a different calendar.
sub property of: has numbering of sequence
label: alternativ kronologisk betegnelse for første nummer eller del af en sekvens @da
definition: Relaterer en ressource til et andet eller efterfølgende nummereringssystem i form af en datering på første nummer eller del af nummereringssekvensen for et periodikum. @da
scope note: Betegnelsen omfatter et år; år og måned; måned, dag og år. En alternativ kronologisk betegnelse kan omfatte en dato i en anden kalender. @da
inverse of: is first chronological designation of alternative sequence of
label: heeft eerste chronologische aanduiding van alternatieve reeks @nl
label: له تسمية زمنية أولى لتسلسل بديل @ar
definition: يربط بين مصدر ونظام ترقيم ثانٍ أو تالٍ يُعرض في شكل تاريخ على الإصدار الأول أو الجزء الأول لتسلسل الترقيم لدورية. @ar
scope note: تشمل التسمية: سنة؛ سنة وشهر؛ شهر، يوم، وسنة. قد تتضمن التسمية الزمنية لتسلسل بديل تاريخًا في تقويم مختلف. @ar
label: vaihtoehtoisen numerointijakson ensimmäinen aikamäärite @fi
definition: Liittää aineiston toiseen tai myöhempään numerointijärjestelmään, joka on esitetty ensimmäisen numeron päivämäärän muodossa tai sarjan numerointisarjan osana. @fi
scope note: Määrite sisältää vuoden; vuoden ja kuukauden; kuukauden, päivän ja vuoden. Vaihtoehtoinen aikamääre voi sisältää toisen kalenterin mukaisen ajankohdan. @fi
label: hat alternative chronologische Bezeichnung einer ersten Ausgabe oder eines ersten Teils einer Folge @de
definition: Setzt eine Ressource in Beziehung zu einem zweiten oder nachfolgenden Zählungssystem, das in Form eines Datums auf der ersten Ausgabe oder dem ersten Teil einer fortlaufenden Ressource zu finden ist. @de
scope note: Darunter fällt ein Jahr; ein Monat und ein Jahr; ein Tag, ein Monat und ein Jahr. Zu einer alternativen chronologischen Bezeichnung einer fortlaufenden Ressource kann auch ein Datum nach einem anderen Kalender gehören. @de
label: 有交替序列的第一个年代标识 @zh-hans
definition: 将一种资源与作为以日期或其他时间段形式用于标识一种资源的部分或更新后整体的并存编号序列中第一个的标识的一个命名关联起来。 @zh-hans
scope note: 标识包括年，年和月，年、月和日。交替序列的年代标识可以包括不同历法的日期。 @zh-hans
definition: Relaciona un recurs amb un nomen que és una designació en la forma d’una data o un altre interval de temps que s’usa per indicar la primera en una seqüència concurrent de numeració de les parts o iteracions d’un recurs. @ca
label: alternatív sorrendiségének kronológiai kezdőjelölése a következő: @hu
definition: Hozzákapcsol egy forrást egy második vagy más folyamatos számozáshoz, amely dátum formájában jelzi egy sorozat első részét vagy számát. @hu
scope note: Jelölés lehet év, év és hónap, hónap, nap és év. Az alternatív sorrendiség kronológiai jelölése tartalmazhat dátumot egy másik naptárból is. @hu
label: alternatif sıranın ilk kronolojik tanımlanması ile ilişkilidir @tr
definition: Bir kaynağı, bir seri numaralandırma dizisinin ilk sayısında veya bir bölümünde tarih biçiminde sunulan ikinci veya sonraki bir numaralandırma sistemiyle ilişkilendirir. @tr
scope note: Bir atama bir yılı içerir; yıl ve ay; ay, gün ve yıl. Alternatif dizinin kronolojik gösterimi farklı bir takvimdeki bir tarihi içerebilir. @tr

has first chronological designation of sequence
status: Published
definition: Relates a resource to a nomen that is a designation in the form of a date or other timespan that is used to indicate the first in a sequence of numbering of the parts or iterations of a resource.
type: Property
sub property of: has numbering of sequence
lexical alias: firstChronologicalDesignationOfSequence.en
scope note: Designation includes a year; year and month; month, day, and year.
label: har kronologisk betegnelse for første nummer eller del af sekvens @da
definition: Relaterer en ressource til en betegnelse i form af en datering på første nummer eller del af en nummereringssekvens for et periodikum. @da
scope note: Betegnelsen omfatter et år; år og måned; måned, dag og år. @da
inverse of: is first chronological designation of sequence of
label: heeft eerste chronologische aanduiding van reeks @nl
label: له تسمية زمنية أولى لتسلسل @ar
definition: يربط بين مصدر وتسمية في شكل بيانات مُقدم في عدد أول أو جزء أول من تسلسل صدر في ترقيم متسلسل. @ar
scope note: تشمل التسمية: سنة؛ سنة وشهر؛ شهر، يوم، وسنة. @ar
label: numerointijakson ensimmäinen aikamäärite aineistolle @fi
definition: Liittää aineiston päivämäärästä tai muusta ajanjaksosta muodostuvaan määritteeseen, joka ilmaisee aineiston osien tai iteraatioiden numerointijakson ensimmäisen määritteen. @fi
scope note: Määrite sisältää vuoden; vuoden ja kuukauden; kuukauden, päivän ja vuoden. @fi
label: hat chronologische Bezeichnung der ersten Ausgabe einer fortlaufenden Ressource @de
definition: Setzt eine Ressource in Beziehung zu einer Bezeichnung in Form eines Datums, das innerhalb einer Zählfolge auf der ersten Ausgabe einer fortlaufenden Ressource erscheint. @de
scope note: Darunter fällt ein Jahr; ein Monat und ein Jahr; ein Tag, ein Monat und ein Jahr. @de
label: 有序列的第一个年代标识 @zh-hans
definition: 将一种资源与作为以日期或其他时间段形式用于标识一种资源的部分或更新后整体的编号序列中第一个的标识的一个命名关联起来。 @zh-hans
scope note: 标识包括年，年和月，年、月和日。 @zh-hans
definition: Relaciona un recurs amb un nomen que és una designació en la forma d’una data o un altre interval de temps que s’usa per indicar la primera en una seqüència de numeració de les parts o iteracions d’un recurs. @ca
label: sorrendiségének kronológiai kezdőjelölése a következő: @hu
definition: Hozzákapcsol egy forrást egy megjelöléshez, amely egy sorozat számozási sorrendjében, dátum formájában jelzi az első részt vagy számot. @hu
scope note: Jelölés lehet év; év és hónap; hónap, nap és év. @hu
label: sıranın ilk kronolojik tanımlanması ile ilişkilidir @tr
definition: Bir kaynağı, bir numaralandırma dizisinde yayınlanan bir serinin ilk baskısında veya bir kısmında sunulan tarih formundaki bir tanımla ilişkilendirir. @tr
scope note: Tanımlama, yıl; yıl ve ay; ay, gün ve yılı içerir. @tr

has font point size
status: Published
lexical alias: fontPointSize.en
definition: Relates a resource to a point size of the type used to represent the characters and symbols in a resource.
type: Property
label: heeft puntgrootte font @nl
label: له حجم خط @ar
definition: يربط بين مصدر وحجم الخط المستخدم في طباعة التمثيلات والرموز في مصدر. @ar
label: har skrifttypes punktstørrelse @da
definition: Relaterer en ressource til en punktstørrelse af den skrifttype der er brugt for at repræsentere bogstæverne og symbolerne i en ressource. @da
label: aineiston kirjasimen pistekoko @fi
definition: Liittää aineiston aineistossa esiintyvien merkkien ja symbolien pistekokoon. @fi
label: hat Punktgröße der Schrift @de
definition: Setzt eine Ressource in Beziehung zu einer Punktgröße der Schrift, die zur Darstellung der Zeichen und Symbole in einer Ressource verwendet wird. @de
label: 有字体点大小 @zh-hans
definition: 将一种资源与在一种资源中用于表示字符和符号的字型的点大小关联起来。 @zh-hans
label: betűmérete a következő: @hu
definition: Hozzákapcsol egy forrást egy típus pontméretéhez, amelyet egy forrás karaktereinek és szimbólumainak ábrázolására használnak. @hu
label: yazı tipi punto boyutu ile ilişkilidir @tr
definition: Bir kaynağı, bir kaynaktaki karakterleri ve sembolleri temsil etmek için kullanılan türün punto boyutuyla ilişkilendirir. @tr

has font size
status: Published
definition: Relates a resource to a size of the type that is used to represent the characters and symbols in a resource.
type: Property
lexical alias: fontSize.en
label: har skriftstørrelse @da
definition: Relaterer en ressource til en størrelse på den skrifttype, der er anvendt til at repræsentere tegn og symboler i en ressource. @da
label: heeft lettergrootte @nl
label: له حجم خط @ar
definition: يربط بين مصدر وحجم الخط المستخدم في تمثيل التمثيلات والرموز في مصدر. @ar
label: kirjasinkoko aineistossa @fi
definition: Liittää aineiston aineiston merkeissä ja symboleissa käytettävään kirjasimen kokoon. @fi
label: hat Schriftgröße @de
definition: Setzt eine Ressource in Beziehung zu den Details zur Größe der Schrift, die zur Repräsentation der Zeichen und Symbole in einer Ressource verwendet wird. @de
label: 有字体大小 @zh-hans
definition: 将一种资源与在一种资源中用于表示字符和符号的字型的大小关联起来。 @zh-hans
label: betűmérete a következő: @hu
definition: Hozzákapcsol egy forrást ahhoz a típusmérethez, amely a karaktereket és szimbólumokat reprezentálja egy forrásban. @hu
label: yazı tipi boyutu ile ilişkilidir @tr
definition: Bir kaynağı, kaynaktaki karakterleri ve sembolleri temsil etmek için kullanılan harfin boyutuyla ilişkilendirir. @tr

has format of notated music
status: Published
definition: Relates a resource to a musical or physical layout of the content of a resource that is presented in the form of musical notation.
type: Property
lexical alias: formatOfNotatedMusic.en
label: har type af noteret musik @da
definition: Relaterer en ressource til et musikalsk eller fysisk layout af en ressources indhold, der er præsenteret som musikalsk notation. @da
label: heeft format van bladmuziek @nl
label: لها صيغة من موسيقى مدونة @ar
definition: يربط بين مصدر وتخطيط موسيقي أو مادي لمحتوى مصدر يُعرض في شكل من أشكال التدوين الموسيقي. @ar
label: nuottiaineiston muoto @fi
definition: Liittää aineiston nuottikirjoituksen muodossa esitetyn aineiston musiikilliseen tai fyysiseen layoutiin. @fi
label: hat musikalische Ausgabeform @de
definition: Setzt eine Ressource in Beziehung zu einem musikalischen oder physischen Layout des Inhalts einer Ressource, der in Form einer Musiknotation präsentiert wird. @de
label: 有乐谱的形式 @zh-hans
definition: 将一种资源与以乐谱形式呈现的一种资源之内容的音乐或物理布局关联起来。 @zh-hans
label: zenei lejegyzés formátuma a következő: @hu
definition: Hozzákapcsol egy forrást egy forrás tartalmának zenei vagy fizikai elrendezéséhez, amely egy zenei lejegyzés formájában jelenik meg. @hu
label: notaya alınmış müziğin formatı ile ilişkilidir @tr
definition: Bir kaynağı, nota biçiminde sunulan bir kaynağın içeriğinin müzikal veya fiziksel düzeniyle ilişkilendirir. @tr

has former owner
status: Published
definition: Relates a resource to an agent formerly having legal possession of a resource.
type: Property
sub property of: has owner
inverse of: is former owner of
lexical alias: formerOwner.en
label: har tidligere ejer @da
definition: Relaterer en ressource til en agent, der tidligere har været i lovlig besiddelse af en ressource. @da
label: heeft voormalige eigenaar @nl
label: aineiston aiempi omistaja @fi
label: له مالك سابق @ar
definition: يربط مصدر بوكيل كان يمتلك سابقًا ملكية قانونية لمصدر. @ar
definition: Liittää aineiston toimijaan, jolla on aiemmin ollut aineiston laillinen omistus. @fi
label: hat frühere Eigentümerin/früheren Eigentümer @de
definition: Setzt eine Ressource in Beziehung zu einem Akteur, der früher im rechtmäßigen Besitz einer Ressource war. @de
label: 有先前拥有者 @zh-hans
definition: 将一种资源与拥有对一种资源先前法定所有权的一个行为者关联起来。 @zh-hans
label: korábbi tulajdonosa a következő: @hu
definition: Hozzákapcsol egy forrást egy ágenshez, amelynek korábban jogszerű tulajdonában volt egy forrás. @hu
has subproperty: has donor
has subproperty: has seller
label: eski sahip ile ilişkilidir @tr
definition: Bir kaynağı, daha önce bir kaynağın yasal mülkiyetine sahip olan bir temsilci ile ilişkilendirir. @tr

is former owner of
status: Published
definition: Relates an agent to a resource that involves a responsibility of an agent for former legal possession.
type: Property
sub property of: is owner of
inverse of: has former owner
lexical alias: formerOwnerOf.en
label: er tidligere ejer af @da
definition: Relaterer en agent, der tidligere har været i lovligbesiddelse af en ressource til en ressource. @da
label: is voormalige eigenaar van @nl
label: هو مالك سابق لـ @ar
definition: يربط بين وكيل ومصدر ينطوي على مسؤولية وكيل عن الملكية القانونية السابقة. @ar
label: aiempi omistaja (toimija) aineistossa @fi
definition: Liittää toimijan aineistoon, jonka toimija on aiemmin laillisesti omistanut. @fi
label: ist frühere Eigentümerin/früherer Eigentümer von @de
definition: Setzt einen Akteur in Beziehung zu einer Ressource, die früher im rechtmäßigen Besitz eines Akteurs war. @de
label: 是……的先前拥有者 @zh-hans
definition: 将一个行为者与涉及一个先前法定所有权的一个行为者的责任的一种资源关联起来。 @zh-hans
label: korábbi tulajdonosa a következőnek: @hu
definition: Hozzákapcsol egy ágenst egy forráshoz, amelyhez hozzátartozik az ágens korábbi tulajdonjog iránti felelőssége. @hu
has subproperty: is donor of
has subproperty: is seller of
label: eski sahibidir @tr
definition: Bir temsilciyi, eski yasal mülkiyete ilişkin bir temsilcinin sorumluluğunu içeren bir kaynakla ilişkilendirir. @tr

has form of musical notation
status: Published
definition: Relates a resource to a set of characters or symbols used to express musical content of a resource.
type: Property
sub property of: has form of notation
lexical alias: formOfMusicalNotation.en
label: har musikalsk notationsform @da
definition: Relaterer en ressource til et sæt af tegn og/eller symboler, der anvendes til at udtrykke en ressources musikindhold. @da
label: heeft vorm van muzieknotatie @nl
label: aineiston nuottikirjoituksen tyyppi @fi
label: له شكل من أشكال التدوين الموسيقي @ar
definition: يربط بين مصدر ومجموعة من الأحرف أو الرموز المستخدمة للتعبير عن محتوى موسيقي لمصدر. @ar
definition: Liittää aineiston joukkoon merkkejä tai symboleja, joita käytetään aineiston musiikkisisällön ilmaisemiseen. @fi
label: hat Form einer Musiknotation @de
definition: Setzt eine Ressource in Beziehung zu einem Satz von Zeichen oder Symbolen der verwendet wird, um den musikalischen Inhalt einer Ressource auszudrücken. @de
label: 有乐谱的形式 @zh-hans
definition: 将一种资源与用于表达一种资源的音乐内容的字符或符号的集合关联起来。 @zh-hans
label: zenei lejegyzés formája a következő: @hu
definition: Hozzákapcsol egy forrást karakterek vagy szimbólumok egy csoportjához, amelyet arra használnak, hogy egy forrás zenei tartalmát kifejezze. @hu
label: müzikal notasyon biçimi ile ilişkilidir @tr
definition: Bir kaynağı, bir kaynağın müzikal içeriğini ifade etmek için kullanılan bir dizi karakter veya sembolle ilişkilendirir. @tr

has form of notated movement
status: Published
definition: Relates a resource to a set of characters or symbols used to express movement content of a resource.
type: Property
sub property of: has form of notation
lexical alias: formOfNotatedMovement.en
label: har bevægelsesnotationsform @da
definition: Relaterer en ressource til et sæt af tegn og/eller symboler, der anvendes til at udtrykke de bevægelser en ressource indeholder. @da
label: heeft vorm van bewegingsnotatie @nl
label: aineiston liikenotaation tyyppi @fi
label: شكل من أشكال الحركات المدونة @ar
definition: يربط بين مصدر ومجموعة من الأحرف أو الرموز المستخدمة للتعبير عن محتوى حركي لمصدر. @ar
definition: Liittää aineiston joukkoon merkkejä tai symboleja, joita käytetään aineiston liikesisällön ilmaisemiseen. @fi
label: hat Form der Bewegungsnotation @de
definition: Setzt eine Ressource in Beziehung zu einem Satz von Zeichen oder Symbolen der verwendet wird, um den Bewegungsinhalt einer Ressource auszudrücken. @de
label: 有动作谱的形式 @zh-hans
definition: 将一种资源与用于表达一种资源的动作内容的字符或符号的集合关联起来。 @zh-hans
label: mozgásírás formája a következő: @hu
definition: Hozzákapcsol egy forrást karakterek vagy szimbólumok egy csoportjához, amelyet arra használnak, hogy egy forrás mozgástartalmát kifejezze. @hu
label: notaya alınmış hareketin biçimi ile ilişkilidir @tr
definition: Bir kaynağı, bir kaynağın hareket içeriğini ifade etmek için kullanılan bir dizi karakter veya sembolle ilişkilendirir. @tr

has form of notation
status: Published
definition: Relates a resource to a set of characters or symbols used to express the content of a resource.
type: Property
lexical alias: formOfNotation.en
label: har notationsform @da
definition: Relaterer en ressource til et sæt af tegn og/eller symboler, der anvendes til at udtrykke en ressources indhold. @da
label: heeft vorm van notatie @nl
label: aineiston merkkijärjestelmän tyyppi @fi
label: له شكل من أشكال التدوين @ar
definition: يربط بين مصدر ومجموعة من الأحرف أو الرموز المستخدمة للتعبير عن محتوى مصدر. @ar
definition: Liittää aineiston joukkoon merkkejä tai symboleja, joita käytetään aineiston sisällön ilmaisemiseen. @fi
label: hat Form der Notation @de
definition: Setzt eine Ressource in Beziehung zu einem Satz von Zeichen oder Symbolen der verwendet wird, um den Inhalt einer Ressource auszudrücken. @de
label: 有标记的形式 @zh-hans
definition: 将一种资源与用于表达一种资源的内容的字符或符号的集合关联起来。 @zh-hans
label: lejegyzésformája a következő: @hu
definition: Hozzákapcsol egy forrást karakterek vagy szimbólumok egy csoportjához, amelyet arra használnak, hogy egy forrás tartalmát kifejezze. @hu
has subproperty: has form of musical notation
has subproperty: has form of notated movement
has subproperty: has form of tactile notation
has subproperty: has script
label: notasyon biçimi ile ilişkilidir @tr
definition: Bir kaynağı, bir kaynağın içeriğini ifade etmek için kullanılan bir dizi karakter veya sembolle ilişkilendirir. @tr

has form of tactile notation
status: Published
definition: Relates a resource to a set of characters or symbols used to express the content of a resource in a form that can be perceived through touch.
type: Property
sub property of: has form of notation
lexical alias: formOfTactileNotation.en
label: har taktil notationsform @da
definition: Relaterer en ressource til et sæt af tegn og/eller symboler, der anvendes til at udtrykke en ressources indhold på en måde, der kan opfattes ved berøring. @da
label: heeft vorm van tactiele notatie @nl
label: aineiston taktiilin merkkijärjestelmän tyyppi @fi
label: له شكل من أشكال التدوين عن طريق اللمس @ar
definition: يربط بين مصدر ومجموعة من أحرف أو رموز مُستخدمة للتعبير عن محتوى مصدر في شكل يمكن إدراكه من خلال اللمس. @ar
definition: Liittää aineiston joukkoon merkkejä tai symboleja, joita käytetään aineiston sisällön ilmaisemiseen kosketeltavassa muodossa. @fi
label: hat Form der taktilen Notation @de
definition: Setzt eine Ressource in Beziehung zu einem Satz von Zeichen oder Symbolen der verwendet wird, um den Inhalt einer Ressource in einer Form auszudrücken, die über den Tastsinn wahrgenommen werden kann. @de
label: 有触摸标记的形式 @zh-hans
definition: 将一种资源与用于通过触摸感知的形式来表达一种资源的内容的字符或符号的集合关联起来。 @zh-hans
label: tapintható lejegyzési formája a következő: @hu
definition: Hozzákapcsol egy forrást karakterek vagy szimbólumok egy csoportjához, amelyet arra használnak, hogy egy forrás tartalmát érintés útján felfogató formában fejezze ki. @hu
label: dokunsal notasyon biçimi ile ilişkilidir @tr
definition: Bir kaynağı, bir kaynağın içeriğini dokunma yoluyla algılanabilecek bir biçimde ifade etmek için kullanılan bir dizi karakter veya sembolle ilişkilendirir. @tr

has founded agent of agent
status: Published
definition: Relates an agent to an agent who is initiated by an agent.
type: Property
inverse of: has founder agent of agent
lexical alias: foundedAgentOfAgent.en
label: har grundlagt entitet @da
definition: Relaterer en agent der er grundlagt af en agent til en agent. @da
label: heeft opgerichte actor van actor @nl
label: له وكيل أسسه وكيل @ar
definition: يربط بين وكيل ووكيل أسسه وكيل @ar
label: perustaja (toimija) @fi
definition: Liittää yhteistoimijan sen perustaneeseen toimijaan. @fi
label: hat gegründeten Akteur durch einen Akteur @de
definition: Setzt einen Akteur in Beziehung zu einem Akteur, der von einem Akteur gegründet wurde. @de
label: 有行为者的被创办行为者 @zh-hans
definition: 将一个行为者与被另一个行为者发起的一个行为者关联起来。 @zh-hans
definition: Relaciona un agent amb un agent que és iniciat per un agent. @ca
label: ágens által alapított ágens a következő: @hu
definition: Hozzákapcsol egy ágens által alapított ágenst egy ágenshez. @hu
label: temsilcinin kurduğu temsilci ile ilişkilidir @tr
definition: Bir temsilcinin kurduğu bir temsilciyi bir temsilciyle ilişkilendirir. @tr

is founder agent of resource of
status: Published
type: Property
lexical alias: founderAgentOfResourceOf.en
definition: Relates an agent to a resource that involves a responsibility of an agent for establishing a serial, integrating resource, or multipart monograph.
inverse of: has founder agent of resource
sub property of: is other agent associated with resource of (Deprecated)
label: er stifter af værk til @da
definition: Relaterer en agent, der er ansvarlig for at have etableret et periodikum, en integrerende ressource eller et flerbindsværk til en ressource. @da
label: is oprichter-actor van resource van @nl
label: هو وكيل مؤسس لمصدر لـ @ar
definition: يربط بين وكيل ومصدر ينطوي على مسؤولية وكيل إنشاء سلسلة، مصدر متكامل، أو دراسات متعددة الأجزاء. @ar
label: perustaja (toimija) aineistossa @fi
label: ist Begründerin/Begründer einer Ressource von @de
definition: Setzt einen Akteur in Beziehung zu einer Ressource, die mit einer Verantwortung eines Akteurs verbunden ist, eine fortlaufende, integrierende oder mehrteilig monografische Ressource einzuführen. @de
definition: Liittää toimijan aineistoon, johon liittyy toimijan vastuu sarja-aineiston, päivittyvän aineiston tai moniosaisen monografian luomisesta. @fi
label: 是……的资源的创办者 @zh-hans
definition: 将一个行为者与涉及创办一种连续出版物、集成性资源或多部分单行出版物的一个行为者的责任的一种资源关联起来。 @zh-hans
label: alapító ágense a következő forrásnak: @hu
definition: Hozzákapcsol egy ágenst egy forráshoz, amelyhez hozzátartozik az ágens felelőssége sorozat, integráló forrás vagy többrészes monografikus forrás alapításáért. @hu
label: kaynağının kurucu temsilcisidir @tr
definition: Bir temsilciyi, bir seri, bütünleyici kaynak veya çok parçalı monograf oluşturmakla görevli bir temsilcinin sorumluluğunu içeren bir kaynakla ilişkilendirir. @tr

has founder agent of agent
status: Published
definition: Relates an agent to an agent who initiates an agent.
type: Property
inverse of: has founded agent of agent
label: har grundlægger @da
definition: Relaterer en agent der har grundlagt en agent til en agent. @da
lexical alias: founderAgentOfAgent.en
label: heeft oprichter-actor van actor @nl
label: له وكيل مؤسس لوكيل @ar
definition: يربط بين وكيل ووكيل أسس وكيل. @ar
label: perustaja (yhteistoimija) @fi
definition: Liittää yhteistoimijan perustaneen toimijan yhteistoimijaan. @fi
label: hat Begründerin/Begründer eines Akteurs @de
definition: Setzt einen Akteur in Beziehung zu einem Akteur, der einen Akteur gegründet hat. @de
label: 有行为者的创办者行为者 @zh-hans
definition: 将一个行为者与发起一个行为者的一个行为者关联起来。 @zh-hans
definition: Relaciona un agent amb un agent que inicia un agent. @ca
label: ágens alapító ágense a következő: @hu
definition: Hozzákapcsol egy ágenst alapító ágenst egy ágenshez. @hu
label: temsilcinin kurduğu kurucu temsilci ile ilişkilidir @tr
definition: Bir temsilci kuran bir temsilciyi bir temsilciyle ilişkilendirir. @tr

has founder agent of resource
status: Published
type: Property
definition: Relates a resource to an agent who is responsible for initiating a diachronic resource.
inverse of: is founder agent of resource of
sub property of: has other agent associated with resource (Deprecated)
label: har stifter af ressource @da
definition: Relaterer en ressource til en agent, der er ansvarlig for at have etableret et periodikum, en integrerende ressource eller et flerbindsværk. @da
lexical alias: founderAgentOfResource.en
label: heeft oprichter-actor van resource @nl
label: له وكيل مؤسس لمصدر @ar
definition: يربط مصدر بوكيل مسؤول عن البدء في مصدر ممتد زمنيًا. @ar
label: aineiston perustaja @fi
definition: Liittää aineiston toimijaan, joka on vastannut diakronisen teoksen alullepanosta. @fi
label: hat Begründerin/Begründer einer Ressource @de
definition: Setzt eine Ressource in Beziehung zu einem Akteur, der für das Begründen einer diachronen Ressource verantwortlich ist. @de
label: 有资源的创办者行为者 @zh-hans
definition: 将一种资源与负责发起一种历时资源的一个行为者关联起来。 @zh-hans
label: forrás alapító ágense a következő: @hu
definition: Hozzákapcsol egy forrást egy ágenshez, amely felelős egy diakronikus forrás indításáért. @hu
label: kaynağın kurucu temsilcisi ile ilişkilidir @tr
definition: Bir kaynağı, artzamanlı bir kaynağı başlatmaktan sorumlu olan bir temsilci ile ilişkilendirir. @tr

is freely translated as
status: Published
definition: Relates a resource to a resource that is both an adaptation and a translation into another language of another resource.
type: Property
sub property of: has derivative
inverse of: is free translation of
lexical alias: freelyTranslatedAs.en
label: er frit oversat til @da
definition: Relaterer en ressource til en ressource, der frit oversætter teksten til et andet sprog, og som bevarer originalens ånd, men ikke dens sproglige detaljer. @da
label: is vrij vertaald als @nl
label: vapaamuotoinen käännös aineistosta @fi
label: هو مترجم بتصرف كـ @ar
definition: يربط بين مصدر ومصدر يعد اقتباسًا وترجمة إلى لغة أخرى لمصدر آخَر. @ar
label: ist frei übersetzt als @de
definition: Setzt eine Ressource in Beziehung zu einer Ressource, die sowohl eine Bearbeitung als auch eine Übersetzung einer anderen Ressource in eine andere Sprache ist. @de
definition: Liittää aineiston aineistoon, joka on sekä lähteenä olevan aineiston mukaelma että käännös toiselle kielelle. @fi
label: 被自由翻译为 @zh-hans
definition: 将一种资源与作为另一种资源的另一种语言改编和翻译同时进行而成的一种资源关联起来。 @zh-hans
label: szabadon fordítva a következőként: @hu
definition: Hozzákapcsol egy forrást egy forráshoz, amely egy másik forrás adaptációja és egy másik nyelvre való fordítása egyszerre. @hu
label: olarak serbestçe çevrilmiştir @tr
definition: Bir kaynağı, başka bir kaynağın hem uyarlaması hem de başka bir dile çevirisi olan bir kaynakla ilişkilendirir. @tr

is free translation of
status: Published
definition: Relates a resource to a resource that is adapted and translated into another language.
type: Property
sub property of: has source
inverse of: is freely translated as
lexical alias: freeTranslationOf.en
label: er fri oversættelse af @da
definition: Relaterer en ressource til en ressource, der er frit oversat, og som bevarer originalens ånd, men ikke dens sproglige detaljer. @da
label: is vrije vertaling van @nl
label: vapaa käännös aineistosta @fi
label: هو ترجمة بتصرف لـ @ar
definition: يربط بين مصدر ومصدر تم تحويره وترجمته إلى لغة أخرى. @ar
definition: Liittää aineiston aineistoon, jonka kieltä on muokattu ja näin luotu uusi alkuperäisestä eroava aineisto. @fi
label: ist freie Übersetzung von @de
definition: Setzt eine Ressource in Beziehung zu einer Ressource, die bearbeitet und in eine andere Sprache übersetzt ist. @de
label: 是……的自由翻译 @zh-hans
definition: 将一种资源与被改编并被翻译成另一种语言的一种资源关联起来。 @zh-hans
label: szabad fordítása a következőnek: @hu
definition: Hozzákapcsol egy forrást egy forráshoz, amelyet adaptáltak és másik nyelvre fordítottak. @hu
label: serbest çevirisidir @tr
definition: Bir kaynağı, başka bir dile uyarlanmış ve çevrilmiş bir kaynakla ilişkilendirir. @tr

has frequency
status: Published
definition: Relates a resource to an interval at which an issue or part of a diachronic resource is issued.
type: Property
lexical alias: frequency.en
label: har frekvens @da
definition: Relaterer en ressource til et interval, ved hvilke en series numre eller dele udgives eller det interval der er mellem opdateringer af en integrerende ressource. @da
label: heeft frequentie @nl
label: له تتابع الصدور @ar
definition: يربط بين مصدر وفترة زمنية يتم فيها صدور عدد أو جزء من مصدر ممتد زمنيًا. @ar
label: aineiston ilmestymistiheys @fi
definition: Liittää aineiston diakronisen teoksen osien, numeroiden tai iteraatioiden ilmestymistiheyteen. @fi
label: hat Erscheinungsfrequenz @de
definition: Setzt eine Ressource in Beziehung zu einem Intervall, in dem die Ausgaben oder Teile einer diachronen Ressource erscheinen. @de
label: 有频率 @zh-hans
definition: 将一种资源与一种历时资源的期或部分的发行的时间间隔关联起来。 @zh-hans
label: gyakorisága a következő: @hu
definition: Hozzákapcsol egy forrást egy időközhöz, amelyben egy diakronikus forrás egy számát vagy részét közreadják. @hu
label: yayın sıklığı ile ilişkilidir @tr
definition: Bir kaynağı, artzamanlı bir kaynağın bir sayısının veya kısmının yayımlandığı bir aralıkla ilişkilendirir. @tr

has friend
status: Published
type: Property
lexical alias: friend.en
definition: Relates an agent to an agent who shares a bond of mutual affection or regard with a related agent.
sub property of: has related agent of agent
label: har ven @da
definition: Relaterer en agent til en agent, der deler et bånd af gensidig ømhed eller respekt med en anden agent. @da
label: heeft vriend @nl
label: له صديق @ar
definition: يربط بين وكيل ووكيل تجمعه مودة أو احترام متبادل مع وكيل ذي صلة. @ar
label: ystävä (toimija) @fi
definition: Liittää toimijan toimijaan, jolla on molemminpuolinen kiintymys- tai kunnioitussuhde liittyvään toimijaan. @fi
label: hat Freundin/Freund @de
definition: Setzt einen Akteur in Beziehung zu einem Akteur, der eine gegenseitige Zuneigung oder Achtung mit einem in Beziehung stehenden Akteur teilt. @de
label: 有朋友 @zh-hans
definition: 将一个行为者与和一个相关行为者有共同感情或尊重的一个行为者关联起来。 @zh-hans
label: barátja a következő: @hu
definition: Hozzákapcsol egy ágenst egy ágenshez, aki a kölcsönös szeretet kötelékében osztozik vagy így tekint egy kapcsolódó ágensre. @hu
label: arkadaş ile ilişkilidir @tr
definition: Bir temsilciyi, ilgili bir temsilciyle karşılıklı sevgi veya saygı bağı paylaşan bir temsilciyle ilişkilendirir. @tr

has fuller form of name
status: Published
definition: Relates a resource to a nomen that is a name of agent that includes the fuller form of a name or part of a name represented by an initial, abbreviation, or shortened or otherwise modified form.
type: Property
lexical alias: fullerFormOfName.en
label: har mere fuldstændig navneform @da
definition: Relaterer en ressource til en mere fuldstændig navneform for en person, hvis navn i foretrukken form indeholder initialer, forkortelser eller andre varianter. @da
inverse of: is fuller form of name of
label: heeft meer volledige vorm van naam @nl
label: له شكل كامل للاسم @ar
definition: يربط بين مصدر وشكل كامل لجزء من الاسم يتم تمثيله فقط من خلال اسم أول أو اختصار في شكل يتم اختياره كاسم مفضل، أو جزء من اسم غير مضمن في شكل تم اختياره كاسم مفضل. @ar
label: nimen täydellisempi muoto aineistossa @fi
label: hat vollständigere Namensform @de
definition: Setzt eine Ressource in Beziehung zu einer vollständigen Form eines Namens, dessen bevorzugte Namensform nur durch eine Initiale oder eine Abkürzung dargestellt wird, oder zu einem Teil eines Namens, der nicht als bevorzugte Namensform gewählt wird. @de
definition: Liittää aineiston alkukirjaimin, lyhenteellä tai muuten lyhennetyn tai muokatun nimen tai nimen osan täydellisempään muotoon. @fi
label: 有名称的完整形式 @zh-hans
definition: 将一种资源与一个作为行为者名称（包括名称的完整形式或由首字母缩写、缩略或缩短或其他修改形式的名称部分）的命名关联起来。 @zh-hans
definition: Relaciona un recurs amb un nomen que és un nom d’agent que inclou la forma més completa d’un nom o d’una part d’un nom representat per una inicial, una abreviació o una forma escurçada o modificada altrament. @ca
label: teljesebb névformája a következő: @hu
definition: Hozzákapcsol egy forrást egy név olyan részének teljes névformájához, amelyet csak egy kezdőbetű vagy rövidítés reprezentál az előnyben részesített névként választott formában, vagy a név egy olyan részéhez, amely nincs előnyben részesített névként választott formában. @hu
label: ismin tam hali ile ilişkilidir @tr
definition: Bir kaynağı, tercih edilen ad olarak seçilen bir biçimde yalnızca bir baş harf veya kısaltma ile temsil edilen bir adın bir bölümünün tam haliyle veya tercih edilen ad olarak seçilen bir biçimde yer almayan adın bir bölümüyle ilişkilendirir. @tr

has gender
status: Published
definition: Relates an agent to a gender with which an agent identifies.
type: Property
lexical alias: gender.en
label: har køn @da
definition: Relaterer en ressource til et køn med hvilket en agent identificerer sig. @da
label: heeft gender @nl
label: له نوع جنس @ar
definition: يربط بين وكيل ونوع جنس يُعرف به وكيل. @ar
label: sukupuoli @fi
definition: Liittää toimijan sukupuoleen, johon toimija identifioituu. @fi
label: hat Geschlecht @de
definition: Setzt einen Akteur in Beziehung zu einem Geschlecht, mit dem sich ein Akteur identifiziert. @de
label: 有性别 @zh-hans
definition: 将一个行为者与一个行为者所识别的性别关联起来。 @zh-hans
label: neme a következő: @hu
definition: Hozzákapcsol egy ágenst egy nemhez, amellyel egy ágens azonosul. @hu
label: cinsiyet ile ilişkilidir @tr
definition: Bir temsilciyi, temsilcinin tanımladığı bir cinsiyetle ilişkilendirir. @tr

has generation
status: Published
definition: Relates a resource to a relationship between an original carrier and a carrier of a reproduction that is made from the original.
type: Property
lexical alias: generation.en
label: har generation @da
definition: Relaterer en ressource til et forhold mellem en oprindelig bærere og bæreren af en reproduktion baseret på originalen. @da
label: heeft generatie @nl
label: له توليد @ar
definition: يربط بين مصدر وعلاقة بين حامل أصلي والحامل الخاص بإعادة الإنتاج المصنوع من الأصل. @ar
label: sukupolvi aineistossa @fi
definition: Liittää aineiston alkuperäisen tallenteen ja siitä tuotetun jäljenteen tallenteen väliseen suhteeseen. @fi
label: hat Kopiengeneration @de
definition: Setzt eine Ressource in Beziehung zu einer Beziehung zwischen einem Originaldatenträger und dem Datenträger einer Reproduktion, die vom Original erstellt wird. @de
label: 有代 @zh-hans
definition: 将一种资源与原始载体和原件复制品的载体之间的关系关联起来。 @zh-hans
label: generációja a következő: @hu
definition: Hozzákapcsol egy forrást egy eredeti hordozó és az eredetiből készült másolat hordozója közötti viszonyhoz. @hu
has subproperty: has generation of audio recording (Deprecated)
has subproperty: has generation of digital resource (Deprecated)
has subproperty: has generation of microform (Deprecated)
has subproperty: has generation of motion picture film (Deprecated)
has subproperty: has generation of videotape (Deprecated)
label: nesil ile ilişkilidir @tr
definition: Bir kaynağı, orijinal bir taşıyıcı ile orijinalden yeniden üretilen bir taşıyıcı arasındaki bağlantıyla ilişkilendirir. @tr

has generation of audio recording (Deprecated)
status: Deprecated
definition: Relates a resource to the relationship between an original audio carrier and the carrier of a reproduction made from the original (e.g., a tape duplication master, a test pressing).. (Deprecated)
type: Property
sub property of: has generation
lexical alias: generationOfAudioRecording.en

has generation of digital resource (Deprecated)
status: Deprecated
definition: Relates a resource to the relationship between an original carrier of a digital resource and the carrier of a reproduction made from the original (e.g., a derivative master).. (Deprecated)
type: Property
sub property of: has generation
lexical alias: generationOfDigitalResource.en

has generation of microform (Deprecated)
status: Deprecated
definition: Relates a resource to the relationship between an original microform carrier and the carrier of a reproduction made from the original (e.g., a printing master).. (Deprecated)
type: Property
sub property of: has generation
lexical alias: generationOfMicroform.en

has generation of motion picture film (Deprecated)
status: Deprecated
definition: Relates a resource to the relationship between an original carrier of a motion picture film resource and the carrier of a reproduction made from the original (e.g., a reference print).. (Deprecated)
type: Property
sub property of: has generation
lexical alias: generationOfMotionPictureFilm.en

has generation of videotape (Deprecated)
status: Deprecated
definition: Relates a resource to the relationship between an original carrier of a videotape resource and the carrier of a reproduction made from the original (e.g., a show copy).. (Deprecated)
type: Property
sub property of: has generation
lexical alias: generationOfVideotape.en

has given name
status: Published
type: Property
lexical alias: givenName.en
definition: Relates an agent to a nomen that is a name of agent given at birth or at some later point in addition to, or instead of, a surname.
label: har fornavn @da
definition: Relaterer en agent til et navn, der gives til en agent ved fødslen eller, på et senere tidspunkt oveni, eller i stedet for, et efternavn. @da
inverse of: is given name of
label: is voornaam @nl
label: له اسم أول @ar
definition: يربط بين وكيل واسم أطلق على وكيل عند ولادته أو لاحقا مضافا إليه اسم عائلة أو عوضا عنه. @ar
label: toimijan etunimi @fi
definition: Liittää toimijan nimeen, joka on annettu toimijalle syntymässä tai myöhempänä ajankohtana sukunimen lisäksi tai sen sijaan. @fi
label: hat Vornamen @de
definition: Setzt einen Akteur in Beziehung zu einem Namen, der ihm bei der Geburt oder zu einem späteren Zeitpunkt, zusätzlich oder anstatt eines Nachnamens, gegeben wird. @de
label: 有名 @zh-hans
definition: 将一个行为者与作为行为者在出生时候或之后某时候被给予、姓以外附加或替代姓的一个名称的命名关联起来。 @zh-hans
definition: Relaciona un agent amb un nomen que és un nom d’agent donat al moment del naixement o en algun moment posterior, a més de, o en lloc d’un cognom. @ca
label: utóneve a következő: @hu
definition: Hozzákapcsol egy ágenst egy névhez, amelyet az ágens születésekor kapott vagy később vett fel, és a vezetéknevével együtt vagy ahelyett használja. @hu
label: adı ile ilişkilidir @tr
definition: Bir temsilciyi, bir temsilciye doğumda veya daha sonraki bir noktada soyadına ek olarak veya soyadı yerine verilen bir isimle ilişkilendirir. @tr

has graduate
status: Published
type: Property
lexical alias: graduate.en
definition: Relates an agent to an agent who receives an academic degree from a granting institution or faculty.
inverse of: is graduate of
label: har dimittend @da
definition: Relaterer en agent til en agent der modtager en akademsk grad fra en institution eller fakultet, der tildeler en akademisk grad. @da
label: heeft afgestudeerde @nl
label: له خريج @ar
definition: يربط بين وكيل ووكيل يحصل على درجة أكاديمية من مؤسسة أو كلية مانحة. @ar
label: loppututkinnon suorittanut (toimija) aineistossa @fi
definition: Liittää toimijan toimijaan, jolle laitos tai tiedekunta on myöntänyt akateemisen loppututkinnon. @fi
label: hat Graduierte/Graduierten @de
definition: Setzt einen Akteur in Beziehung zu einem Akteur, der einen akademischen Grad von einer verleihenden Institution oder Fakultät erhält. @de
label: 有毕业生 @zh-hans
definition: 将一个行为者与从一个授予机构或院系获得学位的一个行为者关联起来。 @zh-hans
label: diplomása a következő: @hu
definition: Hozzákapcsol egy ágenst egy ágenshez, aki tudományos fokozatot kap egy annak odaítélésére jogosult intézménytől vagy egyetemi kartól. @hu
label: mezun ile ilişkilidir @tr
definition: Bir temsilciyi, derece veren bir kurum veya fakülteden bir akademik derece alan bir temsilciyle ilişkilendirir. @tr

is graduate of
status: Published
type: Property
lexical alias: graduateOf.en
definition: Relates an agent to an institution or faculty that granted an academic degree to an agent.
inverse of: has graduate
label: er dimittend fra @da
definition: Relaterer en agent til en institution eller fakultet, der har tildelt en akademisk grad til en agent. @da
label: is afgestudeerde van @nl
label: هو خريج في @ar
definition: يربط بين وكيل ومؤسسة أو كلية تمنح درجة أكاديمية لوكيل. @ar
label: loppututkinnon suorittanut (toimija) @fi
definition: Liittää toimijan laitokseen tai tiedekuntaan, joka on myöntänyt toimijalle akateemisen loppututkinnon. @fi
label: ist Graduierte/Graduierter von @de
definition: Setzt einen Akteur in Beziehung zu einer grad-verleihenden Institution, die einem Akteur einen akademischen Grad verleiht. @de
label: 是……的毕业生 @zh-hans
definition: 将一个行为者与授予一个行为者学位的机构或院系关联起来。 @zh-hans
label: diplomása a következőnek: @hu
definition: Hozzákapcsol egy ágenst egy intézményhez vagy egyetemi karhoz, amely tudományos fokozatot ad egy személynek. @hu
label: mezunudur @tr
definition: Bir temsilciyi, bir temsilciye akademik derece veren bir fakülte veya bir kurumla ilişkilendirir. @tr

has granting institution or faculty (Deprecated)
status: Deprecated
definition: Relates a resource to an institution or faculty conferring an academic degree on a candidate. (Deprecated)
type: Property
lexical alias: grantingInstitutionOrFaculty.en
label: har tildelende institution eller fakultet @da
definition: Relaterer et værk til en institution eller et fakultet, der tildeler en kandidat en akademisk grad. @da
sub property of: has other agent associated with resource (Deprecated)

is graphic novelization of
status: Published
type: Property
lexical alias: graphicNovelizationOf.en
definition: Relates a resource to a resource that is adapted as a graphic novel.
inverse of: is adapted as graphic novel
sub property of: is adaptation of
label: er omskrivning til graphic novel af @da
definition: Relaterer et en ressource til en ressource, der er blevet bearbejdet som en graphic novel. @da
label: is stripboekversie van @nl
label: هو رواية مصورة لـ @ar
definition: يربط بين مصدر ومصدر تم اقتباسها كرواية مصورة. @ar
label: sarjakuvaversio aineistosta @fi
definition: Liittää aineiston aineistoon, joka on sovitettu sarjakuvaksi. @fi
label: ist Bearbeitung als Graphic Novel von @de
definition: Setzt eine Ressource in Beziehung zu einer Ressource, die als Graphic Novel bearbeitet ist. @de
label: 是……的图解小说化 @zh-hans
definition: 将一种资源与被改编为图解小说的一种资源关联起来。 @zh-hans
label: képregény-feldolgozása a következőnek: @hu
definition: Hozzákapcsol egy forrást egy forráshoz, amelyet képregényként adaptáltak. @hu
label: çizgi romanlaştırılmasıdır @tr
definition: Bir kaynağı, çizgi roman olarak uyarlanmış bir kaynakla ilişkilendirir. @tr

has groove characteristic
status: Published
definition: Relates a resource to a groove width of an analog disc or a groove pitch of an analog cylinder.
type: Property
sub property of: has sound characteristic
lexical alias: grooveCharacteristic.en
label: har rillekarakteristika @da
definition: Relaterer en ressource til rillebredde på en analog disc eller rilledybde på en analog cylinder. @da
label: heeft groefkenmerken @nl
label: له خاصية مسار @ar
definition: يربط بين مصدر وعرض مسار لقرص تناظري أو مسار لاسطوانة تناظرية. @ar
label: uran ominaisuudet aineistossa @fi
definition: Liittää aineiston analogisen levyn uran leveyteen tai analogisen äänilieriön urajakoon. @fi
label: hat Rilleneigenschaft @de
definition: Setzt eine Ressource in Beziehung zu einer Rillenbreite einer Schallplatte oder einem Rillenabstand eines Phonographenzylinders. @de
label: 有纹槽特征 @zh-hans
definition: 将一种资源与模拟盘的纹槽宽度或模拟筒的纹槽间距关联起来。 @zh-hans
label: barázdajellemzője a következő: @hu
definition: Hozzákapcsol egy forrást egy analóg lemez vagy diszk barázdaszélességéhez, vagy egy analóg henger barázdamagasságához. @hu
has subproperty: has groove pitch
has subproperty: has groove width
label: oluk özelliği ile ilişkilidir @tr
definition: Bir kaynağı analog bir diskin oluk genişliği veya analog bir silindirin yiv aralığı ile ilişkilendirir. @tr

has groove pitch
status: Published
lexical alias: groovePitch.en
definition: Relates a resource to a groove pitch of an analog cylinder.
type: Property
sub property of: has groove characteristic
label: heeft groefpitch @nl
label: له مسار أسطوانة @ar
definition: يربط بين مصدر ومسارات مفحورة على اسطوانة تناظرية. @ar
label: har rilledybde @da
definition: Relaterer en ressource til en rilledybde i en analog cylinder. @da
label: urajako aineistossa @fi
definition: Liittää aineiston äänilieriön urajakoon. @fi
label: hat Rillenabstand @de
definition: Setzt eine Ressource in Beziehung zu einem Abstand zwischen den Rillen eines Phonographenzylinders. @de
label: 有槽纹间距 @zh-hans
definition: 将一种资源与模拟筒的纹槽间距关联起来。 @zh-hans
label: barázdamagassága a következő: @hu
definition: Hozzákapcsol egy forrást egy analóg henger barázdamagasságához. @hu
label: oluk aralığı ile ilişkilidir @tr
definition: Bir kaynağı, bir analog silindirin oluk aralığıyla ilişkilendirir. @tr

has groove width
status: Published
lexical alias: grooveWidth.en
definition: Relates a resource to a groove width of an analog disc.
type: Property
sub property of: has groove characteristic
label: heeft groefwijdte @nl
label: له عرض مسار قرص @ar
definition: يربط بين مصدر وعرض المسار لقرص تناظري. @ar
label: har rillebredde @da
definition: Relaterer en ressource til en rillebredde på en analog disc. @da
label: uran leveys aineistossa @fi
definition: Liittää aineiston analogisen levyn uran leveyteen. @fi
label: hat Rillenbreite @de
definition: Setzt eine Ressource in Beziehung zu einer Breite der Rillen auf einer Schallplatte. @de
label: 有槽纹宽度 @zh-hans
definition: 将一种资源与模拟盘的槽纹宽度关联起来。 @zh-hans
label: barázdaszélessége a következő: @hu
definition: Hozzákapcsol egy forrást egy analóg lemez barázdaszélességéhez. @hu
label: oluk genişliği ile ilişkilidir @tr
definition: Bir kaynağı, bir analog diskin oluk genişliğiyle ilişkilendirir. @tr

has guide
status: Published
definition: Relates a resource to a resource that guides a user through the use of a predominant resource, using notes, learning and study aids, exercises, problems, questions and answers, instructor or student materials, etc.
type: Property
sub property of: is augmented by
inverse of: is guide to
lexical alias: guide.en
label: er vejledning @da
definition: Relater en ressource til en ressource, der hjælper en bruger med at anvende en dominerende ressource vha. noter, lære- og studiehjælpemidler, øvelser, problemstillinger, spørgsmål og svar, lærer- og elevmaterialer etc. @da
label: heeft gids @nl
label: opas aineistoon @fi
label: له دليل إرشادي @ar
definition: يربط بين مصدر ومصدر يُرشد المستخدم من خلال استخدام مصدر سائد، باستخدام الملاحظات، ووسائل التعلم والدراسة، والتمارين، والمسائل، والأسئلة والأجوبة، ومواد المعلم أو الطلاب، إلخ. @ar
definition: Liittää aineiston aineistoon,joka opastaa käyttäjää aineiston käytössä muistiinpanojen, opiskelumateriaalien, harjoitusten, tehtävien, kysymysten ja vastausten tai muiden opettajan tai opiskelijan aineistojen avulla. @fi
label: hat Orientierungshilfe @de
definition: Setzt eine Ressource in Beziehung zu einer Ressource, die Benutzende durch die Verwendung von Anmerkungen, Lern- und Studienhilfen, Übungen, Problemstellungen, Fragen und Antwort oder anderen Lehr- oder Schülermaterialien durch die Nutzung einer Hauptressource führt. @de
label: 有指南 @zh-hans
definition: 将一种资源与用注释、学习和研究工具、练习、提问、问题与答案、教师或学生参考资料等对使用者使用主要资源提供指导的一种资源关联起来。 @zh-hans
label: kalauza a következő: @hu
definition: Hozzákapcsol egy forrást egy forráshoz, amely a használót végigvezeti egy domináns forrás használatán jegyzetek, tanulási és tanulmányi segédletek, gyakorlatok, problémák, kérdések és válaszok, oktatói vagy diákanyagok stb. felhasználásával. @hu
label: rehber ile ilişkilidir @tr
definition: Bir kaynağı, notlar, eğitim ve öğrenim yardımcıları, alıştırmalar, problemler, sorular ve cevaplar, eğitmen veya öğrenci materyalleri vb. kullanarak bir kullanıcıya ana kaynağın kullanımı boyunca rehberlik eden kaynakla ilişkilendirir. @tr

is guide to
status: Published
definition: Relates a resource to a resource that is augmented by a related resource that consists of material, such as notes, learning and study aids, exercises, problems, questions and answers, instructor or student materials, etc., to help a user of a predominant resource.
type: Property
sub property of: is augmentation of
inverse of: has guide
lexical alias: guideTo.en
label: er vejledning til @da
definition: Relaterer en ressource til en ressource, der er beriget af en anden ressource, der består af materiale, som kan hjælpe brugeren af hovedværket, såsom noter, lære- og studiehjælpemidler, øvelser, problemstillinger, spørgsmål og svar, lærer- eller elevmaterialer etc @da
label: is gids bij @nl
label: opas aineistoon @fi
label: هو دليل إرشادي لـ @ar
definition: يربط بين مصدر ومصدر تم تعزيزه من خلال مصدر ذي صلة يتكون من مواد، مثل الملاحظات، ووسائل التعلم والدراسة، والتمارين، والمسائل، والأسئلة والأجوبة، ومواد المعلم أو الطلاب، إلخ، لمساعدة مستخدم مصدر سائد. @ar
definition: Liittää aineiston aineistoa laajentavaan aineistoon, joka koostuu pääaineiston käyttäjää auttavasta aineistosta kuten muistiinpanoista, opiskelumateriaaleista, harjoituksista, tehtävistä, kysymyksistä ja vastauksista tai muista opettajan tai opiskelijan aineistoista. @fi
label: ist Orientierungshilfe für @de
definition: Setzt eine Ressource in Beziehung zu einer Ressource, die durch eine in Beziehung stehende Ressource erweitert ist, die zum Beispiel Anmerkungen, Lern- und Studienhilfen, Übungen, Problemstellungen, Fragen und Antworten, Lehr- oder Schülermaterialien und so weiter enthält, und Benutzende bei der Verwendung einer Hauptressource unterstützt. @de
label: 是……的指南 @zh-hans
definition: 将一种资源与作为被由注释、学习和研究工具、练习、提问、问题与答案、教师或学生参考资料等组成对使用者使用主要资源提供指导的一种相关资源附增的一种资源关联起来。 @zh-hans
label: kalauzzal ellátott @hu
definition: Hozzákapcsol egy forrást egy forráshoz, amelyet bővítenek egy másik forrással, amelynek tartalma, mint például jegyzetek, tanulási és tanulmányi segédletek, gyakorlatok, problémák, kérdések és válaszok, oktatói és diákanyagok stb., egy domináns forrás használóját segíti. @hu
label: rehberdir @tr
definition: Bir kaynağı, kullanıcısına yardımcı olmak adına notlar, öğrenmeye ve çalışmaya yardımcı materyaller, alıştırmalar, problemler, sorular, cevaplar, eğitmen veya öğrenci materyalleri vb. gibi artırılmış içeriğe sahip başka bir kaynakla ilişkilendirir. @tr

has hereditary title
status: Published
definition: Relates an agent to a word or phrase indicative of royalty, nobility, etc., associated with an agent.
type: Property
lexical alias: hereditaryTitle.en
label: har arvelig titel @da
definition: Relaterer ressource til en adelstitel etc., knyttet til en agent. @da
label: heeft erfelijke titel @nl
label: peritty arvonimi @fi
label: له عنوان تقليدي @ar
definition: يربط بين وكيل ولقب نبالة، إلخ.، مرتبط بوكيل. @ar
definition: Liittää toimijan häneen liittyvään aatelisnimeen tms. @fi
label: hat Erbtitel @de
definition: Setzt einen Akteur in Beziehung zu einem Adelstitel und so weiter, der mit einem Akteur in Verbindung steht. @de
label: 有世袭头衔 @zh-hans
definition: 将一个行为者与和一个行为者有关的表示皇室、贵族等的一个词或短语关联起来。 @zh-hans
definition: Relaciona un agent amb una paraula o frase indicativa de reialesa, noblesa, etc., associada amb un agent. @ca
label: örökletes titulusa a következő: @hu
definition: Hozzákapcsol egy ágenst egy ágenssel társított nemesi címhez, stb-hez. @hu
label: soyluluk unvanı ile ilişkilidir @tr
definition: Bir temsilciyi, bir temsilciyle bağlantılı olan bir soyluluk unvanı vb. ile ilişkilendirir. @tr

has hierarchical subordinate
status: Published
definition: Relates an agent to an agent who is subordinate to another agent.
type: Property
inverse of: has hierarchical superior
lexical alias: hierarchicalSubordinate.en
label: har hierarkisk underordnet @da
definition: Relaterer en agent der er underordnet en agent til en agent. @da
label: heeft dochteronderneming @nl
label: له رتبة أدنى في التسلسل الرئاسي @ar
definition: يربط بين وكيل ووكيل في مرتبة أدنى من وكيل ذي صلة. @ar
label: alayhteisö (yhteistoimija) @fi
definition: Liittää yhteistoimijan yhteistoimijaan, joka on hierarkkisesti toisen yhteistoimijan alainen. @fi
label: hat untergeordneten Akteur @de
definition: Setzt einen Akteur in Beziehung zu einem Akteur, der einem anderen Akteur untergeordnet ist. @de
label: 有下级 @zh-hans
definition: 将一个行为者与另一个行为者的下级行为者关联起来。 @zh-hans
definition: Relaciona un agent amb un agent que està subordinat a un altre agent. @ca
label: hierarchikus alárendeltje a következő: @hu
definition: Hozzákapcsol egy ágenst, amely egy kapcsolódó ágens hierarchikus alárendeltje, egy ágenshez. @hu
label: hiyerarşik olarak bağlı alt kuruluş ile ilişkilidir @tr
definition: İlgili bir temsilciye bağlı olan bir temsilciyi bir temsilciyle ilişkilendirir. @tr

has hierarchical superior
status: Published
definition: Relates an agent to an agent who is hierarchically superior to another agent.
type: Property
inverse of: has hierarchical subordinate
lexical alias: hierarchicalSuperior.en
label: har hierarkisk overordnet @da
definition: Relaterer en agent der er hierarkisk overordnet en anden agent til en agent. @da
label: heeft moederonderneming @nl
label: له رتبة أعلى في التسلسل الرئاسي @ar
definition: يربط بين وكيل ووكيل في مرتبة أعلى في التسلسل الرئاسي من وكيل ذي صلة. @ar
label: kattoyhteisö (yhteistoimija) @fi
definition: Liittää yhteistoimijan yhteistoimijaan, joka on hierarkkisesti toista yhteistoimijaa ylempänä. @fi
label: hat übergeordneten Akteur @de
definition: Setzt einen Akteur in Beziehung zu einem Akteur, der einem anderen Akteur übergeordnet ist. @de
label: 有上级 @zh-hans
definition: 将一个行为者与另一个行为者的上级行为者关联起来。 @zh-hans
definition: Relaciona un agent amb un agent que és jeràrquicament superior a un altre agent. @ca
label: hierarchikus felettese a következő: @hu
definition: Hozzákapcsol egy ágenst, amely egy kapcsolódó ágens hierarchikus felettese, egy ágenshez. @hu
label: hiyerarşik olarak bağlı üst kuruluş ile ilişkilidir @tr
definition: İlgili bir temsilciden hiyerarşik olarak üstün olan bir temsilciyi bir temsilciyle ilişkilendirir. @tr

has history of resource
status: Published
definition: Relates a resource to a summary of information about the history of a resource.
type: Property
lexical alias: historyOfResource.en
label: har ressourcehistorie @da
definition: Relaterer en ressource til en opsummering af oplysninger om en ressources historie. @da
label: heeft geschiedenis van resource @nl
label: له تاريخ مصدر @ar
definition: يربط بين مصدر وملخص معلومات عن تاريخ مصدر ما. @ar
label: aineiston historia @fi
definition: Liittää aineiston tiivistelmään aineiston historiatiedoista. @fi
label: hat Geschichte einer Ressource @de
definition: Setzt eine Ressource in Beziehung zu Informationen über die Geschichte einer Ressource. @de
label: 有资源的历史 @zh-hans
definition: 将一种资源与关于一种资源历史的信息提要关联起来。 @zh-hans
label: forrás története a következő: @hu
definition: Hozzákapcsol egy forrást egy forrás történetéről szóló információk összefoglalásához. @hu
label: kaynağın geçmişi ile ilişkilidir @tr
definition: Bir kaynağı, bir kaynağın tarihinin kısa özet bilgisiyle ilişkilendirir. @tr

has honouree
status: Published
definition: Relates a resource to an agent who is honoured by a resource.
type: Property
sub property of: has other agent associated with resource (Deprecated)
inverse of: is honouree of
lexical alias: honouree.en
alternative label: has honoree
label: har festskriftmodtager @da
definition: Relaterer en ressource til en agent, der hædres af en ressource. @da
label: heeft geëerde @nl
label: kunnioitettu henkilö aineistossa @fi
label: له مكرَّم @ar
definition: يربط مصدر بوكيل مكرَّم من مصدر. @ar
definition: Liittää aineiston toimijaan, jolle aineistolla osoitetaan arvostusta ja kunnioitusta. @fi
label: hat Gefeierte/Gefeierten @de
definition: Setzt eine Ressource in Beziehung zu einem Akteur, der durch eine Ressource geehrt wird. @de
label: 有被纪念者 @zh-hans
definition: 将一种资源与被一种资源纪念的一个行为者关联起来。 @zh-hans
label: méltatottja a következő: @hu
definition: Hozzákapcsol egy forrást egy ágenshez, amelyet a forrás méltat. @hu
label: onurlandırılan kişi ile ilişkilidir @tr
definition: Bir kaynağı, bir kaynak tarafından onurlandırılan bir temsilci ile ilişkilendirir. @tr

is honouree of
status: Published
definition: Relates an agent to a resource that marks the esteem of and respect for an agent.
type: Property
sub property of: is other agent associated with resource of (Deprecated)
inverse of: has honouree
lexical alias: honoureeOf.en
alternative label: honoree of
label: er festskriftmodtager af @da
definition: Relaterer en agent, der hædres af en ressource til en ressource. @da
label: is geëerde van @nl
label: له مكرَّم لـ @ar
definition: يربط بين وكيل ومصدر يدل على تقدير وحترام لوكيل. @ar
alternative label: مكرَّم لـ @ar
label: kunnioitettu henkilö (toimija) aineistossa @fi
definition: Liittää toimijan aineistoon, jolla osoitetaan arvostusta ja kunnioitusta toimijalle. @fi
alternative label: kunnioitettu henkilö @fi
label: ist Gefeierte/Gefeierter von @de
definition: Setzt einen Akteur in Beziehung zu einer Ressource, die einen Akteur ehrt. @de
alternative label: ……的被纪念者 @zh-hans
label: 是……的被纪念者 @zh-hans
definition: 将一个行为者与表示对一个行为者尊重或尊敬的一种资源关联起来。 @zh-hans
alternative label: méltatottja: @hu
label: méltatottja a következőnek: @hu
definition: Hozzákapcsol egy ágenst egy forráshoz, amely jelzi egy ágens megbecsülését és tiszteletét. @hu
label: onurlandırılanıdır @tr
definition: Bir temsilciyi, bir temsilciye olan saygısını ve hürmetini gösteren bir kaynakla ilişkilendirir. @tr

has horizontal scale of cartographic content
status: Published
definition: Relates a resource to a ratio of horizontal distances in the cartographic content of a resource to the actual distances they represent.
type: Property
sub property of: has scale
lexical alias: horizontalScaleOfCartographicContent.en
label: har horisontal målestok for kartografisk indhold @da
definition: Relaterer en ressource til et forhold mellem horisontale afstande i et udtryks kartografiske indhold og de virkelige afstande, de repræsenterer. @da
label: heeft horizontale schaal van cartografische content @nl
label: له مقياس أفقي لمحتوى رسم خرائطي @ar
definition: يربط بين مصدر ونسبة المسافات الأفقية في محتوى رسم خرائطي لمصدر بالمسافات الفعلية التي يمثلها. @ar
label: kartografisen sisällön horisontaalinen mittakaava aineistossa @fi
definition: Liittää aineiston kartografisen sisällön horisontaalisten etäisyyksien suhteeseen niiden esittämiin todellisiin mittoihin. @fi
label: hat horizontalen Maßstab bei kartografischem Inhalt @de
definition: Setzt eine Ressource in Beziehung zu einem Verhältnis der horizontalen Entfernungen bei kartografischem Inhalt einer Ressource zu den tatsächlichen Entfernungen, die sie repräsentieren. @de
label: 有地图内容的水平比例尺 @zh-hans
definition: 将一种资源与资源的地图内容的水平距离与它代表的实际距离的比关联起来。 @zh-hans
label: kartográfiai tartalom vízszintes méretaránya a következő: @hu
definition: Hozzákapcsol egy forrást a vízszintes távolságok arányához egy forrás kartográfiai tartalmában, amely a tényleges távolságokat képviseli és reprezentálja. @hu
label: kartografik içeriğin yatay ölçeği ile ilişkilidir @tr
definition: Bir kaynağı, kaynağın kartografik içeriğindeki yatay mesafelerin temsil ettikleri gerçek mesafelere oranıyla ilişkilendirir. @tr

has host
status: Published
definition: Relates a resource to an agent who is a performer who contributes to a resource by leading a program, often broadcast, that includes other performers.
type: Property
sub property of: has performer
inverse of: is host of
lexical alias: host.en
label: har vært @da
definition: Relaterer en ressource til en performer, der har bidraget til en ressource ved at lede et program, ofte transmitteret, der omfatter andre gæster, optrædende etc. @da
label: heeft gastgever @nl
label: juontaja aineistossa @fi
label: له مُضِيف @ar
definition: يربط مصدر بوكيل يُمثل مؤدِ يُساهم في مصدر من خلال إدارة برنامج، غالبًا مُذاع، ويستضيف ضيوفًا وفنانين ووكلاءآخرين. @ar
definition: Liittää aineiston toimijaan, joka on on osallisena (useimmiten lähetettyyn) ohjelmaan, johon osallistuu muita esiintyjiä. @fi
label: ist Gastgeberin/Gastgeber @de
definition: Setzt eine Ressource in Beziehung zu einer Ausführenden/einem Ausführenden, die/der zu einer Ressource beiträgt, indem sie/er eine Veranstaltung (meist eine Sendung) leitet, an der auch andere Ausführende teilnehmen. @de
label: 有主持人 @zh-hans
definition: 将一种资源与作为一个表演者通过主导节目（经常是广播节目）并包括其他表演者而对一种资源有贡献的一个行为者关联起来。 @zh-hans
label: házigazdája a következő: @hu
definition: Hozzákapcsol egy forrást egy előadó ágenshez, amely hozzájárul egy forráshoz egy program, gyakran sugárzott műsor, vezetésével, amelyben más vendégek, előadók stb. is közreműködnek. @hu
label: sunucu ile ilişkilidir @tr
definition: Bir kaynağı, başka sanatçıları içeren bir programa, sıklıkla radyo ve televizyon yayınına liderlik ederek kaynağa katkıda bulunan bir sanatçı olan temsilci ile ilişkilendirir. @tr

has host institution
status: Published
definition: Relates a resource to an agent who hosts a conference, exhibition, or other event that gives rise to a resource, but has little or no responsibility of an agent for the content.
type: Property
sub property of: has other agent associated with resource (Deprecated)
inverse of: is host institution of
lexical alias: hostInstitution.en
label: har værtsinstitution @da
definition: Relaterer en ressource til en korporation der afholder en event, udstilling, konference, etc., der fører til en ressource, som korporationen har ringe eller intet ansvar for indholdet af. @da
label: heeft hostorganisatie @nl
label: له مؤسسة مُضِيفة @ar
definition: يربط مصدر بوكيل يستضيف مؤتمرًا، معرضًا، أو حدثًا آخر يؤدي إلى مصدر، ولكن لديه مسؤولية محدودة عن وكيل أو غير مسؤول مطلقًا عن المحتوى. @ar
label: isäntäorganisaatio @fi
definition: Liittää aineiston toimijaan, joka isännöi konferenssin, näyttelyn tai muun tapahtuman, mutta jonka sisällöstä toimijalla on vähän tai ei lainkaan vastuuta. @fi
label: hat gastgebende Institution @de
definition: Setzt eine Ressource in Beziehung zu einem Akteur, der eine Konferenz, eine Ausstellung oder eine andere Veranstaltung ausrichtet, die eine Ressource zur Folge hat, der aber für den Inhalt wenig oder gar keine Verantwortung trägt. @de
label: 有承办机构 @zh-hans
definition: 将一种资源与承办产生一种资源的会议、展览或其他活动但对其内容没有或很少责任的一个行为者关联起来。 @zh-hans
label: rendező intézménye a következő: @hu
definition: Hozzákapcsol egy forrást egy forrás létrejöttében szerepet játszó konferenciát, kiállítást vagy más eseményt rendező ágenshez, a tartalomért felelős ágens iránti felelőssége azonban nincs vagy csekély. @hu
label: ev sahibi kurum ile ilişkilidir @tr
definition: Bir kaynağı, bir kaynağa yol açan bir konferansa, sergiye veya başka bir etkinliğe ev sahipliği yapan, ancak içerik için bir temsilcinin çok az sorumluluğu olan veya hiç sorumluluğu olmayan bir temsilci ile ilişkilendirir. @tr

is host institution of
status: Published
definition: Relates an agent to a resource that arises from a conference, exhibition, or other event that is hosted by an agent with little or no responsibility for the content.
type: Property
sub property of: is other agent associated with resource of (Deprecated)
inverse of: has host institution
lexical alias: hostInstitutionOf.en
label: er værtsinstitution for @da
definition: Relaterer en korporation, der afholder en event, udstilling, konference, etc., der fører til en ressource til en ressource. @da
label: is hostorganisatie van @nl
label: isäntäorganisaatio (aineistoon liittyvä yhteistoimija) @fi
label: هي مؤسسة مُضيفة لـ @ar
definition: يربط وكيلًا يستضيف حدثًا، معرضًا، مؤتمرًا...إلخ، مما يؤدي إلى وجود مصدر. @ar
definition: Liittää toimijan aineistoon, jolle alun antavan konferenssin, näyttelyn tai muun tapahtuman toimija sännöi, mutta jonka sisällöstä toimijalla on vähän tai ei lainkaan vastuuta. @fi
label: ist gastgebende Institution von @de
definition: Setzt einen Akteur in Beziehung zu einer Ressource, bei der der Akteur eine Veranstaltung, eine Ausstellung, eine Konferenz und so weiter ausrichtet, aus der eine Ressource hervorgeht. @de
label: 是……的承办机构 @zh-hans
definition: 将一个行为者与一个行为者承办但对内容没有或很少责任的会议、展览或其他活动所产生的资源关联起来。 @zh-hans
definition: Relaciona un agent amb un recurs que sorgeix d’un congrés, exposició o un altre esdeveniment l'amfitrió del qual és un agent amb poca o nula responsablitat pel contingut. @ca
label: rendező intézménye a következőnek: @hu
definition: Hozzákapcsol egy ágenshez, amely olyan eseményt, kiállítást, konferenciát, stb rendez, amelyből egy forrás keletkezik, egy forráshoz. @hu
label: ev sahibi kurumudur @tr
definition: Bir kaynağa yol açan bir etkinliğe, sergiye, konferansa vb. ev sahipliği yapan bir aracıyı bir kaynakla ilişkilendirir. @tr

is host of
status: Published
definition: Relates an agent to a resource that includes a contribution by an agent who is a performer of leading a program, often broadcast, that includes other performers.
type: Property
sub property of: is performer of
inverse of: has host
lexical alias: hostOf.en
label: er vært for @da
definition: Relaterer en udøver, der bidrager til en ressource ved at lede et program, ofte transmitteret, der inkluderer andre gæster, optrædende etc. til en ressource @da
label: is gastgever van @nl
label: هو مُضيف لـ @ar
definition: يربط بين وكيل ومصدر يتضمن إسهام وكيل في إدارة برنامج، غالبًا مُذاع، ويستضيف ضيوفا وفنانين ووكلاء آخرين. @ar
label: juontajana aineistossa @fi
definition: Liittää toimijan aineistoon, jonka tekemiseen toimija, joka on esittäjä, osallistuu (useimmiten lähetettyyn) ohjelmaan, johon osallistuu muita esiintyjiä. @fi
label: ist Gastgeberin/Gastgeber von @de
definition: Setzt einen Akteur in Beziehung zu einer Ressource, zu der ein Akteur beiträgt, indem er eine Veranstaltung (meist eine Sendung) leitet, an der auch andere Ausführende teilnehmen. @de
label: 是……的主持人 @zh-hans
definition: 将一个行为者与包括作为一个表演者通过主导节目（经常是广播节目）并包括其他表演者的一个行为者的贡献的一种资源关联起来。 @zh-hans
label: házigazdája a következőnek: @hu
definition: Hozzákapcsol egy ágenst egy forráshoz, amely magában foglalja egy ágens közreműködését egy program, gyakran sugárzott műsor, vezetésében, amelyen más előadók vesznek részt. @hu
label: sunucusudur @tr
definition: Bir temsilciyi, sıklıkla yayınlanan ve diğer sanatçıları içeren bir programa liderlik eden sanatçı olan temsilcinin katkısını içeren bir kaynakla ilişkilendirir. @tr

has identifier for agent
status: Published
definition: Relates an agent to a nomen that is an appellation of agent that consists of a code, number, or other string, usually independent of natural language and social naming conventions, used to identify an agent.
type: Property
lexical alias: identifierForAgent.en
label: har identifikator for agent @da
definition: Relaterer en ressource til en tegnrække, der er entydigt knyttet til en agent eller til en erstatning for en agent, fx en autoritetsregistrering @da
sub property of: has identifier for entity
inverse of: is identifier for agent of
label: heeft identificatie voor actor @nl
label: toimijan tunniste @fi
label: له معرف لوكيل @ar
definition: يربط بين وكيل وتسمية لوكيل يتكون من رمز، رقم، أو سلسلة تمثيلات أخرى، عادة ما تكون مستقلة عن اللغة الطبيعية وعن التسميات المتعارف عليها اجتماعيًا، المستخدمة في تحديد هوية وكيل. @ar
definition: Liittää toimijan nimitykseen, joka koostuu koodista, numerosta tai muusta merkkijonosta ja joka yleensä on luonnollisesta kielestä ja kielen sosiaalisista konventioista riippumaton toimijan tunnistamiskeino. @fi
label: hat Identifikator für einen Akteur @de
definition: Setzt einen Akteur in Beziehung zu einer Bezeichnung für einen Akteur, die aus einem Code, einer Nummer oder einer anderen Zeichenkette besteht, der/die normalerweise nicht in natürlicher Sprache und unabhängig von den sozialen Benennungskonventionen ist und zur Identifizierung eines Akteurs verwendet wird. @de
label: 有行为者的标识符 @zh-hans
definition: 将一个行为者与一个作为由代码、数字、或其他串构成、通常独立于自然语言和社会命名惯例、用以标识一个行为者的一个行为者称谓的命名关联起来。 @zh-hans
definition: Relaciona un agent amb un nomen que és una apel·lació d’agent que consisteix en un codi, número o qualsevol altra cadena, normalment independent del llenguatge natural i de les convencions lingüístiques socials, usada per identificar un agent. @ca
label: ágens azonosítója a következő: @hu
definition: Hozzákapcsol egy ágenst egy ágens megnevezéséhez, amely egy kód, szám, vagy más típusú karakterláncból áll, amely általában független a természetes nyelvektől és a társadalmi névkonvencióktól, és egyetlen ágens azonosítására használják. @hu
label: temsilcinin tanımlayıcısı ile ilişkilidir @tr
definition: Bir temsilciyi, bir temsilciyi tanımlamak için kullanılan, genellikle doğal dilden ve sosyal adlandırma kurallarından bağımsız olarak, bir kod, sayı veya başka bir dizgeden oluşan bir temsilci unvanıyla ilişkilendirir. @tr

is identifier for agent of
status: Published
type: Property
lexical alias: identifierForAgentOf.en
definition: Relates a nomen to an agent who has an appellation of agent who is a reference code taken from a vocabulary encoding scheme.
sub property of: is identifier for entity of
inverse of: has identifier for agent
scope note: The coded string is usually independent of natural language and social naming conventions.
label: is identificatie voor actor van @nl
label: هو معرف لوكيل لـ @ar
definition: يربط بين تسمية ووكيل له تسمية لوكيل عبارة عن رمز إحالة مأخوذ من خطة ترميز مفردات. @ar
scope note: عادة ما تكون سلسلة التمثيلات المرمزة مستقلة عن اللغة الطبيعية وعن التسميات المتعارف عليها اجتماعيًا. @ar
label: er identifkator for agent af @da
definition: Relaterer et nomen til en agent, som har en benævnelse for agent, der er en referencekode hentet fra et vokabularkodningsskema. @da
scope note: Den kodede streng er normalt uafhængig af naturligt sprog og sociale navngivningskonventioner. @da
label: tunniste toimijalle @fi
definition: Liittää nomenin toimijaan, jolla on sanaston merkintäjärjestelmästä otettu viitekoodi nimityksenään. @fi
scope note: Koodattu merkkijono on yleensä luonnollisesta kielestä ja sosiaalisista nimeämisen käytännöistä riippumaton. @fi
label: ist Identifikator für einen Akteur von @de
definition: Setzt ein Nomen in Beziehung zu einem Akteur, der über eine Bezeichnung für einen Akteur verfügt, die einen Referenzcode darstellt, der aus einem Vocabulary Encoding Scheme entnommen wird. @de
scope note: Die kodierte Zeichenkette ist normalerweise nicht in natürlicher Sprache und unabhängig von den sozialen Benennungskonventionen. @de
label: 是……的行为者的标识符 @zh-hans
definition: 将一个命名与有一个取自一个词表编码体系的指称代码作为行为者称谓的一个行为者关联起来。 @zh-hans
scope note: 编码串通常独立于自然语言和社会命名惯例。 @zh-hans
label: ágensazonosítója a következőnek: @hu
definition: Hozzákapcsol egy noment egy ágenshez, amelynek van olyan ágensmegnevezése, amely egy szótárkódolási sémából származó hivatkozási kód. @hu
scope note: A kódolt karakterlánc általában független a természetes nyelvektől és társadalmi névkonvencióktól. @hu
label: temsilcisinin tanımlayıcısıdır @tr
definition: Bir isim, bir kelime kodlama şemasından alınan bir referans kodu olan bir temsilci unvanına sahip olan bir temsilciyle ilişkilendirir. @tr
scope note: Kodlanmış dizi genellikle doğal dilden ve sosyal adlandırma kurallarından bağımsızdır. @tr

has identifier for entity
status: Published
sub property of: has appellation of entity
type: Property
lexical alias: identifierForEntity.en
definition: Relates an entity to a nomen that is an appellation of entity that consists of a code, number, or other string, usually independent of natural language and social naming conventions, used to identify an entity.
scope note: The coded string is usually independent of natural language and social naming conventions.
inverse of: is identifier for entity of
label: heeft identificatie voor entiteit @nl
label: له معرف لكيان @ar
definition: يربط بين كيان وتسمية لكيان يتكون من رمز، رقم، أو سلسلة تمثيلات أخرى، مستقلة عادة عن اللغة الطبيعية وعن التسميات المتعارف عليها اجتماعيًا، المستخدمة لتعريف كيان. @ar
scope note: عادة ما تكون سلسلة التمثيلات المرمزة مستقلة عن اللغة الطبيعية وعن التسميات المتعارف عليها اجتماعيًا. @ar
label: har dentifikator for entitet @da
definition: Relaterer en entitet til en entitetsbenævnelse, der består af kode, nummer, eller anden streng, normalt uafhængig af normalt sprog og sociale navngivningskonventioner, anvendt for at identificere en entitet. @da
scope note: Den kodede streng er normalt uafhængig af naturligt sprog og sociale navngivningskonventioner. @da
label: entiteetin tunniste @fi
definition: Liittää entiteetin entiteetin nimitykseen, joka koostuu koodista, luvusta tai muusta tavallisesti luonnollisesta kielestä ja yleisistä nimeämiskäytännöistä riippumattomasta merkkijonosta, jota käytetään entiteetin dentifiointiin. @fi
scope note: Koodattu merkkijono on yleensä luonnollisesta kielestä ja sosiaalisista nimeämisen käytännöistä riippumaton. @fi
label: hat Identifikator für eine Entität @de
definition: Setzt eine Entität in Beziehung zu einer Bezeichnung für eine Entität, die aus einem Code, einer Nummer oder einer anderen Zeichenkette besteht, der/die normalerweise nicht in natürlicher Sprache und unabhängig von den sozialen Benennungskonventionen ist und zur Identifizierung einer Entität verwendet wird. @de
scope note: Die kodierte Zeichenkette ist normalerweise nicht in natürlicher Sprache und unabhängig von den sozialen Benennungskonventionen. @de
label: 有实体的标识符 @zh-hans
definition: 将一个实体与作为由代码、数字、或其他字符串构成、通常独立于自然语言和社会命名惯例、用以标识实体的实体称谓的一个命名关联起来。 @zh-hans
scope note: 编码串通常独立于自然语言和社会命名惯例。 @zh-hans
definition: Relaciona una entitat amb un nomen que és una apel·lació d’entitat que consisteix en un codi, número o qualsevol altra cadena, normalment independent del llenguatge natural i de les convencions lingüístiques socials, usada per identificar una entitat. @ca
label: entitás azonosítója a következő: @hu
definition: Hozzákapcsol egy entitást egy entitás megnevezéséhez, amely egy kód-, szám-, vagy más típusú karakterláncból áll, amely általában független a természetes nyelvektől és társadalmi névkonvencióktól, és egy ágens azonosítására használják. @hu
scope note: A kódolt karakterlánc általában független a természetes nyelvektől és társadalmi névkonvencióktól. @hu
has subproperty: has identifier for agent
has subproperty: has identifier for resource
has subproperty: has identifier for place
has subproperty: has identifier for timespan
label: varlığın tanımlayıcısı ile ilişkilidir @tr
definition: Bir varlığı, bir varlığı tanımlamak için kullanılan, genellikle doğal dil ve sosyal adlandırma kurallarından bağımsız bir kod, sayı veya başka bir dizgeden oluşan bir varlık unvanı ile ilişkilendirir. @tr
scope note: Kodlanmış dizi genellikle doğal dilden ve sosyal adlandırma kurallarından bağımsızdır. @tr

is identifier for entity of
status: Published
sub property of: is appellation of entity of
type: Property
lexical alias: identifierForEntityOf.en
definition: Relates a nomen to an entity that has a reference code taken from a vocabulary encoding scheme.
inverse of: has identifier for entity
scope note: The coded string is usually independent of natural language and social naming conventions.
label: is identificatie voor entiteit van @nl
label: هو معرف لكيان لـ @ar
definition: يربط بين تسمية وكيان له رمز إحالة مأخوذ من خطة ترميز مفردات. @ar
scope note: عادة ما تكون سلسلة التمثيلات المرمزة مستقلة عن اللغة الطبيعية وعن التسميات المتعارف عليها اجتماعيًا. @ar
label: er identifikator for entitet af @da
definition: Relaterer et noment til en entitet, som jar en referencekode hetet fra et vokabularkodningsskema. @da
scope note: Den kodede streng er normalt uafhængig af naturligt sprog og sociale navngivningskonventioner. @da
label: entiteetin tunniste @fi
definition: Liittää nomenin entiteettiin, jolla on sanaston merkintäjärjestelmästä otettu viitekoodi @fi
scope note: Koodattu merkkijono on yleensä luonnollisesta kielestä ja sosiaalisista nimeämisen käytännöistä riippumaton. @fi
label: ist Identifikator für eine Entität von @de
definition: Setzt ein Nomen in Beziehung zu einer Entität, die über einen Referenzcode verfügt, der aus einem Vocabulary Encoding Scheme entnommen wird. @de
scope note: Die kodierte Zeichenkette ist normalerweise nicht in natürlicher Sprache und unabhängig von den sozialen Benennungskonventionen. @de
label: 是……的实体的标识符 @zh-hans
definition: 将一个命名与有一个取自一个词表编码体系的指称代码的一个实体关联起来。 @zh-hans
scope note: 编码串通常独立于自然语言和社会命名惯例。 @zh-hans
label: azonosító a következő entitáshoz: @hu
definition: Hozzákapcsol egy noment egy entitáshoz, amelynek van egy szótárkódolási sémából származó hivatkozásikódja. @hu
scope note: A kódolt karakterlánc általában független a természetes nyelvektől és társadalmi névkonvencióktól. @hu
has subproperty: is identifier for agent of
has subproperty: is identifier for resource of
has subproperty: is identifier for place of
has subproperty: is identifier for timespan of
label: varlığının tanımlayıcısıdır @tr
definition: Bir ismi, kelime kodlama şemasından alınan bir referans koduna sahip bir varlıkla ilişkilendirir. @tr
scope note: Kodlanmış dizi genellikle doğal dilden ve sosyal adlandırma kurallarından bağımsızdır. @tr

has identifier for resource
status: Published
definition: Relates a resource to a nomen that is an appellation of resource that consists of a code, number, or other string, usually independent of natural language and social naming conventions, used to identify a resource.
type: Property
lexical alias: identifierForResource.en
label: har identifikator for ressourcen @da
definition: Relaterer en ressource til en ressourcebenævnelse, der består af en kode, et nummer, eller anden streng, normalt uafhængig af naturligt sprog og sociale navngivningskonventioner, der tjener til at skelne denne ressource fra andre ressourcer. @da
sub property of: has identifier for entity
inverse of: is identifier for resource of
scope note: The coded string is usually independent of natural language and social naming conventions.
label: heeft identificatie voor resource @nl
label: له معرف لمصدر @ar
definition: يربط بين مصدر وتسمية لمصدر يتكون من رمز، رقم، أو سلسلة تمثيلات أخرى، عادة ما تكون مستقلة عن اللغة الطبيعية وعن التسميات المتعارف عليها اجتماعيًا، المستخدمة في تحديد هوية مصدر. @ar
scope note: عادة ما تكون سلسلة التمثيلات المرمزة مستقلة عن اللغة الطبيعية وعن التسميات المتعارف عليها اجتماعيًا. @ar
scope note: Den kodede streng er normalt uafhængig af naturligt sprog og sociale navnekonventioner. @da
label: aineiston tunniste @fi
definition: Liittää aineiston aineiston nimitykseen, joka koostuu koodista, luvusta tai muusta tavallisesti luonnollisesta kielestä ja yleisistä nimeämiskäytännöistä riippumattomasta merkkijonosta, jota käytetään aineiston identifiointiin. @fi
scope note: Koodattu merkkijono on yleensä luonnollisesta kielestä ja sosiaalisista nimeämisen käytännöistä riippumaton. @fi
label: hat Identifikator für eine Ressource @de
definition: Setzt eine Ressource in Beziehung zu einer Bezeichnung für eine Ressource, die aus einem Code, einer Nummer oder einer anderen Zeichenkette besteht, der/die normalerweise nicht in natürlicher Sprache und unabhängig von den sozialen Benennungskonventionen ist und zur Identifizierung einer Ressource verwendet wird. @de
scope note: Die kodierte Zeichenkette ist normalerweise nicht in natürlicher Sprache und unabhängig von den sozialen Benennungskonventionen. @de
label: 有资源的标识符 @zh-hans
definition: 将一种资源与由代码、数字或其他串组成、通常独立于自然语言和社会命名惯例、用于标识一种资源、作为一种的称谓的一个命名关联起来。 @zh-hans
scope note: 编码串通常独立于自然语言和社会命名惯例。 @zh-hans
definition: Relaciona un recurs amb un nomen que és una apel·lació de recurs que consisteix en un codi, número o qualsevol altra cadena, normalment independent del llenguatge natural i de les convencions lingüístiques socials, usada per identificar un recurs. @ca
label: forrás azonosítója a következő: @hu
definition: Hozzákapcsol egy forrást egy forrás megnevezéséhez, amely egy kód, egy szám, vagy más típusú karakterlánc, amely általában független a természetes nyelvektől és a társadalmi névkonvencióktól, és egyetlen forrás azonosítására használják. @hu
scope note: A kódolt karakterlánc általában független a természetes nyelvektől és társadalmi névkonvencióktól. @hu
has subproperty: has fingerprint
has subproperty: has plate number for notated music
has subproperty: has publisher number for notated music
label: kaynağın tanımlayıcısı ile ilişkilidir @tr
definition: Bir kaynağı, bir kaynağı tanımlamak için kullanılan, genellikle doğal dil ve sosyal adlandırma kurallarından bağımsız olarak, bir kod, sayı veya başka bir diziyi içeren bir kaynak unvanıyla ilişkilendirir. @tr
scope note: Kodlanmış dizi genellikle doğal dilden ve sosyal adlandırma kurallarından bağımsızdır. @tr

is identifier for resource of
status: Published
type: Property
lexical alias: identifierForResourceOf.en
definition: Relates a nomen to a resource that has an appellation of resource that is a reference code taken from a vocabulary encoding scheme.
sub property of: is identifier for entity of
inverse of: has identifier for resource
scope note: The coded string is usually independent of natural language and social naming conventions.
label: is identificatie voor resource van @nl
label: هو معرف لمصدر لـ @ar
definition: يربط تسمية بمصدر له تسمية لمصدر عبارة عن رمز إحالة مأخوذ من خطة ترميز مفردات. @ar
scope note: عادة ما تكون سلسلة التمثيلات المرمزة مستقلة عن اللغة الطبيعية وعن التسميات المتعارف عليها اجتماعيًا. @ar
label: er identifkator for ressource af @da
definition: Relaterer et nomen til en ressource der har en ressourcebenævnelse, som er en referencekode hentet fra et vokabularkodningsskema. @da
scope note: Den kodede streng er normalt uafhængig af naturligt sprog og sociale navngivningskonventioner. @da
label: tunniste aineistolle @fi
definition: Liittää nomenin aineistoon, jolla jolla on sanaston merkintäjärjestelmästä otettu viitekoodi nimityksenään. @fi
scope note: Koodattu merkkijono on yleensä luonnollisesta kielestä ja sosiaalisista nimeämisen käytännöistä riippumaton. @fi
label: ist Identifikator für eine Ressource von @de
definition: Setzt ein Nomen in Beziehung zu einer Ressource, die über eine Bezeichnung für eine Ressource verfügt, die einen Referenzcode darstellt, der aus einem Vocabulary Encoding Scheme entnommen wird. @de
scope note: Die kodierte Zeichenkette ist normalerweise nicht in natürlicher Sprache und unabhängig von den sozialen Benennungskonventionen. @de
label: 是……的资源的标识符 @zh-hans
definition: 将一个命名与有一个取自一个词表编码体系的指称代码作为资源称谓的一种资源关联起来。 @zh-hans
scope note: 编码串通常独立于自然语言和社会命名惯例。 @zh-hans
label: azonosító a következő forráshoz: @hu
definition: Hozzákapcsol egy noment egy forráshoz, amelynek van olyan forrásmegnevezése, amely egy szótárkódolási sémából származó hivatkozási kód. @hu
scope note: A kódolt karakterlánc általában független a természetes nyelvektől és társadalmi névkonvencióktól. @hu
has subproperty: is plate number for notated music of
has subproperty: is publisher number for notated music of
label: kaynağının tanımlayıcısıdır @tr
definition: Bir ismi, bir kelime kodlama şemasından alınan bir referans kodu olan bir kaynak adına sahip olan bir kaynakla ilişkilendirir. @tr
scope note: Kodlanmış dizi genellikle doğal dilden ve sosyal adlandırma kurallarından bağımsızdır. @tr

has illuminator
status: Published
definition: Relates a resource to an agent who decorates a specific resource using precious metals or colour, often with elaborate designs and motifs.
type: Property
sub property of: has other agent associated with resource (Deprecated)
inverse of: is illuminator of
lexical alias: illuminator.en
label: har illuminator @da
definition: Relaterer en ressource til en agent, der tilfører udsmukning til en særlig ressource vha. ædelmetal eller farve, ofte med udsøgte mønstre og motiver. @da
label: heeft verluchter @nl
label: aineiston illuminoinnin tekijä @fi
label: له مزخرِف @ar
definition: يربط مصدر بوكيل يقوم بتزيين مصدر محدد باستخدام معادن ثمينة أو ألوان، غالبًا بتصاميم وزخارف منمقة. @ar
definition: Liittää aineiston toimijaan, joka koristelee tietyn aineiston, usein yksityiskohtaisin kuvioin tai motiivein, käyttäen jalometalleja tai värejä. @fi
label: hat Illuminatorin/Illuminator @de
definition: Setzt eine Ressource in Beziehung zu einem Akteur, der eine bestimmte Ressource durch Edelmetalle oder Farben, häufig mit kunstvollen Mustern und Motiven, (aus-)gestaltet. @de
label: 有彩饰者 @zh-hans
definition: 将一种资源与用贵重的金属或色彩（通常有精心的设计和图案）装饰一种特定资源的一个行为者关联起来。 @zh-hans
label: illuminátora a következő: @hu
definition: Hozzákapcsol egy forrást egy ágenshez, amely egy adott példányt nemesfémekkel vagy színekkel díszít, gyakran gondosan kidolgozott kivitelezéssel és motívumok használával. @hu
label: tezhip sanatçısı ile ilişkilidir @tr
definition: Bir kaynağı, değerli metaller veya renkler kullanarak, genellikle ayrıntılı tasarımlar ve motiflerle süsleyen bir temsilci ile ilişkilendirir. @tr

is illuminator of
status: Published
definition: Relates an agent to a resource that is decorated using precious metals or colour, often with elaborate designs and motifs.
type: Property
sub property of: is other agent associated with resource of (Deprecated)
inverse of: has illuminator
lexical alias: illuminatorOf.en
label: er illuminator af @da
definition: Relaterer en person der sørger for at der er tilført en udsmukning til en særlig ressource vha. ædelmetal eller farve, ofte med udsøgte mønstre og motiver til en ressource. @da
label: is verluchter van @nl
label: هو مزخرِف لـ @ar
definition: يربط بين وكيل ومصدر مُزيّن بمعادن ثمينة أو بألوان، غالبًا بتصاميم وزخارف منمقة. @ar
label: illuminoinnin tekijä (toimija) aineistossa @fi
definition: Liittää toimijan aineistoon, joka on koristeltu jalometalleja tai värejä käyttäen, usein yksityiskohtaisin kuvioin tai motiivein. @fi
label: ist Illuminatorin/Illuminator von @de
definition: Setzt einen Akteur in Beziehung zu einer Ressource, die durch Edelmetalle oder Farbe, häufig mit kunstvollen Mustern und Motiven, (aus-)gestaltet wird. @de
label: 是……的彩饰者 @zh-hans
definition: 将一个行为者与被用贵重的金属或色彩（通常有精心的设计和图案）进行装饰的一种资源关联起来。 @zh-hans
label: illuminátora a következőnek: @hu
definition: Hozzákapcsol egy ágenst egy forráshoz, amelyet nemesfémeket vagy színeket használva díszítenek, gyakran kidolgozott rajzokkal és motívumokkal. @hu
label: tezhip sanatçısıdır @tr
definition: Bir temsilciyi, değerli metaller veya renkler kullanılarak, genellikle ayrıntılı tarasarımlar ve motiflerle süslenmiş bir kaynakla ilişkilendirir. @tr

has illustrations
status: Published
definition: Relates a resource to a resource that consists of pictorial content designed to explain or decorate an augmented resource.
type: Property
sub property of: is augmented by
inverse of: is illustrations for
lexical alias: illustrations.en
label: er illustrationer @da
definition: Relaterer en ressource til en ressource, der består af billedindhold, som er skabt til at forklare eller udsmykke den berigede ressource. @da
label: heeft illustraties @nl
label: aineiston kuvitus @fi
label: له إيضاحيات @ar
definition: يربط بين مصدر ومصدر يتكون من محتوى تصويري مصمم لشرح أو تزيين مصدر مُعَزَّز. @ar
definition: Liittää aineiston laajennettua aineistoa selittävästä tai koristavasta kuvamateriaalista koostuvaan aineistoon. @fi
label: hat Illustrationen @de
definition: Setzt eine Ressource in Beziehung zu einer Ressource, die durch Bildinhalte ergänzt wird, die eine erweiterte Ressource erklären oder ausschmücken sollen. @de
label: 有插图 @zh-hans
definition: 将一种资源与由被设计用来解释或装饰一种被附增的资源的图画内容组成的一种资源关联起来。 @zh-hans
label: illusztrációja a következő: @hu
definition: Hozzákapcsol egy forrást egy olyan képi tartalomból álló forráshoz, amelyet egy bővített forrás magyarázatára vagy díszítésére terveztek. @hu
label: resimleme ile ilişkilidir @tr
definition: Bir kaynağı, artırılmış bir kaynağı açıklamak veya düzenlemek için tasarlanmış görsel içerikten oluşan bir kaynakla ilişkilendirir. @tr

is illustrations for
status: Published
definition: Relates a resource to a resource that is augmented by pictorial content designed to explain or decorate it.
type: Property
sub property of: is augmentation of
inverse of: has illustrations
lexical alias: illustrationsFor.en
label: er illustrationer til @da
definition: Relaterer en ressource til en ressource, der er beriget med billedindhold, som er skabt til at forklare eller udsmykke den. @da
label: is illustraties voor @nl
label: aineiston kuvitus @fi
label: هي إيضاحيات لــ @ar
definition: يربط بين مصدر ومصدر زُيِد بمحتوى تصويري مصمم لشرحه أو تزيينه. @ar
definition: Liittää aineiston aineistoon, jota on laajennettu sitä selittämään tai koristamaan suunnitellulla kuvasisällöllä. @fi
label: sind Illustrationen für @de
definition: Setzt eine Ressource in Beziehung zu einer Ressource, die durch Bildinhalte ergänzt wird, die die Ressource erklären oder ausschmücken sollen. @de
label: 是……的插图 @zh-hans
definition: 将一种资源与由被设计用来解释或装饰它的图画内容附增的一种资源关联起来。 @zh-hans
label: illusztrációk a következőhöz: @hu
definition: Hozzákapcsol egy forrást egy forráshoz, amelyet képi tartalommal bővítenek, amelyet annak magyarázatára vagy díszítésére terveztek. @hu
label: resimlemedir @tr
definition: Bir kaynağı, onu açıklamak veya görsellik kazandırmak için kullanılan resim içeriğiyle artırılan bir kaynağa bağlar. @tr

has illustrative content
status: Published
definition: Relates a resource to an indication of the kinds of image content that supplement the main resources that are embodied by an augmentation aggregate.
type: Property
lexical alias: illustrativeContent.en
label: har illustrativt indhold @da
definition: Relaterer en ressource til en tilstedeværelse af billedindhold, der medfølger en ressources primære indhold. @da
label: heeft illustratieve content @nl
label: aineiston kuvasisältö @fi
label: له محتوى توضيحي @ar
definition: يربط بين مصدر ومؤشر لأنواع محتوى الصورة التي تُكمل المصادر الرئيسية التي يتم تجسيدها بواسطة إضافة تجميعة. @ar
definition: Liittää aineiston ilmaukseen niistä kuvasisällöistä, jotka täydentävät laajennusaggregaatin sisältämiä aineistoja. @fi
label: hat illustrierenden Inhalt @de
definition: Setzt eine Ressource in Beziehung zu einer Angabe der Arten von Bildinhalt, die die Hauptressourcen ergänzt, die durch ein Erweiterungsaggregat verkörpert werden. @de
label: 有插图内容 @zh-hans
definition: 将一种资源与补充被一种附增合集具体化的主要资源的图像内容的资源的类型的指示关联起来。 @zh-hans
label: illusztratív tartalma a következő: @hu
definition: Hozzákapcsol egy forrást egy képi tartalom azon típusainak a jelöléséhez, amely kiegészíti a bővülésből eredő aggregátumban megtestesülő fő forrásokat. @hu
label: resimleyici içerik ile ilişkilidir @tr
definition: Bir kaynağı, bir çoğaltma topluluğu tarafından somutlaştırılan ana kaynakları tamamlayan görüntü içeriği türlerinin göstergesiyle ilişkilendirir. @tr

is imitated as
status: Published
definition: Relates a resource to a resource that copies the style or content of another resource.
type: Property
sub property of: has derivative
inverse of: is imitation of
lexical alias: imitatedAs.en
label: er efterlignet som @da
definition: Relaterer en ressource til en ressource, der kopierer en oprindelig ressources stil eller indhold. @da
label: is geïmiteerd in @nl
label: jäljitelmä aineistosta @fi
label: هو محاكاة كـ @ar
definition: يربط بين مصدر ومصدر ينسخ نمط أو محتوى مصدر آخَر. @ar
definition: Liittää aineiston aineistoon, joka kopioi toisen aineiston tyyliä tai sisältöä. @fi
label: ist imitiert als @de
definition: Setzt eine Ressource in Beziehung zu einer Ressource, die den Stil oder Inhalt einer anderen Ressource kopiert. @de
label: 被模仿成为 @zh-hans
definition: 将一种资源与复制另一种资源的风格和内容的一种资源关联起来。 @zh-hans
label: utánozva a következőként: @hu
definition: Hozzákapcsol egy forrást egy forráshoz, amely egy másik forrás stílusát vagy tartalmát másolja. @hu
has subproperty: is parodied as
label: olarak taklit edilmiştir @tr
definition: Bir kaynağı, başka bir kaynağın biçimini veya içeriğini kopyalayan kaynakla ilişkilendirir. @tr

is imitation of
status: Published
definition: Relates a resource to a resource whose style or content is copied in a derivative resource.
type: Property
sub property of: has source
inverse of: is imitated as
lexical alias: imitationOf.en
label: er imitation af @da
definition: Relaterer en ressource til en ressource, hvis stil eller indhold er kopieret i en afledt ressource. @da
label: is imitatie van @nl
label: jäljitelmän perustana oleva aineisto @fi
label: هو تقليد لـ @ar
definition: يربط بين مصدر ومصدر يتم نسخ أسلوبه أو محتواه في مصدر مشتق. @ar
definition: Liittää aineiston aineistoon, jonka tyyliä tai sisältöä johdettu aineisto jäljittelee. @fi
label: ist Imitation von @de
definition: Setzt eine Ressource in Beziehung zu einer Ressource, deren Stil oder Inhalt in einer abgeleiteten Ressource kopiert wird. @de
label: 是……的模仿 @zh-hans
definition: 将一种资源与其风格和内容被复制于一种衍生资源的一种资源关联起来。 @zh-hans
label: utánzása a következőnek: @hu
definition: Hozzákapcsol egy forrást egy forráshoz, amelynek stílusát vagy tartalmát egy származékos forrásban másolják. @hu
has subproperty: is parody of
label: taklididir @tr
definition: Bir kaynağı, biçimi veya içeriği türev bir kaynağa kopyalanan bir kaynakla ilişkilendirir. @tr

has immediate source of acquisition of resource
status: Published
definition: Relates a resource to the circumstances under which a resource is directly acquired, including a method, source, and date of acquisition.
type: Property
lexical alias: immediateSourceOfAcquisitionOfResource.en
label: har direkte anskaffelseskilde for eksemplar @da
definition: Relaterer en ressource til en kilde, hvorfra institutionen har anskaffet en ressource, samt de omstændigheder under hvilke det blev modtaget. @da
label: heeft directe bron van verwerving van resource @nl
label: له مصدر حالى لاقتناء مصدر @ar
definition: يربط بين مصدر والظروف التي تم فيها اقتناء مصدر بصورة مباشرة، ويشمل ذلك طريقة الاقتناء، مصدره، تاريخه. @ar
label: aineiston hankintalähde @fi
definition: Liittää aineiston aineiston hankintaolosuhteisiin, kuten hankintatapaan, -lähteeseen ja -ajankohtaan. @fi
label: hat Bezugsquelle einer Ressource @de
definition: Setzt eine Ressource in Beziehung zu den Umständen, unter denen eine Ressource direkt erworben wird. Darunter fallen Erwerbungsmethoden, Erwerbungsquellen und Erwerbungsdaten. @de
label: 有资源的直接获取来源 @zh-hans
definition: 将一种资源与资源直接被获取的环境（包括获取的方法、来源和日期）关联起来。 @zh-hans
label: forrás közvetlen beszerzési forrása a következő: @hu
definition: Hozzákapcsol egy forrást azokhoz a körülményekhez, amelyek keretében egy forrást közvetlenül beszereznek, beleértve a beszerzés módszerét, forrását és időpontját. @hu
label: kaynağın doğrudan sağlandığı kaynak ile ilişkilidir @tr
definition: Bir kaynağı, bir yöntem, kaynak ve satın alma tarihi de dahil olmak üzere bir kaynağın doğrudan edinildiği koşullarla ilişkilendirir. @tr

has incidental music
status: Published
definition: Relates a resource to a resource that is a musical resource that complements a resource that is a play or other work for the stage that is realized as spoken word.
type: Property
inverse of: is incidental music for
lexical alias: incidentalMusic.en
sub property of: has music
label: er skuespilsmusik @da
definition: Relaterer en ressource til en musikressource, der indeholder tilhørende musik til et skuespil eller anden ressource for et talt sceneværk. @da
label: heeft toneelmuziek @nl
label: näytelmämusiikkiaineisto @fi
label: له موسيقى تصويرية @ar
definition: يربط بين مصدر ومصدر موسيقي يكمل مصدرًا يمثل مسرحية أو مصدر آخر للمسرح يتحول إلى كلمة منطوقة. @ar
definition: Liittää aineiston musiikkiaineistoon, joka toimii näytelmän tai muun puhutun näyttämöesityksen näytelmämusiikkina. @fi
label: hat Bühnenmusik @de
definition: Setzt eine Ressource in Beziehung zu einer Musikressource, die ein Drama oder eine andere, gesprochene Bühnenressource ergänzt. @de
label: 有配乐 @zh-hans
definition: 将一种资源与补充作为戏剧或其他舞台会话作品之资源的作为一种音乐资源的一种资源关联起来。 @zh-hans
definition: Relaciona un recurs amb un recurs que és un recurs musical que complementa un recurs que és una obra de teatre o qualsevol altra obra escènica que es realitza com a paraula parlada. @ca
label: kísérőzenéje: @hu
definition: Hozzákapcsol egy forrást egy zenei forráshoz, amely kísérőzenét szolgáltat egy színdarabhoz vagy a színpad másik beszélt forrásához. @hu
label: fon müziği ile ilişkilidir @tr
definition: Bir kaynağı, tiyatro olan bir kaynağı veya repliklerle sahnelenen başka bir kaynağı tamamlayan bir müzikal kaynak ile ilişkilendirir. @tr

is incidental music for
status: Published
definition: Relates a resource to a resource that is a play or other resource for the stage that is realized as spoken word and that is complemented by a musical resource.
type: Property
inverse of: has incidental music
lexical alias: incidentalMusicFor.en
sub property of: is music for
label: er skuespilsmusik til @da
definition: Relaterer en ressource til en ressource, såsom et skuespil eller et andet talt sceneværk, der anvender en ressource til et musikværk som tilhørende musik. @da
label: is toneelmuziek voor @nl
label: näytelmämusiikkiaineisto @fi
label: هو موسيقى تصويرية لـ @ar
definition: يربط بين مصدر ومصدر مسرحي أو مصدر آخر للمسرح الذي يتحقق على أنه كلمة منطوقة ويكمله مصدر موسيقي. @ar
definition: Liittää aineiston näytelmään tai muuhun näyttämöesitykseen, joka on toteutettu @fi
label: ist Bühnenmusik für @de
definition: Setzt eine Ressource in Beziehung zu einer Ressource, bei der es sich um ein Drama oder eine andere, gesprochene Bühnenressource handelt, die durch eine Musikressource vervollständigt wird. @de
label: 是……的配乐 @zh-hans
definition: 将一种资源与作为被一种音乐作品补充的通过口语实现的戏剧或其他舞台资源的一种资源关联起来。 @zh-hans
label: kísérőzene a következőhöz: @hu
definition: Hozzákapcsol egy forrást egy színdarabhoz vagy más beszélt színpadi forráshoz, amelyet egy zenei forrás egészít ki. @hu
label: fon müziğidir @tr
definition: Bir kaynağı, sözlü olarak gerçekleştirilen ve müzikal kaynakla tamamlanan bir oyun veya sahne için kullanılan başka bir kaynakla ilişkilendirir. @tr

has index
status: Published
definition: Relates a resource to a resource that is a systematic guide to the content of a resource that is a textual resource.
type: Property
inverse of: is index for
lexical alias: index.en
label: er indeks @da
definition: Relaterer en ressource til en ressource, der indeholder en systematisk, alfabetiseret oversigt over indholdet i hovedværket, normalt kædet sammen med sidenumre eller andre henvisningskoder. @da
sub property of: heeft gerelateerde resource van resource
label: heeft index @nl
label: hakemisto (aineisto) @fi
label: له كشاف @ar
definition: يربط بين مصدر ومصدر يوفر دليلًا منهجيًا،هجائيًا لمحتويات مصدر آخر. @ar
definition: Liittää aineiston aineistoon, joka on systemaattinen opas tekstiaineiston sisältöön. @fi
label: hat Index @de
definition: Setzt eine Ressource in Beziehung zu einer Ressource, die eine systematische, alphabetische Orientierungshilfe zum Inhalte einer anderen Ressource bietet. @de
label: 有索引 @zh-hans
definition: 将一种资源与作为一种文字资源的一种资源之内容的系统性指引的一种资源关联起来。 @zh-hans
definition: Relaciona un recurs amb un recurs que és una guia sistemàtica del contingut d’un recurs que és un recurs textual. @ca
label: tárgymutatója a következő: @hu
definition: Hozzákapcsol egy forrást egy forráshoz, amely egy szisztematikus és betűrendes kalauz egy másik forrás tartalmához. @hu
label: indeks ile ilişkilidir @tr
definition: Bir kaynağı, metinsel kaynak olan bir kaynağın içerik dizini olan bir kaynağa bağlar. @tr

is indexed in (Deprecated)
definition: Relates a resource to a resource that is an abstracting and indexing service that indexes the contents of another resource. (Deprecated)
type: Property
sub property of: has derivative
inverse of: is indexing for (Deprecated)
lexical alias: indexedIn.en
label: er indekseret i @da
definition: Relaterer en ressource til en ressource, der er en abstracts- og indekseringsservice, der indekserer en oprindelig kildes indhold. @da
status: Deprecated
label: is geïndexeerd in @nl
label: indeksointi @fi
label: هو مُكَشَّف في @ar
definition: يربط بين مصدر ومصدر يمثل خدمة استخلاص وتكشيف تُفهرس محتويات مصدر آخَر. @ar
label: ist indexiert in @de
definition: Setzt eine Ressource in Beziehung zu einer Ressource, bei der es sich um einen Abstract- und Indexierungsdienst handelt, die die Inhalte einer ursprünglichen Expression indexiert. @de
definition: Liittää aineiston aineistoon, joka on tiivistelmä- ja indeksointipalvelu, joka sisältää toisen aineiston sisällön abstraktit. @fi
label: indexelve a következőben: @hu
definition: Hozzákapcsol egy forrást egy forráshoz, amely egy referáló és indexelő szolgáltatás, amely egy másik forrás tartalmát indexeli. @hu

is indexing for (Deprecated)
definition: Relates a resource to a resource whose contents have been indexed by a related resource. (Deprecated)
type: Property
sub property of: has source
inverse of: is indexed in (Deprecated)
lexical alias: indexingFor.en
label: er indeksering for @da
definition: Relaterer en ressource til en ressource, hvis indhold er blevet indekseret af en abstract- og indekseringsservice. @da
status: Deprecated
label: is indexering voor @nl
label: indeksointi @fi
label: هو تكشيف لـ @ar
definition: يربط بين مصدر ومصدر تم تكشيف محتوياته بواسطة مصدر ذي صلة. @ar
label: ist Indexierung für @de
definition: Setzt eine Ressource in Beziehung zu einer Ressource, deren Inhalte durch eine in Beziehung stehende Ressource indexiert wurden. @de
definition: Liittää aineiston aineistoon, jonka sisältö on indeksoitu liittyvässä aineistossa. @fi
label: index a következőhöz: @hu
definition: Hozzákapcsol egy forrást egy forráshoz, amelynek tartalmait egy kapcsolódó forrás indexeli. @hu

is index for
status: Published
definition: Relates a resource to a resource of a textual resource that is the basis of an index of the content.
type: Property
inverse of: has index
label: er indeks til @da
definition: Relaterer en ressource til en ressource, der er anvendt som grundlag for et indeks, dvs. en systematisk, alfabetiseret oversigt over indholdet i hovedressourcen, normalt kædet sammen med sidenumre eller andre henvisningskoder. @da
alternative label: is index to
sub property of: heeft gerelateerde resource van resource
lexical alias: indexFor.en
label: is index bij @nl
label: hakemisto aineistosta @fi
label: هو كشاف لـ @ar
definition: يربط بين مصدر ومصدر يُستخدم كأساس لمصدر يُمثل دليلًا منهجيًا، هجائيًا لمحتوياته @ar
definition: Liittää aineiston sisällön hakemiston perustana olevaan tekstiaineistoon. @fi
alternative label: hakemistoaineisto @fi
label: ist Index zu @de
definition: Setzt eine Ressource in Beziehung zu einer Ressource, die als Grundlage für eine Ressource verwendet wird, bei der es sich um eine systematische, alphabetische Orientierungshilfe zu deren Inhalt handelt. @de
label: 是……的索引 @zh-hans
definition: 将一种资源与作为一种文字资源并作为其内容的索引的基础的一种资源关联起来。 @zh-hans
alternative label: és index de @ca
label: és índex per @ca
definition: Relaciona un recurs amb un recurs d’un recurs textual que és la base d’un índex del contingut. @ca
label: tárgymutatója a következőnek: @hu
definition: Hozzákapcsol egy forrást egy forráshoz, amelyet alapként használnak egy olyan forráshoz, ami a tartalmára vonatkozó szisztematikus és betűrendes kalauz. @hu
label: dizinidir @tr
definition: Bir kaynağı, içerik dizininin temeli olan bir metin kaynağı ile ilişkilendirir. @tr

has inscriber
status: Published
definition: Relates a resource to an agent who has written a statement of dedication or gift on a resource.
type: Property
sub property of: has other agent associated with resource (Deprecated)
inverse of: is inscriber of
lexical alias: inscriber.en
label: har dedikationsskriver @da
definition: Relaterer en ressource til en agent, der har skrevet en tilegnelses- eller gavekommentar på en ressource. @da
label: heeft opdrachtschrijver @nl
label: omistuskirjoituksen kirjoittaja aineistossa @fi
label: له كاتب إهداء @ar
definition: يربط مصدر بوكيل يكتب جملة إهداء على مصدر. @ar
definition: Liittää aineiston toimijaan, joka kirjoittaa siihen omistuskirjoituksen tai merkinnön lahjoituksesta. @fi
label: hat Beschrifterin/Beschrifter @de
definition: Setzt eine Ressource in Beziehung zu einem Akteur, der eine Widmung oder einen Schenkungsvermerk in eine Ressource geschrieben hat. @de
label: 有题写者 @zh-hans
definition: 将一种资源与在一种资源上书写题词或赠与文字的一个行为者关联起来。 @zh-hans
label: beírója a következő: @hu
definition: Hozzákapcsol egy forrást egy ágenshez, amely elkötelezettségi vagy ajándékozási nyilatkozatot ír egy forrásra. @hu
label: armağan notu yazarı ile ilişkilidir @tr
definition: Bir kaynağı, bir kaynak üzerinde bir ithaf veya hediye bildirimi yazan bir temsilci ile ilişkilendirir. @tr

is inscriber of
status: Published
definition: Relates an agent to a resource that involves a responsibility of an agent for inscribing a text, such as a statement of dedication or gift.
type: Property
sub property of: is other agent associated with resource of (Deprecated)
inverse of: has inscriber
lexical alias: inscriberOf.en
label: er dedikationsskriver i @da
definition: Relaterer en agent der har skrevet en dedikations- eller gaveangivelse på en ressource til en ressource. @da
label: is opdrachtschrijver van @nl
label: هو كاتب إهداء لـ @ar
definition: يربط بين وكيل ومصدر ينطوي على مسؤولية وكيل عن كتابة نص، مثل بيان الإهداء أو الهدية. @ar
label: omistuskirjoituksen kirjoittaja (toimija) aineistossa @fi
definition: Liittää toimijan aineistoon, johon toimija kirjoitta siihen omistuskirjoituksen tai merkinnön lahjoituksesta. @fi
label: ist beschriftende Person von @de
definition: Setzt einen Akteur in Beziehung zu einer Ressource, die mit einer Verantwortung verbunden ist, eine Widmung oder einen Schenkungsvermerk zu schreiben. @de
label: 是……的题写者 @zh-hans
definition: 将一个行为者与涉及题写文字（诸如题献或赠与的说明）的责任的一种资源关联起来。 @zh-hans
label: beírója a következőnek: @hu
definition: Hozzákapcsol egy ágenst egy forráshoz, amelyhez hozzátartozik az ágens felelőssége egy olyan beírt szövegért, mint egy dedikáció vagy egy ajándékozási nyilatkozat. @hu
label: armağan notu yazarıdır @tr
definition: Bir temsilciyi, bir adanmışlık veya hediye beyanı gibi bir metni yazmak için bir temsilcinin sorumluluğunu içeren bir kaynakla ilişkilendirir. @tr

has insert
status: Published
definition: Relates a resource to a resource that is a separate part of another resource.
type: Property
sub property of: has part resource
inverse of: is inserted in
lexical alias: insert.en
label: er indlæg @da
definition: Relaterer en ressource til en ressource, der består af separat udgivet materiale, der ikke er en integreret del af den større manifestation, som den er indlagt i. @da
label: heeft ingevoegde bijlage @nl
label: aineiston liite @fi
label: له جزء مُضاف @ar
definition: يربط بين مصدر ومصدر يُعد جزء منفصل من مصدر آخَر. @ar
definition: Liittää aineiston aineistoon, joka on, erillinen osa toista aineistoa. @fi
label: hat Beilage @de
definition: Setzt eine Ressource in Beziehung zu einer Ressource, die ein eigenständiger Bestandteil einer anderen Ressource ist. @de
label: 有插页 @zh-hans
definition: 将一种资源与作为另一种资源之独立部分的一种资源关联起来。 @zh-hans
label: beillesztése a következő: @hu
definition: Hozzákapcsol egy forrást egy forráshoz, amely egy másik forrás külön kiadott része. @hu
label: ek parça ile ilişkilidir @tr
definition: Bir kaynağı, başka bir kaynağın ayrı bir parçası olan bir kaynakla ilişkilendirir. @tr

is inserted in
status: Published
definition: Relates a resource to a resource into which material is inserted that is not an integral part of the publication.
type: Property
sub property of: is part of resource
inverse of: has insert
lexical alias: insertedIn.en
label: er indlagt i @da
definition: Relaterer en ressource til en ressource, hvori der er indlagt materiale, der ikke er en integreret del af publikationen. @da
label: is ingevoegd in @nl
label: liitteenä aineistossa @fi
label: هو مُدرَج في @ar
definition: يربط بين مصدر ومصدر تم إدراج مادة فيه وهي لا تُمثل جزءًا أساسيًا من المنشور. @ar
definition: Liittää aineiston aineistoon, joka sisältää materiaalia erillisenä liitteenä. @fi
label: ist beigelegt in @de
definition: Setzt eine Ressource in Beziehung zu einer Ressource, in die Material eingefügt wird, das nicht integraler Bestandteil der Veröffentlichung ist. @de
label: 被插入于 @zh-hans
definition: 将一种资源与在其中插入不属于出版物完整部分的资料的一种资源关联起来。 @zh-hans
label: beillesztve a következőbe: @hu
definition: Hozzákapcsol egy forrást egy forráshoz, amelybe olyan anyagot illesztettek be, amely nem szerves része a kiadványnak. @hu
label: eklenmiştir @tr
definition: Bir kaynağı, içine yayının ayrılmaz bir parçası olmayan materyalin eklendiği bir kaynakla ilişkilendirir. @tr

is inspiration for
status: Published
type: Property
lexical alias: inspirationFor.en
definition: Relates a resource to a resource that was inspired by a related resource.
inverse of: is inspired by
sub property of: has derivative
label: er inspiration til @da
definition: Relaterer en ressource til en ressource, der var inspireret af en anden ressource. @da
label: is inspiratie voor @nl
label: هو مُستَوحي لـ @ar
definition: يربط بين مصدر ومصدر مُستَوحي من مصدر ذي صلة. @ar
label: inspiraatio aineistolle @fi
definition: Liittää aineiston aineistoon, joka on saanut inspiraatiota toisesta, liittyvästä aineistosta. @fi
label: ist Anregung für @de
definition: Setzt eine Ressource in Beziehung zu einer Ressource, die von einer in Beziehung stehenden Ressource angeregt ist. @de
label: 是对……的启发 @zh-hans
definition: 将一种资源与受一种相关资源启发的一种资源关联起来。 @zh-hans
label: inspirációja a következőnek: @hu
definition: Hozzákapcsol egy forrást egy forráshoz, amelyet egy kapcsolódó forrás inspirált. @hu
label: için ilham kaynağıdır @tr
definition: Bir kaynağı, ilgili bir kaynaktan ilham alan bir kaynakla ilişkilendirir. @tr

is inspired by
status: Published
type: Property
lexical alias: inspiredBy.en
definition: Relates a resource to a resource that serves as the inspiration for a related resource.
inverse of: is inspiration for
sub property of: has source
label: er inspireret af @da
definition: Relaterer en ressource til en ressource, der tjener som inspiration for en anden ressource. @da
label: is geïnspireerd door @nl
label: هو مُستَوحىً مِن @ar
definition: يربط بين مصدر ومصدر يمثل مصدر إلهام لمصدر ذي صلة. @ar
label: inspiraation lähde (aineisto) @fi
definition: Liittää aineiston aineistoon, joka toimii toisen, liittyvän aineiston inspiraationa. @fi
label: ist angeregt durch @de
definition: Setzt eine Ressource in Beziehung zu einer Ressource, die als Anregung für eine in Beziehung stehende Ressource dient. @de
label: 受……启发 @zh-hans
definition: 将一种资源与作为一种相关资源的启发的一种资源关联起来。 @zh-hans
label: inspirálta a következő: @hu
definition: Hozzákapcsol egy forrást egy forráshoz, amely egy másik forrás inspirációjaként szolgál. @hu
label: esinlenmiştir @tr
definition: Bir kaynağı, ilgili bir kaynağa ilham kaynağı olarak kullanılan bir kaynakla ilişkilendirir. @tr

is instructor of
status: Published
definition: Relates an agent to a resource that includes a contribution by an agent of teaching or providing a demonstration.
type: Property
sub property of: is performer of
inverse of: has instructor
lexical alias: instructorOf.en
label: er lærer i @da
definition: Relaterer en udøver, der bidrager til en ressource ved at give instruktion eller demonstration til en ressource. @da
label: is instructeur van @nl
label: opettaja @fi
label: هو مُحاضر لـ @ar
definition: يربط بين وكيل ومصدر يتضمن إسهام وكيل بالتدريس أو تقديم عرض توضيحي. @ar
definition: Liittää toimijan aineistoon jonka tekemiseen hän osallistuu opettamalla tai esittelemällä. @fi
label: ist Ausbilderin/Ausbilder von @de
definition: Setzt einen Akteur in Beziehung zu einer Ressource, zu der ein Akteur beiträgt, indem er unterrichtet oder etwas demonstriert. @de
label: 是……的教师 @zh-hans
definition: 将一个行为者与包括教学或提供演示的一个行为者的贡献的一种资源关联起来。 @zh-hans
label: oktatója a következőnek: @hu
definition: Hozzákapcsol egy ágenst egy forráshoz, amely magában foglalja egy tanító vagy szemléltetést tartó ágens közreműködését. @hu
label: eğitmenidir @tr
definition: Bir temsilciyi, öğreten veya gösteri sunan temsilcinin katkısını içeren bir kaynakla ilişkilendirir. @tr

has instrumental conductor
status: Published
type: Property
lexical alias: instrumentalConductor.en
definition: Relates a resource to an agent who contributes to a resource by leading an instrumental performing group in a musical or dramatic presentation.
inverse of: is instrumental conductor of
sub property of: has conductor
label: har instrumentaldirigent @da
definition: Relaterer en ressource til en dirigent, der har bidraget til en musikressource ved at lede en optrædende instrumentalgruppe i en musikalsk eller dramatisk præsentation etc. @da
label: heeft instrumentaal dirigent @nl
label: له مايِسترو لآلات عزف @ar
definition: يربط بين مصدر ومايِسترو يُساهم في مصدر موسيقي من خلال قيادة فرقة عزف في عرض موسيقي أو درامي. @ar
label: kapellimestari aineistossa @fi
definition: Liittää aineiston kapellimestariin, joka osallistuu aineiston tekemiseen johtamalla soitinryhmää musiikki- tai näytelmäesityksessä. @fi
label: hat Orchesterleiterin/Orchesterleiter @de
definition: Setzt eine Ressource in Beziehung zu einer Dirigentin/einem Dirigenten, die/der zu einer musikalischen Ressource beiträgt, indem sie/er eine Instrumentalgruppe in einer musikalischen oder dramatischen Darbietung leitet. @de
label: 有器乐指挥 @zh-hans
definition: 将一种资源与通过在一个音乐或戏剧呈现中领导一个器乐表演团体而对一种资源作出贡献的一个行为者关联起来。 @zh-hans
definition: Relaciona un recurs amb un agent que contribueix a un recurs dirigint un grup instrumental en una representació musical o dramàtica. @ca
label: zenekari karmestere a következő: @hu
definition: Hozzákapcsol egy forrást egy karmesterhez, amely hozzájárul egy zenei forráshoz azzal, hogy hangszeres előadói csoportot vezet egy zenei vagy drámai bemutatóban. @hu
label: enstrüman şefi ile ilişkilidir @tr
definition: Bir kaynağı, müzikal veya dramatik bir sunumda enstrümantal bir performans grubuna liderlik ederek müzikal bir kaynağa katkıda bulunan bir şefle ilişkilendirir. @tr

is instrumental conductor of
status: Published
type: Property
lexical alias: instrumentalConductorOf.en
definition: Relates an agent to a resource that includes a contribution by an agent of conducting and leading an instrumental performing group in a musical or dramatic presentation
inverse of: has instrumental conductor
sub property of: is conductor of
label: er instrumentaldirigent i @da
definition: Relaterer en dirigent, der har bidraget til en musikressource ved at lede en optrædende instrumentalgruppe i en musikalsk eller dramatisk præsentation etc. til en ressource. @da
label: is instrumentaal dirigent van @nl
label: هو مايِسترو لآلات عزف لـ @ar
definition: يربط بين وكيل ومصدر يتضمن إسهام وكيل في إدارة فرقة عزف وقيادتها في عرض موسيقي أو درامي. @ar
label: kapellimestari (toimija) aineistossa @fi
definition: Liittää toimijan aineistoon, jossa toimija on osallisena johtamalla soitinryhmää musiikki- tai näytelmäesityksessä tms. @fi
label: ist Orchesterleiterin/Orchesterleiter von @de
definition: Setzt einen Akteur in Beziehung zu einer Ressource, zu der ein Akteur beiträgt, indem er eine Instrumentalgruppe in einer musikalischen oder dramatischen Darbietung leitet. @de
label: 是……的器乐指挥 @zh-hans
definition: 将一个行为者与包括在音乐或戏剧呈现中指挥并领导一个器乐表演团体的一个行为者的贡献的一种资源关联起来。 @zh-hans
label: zenekari karmestere a következőnek: @hu
definition: Hozzákapcsol egy ágenst egy forráshoz, amely magában foglalja egy zenei vagy drámai bemutatóban hangszeres előadói csoportot vezénylő és vezető ágens közreműködését. @hu
label: enstrüman şefidir @tr
definition: Bir temsilciyi, müzikal veya dramatik bir sunumda enstrümantal performans gösteren bir grubu yürütme ve yönetme konusunda bir temsilcinin katkısını içeren bir kaynakla ilişkilendirir. @tr

has instrumentalist
status: Published
definition: Relates a resource to an agent who is a performer who contributes to a resource by playing a musical instrument.
type: Property
sub property of: has performer
inverse of: is instrumentalist of
lexical alias: instrumentalist.en
label: har musiker @da
definition: Relaterer en ressource til en optrædende, der har bidraget til en ressource ved at spille et musikinstrument. @da
label: heeft instrumentalist @nl
label: instrumentalisti aineistossa @fi
label: له عَازِف @ar
definition: يربط بين مصدر ومؤدِ يُساهم في مصدر من خلال العزف على آلة موسيقية. @ar
label: hat Instrumentalmusikerin/Instrumentalmusiker @de
definition: Setzt eine Ressource in Beziehung zu einer Ausführenden/einem Ausführenden, die/der zu einer Ressource beiträgt, indem sie/er ein Musikinstrument spielt. @de
definition: Liittää aineiston esittäjään, joka osallistuu aineistoon soittamalla soitinta. @fi
label: 有乐器演奏者 @zh-hans
definition: 将一种资源与作为一个表演者通过演奏乐器对一种资源有贡献的一个行为者关联起来。 @zh-hans
definition: Relaciona un recurs amb un agent que és un intèrpret que contribueix a un recurs tocant un instrument musical. @ca
label: zenésze a következő: @hu
definition: Hozzákapcsol egy forrást egy olyan előadóhoz, aki hangszeren játszik és ezzel hozzájárul egy forráshoz. @hu
label: enstrüman sanatçısı ile ilişkilidir @tr
definition: Bir kaynağı, müzik enstrümanı çalarak kaynağa katkıda bulunan sanatçı ile ilişkilendirir. @tr

is instrumentalist of
status: Published
definition: Relates an agent to a resource that includes a contribution by an agent of playing a musical instrument.
type: Property
sub property of: is performer of
inverse of: has instrumentalist
lexical alias: instrumentalistOf.en
label: er musiker i @da
definition: Relaterer en udøver der bidrager til en ressource ved at spille et musikinstrument til en ressource @da
label: is instrumentalst van @nl
label: instrumentalistina aineistossa @fi
label: هو عَازِف لـ @ar
definition: يربط بين وكيل ومصدر يتضمن إسهام وكيل بالعزف على آلة موسيقية. @ar
definition: Liittää toimijan aineistoon jonka tekemiseen hän osallistuu soittamalla soitinta. @fi
label: ist Instrumentalmusikerin/Instrumentalmusiker von @de
definition: Setzt einen Akteur in Beziehung zu einer Ressource, zu der ein Akteur beiträgt, indem er ein Musikinstrument spielt. @de
label: 是……的乐器演奏者 @zh-hans
definition: 将一个行为者与包括演奏乐器的一个行为者的贡献的一种资源关联起来。 @zh-hans
label: zenésze a következőnek: @hu
definition: Hozzákapcsol egy ágenst egy forráshoz, amely magában foglalja egy hangszeren játszó ágens közreműködését. @hu
label: enstrümantalistidir @tr
definition: Bir temsilciyi, müzik aleti çalan temsilcinin katkısını içeren bir kaynakla ilişkilendirir. @tr

has intended audience
status: Published
definition: Relates a resource to a category of user for whom the content of a resource is intended, or for whom the content is considered suitable.
type: Property
lexical alias: intendedAudience.en
label: har målgruppe @da
definition: Relaterer en ressource til en brugerkategori, som en ressources indhold er beregnet for, eller for hvilken indholdet anses passende. @da
label: heeft beoogde doelgroep @nl
label: له جمهور مستهدف @ar
definition: يربط بين مصدر وفئة من المستخدمين المُستهدفين من قبل محتوى مصدر، أو الذين يُعد محتوى المصدر مناسبًا لهم. @ar
label: aineiston kohderyhmä @fi
definition: Liittää aineiston käyttäjäryhmään, jolle aineiston on tarkoitettu tai jolle aineiston katsotaan soveltuvan. @fi
label: hat Zielgruppe @de
definition: Setzt eine Ressource in Beziehung zu einer Gruppe von Benutzenden, für die der Inhalt einer Ressource gedacht ist oder für die der Inhalt als passend angesehen wird. @de
label: 有目标受众 @zh-hans
definition: 将一种资源与一种资源之内容的目标使用者或者一种资源之内容被认为适合的使用者的类别关联起来。 @zh-hans
label: célközönsége a következő: @hu
definition: Hozzákapcsol egy forrást egy használói kategóriához, amelynek a forrás tartalmát szánták, vagy amelynek a tartalmat alkalmasnak tekintik. @hu
label: hedef kitle ile ilişkilidir @tr
definition: Bir kaynağı, bir kaynağın içeriğinin amaçlandığı veya içeriğin uygun olduğu düşünülen bir kullanıcı kategorisiyle ilişkilendirir. @tr

has interactivity mode
status: Published
lexical alias: interactivityMode.en
definition: Relates a resource to a capacity of content to respond to actions performed by the user.
type: Property
label: heeft interactiviteitsmodus @nl
label: له أسلوب تفاعلي @ar
definition: يربط بين مصدر وقدرة المحتوى على الاستجابة للإجراءات التي يقوم بها المستخدم. @ar
label: har interaktivitetstilstand @da
definition: Relaterer en ressource til en kapacitet af indhold der svarer til handlinger udført af brugeren. @da
label: vuorovaikutteisuuden aste aineistossa @fi
definition: Liittää aineiston sisällön kykyyn vastata käyttäjän suorittamiin toimintoihin. @fi
label: hat Interaktivitätsmodus @de
definition: Setzt eine Ressource in Beziehung zu einer Fähigkeit von Inhalten, auf von Benutzenden ausgeführte Aktionen zu reagieren. @de
label: 有互动模式 @zh-hans
definition: 将一种资源与内容对使用者的行动作出响应的能力关联起来。 @zh-hans
label: interaktivitás módja a következő: @hu
definition: Hozzákapcsol egy forrást a tartalom olyan adottságához, amely által képes válaszolni a felhasználó által végrehajtott műveletekre. @hu
label: etkileşim modu ile ilişkilidir @tr
definition: Bir kaynağı, kullanıcı tarafından gerçekleştirilen eylemlere yanıt veren bir içerik kapasitesiyle ilişkilendirir. @tr

has interviewee
status: Published
definition: Relates a resource to an agent who is responsible for creating a resource by responding to an interviewer, usually a reporter, pollster, or some other kind of agent who gathers information.
type: Property
sub property of: has creator
inverse of: is interviewee of
lexical alias: interviewee.en
label: har interviewede @da
definition: Relaterer en ressource til en agent, der er ansvarlig for at have skabt en ressource ved at besvare spørgsmål fra en interviewer, normalt en journalist, medarbejder ved et meningsmålingsinstitut eller en anden informationsindsamler. @da
label: heeft geïnterviewde @nl
label: haastateltava aineistossa @fi
label: له مُستجوَب @ar
definition: يربط مصدر بوكيل مسؤول عن إنشاء مصدر من خلال الاستجابة لمحاور، وعادة ما يكون مراسلًا أو مستطلع رأي أو وكيل من نوع آخر يجمع معلومات. @ar
definition: Liittää aineiston toimijaan, joka vastaa aineiston luomisesta vastaamalla haastattelijalle. Yleensä haastattelija on toimittaja, mielipidetutkija tai muunlainen tiedonkeruun tekijä. @fi
label: hat Interviewte/Interviewten @de
definition: Setzt eine Ressource in Beziehung zu einem Akteur, der für die Schaffung einer Ressource verantwortlich ist, indem er einer Interviewerin/einem Interviewer antwortet. Dabei handelt es sich normalerweise um eine Reporterin/einen Reporter, eine Meinungsforscherin/einen Meinungsforscher oder eine andere Akteurin/einen anderen Akteur, die/der Informationen zusammenträgt. @de
label: 有受访者 @zh-hans
definition: 将一种资源与通过回答采访者（通常是记者、民意调查员或其他类型信息搜集行为者）而对一种资源的创建负责的一个行为者关联起来。 @zh-hans
label: interjúalanya a következő: @hu
definition: Hozzákapcsol egy forrást egy ágenshez, amely felelős egy forrás létrehozásáért oly módon, hogy válaszol egy interjúkészítőnek, általában riporternek, közvélemény-kutatónak, vagy valamilyen más információgyűjtő ágensnek. @hu
label: görüşülen ile ilişkilidir @tr
definition: Bir kaynağı, genellikle bir muhabir, anketör veya bilgi toplayan başka bir tür temsilci olan bir görüşmeciye yanıt vererek bir eser oluşturmaktan sorumlu olan bir temsilci ile ilişkilendirir. @tr

is interviewee of
status: Published
definition: Relates an agent to a resource that includes a contribution by an agent of being interviewed, usually by a reporter or some other information gathering agent.
type: Property
sub property of: is creator of
inverse of: has interviewee
lexical alias: intervieweeOf.en
label: er interviewet i @da
definition: Relaterer en agent, der er ansvarlig for at have skabt en ressource ved at besvare spørgsmål fra en interviewer, normalt en journalist, medarbejder ved et meningsmålingsinstitut eller en anden informationsindsamler en ressource.. @da
label: is geïnterviewde van @nl
label: هو ضيف مقابلة لـ @ar
definition: يربط بين وكيل ومصدر يتضمن إسهام وكيل بإجراء مقابلة معه، عادةً من جانب مراسل أو وكيل من نوع آخر يجمع معلومات. @ar
label: haastateltava (toimija) aineistossa @fi
definition: Liittää toimijan aineistoon, jossa toimija on osallisena vastaamalla haastattelijalle. Yleensä haastattelija on toimittaja, mielipidetutkija tai muunlainen tiedonkeruun tekijä. @fi
label: ist Interviewte/Interviewter von @de
definition: Setzt einen Akteur in Beziehung zu einer Ressource, zu der ein Akteur beiträgt, indem er einer Interviewerin/einem Interviewer antwortet. Dabei handelt es sich normalerweise um eine Reporterin/einen Reporter oder einen anderen Akteur, der Informationen zusammenträgt. @de
label: 是……的受访者 @zh-hans
definition: 将一个行为者与涉及被采访（通常是被记者或其他信息收集行为者采访）的一个行为者的责任的一种资源关联起来。 @zh-hans
label: interjúalanya a következőnek: @hu
definition: Hozzákapcsol egy ágenst egy forráshoz, amelyhez hozzátartozik egy ágens felelőssége a válaszadásért egy interjúkészítőnek, rendszerint egy riporternek, vagy más információgyűjtő ágensnek. @hu
label: görüşülenidir @tr
definition: Bir temsilciyi, genellikle bir muhabir veya bilgi toplayan başka bir temsilci tarafından görüşülen bir temsilcinin katksının içeren bir kaynakla ilişkilendirir. @tr

has interviewer
status: Published
definition: Relates a resource to an agent who is responsible for creating a resource by acting as an interviewer, reporter, pollster, or some other kind of agent who gathers information.
type: Property
sub property of: has creator
inverse of: is interviewer of
lexical alias: interviewer.en
label: har interviewer @da
definition: Relaterer en ressource til en agent, der er ansvarlig for at have skabt en ressource ved at optræde som interviewer, journalist, medarbejder ved et meningsmålingsinstitut eller en anden informationsindsamler. @da
label: heeft interviewer @nl
label: haastattelija aineistossa @fi
label: له مُحاور @ar
definition: يربط مصدر بوكيل مسؤول عن إنشاء مصدر من خلال العمل كمحاور أو مراسل أو خبير استطلاعات رأي أو وكيل من نوع آخر يجمع المعلومات. @ar
definition: Liittää aineiston toimijaan, joka vastaa aineiston luomisesta toimimalla haastattelijana, toimittajana, mielipidetutkijana tai muunlaisena tiedonkerääjänä. @fi
label: hat Interviewerin/Interviewer @de
definition: Setzt eine Ressource in Beziehung zu einem Akteur, der für die Schaffung einer Ressource verantwortlich ist, indem er als Interviewerin/Interviewer, Reporterin/Reporter, Meinungsforscherin/Meinungsforscher oder anderer Akteur Informationen zusammenträgt. @de
label: 有采访者 @zh-hans
definition: 将一种资源与通过担当采访者、记者、民意调查员或其他类型信息搜集行为者而对一种资源的创建负责的一个行为者关联起来。 @zh-hans
label: interjúkészítője a következő: @hu
definition: Hozzákapcsol egy forrást egy ágenshez, amely felelős egy forrás létrehozásáért oly módon, hogy interjúkészítőként, riporterként, közvélemény-kutatóként, vagy valamilyen más információgyűjtő ágensként cselekszik. @hu
label: görüşmeci ile ilişkilidir @tr
definition: Bir kaynağı, röportajcı, muhabir, anketör veya bilgi toplayan başka tür bir temsilci olarak hareket ederek kaynak oluşturmaktan sorumlu olan bir temsilci ile ilişkilendirir. @tr

is interviewer of
status: Published
definition: Relates an agent to a resource that includes a contribution by an agent of interviewing, reporting, or some other information gathering agent.
type: Property
sub property of: is creator of
inverse of: has interviewer
lexical alias: interviewerOf.en
label: er interviewer i @da
definition: Relaterer en agent, der er ansvarlig for at have skabt en ressource ved at optræde som interviewer, journalist, medarbejder ved et meningsmålingsinstitut eller en anden informationsindsamler til en ressource. @da
label: is interviewer van @nl
label: هو مُحاور لـ @ar
definition: يربط بين وكيل ومصدر يتضمن مساهمة وكيل في إجراء مقابلات، إعداد تقارير، أو وكيل من نوع آخر يجمع معلومات. @ar
label: haastattelija (toimija) aineistossa @fi
definition: Liittää toimijan aineistoon, jossa toimija vastaa aineiston luomisesta toimimalla haastattelijana, toimittajana, mielipidetutkijana tai muunlaisena tiedonkerääjänä. @fi
label: ist Interviewerin/Interviewer von @de
definition: Setzt einen Akteur in Beziehung zu einer Ressource, zu der ein Akteur beiträgt, indem er als Interviewerin/Interviewer, Reporterin/Reporter, Meinungsforscherin/Meinungsforscher oder anderweitig Informationen zusammenträgt. @de
label: 是……的采访者 @zh-hans
definition: 将一个行为者与包括担当采访、报道、民意调查或其他类型信息搜集的一个行为者的贡献的一种资源关联起来。 @zh-hans
label: interjúkészítője a következőnek: @hu
definition: Hozzákapcsol egy ágenst egy forráshoz, amely magában foglalja egy ágens közreműködését interjúban, riportban vagy más információgyűjtő ágensként. @hu
label: görüşmecisidir @tr
definition: Bir temsilciyi, görüşme, raporlama veya diğer bazı bilgi kaynaklarını toplayan temsilcinin katkısını içeren bir kaynakla ilişkilendirir. @tr

has inventor
status: Published
definition: Relates a resource to an agent who is responsible for creating a new device or process.
type: Property
sub property of: has creator
inverse of: is inventor of
lexical alias: inventor.en
label: har opfinder @da
definition: Relaterer en ressource til en agent, der er ansvarlig for at have skabt en ny anordning eller proces. @da
label: heeft uitvinder @nl
label: keksijä aineistossa @fi
label: له مخترع @ar
definition: يربط مصدر بوكيل مسؤول عن إنشاء جهاز جديد أو عملية جديدة. @ar
definition: Liittää aineiston toimijaan, joka vastaa uuden laitteen tai prosessin luomisesta. @fi
label: hat Erfinderin/Erfinder @de
definition: Setzt eine Ressource in Beziehung zu einem Akteur, der für die Schaffung eines neuen Geräts oder Prozesses verantwortlich ist. @de
label: 有发明者 @zh-hans
definition: 将一种资源与负责创建一种新装置或新过程的一个行为者关联起来。 @zh-hans
label: feltalálója a következő: @hu
definition: Hozzákapcsol egy forrást egy ágenshez, amely felelős egy új eszköz vagy eljárás létrehozásáért. @hu
label: mucit ile ilişkilidir @tr
definition: Bir kaynağı, yeni bir aygıt veya işlem oluşturmaktan sorumlu olan bir temsilci ile ilişkilendirir. @tr

is inventor of
status: Published
definition: Relates an agent who is responsible for creating a new device or process to a resource.
type: Property
sub property of: is creator of
inverse of: has inventor
lexical alias: inventorOf.en
label: er opfinder af @da
definition: Relaterer en agent der er ansvarlig for at have skabt en ny anordning eller proces til en ressource. @da
label: is uitvinder van @nl
label: هو مخترع لـ @ar
definition: يربط وكيل مسؤول عن تصنيع جهاز جديد أو عملية جديدة لمصدر. @ar
label: keksijä (toimija) aineistossa @fi
definition: Liittää toimijan aineistoon, jossa toimija vastaa uuden laitteen tai prosessin luomisesta. @fi
label: ist Erfinderin/Erfinder von @de
definition: Setzt einen Akteur, der für die Schaffung eines neuen Geräts oder Prozesses verantwortlich ist, in Beziehung zu einer Ressource. @de
label: 是……的发明者 @zh-hans
definition: 将一个负责创建一个新装置或新过程的行为者与一种资源关联起来。 @zh-hans
label: feltalálója a következőnek: @hu
definition: Hozzákapcsol egy új eszköz vagy eljárás létrehozásáért felelős ágenst egy forráshoz. @hu
label: mucididir @tr
definition: Yeni bir cihaz veya işlem oluşturmaktan sorumlu olan bir temsilciyi bir kaynakla ilişkilendirir. @tr

has ISSN
status: Published
definition: Relates a resource to an identifier that is assigned to a series by an ISSN registration agency.
type: Property
lexical alias: issn.en
label: har ISSN for serie @da
definition: Relaterer en ressource til en unik identifikator givet til en serie af en ISSN-registreringsinstitution. @da
inverse of: is ISSN of
label: heeft ISSN @nl
label: له ترقيم دولي موحد للدوريات @ar
definition: يربط بين مصدر ومعرف خُصص لسلسلة من قبل وكالة تسجيل الترقيم الدولي الموحد للدوريات @ar
label: aineiston ISSN @fi
definition: Liittää aineiston ISSN-rekisteröintitoimistoon myöntämään sarjan tunnisteeseen. @fi
label: hat ISSN einer Reihe @de
definition: Setzt eine Ressource in Beziehung zu einem Identifikator, der einer Reihe von einem ISSN-Zentrum zugewiesen wird. @de
label: 有国际标准连续出版物号 @zh-hans
definition: 将一种资源与一个国际标准连续出版物号注册机构分配给一种丛编的一个标识符关联起来。 @zh-hans
label: ISSN-je a következő: @hu
definition: Hozzákapcsol egy forrást egy azonosítóhoz, amelyet egy ISSN regisztrációs ügynökség rendelt hozzá egy sorozathoz. @hu
label: ISSN ile ilişkilidir @tr
definition: Bir kaynağı, ISSN kayıt kurumu tarafından bir diziye atanan bir tanımlayıcı ile ilişkilendirir. @tr

is ISSN of
status: Published
lexical alias: issnOf.en
definition: Relates a nomen to a resource that has an identifier assigned by an ISSN registration agency.
type: Property
inverse of: has ISSN
label: is ISSN van @nl
label: هو ترقيم دولي موحد للدوريات لـ @ar
definition: يربط تسمية بمصدر له مُعرّف خُصص لسلسلة من قبل وكالة تسجيل الترقيم الدولي الموحد للدوريات @ar
label: er ISSN for @da
definition: Relaterer et nomen til en ressource, som har en identifikator tildelt af et ISSN registreringsbureau. @da
label: ISSN @fi
definition: Liittää nomenin aineistoon, jolla on ISSN-rekisteröintiyksikön antama tunniste. @fi
label: ist ISSN von @de
definition: Setzt ein Nomen in Beziehung zu einer Ressource, die über einen Identifikator verfügt, der von einem ISSN-Zentrum vergeben wird. @de
label: 是……的国际标准连续出版物号 @zh-hans
definition: 将一个命名与被一个国际标准连续出版物号注册机构分配一个标识符的一种资源关联起来。 @zh-hans
label: ISSN-je a következőnek: @hu
definition: Hozzákapcsol egy noment egy forráshoz, amelynek rendelkezik egy ISSN regisztrációs ügynökség által jegyzett azonosítóval. @hu
label: ISSN'idir @tr
definition: Bir ismi, ISSN kayıt ajansı tarafından atanmış bir tanımlayıcıya sahip bir kaynakla ilişkilendirir. @tr

has ISSN of subseries (Deprecated)
status: Deprecated
definition: Relates a resource to an identifier assigned to a subseries by an ISSN registration agency. (Deprecated)
type: Property
lexical alias: issnOfSubseries.en
label: har ISSN for underserie @da
definition: Relaterer en ressource til en unik identifikator givet til en underserie af en ISSN-registreringsinstitution. @da

has issue
status: Published
definition: Relates a resource to a resource that is a static resource that is inspired by the overall editorial policy, scope, and style of a successive aggregating resource.
type: Property
sub property of: has part resource
inverse of: is issue of
lexical alias: issue.en
label: er serieindholder af @da
definition: Relaterer en ressource til en ressource, der er blevet udgivet som del af en serie. @da
alternative label: is series container of
label: heeft aflevering @nl
label: aineiston numero @fi
alternative label: sarjan osa @fi
label: له إصدارة @ar
definition: يربط بين مصدر ومصدر ثابت مستوحى من السياسة التحريرية الشاملة، والمجال، والأسلوب لمصدر تجميعي متتالي. @ar
alternative label: هي حاوية سلسلة لـ @ar
alternative label: er seriecontainer af @da
definition: Liittää aineiston aineistoon, joka on staattinen aineisto, johon on vaikuttanut peräkkäin ilmestyvän aggregoivan teoksen yleinen toimituslinja, toiminta-ala ja tyyli. @fi
label: hat Ausgabe @de
definition: Setzt eine Ressource in Beziehung zu einer Ressource, die an die allgemeine redaktionelle Vorgehensweise, den Geltungsbereich und den Stil einer sukzessiven, aggregierenden Ressource angelehnt ist. @de
alternative label: ist Reihe enthält @de
alternative label: 是……的丛编整体 @zh-hans
label: 有期 @zh-hans
definition: 将一种资源与作为一种静态资源并受一种相继合集性资源的编辑政策、编辑范围和编辑风格启发的一种资源关联起来。 @zh-hans
alternative label: sorozatbefoglalója a következőnek: @hu
label: száma a következő: @hu
definition: Hozzákapcsol egy forrást egy statikus forráshoz, amelyre egy folyamatos aggregáló forrás szerkesztési elve, tárgyköre és stílusa volt hatással. @hu
alternative label: serisi kapsayıcısıdır @tr
label: sayı ile ilişkilidir @tr
definition: Bir kaynağı, ardışık toplama kaynağın genel yayın politikası, kapsamı ve biçiminden esinlenen durağan bir kaynak olan bir kaynakla ilişkilendirir. @tr

is on carrier unit with
status: Published
definition: Relates a resource to a resource that is a part of the same carrier unit as another part resource.
type: Property
sub property of: is accompanied by
label: er udgivet sammen med @da
definition: Relaterer en ressource til en ressource, der er udgivet på den samme bærer som den ressource, der beskrives. @da
alternative label: is issued with
lexical alias: onCarrierUnitWith.en
label: is uitgevaardigd met @nl
label: tallenteella myös (aineisto) @fi
label: هو صادر مع @ar
definition: يربط بين مصدر ومصدر صادر على الوسيط نفسه مثل المصدر الذي يتم وصفه. @ar
definition: Liittää aineiston ainestoon, joka on ilmestynyt samalla tallenteella kuin toinen osa-aineisto. @fi
alternative label: ilmestynyt yhdessä (aineisto) @fi
label: ist erschienen mit @de
definition: Setzt eine Ressource in Beziehung zu einer Ressource, die auf demselben Datenträger erscheint, wie die Ressource, die beschrieben wird. @de
alternative label: 与……一起发行 @zh-hans
label: 和……一起在载体单元上 @zh-hans
definition: 将一种资源与作为和另一种部分资源一起在同一个载体单元上的一个部分的一种资源关联起来。 @zh-hans
label: és en una unitat de suport físic amb @ca
label: együtt kiadva a következővel: @hu
definition: Hozzákapcsol egy forrást egy forráshoz, amelyet ugyanazon a hordozón adnak ki, mint az éppen leírt forrást. @hu
has subproperty: is filmed with
has subproperty: is on disc with
alternative label: ile aynı taşıyıcı birimde yer alır @tr
label: ile aynı taşıyıcı ünitede yer alır @tr
definition: Bir kaynağı, aynı taşıyıcı birimin parçası olan başka bir kaynağın parçası ile ilişkilendirir. @tr

is issue of
status: Published
definition: Relates a resource to a resource that is a successive aggregating resource that inspires the editorial policy, scope, and style of a static resource.
type: Property
sub property of: is part of resource
inverse of: has issue
lexical alias: issueOf.en
label: er del af serie @da
definition: Relaterer en ressource til en ressource, i hvilket en del er blevet udgivet; en titel på en større ressource optræder på delen. @da
alternative label: is in series
label: is aflevering van @nl
label: numero @fi
alternative label: kuuluu sarjaan @fi
label: هو إصدارة لـ @ar
definition: يربط بين مصدر ومصدر تجميعي متتالي يلهِم السياسة التحريرية، المجال، والأسلوب لمصدر ثابت. @ar
alternative label: هو في سلسلة @ar
alternative label: er i serie @da
definition: Liittää aineiston staattiseen aggregoivaan aineistoon, josta toinen peräkkäinen staattinen aineisto saa vaikutteita toimitukselliseen käytäntöön, laajuuteen ja tyyliin. @fi
label: ist Ausgabe von @de
definition: Setzt eine Ressource in Beziehung zu einer sukzessiven, aggregierenden Ressource, die die redaktionelle Vorgehensweise, den Geltungsbereich und den Stil einer statischen Ressource beeinflusst. @de
alternative label: 在丛编中 @zh-hans
label: 是……的期 @zh-hans
definition: 将一种资源与作为一种相继合集性资源并且启发一种静态资源的编辑政策、编辑范围和编辑风格的一种资源关联起来。 @zh-hans
alternative label: a következő sorozat része: @hu
label: száma a következőnek: @hu
definition: Hozzákapcsol egy forrást egy folyamatos aggregáló forráshoz, amely hatással van egy statikus forrás szerkesztési elveire, tárgykörére és stílusára. @hu
label: sayısıdır @tr
definition: Bir kaynağı, durağan bir kaynağın yayın politikasına, kapsamına ve biçimine ilham veren ardışık toplama kaynağı olan bir kaynakla ilişkilendirir. @tr

has issuing agent
status: Published
definition: Relates a resource to an agent who issues a resource.
type: Property
sub property of: has other agent associated with resource (Deprecated)
inverse of: is issuing agent of
label: har ansvarlig institution @da
definition: Relaterer en ressource til en agent, der har udgivet en ressource, såsom et officielt skrift fra agenten. @da
lexical alias: issuingAgent.en
label: heeft uitvaardiger @nl
label: له وكيل جهة إصدار @ar
definition: يربط مصدر بوكيل يقوم بإصدار مصدر ما. @ar
label: aineiston julkaisija @fi
definition: Liittää aineiston sen julkaisevaan toimijaan. @fi
label: hat herausgebenden Akteur @de
definition: Setzt eine Ressource in Beziehung zu einem Akteur, der eine Ressource heraus gibt. @de
label: 有颁布行为者 @zh-hans
definition: 将一种资源与颁布一种资源的一个行为者关联起来。 @zh-hans
label: kibocsátó ágense a következő: @hu
definition: Hozzákapcsol egy forrást egy ágenshez, amely kibocsát egy forrást. @hu
label: piyasaya çıkaran temsilcisi ile ilişkilidir @tr
definition: Bir kaynağı, kaynağı yayınlayan bir temsilci ile ilişkilendirir. @tr

is issuing agent of
status: Published
definition: Relates an agent to a resource that involves a responsibility of an agent for issuing a resource, such as an official organ of the body.
type: Property
sub property of: is other agent associated with resource of (Deprecated)
inverse of: has issuing agent
label: er ansvarlig institution for @da
definition: Relaterer en agent, der har udgivet en ressource, såsom en officiel skrift fra agenten til en ressource. @da
lexical alias: issuingAgentOf.en
label: is uitvaardiger-actor van @nl
label: هو وكيل جهة إصدار لـ @ar
definition: يربط بين وكيل ومصدر ينطوي على مسؤولية وكيل عن إصدار مصدر، مثل العضوية الرسمية لهيئة. @ar
label: aineiston julkaisija (toimija) aineistossa @fi
definition: Liittää toimijan aineistoon, jonka julkaisemisesta toimija, esimerkiksi virallinen toimielin, vastaa. @fi
label: ist herausgebender Akteur von @de
definition: Setzt einen Akteur in Beziehung zu einer Ressource, bei der ein Akteur für die Herausgabe einer Ressource, zum Beispiel eines offiziellen Organs der Körperschaft, verantwortlich ist. @de
label: 是……的颁布行为者 @zh-hans
definition: 将一个行为者与涉及一个颁布一种资源（例如一个团体的机关刊物）的一个行为者的责任的一种资源关联起来。 @zh-hans
label: kibocsátó ágense a következőnek: @hu
definition: Hozzákapcsol egy ágenst egy forráshoz, amelyhez hozzátartozik az ágens felelőssége egy olyan forrás kibocsátásáért, mint amilyen egy társaság hivatalos sajtóorgánuma. @hu
label: piyasaya çıkaran temsilcisidir @tr
definition: Bir temsilciyi, kuruluşun resmi bir organı gibi bir kaynağı yayınlamaya ilişkin bir temsilcinin sorumluluğunu içeren bir kaynakla ilişkilendirir. @tr

has resource-specific carrier characteristic of early printed resource (Deprecated)
status: Deprecated
definition: Relates a resource to a characteristic that applies to the carrier or carriers of the specific early printed resource being described and is assumed not to apply to other resources exemplifying the same resource. includes rubrication, illumination, and other hand colouring, manuscript additions, and binding. (Deprecated)
sub property of: has modification of resource
lexical alias: itemSpecificCarrierCharacteristicOfEarlyPrintedResource.en
type: Property

has jointly held conference
status: Published
type: Property
lexical alias: jointlyHeldConference.en
definition: Relates an agent to an agent who is a conference that is jointly held with a related conference.
label: har konference afholdt i fællesskab @da
definition: Relaterer en konference til en konference, der afholdes i fællesskab med en anden konference. @da
label: heeft gezamenlijk gehouden conferentie @nl
label: له مؤتمر يعقد بصورة مشتركة @ar
definition: يربط بين وكيل ووكيل مؤتمر ر يُعقد بصورة مشتركة مع مؤتمر ذي صلة. @ar
label: yhteiskonferenssi (yhteistoimija) @fi
definition: Liittää toimijan toimijaan, joka on yhdessä toisen konferenssin kanssa järjestettävä konferenssi. @fi
label: hat gemeinsam durchgeführte Konferenz @de
definition: Setzt einen Akteur in Beziehung zu einer Konferenz, die gemeinsam mit einer anderen Konferenz durchgeführt wird. @de
label: 有联合举办的会议 @zh-hans
definition: 将一个行为者与作为一次会议并和一次相关会议联合举办的一个行为者关联起来。 @zh-hans
definition: Relaciona un agent amb un agent que és un congrés que se celebra conjuntament amb un congrés relacionat. @ca
label: közösen tartott konferenciája a következő: @hu
definition: Hozzákapcsol egy ágenst egy ágenshez, amely egy olyan konferencia, amelyet közösen tartanak egy kapcsolódó konferenciával. @hu
label: ortak düzenlenen konferans ile ilişkilidir @tr
definition: Bir temsilciyi, ilgili bir konferansla ortaklaşa düzenlenen bir konferans olan bir temsilci ile ilişkilendirir. @tr

has judge
status: Published
definition: Relates a resource to an agent who hears and decides on legal matters in court.
type: Property
sub property of: has other agent associated with resource (Deprecated)
inverse of: is judge of
lexical alias: judge.en
label: har dommer @da
definition: Relaterer en ressource til en agent, der hører og træffer beslutning om juridiske anliggender i retten. @da
label: heeft rechter @nl
label: tuomari @fi
label: له قاضي @ar
definition: يربط مصدر بوكيل يسمع ويفصل في المسائل القانونية في محكمة. @ar
definition: Liittää aineiston toimijaan, joka kuulee ja päättää oikeusasioista tuomioistuimessa. @fi
label: hat Richterin/Richter @de
definition: Setzt eine Ressource in Beziehung zu einem Akteur, der bei Gericht juristische Angelegenheiten anhört und darüber entscheidet. @de
label: 有法官 @zh-hans
definition: 将一种资源与在法院中审理并决定法律事务的一个行为者关联起来。 @zh-hans
label: bírója a következő: @hu
definition: Hozzákapcsol egy forrást egy ágenshez, amely jogi ügyekben tárgyalást vezet és ítélkezik a bíróságon. @hu
label: hâkim ile ilişkilidir @tr
definition: Bir kaynağı mahkemede hukuki meseleleri dinleyen ve karara bağlayan bir temsilci ile ilişkilendirir. @tr

is judge of
status: Published
definition: Relates an agent to a resource that involves a responsibility of an agent for hearing and decision on legal matters in court.
type: Property
sub property of: is other agent associated with resource of (Deprecated)
inverse of: has judge
lexical alias: judgeOf.en
label: er dommer i @da
definition: Relaterer en agent der hører og træffer beslutning om juridiske anliggender i retten til en ressource. @da
label: is rechter van @nl
label: هو قاضِي لـ @ar
definition: يربط بين وكيل ومصدر ينطوي على مسؤولية وكيل عن الاستماع إلى المسائل القانونية في محكمة والبت فيها. @ar
label: tuomari (toimija) aineistossa @fi
definition: Liittää toimijan aineistoon, jossa toimija kuulee ja päättää oikeusasioista tuomioistuimessa. @fi
label: ist Richterin/Richter von @de
definition: Setzte einen Akteur in Beziehung zu einer Ressource, bei der ein Akteur dafür verantwortlich ist, sich bei Gericht juristische Angelegenheiten anzuhören und darüber zu entscheiden. @de
label: 是……的法官 @zh-hans
definition: 将一个行为者与涉及法院中关于法律事务审理和决定责任的一种资源关联起来。 @zh-hans
label: bírája a következőnek: @hu
definition: Hozzákapcsol egy ágenst egy forráshoz, amelyhez hozzátartozik egy ágens felelőssége a bíróságon a jogi ügyek tárgyalása és az ítélkezés. @hu
label: yargıcıdır @tr
definition: Bir temsilciyi, mahkemede yasal konularda duruşma ve karar vermeye ilişkin bir temsilcinin sorumluluğunu içeren bir kaynakla ilişkilendirir. @tr

has place governed
status: Published
definition: Relates an agent to a place that is governed by an agent who is a government.
type: Property
sub property of: has related place of agent
inverse of: is place governed by
label: har jurisdiktion underlagt @da
definition: Relaterer en ressource til en jurisdiktion, der har vedtaget en lov, forordning, forfatning, retsplejeregel etc. @da
label: heeft geregeerde jurisdictie @nl
label: säätävä hallintoelin @fi
label: له اختصاص قضائي @ar
definition: يربط مكانًا يُمثل ولاية قضائية لوكيل يُمثل حكومة تخضع لسُلطة نطاق جغرافي يحكمه قانون أو لائحة تنظيمية، إلخ.، سنتها حكومة أخرى. @ar
definition: Liittää paikan julkishallinnolliseen toimijaan, jota toisen julkishallinnollisen yhteisön säätämät lait, asetukset tms. ohjaavat. @fi
label: hat geregelte Gebietskörperschaft @de
definition: Setzt eine Gebietskörperschaft in Beziehung zu einem Akteur, bei dem es sich um die Regierung einer Gebietskörperschaft handelt, die durch ein Gesetz, eine Verordnung und so weiter geregelt wird, das/die von einer anderen Regierung erlassen wurde. @de
alternative label: has jurisdiction governed
lexical alias: placeGoverned.en
label: 有所管理的辖区 @zh-hans
definition: 将一个行为者与作为根据另一个政府所颁布的法律、法规等管理的一个辖区的一个地点关联起来。 @zh-hans
definition: Relaciona un agent amb un lloc que és regit per un agent que és un govern. @ca
label: joghatósága a következő: @hu
definition: Hozzákapcsol egy joghatóság helyet egy igazgatási szerv ágenshez, amely egy másik igazgatási szerv által hozott törvény, rendelet stb. hatálya alá tartozik. @hu
alternative label: té jurisdicció regida @ca
label: té com a lloc regit @ca
label: yönetilen yargı alanı ile ilişkilidir @tr
definition: Yargı yetkisi olan bir yeri, başka bir hükümet tarafından çıkarılan bir yasa, yönetmelik vb. ile yönetilen bir yargı yetkisinin hükümeti olan bir temsilci ile ilişkilendirir. @tr

is place governed by
status: Published
definition: Relates a place to an agent who is a government of a place.
type: Property
inverse of: has place governed
label: er jurisdiktion underlagt @da
definition: Relaterer en jurisdiktion, der er underlagt en lov, forordning etc., der var vedtaget af en anden domsmyndighed til en ressource. @da
label: is jurisdictie geregeerd van @nl
label: soveltava lainkäyttöalue yhteisölle @fi
label: هو نطاق جغرافى خاضع لـ @ar
definition: يربط بين وكيل ومكان يخضع لسلطة قضائية يحكمها قانون، لائحة تنظيمية...إلخ، سنتها حكومة أخرى. @ar
label: ist geregelte Gebietskörperschaft von @de
definition: Setzt einen Akteur in Beziehung zu einem Geografikum, das durch ein Gesetz, eine Verordnung und so weiter geregelt wird, das/die von einer anderen Regierung erlassen wurde. @de
definition: Liittää toimijan paikkaan, joka on toisen julkishallinnollisen yhteisön säätämien lakien, asetusten tms. alainen. @fi
alternative label: is jurisdiction governed of
lexical alias: placeGovernedOf.en
label: 是……的所管理辖区 @zh-hans
definition: 将一个地点与作为根据另一个政府所颁布的法律、法规等管理的一个辖区的政府的一个行为者关联起来。 @zh-hans
definition: Relaciona un lloc amb un agent que és un govern d’un lloc. @ca
label: joghatósága a következőnek: @hu
definition: Hozzákapcsol egy ágenst egy helyhez, amely egy másik igazgatási szerv által hozott törvény, rendelet stb. hatálya alá tartozó joghatóság. @hu
alternative label: és jurisdicció regida de @ca
label: és lloc regit per @ca
label: yönetilen yargı alanıdır @tr
definition: Bir temsilciyi, başka bir hükümet tarafından yürürlüğe konulan bir yasa, yönetmelik vb. tarafından yönetilen bir yargı yetkisi olan bir yerle ilişkilendirir. @tr

has key
status: Published
definition: Relates a resource to a set of pitch relationships that establishes the tonal centre, or principal tonal centre, used, or intended to be used, for performance of musical content of a resource.
type: Property
lexical alias: key.en
label: har toneart @da
definition: Relaterer en ressource til et sæt af tonehøjdeforhold, der fastlægger et musikressources tonale eller væsentligste tonale centrum. @da
label: heeft toonsoort @nl
label: له مُفتاح @ar
definition: يربط بين مصدر ومجموعة من علاقات النغمات التي تؤسس مركز النغمات أو مركز النغمات الرئيسي المستخدم أو المزمع استخدامه لأداء المحتوى الموسيقي لمصدر ما. @ar
label: aineiston sävellaji @fi
definition: Liittää aineiston sävelsuhteiden joukkoon, johon aineiston musiikillisen sisällön esityksessä käytetty tai käytettäväksi tarkoitettu tonaalinen keskus tai pääasiallinen tonaalinen keskus perustuu. @fi
label: hat Tonart @de
definition: Setzt eine Ressource in Beziehung zu einem Satz an Tonhöhenbeziehungen, der das tonale Zentrum oder das hauptsächliche tonale Zentrum begründet, das für eine Darbietung eines musikalischen Inhalts einer Ressource verwendet wird oder verwendet werden soll. @de
label: 有调 @zh-hans
definition: 将一种资源与为一种资源的音乐内容之表演建立所用或计划所用的调性中心或主调性中心的一组音高关系关联起来。 @zh-hans
label: kulcsa a következő: @hu
definition: Hozzákapcsol egy forrást hangmagassági kapcsolatok halmazához, amely tonális központot vagy fő tonális központot hoz létre, amelyet a forrás zenei tartalmának előadásához használnak vagy használni kívánnak. @hu
label: ton ile ilişkilidir @tr
definition: Bir kaynağı, bir kaynağın müzikal içeriğinin performansı için kullanılan veya kullanılması amaçlanan tonal merkezi veya ana tonal merkezi belirleyen bir dizi perde ilişkisiyle ilişkilendirir. @tr

has key title
status: Published
definition: Relates a resource to a nomen that is a title of resource that is assigned by an ISSN registration agency.
type: Property
sub property of: has related nomen of resource
lexical alias: keyTitle.en
label: har nøgletitel @da
definition: Relaterer en ressource til et unikt navn, der gives til en ressource af et ISSN-registreringsorgan. @da
inverse of: is key title of
label: heeft key title @nl
label: له عنوان مُفتاحي @ar
definition: يربط بين مصدر وعنوان مصدر خصصته وكالة تسجيل ترقيم دولي موحد للدوريات. @ar
label: aineiston avainnimeke @fi
definition: Liittää aineiston ISSN-rekisteröintiyksikön antamaan aineiston nimekkeeseen. @fi
label: hat Key Title @de
definition: Setzt ein Werk in Beziehung zu einem Titel eines Werks, der durch eine ISSN-Registrierungsstelle vergeben wird. @de
label: 有识别题名 @zh-hans
definition: 将一种资源与作为被国际标准连续出版物号一个注册机构分配之资源的一个题名的一个命名关联起来。 @zh-hans
definition: Relaciona un recurs amb un nomen que és un títol d’un recurs que és assignat per una agència de registre de l’ISSN. @ca
label: kulcscíme a következő: @hu
definition: Hozzákapcsol egy forrást egy forráscímhez, amelyet egy ISSN nyilvántartó ügynökség utal ki. @hu
label: ana başlık ile ilişkilidir @tr
definition: Bir kaynağı, bir ISSN kayıt kuruluşu tarafından atanan bir kaynak başlığıyla ilişkilendirir. @tr

is key title of
status: Published
lexical alias: keyTitleOf.en
definition: Relates a nomen to a resource that has a title of resource that is assigned by an ISSN registration agency.
type: Property
inverse of: has key title
sub property of: has related resource of nomen
label: is key title van @nl
label: هو عنوان مفتاحى لـ @ar
definition: يربط تسمية بمصدر له عنوان مصدر خصصته وكالة تسجيل الترقيم الدولي الموحد للدوريات @ar
label: er nøgletitel på @da
definition: Relaterer et nomen til en ressource, som har en ressourcetitel, der er tildelt af et ISSN registreringsbureau. @da
label: avainnimeke aineistolle @fi
definition: Liittää aineiston ISSN-rekisteröintiyksikön antamaan aineiston nimekkeeseen. @fi
label: ist Key Title von @de
definition: Setzt ein Nomen in Beziehung zu einer Ressource, die über einen Titel für eine Ressource verfügt, der von einem ISSN-Zentrum vergeben wird. @de
label: 有……的识别题名 @zh-hans
definition: 将一个命名与有被国际标准连续出版物号一个注册机构分配之资源的一个题名的一种资源关联起来。 @zh-hans
label: kulcscíme a következőnek: @hu
definition: Hozzákapcsol egy noment egy forráshoz, amely rendelkezik egy olyan forráshoz tartozó címmel, amelyet egy ISSN regisztrációs ügynökség jegyez. @hu
label: ana başlığıdır @tr
definition: Bir ismi, ISSN kayıt ajansı tarafından atanan bir kaynak başlığına sahip bir kaynakla ilişkilendirir. @tr

has landscape architect
status: Published
definition: Relates a resource to an agent who is an architect who is responsible for creating landscape resources.
type: Property
sub property of: has architect
inverse of: is landscape architect of
lexical alias: landscapeArchitect.en
label: har landskabsarkitekt @da
definition: Relaterer en ressource til en arkitekt, der er ansvarlig for at forme landskaber. @da
label: heeft landschapsarchitect @nl
label: maisema-arkkitehti aineistossa @fi
label: له مهندس تنسيق مواقع @ar
definition: يربط مصدر بوكيل هو مهندس معماري مسؤول عن إنشاء مصادر تنسيق المواقع. @ar
definition: Liittää aineiston toimijaan, joka vastaa maisemasunnittelusta. @fi
label: hat Landschaftsarchitektin/Landschaftsarchitekten @de
definition: Setzt eine Ressource in Beziehung zu einer Architektin/einem Architekten, die/der für die Erschaffung landschaftlicher Ressourcen verantwortlich ist. @de
label: 有景观设计师 @zh-hans
definition: 将一种资源与作为建筑师并负责创建景观资源的一个行为者关联起来。 @zh-hans
label: tájépítésze a következő: @hu
definition: Hozzákapcsol egy forrást egy építész ágenshez, aki felelős tájépítészeti források létrehozásáért. @hu
label: peyzaj mimarı ile ilişkilidir @tr
definition: Bir kaynağı, kaynağın peyzaj çalışmasından sorumlu mimar olan temsilci ile ilişkilendirir. @tr

is landscape architect of
status: Published
definition: Relates an agent to a resource that involves a responsibility of an agent for architectural aspects of landscaping.
type: Property
sub property of: is architect of
inverse of: has landscape architect
lexical alias: landscapeArchitectOf.en
label: er landskabsarkitekt til @da
definition: Relaterer en arkitekt, der er ansvarlig for at have skabt landskabsressourcer til en ressource. @da
label: is landschapsarchitect van @nl
label: هو مهندس تنسيق مواقع لـ @ar
definition: يربط بين وكيل ومصدر ينطوي على مسؤولية وكيل عن الجوانب المعمارية لتنسيق المواقع. @ar
label: maisema-arkkitehti (toimija) aineistossa @fi
definition: Liittää toimijan aineistoon, jossa toimija vastaa maisemasuunnittelun arkkitehtonisista osa-alueista. @fi
label: ist Landschaftsarchitektin/Landschaftsarchitekt von @de
definition: Setzt einen Akteur in Beziehung zu einem Werk, bei dem ein Akteur für die Schaffung von Landschaften verantwortlich ist. @de
label: 是……的景观设计师 @zh-hans
definition: 将一个行为者与涉及景观之建筑方面的一个行为者的责任的一种资源关联起来。 @zh-hans
label: tájépítésze a következőnek: @hu
definition: Hozzákapcsol egy ágenst egy forráshoz, amelyhez hozzátartozik egy ágens felelőssége a tájépítészet építészeti vonatkozásaiért. @hu
label: peyzaj mimarıdır @tr
definition: Bir temsilciyi, peyzajın mimari yönlerine ilişkin bir temsilcinin sorumluluğunu içeren bir kaynakla ilişkilendirir. @tr

has language of agent
status: Published
definition: Relates an agent to a language that is used by an agent in its communications.
type: Property
lexical alias: languageOfAgent.en
label: har agents sprog @da
definition: Relaterer en ressource til et sprog en agent anvender til at skrive til publicering, udsendelse etc. @da
label: heeft taal van actor @nl
label: toimijan käyttämä kieli @fi
label: له لغة لوكيل @ar
definition: يربط بين مصدر ولغة يستخدمها وكيل في اتصالاته، عند الكتابة للنشر، للبث الإذاعي، إلخ. @ar
definition: Liittää aineiston kieleen, jota toimija käyttää viestinnässään kirjallisissa julkaisuissa, radiolähetyksessä yms. @fi
label: hat Sprache eines Akteurs @de
definition: Setzt eine Ressource in Beziehung zu einer Sprache, die ein Akteur bei seiner Kommunikation verwendet, wenn er für eine Veröffentlichung, einen Hörfunkbeitrag und so weiter schreibt. @de
label: 有行为者的语言 @zh-hans
definition: 将一个行为者与一个行为者在交流中所用的语言关联起来。 @zh-hans
definition: Relaciona un agent amb una llengua que es usada per un agent en les seves comunicacions. @ca
label: ágens nyelve a következő: @hu
definition: Hozzákapcsol egy forrást egy ágens kiadás, műsorszórás közbeni kommunikációja során használt nyelvhez. @hu
label: temsilcinin dili ile ilişkilidir @tr
definition: Bir kaynağı, bir temsilcinin iletişimlerinde, yayın için yazarken, yayın yaparken vb. kullandığı bir dille ilişkilendirir. @tr

has language of resource
status: Published
definition: Relates a resource to a language used for the content of a resource.
type: Property
lexical alias: languageOfResource.en
label: har indholdets sprog @da
definition: Relaterer en ressource til et sprog, der anvendes til at udtrykke en ressources indhold. @da
label: heeft taal van resource @nl
label: له لغة لمصدر @ar
definition: يربط بين مصدر ولغة مُستخدمة لمحتوى مصدر. @ar
label: aineiston kieli @fi
definition: Liittää aineiston aineiston sisällössä käytettyyn kieleen. @fi
label: hat Sprache einer Ressource @de
definition: Setzt eine Ressource in Beziehung zu einer Sprache, die für den Inhalt einer Ressource verwendet wird. @de
label: 有资源的语言 @zh-hans
definition: 将一种资源与一种资源的内容所用的语言关联起来。 @zh-hans
label: forrás nyelve a következő: @hu
definition: Hozzákapcsol egy forrást egy nyelvhez, amelyet a forrás tartalmához használnak. @hu
label: kaynağın dili ile ilişkilidir @tr
definition: Bir kaynağı, bir kaynağın içeriği için kullanılan bir dille ilişkilendirir. @tr

has language version
status: Published
lexical alias: languageVersion.en
definition: Relates a resource to a resource that is created by changing the language audience of a resource.
type: Property
sub property of: has transformation by audience
label: heeft taalversie @nl
label: له إصدارة لغة @ar
definition: يربط بين مصدر ومصدر تم إنشاؤه عن طريق تغيير جمهور لغة لمصدر. @ar
label: har sproglig version @da
definition: Relaterer en ressource til en ressource, som er skabt ved at ændre det sproglige publikum for en ressource. @da
label: kieliversio @fi
label: hat Sprachversion @de
definition: Setzt eine Ressource in Beziehung zu einer Ressource, die durch Änderung der sprachlichen Zielgruppe einer Ressource erstellt wird. @de
definition: Liittää aineiston aineistoon, joka on luotu muuttamalla aineiston kieliyleisöä. @fi
label: 有语言版本 @zh-hans
definition: 将一种资源与通过改变一种资源的语言受众而被创建的一种资源关联起来。 @zh-hans
label: nyelvi változata a következő: @hu
definition: Hozzákapcsol egy forrást egy forráshoz, amely egy forrásközönség nyelvének megváltozása következtében jött létre. @hu
label: dil uyarlaması ile ilişkilidir @tr
definition: Bir kaynağı, bir kaynağın dil kitlesini değiştirerek oluşturulan bir kaynakla ilişkilendirir. @tr

is language version of
status: Published
lexical alias: languageVersionOf.en
definition: Relates a resource to a resource that has a language audience that is changed to create a resource.
type: Property
sub property of: is transformation by audience of
inverse of: has language version
label: is taalversie van @nl
label: هو إصدارة لغة لـ @ar
definition: يربط بين مصدر ومصدر له جمهور لغة تم تغييره لإنشاء مصدر. @ar
label: er sprogversion af @da
definition: Relaterer en ressource til en ressource, som har et sprogligt publikum, der ændres for at skabe en ressource. @da
label: ist Sprachversion von @de
definition: Setzt eine Ressource in Beziehung zu einer Ressource, deren sprachlichen Zielgruppe geändert wird, um eine Ressource zu schaffen. @de
label: aineiston kieliversio @fi
definition: Liittää aineiston aineistoon, jolla on aineiston luomiseksi muutettu kieliyleisö. @fi
label: 是……的语言版本 @zh-hans
definition: 将一种资源与有语言受众并被改变以创建一种资源的一种资源关联起来。 @zh-hans
label: nyelvi változata a következőnek: @hu
definition: Hozzákapcsol egy forrást egy forráshoz, amely közönségének a nyelve megváltozott egy forrás létrejövetele érdekében. @hu
label: dil uyarlamasıdır @tr
definition: Bir kaynağı, bir kaynak oluşturmak için değiştirilen bir kitlenin diline sahip kaynakla ilişkilendirir. @tr

has last alphanumeric designation of alternative sequence
status: Published
type: Property
lexical alias: lastAlphanumericDesignationOfAlternativeSequence.en
definition: Relates a resource to a nomen that is a designation in the form of numbers or alphabetic characters that is used to indicate the last in a concurrent sequence of numbering of the parts or iterations of a resource.
sub property of: has numbering of sequence
label: har alternativ numerisk og/eller alfabetisk betegnelse for sidste nummer eller del af en sekvens @da
definition: Relaterer en ressource til et andet eller efterfølgende nummereringssystem i numerisk og/eller alfabetisk form på sidste nummer eller del af nummereringssekvensen for et periodikum. @da
inverse of: is last alphanumeric designation of alternative sequence of
label: heeft laatste alfanumerieke aanduiding van alternatieve reeks @nl
label: له تسمية رقمية أخيرة لتسلسل بديل @ar
definition: يربط بين مصدر ونظام ترقيم ثانٍ أو تالٍ يُعرض في شكل أرقام أو حروف هجائية على الإصدار الأخير أو الجزء الأخير لتسلسل الترقيم لدورية. @ar
label: vaihtoehtoisen numerointijakson viimeinen numero- tai kirjainmäärite @fi
definition: Liittää aineiston toiseen tai myöhempään numerointijärjestelmään, joka on esitetty numeroin tai aakkosin sarjan viimeisessä numerossa tai sarjan numerointisarjan osana. @fi
label: hat alternative alphanumerische Bezeichnung der letzten Ausgabe oder des letzten Teils einer Folge @de
definition: Setzt eine Ressource in Beziehung zu einem zweiten oder nachfolgenden Zählungssystem, das in Form von Nummern oder Buchstaben auf der letzten Ausgabe oder dem letzten Teil einer fortlaufenden Ressource zu finden ist. @de
label: 有交替序列的最后一个字母数字标识 @zh-hans
definition: 将一种资源与作为以数字或字母字符形式用于标识一种资源的部分或更新后整体的并存编号序列中最后一个的标识的一个命名关联起来。 @zh-hans
definition: Relaciona un recurs amb un nomen que és una designació en la forma de números o caràcters alfabètics que s’usa per indicar la darrera en una seqüència concurrent de numeració de les parts o iteracions d’un recurs. @ca
label: alternatív sorrendiségének alfanumerikus zárójelölése a következő: @hu
definition: Hozzákapcsol egy forrást egy második vagy más folyamatos számozáshoz, amely számok vagy alfabetikus karakterek formájában jelzi egy sorozat utolsó részét vagy számát. @hu
label: alternatif sıranın son alfanümerik tanımlanması ile ilişkilidir @tr
definition: Bir kaynağı, bir seri numaralandırma dizisinin son sayısında veya bir bölümünde sayısal veya alfabetik biçimde sunulan ikinci veya sonraki bir numaralandırma sistemiyle ilişkilendirir. @tr

has last alphanumeric designation of sequence
status: Published
definition: Relates a resource to a nomen that is a designation in the form of numbers or alphabetic characters that is used to indicate the last in a sequence of numbering of the parts or iterations of a resource.
type: Property
sub property of: has numbering of sequence
lexical alias: lastAlphanumericDesignationOfSequence.en
label: har numerisk og/eller alfabetisk betegnelse for sidste nummer eller del af sekvens @da
definition: Relaterer en ressource til en betegnelse i numerisk og/eller alfabetisk form på sidste nummer eller del af en nummereringssekvens for et periodikum. @da
inverse of: is last alphanumeric designation of sequence of
label: heeft laatste alfanumerieke aanduiding van reeks @nl
label: له تسمية رقمية أخيرة لتسلسل @ar
definition: يربط بين مصدر وتسمية على شكل رقمي أو أبجدي مُقدمة في عدد أخير أو جزء أخير من تسلسل صدر في ترقيم متسلسل. @ar
label: numerointijakson viimeinen numero- ja/tai kirjainmäärite aineistolle @fi
definition: Liittää aineiston numeroista tai kirjaimista muodostuvaan määritteeseen, joka ilmaisee aineiston osien tai iteraatioiden numerointijakson viimeisen määritteen. @fi
label: hat alphanumerische Bezeichnung der letzten Ausgabe einer fortlaufenden Ressource @de
definition: Setzt eine Ressource in Beziehung zu einer Bezeichnung in Form von Nummern oder Buchstaben, die innerhalb einer Zählfolge auf der letzten Ausgabe einer fortlaufenden Ressource erscheint. @de
label: 有序列的最后一个字母数字标识 @zh-hans
definition: 将一种资源与作为以数字或字母字符形式用于标识一种资源的部分或更新后整体的编号序列中最后一个的标识的一个命名关联起来。 @zh-hans
definition: Relaciona un recurs amb un nomen que és una designació en la forma de números o caràcters alfabètics que s’usa per indicar la darrera en una seqüència de numeració de les parts o iteracions d’un recurs. @ca
label: sorrendiségének alfanumerikus zárójelölése a következő: @hu
definition: Hozzákapcsol egy forrást egy megjelöléshez, amely egy sorozat számozási sorrendjében, számok vagy alfabetikus karakterek formájában jelzi az utolsó részt vagy számot. @hu
label: sıranın son alfanümerik tanımlanması ile ilişkilidir @tr
definition: Bir kaynağı, bir sayı dizisinde yayınlanan bir serinin son sayısında veya bir kısmında sunulan sayısal veya alfabetik formdaki tanım ile ilişkilendirir. @tr

has last chronological designation of alternative sequence
status: Published
type: Property
lexical alias: lastChronologicalDesignationOfAlternativeSequence.en
definition: Relates a resource to a nomen that is a designation in the form of a date or other timespan that is used to indicate the last in a concurrent sequence of numbering of the parts or iterations of a resource.
scope note: A designation includes a year; year and month; month, day, and year. A chronological designation of alternative sequence may include a date in a different calendar.
sub property of: has numbering of sequence
label: alternativ kronologisk betegnelse for sidste nummer eller del af en sekvens @da
definition: Relaterer en ressource til et andet eller efterfølgende nummereringssystem i form af en datering på sidste nummer eller del af nummereringssekvensen for et periodikum. @da
scope note: Betegnelsen omfatter et år; år og måned; måned, dag og år. En alternativ kronologisk betegnelse kan omfatte en dato i en anden kalender. @da
inverse of: is last chronological designation of alternative sequence of
label: heeft laatste chronologische aanduiding van alternatieve reeks @nl
label: له تسمية زمنية أخيرة لتسلسل بديل @ar
definition: يربط بين مصدر ونظام ترقيم ثانٍ أو تالٍ يُعرض في شكل تاريخ على الإصدار الأخير أو الجزء الأخير لتسلسل الترقيم لدورية. @ar
scope note: تشمل التسمية: سنة؛ سنة وشهر؛ شهر، يوم، وسنة. قد تتضمن التسمية الزمنية لتسلسل بديل تاريخًا في تقويم مختلف. @ar
label: vaihtoehtoisen numerointijakson viimeinen aikamäärite @fi
definition: Liittää aineiston toiseen tai myöhempään numerointijärjestelmään, joka on esitetty viimeisen numeron päivämäärän muodossa tai sarjan numerointisarjan osana. @fi
scope note: Määrite sisältää vuoden; vuoden ja kuukauden; kuukauden, päivän ja vuoden. Vaihtoehtoinen aikamääre voi sisältää toisen kalenterin mukaisen ajankohdan. @fi
label: hat alternative chronologische Bezeichnung einer letzten Ausgabe oder eines letzten Teils einer Folge @de
definition: Setzt eine Ressource in Beziehung zu einem zweiten oder nachfolgenden Zählungssystem, das in Form eines Datums auf der letzten Ausgabe oder dem letzten Teil einer fortlaufenden Ressource zu finden ist. @de
scope note: Darunter fällt ein Jahr; ein Monat und ein Jahr; ein Tag, ein Monat und ein Jahr. Zu einer alternativen chronologischen Bezeichnung einer fortlaufenden Ressource kann auch ein Datum nach einem anderen Kalender gehören. @de
label: 有交替序列的最后一个年代标识 @zh-hans
definition: 将一种资源与作为以日期或其他时间段形式用于标识一种资源的部分或更新后整体的并存编号序列中最后一个的标识的一个命名关联起来。 @zh-hans
scope note: 标识包括年，年和月，年、月和日。交替序列的年代标识可以包括不同历法的日期。 @zh-hans
definition: Relaciona un recurs amb un nomen que és una designació en la forma d’una data o un altre interval de temps que s’usa per indicar la darrera en una seqüència concurrent de numeració de les parts o iteracions d’un recurs. @ca
label: alternatív sorrendiségének kronológiai zárójelölése a következő: @hu
definition: Hozzákapcsol egy forrást egy második vagy más folyamatos számozáshoz, amely dátum formájában jelzi egy sorozat utolsó részét vagy számát. @hu
scope note: Jelölés lehet év, év és hónap, hónap, nap és év. Az alternatív sorrendiség kronológiai jelölése tartalmazhat dátumot egy másik naptárból is. @hu
label: alternatif sıranın son kronolojik tanımlanması ile ilişkilidir @tr
definition: Bir kaynağı, bir seri numaralandırma dizisinin son sayısında veya bir bölümünde tarih biçiminde sunulan ikinci veya sonraki bir numaralandırma sistemiyle ilişkilendirir. @tr
scope note: Bir atama bir yılı içerir; yıl ve ay; ay, gün ve yıl. Alternatif dizinin kronolojik gösterimi farklı bir takvimdeki bir tarihi içerebilir. @tr

has last chronological designation of sequence
status: Published
definition: Relates a resource to a nomen that is a designation in the form of a date or other timespan that is used to indicate the last in a sequence of numbering of the parts or iterations of a resource.
type: Property
sub property of: has numbering of sequence
lexical alias: lastChronologicalDesignationOfSequence.en
scope note: Designation includes a year; year and month; month, day, and year.
label: har kronologisk betegnelse for sidste nummer eller del af sekvens @da
definition: Relaterer en ressource til en betagnelse i form af en datering på sidste nummer eller del af en nummereringssekvens for et periodikum. @da
scope note: Betegnelsen omfatter et år; år og måned; måned, dag og år. @da
inverse of: is last chronological designation of sequence of
label: heeft laatste chronologische aanduiding van reeks @nl
label: له تسمية زمنية أخيرة لتسلسل @ar
definition: يربط بين مصدر وتسمية في شكل بيانات مُقدمة في عدد أخير أو جزء أخير من تسلسل صدر في ترقيم متسلسل. @ar
scope note: تشمل التسمية: سنة؛ سنة وشهر؛ شهر، يوم، وسنة. @ar
label: numerointijakson viimeinen aikamäärite aineistolle @fi
definition: Liittää aineiston päivämäärästä tai muusta ajanjaksosta muodostuvaan määritteeseen, joka ilmaisee aineiston osien tai iteraatioiden numerointijaksonviimeisen määritteen. @fi
scope note: Määrite sisältää vuoden; vuoden ja kuukauden; kuukauden, päivän ja vuoden. @fi
label: hat chronologische Bezeichnung der letzten Ausgabe einer fortlaufenden Ressource @de
definition: Setzt eine Ressource in Beziehung zu einer Bezeichnung in Form eines Datums, das innerhalb einer Zählfolge auf der letzten Ausgabe einer fortlaufenden Ressource erscheint. @de
scope note: Darunter fällt ein Jahr; ein Monat und ein Jahr; ein Tag, ein Monat und ein Jahr. @de
label: 有序列的最后一个年代标识 @zh-hans
definition: 将一种资源与作为以日期或其他时间段形式用于标识一种资源的部分或更新后整体的编号序列中最后一个的标识的一个命名关联起来。 @zh-hans
scope note: 标识包括年，年和月，年、月和日。 @zh-hans
definition: Relaciona un recurs amb un nomen que és una designació en la forma d’una data o un altre interval de temps que s’usa per indicar la darrera en una seqüència de numeració de les parts o iteracions d’un recurs. @ca
label: sorrendiségének kronológiai zárójelölése a következő: @hu
definition: Hozzákapcsol egy forrást egy megjelöléshez, amely egy sorozat számozási sorrendjében, dátumformátumban jelzi az utolsó részt vagy számot. @hu
scope note: Jelölés lehet év; év és hónap; hónap, nap és év. @hu
label: sıranın son kronolojik tanımlanması ile ilişkilidir @tr
definition: Bir kaynağı, bir numaralandırma dizisinde yayınlanan bir serinin son baskısında veya bir kısmında sunulan tarih formundaki bir tanımla ilişkilendirir. @tr
scope note: Tanımlama, yıl; yıl ve ay; ay, gün ve yılı içerir. @tr

has later title proper (Deprecated)
status: Deprecated
definition: Relates a resource to a title proper appearing on a later issue or part of a multipart monograph or serial that differs from that on the first or earliest issue or part. (Deprecated)
type: Property
sub property of: has title
lexical alias: laterTitleProper.en
label: har senere hovedtitel @da
definition: Relaterer en ressource til en hovedtitel, der optræder på et senere nummer eller en senere del af et flerbindsværk eller et periodikum, og som afviger fra den titel, der fremgår af første eller tidligste nummer eller del.. @da

has latitude
status: Published
type: Property
lexical alias: latitude.en
definition: Relates a resource to the distance of a place on a planet or satellite that is measured north and south from the equator.
label: har breddegrad @da
definition: Relaterer en ressource til en afstand fra et punkt på en planet eller satellit målt nord og syd fra ækvator. @da
label: heeft breedtegraad @nl
label: له خط عرض @ar
definition: يربط بين مصدر ومسافة نقطة على كوكب أو قمر إصطناعي تم قياسها شمالًا وجنوبا من خط الاستواء. @ar
label: leveysaste aineistossa @fi
definition: Liittää aineiston planeetan tai satelliitin pisteen etäisyyteen, joka on mitattu pohjoiseen ja etelään päiväntasaajalta. @fi
label: hat Breitengrad @de
definition: Setzt eine Ressource in Beziehung zu einer Entfernung eines Punkts auf einem Planeten oder Satelliten, der nördlich oder südlich vom Äquator gemessen wird. @de
label: 有纬度 @zh-hans
definition: 将一种资源与从行星或卫星的赤道向北和向南到行星或卫星上一个地点所测量的距离关联起来。 @zh-hans
definition: Relaciona un recurs amb la distància d’un lloc sobre un planeta o un satèl·lit que es mesura al nord i al sud de l’equador. @ca
label: szélessége a következő: @hu
definition: Hozzákapcsol egy forrást egy bolygó vagy hold egy pontjának az egyenlítőtől északra vagy délre mért távolságához. @hu
label: enlem ile ilişkilidir @tr
definition: Bir kaynağı, ekvatordan kuzey ve güneyde ölçülen bir gezegen veya uydu üzerindeki bir noktanın uzaklığıyla ilişkilendirir. @tr

has layout
status: Published
definition: Relates a resource to an arrangement of text, images, tactile notation, or other content in a resource.
type: Property
lexical alias: layout.en
label: har layout @da
definition: Relaterer en ressource til opstilling af tekst, billeder, taktil notation etc. i en ressource. @da
label: heeft opmaak @nl
label: له تصميم طباعي @ar
definition: يربط بين مصدر وترتيب نص، صور، كتابة بارزة، أو أي محتوى آخر في مصدر ما. @ar
label: aineiston layout @fi
definition: Liittää aineiston aineistoon sisältyvien tekstin, kuvien, taktiilin nuottikirjoituksen tai muun aineiston sisällön sommitteluun. @fi
label: hat Layout @de
definition: Setzt eine Ressource in Beziehung zu einer Anordnung von Text, Bildern, taktiler Notation und so weiter in einer Ressource. @de
label: 有版式 @zh-hans
definition: 将一种资源与资源中对文本、图像、触摸标记或其他内容的安排关联起来。 @zh-hans
label: tördelése a következő: @hu
definition: Hozzákapcsol egy forrást szöveg, képek, tapintható lejegyzés vagy egyéb tartalom elrendezéséhez egy forrásban. @hu
label: düzen ile ilişkilidir @tr
definition: Bir kaynağı, bir kaynaktaki metin, görüntü, dokunsal notasyon veya diğer içeriğin düzenlemesiyle ilişkilendirir. @tr

has letterer
status: Published
type: Property
lexical alias: letterer.en
definition: Relates a resource to an agent who contributes to a comic book, graphic novel, etc., by drawing the text and graphic sound effects.
inverse of: is letterer of
sub property of: has contributor agent of still image
label: har bogstavtegner @da
definition: Relaterer en ressource til en illustrator, der har bidraget til et udtryk af en tegneserie, en graphic novel etc. ved at tegne teksten og de grafiske lydeffekter. @da
label: heeft letteraar @nl
label: له رسّام حروف @ar
definition: يربط بين مصدر ورسّام توضيحي يُساهم في كتاب مصور، رواية مصورة، إلخ.، من خلال رسم النص وتصميم المؤثرات الصوتية المصاحبة. @ar
label: aineiston tekstaaja @fi
definition: Liittää aineiston toimijaan, joka on osallisena sarjakuvan, sarjakuvaromaanin tms. tekemisessä piirtämällä tekstin ja graafiset äänitehosteet. @fi
label: ist Letterer @de
definition: Setzt eine Ressource in Beziehung zu einer Illustratorin/einem Illustrator, die/der zu einem Comicbuch, einer Graphic Novel und so weiter beiträgt, indem sie/er den Text und die grafischen Toneffekte zeichnet. @de
label: 有字母图案画者 @zh-hans
definition: 将一种资源与通过绘制文字和图案声音效果的为漫画书、图解小说等作出贡献的一个行为者关联起来。 @zh-hans
definition: Relaciona un recurs amb un agent que contribueix a un còmic, una novel·la gràfica, etc., dibuixant el text i els efectes sonors gràfics. @ca
label: betűrajzolója a következő: @hu
definition: Hozzákapcsol egy forrást egy illusztrátorhoz, aki hozzájárul egy képregényhez, képregényalbumhoz, stb., azzal, hogy megrajzolja a szöveget és a grafikus hangeffektusokat. @hu
label: yazı tasarımcısı ile ilişkilidir @tr
definition: Bir kaynağı, metin ve grafik ses efektleri çizerek bir çizgi romana vb. katkıda bulunan bir illüstratörle ilişkilendirir. @tr

is letterer of
status: Published
type: Property
lexical alias: lettererOf.en
definition: Relates an agent to a resource that includes a contribution by an agent of drawing text and graphic sound effects for a comic book, graphic novel, etc.
inverse of: has letterer
sub property of: is contributor agent of still image of
label: er bogstavtegner til @da
definition: Relaterer en illustrator, der har bidraget til en tegneserie, en graphic novel etc. til en ressource. @da
label: is letteraar van @nl
label: هو رسّام حروف لـ @ar
definition: يربط بين وكيل ومصدر يتضمن إسهام وكيل في رسم نص وتصميم المؤثرات الصوتية المصاحبة لرسومات كتاب مصور، أو رواية مصورة، إلخ. @ar
label: tekstaaja (toimija) aineistossa @fi
definition: Liitttää toimijan aineistoon, jossa toimija on osallisena sarjakuvan, sarjakuvaromaanin tms. tekemisessä piirtämällä tekstin ja graafiset äänitehosteet. @fi
label: ist Letterer von @de
definition: Setzt einen Akteur in Beziehung zu einer Ressource, zu der ein Akteur beiträgt, indem er für ein Comicbuch, eine Graphic Novel und so weiter Text und grafische Toneffekte zeichnet. @de
label: 是……的字母图案画者 @zh-hans
definition: 将一个行为者与包括一个为漫画书、图解小说等绘制文字和图案声音效果的一个行为者的贡献的一种资源关联起来。 @zh-hans
label: betűrajzolója a következőnek: @hu
definition: Hozzákapcsol egy forrást egy ágenshez, amely magában foglalja az ágens közreműködését képregény, képregényalbum stb. szövegének és grafikai hangeffektusainak rajzolásában. @hu
label: yazı tasarımcısıdır @tr
definition: Bir temsilciyi, grafik roman, çizgi roman vb. için metin ve grafik ses efektleri çizen bir temsilcinin katkısını içeren bir kaynakla ilişkilendirir. @tr

has librettist
status: Published
definition: Relates a resource to an agent who is an author of the words of a musical or choreographic resource such as an opera, a ballet, or other resource for the musical stage, or an oratorio.
type: Property
sub property of: has author
inverse of: is librettist of
lexical alias: librettist.en
scope note: Authoring of the words of just the songs from a musical is excluded.
see also: has lyricist
label: har librettist @da
definition: Relaterer en ressource til en forfatter af teksten til en opera eller en anden ressource af et musikalsk sceneværk, eller et oratorium. @da
scope note: Omfatter ikke forfatteren til sangteksterne i en musical. @da
label: heeft librettist @nl
label: libretisti aineistossa @fi
label: له واضع كلمات الأوبرا @ar
definition: يربط مصدر بوكيل هو مؤلف لكلمات مصدر موسيقي أو راقص مثل أوبرا، باليه، أو أي مصدر آخر للمسرح الموسيقي، أو موسيقى دينية. @ar
scope note: يُستبعد تأليف كلمات الأغاني فقط من مسرحية موسيقية. @ar
definition: Liittää aineiston toimijaan, joka on musiikki- tai koreografisen teoksen, kuten oopperan, baletin tai muun musiikillisen näyttämöteoksen tai oratorion sanojen kirjoittaja. @fi
scope note: Ei kata pelkän musikaalin laulunsanojen kirjoittajaa. @fi
label: hat Librettistin/Librettist @de
definition: Setzt eine Ressource in Beziehung zu einer Verfasserin/einem Verfasser des Texts für eine Musikressource oder choreografische Ressource, wie zum Beispiel einer Oper, einem Ballett oder einer anderen Musikressource für die Bühne, oder für ein Oratorium. @de
scope note: Nur das Verfassen der Liedtexte eines Musicals fällt nicht darunter. @de
label: 有台本作者 @zh-hans
definition: 将一种资源与作为歌剧、芭蕾等音乐或编舞资源或其他舞台音乐资源或者清唱剧的歌词的著者的一个行为者关联起来。 @zh-hans
scope note: 不包括音乐剧中只是歌曲的词著者。 @zh-hans
label: librettistája a következő: @hu
definition: Hozzákapcsol egy forrást egy szerző ágenshez, aki olyan zenei vagy koreografikus forrás szövegét szerzi, mint egy opera, balett, oratórium, vagy más zenés színpadi forrás. @hu
scope note: A musical dalainak szövegírója nem tartozik ide. @hu
label: libretto yazarı ile ilişkilidir @tr
definition: Bir kaynağı, opera, bale veya müzikal sahnesi için başka bir kaynak veya oratoryo gibi müzikal veya koreografik bir kaynağın sözlerinin yazarı olan bir temsilci ile ilişkilendirir @tr
scope note: Bir müzikalde sadece şarkıların sözlerinin yazılması hariçtir. @tr

is librettist of
status: Published
definition: Relates an agent to a resource that involves a responsibility of an agent for authoring the words of an opera or other musical stage resource, or an oratorio.
type: Property
sub property of: is author of
inverse of: has librettist
lexical alias: librettistOf.en
see also: is lyricist of
label: er librettist til @da
definition: Relaterer en forfatter af ordene til en opera eller anden musikalsk sceneressource, eller et oratorium til en ressource. @da
label: is librettist van @nl
label: هو واضع كلمات الأوبرا لـ @ar
definition: يربط بين وكيل ومصدر ينطوي على مسؤولية وكيل عن تأليف كلمات أوبرالية أو مصدر مسرحي موسيقي آخر، أو موسيقى دينية. @ar
label: libretisti (toimija) aineistossa @fi
label: ist Librettistin/Librettist von @de
definition: Setzt einen Akteur in Beziehung zu einer Ressource, bei der ein Akteur für das Verfassen des Texts einer Oper, einer sonstigen Bühnenressource oder eines Oratoriums verantwortlich ist. @de
definition: Liittää toimijan aineistoon, jossa toimija vastaa oopperan tai muun musiikillisen näyttämöteoksen tai oratorion sanojen kirjoittamisesta. @fi
label: 是……的台本作者 @zh-hans
definition: 将一个行为者与涉及歌剧或其他舞台音乐作品或者清唱剧的歌词的写作的一个行为者的责任的一种资源关联起来。 @zh-hans
label: librettistája a következőnek: @hu
definition: Hozzákapcsol egy ágenst egy forráshoz, amelyhez hozzátartozik egy ágens felelőssége egy opera vagy más zenés színpadi forrás vagy egy oratórium szövegének szerzősége. @hu
label: libretto yazarıdır @tr
definition: Bir temsilciyi, bir operanın veya başka bir müzikal sahne kaynağının veya bir oratoryonun sözlerini yazmakla görevli bir temsilcinin sorumluluğunu içeren bir kaynakla ilişkilendirir. @tr

has libretto
status: Published
definition: Relates a resource to a resource that is a textual resource that complements a resource that is a musical or choreographic resource such as an opera, a ballet, or other resource for the musical stage, or an oratorio.
type: Property
sub property of: is complemented by
inverse of: is libretto for
lexical alias: libretto.en
label: er libretto @da
definition: Relaterer en ressource til en ressource, der indeholder teksten til en opera eller en ressource til et andet musikalsk sceneværk, eller til et oratorium. @da
label: heeft libretto @nl
label: libretto (aineisto) @fi
label: له نص أوبرالي @ar
definition: يربط بين مصدر ومصدر يتحقق كنص يكمل مصدر أوبرالي أو مصدر آخر للمسرح الموسيقي أو لموسيقى دينية. @ar
definition: Liittää aineiston tekstiaineistona toteutettuun aineistoon, jota täydentää musiikkiaineisto, koreografinen aineisto, baletti tai muu lavaesitysaineisto tai oratorio. @fi
label: hat Libretto @de
definition: Setzt eine Ressource in Beziehung zu einer textlichen Ressource, die eine Oper oder eine andere Ressource für die Bühne, oder ein Oratorium ergänzt. @de
label: 有台本 @zh-hans
definition: 将一种资源与补充诸如歌剧、芭蕾或其他舞台音乐作品或清唱剧之类的作为一种音乐或编舞资源的一种资源的作为一种文字资源的一种资源关联起来。 @zh-hans
definition: Relaciona un recurs amb un recurs que és un recurs textual que complementa un recurs que és una obra musical o coreogràfica com ara una òpera, un ballet o qualsevol altre recurs escènic musical o d’un oratori. @ca
label: librettója a következő: @hu
definition: Hozzákapcsol egy forrást egy forráshoz, amely szövegként valósul meg és kiegészít egy forrást, ami egy opera, vagy egyéb zenés színpadi forrás, vagy egy oratórium. @hu
label: libretto ile ilişkilidir @tr
definition: Bir kaynağı, bir opera veya müzik sahnesi için başka bir kaynak olan ya da bir oratoryo olan kaynağı tamamlayan ve metin olarak gerçekleştirilen bir kaynakla ilişkilendirir. @tr

is libretto based on
status: Published
definition: Relates a resource to a resource that provides text for a musical or choreographic resource such as an opera, a ballet, or other resource for the musical stage, or an oratorio.
type: Property
sub property of: has source
inverse of: is adapted as libretto
lexical alias: librettoBasedOn.en
label: er libretto baseret på @da
definition: Relaterer en ressouce til en ressource, der er blevet bearbejdet til tekst til en opera eller en anden ressource af et musikalsk sceneværk, eller til et oratorium. @da
label: is libretto gebaseerd op @nl
label: librettoaineisto @fi
label: هو نص أوبرالي معتمد على @ar
definition: يربط بين مصدر ومصدر موسيقي، أو راقص مثل أوبرا، أو باليه، أو أي مصدر آخر للمسرح الموسيقي، أو موسيقى دينية. @ar
definition: Liittää aineiston musiikkiaineistoon tai koreografiseen aineistoon, kuten oopperaan, balettiin tai muuhun musiikilliseen näyttämöteokseen tai oratorioon. @fi
label: ist Libretto basierend auf @de
definition: Setzt eine Ressource in Beziehung zu einer Ressource, die Text für eine Musikressource oder choreografischen Ressource, wie zum Beispiel einer Oper, einem Ballett oder einer anderen Musikressource für die Bühne, oder zu einem Oratorium enthält. @de
label: 是基于……的台本 @zh-hans
definition: 将一种资源与为诸如歌剧、芭蕾、或其他舞台音乐资源或清唱剧提供文本的一种资源关联起来。 @zh-hans
definition: Relaciona un recurs amb un recurs que proporciona text per a un recurs musical o coreogràfic com ara una òpera, un ballet o qualsevol altre recurs escènic musical o un oratori. @ca
label: librettó a következő alapján: @hu
definition: Hozzákapcsol egy forrást egy olyan zenei vagy koreografikus forráshoz, mint egy opera, vagy egyéb zenés színpadi forrás, vagy egy oratórium. @hu
label: dayalı librettodur @tr
definition: Bir kaynağı, opera, bale, müzikal sahne için başka bir kaynak veya oratoryo gibi müzikal veya koreografik bir kaynak için metin sağlayan bir kaynakla ilişkilendirir. @tr

is libretto for
status: Published
definition: Relates a resource to a resource that is a musical or choreographic resource such as an opera, a ballet, or other resource for the musical stage, or an oratorio, that is complemented by a textual resource.
type: Property
sub property of: is complemented by
inverse of: has libretto
lexical alias: librettoFor.en
label: er libretto til @da
definition: Relaterer en ressource til en musikressource, såsom en opera eller et andet musikalsk sceneværk, eller et oratorium, der anvender den relaterede ressources tekst. @da
label: is libretto voor @nl
label: نص أوبرالي لـ @ar
definition: يربط بين مصدر ومصدر موسيقي أو راقص مثل الأوبرا، الباليه، أو مصدر آخر للمسرح الموسيقي، أو موسيقى دينية يكملها مصدر نصي. @ar
label: librettoaineisto @fi
definition: Liittää aineiston tekstiaineistolla täydennettyyn musiikkiin tai koreografiaan, kuten oopperaan, balettiin tai muuhun näyttämöteokseen tai oratorioon. @fi
label: ist Libretto für @de
definition: Setzt eine Ressource in Beziehung zu einer Musikressource oder einer choreographischen Ressource, wie zum Beispiel einer Oper, einem Ballett oder einer anderen Musikressource für die Bühne oder einem Oratorium, die/das durch eine textliche Ressource vervollständigt wird. @de
label: 是……的台本 @zh-hans
definition: 将一种资源与被一种文字资源补充的诸如歌剧、芭蕾或其他舞台音乐作品或清唱剧之类的作为一种音乐或编舞资源的一种资源关联起来。 @zh-hans
label: librettó a következőhöz: @hu
definition: Hozzákapcsol egy forrást egy olyan zenei vagy koreografikus forráshoz, mint egy opera, ballett, vagy egyéb zenés színpadi forrás, vagy egy oratórium, amelyet egy szöveges forrás egészít ki. @hu
label: librettosudur @tr
definition: Bir kaynağı, metinsel kaynakla tamamlanan, opera, bale ya da başka bir kaynak için müzikal sahne veya oratoryo gibi müzikal veya koreografik bir kaynak olan kaynak ile ilişkilendirir. @tr

has lighting designer
status: Published
type: Property
lexical alias: lightingDesigner.en
definition: Relates a resource to an agent who contributes to a resource by designing and creating lighting components.
inverse of: is lighting designer of
sub property of: has contributor (Deprecated)
label: har belysningsdesigner @da
definition: Relaterer en ressource til en agent, der har bidraget til en ressource ved at designe og skabe belysningsdele. @da
label: heeft lichtontwerper @nl
label: له مصمم إضاءة @ar
definition: يربط مصدر بوكيل يُساهم في مصدر من خلال تصميم عناصرالإضاءة وإنشائها. @ar
label: aineiston valosuunnittelija @fi
definition: Liittää aineiston toimijaan, joka on aineistossa osallisena suunnittelemalla ja luomalla valokomponentteja. @fi
label: hat Lichtgestalterin/Lichtgestalter @de
definition: Setzt eine Ressource in Beziehung zu einem Akteur, der zu einer Ressource beiträgt, indem er Lichtelemente entwirft und erstellt. @de
label: 有灯光设计者 @zh-hans
definition: 将一种资源与通过设计和创建灯光组成部分而对资源有贡献的一个行为者关联起来。 @zh-hans
label: világítástervezője a következő: @hu
definition: Hozzákapcsol egy forrást egy ágenshez, amely hozzájárul egy forráshoz azzal, hogy megtervezi és megalkotja a világítás összetevőit. @hu
label: ışık tasarımcısı ile ilişkilidir @tr
definition: Bir kaynağı, aydınlatma bileşenlerinin tasarlanarak ve oluşturarak bir kaynağa katkıda bulunan bir temsilci ile ilişkilendirir. @tr

is lighting designer of
status: Published
type: Property
lexical alias: lightingDesignerOf.en
definition: Relates an agent to a resource that includes a contribution by an agent of designing and creating lighting components.
inverse of: has lighting designer
sub property of: is contributor of (Deprecated)
label: er belysningsdesigner for @da
definition: Relaterer en agent, der har bidraget til en ressource ved at designe og skabe belysningsdele til en ressource. @da
label: is lichtontwerper van @nl
label: هو مصمم إضاءة لـ @ar
definition: يربط بين وكيل ومصدر ينطوي على مسؤولية وكيل عن تصميم عناصرالإضاءة وإنشائها. @ar
label: valosuunnittelija (toimija) aineistossa @fi
definition: Liittää toimijan aineistoon, jossa toimija on osallisena suunnittelemalla ja luomalla valokomponentteja. @fi
label: ist Lichtgestalterin/Lichtgestalter von @de
definition: Setzt einen Akteur in Beziehung zu einer Ressource, zu der ein Akteur beiträgt, indem er Lichtelemente entwirft und erstellt. @de
label: 是……的灯光设计者 @zh-hans
definition: 将一个行为者与包括设计并创作灯光组成部分的一个行为者的贡献的一种资源关联起来。 @zh-hans
label: világítástervezője a következőnek: @hu
definition: Hozzákapcsol egy ágenst egy forráshoz, amely magában foglalja az ágens közreműködését világítási összetevők tervezésében és létrehozásában. @hu
label: ışık tasarımcısıdır @tr
definition: Bir temsilciyi, aydınlatma bileşenlerini tasarlayan ve oluşturan bir temsilcinin katkısını içeren bir kaynakla ilişkilendirir. @tr

has lithographer
status: Published
definition: Relates a resource to an agent who is responsible for creating a resource by preparing a stone or plate for lithographic printing.
type: Property
inverse of: is lithographer of
lexical alias: lithographer.en
scope note: A lithographer includes a graphic artist creating a design directly on the surface from which printing will be done.
label: har litograf @da
definition: Relaterer en ressource til en agent, der har været involveret i fremstillingen af en ressource ved at forberede en sten eller plade til litografisk trykning. @da
scope note: En litograf omfatter en grafiker, der har skabt et design direkte på overfladen, hvorfra trykning vil blive lavet. @da
label: heeft lithograaf @nl
label: aineiston litografi @fi
sub property of: has printmaker
label: له طبّاع على الحجر @ar
definition: يربط مصدر بوكيل مسؤول عن إنتاج مصدر من خلال تجهيز حجر أو لوح للطباعة الحجرية. @ar
scope note: يتضمن مصطلح طبّاع على الحجر كذلك إلى فنان الجرافيك الذي ينشيء تصميما مباشرة على السطح الذي ستتم الطباعة منه. @ar
definition: Liittää aineiston toimijaan, joka on vastuussa aineiston valmistamisesta valmistamalla litografiassa käytetyn kivilaatan tai muun painolaatan. @fi
scope note: Litografi tarkoittaa myös graafikkoa, joka tekee piirroksen suoraan painamiseen käytettävälle pinnalle. @fi
label: hat Lithografin/Lithograf @de
definition: Setzt eine Ressource in Beziehung zu einem Akteur, der für die Herstellung einer Ressource verantwortlich ist, indem er einen Stein oder eine Platte für lithografischen Druck vorbereitet. @de
scope note: Darunter fallen Grafikerinnen/Grafiker, die ein Muster direkt auf der Oberfläche erstellen, von der aus gedruckt werden soll. @de
label: 有平版制作者 @zh-hans
definition: 将一种资源与通过制作用于平版印刷的石头或平版而对一种资源的创建负责的一个行为者关联起来。 @zh-hans
scope note: 平版制作者包括直接在用于印刷的表面进行设计创作的平面美术家 @zh-hans
definition: Relaciona un recurs amb un agent que és responsable de la creació d’un recurs amb la preparació d’una pedra o una planxa per a la impressió litogràfica. @ca
label: kőnyomatkészítője a következő: @hu
definition: Hozzákapcsol egy forrást egy ágenshez, amely felelős egy forrás gyártásáért oly módon, hogy egy követ vagy lemezt készít elő litográfiai nyomtatáshoz, azaz kőnyomathoz. @hu
scope note: A litográfus egy grafikusművész, aki közvetlenül azon a felületen készít tervet, amelyről a nyomtatás történik. @hu
label: taş baskı sanatçısı ile ilişkilidir @tr
definition: Bir kaynağı, taş baskı için bir taş veya plaka hazırlayarak bir kaynak oluşturmaktan sorumlu olan bir temsilci ile ilişkilendirir. @tr
scope note: Bir taş baskı sanatçısı, baskının yapılacağı yüzey üzerinde doğrudan bir tasarım yaratan bir grafik sanatçısı içerir. @tr

is lithographer of
status: Published
definition: Relates an agent to a resource that involves a responsibility of an agent for preparing a stone or plate for lithographic printing.
type: Property
inverse of: has lithographer
lexical alias: lithographerOf.en
scope note: A lithographer includes a graphic artist creating a design directly on the surface from which printing will be done.
label: er litograf af @da
definition: Relaterer en agent, der har været involveret i fremstillingen af en ressource ved at forberede en sten eller plade til litografisk trykning til en ressource. @da
scope note: En litograf inkluderer en grafisk artist der har skabt et design direkte på overfladen, hvorfra trykning vil blive lavet. @da
label: is lithograaf van @nl
sub property of: is printmaker of
label: هو طبّاع على الحجر لـ @ar
definition: يربط بين وكيل ومصدر ينطوي على مسؤولية وكيل عن تجهيز حجر أو لوح للطباعة الحجرية. @ar
scope note: يتضمن مصطلح طبّاع على الحجر كذلك فنان الجرافيك الذي ينشيء تصميمًا مباشرًا على السطح الذي ستتم الطباعة منه. @ar
label: litografi (toimija) aineistossa @fi
definition: Liittää toimijan aineistoon, jossa toimija vastaa aineiston valmistamisesta valmistamalla litografiassa käytetyn kivilaatan tai muun painolaatan. @fi
scope note: Litografi tarkoittaa myös graafikkoa, joka tekee piirroksen suoraan painamiseen käytettävälle pinnalle. @fi
label: ist Lithografin/Lithograf von @de
definition: Setzt einen Akteur in Beziehung zu einer Ressource, bei der ein Akteur für die Vorbereitung eines Steins oder einer Platte für lithografischen Druck verantwortlich ist. @de
scope note: Darunter fallen Grafikerinnen/Grafiker, die ein Muster direkt auf der Oberfläche erstellen, von der aus gedruckt werden soll. @de
label: 是……的平版制作者 @zh-hans
definition: 将一个行为者与涉及制作用于平版印刷的石头或平版的一个行为者的责任的一种资源关联起来。 @zh-hans
scope note: 平版制作者包括直接在用于印刷的表面进行设计创作的平面美术家 @zh-hans
label: kőnyomatkészítője a következőnek: @hu
definition: Hozzákapcsol egy ágenst egy forráshoz, amelyhez hozzátartozik az ágens felelőssége egy kő vagy lemez litográfiai nyomtatáshoz történő előkészítéséért. @hu
scope note: A litográfus egy grafikusművész, aki közvetlenül azon a felületen készít tervet, amelyről a nyomtatás történik. @hu
label: taş baskı sanatçısıdır @tr
definition: Bir temsilciyi, litografik baskı için bir taş veya plaka hazırlamakla görevli bir temsilcinin sorumluluğunu içeren bir kaynakla ilişkilendirir. @tr
scope note: Bir taş baskı sanatçısı, baskının yapılacağı yüzey üzerinde doğrudan bir tasarım yaratan bir grafik sanatçısını içerir. @tr

has local affiliate
status: Published
type: Property
lexical alias: localAffiliate.en
definition: Relates an agent to an agent that is local who is affiliated with a broader body which acts for it and others at a broader organizational level.
label: har lokal filial @da
definition: Relaterer en lokal agent der er tilknyttet et bredere organ som agerer for den og andre på et bredere organisatorisk niveau til en agent. @da
label: heeft lokaal aangeslotene @nl
label: له تابع محلي @ar
definition: يربط بين وكيل ووكيل محلي تابع لوكيل أوسع يعمل لصالحه ولصالح آخرين على مستوى تنظيمي أوسع. @ar
label: paikallinen tytäryhtiö @fi
definition: Liittää yhteistoimijan paikalliseen yhteistoimijaan, jolla on yhteys emoyhtiön edustamaan laajempaan organisaatioon. @fi
label: hat lokalen Partner @de
definition: Setzt einen Akteur in Beziehung zu einem lokalen Akteur, der mit einem Dachverband verbunden ist, der für ihn und andere auf einer größeren organisatorischen Ebene handelt. @de
label: 有本地隶属 @zh-hans
definition: 将一个行为者与作为本地的并隶属于一个更广泛的团体、为其并为一个更广泛的组织层次其他团体行为的一个行为者关联起来。 @zh-hans
definition: Relaciona un agent amb un agent local que està afiliat amb una entitat més àmplia que actua per a aquella i per a altres entitats en un nivell organitzatiu més ampli. @ca
label: helyi leányvállalata a következő: @hu
definition: Hozzákapcsol egy helyi ágenst, amely része egy tágabb értelmű ágensnek amely annak és másoknak az érdekében cselekszik szélesebb szervezeti szinten, egy ágenshez. @hu
label: yerel bağlı kuruluş ile ilişkilidir @tr
definition: Kendisi adına hareket eden daha geniş bir aracıya bağlı yerel bir aracıyı ve daha geniş bir organizasyonel seviyedeki diğerlerini bir aracıyla ilişkilendirir. @tr

has location of headquarters (Deprecated)
status: Deprecated
type: Property
sub property of: has place associated with agent (Deprecated)
lexical alias: locationOfHeadquarters.en
definition: Relates a resource to a country, state, province, etc., or local place in which an organization has its headquarters. (Deprecated)

has longitude
status: Published
type: Property
lexical alias: longitude.en
definition: Relates a resource to the distance of a place on a planet or satellite that is measured east and west from a reference meridian.
label: har længdegrad @da
definition: Relaterer en ressource til en afstand fra et punkt på en planet eller satellit målt øst og vest fra referencemeridianen. @da
label: heeft lengtegraad @nl
label: له خط طول @ar
definition: يربط بين مصدر ومسافة نقطة على كوكب أو قمر إصطناعي تم قياسها شرقًا وغربًا من خط الزوال المرجعي. @ar
label: pituusaste aineistossa @fi
definition: Liittää aineiston planeetan tai satelliitin pisteen etäisyyteen, joka on mitattu itään ja länteen vertailumeridiaanista. @fi
label: hat Längengrad @de
definition: Setzt eine Ressource in Beziehung zu einer Entfernung eines Punkts auf einem Planeten oder Satelliten, der östlich und westlich von einem Bezugsmeridian gemessen wird. @de
label: 有经度 @zh-hans
definition: 将一种资源与从行星或卫星的基准子午线向东和向西到行星或卫星上一个地点所测量的距离关联起来。 @zh-hans
definition: Relaciona un recurs amb la distància d’un lloc sobre un planeta o un satèl·lit que es mesura a l’est i a l’oest d’un meridià de referència. @ca
label: hosszúsága a következő: @hu
definition: Hozzákapcsol egy forrást egy bolygó vagy hold egy pontjának a referencia-délkörtől (meridiántól) keletre és nyugatra mért távolságához. @hu
label: boylam ile ilişkilidir @tr
definition: Bir kaynağı, bir referans meridyenden doğu ve batı olarak ölçülen bir gezegen veya uydu üzerindeki bir noktanın uzaklığıyla ilişkilendirir. @tr

has longitude and latitude
status: Published
definition: Relates a resource to a place that is the area of coverage of a cartographic resource that is identified using the longitude of the westernmost and easternmost boundaries and the latitude of the northernmost and southernmost boundaries.
type: Property
sub property of: has coordinates of cartographic content
lexical alias: longitudeAndLatitude.en
label: har længdegrad og breddegrad @da
definition: Relaterer en ressource til et system til identificering af det område, der dækkes af en ressources kartografiske indhold; anvender længdegrader for de vestligste og østligste grænser samt breddegrader for de nordligste og sydligste grænser. @da
inverse of: is longitude and latitude of
label: heeft lengtegraad en breedtegraad @nl
label: pituus- ja leveysasteet aineistossa @fi
label: له خط طول وخط عرض @ar
definition: يربط بين مصدر ومكان يحدد المنطقة التي يغطيها المحتوى الخرائطي لمصدر باستخدام خط الطول لأقصى الحدود الغربية والشرقية وخط العرض لأقصى الحدود الشمالية والجنوبية. @ar
definition: Liittää aineiston paikkaan, joka määrittää aineiston kartografisen sisällön kattaman alueen indentifioidaan käyttämällä läntisimmän ja itäisimmän rajan pituusastetta sekä pohjoisimman ja eteläisimmän rajan leveysastetta. @fi
label: ist Längengrad und Breitengrad von @de
definition: Setzt eine Ressource in Beziehung zu einem Gebiet, das den Abdeckungsbereich des kartografischen Inhalts einer Ressource anhand des Längengrads der westlichsten und östlichsten Grenze sowie des Breitengrads der nördlichsten und südlichsten Grenze identifiziert. @de
label: 有经度和纬度 @zh-hans
definition: 将一种资源与作为一种地图资源的覆盖范围、用最西和最东边界的经度以及最北和最南边界的纬度标识的一个地点关联起来。 @zh-hans
definition: Relaciona un recurs amb un lloc que és l’àrea d'abast d’un recurs cartogràfic que s’identifica usant la longitud dels límits occidental i oriental i la latitud dels límits septentrional i meridional. @ca
label: hosszúsági és szélességi foka a következő: @hu
definition: Hozzákapcsol egy forrást egy helyhez, amely azonosít egy forrás kartográfiai tartalma által lefedett területet a legnyugatibb és legkeletibb határok hosszúságának és a legészakibb és legdélibb határok szélességének a használatával. @hu
label: enlem ve boylam ile ilişkilidir @tr
definition: Bir kaynağı, en batı ve en doğu sınırlarının boylamını ve en kuzey ve en güney sınırlarının enlemini kullanarak bir kaynağın kartografik içeriğinin kapsadığı alanı tanımlayan bir yerle ilişkilendirir. @tr

has lyricist
status: Published
definition: Relates a resource to an agent who is an author of the words of a popular song, including a song from a musical.
type: Property
sub property of: has author
inverse of: is lyricist of
lexical alias: lyricist.en
scope note: Authoring of just dialogue from a musical is excluded
see also: has librettist
label: har forfatter til sangtekst @da
definition: Relaterer en ressource til en forfatter til sangteksten til en populær sang, inkl. en eller flere sange fra en musical. @da
scope note: Omfatter ikke forfatteren til dialogen i en musical. @da
label: heeft liedtekstschrijver @nl
label: aineiston sanoittaja @fi
label: كاتب أغاني @ar
definition: يربط مصدر بوكيل هو مؤلف لكلمات أغنية شعبية، بما في ذلك أغنية من مسرحية موسيقية. @ar
scope note: يُستبعد تأليف الحوار فقط من مسرحية موسيقية. @ar
definition: Liittää aineiston toimijaan, joka on populaarimusiikkiin kuuluvan laulun (mukaan lukien musikaalin laulun) sanojen kirjoittaja. @fi
scope note: Ei kata pelkän musikaalin dialogin kirjoittajaa. @fi
label: hat Textdichterin/Textdichter @de
definition: Setzt eine Ressource in Beziehung zu einer Verfasserin/einem Verfasser des Texts eines populären Lieds, einschließlich eines Lieds aus einem Musical. @de
scope note: Nur das Verfassen des Dialogs eines Musicals fällt nicht darunter. @de
label: 有作词者 @zh-hans
definition: 将一种资源与作为一首流行歌曲（包括音乐剧中的歌曲）歌词的著者的一个行为者关联起来。 @zh-hans
scope note: 不包括音乐剧中只是对话的著者。 @zh-hans
label: dalszövegírója a következő: @hu
definition: Hozzákapcsol egy forrást egy ágenshez, aki egy könnyűzenei dal szövegének szerzője, beleértve a musicaldalokat is. @hu
scope note: Musical párbeszédeinek szerzősége nem tartozik ide. @hu
label: söz yazarı ile ilişkilidir @tr
definition: Bir kaynağı, bir müzikalin şarkısı da dahil olmak üzere popüler bir şarkının sözlerinin yazarı olan bir temsilci ile ilişkilendirir. @tr
scope note: Bir müzikalde sadece dialogların yazılması hariçtir. @tr

is lyricist of
status: Published
definition: Relates an agent to a resource that involves a responsibility of an agent for authoring the words of a popular song, including a song from a musical.
type: Property
sub property of: is author of
inverse of: has lyricist
lexical alias: lyricistOf.en
see also: is librettist of
label: er forfatter til sangtekst til @da
definition: Relaterer en forfatter af ordene til en populær sang, inkl. en sang eller flere sange fra en musical til en ressource. @da
label: is liedtekstschrijver van @nl
label: هو كاتب أغاني لـ @ar
definition: يربط بين وكيل ومصدر ينطوي على مسؤولية وكيل عن تأليف كلمات أغنية شعبية، بما في ذلك أغنية في مَسرحية موسيقِيّة. @ar
label: sanoittaja (toimija) aineistossa @fi
definition: Liittää toimijan aineistoon, jossa toimija vastaa populaarimusiikkiin kuuluvan laulun (mukaan lukien musikaalilaulun) sanojen kirjoittajamisesta. @fi
label: ist Textdichterin/Textdichter von @de
definition: Setzt einen Akteur in Beziehung zu einer Ressource, bei der ein Akteur für das Verfassen des Texts eines populären Lieds, einschließlich eines Lieds aus einem Musical, verantwortlich ist. @de
label: 是……的作词者 @zh-hans
definition: 将一个行为者与涉及流行歌曲（包括音乐剧中的歌曲）歌词的写作的一个行为者的责任的一种资源关联起来。 @zh-hans
label: dalszövegírója a következőnek: @hu
definition: Hozzákapcsol egy ágenst egy forráshoz, amelyhez hozzátartozik egy ágens felelőssége egy könyűzenei dalszöveg, musicaldalt is beleértve, szerzőségéért. @hu
label: söz yazarıdır @tr
definition: Bir temsilciyi, bir müzikalden bir şarkı da dahil olmak üzere popüler bir şarkının sözlerini yazmakla görevli bir temsilcinin sorumluluğunu içeren bir kaynakla ilişkilendirir. @tr

has lyrics
status: Published
lexical alias: lyrics.en
definition: Relates a resource to a resource that is a textual resource that complements a musical resource.
type: Property
sub property of: has text resource
inverse of: is lyrics for
label: heeft liedteksten @nl
label: له كلمات أغنية @ar
definition: يربط بين مصدر ومصدر عبارة عن مصدر نصي يكمل مصدر موسيقي. @ar
label: har sangtekster @da
definition: Relaterer en ressource til en ressource, der er en tekstressource, der er suppleret med en tekstressource. @da
label: aineiston sanoitus @fi
definition: liittää aineiston aineistoon, joka on musiikkiaineistoa täydentävä tekstiaineisto. @fi
label: hat Lyrics @de
definition: Setzt eine Ressource in Beziehung zu einer textlichen Ressource, die ein Musikwerk ergänzt. @de
label: 有歌词 @zh-hans
definition: 将一种资源与作为一种文字资源并补充一种音乐资源的一种资源关联起来。 @zh-hans
label: dalszövege a következő: @hu
definition: Hozzákapcsol egy forrást egy szöveges forráshoz, amelyet egy zenei forrás egészít ki. @hu
label: sözler ile ilişkilidir @tr
definition: Bir kaynağı, bir müzik kaynağını tamamlayan metinsel kaynak olan bir kaynakla ilişkilendirir. @tr

is lyrics for
status: Published
lexical alias: lyricsFor.en
definition: Relates a resource to a musical resource that is complemented by a textual resource.
type: Property
sub property of: is text for resource
label: is liedteksten voor @nl
label: هي كلمات أغنية لـ @ar
definition: يربط بين مصدر ومصدر موسيقي يكمله مصدر نصي. @ar
label: er sangekster for @da
definition: Relaterer en ressource til en musikressource, der er suppleret med en tekstressource. @da
label: sanoitettu aineisto @fi
definition: liittää aineiston musiikkiaineistoon, jota on täydennetty tekstiaineistolla. @fi
label: ist Lyrics für @de
definition: Setzt eine Ressource in Beziehung zu einer Musikressource, die durch eine textliche Ressource vervollständigt wird. @de
label: 是……的歌词 @zh-hans
definition: 将一种资源与被一种文字资源补充的一种音乐资源关联起来。 @zh-hans
label: dalszöveg a következőhöz: @hu
definition: Hozzákapcsol egy forrást egy zenei forráshoz, amelyet egy szöveges forrás egészít ki. @hu
label: sözleridir @tr
definition: Bir kaynağı, metinsel bir kaynakla tamamlanan bir müzik kaynağıyla ilişkilendirir. @tr

has makeup artist
status: Published
type: Property
lexical alias: makeupArtist.en
definition: Relates a resource to an agent who contributes to a resource by applying makeup and prosthetics for a moving image production or for a musical or dramatic presentation or entertainment.
inverse of: is makeup artist of
sub property of: has contributor (Deprecated)
label: har sminkør @da
definition: Relaterer en ressource til en agent, der har bidraget til en ressource ved at lægge makeup og påsætte proteser til en levende billedproduktion eller til en musikalsk eller dramatisk præsentation eller til underholdning. @da
label: heeft make-upartiest @nl
label: له فنان ماكياج @ar
definition: يربط مصدر بوكيل يُساهم في مصدر من خلال وضع مكياج أو مكياج ترقيعي لإنتاج فيلم أو في عرض موسيقي أو درامي أو ترفيهي. @ar
label: maskeeraaja aineistossa @fi
definition: Liittää aineiston toimijaan, joka vastaa elokuvan, musikaalin tai näyttämöteoksen maskeerauksesta. @fi
label: hat Maskenbildnerin/Maskenbildner @de
definition: Setzt eine Ressource in Beziehung zu einem Akteur, der zu einer Ressource beiträgt, indem er Schminke und Prothetik für eine Bewegtbildproduktion oder eine musikalische oder dramatische Darbietung oder Aufführung aufträgt. @de
label: 有化妆艺术家 @zh-hans
definition: 将一种资源与通过为动态图像制作或者为音乐或戏剧呈现或娱乐施加化妆品或假体而对一种资源作出贡献的一个行为者关联起来。 @zh-hans
label: sminkmestere a következő: @hu
definition: Hozzákapcsol egy forrást egy ágenshez, amely hozzájárul egy forráshoz azzal, hogy makeupot és protéziseket alkalmaz egy mozgókép-produkcióhoz, zenei vagy drámai bemutatóhoz, vagy szórakoztató műsorhoz. @hu
label: makyaj sanatçısı ile ilişkilidir @tr
definition: Bir kaynağı, hareketli bir görüntü yapımı veya müzikal veya dramatik bir sunum veya eğlence için makyaj ve protez uygulayarak bir kaynağa katkıda bulunan bir temsilci ile ilişkilendirir. @tr

is makeup artist of
status: Published
type: Property
lexical alias: makeupArtistOf.en
definition: Relates an agent to a resource that includes a contribution by an agent of applying makeup and prosthetics for a moving image production or for a musical or dramatic presentation or entertainment.
inverse of: has makeup artist
sub property of: is contributor of (Deprecated)
label: er sminkør for @da
definition: Relaterer en agent, der har bidraget til en ressource ved at lægge makeup og påsætte proteser til en levende billedproduktion eller til en musikalsk eller dramatisk præsentation eller til underholdningtil en ressource. @da
label: is make-upartiest van @nl
label: هو فنان ماكياج لـ @ar
definition: يربط بين وكيل ومصدر يتضمن إسهام وكيل في وضع مكياج أو مكياج ترقيعي لإنتاج فيلم أو في عرض موسيقي أو درامي أو ترفيهي. @ar
label: ist Maskenbildnerin/Maskenbildner von @de
definition: Setzt einen Akteur in Beziehung zu einer Ressource, zu der ein Akteur beiträgt, indem er Schminke und Prothetik für eine Bewegtbildproduktion oder eine musikalische oder dramatische Darbietung oder Aufführung aufträgt. @de
label: maskeeraaja aineistossa @fi
definition: Liittää toimijan aineistoon, jonka tekemiseen toimija osallistuu vastaamalla elokuvan, musikaalin tai näyttämöteoksen maskeerauksesta. @fi
label: 是……的化妆艺术家 @zh-hans
definition: 将一个行为者与包括为动态图像制作或者为音乐或戏剧呈现或娱乐施加化妆品或假体的一个行为者的贡献的一种资源关联起来。 @zh-hans
definition: Relaciona un agent amb un recurs que inclou una contribució d’un agent aplicant maquillatge i pròtesis en el cas d’una producció d’imatge en moviment o una representació o un espectacle musical o dramàtic. @ca
label: sminkmestere a következőnek: @hu
definition: Hozzákapcsol egy ágenst egy forráshoz, amely magában foglalja az ágens közreműködését szoftver kutatásában, tervezésében, implementálásában vagy tesztelésében. @hu
label: makyaj sanatçısıdır @tr
definition: Bir temsilciyi, hareketli bir görüntü üretimi veya müzikal veya dramatik bir sunum veya eğlence için makyaj ve protez uygulayan bir temsilcinin katkısını içeren bir kaynakla ilişkilendirir. @tr

has resource copyright statement
status: Published
lexical alias: resourceCopyrightStatement.en
definition: Relates a resource to a resource statement about a date that is associated with a claim of protection under copyright or a similar regime.
type: Property
scope note: A copyright date includes a phonogram date that is associated with a claim of protection for an audio recording.
label: heeft resource-copyrightvermelding @nl
label: له بيان حقوق نشر لمصدر @ar
definition: يربط بين مصدر وبيان مصدر حول تاريخ مرتبط بالحماية تحت حقوق النشر أو أي نظام مشابه. @ar
scope note: تاريخ حقوق النشر يشمل تاريخ التسجيل الصوتي المرتبط بإعلان الحماية الخاص بالتسجيل الصوتي. @ar
label: har copyrightoplysning for ressource @da
definition: Relaterer en ressource til en oplysning om ressource om et tidspunkt, som er knyttet til et krav om beskyttelse under copyright eller en lignende ordning. @da
scope note: Et copyrightdato omfatter et fonogramdato, som er knyttet til et krav om beskyttelse af en lydindspelning. @da
label: aineiston copyright-merkintö @fi
definition: Liittää aineiston aineistomerkintöön, joka kertoo copyright-säädöksen tai vastaavien säädösten alaiseen copyright-suojaukseen liittyvän ajankohdan. @fi
scope note: Copyright-vuodet käsittävät phonogram-vuodet, jotka liittyvät äänitallenteiden copyright-suojaukseen. @fi
label: hat Copyright-Angabe einer Manifestation @de
definition: Setzt eine Ressource in Beziehung zu einer Ressourcenangabe zu einem Datum, das mit einem Schutzanspruch nach dem Urheberrecht oder einem ähnlichen Regelwerk in Verbindung steht. @de
scope note: Darunter fallen Phonogramm-Daten, das heißt Datumsangaben, die mit einem Schutzanspruch für Audioaufnahmen in Verbindung stehen. @de
label: 有资源版权说明 @zh-hans
definition: 将一种资源与关于版权或其他类似管理体系下和保护声明有关的一个日期的一个资源说明关联起来。 @zh-hans
scope note: 版权日期包括与录音保护声明有关的录音版权日期 @zh-hans
label: forrás szerzői jogra vonatkozó közlése a következő: @hu
definition: Hozzákapcsol egy forrást egy időpontot jelölő forrásközléshez, amely a szerzői jog vagy egy hasonló szabályrendszer alapján támasztott védettségi követeléshez kapcsolódik. @hu
scope note: A szerzői jogra vonatkozó időpontok magukban foglalnak hangfelvételek védettségi követelésével társított időpontokat is. @hu
label: kaynak telif hakkı bildirimi ile ilişkilidir @tr
definition: Bir kaynağı, telif hakkı veya benzer bir düzenleme kapsamında koruma talebiyle ilişkilendirilen bir tarih hakkındaki kaynak bildirimiyle ilişkilendirir. @tr
scope note: Telif hakkı tarihi, bir ses kaydı için koruma talebiyle ilişkili olan bir fonogram tarihini içerir. @tr

has resource designation of sequence statement
status: Published
lexical alias: resourceDesignationOfSequenceStatement.en
definition: Relates a resource to a resource statement about the designation of a sequence of a resource of a part, issue, or iteration of a diachronic resource.
type: Property
label: heeft resource-aanduiding van volgorde-vermelding @nl
label: له تسمية مصدر لبيان تسلسل @ar
definition: يربط بين مصدر وبيان مصدر حول تسمية تسلسل مصدر لجزء، إصدار، أو تكرار لمصدر غير متزامن. @ar
label: har oplysning om rækkefølge for ressource @da
definition: Relaterer en ressource til en ressourceoplysning om en betegnelse for rækkefølge af en ressource af en del, udgave eller iteration af en diakronisk ressource. @da
label: aineiston merkintö numerointijakson määritteestä @fi
definition: Liittää aineiston aineistomerkintöön diakronisen aineiston yksittäisten osien tai iteraatioiden tai teoksen yksittäisten osien tai numeroiden numerointijaksosta. @fi
label: hat Ressourcenangabe zur Bezeichnung einer fortlaufenden Ressource @de
definition: Setzt eine Ressource in Beziehung zu einer Ressourcenangabe, die die Bezeichnung einer Folge von Ressourcen in Teilen, Ausgaben oder Iterationen enthält. @de
label: 有序列说明的资源标识 @zh-hans
definition: 将一种资源与关于一种历时资源的部分、期或更新后整体的资源的序列之标识的一个资源说明关联起来。 @zh-hans
label: sorrendiségre vonatkozó forrásmegjelölése a következő: @hu
definition: Hozzákapcsol egy forrást egy diakronikus forrás egy részének, számának vagy iterációjának sorrendiség-jelöléséről szóló forrásközléshez. @hu
label: kaynak sıralandırma bildirimi ile ilişkilidir @tr
definition: Bir kaynağı, artzamanlı bir kaynağın bir parçasının, sayısının veya yinelemesinin bir kaynak dizisinin belirlenmesi hakkındaki bir kaynak bildirimiyle ilişkilendirir. @tr

has resource dissertation statement
status: Published
lexical alias: resourceDissertationStatement.en
definition: Relates a resource to a resource statement about thesis and other dissertation information.
type: Property
label: heeft resource-proefschriftvermelding @nl
label: له بيان أطروحة لمصدر @ar
definition: يربط بين مصدر وبيان مصدر حول بيانات مرتبطة بأطروحة والمعلومات الأخرى عن الرسائل. @ar
label: har oplysning om afhandling for ressource @da
definition: Relaterer en ressource til en ressourceoplysning om en disputats og andre oplysninger om afhandlingen. @da
label: aineiston väitöskirjamerkintö @fi
definition: Liittää aineiston aineistomerkintöön opinnäytteen tai väitöskirjan tiedoista. @fi
label: hat Hochschulschriftenvermerk einer Ressource @de
definition: Setzt eine Ressource in Beziehung zu einer Ressourcenangabe, die Angaben zum Hochschulschriftenvermerk enthält. @de
label: 有资源学位论文说明 @zh-hans
definition: 将一种资源与关于毕业论文或其他学位论文信息的一个资源说明关联起来。 @zh-hans
label: forrás disszertációra vonatkozó közlése a következő: @hu
definition: Hozzákapcsol egy forrást egy szakdolgozatról vagy disszertációról szóló információ forrásközléséhez. @hu
label: kaynak tez bildirimi ile ilişkilidir @tr
definition: Bir kaynağı, tez ve diğer bitirme tezi bilgileriyle ilgili bir kaynak bildirimiyle ilişkilendirir. @tr

has resource distribution statement
status: Published
lexical alias: resourceDistributionStatement.en
definition: Relates a resource to a resource statement about data relating to the distribution of a published resource.
type: Property
label: heeft resource-distributievermelding @nl
label: له بيان توزيع مصدر @ar
definition: يربط بين مصدر وبيان مصدر حول بيانات متعلقة بتوزيع مصدر منشور. @ar
label: har oplysning om distribution for ressource @da
definition: Relaterer en ressource til en ressourceoplysning om data, der relaterer til distibution af en udgiven ressource. @da
label: aineiston jakelumerkintö @fi
definition: Liittää aineiston aineistomerkintöön julkaistun aineiston jakeluun liittyvistä tiedoista. @fi
label: hat Vertriebsangabe einer Ressource @de
definition: Setzt eine Ressource in Beziehung zu einer Ressourcenangabe, die Daten zum Vertrieb einer veröffentlichten Ressource enthält. @de
label: 有资源发行说明 @zh-hans
definition: 将一种资源与关于和一种出版资源的发行有关的数据的一个资源说明关联起来。 @zh-hans
label: forrás terjesztésre vonatkozó közlése a következő: @hu
definition: Hozzákapcsol egy forrást egy kiadott forrás terjesztésével kapcsolatos adatokról szóló forrásközléshez. @hu
label: kaynak dağıtım bildirimi ile ilişkilidir @tr
definition: Bir kaynağı, yayımlanmış bir kaynağın dağıtımıyla ilgili veriler hakkındaki bir kaynak bildirimiyle ilişkilendirir. @tr

has resource edition statement
status: Published
lexical alias: resourceEditionStatement.en
definition: Relates a resource to a resource statement about an edition to which a resource belongs.
type: Property
label: heeft resource-editievermelding @nl
label: له بيان طبعة لمصدر @ar
definition: يربط بين مصدر وبيان مصدر حول طبعة التي ينتمي إليها مصدر. @ar
label: har oplysning om udgave for ressource @da
definition: Relaterer en ressource til en ressourceoplysning om en udgave, som en ressource tilhører. @da
label: aineiston painosmerkintö @fi
definition: Liittää aineiston aineistomerkintöön painoksesta, johon aineisto kuuluu. @fi
label: hat Ausgabevermerk einer Ressource @de
definition: Setzt eine Ressource in Beziehung zu einer Ressourcenangabe über eine Ausgabe, zu der eine Ressource gehört. @de
label: 有资源版本说明 @zh-hans
definition: 将一种资源与关于一种资源所属于的一个版本的一个资源说明关联起来。 @zh-hans
label: forrás kiadásra vonatkozó közlése a következő: @hu
definition: Hozzákapcsol egy forrást a forrás kiadásáról szóló forrásközléshez. @hu
label: kaynak sürüm bildirimi ile ilişkilidir @tr
definition: Bir kaynağı, kaynağın ait olduğu sürüm hakkındaki bir kaynak bildirimiyle ilişkilendirir. @tr

has resource frequency statement
status: Published
lexical alias: resourceFrequencyStatement.en
definition: Relates a resource to a resource statement about an interval at which the resources of parts, issues, or iterations of a diachronic resource are issued.
type: Property
label: heeft resource-frequentievermelding @nl
label: له بيان تتابع لمصدر @ar
definition: يربط بين مصدر وبيان مصدر حول الفترة الزمنية التي وفقًا لها يتم إصدار مصادر أجزاء، أعداد، أو تكرارات لمصدر ممتد زمنيًاً. @ar
label: har oplysning om hyppighed for ressource @da
definition: Relaterer en ressource til en oplysning om ressource om et interval, hvori ressourcerne for dele, udgaver eller iterationer af en diakronisk ressouce udgives. @da
label: aineiston ilmestymistiheysmerkintö @fi
definition: Liittää aineiston aineistomerkintöön tiheydestä, jolla diakronisen aineiston osat, numerot tai iteraatiot ilmestyvät. @fi
label: hat Angabe zur Erscheinungsfrequenz einer Ressource @de
definition: Setzt eine Ressource in Beziehung zu einer Ressourcenangabe die angibt, in welchem Intervall die Ressourcen von Teilen, Ausgaben oder Iterationen einer diachronen Ressource erscheinen. @de
label: 有资源频率说明 @zh-hans
definition: 将一种资源与关于一种历时资源的部分、期或更新后的整体的资源发行的时间间隔的资源说明关联起来。 @zh-hans
label: forrás gyakoriságra vonatkozó közlése a következő: @hu
definition: Hozzákapcsol egy forrást egy időközről szóló forrásközléshez, amely alatt egy diakronikus forrás részeit, számait, iterációit kiadják. @hu
label: kaynağın yayın sıklığı bildirimi ile ilişkilidir @tr
definition: Bir kaynağı, artzamanlı bir kaynağın parçalarının, sayılarının veya yinelemelerinin kaynaklarının verildiği bir aralık hakkındaki bir kaynak bildirimiyle ilişkilendirir. @tr

has resource identifier statement
status: Published
lexical alias: resourceIdentifierStatement.en
definition: Relates a resource to a resource statement about a code, number, or other string, usually independent of natural language and social naming conventions, used to identify a resource.
type: Property
label: heeft resource-identificatievermelding @nl
label: له بيان معرف مصدر @ar
definition: يربط بين مصدر وبيان مصدر حول رمز، رقم، أو سلسلة تمثيلات أخرى، عادة ما تكون مستقلة عن اللغة الطبيعية وعن التسميات المتعارف عليها اجتماعيًا، المستخدمة في تحديد هوية مصدر. @ar
label: har identfikatoroplysning for ressource @da
definition: Relaterer en ressource til en oplysning om ressource om en kode, et nummer, eller en anden streng, normalt uafhængig af naturligt sprog og sociale navnekonventioner, der bruges til at identificere en ressource. @da
label: aineiston tunnistemerkintö @fi
definition: Liittää aineiston aineistomerkintöön koodista, numerosta tai muusta merkkijonosta, joka on luonnollisesta kielestä ja kielen sosiaalisista konventioista riippumaton aineiston tunnistamiskeino. @fi
label: hat Angaben zum Identifikator einer Ressource @de
definition: Setzt eine Ressource in Beziehung zu einer Ressourcenangabe über einen Code, eine Nummer oder eine andere Zeichenkette, der/die normalerweise nicht in natürlicher Sprache und unabhängig von den sozialen Benennungskonventionen ist und zur Identifizierung einer Ressource verwendet wird. @de
label: 有资源标识符说明 @zh-hans
definition: 将一种资源与关于通常独立于自然语言和社会命名惯例、用以标识一种资源的代码、数字或其他串的一个资源说明关联起来。 @zh-hans
label: forrás azonosítóra vonatkozó közlése a következő: @hu
definition: Hozzákapcsol egy forrást egy kód-, szám-, vagy más típusú karakterláncból álló forrásközléshez, amely általában független a természetes nyelvektől és társadalmi névkonvencióktól, és egy forrás azonosítására használják. @hu
label: kaynak tanımlayıcısının bildirimi ile ilişkilidir @tr
definition: Bir kaynağı, bir kaynağı tanımlamak için kullanılan, genellikle doğal dil ve sosyal adlandırma kurallarından bağımsız olarak, bir kod, sayı veya başka bir dizi hakkındaki bir kaynak bildirimiyle ilişkilendirir. @tr

has resource manufacture statement
status: Published
lexical alias: resourceManufactureStatement.en
definition: Relates a resource to a resource statement about data relating to the printing, duplicating, casting, etc., of a published resource.
type: Property
label: heeft resource-vervaardigingsvermelding @nl
label: له بيان تصنيع لمصدر @ar
definition: يربط بين مصدر وبيان مصدر حول البيانات المتعلقة بطباعة، نسخ، طَرَح...إلخ، مصدر منشور. @ar
label: har oplysning om producent for ressource @da
definition: Relaterer en ressource til en oplysning om ressource om data vedrørende trykning, duplikering, støbning etc. af en udgiven ressource. @da
label: aineiston valmistusmerkintö @fi
definition: Liittää aineiston aineistomerkintöön julkaistun aineiston painamiseen, monistamiseen, kirjasinten valamiseen tai muuhun valmistustapaan liittyvistä tiedoista. @fi
label: hat Herstellungsangabe einer Ressource @de
definition: Setzt eine Ressource in Beziehung zu einer Ressourcenangabe, die Daten zum Druck, zur Vervielfältigung, zum Guss und so weiter einer veröffentlichten Ressource enthält. @de
label: 有资源生产说明 @zh-hans
definition: 将一种资源与关于和一种出版资源的印刷、复制、铸造或其他生产方法有关的数据的一个资源说明关联起来。 @zh-hans
label: forrás gyártásra vonatkozó közlése a következő: @hu
definition: Hozzákapcsol egy forrást egy kiadott forrás nyomtatásával, sokszorosításával, öntésével stb. kapcsolatos adatokról szóló forrásközléshez. @hu
label: kaynak üreticisi bildirimi ile ilişkilidir @tr
definition: Bir kaynağı, yayınlanmış bir kaynağın yazdırılması, çoğaltılması, yayınlanması vb. ile ilgili veriler hakkındaki bir kaynak bildirimiyle ilişkilendirir. @tr

has resource production statement
status: Published
lexical alias: resourceProductionStatement.en
definition: Relates a resource to a resource statement about data relating to the inscription, fabrication, construction, etc., of an unpublished resource.
type: Property
label: heeft resource-productievermelding @nl
label: له بيان إنتاج لمصدر @ar
definition: يربط بين مصدر وبيان مصدر حول البيانات المتعلقة بتسجيل، تصنيع، إنشاء...إلخ، مصدر غير منشور. @ar
label: har oplysning om produktion for ressource @da
definition: Relaterer en ressource til en oplysning om ressource om data vedrørende indskrift, fremstilling, konstruktion etc. af en ikke udgiven ressource. @da
label: aineiston tuotantomerkintö @fi
definition: Liittää aineiston aineistomerkintöön julkaisemattoman aineiston kaivertamiseen, valmistamiseen, kokoamiseen tai muuhun tuotantotapaan liittyvistä tiedoista. @fi
label: hat Entstehungsangabe einer Ressource @de
definition: Setzt eine Ressource in Beziehung zu einer Ressourcenangabe, die Daten zu der Beschriftung, der Fabrikation, der Konstruktion und so weiter einer unveröffentlichten Ressource enthält. @de
label: 有资源制作说明 @zh-hans
definition: 将一种资源与关于和一种非出版资源的镌刻、制造、构建或其他制作方法有关的数据的一个资源说明关联起来。 @zh-hans
label: forrás előállításra vonatkozó közlése a következő: @hu
definition: Hozzákapcsol egy forrást egy kiadatlan forrás írásával, összeállításával, készítésével stb. kapcsolatos adatokról szóló forrásközléshez. @hu
label: kaynak yapım bildirimi ile ilişkilidir @tr
definition: Bir kaynağı, yayınlanmamış bir kaynağın yazımı, üretimi, yapımı vb. ile ilgili veriler hakkındaki bir kaynak bildirimiyle ilişkilendirir. @tr

has resource publication statement
status: Published
lexical alias: resourcePublicationStatement.en
definition: Relates a resource to a resource statement about the publication, release, or issuing of a resource.
type: Property
label: heeft resource-publicatievermelding @nl
label: له بيان نشر لمصدر @ar
definition: يربط بين مصدر وبيان مصدر حول نشر، تحرير، أو إصدار مصدر. @ar
label: har oplysning om publicering for ressource @da
definition: Relaterer en ressource til en oplysning om en ressource om publicering, frigivelse eller udgivelse af en ressource. @da
label: aineiston julkaisumerkintö @fi
definition: Liittää aineiston aineistomerkintöön aineiston kustantamiseen, julkaisemiseen, ilmestymiseen tms. liittyvistä tiedoista. @fi
label: hat Veröffentlichungsangabe einer Ressource @de
definition: Setzt eine Ressource in Beziehung zu einer Ressourcenangabe, die Informationen über die Veröffentlichung, das Release oder die Herausgabe einer Ressource enthält. @de
label: 有资源出版说明 @zh-hans
definition: 将一种资源与关于一种资源出版、发布或发行的一个资源说明关联起来。 @zh-hans
label: forrás kiadásra vonatkozó közlése a következő: @hu
definition: Hozzákapcsol egy forrást egy forrás kiadásához, kibocsájtásához vagy megjelentetéséhez szóló forrásközléshez. @hu
label: kaynak yayınlama bildirimi ile ilişkilidir @tr
definition: Bir kaynağı, bir kaynağın yayınlanması, basılması veya piyasaya sürülmesiyle ilgili bir kaynak bildirimiyle ilişkilendirir. @tr

has resource regional encoding statement
status: Published
lexical alias: resourceRegionalEncodingStatement.en
definition: Relates a resource to a resource statement about a designation for one or more regions of the world for which a videodisc or video game carrier has been encoded, indicating that playback is restricted to a device configured to decode it.
type: Property
label: heeft resource-regiocoderingsvermelding @nl
label: له بيان أكواد مناطق لمصدر @ar
definition: يربط بين مصدر وبيان مصدر حول تسمية منطقة أو أكثر من العالم التي تم تشفير حامل قرص الفيديو أو ألعاب الفيديو وفقًا له، ويوضح أن التشغيل مقيد بجهاز معد لفك الكود. @ar
label: har oplysning om regional kodning for ressource @da
definition: Relaterer en ressource til en oplysning om ressource om en betegnelse for en eller flere regioner i verden, som en videodisk eller video spillekonsol er blevet kodet til, hvilket indikerer, at afspilning er begrænset til en enhed, der der konfigureret til at afkode den. @da
label: aineistomerkintö aluekoodista @fi
definition: Liittää aineiston aineistomerkintöön määritteestä, jolla identifioidaan videolevyn tai videopelitallenteen käyttöalue ja estetään niiden käyttäminen toisella alueella myydyllä soittimella. @fi
label: hat Angabe zum Regionalcode einer Ressource @de
definition: Setzt eine Ressource in Beziehung zu einer Ressourcenangabe, die die Region(en) der Welt angibt, für die eine Videodisk oder ein Videospiel-Datenträger kodiert ist, und der verhindert, dass die Disk von einem Wiedergabegerät, das in einer anderen Region verkauft wurde, abgespielt werden kann. @de
label: 有资源地区编码说明 @zh-hans
definition: 将一种资源与关于视盘或视频游戏载体被编码后表示对设置解码回放的设备限制的世界上一个或多个地区的标识的一个资源说明关联起来。 @zh-hans
label: forrás regionális kódolásra vonatkozó közlése a következő: @hu
definition: Hozzákapcsol egy forrást egy forrásközléshez, amely vegy videolemez vagy videojáték-hordozó kódolásáról szól, a világ egy vagy több régiójának jelölésével, és azt jelzi, hogy a lejátszás egy dekódolásra konfigurált eszközre korlátozódik. @hu
label: kaynak bölgesel kodlama bildirimi ile ilişkilidir @tr
definition: Bir kaynağı, bir videodisk veya video oyunu taşıyıcısının kodlandığı dünyanın bir veya daha fazla bölgesi için bir tanımlaması hakkındaki bir kaynak bildirimiyle ilişkilendirir ve oynatmanın kodunu çözmek için yapılandırılmış bir cihazla sınırlı olduğunu belirtir. @tr

has resource series statement
status: Published
lexical alias: resourceSeriesStatement.en
definition: Relates a resource to a resource statement about a series to which a resource belongs and a sequence within the series.
type: Property
label: heeft resource-reeksvermelding @nl
label: له بيان سلسلة لمصدر @ar
definition: يربط بين مصدر وبيان مصدر حول سلسلة ينتمي إليها مصدر وتسلسل داخل السلسلة. @ar
label: har oplysning om serie for ressource @da
definition: Relaterer en ressource til en oplysning om ressource om en serie, som en ressource tilhører og en rækkefølge indenfor denne serie. @da
label: aineiston sarjamerkintö @fi
definition: Liittää aineiston aineistomerkintöön aineistoon liittyvästä sarjasta ja aineiston numeroinnista sarjassa. @fi
label: hat Gesamttitelangabe einer Ressource @de
definition: Setzt eine Ressource in Beziehung zu einer Ressourcenangabe, die Informationen über eine Reihe enthält, zu der eine Ressource gehört und zu deren Reihenfolge innerhalb der Reihe. @de
label: 有资源丛编说明 @zh-hans
definition: 将一种资源与关于一种资源所属于的一种丛编以及在丛编内的序列的一个资源说明关联起来。 @zh-hans
label: forrás sorozatra vonatkozó közlése a következő: @hu
definition: Hozzákapcsol egy forrást egy forrás sorozatáról és a sorozaton belüli számozásáról szóló forrásközléshez. @hu
label: kaynak serisi bildirimi ile ilişkilidir @tr
definition: Bir kaynağı, bir kaynağın ait olduğu bir seri ve seri içindeki bir sıra hakkındaki bir kaynak bildirimiyle ilişkilendirir. @tr

has resource statement
status: Published
lexical alias: resourceStatement.en
definition: Relates a resource to a resource statement appearing in a resource and deemed to be significant for users to understand how the resource represents itself.
type: Property
label: heeft resourcevermelding @nl
label: له بيان مصدر @ar
definition: يربط بين مصدر وبيان مصدر حول سلسلة مرتبطة بمصدر وترقيم مصدر داخل السلسلة. @ar
label: har oplysning om ressource @da
definition: Relaterer en ressource til en oplysning om ressource om en serie, der er knyttet til en ressource og nummrering af en ressource indenfor denne serie. @da
label: aineistomerkintö @fi
definition: Liittää aineiston aineistomerkintöön liittyvästä sarjasta ja aineiston numeroinnista sarjassa. @fi
label: hat Ressourcenangabe @de
definition: Setzt eine Ressource in Beziehung zu einer Ressourcenangabe, die Informationen über eine Reihe enthält, mit der eine Ressource in Verbindung steht und die eine Zählung einer Ressource innerhalb der Reihe aufweist. @de
scope note: Aineiston sarjamerkintö sisältää jonkin tai kaikki näistä: sarjan nimeke, sarjan muu nimeketieto, sarjaan liittyvä vastuullisuusmerkintö, ISSN, sarjanumerointi. @fi
label: 有资源说明 @zh-hans
definition: 将一种资源与在一种资源中出现并被认为对使用者理解该资源呈现方式重要的一个说明关联起来。 @zh-hans
definition: Relaciona un recurs amb una menció de recurs que figura en un recurs i que es considera significativa perquè els usuaris entenguin com el recurs es representa a si mateix. @ca
label: forrásközlése a következő: @hu
definition: Hozzákapcsol egy forrást egy forráshoz társított sorozatról és a forrás sorozaton belüli számozásáról szóló forrásközléshez. @hu
scope note: Egy sorozati forrásközlés magában foglalja a sorozat bármely vagy összes főcímét, egy sorozat egyébcím-információját, a sorozattal kapcsolatos felelősségi közlést, ISSN-t és sorrendiséget jelző számozást. @hu
label: kaynak bildirimi ile ilişkilidir @tr
definition: Bir kaynağı, bir kaynakla ilişkilendirilmiş bir seri ve seri içindeki bir kaynağın numaralandırılması hakkındaki bir kaynak bildirimiyle ilişkilendirir. @tr
scope note: Kaynak dizisi bildirimi, dizinin herhangi bir veya tüm başlığını, dizinin diğer başlık bilgilerini, diziyle ilgili sorumluluk bildirimini, ISSN'yi veya dizi içindeki numaralandırmayı içerir. @tr

has resource title and responsibility statement
status: Published
lexical alias: resourceTitleAndResponsibilityStatement.en
definition: Relates a resource to a resource statement about a name of a resource and the agent creating or contributing to the content of the resource.
type: Property
scope note: A resource title and responsibility statement includes any kind of title or statement of responsibility that is associated with the content of the resource, but does not include a title or statement of responsibility that is associated with an edition, revision or series that is related to the resource.
label: heeft resource-titel en verantwoordelijkheidsvermelding @nl
label: له بيان عنوان ومسؤولية لمصدر @ar
definition: يربط بين مصدر وبيان مصدر حول اسم المصدر والوكيل الذي ينشئ محتوى مصدر أو يساهم فيه. @ar
scope note: يتضمن بيان عنوان ومسؤولية لمصدر على أي نوع من العناوين أو بيان المسؤولية المرتبط بمحتوى المصدر، ولكن لا يتضمن عنوانًا أو بيان مسؤولية مرتبطًا بإصدار، مراجعة أو سلسلة مرتبطة بالمصدر. @ar
label: har oplysning om ressourcetitel og ophav @da
definition: Relaterer en ressource til en oplysning om ressource om et navn på en ressource og den agent der har skabt eller bidraget til ressourcens indhold. @da
scope note: En oplysning om ressourcetitel og ophav omfatter enhver form for titel eller ophavsangivelse, som er knyttet til ressourcens indhold, men omfatter ikke en titel eller ophavsanivelse, som er knyttet til en udgave, serierevistion, der er relateret til ressourcen. @da
label: aineiston nimeke- ja vastuullisuusmerkintö @fi
definition: Liittää aineiston aineistomerkintöön aineiston nimekkeistä ja aineistoon sisältyvän aineiston sisältöön vaikuttavien toimijoiden nimistä. @fi
scope note: Aineiston nimeke- ja vastuullisuusmerkintö sisältää kaikenlaiset nimekkeet (ml. päänimekkeen, nimekkeen varianttimuodot ja muun nimeketiedon) sekä kaikenlaiset aineiston sisältöön liittyvät vastuullisuusmerkinnöt. aineiston nimeke- ja vastuullisuusmerkintö ei sisällä sarjaan liittyviä nimekkeitä eikä sarjasta vastuussa olevien toimijoiden nimiä. @fi
label: hat Titel und Verantwortlichkeitsangabe einer Ressource @de
definition: Setzt eine Ressource in Beziehung zu einer Ressourcenangabe, die einen Namen einer Ressource und den Akteur enthält, der den Inhalt der Ressource erstellt oder dazu beigetragen hat. @de
scope note: Darunter fallen alle Arten von Titeln (Haupttitel, abweichende Titel und Titelzusätze) oder Verantwortlichkeitsangaben, die mit dem Inhalt der Ressource in Beziehung stehen. Darunter fallen keine Titel oder Verantwortlichkeitsangaben von in Beziehung stehenden Ausgaben, Überarbeitungen oder Reihen, die mit der Ressource in Verbindung stehen. @de
label: 有资源题名和责任说明 @zh-hans
definition: 将一种资源与关于一种资源的名称以及对一种资源之内容的创建或有贡献的一个行为者的名称的一个资源说明关联起来。 @zh-hans
scope note: 资源题名和责任说明包括与该资源的内容有关的任何类型的题名或责任说明，但不包括与该资源所关联的版本、修订或丛编的题名或责任说明。 @zh-hans
label: forrás címre és szerzőségre vonatkozó közlése a következő: @hu
definition: Hozzákapcsol egy forrást egy a forrás megnevezéséről és a forrás tartalmát létrehozó vagy ahhoz hozzájáruló ágensről szóló forrásközléshez. @hu
scope note: Egy forrás cím- és szerzőségi közlése magában foglal bármilyen címet és felelősségi közlést, amelyeket a forrás tartalmához társítanak, de nem foglalja magában a forrás kiadáshoz, átdolgozáshoz vagy sorozathoz társított címét és felelősségi közlését. @hu
label: kaynak başlığı ve sorumluluk bildirimi ile ilişkilidir @tr
definition: Bir kaynağı, bir kaynak adı ve kaynağı oluşturan ya da kaynağın içeriğine katkıda bulunan temsilci hakkındaki bir kaynak bildirimiyle ilişkilendirir. @tr
scope note: Kaynak başlığı ve sorumluluk bildirimi, kaynağın içeriğiyle bağlantılı olan her türlü başlığı veya sorumluluk bildirimini içerir, ancak kaynakla bağlantılı olan bir baskı, revizyon veya diziyle ilişkili bir başlığı veya sorumluluk bildirimini içermez. @tr

has manufacturer
status: Published
definition: Relates a resource to an agent who is responsible for printing, duplicating, casting, or other method of manufacturing a published resource.
type: Property
inverse of: is manufacturer of
lexical alias: manufacturer.en
label: har producent @da
definition: Relaterer en ressource til en agent, der er ansvarlig for trykning, duplikering, støbning etc. af en ressource i publiceret form. @da
sub property of: has appellation of entity
label: heeft vervaardiger @nl
label: aineiston valmistaja @fi
label: له مُصَنِّع @ar
definition: يربط مصدر بوكيل مسؤول عن طبع، نسخ، طَرَح، أو مرتبط بأي طريقة أخرى بتصنيع مصدر منشور. @ar
label: hat Hersteller @de
definition: Setzt eine Ressource in Beziehung zu einem Akteur, der für den Druck, die Vervielfältigung, den Guss oder eine andere Herstellungsmethode einer veröffentlichten Ressource verantwortlich ist. @de
definition: Liittää aineiston toimijaan, joka vastaa julkaistun aineiston painamisesta, monistamisesta, kirjasinten valamisesta tai muusta valmistustavasta. @fi
label: 有生产者 @zh-hans
definition: 将一种资源与负责一种出版资源的印刷、复制、铸造或其他生产方法的一个行为者关联起来。 @zh-hans
label: gyártója a következő: @hu
definition: Hozzákapcsol egy forrást egy ágenshez, amely felelős egy kiadott forrás nyomtatásáért, sokszorosításáért, öntéséért vagy egyéb módú gyártásáért. @hu
has subproperty: has braille embosser
has subproperty: has printer
label: üretici ile ilişkilidir @tr
definition: Bir kaynağı, yayınlanmış bir kaynağın basılmasından, çoğaltılmasından, dökümünden veya başka bir üretim yönteminden sorumlu olan bir temsilci ile ilişkilendirir. @tr

is manufacturer of
status: Published
definition: Relates an agent to a resource that involves a responsibility of an agent for printing, duplicating, casting, etc.
type: Property
inverse of: has manufacturer
lexical alias: manufacturerOf.en
label: er producent af @da
definition: Relaterer en agent der er ansvarlig for trykning, duplikering, støbning etc., til en ressource. @da
sub property of: is appellation of entity of
label: is vervaardiger van @nl
label: هو مُصّنع لـ @ar
definition: يربط بين وكيل ومصدر ينطوي على مسؤولية وكيل عن الطباعة، النسخ، الطَرَح، إلخ. @ar
label: valmistaja (toimija) aineistossa @fi
definition: Liittää toimijan aineistoon, jossa toimija vastaa painamisesta, monistamisesta, kirjasinten valamisesta tai muusta valmistustavasta. @fi
label: ist Hersteller von @de
definition: Setzt einen Akteur in Beziehung zu einer Ressource, bei der ein Akteur für den Druck, die Vervielfältigung, den Guss und so weiter verantwortlich ist. @de
label: 是……的生产者 @zh-hans
definition: 将一个行为者与涉及印刷、复制、铸造等的一个行为者的责任的一种资源关联起来。 @zh-hans
label: gyártója a következőnek: @hu
definition: Hozzákapcsol egy ágenst egy forráshoz, amelyhez hozzátartozik az ágens felelőssége a nyomtatásért, sokszorosításért, öntésért, stb. @hu
has subproperty: is braille embosser of
has subproperty: is printer of
label: üreticisidir @tr
definition: Bir temsilciyi, yazdırma, çoğaltma, oyuncu seçimine…vb ilişkin bir temsilcinin sorumluluğunu içeren bir kaynakla ilişkilendirir @tr

has manufacture statement
status: Published
definition: Relates a resource to a statement that identifies a place of manufacture, a manufacturer, or a date of manufacture of a published resource.
type: Property
lexical alias: manufactureStatement.en
label: har produktionsbeskrivelse @da
definition: Relaterer en ressource til oplysninger, der identificerer fremstillingssted, producent og fremstillingsår eller -dato for en ressource i publiceret form. @da
scope note: A manufacture statement includes a statement about the printing, duplicating, casting, etc., of a published resource.
label: heeft vervaardigingsvermelding @nl
label: aineiston valmistusmerkintö @fi
label: له بيان تصنيع @ar
definition: يربط بين مصدر وبيان يحدد مكان تصنيع، مصنعون، أو تاريخ تصنيع خاص بمصدر منشور. @ar
scope note: يشمل بيان التصنيع البيان المتعلق بالطباعة، النسخ، الطَرَح، إلخ. لمصدر منشور. @ar
scope note: Produktionsbeskrivelse omfatter en beskrivelse af trykning, kopiering, støbning, etc. af en publiceret ressource. @da
definition: Liittää aineiston merkintöön, joka identifioi julkaistun aineiston valmistuspaikan, valmistajan tai valmistusajan. @fi
scope note: Valmistusmerkintö sisältää julkaistun aineiston painamiseen, monistamiseen, kirjasinten valamiseen tms. liittyvän merkinnön. @fi
label: hat Herstellungsangabe @de
definition: Setzt eine Ressource in Beziehung zu einer Angabe, die einen Herstellungsort, einen Hersteller oder ein Herstellungsdatum einer veröffentlichten Ressource identifiziert. @de
scope note: Darunter fallen Angaben, die sich auf den Druck, die Vervielfältigung, den Guss und so weiter einer veröffentlichten Ressource beziehen. @de
label: 有生产说明 @zh-hans
definition: 将一种资源与标识一种出版资源的生产地、生产者或生产日期的一个说明关联起来。 @zh-hans
scope note: 生产说明包括关于一种出版资源的印刷、复制、铸造等的一个说明。 @zh-hans
label: gyártási közlése a következő: @hu
definition: Hozzákapcsol egy forrást egy közléshez, amely azonosítja egy kiadott forrás gyártási helyét, gyártóját és a gyártás időpontját. @hu
scope note: A gyártási közlések olyan közléseket tartalmaznak, amelyek egy kiadott forrás nyomtatására, sokszorosítására, öntésére, stb. vonatkoznak. @hu
label: üretim bildirimi ile ilişkilidir @tr
definition: Bir kaynağı, yayınlanmış bir kaynağın üretim yerini, üreticisini veya üretim tarihini tanımlayan bir bildirim ile ilişkilendirir. @tr
scope note: Bir üretim bildirimi, yayımlanmış bir kaynağın baskısı, çoğaltılması, dökümü vb. ile ilgili bir bildirim içerir. @tr

has material
status: Published
type: Property
lexical alias: material.en
definition: Relates a resource to a physical or chemical substance that is used to create a resource.
label: heeft materiaal @nl
label: له مادة @ar
definition: يربط بين مصدر ومادة فيزيائية أو كيميائية مستخدمة في إنشاء مصدر. @ar
label: har materiale @da
definition: Relaterer en ressource til et fysisk eller kemisk stof, som er påført en manifestations basismateriale. @da
label: materiaali aineistossa @fi
definition: Liittää aineiston fyysiseen tai kemialliseen aineeseen, jota on käytetty aineiston luomisessa. @fi
label: hat Material @de
definition: Setzt eine Ressource in Beziehung zu einer physischen oder chemischen Substanz, die zur Erstellung einer Ressource verwendet wird. @de
label: 有材料 @zh-hans
definition: 将一种资源与被用于创建一种资源的一种物理或化学物质关联起来。 @zh-hans
label: anyaga a következő: @hu
definition: Hozzákapcsol egy forrást egy olyan fizikai vagy kémiai anyaghoz, amelyet egy forrás létrehozásához használnak. @hu
has subproperty: has applied material
has subproperty: has base material
label: materyal ile ilişkilidir @tr
definition: Bir kaynağı, bir kaynağı oluşturmak için kullanılan fiziksel veya kimyasal bir maddeyle ilişkilendirir. @tr

has media type
status: Published
definition: Relates a resource to a categorization reflecting the general type of intermediation device required to view, play, run, or otherwise access the content of a resource.
type: Property
lexical alias: mediaType.en
label: har medietype @da
definition: Relaterer en ressource til en kategorisering der generelt afspejler typen af formidlingsudstyr/afspiller, der kræves for at tilgå en ressources indhold. @da
label: heeft type medium @nl
label: له نوع الوسيط @ar
definition: يربط بين مصدر وفئة تعكس النوع العام للجهاز الوسيط المطلوب لعرض، أو لتشغيل، أو لمعالجة أو للوصول إلى محتوى مصدر. @ar
label: aineiston mediatyyppi @fi
definition: Kategorisointi, joka ilmaisee aineiston sisällön katsomiseen, toistamiseen, suorittamiseen tai muuhun toimintaan tarvittavan välittävän laitteen yleistä tyyppiä. @fi
label: hat Medientyp @de
definition: Setzt eine Ressource in Beziehung zu einer Kategorisierung, welche die allgemeine Art des Hilfsmittels widerspiegelt, das erforderlich ist, um den Inhalt einer Ressource anzuschauen, abzuspielen oder laufen zu lassen und so weiter. @de
label: 有媒介类型 @zh-hans
definition: 将一种资源与反映资源内容的浏览、播放、运行或其他存取方式等所需中间设备的一般类型的分类关联起来。 @zh-hans
label: médiatípusa a következő: @hu
definition: Hozzákapcsol egy forrást egy kategorizáláshoz, amely tükrözi a közvetítőkészülék általános típusát, amely egy forrás tartalmának megtekintéséhez, lejátszásához, futtatásához, stb. szükséges. @hu
label: ortam türü ile ilişkilidir @tr
definition: Bir kaynağı, bir kaynağın içeriğini görüntülemek, oynatmak, çalıştırmak veya başka bir şekilde erişmek için gereken aracı aygıtın genel türünü yansıtan bir sınıflandırmayla ilişkilendirir. @tr

has medium
status: Published
definition: Relates a resource to an agent who claims to be a channel of communication with a world of spirits.
type: Property
sub property of: has other agent associated with resource (Deprecated)
inverse of: is medium of
lexical alias: medium.en
label: har medie @da
definition: Relaterer en ressource til en agent der siges at være en kanal for kommunikation mellem den jordiske verden og en åndevereden. @da
label: heeft medium @nl
label: meediona aineistossa @fi
label: له وسيط روحاني @ar
definition: يربط مصدر بوكيل يدعي أنه قناة اتصال مع عالم الأرواح. @ar
definition: Liittää aineistoon toimijan, jota pidetään kanavana henkimaailman ja maallisen maailman välillä. @fi
label: hat Channel @de
definition: Setzt eine Ressource in Beziehung zu einem Akteur, der sich für einen Kommunikationskanal zwischen der irdischen Welt und einer Geisterwelt hält. @de
label: 有通灵者 @zh-hans
definition: 将一种资源与声称是和精神世界之间通讯渠道的一个行为者关联起来。 @zh-hans
label: médiuma a következő: @hu
definition: Hozzákapcsol egy forrást egy ágenshez, akit a szellemek világával folytatott kommunikáció csatornájának tartanak. @hu
label: medyum ile ilişkilidir @tr
definition: Bir kaynağı, ruhlar dünyasıyla iletişimde olduğunu iddia eden bir temsilci ile ilişkilendirir. @tr

is medium of
status: Published
definition: Relates an agent held to be a channel of communication between the earthly world and a world of spirits to a resource.
type: Property
sub property of: is other agent associated with resource of (Deprecated)
inverse of: has medium
lexical alias: mediumOf.en
label: er medie i @da
definition: Relaterer en agent der siges at være en kanal for kommunikation mellem den jordiske verden og en åndevereden, til en ressource. @da
label: is medium van @nl
label: meediona aineistossa @fi
label: هو وسيط روحاني لـ @ar
definition: يربط بين وكيل يعمل بوصفه قناة اتصال بين العالم الأرضي وعالم الأرواح وأحد المصادر. @ar
definition: Liittää aineistoon toimijan, jota pidetään kanavana henkimaailman ja maallisen maailman välillä. @fi
label: ist Channel von @de
definition: Setzt einen Akteur in Beziehung zu einer Ressource, bei der der der Akteur für sich in Anspruch nimmt, als Kommunikationskanal zwischen der irdischen Welt und einer Geisterwelt zu dienen. @de
label: 是……的通灵者 @zh-hans
definition: 将一个被认为是现实世界和精神世界之间通讯渠道的一个行为者与一种资源关联起来。 @zh-hans
label: médiuma a következőnek: @hu
definition: Hozzákapcsol egy ágenst, akit a földi világ és a szellemek világa közötti kommunikációs csatornának tartanak. @hu
label: medyumudur @tr
definition: Bir temsilciyi, dünyevi dünya ile ruhlar dünyası arasında bir iletişim kanalı olarak kabul edilen bir kaynakla ilişkilendirir. @tr

has medium of performance (Deprecated)
status: Deprecated
definition: Relates a resource to an instrument, voice, or ensemble for which a musical resource was originally conceived. (Deprecated)
type: Property
lexical alias: mediumOfPerformance.en
label: har originalbesætning @da
definition: Relaterer en ressource til et instrument, en sangstemme og/eller en ensemble som en musikressource oprindeligt blev udtænkt til. @da

has medium of performance of choreographic content
status: Published
lexical alias: mediumOfPerformanceOfChoreographicContent.en
definition: Relates a resource to a type of performer or group of performers participating, or intended to participate, in a performance of choreographic or non-musical dramatic content.
type: Property
label: heeft uitvoeringsmedium van choreografische content @nl
label: له وسيط أداء محتوى الرقصات @ar
definition: يربط بين مصدر ونوع من فناني الأداء أو مجموعة من المؤدين يشاركون، أو يعتزمون المشاركة، في أداء محتوى درامي راقص أو محتوى درامي غير موسيقي. @ar
label: har besætning for koreografisk indehold @da
definition: Relaterer en ressource til en type af performer eller gruppe af performere, der deltager, eller havde til hensigt at deltage, i en performance med koreografisk eller ikke-musikalsk indhold. @da
label: aineiston koreografisen sisällön esityskokoonpano @fi
definition: Koreografiseen tai ei-musiikilliseen draamasisältöön osallistuvan tai osallistuvaksi tarkoitetun esittäjän tai esittäjien ryhmän tyyppi. @fi
label: hat Besetzung für choreografischen Inhalt @de
definition: Setzt eine Ressource in Beziehung zu einer Kategorisierung der Ausführenden/des Ausführenden oder einer Gruppe von Ausführenden, die an einer Darbietung eines choreografischen oder nicht musikalischen, dramatischen Inhalts teilnehmen oder teilnehmen sollen. @de
label: 有编舞内容的表演媒介 @zh-hans
definition: 将一种资源与在编舞或非音乐戏剧内容的一种表演中参与或计划参与的表演者或表演者群体的类型关联起来。 @zh-hans
label: koreográfiai tartalom előadásmédiuma a következő: @hu
definition: Hozzákapcsol egy forrást egy koreográfiai vagy nem zenei drámai tartalom előadásában részt vevő vagy részt venni szándékozó előadói típushoz vagy előadói csoporthoz. @hu
label: koreografik içeriğin performans ortamı ile ilişkilidir @tr
definition: Bir kaynağı, koreografik veya müzikal olmayan dramatik içerikli bir performansa katılan veya katılması amaçlanan bir sanatçı türü veya sanatçı grubuyla ilişkilendirir. @tr

has medium of performance of musical content
status: Published
definition: Relates a resource to an instrument, voice, or ensemble and the number of parts, performers and hands used, or intended to be used, to perform the musical content of a resource.
type: Property
lexical alias: mediumOfPerformanceOfMusicalContent.en
label: har besætning @da
definition: Relaterer en ressource til et instrument, en stemme og eller ensemble anvendt, eller påtænkt anvendt, til opførelse af musikindhold. @da
label: heeft uitvoeringsmedium van muzikale content @nl
label: له وسيط أداء لمحتوى موسيقي @ar
definition: يربط بين مصدرً وآلة، صوت، أو مجموعة وعدد من أجزاء، فنانين وعاملين مُستخدمين أو يُعتزم استخدامهم لأداء المحتوى الموسيقي لمصدر ما. @ar
label: musiikkisisällön esityskokoonpano aineistossa @fi
definition: Liittää aineiston musiikkiesityksessä käytettävään tai käytettäväksi aiottuun soittimeen, lauluääneen tai esittäjäryhmään ja osien, esiintyjien ja käsien lukumäärään. @fi
label: hat Besetzung für musikalischen Inhalt @de
definition: Setzt eine Ressource in Beziehung zu einem Instrument, einer Singstimme oder einem Ensemble und der Anzahl der Stimmen, der Ausführenden und Hände, das/die zur Darbietung eines musikalischen Inhalts einer Ressource verwendet wird/werden oder verwendet werden soll/sollen. @de
label: 有音乐内容的表演媒介 @zh-hans
definition: 将一种资源与一种资源的音乐内容之表演所用或构想所用的乐器、人声或组合以及声部、表演者和手的数量关联起来。 @zh-hans
label: zenei tartalom előadásmédiuma a következő: @hu
definition: Hozzákapcsol egy forrást egy hangszerhez, hanghoz vagy együtteshez, illetve egy forrás zenei tartalmának előadásához használt, vagy használni kívánt szólamok, előadók és kezek számához . @hu
label: müzikal içeriğin performans ortamı ile ilişkilidir @tr
definition: Bir kaynağı bir enstrüman, ses veya grupla ve bir kaynağın müzikal içeriğini çalmak için kullanılan veya kullanılması amaçlanan parçaların, sanatçıların ve ellerin sayısı ile ilişkilendirir. @tr

has member
status: Published
definition: Relates an agent to an agent who is a member of an agent.
type: Property
inverse of: is member of
lexical alias: member.en
label: har medlem af @da
definition: Relaterer en agent der er medlem af en agent til en agent. @da
label: heeft lid @nl
label: له عضو @ar
definition: يربط بين وكيل ووكيل هو عضو لوكيل. @ar
label: jäsen (toimija) @fi
definition: Liittää yhteistoimijan toimijaan, joka on yhteistoimijan jäsen. @fi
label: hat Mitglied @de
definition: Setzt einen Akteur in Beziehung zu einem Akteur, der Mitglied eines Akteurs ist. @de
label: 有成员 @zh-hans
definition: 将一个行为者与作为一个行为者之成员的一个行为者关联起来。 @zh-hans
definition: Relaciona un agent amb un agent que és un membre d’un agent. @ca
label: tagja a következő: @hu
definition: Hozzákapcsol egy ágenst, amely tagja egy ágensnek, egy ágenshez. @hu
label: üye ile ilişkilidir @tr
definition: Bir temsilcinin üyesi olan bir temsilciyi bir temsilciyle ilişkilendirir. @tr

is member of
status: Published
definition: Relates an agent of which an agent is a member to an agent.
type: Property
inverse of: has member
lexical alias: memberOf.en
label: har medlem af @da
definition: Relaterer en agent som en agent er medlem af til en agent. @da
label: is lid van @nl
label: هو عضو لـ @ar
definition: يربط وكيلًا يكون الوكيل عضوًا لوكيل. @ar
label: jäsen @fi
definition: Liittää toimijan yhteistoimijaan, jonka jäsen toimija on. @fi
label: ist Mitglied von @de
definition: Setzt einen Akteur in Beziehung zu einem Akteur, dem ein Akteur angehört. @de
label: 是……的成员 @zh-hans
definition: 将一个行为者与作为一个行为者的一个成员的一个行为者关联起来。 @zh-hans
label: tagja a következőnek: @hu
definition: Hozzákapcsol egy olyan egy ágenst egy ágenshez, amelynek egy ágens a tagja. @hu
label: medyumudur @tr
definition: Bir temsilciyi, bir temsilcinin üyesi olduğu bir temsilciyle ilişkilendirir. @tr

is merged to form
status: Published
definition: Relates a resource to a resource that is formed from a coming together of two or more resources.
type: Property
sub property of: is succeeded by
inverse of: is merger of
lexical alias: mergedToForm.en
label: er lagt sammen til @da
definition: Relaterer en ressource til en ressource, der er dannet ved at lægge to eller flere ressourcer sammen. @da
label: is samengevoegd om te vormen @nl
label: هو مدمج لتشكيل @ar
definition: يربط بين مصدر ومصدر مكون من تجميع لمصدرين أو أكثر معًا. @ar
label: yhdistynyt aineisto @fi
definition: Liittää aineiston aineistoon, joka on syntynyt kahden tai useamman aineiston yhdistymisestä. @fi
label: ist vereinigt, um ... zu bilden @de
definition: Setzt eine Ressource in Beziehung zu einer Ressource, die durch ein Zusammenführen von zwei oder mehreren Ressourcen gebildet wird. @de
label: 被合并而形成 @zh-hans
definition: 将一种资源与两种或多种资源一起形成的一种资源关联起来。 @zh-hans
label: egyesül a következőkkel: @hu
definition: Hozzákapcsol egy forrást egy forráshoz, amely két vagy több forrás egyesüléséből jött létre. @hu
label: olarak birleştirilmiştir @tr
definition: Bir kaynağı, iki veya daha fazla kaynağın bir araya gelmesiyle oluşan bir kaynakla ilişkilendirir. @tr

has mergee
status: Published
definition: Relates an agent to an agent who merged with another agent to form a third.
type: Property
lexical alias: mergee.en
label: har sammenlagt korporation @da
definition: Relaterer en agent der er sammenlagt med en anden agent for at skabe en tredje agent til en agent. @da
label: heeft fusiepartner @nl
label: له هيئة مندمجة @ar
definition: يربط بين وكيل ووكيل اندمج مع وكيل ذي صلة ليُشكلا وكيلًا ثالثًا. @ar
label: kanssayhdistyjä (yhteistoimija) @fi
definition: Liittää toimijan yhteistoimijaan, joka on sulautunut toiseen muodostaakseen kolmannen yhteistoimijan. @fi
label: hat fusionierten Akteur @de
definition: Setzt einen Akteur in Beziehung zu einem Akteur, der mit einem anderen Akteur fusioniert, um einen neue zu bilden. @de
label: 有被合并的一方 @zh-hans
definition: 将一个行为者与一个和另一行为者合并后形成第三个行为者的行为者关联起来。 @zh-hans
definition: Relaciona un agent amb un agent que s’ha fusionat amb un altre agent per formar-ne un tercer. @ca
label: beolvadója a következő: @hu
definition: Hozzákapcsol egy ágenst, amely egy harmadikat alkotva összeolvad egy kapcsolódó ágenssel, egy ágenshez. @hu
label: birleşen kurum ile ilişkilidir @tr
definition: Bir temsilcinin üçte birini oluşturmak için ilgili bir temsilci ile birleşen bir temsilciyle ilişkilendirir @tr

is merger of
status: Published
definition: Relates a resource to a resource that came together with one or more other resources to form a new resource.
type: Property
sub property of: is preceded by
inverse of: is merged to form
lexical alias: mergerOf.en
label: er sammenlægning af @da
definition: Relaterer en ressource til en ressource, der sammen med en eller flere andre ressourcer danner en ny ressource. @da
label: is samenvoeging van @nl
label: هو مدمج لـ @ar
definition: يربط بين مصدر ومصدر تم دمجه مع مصدر آخر أو أكثر لتكوين مصدر جديد. @ar
label: yhdistyjä (aineisto) @fi
definition: Liittää aineiston aineistoon, joka on yhdistynyt yhden tai useamman aineiston kanssa ja muodostanut uuden aineiston. @fi
label: ist Vereinigung von @de
definition: Setzt eine Ressource in Beziehung zu einer Ressource, die mit einer anderen Ressource oder mehreren anderen Ressourcen zusammengeführt wird, um eine neue Ressource zu bilden. @de
label: 是……的合并 @zh-hans
definition: 将一种资源与和一种或者多种其他资源一起形成一种新的资源的一种资源关联起来。 @zh-hans
label: egyesítője a következőknek: @hu
definition: Hozzákapcsol egy forrást egy forráshoz, amely egy vagy több egyéb forrással egyesült egy új forrás létrehozása érdekében. @hu
label: birleşmesidir @tr
definition: Bir kaynağı, yeni bir kaynak oluşturmak için bir veya daha fazla başka kaynakla bir araya gelen kaynakla ilişkilendirir. @tr

has minute taker
status: Published
definition: Relates a resource to an agent who is responsible for recording the minutes of a meeting.
type: Property
sub property of: has contributor (Deprecated)
inverse of: is minute taker of
lexical alias: minuteTaker.en
label: har referent @da
definition: Relaterer en ressource til en agent, der er ansvarlig for at have taget referat ved et møde. @da
label: heeft notulist @nl
label: pöytäkirjan laatija aineistossa @fi
label: له مدون لمحضر اجتماع @ar
definition: يربط مصدر بوكيل مسؤول عن تسجيل محاضر اجتماع. @ar
definition: Liittää aineiston toimijaan, joka vastaa kokouksen pöytäkirjan laatimisesta. @fi
label: hat Protokollantin/Protokollant @de
definition: Setzt eine Ressource in Beziehung zu einem Akteur, der für das Aufzeichnen des Protokolls einer Sitzung verantwortlich ist. @de
label: 有会议记录者 @zh-hans
definition: 将一种资源与负责写会议记录的一个行为者关联起来。 @zh-hans
label: jegyzőkönyvvezetője a következő: @hu
definition: Hozzákapcsol egy forrást egy ágenshez, amely felelős egy értekezlet jegyzőkönyvének a rögzítéséért. @hu
label: zabıt katibi ile ilişkilidir @tr
definition: Bir kaynağı, bir toplantının tutanaklarını kaydetmekten sorumlu olan bir temsilci ile ilişkilendirir. @tr

is minute taker of
status: Published
definition: Relates an agent to a resource that includes a contribution by an agent of recording the minutes of a meeting.
type: Property
sub property of: is contributor of (Deprecated)
inverse of: has minute taker
lexical alias: minuteTakerOf.en
label: er referent i @da
definition: Relaterer en agent der er ansvarlig for at have taget referat ved et møde til en ressource. @da
label: is notulist van @nl
label: هو مدون لمحضر اجتماع لـ @ar
definition: يربط بين وكيل ومصدر يتضمن إسهام وكيل في تسجيل محاضر اجتماع. @ar
label: pöytäkirjan laatija (toimija) aineistossa @fi
definition: Liittää toimijan aineistoon, jossa toimija vastaa kokouksen pöytäkirjan laatimisesta. @fi
label: ist Protokollantin/Protokollant von @de
definition: Setzt einen Akteur in Beziehung zu einer Ressource, zu der ein Akteur beiträgt, indem er für das Aufzeichnen des Protokolls einer Sitzung verantwortlich ist. @de
label: 是……的会议记录者 @zh-hans
definition: 将一个行为者与包括写会议记录的一个行为者的贡献的一种资源关联起来。 @zh-hans
label: jegyzőkönyvvezetője a következőnek: @hu
definition: Hozzákapcsol egy ágenst egy forráshoz, amely magában foglalja az ágens közreműködését egy értekezlet jegyzőkönyvének rögzítésében. @hu
label: zabıt katibidir @tr
definition: Bir temsilciyi, bir toplantının tutanaklarını kaydeden temsilcinin katkısını içeren bir kaynakla ilişkilendirir @tr

has mirror site
status: Published
definition: Relates a resource to a resource that is an exact copy of a website, used to reduce network traffic or improve the availability of the content of the original site.
type: Property
sub property of: has equivalent
lexical alias: mirrorSite.en
label: er spejlside @da
definition: Relaterer en ressource til en ressource, der er en nøjagtig kopi af en hjemmeside, som er anvendt til at reducere netværkstrafik eller forbedre tilgængeligheden af originalsidens indhold. @da
label: heeft mirror site @nl
label: peilisivusto @fi
label: له موقع بديل @ar
definition: يربط بين مصدر ومصدر يُعد نسخة طبق الأصل من موقع إلكتروني، مستخدم لتقليل الدخول على الشبكة أو لتحسين الإتاحة لمحتوى الموقع الأصلي. @ar
definition: Liittää aineiston aineistoon, joka on verkkosivuston tarkka kopio ja jota käytetään parantamaan alkuperäisen sivuston saavutettavuutta vähentämällä verkkoliikenteen kuormitusta. @fi
label: hat Mirror-Site @de
definition: Setzt eine Ressource in Beziehung zu einer Ressource, die eine exakte Kopie einer Website ist und verwendet wird, um den Datenverkehr in einem Netzwerk zu reduzieren oder die Verfügbarkeit des Inhalts der Originalseite zu verbessern. @de
label: 有镜像站点 @zh-hans
definition: 将一种资源与作为一个网站精确复本、用于减少网络流量或提高原站点内容获取能力的资源关联起来。 @zh-hans
label: tükörszájtja a következő: @hu
definition: Hozzákapcsol egy forrást egy forráshoz, amely pontos másolata egy weboldalnak, amelyet a hálózati forgalom csökkentésére vagy az eredeti szájt elérésének a javítására használnak. @hu
label: ayna site ile ilişkilidir @tr
definition: Bir kaynağı, orijinal sitenin içeriğinde ağ trafiğini azaltmak veya ulaşılabiliriğini yükseltmek için kullanılan bir web sitesinin tam kopyası olan bir kaynak ile ilişkilendirir. @tr

has mixing engineer
status: Published
type: Property
lexical alias: mixingEngineer.en
definition: Relates a resource to an audio engineer who contributes to the audio content of a resource by manipulating, mixing, and assembling the multiple tracks of a recording.
scope note: Remixing activities that substantially change the nature and content of the original resource, resulting in a new resource, are excluded.
inverse of: is mixing engineer of
sub property of: has audio engineer
see also: has remix artist
label: har mixingtekniker @da
definition: Relaterer en ressource til en lydtekniker der bidrager til en ressources lydindhold ved at manipulere, mixe og samle de forskellige lydspor på en optagelse. @da
scope note: Remixing-aktiviteter der væsentligt forandrer originalværkets karakter og indhold og derved resulterer i et nyt værk, er ikke omfattet. @da
label: heeft mixtechnicus @nl
label: له مهندس مكساج @ar
definition: يربط بين مصدر ومهندس صوت يساهم في المحتوى الصوتي لمصدر من خلال معالجة المواد السمعية المسجلة مسبقًا وإعادة تجميعها ومزجها واستنساخها. @ar
scope note: تُستبعد أنشطة إعادة المزج التي تغير بشكل جوهري طبيعة ومحتوى المصدر الأصلي، إلى حد ينتج معه مصدر جديد. @ar
label: aineiston miksaaja @fi
definition: Liittää aineiston toimijaan, joka on osallisena aineiston äänisisällössä käsittelemällä, miksaamalla ja yhdistelemällä useampia äänitteen raitoja. @fi
scope note: Ei koske uudelleenmiksauksia, jotka olennaisesti muuttavat alkuperäisen teoksen luonnetta ja sisältöä, mikä johtaa uuteen aineistoon. @fi
label: hat Mischtontechnikerin/Mischtontechniker @de
definition: Setzt eine Ressource in Beziehung zu einer Tontechnikerin/einem Tontechniker, die/der zum Audio-Inhalt einer Ressource beiträgt, indem sie/er mehrere Tonspuren einer Aufnahme bearbeitet, mischt und zusammenlegt. @de
scope note: Darunter fallen keine Nachbearbeitungen, die die Art und den Inhalt der Originalressource substantiell verändern, so dass eine neue Ressource entsteht. @de
label: 有合成工程师 @zh-hans
definition: 将一种资源与通过操纵、合成和聚集一个录音的多个音轨而对一种资源的音频内容有贡献的一个音频工程师关联起来。 @zh-hans
scope note: 不包括实质性改变原作品的性质和内容导致一种新的资源的合成活动。 @zh-hans
label: hangkeverője a következő: @hu
definition: Hozzákapcsol egy forrást egy hangmesterhez, aki hozzájárul egy forrás audio-tartalmához egy hangfelvétel sávjainak manipulálásával, keverésével és összeállításával. @hu
scope note: Olyan újrakeverési vagy remixelő tevékenység, amely az eredeti forrás természetét és tartalmát lényegesen megváltoztatja és forrást művet eredményez, nem tartozik ide. @hu
label: ses miksaj mühendisi ile ilişkilidir @tr
definition: Bir kaynağı, bir kaydın birden fazla parçasını işleyerek, karıştırarak ve birleştirerek bir kaynağın ses içeriğine katkıda bulunan bir ses mühendisiyle ilişkilendirir. @tr
scope note: Orijinal kaynağın niteliğini ve içeriğini önemli ölçüde değiştirerek yeni bir kaynakla sonuçlanan remiks faaliyetleri hariçtir. @tr

is mixing engineer of
status: Published
type: Property
lexical alias: mixingEngineerOf.en
definition: Relates an agent to a resource that incorporates a contribution by an agent of manipulating, mixing and assembling the multiple tracks of an audio recording.
scope note: Remixing activities that substantially change the nature and content of the original resource, resulting in a new resource, are excluded.
inverse of: has mixing engineer
sub property of: is audio engineer of
see also: is remix artist of
label: er mixing engineer i @da
definition: Relaterer en agent til en ressource, der inkorporerer et bidrag til lydindholdet ved at manipulere, mixe og samle en indspilnings forskellige spor. @da
scope note: Remixingaktiviteter der fortrinsvis ændrer natur og indhold på en oprindelig ressource og derved resulterer i en ny ressource, er ikke omfattet. @da
label: is mixtechnicus van @nl
label: هو مهندس مكساج لـ @ar
definition: يربط بين وكيل ومصدر يتضمن إسهام وكيل في معالجة المسارات المتعددة لتسجيل صوتي ومزجها وتجميعها. @ar
scope note: تُستبعد أنشطة إعادة المزج التي تغير بشكل جوهري طبيعة ومحتوى المصدر الأصلي، إلى حد ينتج معه مصدر جديد. @ar
label: miksaaja (toimija) aineistossa @fi
definition: Liittää toimijan aineistoon, jossa toimija on osallisena aineiston äänisisällössä käsittelemällä, miksaamalla ja yhdistelemällä useampia äänitteen raitoja. @fi
scope note: Ei koske uudelleenmiksauksia, jotka olennaisesti muuttavat alkuperäisen aineiston luonnetta ja sisältöä, mikä johtaa uuteen aineistoon. @fi
label: ist Mischtontechnikerin/Mischtontechniker von @de
definition: Setzt einen Akteur in Beziehung zu einer Ressource, zu der ein Akteur beiträgt, indem er mehrere Tonspuren einer Aufnahme bearbeitet, mischt und zusammenlegt. @de
scope note: Darunter fallen keine Nachbearbeitungen, die die Art und den Inhalt der Originalressource substantiell verändern, so dass eine neue Ressource entsteht. @de
label: 是……的合成工程师 @zh-hans
definition: 将一个行为者与包括操纵、合成和聚集一个录音的多个音轨的一个行为者的贡献的一种资源关联起来。 @zh-hans
scope note: 不包括实质性改变原资源的性质和内容导致一种新的资源的合成活动。 @zh-hans
label: hangkeverője a következőnek: @hu
definition: Hozzákapcsol egy ágenst egy forráshoz, amely magában foglalja az ágens közreműködését egy hangfelvétel sávjainak manipulálásában, keverésében és összeállításában. @hu
scope note: Olyan újrakeverési vagy remixelő tevékenység, amely az eredeti forrás természetét és tartalmát lényegesen megváltoztatja és forrást művet eredményez, nem tartozik ide. @hu
label: ses miksaj mühendisidir @tr
definition: Bir temsilciyi, bir ses kaydının birden çok parçasını değiştirme, karıştırma ve birleştirme konusunda bir temsilcinin katkısını içeren bir kaynakla ilişkilendirir. @tr
scope note: Orijinal kaynağın niteliğini ve içeriğini önemli ölçüde değiştirerek yeni bir kaynakla sonuçlanan remiks faaliyetleri hariçtir. @tr

has mode of issuance
status: Published
definition: Relates a resource to a categorization that reflects whether a resource is issued in one or more units.
type: Property
lexical alias: modeOfIssuance.en
label: har udgivelsesform @da
definition: Relaterer en ressource til en kategorisering, der afspejler, hvorvidt en ressource er udgivet i en eller flere dele, hvordan den opdateres, og hvorvidt dens ophør er forudbestemt eller ej. @da
label: heeft wijze van uitvaardiging @nl
label: له أسلوب للإصدار @ar
definition: يربط بين مصدر وفئة تعكس ما إذا كان المصدر قد صدر في جزء واحد أو عدة أجزاء، طريقه تحديثه، وتوقيفه عن قصد. @ar
label: aineiston julkaisutapa @fi
definition: Liittää aineiston kategorisointiin, joka kertoo, ilmestyykö se yhdessä vai useassa osassa. @fi
label: hat Erscheinungsweise @de
definition: Setzt eine Ressource in Beziehung zu einer Kategorisierung die widerspiegelt, ob eine Ressource in einem Teil oder mehreren Teilen erscheint, wie sie aktualisiert wird und wie sie enden soll. @de
label: 有发行方式 @zh-hans
definition: 将一种资源与反映资源以一个还是以多个单元发行的分类关联起来。 @zh-hans
definition: Relaciona un recurs amb una categorització que reflecteix si un recurs s’emet en una o més unitats. @ca
label: kibocsájtás módja a következő: @hu
definition: Hozzákapcsol egy forrást egy kategorizáláshoz, amely tükrözi hogy egy forrást egy vagy több részben adtak ki, a frissítés módját, és a tervezett megszüntetést. @hu
label: yayın biçimi ile ilişkilidir @tr
definition: Bir kaynağı, kaynağın bir veya daha fazla parça halinde yayınlanıp yayınlanmadığı, güncellenme biçimi ve kaynağın amaçlanan sona erdilimesini yansıtan bir sınıflandırmayla ilişkilendirir. @tr

has moderator
status: Published
definition: Relates a resource to an agent who is a performer who contributes to a resource by leading a program, often broadcast, where topics are discussed, usually with participation of experts in fields related to the discussion.
type: Property
sub property of: has performer
inverse of: is moderator of
lexical alias: moderator.en
label: har ordstyrer @da
definition: Relaterer en ressource til en optrædende, der har bidraget til en ressource ved at lede et program, ofte transmitteret, hvor emner diskuteres, normalt med deltagelse af fagfolk inden for felter, der er relateret til diskussionen. @da
label: heeft moderator @nl
label: moderoija aineistossa @fi
label: له رئيس جلسة @ar
definition: يربط بين مصدر ومؤدِ يُساهم في مصدر من خلال إدارة برنامج، غالبًا مُذاع، حيث تتم مناقشة موضوعات، عادةً بمشاركة خبراء في المجالات المتعلقة بموضوع النقاش. @ar
definition: Liittää aineiston esittäjään, joka on aineistossa osallisena juontamalla (usein lähetettyä) ohjelmaa, jossa keskustellaan eri aiheista, tavallisesti keskusteluun liittyvien aiheiden asiantuntijoiden kanssa. @fi
label: hat Moderatorin/Moderator @de
definition: Setzt eine Ressource in Beziehung zu einer Ausführenden/einem Ausführenden, die/der zu einer Ressource beiträgt, indem sie/er eine Veranstaltung (meist eine Sendung) leitet, in der Themen üblicherweise mit Expertinnen/Experten diskutiert werden. @de
label: 有谈话类节目主持人 @zh-hans
definition: 将一种资源与作为一个表演者通过主导节目（经常是广播节目，其中讨论话题，通常有讨论相关领域专家参与）对一种资源有贡献的一个行为者关联起来。 @zh-hans
definition: Relaciona un recurs amb un agent que és un intèrpret que contribueix a un recurs liderant un programa, sovint emès, on es discuteixen temes, habitualment amb la participació d’experts en els camps relacionats amb la discussió. @ca
label: moderátora a következő: @hu
definition: Hozzákapcsol egy forrást egy előadóhoz, aki hozzájárul egy forráshoz egy program, gyakran sugárzott műsor, vezetésével, ahol témákat vitatnak meg, rendszerint a beszélgetés témájában jártas szakértők részvételével. @hu
label: moderatör ile ilişkilidir @tr
definition: Bir kaynağı, genellikle tartışma konusu ile ilgili alanlarda uzman olan kişilerin katılımıyla konuların tartışıldığı, sıklıkla radyo ve televizyonda yayınlanan bir programa katılarak, kaynağa katkıda bulunan sunucu ile ilişkilendirir. @tr

is moderator of
status: Published
definition: Relates an agent to a resource that includes a contribution by an agent of leading a program, often broadcast, where topics are discussed, usually with participation of experts in fields related to the discussion.
type: Property
sub property of: is performer of
inverse of: has moderator
lexical alias: moderatorOf.en
label: er ordstyrer i @da
definition: Relaterer en udøver, der bidrager til en ressource ved at lede et program, ofte transmitteret, hvor emner diskuteres, normalt med deltagelse af fagfolk indenfor felter, der er relateret til diskussionen, til en ressource. @da
label: is moderator van @nl
label: moderoijana aineistossa @fi
label: هو رئيس جلسة لـ @ar
definition: يربط بين وكيل ومصدر يتضمن إسهام وكيل في إدارة برنامج، غالبًا مُذاع، حيث تتم مناقشة موضوعات، عادةً بمشاركة خبراء في المجالات المتعلقة بموضوع النقاش. @ar
definition: Liittää toimijan aineistoon jonka tekemiseen hän osallistuu juontamalla (useimmiten lähetettyä) ohjelmaa, jossa keskustellaan eri aiheista tavallisesti keskusteluun liittyvien aiheiden asiantuntijoiden kanssa. @fi
label: ist Moderatorin/Moderator von @de
definition: Setzt einen Akteur in Beziehung zu einer Ressource, zu der ein Akteur beiträgt, indem er eine Veranstaltung (meist eine Sendung) leitet, in der Themen üblicherweise mit Expertinnen/Experten diskutiert werden. @de
label: 是……的谈话类节目主持人 @zh-hans
definition: 将一个行为者与包括主导节目（经常是广播节目，其中讨论话题，通常有讨论相关领域专家参与）的一个行为者的贡献的一种资源关联起来。 @zh-hans
label: moderátora a következőnek: @hu
definition: Hozzákapcsol egy ágenst egy forráshoz, amely magában foglalja egy ágens közreműködését egy program, gyakran sugárzott műsor, vezetésében, amelyen témákat vitatnak meg, rendszerint a beszélgetés témájában jártas szakértők részvételével. @hu
label: moderatörüdür @tr
definition: Bir temsilciyi, genellikle tartışma ile ilgili alanlardaki uzmanların katılımıyla konuların tartışıldığı, sıklıkla yayınlanan bir programa liderlik eden bir temsilcinin katkısını içeren bir kaynakla ilişkilendirir. @tr

has modification of resource
status: Published
definition: Relates a resource to a modification that is specific to a resource and is assumed not to apply to other resources exemplifying the same resource.
type: Property
lexical alias: modificationOfResource.en
label: har note om ressourcespecifikke indholdskarakteristika @da
definition: Relaterer en ressource til en note om oplysninger om ekstra karakteristika, der er specifikke for en beskreven ressource og der antages ikke at være gyldige for andre ressourcer der eksemplificerere den samme ressource. @da
label: heeft aanpassing van resource @nl
label: له تعديل لمصدر @ar
definition: يربط بين مصدر وتعديل مخصص لمصدر ومن المفترض أنه لا ينطبق على المصادر الأخرى التي تمثل المصدر نفسه. @ar
label: muunnos aineistosta @fi
definition: Liittää aineiston sille ominaiseen muunnokseen, jonka ei oleteta sisältyvän muihin samaa aineistoa edustaviin aineistoihin. @fi
label: hat Variante einer Ressource @de
definition: Setzt eine Ressource in Beziehung zu einer Variante, die spezifisch für eine Ressource ist und von der angenommen wird, dass sie nicht auf andere Ressourcen zutrifft, die dieselbe Ressource verkörpern. @de
label: 有资源的修改 @zh-hans
definition: 将一种资源与作为一种资源特有并被认为不适用于例证同一资源之其他资源的一个修改关联起来。 @zh-hans
label: forrás módosítása a következő: @hu
definition: Hozzákapcsol egy forrást egy forrásra jellemző módosításhoz, amely feltételezhetően nem vonatkozik más, ugyanazt a forrást példázó forrásokra. @hu
has subproperty: has resource-specific carrier characteristic of early printed resource (Deprecated)
label: kaynağın düzenlenmesi ile ilişkilidir @tr
definition: Bir kaynağı, bir kaynağa özgü olan ve aynı kaynağı örnekleyen diğer kaynaklara uygulanmadığı varsayılan bir düzenlemeyle ilişkilendirir. @tr

is modified by variation as
status: Published
definition: Relates a resource to a musical resource in which melodic, thematic, or harmonic material taken from another resource forms a discrete theme, which is repeated one or more times with subsequent modifications.
type: Property
sub property of: has derivative
inverse of: is variations based on
lexical alias: modifiedByVariationAs.en
label: er ændret ved variation til @da
definition: Relaterer en ressource til en musikressource, hvori melodisk, tematisk eller harmonisk materiale taget fra det oprindelige værk danner et bestemt tema, der gentages en eller flere gange med efterfølgende ændringer. @da
label: is aangepast door variatie als @nl
label: هو معدل بتنويع كـ @ar
definition: يربط بين مصدر ومصدر موسيقي تكون فيه المواد اللحنية أو المواضعية أو التناغمية مأخوذة من مصدر آخر لتشكل مقطوعة متميزة، تتكرر مرة واحدة أو أكثر مع تعديلات لاحقة. @ar
label: variaatioaineisto @fi
definition: Liittää aineiston musiikkiaineistoon, jossa toisesta aineistosta otettu melodinen, temaattinen tai harmoninen aines muodostaa erillisen teeman, jota toistetaan muunnellen yhden tai useamman kerran. @fi
label: ist durch Variation modifiziert als @de
definition: Setzt eine Ressource in Beziehung zu einer Musikressource, in dem melodisches, thematisches oder harmonisches Material aus einer anderen Ressource ein einzelnes Thema bildet, das ein- oder mehrmals mit nachfolgenden Modifikationen wiederholt wird. @de
label: 被修改为变奏曲作为 @zh-hans
definition: 将一种资源与其旋律、主题或和声材料被取自另一种资源以形成一个不同的主题、而这个主题又经过后续变化而反复一次或多次的一种音乐资源关联起来。 @zh-hans
label: változatként módosította a következő: @hu
definition: Hozzákapcsol egy forrást egy zenei forráshoz, amelyben egy másik forrásformából átvett dallami, tematikus vagy harmonikus anyag egy különálló témát képez, amely egyszer vagy többször ismétlődik egymás utáni módosulásokkal. @hu
label: olarak varyasyonla değiştirilmiştir @tr
definition: Bir kaynağı, ardışık modifikasyonlarla bir veya daha fazla kez tekrar edilen ayrık bir tema oluşturmak üzere başka kaynaktan alınan melodik, tematik veya harmonik materyal içeren bir müzik kaynağı ile ilişkilendirir. @tr

has modifier
status: Published
lexical alias: modifier.en
definition: Relates a resource to an agent who makes changes to a resource without creating a new resource.
type: Property
sub property of: has related agent of resource
inverse of: is modifier of
label: heeft aanpasser @nl
label: له مُعدل @ar
definition: يربط مصدر بوكيل يقوم بإجراء تغييرات على مصدر دون إنشاء مصدر جديد. @ar
label: har tilpasser @da
definition: Relaterer en ressource til en agent, der laver ændringer til en ressource, uden at skabe en ny ressource. @da
label: aineiston muokkaaja @fi
definition: Liittää aineiston toimijaan, joka tekee muutoksia aineistoon luomatta uutta aineistoa. @fi
label: hat Bearbeiterin/Bearbeiter @de
definition: Setzt eine Ressource in Beziehung zu einem Akteur, der Änderungen an einer Ressource vornimmt, ohne eine neue Ressource zu erstellen. @de
label: 有修改者 @zh-hans
definition: 将一种资源与对一种资源作修改而不创建一种新资源的一个行为者关联起来。 @zh-hans
label: módosítója a következő: @hu
definition: Hozzákapcsol egy forrást egy ágenshez, amely új forrás létrehozása nélkül idéz elő változást. @hu
label: düzenleyici ile ilişkilidir @tr
definition: Bir kaynağı, yeni bir kaynak oluşturmadan kaynakta düzenleme yapan bir temsilci ile ilişkilendirir. @tr

is modifier of
status: Published
lexical alias: modifierOf.en
definition: Relates an agent to a resource that is changed by an agent without creating a new resource.
type: Property
sub property of: has related resource of agent
inverse of: has modifier
label: is aanpasser van @nl
label: هو مُعدل لـ @ar
definition: يربط بين وكيل ومصدر قام وكيل بإجراء تغييرات به دون إنشاء مصدر جديد. @ar
label: er tilpasser af @da
definition: Relaterer en agent til en ressource, der der blevet ændret af en agent, uden at skabe en ny ressource. @da
label: aineiston muokkaaja (toimija) @fi
definition: Liittää toimijan aineistoon, johon toimija tekee muutoksia luomatta uutta aineistoa. @fi
label: ist Bearbeiterin/Bearbeiter von @de
definition: Setzt einen Akteur in Beziehung zu einer Ressource, die von einem Akteur verändert wird, ohne eine neue Ressource zu erstellen. @de
label: 是……的修改者 @zh-hans
definition: 将一个行为者与被一个行为者改变而不创建一种新资源的一种资源关联起来。 @zh-hans
label: módosítója a következőnek: @hu
definition: Hozzákapcsol egy ágenst egy forráshoz, amelyet az ágens új forrás létrehozása nélkül változtat meg. @hu
label: düzenleyicisidir @tr
definition: Bir temsilciyi, yeni bir kaynak oluşturmadan bir temsilci tarafından değiştirilen bir kaynakla ilişkilendirir. @tr

is motion picture adaptation of
status: Published
definition: Relates a resource to a resource that is adapted as a motion picture.
type: Property
sub property of: is adaptation of
inverse of: is adapted as motion picture
lexical alias: motionPictureAdaptationOf.en
label: er filmatisering af @da
definition: Relaterer en ressource til en ressource, der er blevet bearbejdet som film. @da
label: is speelfilmbewerking van @nl
label: elokuvaversio aineistosta @fi
label: هو اقتباس فيلم سينمائي لـ @ar
definition: يربط بين مصدر ومصدر تم تحويره كفيلم سينمائي @ar
definition: Liittää aineiston elokuvaksi sovitettuun aineistoon. @fi
label: ist Filmbearbeitung von @de
definition: Setzt eine Ressource in Beziehung zu einer Ressource, die als Film bearbeitet ist. @de
label: 是……的电影改编 @zh-hans
definition: 将一种资源与被改编为电影的一种资源关联起来。 @zh-hans
label: mozgóképes feldolgozása a következőnek: @hu
definition: Hozzákapcsol egy forrást egy forráshoz, amelyet mozgóképként adaptáltak. @hu
label: sinema filmi uyarlamasıdır @tr
definition: Bir kaynağı, sinema filmine uyarlanmış bir kaynakla ilişkilendirir. @tr

has motion picture music
status: Published
definition: Relates a resource to a resource that is a musical resource that complements a resource that is a motion picture.
type: Property
sub property of: has music
inverse of: is music for motion picture
lexical alias: motionPictureMusic.en
label: er filmmusik @da
definition: Relaterer en ressource til en musikressource, der er anvendt i en film. @da
label: heeft speelfilmmuziek @nl
label: له موسيقى فيلم سينمائي @ar
definition: يربط بين مصدر ومصدر موسيقي يُكمل مصدرًا يمثل فيلم سينمائي. @ar
label: elokuvamusiikki @fi
definition: Liittää aineiston musiikkiaineistoon, joka täydentää elokuva-aineistoa. @fi
label: ist Filmmusik @de
definition: Setzt eine Ressource in Beziehung zu einer Musikressource, die ein Filmwerk ergänzt. @de
label: 有电影音乐 @zh-hans
definition: 将一种资源与补充作为电影的一种资源的一种音乐资源关联起来。 @zh-hans
definition: Relaciona un recurs amb un recurs que és un recurs musical que complementa un recurs que és una pel·lícula cinematogràfica. @ca
label: mozgókép zenéje a következő: @hu
definition: Hozzákapcsol egy forrást egy zenei forráshoz, amely kiegészít egy mozgókép-forrást. @hu
label: sinema filmi müziği ile ilişkilidir @tr
definition: Bir kaynağı, sinema filmi olan bir kaynağı tamamlayan bir müzik kaynağıyla ilişkilendirir. @tr

has motion picture screenplay
status: Published
definition: Relates a resource to a resource that is textual resource that complements a resource that is a motion picture.
type: Property
sub property of: has screenplay
inverse of: is screenplay for motion picture
lexical alias: motionPictureScreenplay.en
label: er filmmanuskript @da
definition: Relaterer en ressource til en ressource, der indeholder teksten til en film. @da
label: heeft speelfilmscenario @nl
label: elokuvakäsikirjoitus (aineisto) @fi
label: له سيناريو فيلم سينمائي @ar
definition: يربط بين مصدر ومصدر نصي يكمل مصدر يمثل فيلم سينمائي. @ar
definition: Liittää aineiston elokuva-aineistoon, joka käyttää käsikirjoitusta ja jota on täydennetty tekstiteoksella. @fi
label: hat Filmdrehbuch @de
definition: Setzt eine Ressource in Beziehung zu einer textlichen Ressource, die eine Filmressource ergänzt. @de
label: 有电影剧本 @zh-hans
definition: 将一种资源与作为一种文字资源并补充使用一种电影剧本的一种资源的一种资源关联起来。 @zh-hans
label: mozgókép-forgatókönyve a következő: @hu
definition: Hozzákapcsol egy forrást egy szöveges forráshoz, amely kiegészít egy forrást, ami egy mozgókép. @hu
label: sinema filmi senaryosu ile ilişkilidir @tr
definition: Bir kaynağı, sinema filmi olan bir kaynağı tamamlayan metinsel bir kaynakla ilişkilendirir. @tr

is motion picture screenplay based on
status: Published
definition: Relates a resource to a resource that is adapted as a screenplay for a motion picture.
type: Property
sub property of: is screenplay based on
inverse of: is adapted as motion picture screenplay
lexical alias: motionPictureScreenplayBasedOn.en
label: er filmmanuskript baseret på @da
definition: Relaterer en ressource til en ressource, der er blevet bearbejdet til manuskript til en film. @da
label: is speelfilmscenario gebaseerd op @nl
label: هو سيناريو فيلم سينمائي معتمد على @ar
definition: يربط بين مصدر ومصدر تم تحويره كسيناريو لفيلم سينمائي. @ar
label: elokuvakäsikirjoituksen perustana oleva aineisto @fi
definition: Liittää aineiston elokuvan käsikirjoitukseksi sovitettuun aineistoon. @fi
label: ist Filmdrehbuch basierend auf @de
definition: Setzt eine Ressource in Beziehung zu einer Ressource, die als Drehbuch für einen Film bearbeitet ist. @de
label: 是基于……的电影剧本 @zh-hans
definition: 将一种资源与被改编为电影剧本的一种资源关联起来。 @zh-hans
label: mozgókép-forgatókönyv a következő alapján: @hu
definition: Hozzákapcsol egy forrást egy műhöz, amelyet egy mozgókép forgatókönyveként adaptáltak. @hu
label: dayalı sinema filmi senaryosudur @tr
definition: Bir kaynağı, bir sinema filmi için senaryo olarak uyarlanmış bir kaynakla ilişkilendirir. @tr

has mount
status: Published
definition: Relates a resource to a physical material used for the support or backing to which the base material of a resource is attached.
type: Property
lexical alias: mount.en
label: har montage / ramme @da
definition: Relaterer en ressource til et fysisk materiale, der udgør den støtte eller bagbeklædning, som en ressources basismateriale er fastgjort på. @da
label: heeft ondersteuning @nl
label: له حامل @ar
definition: يربط بين مصدر ومادة مادية تُستخدم في التدعيم أو السند لمادة القاعدة التي يكون المصدر ملصق بها. @ar
label: aineiston tukimateriaali @fi
definition: Liittää aineiston materiaaliin, johon aineiston pohjamateriaali kiinnitetään aineiston tukemiseksi tai kannattamiseksi. @fi
label: hat Halterung @de
definition: Setzt eine Ressource in Beziehung zu einem physischen Material, das für die Halterung oder die Stütze verwendet wird, an dem das Trägermaterial einer Ressource angebracht ist. @de
label: 有衬底/底座 @zh-hans
definition: 将一种资源与用于支撑或背衬的资源的基底材料所附着的物理材料关联起来。 @zh-hans
label: foglalata a következő: @hu
definition: Hozzákapcsol egy forrást egy fizikai anyaghoz, amelyet tartóként vagy támaszként használnak, amelyhez egy forrás alapanyagát csatolták. @hu
label: montaj malzemesi ile ilişkilidir @tr
definition: Bir kaynağı, bir kaynağın temel malzemesinin bağlı olduğu destek veya taşımak için kullanılan fiziksel bir malzeme ile ilişkilendirir. @tr

has music
status: Published
definition: Relates a resource to a resource that is a musical resource that complements a resource.
type: Property
sub property of: is complemented by
inverse of: is music for
lexical alias: music.en
label: er musik @da
definition: Relaterer en ressource til en musikressource, der er anvendt i en film, et skuespil, et tv-program etc. @da
label: heeft muziek @nl
label: له موسيقى @ar
definition: يربط بين مصدر ومصدر موسيقي يُكمل مصدرًا. @ar
label: musiikkia sisältävä aineisto @fi
definition: Liittää aineiston musiikkiaineistoon, joka täydentää aineistoa. @fi
label: hat Musik @de
definition: Setzt eine Ressource in Beziehung zu einer Musikressource, die eine Ressource ergänzt. @de
label: 有音乐 @zh-hans
definition: 将一种资源与作为一种音乐资源而补充一种资源的一种资源关联起来。 @zh-hans
definition: Relaciona un recurs amb un recurs que és un recurs musical que complementa un recurs. @ca
label: zenéje a következő: @hu
definition: Hozzákapcsol egy forrást egy zenei forráshoz, amely kiegészíti a forrást. @hu
has subproperty: has incidental music
has subproperty: has motion picture music
has subproperty: is music for motion picture
has subproperty: has radio program music
has subproperty: has television program music
has subproperty: has video music
label: müzik ile ilişkilidir @tr
definition: Bir kaynağı, bir kaynağı tamamlayan bir müzik kaynağıyla ilişkilendirir. @tr

has musical director
status: Published
definition: Relates a resource to an agent who contributes to a resource by coordinating the activities of composers, sound editors, and sound mixers for a moving image production or for a musical or dramatic presentation or entertainment.
type: Property
sub property of: has contributor (Deprecated)
inverse of: is musical director of
lexical alias: musicalDirector.en
label: har orkesterleder @da
definition: Relaterer en ressource til en agent, der har bidraget til een ressource ved at koordinere komponistens, tonemesterens og lydmixernes aktiviteter ved en levende billedproduktion eller en musikalsk eller dramatisk præsentation eller i underholdning. @da
label: heeft muzikaal director @nl
label: musiikillinen johtaja aineistossa @fi
label: له مُخرج موسيقي @ar
definition: يربط مصدر بوكيل يُساهم في مصدر من خلال تنسيق أنشطة ملحني؛ ومحرري؛ و مازجي الصوت لإنتاج فيلم؛ أو لعرض موسيقي أو درامي أو ترفيهي. @ar
definition: Liittää aineiston toimijaan, joka on aineistossa osallisena koordinoimalla säveltäjien, äänileikkaajien ja äänimiksaajien toimintaa elokuvatuotannossa tai musiikki- tai näytelmäesityksessä. @fi
label: hat Musikalische Leiterin/Musikalischen Leiter @de
definition: Setzt eine Ressource in Beziehung zu einem Akteur, der zu einer Ressource beiträgt, indem er die Arbeit der Komponistin/des Komponisten, der Tonbearbeiterin/des Tonbearbeiters und der Tonmeisterin/des Tonmeisters für eine Bewegtbildproduktion oder eine musikalische oder dramatische Darbietung oder Aufführung koordiniert. @de
label: 有音乐总监 @zh-hans
definition: 将一种资源与通过为动态图像制作或者为音乐或戏剧呈现或娱乐协调作曲者、音响编辑、音响师活动而对一种资源有贡献的一个行为者关联起来。 @zh-hans
label: zenei rendezője a következő: @hu
definition: Hozzákapcsol egy forrást egy ágenshez, amely hozzájárul egy forráshoz azzal, hogy mozgókép-produkcióban, zenei, vagy drámai előadásban, vagy szórakoztató műsorban összehangolja zeneszerzők, hangszerkesztők és hangkeverők cselekedeteit. @hu
label: müzik yönetmeni ile ilişkilidir @tr
definition: Bir kaynağı, hareketli bir görüntü yapımı veya müzikal ya da dramatik bir sunum veya eğlence için bestecilerin, ses editörlerinin ve ses birleştiricilerin faaliyetlerini koordine ederek bir kaynağa katkıda bulunan bir temsilci ile ilişkilendirir. @tr

is musical director of
status: Published
definition: Relates an agent to a resource that includes a contribution by an agent of coordinating the activities of composers, sound editors, and sound mixers for a moving image production or for a musical or dramatic presentation or entertainment.
type: Property
sub property of: is contributor of (Deprecated)
inverse of: has musical director
lexical alias: musicalDirectorOf.en
label: er musikdirektør for @da
definition: Relaterer en agent, der har bidraget til en ressource ved at koordinere komponistens, tonemesterens og lydmiksernes aktiviteter ved en levende billedproduktion eller en musikalsk eller dramatisk præsentation eller underholdning til en ressource. @da
label: is muzikaal director van @nl
label: هو مُدير موسيقي لـ @ar
definition: يربط بين وكيل ومصدر يتضمن إسهام وكيل في تنسيق أنشطة ملحني، محرري، ومازجي الصوت لإنتاج فيلم أو لعرض موسيقي أو درامي أو ترفيهي. @ar
label: musiikillinen johtaja (toimija) aineistossa @fi
definition: Liittää toimijan aineistoon, jossa toimija on osallisena koordinoimalla säveltäjien, äänileikkaajien ja äänimiksaajien toimintaa elokuvatuotannossa tai musiikki- tai näytelmäesityksessä. @fi
label: ist musikalische Leiterin/musikalischer Leiter von @de
definition: Setzt einen Akteur in Beziehung zu einer Ressource, zu der ein Akteur beiträgt, indem er die Arbeit der Komponistin/des Komponisten, der Tonarbeiterin/des Tonbearbeiters und der Tonmeisterin/des Tonmeisters für eine Bewegtbildproduktion oder eine musikalische oder dramatische Darbietung oder Aufführung koordiniert. @de
label: 是……的音乐总监 @zh-hans
definition: 将一个行为者与包括为动态图像制作或者为音乐或戏剧呈现或娱乐协调作曲者、音响编辑、音响师活动的一个行为者的贡献的一种资源关联起来 @zh-hans
label: zenei rendezője a következőnek: @hu
definition: Hozzákapcsol egy ágenst egy forráshoz, amely magában foglalja az ágens közreműködését zeneszerzők, hangszerkesztők és hangkeverők feladatainak összehangolásában mozgókép-produkcióban, zenei vagy drámai előadásban vagy szórakoztató műsorban. @hu
label: müzik yönetmenidir @tr
definition: Bir temsilciyi, hareketli bir görüntü prodüksiyonu veya müzikal veya dramatik bir sunum veya eğlence için bestecilerin, ses editörlerinin ve ses karıştırıcılarının faaliyetlerini koordine eden bir temsilcisinin katkısını içeren bir kaynakla ilişkilendirir. @tr

is musical setting of
status: Published
definition: Relates a resource to a resource that provides text for a non-dramatic musical resource, other than an oratorio.
type: Property
sub property of: has source
inverse of: is set to music as
lexical alias: musicalSettingOf.en
label: er musiksætning af @da
definition: Relaterer en ressource til en ressource, der indeholder tekst til en ressource af et ikke-dramatisk musikværk, bortset fra et oratorium. @da
label: is muziek gezet op @nl
label: musiikkiteoksen teksti (aineisto) @fi
label: هو إعداد موسيقي لـ @ar
definition: يربط بين مصدر ومصدر يقدم نصًا لعمل موسيقي غير درامي، بخلاف الموسيقى الدينية. @ar
definition: Liittää aineiston aineistoon, joka on ei-näytelmällisen musiikkiteoksen (muun kuin oratorion) teksti. @fi
label: ist Vertonung von @de
definition: Setzt eine Ressource in Beziehung zu einer Ressource, die Text für eine nicht dramatische Musikressource (kein Oratorium) liefert. @de
label: 是……的配乐 @zh-hans
definition: 将一种资源与为一种非戏剧音乐作品（清唱剧除外）提供文本的资源关联起来。 @zh-hans
label: zenei átirata a következőnek: @hu
definition: Hozzákapcsol egy forrást egy forráshoz, amely szöveggel lát el egy nem oratórium nem-drámai zenei forrást. @hu
label: müzikal düzenlemesidir @tr
definition: Bir kaynağı, oratoryodan başka, dramatik olmayan bir müzik kaynağı için metin sağlayan başka bir kaynakla ilişkilendirir. @tr

is musical theatre adaptation of
status: Published
definition: Relates a resource to a resource that is adapted as a musical theatre resource.
type: Property
sub property of: is adaptation of
inverse of: is adapted as musical theatre
lexical alias: musicalTheatreAdaptationOf.en
label: er musikteaterbearbejdelse af @da
definition: Relaterer en ressource til en ressource, der er blevet bearbejdet til musikteater-ressource. @da
label: is muziektheaterbewerking van @nl
label: هو اقتباس مسرحي موسيقي لـ @ar
definition: يربط بين مصدر ومصدر مقتبس كمصدر مسرحي موسيق. @ar
label: musikaaliversio aineistosta @fi
definition: Liittää aineiston musikaaliksi sovitettuun aineistoon. @fi
label: ist Musiktheaterbearbeitung von @de
definition: Setzt eine Ressource in Beziehung zu einer Ressource, die als Musiktheaterressource bearbeitet ist. @de
label: 是……的音乐戏剧改编 @zh-hans
definition: 将一种资源与被改编为一种音乐戏剧资源的一种资源关联起来。 @zh-hans
label: zeneszínházi feldolgozása a következőnek: @hu
definition: Hozzákapcsol egy forrást egy forráshoz, amelyet zeneszínházi forrásként adaptáltak. @hu
label: müzikal tiyatro uyarlamasıdır @tr
definition: Bir kaynağı, müzikal tiyatro kaynağı olarak uyarlanmış bir kaynakla ilişkilendirir. @tr

is music for
status: Published
definition: Relates a resource to a resource that is complemented by a musical resource.
type: Property
sub property of: is complemented by
inverse of: has music
lexical alias: musicFor.en
label: er musik til @da
definition: Relaterer en ressource til en ressource såsom en film, et skuespil, et tv-program etc., der anvender en musikressource. @da
label: is muziek voor @nl
label: هي موسيقى لـ @ar
definition: يربط بين مصدر ومصدر يكمله مصدر موسيقي. @ar
label: musiikki aineistoon @fi
definition: Liittää aineiston aineistoon, jota täydentää musiikkiaineisto. @fi
label: ist Musik für @de
definition: Setzt eine Ressource in Beziehung zu einer Ressource, die durch eine Musikressource vervollständigt wird. @de
label: 是用于……的音乐 @zh-hans
definition: 将一种资源与被一种音乐资源补充的一种资源关联起来。 @zh-hans
label: zene a következőhöz: @hu
definition: Hozzákapcsol egy forrást egy forráshoz, amelyet egy zenei forrás egészít ki. @hu
has subproperty: is incidental music for
has subproperty: is music for radio program
has subproperty: is music for television program
has subproperty: is music for video
definition: Relaciona un recurs amb un recurs que es complementa amb un recurs musical. @ca
label: müziğidir @tr
definition: Bir kaynağı, müzikal bir kaynakla tamamlanan bir kaynakla ilişkilendirir. @tr

is music for motion picture
status: Published
definition: Relates a resource to a resource that is a motion picture that is complemented by a musical resource.
type: Property
sub property of: has music
inverse of: has motion picture music
lexical alias: musicForMotionPicture.en
label: er musik til film @da
definition: Relaterer en ressource til en ressource, der anvender en musikressource i en film. @da
label: is muziek voor speelfilm @nl
label: هي موسيقى لفيلم سينمائي @ar
definition: يربط بين مصدر ومصدر هو فيلم سينمائي يُكمله مصدر موسيقي. @ar
label: musiiki elokuvaan (aineisto) @fi
definition: Liittää aineiston aineistoon, joka on musiikkiaineistolla täydennetty elokuva. @fi
label: ist Musik für Film @de
definition: Setzt eine Ressource in Beziehung zu einer Filmressource, die durch eine Musikressource vervollständigt wird. @de
label: 是用于电影的音乐 @zh-hans
definition: 将一种资源与补充作为电影的一种资源的一种音乐资源关联起来。 @zh-hans
label: zene a következő mozgóképhez: @hu
definition: Hozzákapcsol egy forrást egy mozgókép-forráshoz, amelyet egy zenei forrás egészít ki. @hu
label: sinema filmi müziğidir @tr
definition: Bir kaynağı, müzikal kaynakla tamamlanan bir sinema filmi olan bir kaynakla ilişkilendirir. @tr

is music for radio program
status: Published
definition: Relates a resource to a resource that is a radio program that is complemented by a musical resource.
type: Property
sub property of: is music for
inverse of: has radio program music
lexical alias: musicForRadioProgram.en
label: er musik til radioprogram @da
definition: Relaterer en ressource til en ressource, der anvender en musikressource i et radioprogram. @da
label: is muziek voor radioprogramma @nl
label: هي موسيقى لبرنامج إذاعي @ar
definition: يربط بين مصدر ومصدر هو برنامج إذاعي يُكمله مصدر موسيقي. @ar
label: musiikki radio-ohjelmaan (aineisto) @fi
definition: Liittää aineiston aineistoon, joka on musiikkiaineistolla täydennetty radio-ohjelma. @fi
label: ist Musik für Hörfunksendung @de
definition: Setzt eine Ressource in Beziehung zu einer Hörfunksendung (Ressource), die durch eine Musikressource vervollständigt wird. @de
label: 是用于广播节目的音乐 @zh-hans
definition: 将一种资源与补充作为广播节目的一种资源的一种音乐资源关联起来。 @zh-hans
label: zene a következő rádióműsorhoz: @hu
definition: Hozzákapcsol egy forrást egy rádióműsor-forráshoz, amelyet egy zenei forrás egészít ki. @hu
label: radyo programı müziğidir @tr
definition: Bir kaynağı, müzikal kaynakla tamamlanan bir radyo programı olan bir kaynakla ilişkilendirir. @tr

is music for television program
status: Published
definition: Relates a resource to a resource that is a television program that is complemented by a musical resource.
type: Property
sub property of: is music for
inverse of: has television program music
lexical alias: musicForTelevisionProgram.en
label: er musik til tv-program @da
definition: Relaterer en ressource til en ressource, der anvender en musikressource i et tv-program. @da
label: is muziek voor televisieprogramma @nl
label: هي موسيقى لبرنامج تلفزيوني @ar
definition: يربط بين مصدر ومصدر هو برنامج تلفزيوني يُكمله مصدر موسيقي. @ar
label: televisio-ohjelman musiikki (aineisto) @fi
definition: Liittää aineiston aineistoon, joka on musiikkiaineistolla täydennetty televisio-ohjelma. @fi
label: ist Musik für Fernsehsendung @de
definition: Setzt eine Ressource in Beziehung zu einer Fernsehsendung (Ressource), die durch eine Musikressource vervollständigt wird. @de
label: 是用于电视节目的音乐 @zh-hans
definition: 将一种资源与被一种音乐资源补充的作为电视节目的一种资源关联起来。 @zh-hans
label: zene a következő televízióműsorhoz: @hu
definition: Hozzákapcsol egy forrást egy televízióműsor-forráshoz, amelyet egy zenei forrás egészít ki. @hu
label: televizyon programı müziğidir @tr
definition: Bir kaynağı, müzik kaynağıyla tamamlanan bir televizyon programı olan bir kaynakla ilişkilendirir. @tr

is music for video
status: Published
definition: Relates a resource to a resource that is a video that is complemented by a musical resource.
type: Property
sub property of: is music for
inverse of: has video music
lexical alias: musicForVideo.en
label: er musik til video @da
definition: Relaterer en ressource til en ressource, der anvender en musikressource i en video. @da
label: is muziek voor video @nl
label: هي موسيقى لفيديو @ar
definition: يربط بين مصدر ومصدر هو فيديو يُكمله مصدر موسيقي. @ar
label: musiikki videoon (aineisto) @fi
definition: Liittää aineiston musiikkiaineistolla täydennettyyn videoaineistoon. @fi
label: ist Musik für Video @de
definition: Setzt eine Ressource in Beziehung zu einem Video (Ressource), das durch eine Musikressource vervollständigt wird. @de
label: 是用于视频的音乐 @zh-hans
definition: 将一种资源与被一种音乐资源补充的作为视频的一种资源关联起来。 @zh-hans
label: videózene a következőhöz: @hu
definition: Hozzákapcsol egy forrást videóforráshoz, amelyet egy zenei forrás egészít ki. @hu
label: video müziğidir @tr
definition: Bir kaynağı, müzik kaynağıyla tamamlanan bir video olan bir kaynakla ilişkilendirir. @tr

has music programmer
status: Published
type: Property
lexical alias: musicProgrammer.en
definition: Relates a resource to an agent who contributes to a musical resource by using electronic audio devices or computer software to generate sounds.
scope note: The creation of a new musical resource is excluded.
inverse of: is music programmer of
sub property of: has contributor (Deprecated)
see also: has composer
label: har musikprogrammør @da
definition: Relaterer en ressource til en agent, der bidrager til en musikressource ved at bruge elektronisk lydudstyr og/eller computersoftware til at generere lyd. @da
scope note: Skabelse af en ny musikressource er ikke omfattet. @da
label: heeft music programmer @nl
label: له مبرمج موسيقي @ar
definition: يربط مصدر بوكيل يُساهم في مصدر من خلال في استخدام أجهزة الصوت الإلكترونية أو برمجيات الحاسب لتوليد أصوات. @ar
scope note: يُستبعد إنشاء مصدر موسيقي جديد. @ar
label: musiikkiohjelmoija aineistossa @fi
definition: Liittää aineiston toimijaan, joka on osallisena aineistossa tuottamalla ääniä sähköisillä äänilaitteilla tai tietokoneohjelmilla. @fi
scope note: Ei koske uuden musiikkiteoksen luomista. @fi
label: hat Musik-Programmiererin/Musik-Programmierer @de
definition: Setzt eine Ressource in Beziehung zu einem Akteur, der zu einer Ressource beiträgt, indem er durch das Einsetzen elektronischer Audio-Geräte oder von Computerprogrammen Klangeffekte erzeugt. @de
scope note: Darunter fällt nicht das Schaffen einer neuen Musikressource. @de
label: 有音乐编程者 @zh-hans
definition: 将一种资源与通过使用电子音频设备或计算机软件产生声音而对一种音乐资源作出贡献的一个行为者关联起来。 @zh-hans
scope note: 不包括新音乐资源的创作。 @zh-hans
definition: Relaciona un recurs amb un agent que contribueix a un recurs musical usant mecanismes electrònics àudio o programari d’ordinador per generar sons. @ca
label: zeneprogramozója a következő: @hu
definition: Hozzákapcsol egy forrást egy ágenshez, amely egy forráshoz hozzájárul azzal, hogy hangok előállítására elektronikus audiókészülékeket és/vagy számítógépes szoftvert használ. @hu
scope note: Egy új zenei forrás létrehozása nem tartozik ide. @hu
label: müzik programcısı ile ilişkilidir @tr
definition: Bir kaynağı, ses üretmek için elektronik ses cihazları veya bilgisayar yazılımı kullanarak bir kaynağa katkıda bulunan bir temsilci ile ilişkilendirir. @tr
scope note: Yeni bir müzik kaynağının oluşturulması hariçtir. @tr

is music programmer of
status: Published
type: Property
lexical alias: musicProgrammerOf.en
definition: Relates an agent to a musical resource that incorporates a contribution by an agent of using electronic audio devices or computer software to generate sounds.
inverse of: has music programmer
sub property of: has other agent associated with a resource (Deprecated)
see also: is composer of
label: er musikprogrammør i @da
definition: Relaterer en agent til en musikressource, der inkorporerer et bidrag ved at bruge elektronisk lydapparatur og/eller computersoftware til at skabe lyd. @da
label: is music programmer van @nl
label: هو مبرمج موسيقي لـ @ar
definition: يربط بين وكيل ومصدر يتضمن إسهام وكيل في استخدام أجهزة الصوت الإلكترونية أو برمجيات الحاسب لتوليد أصوات. @ar
label: musiikkiohjelmoija (toimija) aineistossa @fi
definition: Liittää toimijan musiikkiaineistoon, jossa toimija on osallisena tuottamalla ääniä sähköisillä äänilaitteilla tai tietokoneohjelmilla. @fi
label: ist Musik-Programmiererin/Musik-Programmierer von @de
definition: Setzt einen Akteur in Beziehung zu einer musikalischen Ressource, zu der ein Akteur beiträgt, indem er durch das Einsetzen elektronischer Audio-Geräte oder von Computerprogrammen Klangeffekte erzeugt. @de
label: 是……的音乐编程者 @zh-hans
definition: 将一个行为者与包括使用电子音频设备或计算机软件产生声音的一个行为者的贡献的一种音乐资源关联起来。 @zh-hans
label: zeneprogramozója a következőnek: @hu
definition: Hozzákapcsol egy ágenst egy forráshoz, amely magában foglalja az ágens közreműködését hangok generálásában elektronikus audioeszközök vagy számítógépes szoftver használatával. @hu
label: müzik programcısıdır @tr
definition: Bir temsilciyi, ses üretmek için elektronik ses cihazları veya bilgisayar yazılımı kullanan bir temsilcinin katkısını içeren bir müzik kaynağıyla ilişkilendirir. @tr

has name of agent
status: Published
definition: Relates an agent to a nomen that is an appellation of agent in natural language and phrasing used in common discourse.
type: Property
lexical alias: nameOfAgent.en
label: har agents navn @da
definition: Relaterer en ressource til et ord, tegn eller gruppe af ord og/eller tegn, som en agent er kendt under. @da
sub property of: has appellation of entity
inverse of: is name of agent of
label: heeft naam van actor @nl
label: toimijan nimi @fi
label: له اسم وكيل @ar
definition: يربط بين وكيل وتسمية وكيل فىي اللغة الطبيعية وفي العبارات المستخدمة في الخطاب العام. @ar
definition: Liittää toimijan luonnollisen kielen ja sanamuodon mukaiseen, yleisessä diskurssissa käytettyyn toimijan nimitykseen. @fi
label: hat Namen eines Akteurs @de
definition: Setzt einen Akteur in Beziehung zu einer Bezeichnung für einen Akteur in natürlicher Sprache und Ausdrucksweise, die beim normalen Sprechen und Schreiben verwendet wird. @de
label: 有行为者的名称 @zh-hans
definition: 将一个行为者与作为用自然语言和普通话语措词表达的行为者的称谓的一个命名关联起来。 @zh-hans
definition: Relaciona un agent amb un nomen que és una apel·lació d’agent en llenguatge i frases naturals usada en el discurs comú. @ca
label: ágens neve a következő: @hu
definition: Hozzákapcsol egy ágenst egy ágens természetes nyelvi megnevezéséhez és a közbeszéd során használt megfogalmazásához. @hu
has subproperty: has preferred name of agent
has subproperty: has variant name of agent
label: temsilcinin adı ile ilişkilidir @tr
definition: Bir temsilciyi, doğal dildeki bir temsilci ünvanıyla ve ortak söylemde kullanılan ifadelerle ilişkilendirir. @tr

is name of agent of
status: Published
sub property of: is appellation of entity of
type: Property
lexical alias: nameOfAgentOf.en
definition: Relates an appellation of agent in natural language and phrasing used in common discourse to an agent.
inverse of: has name of agent
label: is naam van actor van @nl
label: هو اسم لوكيل لـ @ar
definition: يربط بين وكيل وتسمية وكيل فىي اللغة الطبيعية وفي العبارات المستخدمة في الخطاب العام. @ar
label: er agentnavn på @da
definition: Relaterer en agentbenævnelse på naturligt sprog og med naturlig formulering, anvendt i almindelig diskurs til en agent. @da
label: toimijan nimi @fi
definition: Liittää toimijaan luonnollisella kielellä olevan toimijan nimityksen, jota käytetään yleisessä diskurssissa. @fi
label: ist Name eines Akteurs von @de
definition: Setzt eine Bezeichnung für einen Akteur in natürlicher Sprache und Ausdrucksweise, die beim normalen Sprechen und Schreiben verwendet wird, in Beziehung zu einem Akteur. @de
label: 是……的行为者的名称 @zh-hans
definition: 将一个用自然语言和普通话语措词表达的行为者的称谓与一个行为者关联起来。 @zh-hans
label: ágensneve a következőnek: @hu
definition: Hozzákapcsolja egy ágenshez egy ágens természetes nyelvi megnevezését és a közbeszéd során használt megfogalmazását. @hu
has subproperty: is preferred name of agent of
has subproperty: is variant name of agent of
has subproperty: is fuller form of name of
has subproperty: is given name of
has subproperty: is surname of
label: temsilcisinin adıdır @tr
definition: Doğal dildeki bir temsilci sıfatını ve ortak söylemde kullanılan ifadeleri bir temsilci ile ilişkilendirir. @tr

has name of distributor
status: Published
definition: Relates a resource to a nomen that is a name of an agent who is responsible for distributing a published resource.
type: Property
lexical alias: nameOfDistributor.en
label: har distributørnavn @da
definition: Relaterer en ressource til et navn på agent, der er ansvarlig for distribution af en ressource i publiceret form. @da
inverse of: is name of distributor of
sub property of: has appellation of entity
label: heeft naam van distributeur @nl
label: له اسم موزع @ar
definition: يربط بين مصدر واسم وكيل مسؤول عن توزيع مصدر منشور. @ar
label: aineiston jakelijan nimi @fi
definition: Liittää aineiston julkaistun aineiston jakelusta vastaavan toimijan nimeen. @fi
label: hat Vertriebsnamen @de
definition: Setzt eine Ressource in Beziehung zum Namen eines Akteurs, der für den Vertrieb einer veröffentlichten Ressource verantwortlich ist. @de
label: 有发行者名称 @zh-hans
definition: 将一种资源与作为负责一种出版资源的发行的一个行为者的名称的一个命名关联起来。 @zh-hans
definition: Relaciona un recurs amb un nomen que és un nom d’un agent que és responsable de la distribució d’un recurs publicat. @ca
label: terjesztő neve a következő: @hu
definition: Hozzákapcsol egy forrást egy ágens nevéhez, amely felelős egy kiadott forrás terjesztéséért. @hu
label: dağıtımcının adı ile ilişkilidir @tr
definition: Bir kaynağı, yayımlanmış bir kaynağın dağıtımından sorumlu olan bir temsilcinin adıyla ilişkilendirir. @tr

is name of distributor of
status: Published
type: Property
lexical alias: nameOfDistributorOf.en
inverse of: has name of distributor
definition: Relates a nomen to a resource that involves a responsibility of an agent for distributing a published resource.
sub property of: is appellation of entity of
label: is naam van distributeur van @nl
label: هو اسم موزع لـ @ar
definition: يربط تسمية بمصدر ينطوي على مسؤولية وكيل عن توزيع مصدر منشور. @ar
label: er navn på distributør af @da
definition: Relaterer et nomen til en ressource, som involverer ett agentansvar for at distribuere en udgiven ressource. @da
label: aineiston jakelijan nimi @fi
definition: Liittää nomenin aineistoon, johon liittyy toimijan vastuu julkaistun aineiston jakelusta. @fi
label: ist Vertriebsname von @de
definition: Setzt ein Nomen in Beziehung zu einer Ressource, bei der ein Akteur für den Vertrieb einer veröffentlichten Ressource verantwortlich ist. @de
label: 是……的发行者的名称 @zh-hans
definition: 将一个命名与涉及发行一种出版资源的一个行为者的责任的一种资源关联起来。 @zh-hans
label: neve a következő terjesztőjének: @hu
definition: Hozzákapcsol egy noment egy forráshoz, amelyhez hozzátartozik egy ágens felelőssége egy forrás terjesztéséért. @hu
label: dağıtımcısının adıdır @tr
definition: Bir ismi, yayınlamış bir kaynağın dağıtımında temsilcinin sorumluluğunu içeren kaynakla ilişkilendirir. @tr

has name of entity
status: Published
type: Property
lexical alias: nameOfEntity.en
definition: Relates an entity to a nomen that is an appellation of entity in natural language and phrasing used in common discourse.
sub property of: has appellation of entity
inverse of: is name of entity of
label: heeft naam van entiteit @nl
label: له اسم لكيان @ar
definition: يربط بين كيان وتسمية لكيان في اللغة الطبيعية وفي العبارات المستخدمة في الخطاب العام. @ar
label: har navn på entitet @da
definition: Relaterer en entitet til en benævnelse på entitet på naturligt sprog og med formuleringer brugt i almindelig diskurs. @da
label: entiteetin nimi @fi
definition: Liittää entiteetin entiteetin yleisessä diskurssissa luonnollisella kielellä ja sananmuodolla käytettyyn nimitykseen. @fi
label: hat Namen einer Entität @de
definition: Setzt eine Entität in Beziehung zu einer Bezeichnung für eine Entität in natürlicher Sprache und Ausdrucksweise, die beim normalen Sprechen und Schreiben verwendet wird. @de
label: 有实体的名称 @zh-hans
definition: 将一个实体与作为用自然语言和普通话语措词表达的实体的称谓的一个命名关联起来。 @zh-hans
definition: Relaciona una entitat amb un nomen que és una apel·lació d’entitat en llenguatge i frases naturals usada en el discurs comú. @ca
label: entitás neve a következő: @hu
definition: Hozzákapcsol egy entitást egy entitás természetes nyelvi megnevezéséhez és közbeszédben használt megfogalmazásához. @hu
has subproperty: has name of place
has subproperty: has name of timespan
has subproperty: has preferred name of entity
has subproperty: has variant name of entity
label: varlığın adı ile ilişkilidir @tr
definition: Bir varlığı, ortak söylemde kullanılan ifade ve doğal dildeki varlık unvanlıyla ilişkilendirir. @tr

is name of entity of
status: Published
type: Property
lexical alias: nameOfEntityOf.en
sub property of: is appellation of entity of
inverse of: has name of entity
definition: Relates a nomen to an entity that has an appellation of entity in natural language and phrasing used in common discourse.
label: is naam van entiteit van @nl
label: هو اسم لكيان لـ @ar
definition: يربط بين تسمية وكيان له تسمية لكيان في اللغة الطبيعية وفي العبارات المستخدمة في الخطاب العام. @ar
label: er navn på entitet af @da
definition: Relaterer et nomen til en entitet, som har en entitetsbenævnelse på naturligt sprog og med formuleringer brugt i almindelig diskurs. @da
label: entiteetin nimi @fi
definition: Liittää nomenin entiteettiin, jolla on yleisessä diskurssissa käytetty nimitys luonnollisella kielellä ja sananmuodolla. @fi
label: ist Name einer Entität von @de
definition: Setzt ein Nomen in Beziehung zu einer Entität, die über eine Bezeichnung für eine Entität in natürlicher Sprache und Ausdrucksweise verfügt, die beim normalen Sprechen und Schreiben verwendet wird. @de
label: 是……的实体的名称 @zh-hans
definition: 将一个命名与有用自然语言和普通话语措词表达的实体的称谓的一个实体关联起来。 @zh-hans
label: entitásneve a következőnek: @hu
definition: Hozzákapcsol egy noment egy entitáshoz, amelynek van egy természetes nyelvű entitás-megnevezése és közbeszédben használt megfogalmazása. @hu
has subproperty: is name of place of
has subproperty: is name of timespan of
has subproperty: is preferred name of entity of
has subproperty: is variant name of entity of
label: varlığının adıdır @tr
definition: Bir ismi, yerel dilde varlık unvanına ve ortak söylemde kullanılan ifadelere sahip bir varlıkla ilişkilendirir. @tr

has name of manufacturer
status: Published
definition: Relates a resource to a nomen that is a name of an agent who is responsible for printing, duplicating, casting, or other method of manufacturing a published resource.
type: Property
lexical alias: nameOfManufacturer.en
label: har producentnavn @da
definition: Relaterer en ressource til et navn på agent, der er ansvarlig for trykning, duplikering, støbning etc. af en ressource i publiceret form. @da
inverse of: is name of manufacturer of
sub property of: has appellation of entity
label: heeft naam van vervaardiger @nl
label: له اسم صانع @ar
definition: يربط بين مصدر وتسمية وهي اسم وكيل مسؤول عن طبع، نسخ، طَرَح، أو مرتبط بأي طريقة أخرى بتصنيع مصدر منشور. @ar
label: aineiston valmistajan nimi @fi
definition: Liittää aineiston nomeniin, joka on julkaistun aineiston painamisesta, monistamisesta, kirjasinten valamisesta tai muusta valmistustavasta vastaavan toimijan nimi. @fi
label: hat Herstellername @de
definition: Setzt eine Ressource in Beziehung zum Namen eines Akteurs, der für den Druck, die Vervielfältigung, den Guss oder eine andere Herstellungsmethode einer veröffentlichten Ressource verantwortlich ist. @de
label: 有生产者名称 @zh-hans
definition: 将一种资源与作为负责印刷、复制、铸造或其他方法生产一种出版资源的一个行为者之名称的一个命名关联起来。 @zh-hans
label: gyártó neve a következő: @hu
definition: Hozzákapcsol egy forrást egy nomenhez, amely egy kiadott forrás nyomtatásáért, sokszorosításáért, öntéséért vagy egyéb gyártási módszeréért felelős ágens neve. @hu
label: üreticinin adı ile ilişkilidir @tr
definition: Bir kaynağı, yayınlanmış bir kaynağın basılması, çoğaltılması, dökümü veya başka bir yöntemle üretilmesinden sorumlu olan bir temsilcinin adı olan isimle ilişkilendirir. @tr

is name of manufacturer of
status: Published
type: Property
lexical alias: nameOfManufacturerOf.en
inverse of: has name of manufacturer
definition: Relates a nomen to a resource that involves a responsibility of an agent for printing, duplicating, casting, etc., a published resource.
sub property of: is appellation of entity of
label: is naam van vervaardiger van @nl
label: هو اسم لمُصّنع لـ @ar
definition: يربط تسمية بمصدر ينطوي على مسؤولية وكيل عن طباعة، نسخ، طَرَح...إلخ، مصدر منشور. @ar
label: er navn på producent af @da
definition: Relaterer et nomen til en ressource, som involverer ett agentansvar for at for trykning, duplikering, støbning etc. af en udgiven ressource. @da
label: aineiston valmistajan nimi @fi
definition: Liittää nomenin aineistoon, johon liittyy toimijan vastuu julkaistun aineiston painamisesta, monistamisesta, kirjasinten valamisesta tms. @fi
label: ist Herstellername von @de
definition: Setzt ein Nomen in Beziehung zu einer Ressource, bei der ein Akteur für den Druck, die Vervielfältigung, den Guss und so weiter einer veröffentlichten Ressource verantwortlich ist. @de
label: 是……的生产者的名称 @zh-hans
definition: 将一个命名与涉及一种出版资源的印刷、复制、铸造等的一个行为者的责任的一种资源关联起来。 @zh-hans
label: neve a következő gyártójának: @hu
definition: Hozzákapcsol egy noment egy forráshoz, amelyhez hozzátartozik egy ágens felelőssége a kiadott forrás nyomtatásáért, sokszorosításáért, öntéséért, stb. @hu
label: üreticisinin adıdır @tr
definition: Bir ismi, yayımlanmış bir kaynağın basılması, çoğaltılması, yayınlanması vb. için bir temsilcinin sorumluluğunu içeren kaynakla ilişkilendirir. @tr

has name of place
status: Published
definition: Relates a place to a nomen that is an appellation of place in natural language and phrasing used in common discourse.
type: Property
lexical alias: nameOfPlace.en
label: har navn på et sted @da
definition: Relaterer en ressource til et ord, tegn eller gruppe af ord og/eller tegn, som et sted er kendt under. @da
sub property of: has name of entity
inverse of: is name of place of
label: heeft naam van plaats @nl
label: paikan nimi @fi
label: له اسم مكان @ar
definition: يربط مكان بتسمية مكان فىي اللغة الطبيعية وفي العبارات المستخدمة في الخطاب العام. @ar
definition: Liittää paikan luonnollisen kielen ja sanamuodon mukaiseen, yleisessä diskurssissa käytettyyn paikan nimitykseen. @fi
label: hat Namen eines Geografikums @de
definition: Setzt ein Geografikum in Beziehung zu einer Bezeichnung für ein Geografikum in natürlicher Sprache und Ausdrucksweise, die beim normalen Sprechen und Schreiben verwendet wird. @de
label: 有地点的名称 @zh-hans
definition: 将一个地点与作为用自然语言和普通话语措词表达的一个地点之称谓的一个命名关联起来。 @zh-hans
definition: Relaciona un lloc amb un nomen que és una apel·lació de lloc en llenguatge i frases naturals usada en el discurs comú. @ca
label: helyneve a következő: @hu
definition: Hozzákapcsol egy helyet egy hely természetes nyelvi megnevezéséhez és a közbeszéd során használt megfogalmazásához. @hu
has subproperty: has preferred name of place
has subproperty: has variant name of place
label: yerin adı ile ilişkilidir @tr
definition: Bir yeri, doğal dilde ve ortak söylemde kullanılan ifadelerde yer alan bir yer adlandırmasıyla ilişkilendirir. @tr

is name of place of
status: Published
sub property of: is name of entity of
type: Property
lexical alias: nameOfPlaceOf.en
definition: Relates a nomen to a place that has a name in natural language and phrasing used in common discourse.
inverse of: has name of place
label: is naam van plaats van @nl
label: هو اسم لمكان لـ @ar
definition: يربط بين تسمية ومكان له اسم في اللغة الطبيعية وفي العبارات المستخدمة في الخطاب العام. @ar
label: er stednavn på @da
definition: Relaterer et nomen til et sted, som har et navn på naturligt sprog og formuleringer anvendt i allmindelig diskurs. @da
label: paikan nimi @fi
definition: Liittää nomenin paikkaan, jolla on yleisessä diskurssissa käytetty nimi luonnollisella kielellä ja sananmuodolla. @fi
label: ist Name eines Geografikums von @de
definition: Setzt ein Nomen in Beziehung zu einem Geografikum, das über einen Namen in natürlicher Sprache und Ausdrucksweise verfügt, die beim normalen Sprechen und Schreiben verwendet wird. @de
label: 是……的地点的名称 @zh-hans
definition: 将一个命名与有用自然语言和普通话语措词表达的名称的一个地点关联起来。 @zh-hans
label: helyneve a következőnek: @hu
definition: Hozzákapcsol egy noment egy helyhez, amelynek van természetes nyelvű megnevezése és a közbeszédben használt megfogalmazása. @hu
has subproperty: is preferred name of place of
has subproperty: is variant name of place of
label: yerinin adıdır @tr
definition: Bir ismi, yerel dilde adı olan bir yerle ve yaygın söylemde kullanılan ifadelerle ilişkilendirir. @tr

has name of producer
status: Published
definition: Relates a resource to a nomen that is a name of an agent who is responsible for inscribing, fabricating, constructing, or other method of producing an unpublished resource.
type: Property
lexical alias: nameOfProducer.en
label: har producers navn @da
definition: Relaterer en ressource til et navn på agent, der er ansvarlig for indgravering, fremstilling, konstruktion etc. af ressource i upubliceret form. @da
inverse of: is name of producer of
sub property of: has appellation of entity
label: heeft naam van producent @nl
label: له اسم منتج @ar
definition: يربط بين مصدر وتسمية وهي اسم وكيل مسؤول عن تسجيل، تصنيع، إنشاء، أو بأي طريقة أخرى من طرق الإنتاج، مصدر غير منشور. @ar
label: aineiston tuottajan nimi @fi
definition: Liittää aineiston nomeniin, joka on julkaisemattoman aineiston kaiverruksesta, valmistuksesta, kokoonpanosta tai muusta tuotantotavasta vastaavan toimijan nimi. @fi
label: hat Erzeugername @de
definition: Setzt eine Ressource in Beziehung zum Namen eines Akteurs, der für das Gravieren, Fabrizieren, Konstruieren oder eine andere Entstehungsmethode einer unveröffentlichten Ressource verantwortlich ist. @de
label: 有制作者名称 @zh-hans
definition: 将一种资源与作为负责镌刻、制造、构建或其他方法制作一种非出版资源的一个行为者之名称的一个命名关联起来。 @zh-hans
label: előállító neve a következő: @hu
definition: Hozzákapcsol egy forrást egy nomenhez, amely egy kiadatlan forrás írásáért, összeállításáért, készítéséért vagy egyéb módú előállításáért felelős ágens neve. @hu
label: yapımcının adı ile ilişkilidir @tr
definition: Bir kaynağı, yayınlanmamış bir kaynağın yazılmasından, üretilmesinden, oluşturulmasından veya başka bir yöntemle elde edilmesinden sorumlu olan temsilcinin adı olan isimle ilişkilendirir. @tr

is name of producer of
status: Published
type: Property
lexical alias: nameOfProducerOf.en
inverse of: has name of producer
definition: Relates a nomen to a resource that involves a responsibility of an agent for inscribing, fabricating, constructing, etc., an unpublished resource.
sub property of: is appellation of entity of
label: is naam van producent van @nl
label: له اسم لمنتج لـ @ar
definition: يربط تسمية بمصدر ينطوي على مسؤولية وكيل عن تسجيل، تصنيع، إنشاء...إلخ، مصدر غير منشور. @ar
label: er navn på producer af @da
definition: Relaterer et nomen til en ressource, som involverer ett agentansvar for indskrift, fremstilling, konstruktion etc. af en ikke udgiven ressource. @da
label: aineiston tuottajan nimi @fi
definition: Liittää nomenin aineistoon, johon liittyy toimijan vastuu julkaisemattoman aineiston kaiverruksesta, valmistuksesta, kokoonpanosta tms. @fi
label: ist Erzeugername von @de
definition: Setzt ein Nomen in Beziehung zu einer Ressource, bei der ein Akteur für das Gravieren, Fabrizieren, Konstruieren und so weiter einer unveröffentlichten Ressource verantwortlich ist. @de
label: 是……的制作者的名称 @zh-hans
definition: 将一个命名与涉及一种非出版资源的镌刻、制造、构建等的一个行为者的责任的一种资源关联起来。 @zh-hans
label: neve a következő előállítójának: @hu
definition: Hozzákapcsol egy noment egy forráshoz, amelyhez hozzátartozik egy ágens felelőssége egy kiadatlan forrás írásáért, összeállításáért, készítéséért, stb. @hu
label: yapımcısının adıdır @tr
definition: Bir ismi, yayınlanmamış bir kaynağı yazmak, üretmek, inşa etmek vb. için bir temsilcinin sorumluluğunu içeren kaynakla ilişkilendirir. @tr

has name of publisher
status: Published
definition: Relates a resource to a nomen that is a name of an agent who is responsible for publishing, releasing, or issuing a published resource.
type: Property
lexical alias: nameOfPublisher.en
label: har udgivers navn @da
definition: Relaterer en ressource til et navn på en agent, der er ansvarlig for at publicere, offentliggøre eller udgive en ressource. @da
inverse of: is name of publisher of
sub property of: has appellation of entity
label: heeft naam van uitgever @nl
label: له اسم ناشر @ar
definition: يربط بين مصدر واسم وكيل مسؤول عن نشر، تحرير، أو إصدار مصدر منشور. @ar
label: aineiston kustantajan nimi @fi
definition: Liittää aineiston julkaistun aineiston kustantamisesta tai julkistamisesta vastaavaan toimijaan. @fi
label: hat Verlagsnamen @de
definition: Setzt eine Ressource in Beziehung zu einem Namen eines Akteurs, der für das Veröffentlichen, die Freigabe oder die Herausgabe einer Ressource verantwortlich ist. @de
label: 有出版者名称 @zh-hans
definition: 将一种资源与作为负责出版、发布、发行一种出版资源的一个行为者之名称的一个命名关联起来。 @zh-hans
definition: Relaciona un recurs amb un nomen que és un nom d’un agent que és responsable de la publicació, la posada en circulació o l’emissió d’un recurs publicat. @ca
label: kiadói neve a következő: @hu
definition: Hozzákapcsol egy forrást egy ágens nevéhez, amely felelős egy publikált forrás kiadásáért, kibocsájtásáért vagy megjelentetéséért. @hu
label: yayıncının adı ile ilişkilidir @tr
definition: Bir kaynağı, yayınlanan bir kaynağı yayınlamaktan, piyasaya sürmekten veya basmaktan sorumlu olan aracının adıyla ilişkilendirir. @tr

is name of publisher of
status: Published
type: Property
lexical alias: nameOfPublisherOf.en
inverse of: has name of publisher
definition: Relates a nomen to a resource that involves a responsibility of an agent for publishing, releasing, or issuing a published resources.
sub property of: is appellation of entity of
label: is naam van uitgever van @nl
label: هو اسم لناشر لـ @ar
definition: يربط تسمية بمصدر ينطوي على مسؤولية وكيل عن نشر، تحرير، أو إصدار مصدر منشور. @ar
label: er navn på udgiver af @da
definition: Relaterer et nomen til en ressource, som involverer et agentansvar for publicering frigivelse eller udgivelse af en udgiven ressource. @da
label: aineiston kustantajan nimi @fi
definition: Liittää nomenin aineistoon, johon liittyy toimijan vastuu julkaistujen aineistojen kustantamisesta, julkaisemisesta tai ilmestymisestä. @fi
label: ist Verlagsname von @de
definition: Setzt ein Nomen in Beziehung zu einer Ressource, bei der ein Akteur für das Veröffentlichen, die Freigabe oder die Herausgabe einer veröffentlichten Ressource verantwortlich ist. @de
label: 是……的出版者的名称 @zh-hans
definition: 将一个命名与涉及一种出版资源的出版、发布、或发行的一个行为者的责任的一种资源关联起来。 @zh-hans
label: neve a következő kiadójának: @hu
definition: Hozzákapcsol egy noment egy forráshoz, amelyhez hozzátartozik egy ágens felelőssége kiadott források kiadásáért, kibocsájtásáért vagy megjelentetéséért. @hu
label: yayıncısının adıdır @tr
definition: Bir ismi, yayımlanmış bir kaynağı yayınlamak, çıkartmak veya basmak için bir temsilcinin sorumluluğunu içeren kaynakla ilişkilendirir. @tr

has name of timespan
status: Published
sub property of: has name of entity
type: Property
lexical alias: nameOfTimespan.en
definition: Relates a timespan to a nomen that is an appellation of timespan in natural language and phrasing used in common discourse.
inverse of: is name of timespan of
label: heeft naam van tijdspanne @nl
label: له اسم لفترة زمنية @ar
definition: يربط بين فترة زمنية وتسمية لفترة زمنية في اللغة الطبيعية وفي العبارات المستخدمة في الخطاب العام. @ar
label: har navn på tidsforløb @da
definition: Relaterer et tidsforløb til en benævnelse på tidsforløb på naturligt sprog og med naturlig formulering anvendt in almindelig diskurs. @da
label: ajanjakson nimi @fi
definition: Liittää ajanjakson yleisessä diskurssissa luonnollisella kielellä ja sananmuodolla käytettyyn nimitykseen. @fi
label: hat Namen eines Zeitraums @de
definition: Setzt einen Zeitraum in Beziehung zu einer Bezeichnung für einen Zeitraum in natürlicher Sprache und Ausdrucksweise, die beim normalen Sprechen und Schreiben verwendet wird. @de
label: 有时间段的名称 @zh-hans
definition: 将一个时间段与作为用自然语言和普通话语措词表达的时间段的称谓的一个命名关联起来。 @zh-hans
definition: Relaciona un interval de temps amb un nomen que és una apel·lació d’interval de temps en llenguatge i frases naturals usada en el discurs comú. @ca
label: időtartamneve a következő: @hu
definition: Hozzákapcsol egy időtartamot egy időtartam természetes nyelvi megnevezéséhez és a közbeszéd során használt megfogalmazásához. @hu
has subproperty: has preferred name of timespan
has subproperty: has variant name of timespan
label: zaman aralığının adı ile ilişkilidir @tr
definition: Bir zaman aralığını, doğal dilde ve ortak söylemde kullanılan ifadelerdeki bir zaman aralığı unvanıyla ilişkilendirir. @tr

is name of timespan of
status: Published
sub property of: is name of entity of
type: Property
lexical alias: nameOfTimespanOf.en
definition: Relates a nomen to a timespan that has a name in natural language and phrasing used in common discourse.
inverse of: has name of timespan
label: is naam van tijdspanne van @nl
label: هو اسم لفترة زمنية لـ @ar
definition: ييربط تسمية بفترة زمنية لها اسم في اللغة الطبيعية وفي العبارات المستخدمة في الخطاب العام. @ar
label: er navn på tidsforløb af @da
definition: Relaterer et nomen til et tidsforløb, som har et navn på naturligt sprog och formuleringer brugt i almindelig diskurs. @da
label: ajanjakson nimi @fi
definition: Liittää nomenin ajanjaksoon, jolla on jolla on yleisessä diskurssissa käytetty nimi luonnollisella kielellä ja sananmuodolla. @fi
label: ist Name eines Zeitraums von @de
definition: Setzt ein Nomen in Beziehung zu einem Zeitraum, der über einen Namen in natürlicher Sprache und Ausdrucksweise verfügt, die beim normalen Sprechen und Schreiben verwendet wird. @de
label: 是……的时间段的名称 @zh-hans
definition: 将一个命名与有用自然语言和普通话语措词表达的名称的一个时间段关联起来。 @zh-hans
label: időtartamneve a következőnek: @hu
definition: Hozzákapcsol egy noment egy időtartamhoz, amelynek van természetes nyelvű megnevezése és a közbeszédben használt megfogalmazása. @hu
has subproperty: is preferred name of timespan of
has subproperty: is variant name of timespan of
label: zaman aralığının adıdır @tr
definition: Bir ismi, yerel dilde adı olan bir zaman aralığıyla ve yaygın söylemde kullanılan ifadelerle ilişkilendirir. @tr

has narrator
status: Published
definition: Relates a resource to an agent who is a performer who contributes to a resource by reading aloud or giving an account of an act, occurrence, or other event.
type: Property
sub property of: has performer
inverse of: is narrator of
lexical alias: narrator.en
label: har fortæller/indlæser @da
definition: Relaterer en ressource til en optrædende, der har bidraget til en ressource ved at læse højt eller berette om en handling, en hændelse, et begivenhedsforløb etc. @da
label: heeft verteller @nl
label: kertojana aineistossa @fi
label: له راوِ @ar
definition: يربط مصدر بوكيل مؤدِ يُساهم بأحد المصادر من خلال القراءة بصوت مرتفع أو بسرد فصل من مسرحية، أو واقعة، أو حدث آخر. @ar
definition: Liittää henkilön aineistoon, jonka tekemiseen hän osallistuu lukemalla ääneen tai kertomalla toiminnasta, tapahtumasta, tapahtumien kulusta tms. @fi
label: hat Erzählerin/Erzähler @de
definition: Setzt eine Ressource in Beziehung zu einer Ausführenden/einem Ausführenden, die/der zu einer Ressource beiträgt, indem sie/er vorliest oder eine Handlung, ein Geschehnis oder ein anderes Ereignis schildert. @de
label: 有旁白者 @zh-hans
definition: 将一种资源与作为一个表演者通过朗读或描述行为、事情或其他事件而对一种资源有贡献的一个行为者关联起来。 @zh-hans
label: narrátora a következő: @hu
definition: Hozzákapcsol egy forrást egy előadó ágenshez, amely hozzájárul egy forráshoz egy cselekményről, történésről vagy más eseményről szóló beszámoló hangos felolvasásával. @hu
label: anlatıcı ile ilişkilidir @tr
definition: Bir kaynağı, bir eylemi, oluşumu veya başka bir etkinliği anlatarak veya yüksek sesle okuyarak kaynağa katkıda bulunan bir sanatçı olan temsilci ile ilişkilendirir. @tr

is narrator of
status: Published
definition: Relates an agent to a resource that includes a contribution by an agent of reading aloud or giving an account of an act, occurrence, or other event.
type: Property
sub property of: is performer of
inverse of: has narrator
lexical alias: narratorOf.en
label: er fortæller i @da
definition: Relaterer en udøver der bidrager til en ressource ved at læse højt eller berette om en handling, en hændelse, et begivenhedsforløb, etc. til en ressource. @da
label: is verteller van @nl
label: kertojana aineistossa @fi
label: هو راوٍ لـ @ar
definition: يربط بين وكيل ومصدر يتضمن إسهام وكيل بالقراءة بصوت مرتفع أو بسرد فصل من مسرحية، واقعة، أو حدث آخر. @ar
definition: Liittää henkilön aineistoon, jonka tekemiseen hän osallistuu lukemalla ääneen tai kertomalla toiminnasta, tapahtumasta, tapahtumien kulusta tms. @fi
label: ist Erzählerin/Erzähler von @de
definition: Setzt einen Akteur in Beziehung zu einer Ressource, zu der ein Akteur beiträgt, indem er vorliest oder eine Handlung, ein Geschehnis oder ein anderes Ereignis schildert. @de
label: 是……的旁白者 @zh-hans
definition: 将一个行为者与包括有朗读或描述行为、事情或其他事件的行为者的贡献的一种资源关联起来。 @zh-hans
label: narrátora a következőnek: @hu
definition: Hozzákapcsol egy ágenst egy forráshoz, amely magában foglalja egy ágens közreműködését egy cselekményről, eseményről, események menetéről stb. szóló beszámoló hangos felolvasásában. @hu
definition: Relaciona un agent amb un recurs que inclou una contribució d’un agent llegint en veu alta o explicant una acció, una situació o qualsevol altre esdeveniment. @ca
label: anlatıcısıdır @tr
definition: Bir temsilciyi, bir eylemin, oluşumun veya başka bir olayın yüksek sesle okunması veya bir açıklama yapılmasına yönelik bir temsilcinin katkısını içeren bir kaynakla ilişkilendirir. @tr

has nature of content
status: Published
definition: Relates a resource to a specific character of the primary content of a resource.
type: Property
lexical alias: natureOfContent.en
label: har indholdets art @da
definition: Relaterer en ressource til en specifik egenskab ved en ressources primære indhold. @da
label: heeft aard van content @nl
label: له طبيعة محتوى @ar
definition: يربط بين مصدر وخاصية معينة في المحتوى الأساسي لمصدر. @ar
label: aineiston sisällön luonne @fi
definition: Liittää aineiston sen pääasiallisen sisällön erityispiirteeseen. @fi
label: hat Art des Inhalts @de
definition: Setzt eine Ressource in Beziehung zu einer spezifischen Eigenschaft des primären Inhalts einer Ressource. @de
label: 有内容的性质 @zh-hans
definition: 将一种资源与一种资源的主要内容的特定特征关联起来。 @zh-hans
label: tartalmának jellege a következő: @hu
definition: Hozzákapcsol egy forrást egy forrás elsődleges tartalmának adott jellegzetességéhez. @hu
label: içeriğin niteliği ile ilişkilidir @tr
definition: Bir kaynağı, kaynağın birincil içeriğinin belirli bir karakteriyle ilişkilendirir. @tr

has nomen string
status: Published
type: Property
lexical alias: nomenString.en
definition: Relates a nomen to the combination of signs that forms an appellation associated with an entity.
label: heeft nomenstring @nl
label: له سلسلة تمثيلات تسمية @ar
definition: يربط بين تسمية ومجموعة من العلاقات التي تشكل تسمية مرتبطة بكيان. @ar
label: har nomenstreng @da
definition: Relaterer et nomen til den kombination af tegn, der danner en betegnelse knyttet til en entitet. @da
label: nomenin merkkijono @fi
definition: Liittää nomenin merkkien yhdistelmään, joka muodostaa entiteettiin liittyvän nimityksen. @fi
label: hat Nomen-Zeichenkette @de
definition: Setzt ein Nomen in Beziehung zu einer Kombination von Zeichen, die eine Bezeichnung bildet, die mit einer Entität in Verbindung steht. @de
label: 有命名串 @zh-hans
definition: 将一个命名与和一个实体有关的形成一个称谓的符号的组合关联起来。 @zh-hans
label: noment alkotó karakterlánca a következő: @hu
definition: Hozzákapcsol egy noment jelek kombinációjához, amely így egy entitáshoz kapcsolódó megnevezést formál. @hu
label: isim dizgesi ile ilişkilidir @tr
definition: Bir isimi, bir varlıkla ilişkili bir unvanı oluşturan işaretlerin birleşimiyle ilişkilendirir. @tr

has note on agent
status: Published
type: Property
lexical alias: noteOnAgent.en
sub property of: has note on entity
definition: Relates an agent to a broad unstructured description of one or more attributes of an agent.
label: heeft noot bij actor @nl
label: له تبصرة عن وكيل @ar
definition: يربط بين وكيل ووصف مستفيض غير محدد لواحدة أو أكثر من سمات وكيل @ar
label: har note om agent @da
definition: Relaterer en agent til en bred ustruktureret beskrivelse af en eller flere attibuter til en agent. @da
label: huomautus toimijasta @fi
definition: Liittää toimijan laajaan rakenteistamattomaan kuvailuun toimijan yhdestä tai useammasta attribuutista. @fi
label: hat Anmerkung zum Akteur @de
definition: Setzt einen Akteur in Beziehung zu einer umfassenden, unstrukturierten Beschreibung eines Merkmals oder mehrerer Merkmale eines Akteurs. @de
label: 有关于行为者的附注 @zh-hans
definition: 将一个行为者与一个行为者的一个或多个属性的宽泛的、非结构化的描述关联起来。 @zh-hans
label: ágensre vonatkozó megjegyzése a következő: @hu
definition: Hozzákapcsol egy ágenst az ágens egy vagy több ismérvének átfogó strukturálatlan leírásához. @hu
label: temsilciye hakkında not ile ilişkilidir @tr
definition: Bir temsilciyi, bir temsilcinin bir veya daha fazla özelliğinin yapılandırılmamış geniş tanımıyla ilişkilendirir. @tr

has note on capture
status: Published
sub property of: has note on resource
type: Property
lexical alias: noteOnCapture.en
definition: Relates a resource to a note on resource that provides information associated with the recording, filming, etc., of the content of a resource.
scope note: Note on capture includes the circumstances such as a live or studio recording, the equipment used, etc.
label: har note om optagelse @da
definition: Relaterer en ressource til en note der giver oplysninger knyttet til optagelse, indspilning etc. af indholdet af en ressource. @da
scope note: Note om optagelse omfatter forhold såsom live- eller studieoptagelse, anvendt udstyr etc. @da
label: heeft noot bij vastleggen @nl
label: له تبصرة عن التقاط @ar
definition: يربط بين مصدر وتبصرة عن مصدر مرتبطة بتسجيل، تصوير...إلخ، محتوى مصدر. @ar
scope note: تتضمن تبصرة عن التقاط الظروف مثل التسجيل المباشر أو التسجيل في الاستوديو، والمعدات المستخدمة...إلخ. @ar
label: huomautus aineiston tallennuksesta @fi
definition: Liittää aineiston aineistoa koskevaan huomautukseen, joka sisältää aineiston sisällön äänitykseen, kuvaukseen tms. liittyviä tietoja. @fi
scope note: Tallennusta koskevaan huomautukseen kuuluvat sellaiset tapaukset kuin live- tai studioäänitys, käytetty laitteisto jne. @fi
label: hat Anmerkung zur Aufzeichnung @de
definition: Setzt eine Ressource in Beziehung zu einer Anmerkung zur Ressource, die Informationen liefert, die mit der Aufnahme, dem Filmen und so weiter des Inhalts einer Ressource in Verbindung stehen. @de
scope note: Darunter fallen auch die Umstände einer Aufzeichnung wie zum Beispiel, ob es sich um eine Live- oder Studioaufnahme handelt, welches Equipment verwendet wurde und so weiter. @de
label: 有关于摄录的附注 @zh-hans
definition: 将一种资源与提供关于资源之内容的和录制、摄制等有关信息的一个关于资源的附注关联起来。 @zh-hans
scope note: 关于摄录（包括诸如实况录制或工作室录制、所用的设备等条件）的附注 @zh-hans
label: megjegyzése a rögzítésről a következő: @hu
definition: Hozzákapcsol egy forrást egy forrásra tett megjegyzéshez, amely információt nyújt egy forrás tartalmának felvételével, filmezésével, stb. társított információkról. @hu
scope note: A felvételrögzítésről szóló megjegyzésbe olyan körülmények tartoznak, mint az élő adás vagy stúdiófelvétel, a használt eszközök stb. @hu
label: kayıt hakkında not ile ilişkilidir @tr
definition: Bir kaynağı, bir kaynağın içeriğinin kaydedilmesi, filme alınması vb. ile ilgili bilgileri sağlayan bir kaynak notuyla ilişkilendirir. @tr
scope note: Görüntü alımı ile ilgili not, örneğin canlı veya stüdyo kaydı, kullanılan ekipman vb. durumları içerir. @tr

has note on changes in carrier characteristics
status: Published
definition: Relates a resource to a note on resource that provides information on variations in the carrier characteristics that are found on resources of parts, issues, or iterations of a diachronic resource.
type: Property
lexical alias: noteOnChangesInCarrierCharacteristics.en
sub property of: has note on resource
label: har note om ændringer i bærerkarakteristika @da
definition: Relaterer en ressource til en note om ændringer i bærerens karakteristika, der optræder i efterfølgende numre eller dele af en ressource, der er udgivet i successive dele, eller mellem iterationer af en integrerende ressource. @da
label: heeft noot bij veranderingen in karakteristieken van dragers @nl
label: huomautus muutoksista tallenteen ominaisuuksissa @fi
label: له تبصرة عن التغييرات في سمات الحامل @ar
definition: يربط بين مصدر وتبصرة عن مصدر يوفر معلومات عن التغيرات في سمات الحامل التي توجد على مصادر الأجزاء، الأعداد، أو إعادة الإصدار الخاص بمصدر تعاقبي. @ar
definition: Liittää aineiston lisätietoon vaihteluista diakronisen ainieston osien, numeroiden tai iteraatioiden ominaisuuksissa. @fi
label: hat Anmerkung zu Änderungen von Datenträgereigenschaften @de
definition: Setzt eine Ressource in Beziehung zu einer Anmerkung zur Ressource, die Informationen zu Veränderungen in den Datenträgereigenschaften enthält, die bei Ressourcen von Teilen, Ausgaben oder Iterationen einer diachronen Ressource vorkommen. @de
label: 有关于载体特征变化的附注 @zh-hans
definition: 将一种资源与提供关于一种历时资源的部分、期、或更新后整体上发现的载体之变化的信息的一个关于资源的附注关联起来。 @zh-hans
label: a hordozó ismérvváltozásairól szóló megjegyzése a következő: @hu
definition: Hozzákapcsol egy forrást egy a hordozójellemzők változásairól szóló, forrásra tett megjegyzéshez, amely egymást követő részekben kiadott forrás rákövetkező számaiban vagy részeiben fordulnak elő, vagy egy integráló forrás iterációi között. @hu
label: taşıyıcı özelliklerindeki değişiklikler hakkında not ile ilişkilidir @tr
definition: Bir kaynağı, artzamanlı kaynağa ait yinelemelerin, parçaların veya sayıların taşıyıcı özelliklerindeki varyasyonlar hakkında bilgi sağlayan kaynak notu ile ilişkilendirir. @tr

has note on changes in content characteristics
status: Published
definition: Relates a resource to a note on resource that provides information on variations in the content characteristics of parts, issues, or iterations of a diachronic resource.
type: Property
sub property of: has note on resource
lexical alias: noteOnChangesInContentCharacteristics.en
label: har note om ændringer i bærerkarakteristika @da
definition: Relaterer en ressource til en note om ændringer i bærerens karakteristika, der optræder i efterfølgende numre eller dele af en ressource, der er udgivet i successive dele, eller mellem iterationer af en integrerende ressource. @da
label: heeft noot bij veranderingen in karakteristieken van content @nl
label: huomautus muutoksista sisällön ominaisuuksissa @fi
label: له تبصرة على تغييرات في سمات المحتوى @ar
definition: يربط بين مصدر وتبصرة عن مصدر يُعطي معلومات عن التغيرات في سمات المحتوى الذي يوجد على الأجزاء، أو الأعداد، أو إعادة الإصدار الخاص بمصدر مستمر. @ar
definition: Liittää aineiston aineistoa koskevaan huomaukseen, jossa annetaan tietoja vaihteluista diakronisen aineiston osien, numeroiden tai iteraatioiden isällön ominaisuuksissa. @fi
label: hat Anmerkung zu Änderungen von Inhaltseigenschaften @de
definition: Setzt eine Ressource in Beziehung zu einer Anmerkung zur Ressource, die Informationen über Veränderungen in den Inhaltseigenschaften von Teilen, Ausgaben oder Iterationen einer diachronen Ressource enthält. @de
label: 有关于内容特征变化的附注 @zh-hans
definition: 将一种资源与提供关于一种历时资源的部分、期、或更新后整体的内容特征之变化的信息的一个关于资源的附注关联起来。 @zh-hans
label: tartalmi jellemzők változásairól szóló megjegyzése a következő: @hu
definition: Hozzákapcsol egy forrást egy forrásra tett megjegyzéshez, amely információt nyújt egy diakronikus forrás részeinek, számainak, vagy iterációinak tartalmi jellemzőiben történt változásokról. @hu
label: içerik özelliklerindeki değişiklikler hakkında not ile ilişkilidir @tr
definition: Bir kaynağı, artzamanlı kaynağa ait yinelemelerin, parçaların veya sayıların içerik özelliklerindeki varyasyonlar hakkında bilgi sağlayan kaynak notu ile ilişkilendirir. @tr

has note on copyright date
status: Published
definition: Relates a resource to a note on resource that provides information on a copyright date.
type: Property
lexical alias: noteOnCopyrightDate.en
sub property of: has note on resource
label: har note om copyrightår @da
definition: Relaterer en ressource til en note, der giver oplysninger om copyrightår, der ikke er registreret som en del af copyrightangivelsen. @da
label: heeft noot bij copyrightdatum @nl
label: huomautus aineiston copyright-vuodesta @fi
label: له تبصرة عن تاريخ حق النشر @ar
definition: يربط بين مصدر وتبصرة عن مصدر يوفر معلومات عن تاريخ حق النشر. @ar
definition: Liittää aineiston lisätietoon copyright-vuodesta. @fi
label: hat Anmerkung zum Copyright-Datum @de
definition: Setzt eine Ressource in Beziehung zu einer Anmerkung zur Ressource, die Informationen über ein Copyright-Datum enthält. @de
label: 有关于版权日期的附注 @zh-hans
definition: 将一种资源与提供关于版权日期信息的一个关于资源的附注关联起来。 @zh-hans
label: a copyright időpontról szóló megjegyzése a következő: @hu
definition: Hozzákapcsol egy forrást egy forrásra tett megjegyzéshez, amely információt nyújt a copyright időpontjáról. @hu
label: telif tarihi hakkında not ile ilişkilidir @tr
definition: Bir kaynağı, telif hakkı tarihi hakkında bilgi sağlayan kaynak notu ile ilişkilendirir. @tr

has note on dimensions of resource
status: Published
definition: Relates a resource to a note on resource that provides information on the dimensions of a resource.
type: Property
lexical alias: noteOnDimensionsOfResource.en
sub property of: has note on resource
label: har note om ressources størrelse @da
definition: Relaterer en ressource til en note, der giver oplysninger om en ressources størrelse, der ikke er registreret som en del af størrelsesangivelsen. @da
label: heeft noot bij afmetingen van resource @nl
label: huomautus aineiston koosta @fi
label: له تبصرة عن أبعاد المصدر @ar
definition: يربط بين مصدر وتبصرة عن مصدر توفر معلومات عن أبعاد مصدر. @ar
definition: Liittää aineiston lisätietoon aineiston koosta. @fi
label: hat Anmerkung zu Maßen eines Exemplars @de
definition: Setzt eine Ressource in Beziehung zu einer Anmerkung zur Ressource, die Informationen über die Maße einer Ressource enthält. @de
label: 有关于资源尺寸的附注 @zh-hans
definition: 将一种资源与提供关于资源尺寸信息的一个关于资源的附注关联起来。 @zh-hans
label: a forrás méretéről szóló megjegyzése a következő: @hu
definition: Hozzákapcsol egy forrást egy forrásra tett megjegyzéshez, amely információt nyújt egy forrás méretérőll. @hu
label: kaynağın boyutları hakkında not ile ilişkilidir @tr
definition: Bir kaynağı, kaynağın boyutları hakkında bilgi sağlayan kaynak notu ile ilişkilendirir. @tr

has note on distribution statement
status: Published
definition: Relates a resource to a note on resource that provides information on the distribution of a resource.
type: Property
lexical alias: noteOnDistributionStatement.en
sub property of: has note on resource
label: har note til distriubutionsbeskrivelse @da
definition: Relaterer en ressource til en note, der angiver detaljer om distributionssted, distributør eller distributionsår, eller oplysninger om ændringer i distributionssted, distributør eller distributørnavn. @da
label: heeft noot bij distributievermelding @nl
label: huomautus aineiston jakelumerkinnöstä @fi
label: له تبصرة عن بيان التوزيع @ar
definition: يربط بين مصدر وتبصرة عن مصدر يوفر معلومات عن توزيع مصدر. @ar
definition: Liittää aineiston huomautukseen, joka sisältää tietoja aineiston jakelusta. @fi
label: hat Anmerkung zur Vertriebsangabe @de
definition: Setzt eine Ressource in Beziehung zu einer Anmerkung zur Ressource, die Informationen über den Vertrieb einer Ressource enthält. @de
label: 有关于发行说明的附注 @zh-hans
definition: 将一种资源与提供关于资源发行信息的关于资源的附注关联起来。 @zh-hans
label: terjesztési közlésről szóló megjegyzése a következő: @hu
definition: Hozzákapcsol egy forrást egy forrásra tett megjegyzéshez, amely információt nyújt egy forrás terjesztéséről. @hu
label: dağıtım bildirimi hakkında not ile ilişkilidir @tr
definition: Bir kaynağı, kaynağın dağıtımı hakkında bilgi sağlayan kaynak notu ile ilişkilendirir. @tr

has note on edition statement
status: Published
definition: Relates a resource to a note on resource that provides information on an edition of a resource.
type: Property
lexical alias: noteOnEditionStatement.en
sub property of: has note on resource
label: har note til udgavebeskrivelse @da
definition: Relaterer en ressource til en note, der giver oplysninger om kilden til en udgavebeskrivelse, om udgavebeskrivelse relateret til numre, dele etc., om ændringer i udgavebeskrivelse eller om andre oplysninger relateret til en udgavebeskrivelse. @da
label: heeft noot bij editievermelding @nl
label: huomautus aineiston painosmerkinnöstä @fi
label: له تبصرة عن بيان الطبعة @ar
definition: يربط بين مصدر وتبصرة عن مصدر يوفر معلومات عن الطبعة الخاصة بمصدر. @ar
definition: Liitää aineiston lisätietoon painosmerkinnöstä. @fi
label: hat Anmerkung zum Ausgabevermerk @de
definition: Setzt eine Ressource in Beziehung zu einer Anmerkung zur Ressource, die Informationen über eine Ausgabe einer Ressource enthält. @de
label: 有关于版本的附注 @zh-hans
definition: 将一种资源与提供关于资源版本信息的关于资源的附注关联起来。 @zh-hans
label: a kiadási közlésről szóló megjegyzése a következő: @hu
definition: Hozzákapcsol egy forrást egy forrásra tett megjegyzéshez, amely információt nyújt egy forrás kiadásáról. @hu
label: basım bildirimi hakkında not ile ilişkilidir @tr
definition: Bir kaynağı, kaynağın basımı hakkında bilgi sağlayan kaynak notu ile ilişkilendirir. @tr

has note on entity
status: Published
type: Property
lexical alias: noteOnEntity.en
definition: Relates an entity to a broad unstructured description of one or more attributes of an entity.
label: heeft noot bij entiteit @nl
label: له تبصرة لكيان @ar
definition: يربط بين كيان ووصف مستفيض غير محدد لواحدة أو أكثر من سمات كيان. @ar
label: har note om entitet @da
definition: Relaterer en entitet til en en bred ustruktureret definition af en eller flere attributter af en entitet. @da
label: huomautus entiteetistä @fi
definition: Liittää entiteetin laajaan rakenteistamattomaan kuvailuun entiteetin yhdestä tai useammasta attribuutista. @fi
label: hat Anmerkung zur Entität @de
definition: Setzt eine Entität in Beziehung zu einer umfassenden, unstrukturierten Beschreibung eines Merkmals oder mehrerer Merkmale einer Entität. @de
label: 有关于实体的附注 @zh-hans
definition: 将一个实体与一个实体的一个或多个属性的宽泛的、非结构化的描述关联起来。 @zh-hans
label: entitásra vonatkozó megjegyzés a következő: @hu
definition: Hozzákapcsol egy entitást egy vagy több entitás ismérvének általános strukturálatlan leírásához. @hu
has subproperty: has note on agent
has subproperty: has note on resource
label: varlık hakkında not ile ilişkilidir @tr
definition: Bir varlığı, bir varlığın bir veya daha fazla özelliğinin yapılandırılmamış geniş tanımıyla ilişkilendirir. @tr

has note on extent of resource
status: Published
definition: Relates a resource to a note on resource that provides information on the extent of a resource.
type: Property
lexical alias: noteOnExtentOfResource.en
sub property of: has note on resource
label: har note om omfang af ressource @da
definition: Relaterer en ressource til en note, der giver oplysninger om en ressources omfang, der ikke er registreret som en del af omfangsangivelsen. @da
label: heeft noot bij omvang van resource @nl
label: huomautus aineiston laajuudesta @fi
label: له تبصرة عن عدد صفحات المصدر @ar
definition: يربط بين مصدر وتبصرة عن مصدر يوفر معلومات عن عدد صفحات المصدر @ar
definition: Liittää aineiston lisätietoon aineiston laajuudesta. @fi
label: hat Anmerkung zum Umfang eines Exemplars @de
definition: Setzt eine Ressource in Beziehung zu einer Anmerkung zur Ressource, die Informationen über den Umfang einer Ressource enthält. @de
label: 有关于资源数量的附注 @zh-hans
definition: 将一种资源与提供关于资源数量信息的一个关于资源的附注关联起来。 @zh-hans
label: a forrás terjedelméről szóló megjegyzése a következő: @hu
definition: Hozzákapcsol egy forrást egy forrásra tett megjegyzéshez, amely információt nyújt egy forrás terjedelméről. @hu
label: kaynağın kapsamı hakkında not ile ilişkilidir @tr
definition: Bir kaynağı, kaynağın kapsamı hakkında bilgi sağlayan kaynak notu ile ilişkilendirir. @tr

has note on frequency (Deprecated)
status: Deprecated
definition: Relates a resource to a note providing details on the currency of the contents, on the frequency of release of issues or parts of a serial or the frequency of updates to an integrating resource, or on changes in frequency. (Deprecated)
type: Property
lexical alias: noteOnFrequency.en
sub property of: has note on resource
label: har note om frekvens @da
definition: Relaterer en ressource til en note, der giver detaljer om dækningsperioden, om udgivelsesfrekvensen for numre eller dele af et periodikum eller opdateringsfrekvensen for en integrerende ressource eller ændringer i frekvens. @da

has note on identifier for resource
status: Published
type: Property
lexical alias: noteOnIdentifierForResource.en
definition: Relates a resource to a note on resource that provides information on an identifier for a resource.
sub property of: has note on resource
label: har note om identifikator for ressourcen @da
definition: Relaterer en ressource til en note, der giver oplysninger om identifikatorer for ressourcen, der ikke fremgår af identifikatorangivelsen for ressourcen. @da
label: heeft noot bij identificatie van resource @nl
label: له تبصرة عن محدد لمصدر @ar
definition: يربط بين مصدر وتبصرة على مصدر تعطي معلومات عن معرف لمصدر. @ar
label: huomautus aineiston tunnisteesta @fi
definition: Liittää aineiston huomautukseen, joka sisältää tietoa aineiston tunnisteesta. @fi
label: hat Anmerkung zum Identifikator für eine Ressource @de
definition: Setzt eine Ressource in Beziehung zu einer Anmerkung zur Ressource, die Informationen über einen Identifikator für eine Ressource enthält. @de
label: 有关于资源的标识符的附注 @zh-hans
definition: 将一个资源与提供关于一种资源的一个标识符的信息的一个关于资源的附注关联起来。 @zh-hans
label: megjegyzése azonosítóról a következő forráshoz: @hu
definition: Hozzákapcsol egy forrást egy forrásra tett megjegyzéshez, amely információt nyújt egy forrásnak szánt azonosítóról. @hu
label: kaynağın tanımlayıcısı hakkında not ile ilişkilidir @tr
definition: Bir kaynağı, bir kaynak için bir tanımlayıcı hakkında bilgi sağlayan kaynakla ilgili bir notla ilişkilendirir. @tr

has note on issue, part, or iteration used as basis for identification of resource
status: Published
definition: Relates a resource to a note on resource that identifies an issue or part of a multipart monograph or serial, or an iteration of an integrating resource that has been used as a basis for the identification of a resource.
type: Property
lexical alias: noteOnIssuePartOrIterationUsedAsBasisForIdentificationOfResource.en
sub property of: has note on resource
label: har note om nummer, del eller iteration, anvendt som grundlag for identifikation af ressource @da
definition: Relaterer en ressource til en note, der identificerer et nummer eller en del af et flerbindsværk eller et periodikum, eller en iteration af en integrerende ressource, der er brugt som grundlag for identifikation af en ressource. @da
label: heeft noot bij aflevering, deel of iteratie gebruikt als basis voor identificatie van resource @nl
label: له تبصرة عن عدد، جزء، أو إعادة إصدار يُستخدم كأساس لتحديد مصدر. @ar
definition: يربط بين مصدر وتبصرة عن مصدر يُحدد عدد أو جزء من دراسات متعددة الأجزاء أو سلسلة، أو جزء من مصدر متكامل تم استخدامه كأساس لتحديد مصدر. @ar
label: huomautus numerosta, osasta tai iteraatiosta aineiston identifioinnin perustana. @fi
definition: Liittää aineiston huomautukseen moniosaisen monografian tai sarja-aineiston numerosta tai osasta tai päivittyvän aineiston iteraatiosta, jota käytetään aineiston identifioinnin perustana. @fi
label: hat Anmerkung zur Ausgabe, zum Teil oder zur Iteration, die/der als Grundlage für die Identifizierung einer Manifestation verwendet wird @de
definition: Setzt eine Ressource in Beziehung zu einer Anmerkung zur Ressource, die eine Ausgabe oder einen Teil einer mehrteiligen Monografie oder einer fortlaufenden Ressource oder eine Iteration einer integrierenden Ressource identifiziert, die/der als Grundlage für die Identifizierung einer Ressource verwendet wird. @de
label: 有关于用作资源标识之基础的期、部分、或更新后整体的附注 @zh-hans
definition: 将一种资源与标识作为资源标识基础的多部分单行出版物或连续出版物的期或部分或者集成性资源的更新后整体的一个关于资源的附注关联起来。 @zh-hans
label: forrás azonosítója alapjaként használt számról, részről vagy iterációról szóló megjegyzése a következő: @hu
definition: Hozzákapcsol egy forrást egy forrásra tett megjegyzéshez, amely azonosítja egy többrészes monográfia vagy sorozat részét vagy számát, vagy egy a forrás azonosításához alapul szolgáló integráló forrás iterációját. @hu
label: kaynağın tanımlanmasında temel alınan sayı, bölüm veya yineleme hakkında not ile ilişkilidir @tr
definition: Bir kaynağı, bir kaynağın tanımlanması için temel olarak kullanılan ve çok parçalı bir monografın veya dizinin sayısını veya parçasını ya da bir entegre kaynağın yinelemesini tanımlayan kaynak notu ile ilişkilendirir. @tr

has note on manifestation or item (Deprecated)
status: Deprecated
definition: Relates a resource to an annotation providing additional information about resource or resource attributes. (Deprecated)
lexical alias: noteOnManifestationOrItem.en
type: Property

has note on manufacture statement
status: Published
definition: Relates a resource to a note on resource that provides information on the manufacture of a resource.
type: Property
lexical alias: noteOnManufactureStatement.en
sub property of: has note on resource
label: har note til produktionsbeskrivelse - publicerede ressourcer @da
definition: Relaterer en ressource til en note, der giver detaljer om fremstillingssted, producent eller fremstillingsår, eller om ændringer i fremstillingssted, producent eller producentnavn. @da
label: heeft noot bij vervaardigingsvermelding @nl
label: huomautus aineiston valmistusmerkinnöstä @fi
label: له تبصرة عن بيان التصينع @ar
definition: يربط بين مصدر وتبصرة عن مصدر يوفر معلومات عن صانع مصدر. @ar
definition: Liittää aineiston huomautukseen, joka sisältää tietoja aineiston valmistuksesta. @fi
label: hat Anmerkung zur Herstellungsangabe @de
definition: Setzt eine Ressource in Beziehung zu einer Anmerkung zur Ressource, die Informationen über die Herstellung einer Ressource enthält. @de
label: 有关于生产说明的附注 @zh-hans
definition: 将一种资源与提供关于资源生产信息的关于资源的附注关联起来。 @zh-hans
label: gyártási közlésről szóló megjegyzése a következő: @hu
definition: Hozzákapcsol egy forrást egy forrásra tett megjegyzéshez, amely információt nyújt egy forrás gyártásáról. @hu
label: üretim bildirimi hakkında not ile ilişkilidir @tr
definition: Bir kaynağı, kaynağın imalatı hakkında bilgi sağlayan kaynak notu ile ilişkilendirir. @tr

has note on numbering of sequence
status: Published
definition: Relates a resource to a note providing information on the range of designators that is used to indicate a sequence of the individual parts or iterations of a resource.
type: Property
lexical alias: noteOnNumberingOfSequence.en
sub property of: has note on resource
label: har note om periodikanummerering @da
definition: Relaterer en ressource til en note, der giver oplysninger om nummereringen af første og/eller sidste nummer eller del, om kompleks eller uregelmæssig nummerering (inkl. nummereringsfejl), om den periode, der dækkes af et bind, et nummer, en del etc., eller om andre oplysninger relateret til nummerering af periodika. @da
label: heeft noot bij nummering van volgorde @nl
label: huomautus aineiston numerointijaksosta @fi
label: له تبصرة عن ترقيم التسلسل @ar
definition: يربط بين مصدر وتبصرة توفر معلومات عن مجموعة من الترقيمات المستخدمة لتحديد تسلسل أجزاء أو تكرارات فردية لمصدر. @ar
definition: Liittää aineiston lisätietoon määritteiden jonosta. Määritteiden jonoa käytetään ilmaisemaan aineiston yksittäisten osien tai iteraatioiden peräkkäisyyttä. @fi
label: hat Anmerkung zur Zählung einer fortlaufenden Ressource @de
definition: Setzt eine Ressource in Beziehung zu einer Anmerkung, die Informationen zur Reihenfolge der einzelnen Ausgaben einer fortlaufenden Ressource enthält. @de
label: 有关于序列编号的附注 @zh-hans
definition: 将一种资源与提供关于用于表示一种资源的个别部分或更新后整体的序列的标识范围的信息的附注关联起来。 @zh-hans
label: sorrendiség számozásáról szóló megjegyzése a következő: @hu
definition: Hozzákapcsol egy forrást egy megjegyzéshez, amely információt nyújt egy forrás egyes részeinek vagy iterációinak sorrendjét mutató jelöléstartományról. @hu
label: sıranın numaralandırılması hakkında not ile ilişkilidir @tr
definition: Bir kaynağı, kaynağın yinelemelerinin veya münferit parçalar sırasını belirtmek için kullanılan belirleyici aralığı hakkında bilgi sağlayan not ile ilişkilendirir. @tr

has note on production statement
status: Published
definition: Relates a resource to a note on resource that provides information on the production of a resource.
type: Property
lexical alias: noteOnProductionStatement.en
sub property of: has note on resource
label: har note til produktionsbeskrivelse - upublicerede ressourcer @da
definition: Relaterer en ressource til en note, der giver detaljer om produktionssted, producer eller produktionsår, eller om ændringer i produktionssted, producer eller producernavn. @da
label: heeft noot bij productievermelding @nl
label: huomautus aineiston tuotantomerkinnöstä @fi
label: له تبصرة عن بيان الإنتاج @ar
definition: يربط بين مصدر وتبصرة عن مصدر يوفر معلومات عن إنتاج مصدر. @ar
definition: Liittää aineiston lisätietoon aineiston tuotannosta. @fi
label: hat Anmerkung zur Entstehungsangabe @de
definition: Setzt eine Ressource in Beziehung zu einer Anmerkung zur Ressource, die Informationen über die Entstehung einer Ressource enthält. @de
label: 有关于制作说明的附注 @zh-hans
definition: 将一种资源与提供关于资源制作信息的关于资源的附注关联起来。 @zh-hans
label: előállítási közlésről szóló megjegyzése a következő: @hu
definition: Hozzákapcsol egy forrást egy forrásra tett megjegyzéshez, amely információt nyújt egy forrás előállításáróll. @hu
label: yapım bildirimi hakkında not ile ilişkilidir @tr
definition: Bir kaynağı, kaynağın üretimi hakkında bilgi sağlayan kaynak notu ile ilişkilendirir. @tr

has note on publication statement
status: Published
definition: Relates a resource to a note on resource that provides information on the publication of a resource.
type: Property
lexical alias: noteOnPublicationStatement.en
sub property of: has note on resource
label: har note til publiceringsbeskrivelse @da
definition: Relaterer en ressource til en note, der giver detaljer om publiceringssted, udgiver eller publiceringsår eller oplysninger om ændringer i publiceringssted, udgiver eller udgivernavn, eller om ophør af publicering. @da
label: heeft noot bij publicatievermelding @nl
label: huomautus aineiston julkaisumerkinnöstä @fi
label: له تبصرة عن بيان النشر @ar
definition: يربط بين مصدر وتبصرة عن مصدر يوفر معلومات عن نشر مصدر. @ar
definition: Liittää aineiston lisätietoon aineiston julkaisemisesta. @fi
label: hat Anmerkung zur Veröffentlichungsangabe @de
definition: Setzt eine Ressource in Beziehung zu einer Anmerkung zur Ressource, die Informationen über die Veröffentlichung einer Ressource enthält. @de
label: 有关于出版说明的附注 @zh-hans
definition: 将一种资源与提供关于资源出版信息的关于资源的附注关联起来。 @zh-hans
label: megjelenési közlésről szóló megjegyzése a következő: @hu
definition: Hozzákapcsol egy forrást egy forrásra tett megjegyzéshez, amely információt nyújt egy forrás megjelenéséről. @hu
label: yayınlama bildirimi hakkında not ile ilişkilidir @tr
definition: Bir kaynağı, kaynağın yayınlanmasına hakkında bilgi sağlayan kaynak notu ile ilişkilendirir. @tr

has note on resource
status: Published
definition: Relates a resource to a broad unstructured description of one or more attributes of a resource.
type: Property
lexical alias: noteOnResource.en
label: har note til ressource @da
definition: Relaterer en ressource til en note, der giver supplerende oplysninger om indhold, der er registreret, som et attribut til udtrykket. @da
sub property of: has note on entity
label: heeft noot bij resource @nl
label: له تبصرة على المصدر @ar
definition: يربط بين مصدر ووصف مستفيض غير محدد لواحدة أو أكثر من سمات مصدر. @ar
label: huomautus aineistosta @fi
definition: Liittää aineiston yhden tai useamman attribuutin laajaan rakenteistamattomaan kuvailuun aineistosta. @fi
label: hat Anmerkung zur Ressource @de
definition: Setzt eine Ressource in Beziehung zu einer umfassenden, unstrukturierten Beschreibung eines Merkmals oder mehrerer Merkmale einer Ressource. @de
label: 有关于资源的附注 @zh-hans
definition: 将一种资源与一种资源的一个或多个属性的一个宽泛的、非结构化的描述关联起来。 @zh-hans
label: megjegyzése a forrásról a következő: @hu
definition: Hozzákapcsol egy forrást egy forrás egy vagy több ismérvének szabad szöveges, strukturálatlan leírásához. @hu
has subproperty: has note on capture
has subproperty: has note on changes in carrier characteristics
has subproperty: has note on changes in content characteristics
has subproperty: has note on copyright date
has subproperty: has note on dimensions of resource
has subproperty: has note on distribution statement
has subproperty: has note on edition statement
has subproperty: has note on extent of resource
has subproperty: has note on frequency (Deprecated)
has subproperty: has note on identifier for resource
has subproperty: has note on issue, part, or iteration used as basis for identification of resource
has subproperty: has note on manufacture statement
has subproperty: has note on numbering of sequence
has subproperty: has note on production statement
has subproperty: has note on publication statement
has subproperty: has note on series statement
has subproperty: has note on statement of responsibility
has subproperty: has note on title
label: kaynak hakkında not ile ilişkilidir @tr
definition: Bir kaynağı, bir kaynağın bir veya daha fazla niteliğinin geniş, yapılandırılmamış bir açıklamasıyla ilişkilendirir. @tr

has note on series statement
status: Published
definition: Relates a resource to a note on resource that provides information on a series with which a resource is associated.
type: Property
lexical alias: noteOnSeriesStatement.en
sub property of: has note on resource
label: har note til seriebeskrivelse @da
definition: Relaterer en ressource til en note, der giver oplysninger om kompleks seriebetegnelse eller ukorrekt nummerering i serien, om ændringer i seriebeskrivelse eller om andre oplysninger relateret til seriebeskrivelsen. @da
label: heeft noot bij reeksvermelding @nl
label: huomautus aineiston sarjamerkinnöstä @fi
label: له تبصرة عن بيان السلسلة @ar
definition: يربط بين مصدر وتبصرة عن مصدر يوفر معلومات عن السلسلة التي يرتبط بها المصدر. @ar
definition: Liittää aineiston lisätietoon aineistoon liittyvästä sarjasta. @fi
label: hat Anmerkung zur Gesamttitelangabe @de
definition: Setzt eine Ressource in Beziehung zu einer Anmerkung zur Ressource, die Informationen über eine Reihe enthält, mit der eine Ressource in Verbindung steht. @de
label: 有关于丛编说明的附注 @zh-hans
definition: 将一种资源与提供关于和资源有关的丛编的信息的一个关于资源的附注关联起来。 @zh-hans
label: sorozati közlésről szóló megjegyzése a következő: @hu
definition: Hozzákapcsol egy forrást egy forrásra tett megjegyzéshez, amely információt nyújt a forráshoz kapcsolódó sorozatról. @hu
label: seri bildirimi hakkında not ile ilişkilidir @tr
definition: Bir kaynağı, kaynağın ilişkili olduğu bir dizi hakkında bilgi sağlayan kaynak notu ile ilişkilendirir. @tr

has note on statement of responsibility
status: Published
definition: Relates a resource to note on resource that provides information on an agent, and their function, who is responsible for a resource.
type: Property
lexical alias: noteOnStatementOfResponsibility.en
sub property of: has note on resource
label: har note til ophavsangivelse @da
definition: Relaterer en ressource til en note, der giver oplysninger om en agent, der ikke er nævnt i ophavsangivelsen, men som er tillagt ansvaret for det intellektuelle eller kunstneriske indhold af værket, om variantformer af navne, der optræder i ressourcen, om ændringer i ophavsangivelser eller om andre detaljer der knytter sig til ophavsangivelsen. @da
label: heeft noot bij verantwoordelijkheidsvermelding @nl
label: huomautus aineiston vastuullisuusmerkinnöstä @fi
label: له تبصرة عن بيان المسئولية @ar
definition: يربط بين مصدر وتبصرة عن مصدر يوفر معلومات عن وكيل، ووظيفته، ومن مسؤول عن المصدر. @ar
definition: Liittää aineiston lisätietoon aineistossa vastuussa olevasta toimijasta ja tämän roolista. @fi
label: hat Anmerkung zur Verantwortlichkeitsangabe @de
definition: Setzt eine Ressource in Beziehung zu einer Anmerkung zur Ressource, die Informationen über einen Akteur und dessen Funktion enthält, der für eine Ressource verantwortlich ist. @de
label: 有关于责任说明的附注 @zh-hans
definition: 将一种资源与提供关于对资源负责的行为者及其职能的信息的关于资源的附注关联起来。 @zh-hans
label: felelősségi közlésről szóló megjegyzése a következő: @hu
definition: Hozzákapcsol egy forrást egy forrásra tett megjegyzéshez, amely információt nyújt egy forrásért felelős ágensről és funkciójáról. @hu
label: sorumluluk bildirimi hakkında not ile ilişkilidir @tr
definition: Bir kaynağı, bir kaynaktan sorumlu olan temsilci ve işlevleri hakkında bilgi sağlayan kaynak notu ile ilişkilendirir. @tr

has note on title
status: Published
definition: Relates a resource to a note on resource that provides information on inaccuracies appearing in titles, complex changes in titles, or on other information relating to a title.
type: Property
lexical alias: noteOnTitle.en
sub property of: has note on resource
label: har note om titel @da
definition: Relaterer en ressource til en note, der giver oplysninger om titlens kilde, den dato, hvor titlen blev set, titelvariationer, unøjagtigheder, sletninger etc. eller om andre oplysninger relateret til en titel. @da
label: heeft noot bij titel @nl
label: huomautus aineiston nimekkeestä @fi
label: له تبصرة عن عنوان @ar
definition: يربط بين مصدر وتبصرة عن مصدر يوفر معلومات عن الأخطاء التي تظهر في العناوين، أو التغيرات المعقدة في العناوين، أو أي معلومات أخرى متعلقة بعنوان. @ar
definition: Liittää aineiston lisätietoon nimekkeiden epätarkkuuksista, nimekkeiden vaihteluista tai muuta nimekkeeseen liittyvää tietoa. @fi
label: hat Anmerkung zum Titel @de
definition: Setzt eine Ressource in Beziehung zu einer Anmerkung zur Ressource, die Informationen über Ungenauigkeiten in Titeln, unübersichtliche Änderungen in Titeln oder andere Informationen, die sich auf den Titel beziehen, enthält. @de
label: 有关于题名的附注 @zh-hans
definition: 将一种资源与提供关于题名出现不准确性、题名复杂变化或其他与题名相关信息的关于资源的附注关联起来。 @zh-hans
label: a címről szóló megjegyzése a következő: @hu
definition: Hozzákapcsol egy forrást egy megjegyzéshez, amely információt nyújt a forrásról, amelyből a címet vették, az időpontról, amikor a címet megnézték, a címek változatairól, a pontatlanságokról, törlésekről stb. vagy más, a címmel kapcsolatos információkról. @hu
label: başlık hakkında not ile ilişkilidir @tr
definition: Bir kaynağı, başlıklarda görünen yanlışlıklar, başlıklardaki karmaşık değişiklikler hakkında veya başlıkla ilgili diğer bilgileri sağlayan kaynak notu ile ilişkilendirir. @tr

is novelization of
status: Published
definition: Relates a resource to a resource that is adapted as a novel.
type: Property
sub property of: is adaptation of
inverse of: is adapted as novel
lexical alias: novelizationOf.en
label: er omskrivning til roman af @da
definition: Relaterer en ressource til en ressource, der er blevet bearbejdet som roman. @da
label: is romanbewerking van @nl
label: romaanimukaelma aineistosta @fi
label: هو روائية لـ @ar
definition: يربط بين مصدر ومصدر تم تحويره كرواية. @ar
definition: Liittää aineiston romaaniksi sovitettuun aineistoon. @fi
label: ist Romanbearbeitung von @de
definition: Setzt eine Ressource in Beziehung zu einer Ressource, die als Roman bearbeitet ist. @de
label: 是……的小说化 @zh-hans
definition: 将一种资源与被改编为小说的一种资源关联起来。 @zh-hans
label: regényfeldolgozása a következőnek: @hu
definition: Hozzákapcsol egy forrást egy forráshoz, amelyet regényként adaptáltak. @hu
label: romanlaştırılmasıdır @tr
definition: Bir kaynağı, roman olarak uyarlanmış bir kaynakla ilişkilendirir. @tr

has numbering of part
status: Published
definition: Relates a resource to a designation that is assigned to a resource to identify its position in a sequence of individual parts of a larger resource.
type: Property
lexical alias: numberingOfPart.en
scope note: Numbering may consist of a numeral, a letter, any other character, or the combination of these with or without an accompanying caption, and/or a chronological designation.
label: har nummerering af del @da
definition: Relaterer en ressource til en sekvensbetegnelse for en del eller flere dele i et større Ressource. @da
scope note: Nummerering af del kan omfatte et tal, et bogstav, ethvert andet tegn eller en kombination af disse med eller uden tilhørende tekst og/eller en kronologisk betegnelse @da
label: heeft nummering van deel @nl
label: aineiston osan numerointi @fi
label: له ترقيم لجزء @ar
definition: يربط بين مصدر وتسمية في شكل أرقام أو حروف هجائية، أو تاريخ أو أي فترة زمنية أخرى، مستخدمة لتشير إلى تسلسل جزء من مصدر ضمن مصدر كامل. @ar
scope note: قد يتكون الترقيم من رقم، أو حرف، أو أي تمثيلات أخرى تُستخدم بشكل منفصل أو مُجمع، وقد يُصاحبها أو لا يُصاحبها تعليقًا، و/أو تسمية زمنية. @ar
definition: Liittää aineiston numero- tai kirjainmuotoiseen määritteeseen tai ajankohtaan, jota käytetään määrittämään aineiston osan paikka aineiston kokonaisuudessa. @fi
scope note: Numerointi voi koostua numerosta, kirjaimesta, mistä tahansa muusta merkistä tai näiden yhdistelmästä. Siihen voi kuulua, mutta välttämättä ei kuulu, liittyvä seloste ai kronologinen tunniste. @fi
label: hat Zählung eines Teils @de
definition: Setzt eine Ressource in Beziehung zu einer Bezeichnung in Form von Nummern oder Buchstaben oder zu einem Datum oder einem anderen Zeitraum, die/das/der verwendet wird, um die Abfolge eines Teils einer Ressource innerhalb der gesamten Ressource anzugeben. @de
scope note: Darunter fallen Ziffern, Buchstaben, beliebige andere Zeichen oder Kombinationen davon (mit oder ohne begleitende Beschriftung) und/oder chronologische Bezeichnungen. @de
label: 有部分的编号 @zh-hans
definition: 将一种资源与被分配给一种资源以标识其在一种更大的资源的个别部分的序列中的位置的一个标识关联起来。 @zh-hans
scope note: 编号可以由数字、字母、任何其他字符、或其组合组成并且可以有或没有伴随的说明文字和/或年代标识 @zh-hans
definition: Relaciona un recurs amb una designació que s’assigna a un recurs per identificar la seva posició en una seqüència de parts individuals d’un recurs més gran. @ca
label: részszámozása a következő: @hu
definition: Hozzákapcsol egy forrást egy szám vagy alfabetikus karakter, vagy dátum vagy egyéb időtartam formájában lévő jelöléshez, amely számozási rendszerként jelzi a teljes forráson belül a részek sorrendiségét. @hu
scope note: A számozás állhat számokból, betűkből és bármely egyéb karakterből, vagy ezek kombinációjából, kísérő feliratból és/vagy kronológiai jelölésből vagy ezek nélkül. @hu
label: bölümün numaralandırılması ile ilişkilidir @tr
definition: Bir kaynağı, bir bütün kaynak içindeki bir parça kaynağın sırasını belirtmek için kullanılan sayılar veya alfabetik karakterler ya da bir tarih veya başka bir zaman aralığı biçimindeki bir tanım ile ilişkilendirir. @tr
scope note: Numaralandırma bir rakamdan, bir harften, başka bir karakterden veya bunlara eşlik eden bir başlıkla veya başlıksız kombinasyonundan ve/veya kronolojik bir tanımlamadan oluşabilir. @tr

has numbering of sequence
status: Published
definition: Relates a resource to the first and last designations of a sequence of the individual parts or iterations of a resource.
type: Property
lexical alias: numberingOfSequence.en
label: har nummerering af periodika @da
definition: Relaterer en ressource til en betegnelse for hvert nummer eller hver del af et periodikum. @da
scope note: Nummerering af omfatter et tal, et bogstav, ethvert andet tegn eller en kombination af disse med eller uden tilhørende tekst og/eller en kronologisk betegnelse. @da
label: heeft nummering van volgorde @nl
label: له ترقيم متسلسل @ar
definition: يربط بين مصدر وأول وآخر تسمية لتسلسل خاص بأجزاء منفردة أو أجزاء أو أعداد لمصدر. @ar
label: numerointijakso aineistossa @fi
definition: Liittää aineiston ensimmäiseen ja viimeiseen määritteseen, joilla ilmaistaan aineiston yksittäisten osien tai iteraatioiden peräkkäisyyttä. @fi
label: hat Zählung einer fortlaufenden Ressource @de
definition: Setzt eine Ressource in Beziehung zu der ersten und letzten Bezeichnung der einzelnen Ausgaben einer fortlaufenden Ressource. @de
label: 有序列的编号 @zh-hans
definition: 将一种资源与一种资源的个别部分或更新后整体的序列中第一个和最后一个的标识关联起来。 @zh-hans
label: sorrendiségszámozása a következő: @hu
definition: Hozzákapcsol egy forrást egy forrás egyes részeinek vagy iterációinak a sorrendjében az elsőt és az utolsót mutatót jelöléshez. @hu
has subproperty: has first alphanumeric designation of alternative sequence
has subproperty: has first alphanumeric designation of sequence
has subproperty: has first chronological designation of alternative sequence
has subproperty: has first chronological designation of sequence
has subproperty: has last alphanumeric designation of alternative sequence
has subproperty: has last alphanumeric designation of sequence
has subproperty: has last chronological designation of alternative sequence
has subproperty: has last chronological designation of sequence
label: sıranın numaralandırılması ile ilişkilidir @tr
definition: Bir kaynağı, bir kaynağın ayrı parçalarının veya tekrarlamalarının dizisinin ilk ve son belirteçleriyle ilişkilendirir. @tr

has numbering within sequence
status: Published
definition: Relates a resource to a nomen that is a designation that is assigned to a resource to identify its position in a sequence of individual parts of a larger resource or parts or issues of a larger resource.
type: Property
scope note: Numbering may include dates or other timespans, alphanumeric or other characters, and an accompanying caption.
label: har nummerering indenfor serie @da
definition: Relaterer en ressource til en sekvensbetegnelse for en del eller flere dele i en serie. @da
scope note: Nummerering omfatter et tal, et bogstav, ethvert andet tegn eller en kombination af disse med eller uden tilhørende tekst og/eller en kronologisk betegnelse. @da
inverse of: is numbering within sequence of
lexical alias: numberingWithinSequence.en
label: heeft nummering binnen volgorde @nl
label: sarjan sisäinen numerointi aineistolle @fi
label: له ترقيم ضمن تسلسل @ar
definition: يربط بين مصدر وتسمية لتسلسل خاصة بجزء أو عدة أجزاء ضمن سلسلة. @ar
scope note: قد يتضمن الترقيم تواريخ أو أي فترات زمنية أخرى، أو تمثيلات هجائية رقمية أو تمثيلات أخرى، ويتضمن أيضًا تعليق مصاحب. @ar
definition: Liittää aineiston määritelmään, joka identifioi sen sijainnin sarjan osan tai osien jaksossa. @fi
scope note: Numerointi voi sisältää päivämääriä tai muita ajanjaksoja, aakkosnumeerisia tai muita merkkejä sekä selosteen. @fi
label: hat Zählung innerhalb einer Reihe @de
definition: Setzt eine Ressource in Beziehung zu einer Bezeichnung einer Sequenzierung eines Teils oder mehrerer Teile innerhalb einer Reihe. @de
scope note: Darunter fallen Daten oder andere Zeiträume, alphanumerische oder andere Zeichen und ein Begleittext. @de
label: 有序列内的编号 @zh-hans
definition: 将一种资源与作为被分配给一种资源以标识其在一种更大的资源或者更大的资源的部分或期的个别部分的序列中的位置的一个标识的一个命名关联起来。 @zh-hans
scope note: 编号可以包括日期或其他时间段、字母数字或其他字符、以及伴随的说明文字 @zh-hans
definition: Relaciona un recurs amb un nomen que és una designació que s’assigna a un recurs per identificar la seva posició en una seqüència de parts individuals d’un recurs més gran o parts o números d’un recurs més gran. @ca
label: sorozaton belüli számozása a következő: @hu
definition: Hozzákapcsol egy forrást rész vagy részek sorozaton belüli számozásának jelöléséhez. @hu
scope note: A számozás jelenthet dátumokat vagy egyéb időtartamokat, és alfanumerikus vagy egyéb karaktereket is, továbbá kísérő feliratot. @hu
label: sıra içinde numaralandırma ile ilişkilidir @tr
definition: Bir kaynağı, bir serideki bir parçanın veya parçaların sıralanmasının belirlenmesiyle ilişkilendirir. @tr
scope note: Numaralandırma, tarihleri ​​veya diğer zaman aralıklarını, alfasayısal veya diğer karakterleri veberaberindeki bir başlığı içerebilir. @tr

has numbering within subseries (Deprecated
status: Deprecated
definition: Relates a resource to a designation of a sequencing of a part or parts within a subseries. (Deprecated)
type: Property
lexical alias: numberingWithinSubseries.en
scope note: Numbering may consist of a numeral, a letter, any other character, or the combination of these with or without an accompanying caption and/or a chronological designation. (Deprecated)
label: har nummerering indenfor underserie @da
definition: Relaterer en ressource til en sekvensbetegnelse for en del eller flere dele i en underserie. @da
scope note: Nummerering omfatter et tal, et bogstav, ethvert andet tegn eller en kombination af disse med eller uden tilhørende tekst og/eller en kronologisk betegnelse. @da

has number of conference
status: Published
definition: Relates an agent to a designation of the sequencing of a conference, exhibition, or other formally named and convened event that gives rise to a resource.
type: Property
lexical alias: numberOfConference.en
label: har nummer på konference etc. @da
definition: Relaterer en ressource til en sekvensbetegnelse etc. i en række af konferencer etc. @da
label: heeft nummer van conferentie @nl
label: konferenssin numero aineistolle @fi
label: له رقم مؤتمر @ar
definition: يربط بين مصدر وتحديد تتابع مؤتمر، إلخ.، ضمن سلسلة من المؤتمرات، إلخ. @ar
definition: Liittää aineiston konferenssin, näyttelyn tai muun nimetyn ja kokontuneen tapahtuman järjestyslukuun. @fi
label: hat Zählung einer Konferenz @de
definition: Setzt eine Ressource in Beziehung zu einer Bezeichnung für ein Zählfolge einer Konferenz und so weiter innerhalb einer Reihe von Konferenzen und so weiter. @de
label: 有会议的届次 @zh-hans
definition: 将一个行为者与产生作品的会议、展览或其他正式命名并举办的活动的序列的标识关联起来。 @zh-hans
definition: Relaciona un agent amb una designació de la seqüència d’un congrés, una exposició o qualsevol altre esdeveniment formalment esmentat i convocat que dona origen a un recurs. @ca
label: konferencia sorszáma a következő: @hu
definition: Hozzákapcsol egy forrást egy konferencia, stb. sorrendjének jelöléséhez, konferenciák, stb. sorozatán belül. @hu
label: konferans numarası hakkında not ile ilişkilidir @tr
definition: Bir kaynağı, bir dizi konferans vb. içindeki bir konferans vb. sıralamasının bir tanımıyla ilişkilendirir. @tr

has numeric designation of musical resource
status: Published
definition: Relates a resource to a nomen that is a serial number, opus number, or thematic index number assigned to a musical resource by a composer, publisher, or a musicologist.
type: Property
lexical alias: numericDesignationOfMusicalResource.en
scope note: A numeric designation of a musical resource includes a caption such as e.g., no., op., BWV, and it may include a numeral, a letter, a word, any other character, or the combination of these.
label: har numerisk betegnelse for musikressource @da
definition: Relaterer en ressource til et serienummer, opusnummer eller værkfortegnelsesnummer tildelt en musikressource af en komponist, en udgiver eller en musikforsker. @da
scope note: En numerisk betegnelse for en musikressource inkluderer en indledning som fx no., op., BWV og den kan inkludere et nummer, et bogstav, et ord, eller et hvilket som helst andet tegn eller en kombination af disse. @da
inverse of: is numeric designation of musical resource of
label: heeft numerieke aanduiding van muziek-resource @nl
label: لديه تسمية رقمية لمصدر موسيقي @ar
definition: يربط بين مصدر ورقم مسلسل، رقم قطعة موسيقية، رقم كشاف موضوعى مخصص لمصدر موسيقى من جانب ملحن، ناشر، أو عالم موسيقى. @ar
scope note: تتضمن التسمية الرقمية لمصدر موسيقي تعليقًا (على سبيل المثال، رقم، مرجع سابق، BWV) وقد يتضمن رقمًا، حرفًا، كلمة، أو أي رمزًا آخر أو مزيجًا من هذه العناصر. @ar
label: musiikkiaineiston numeromäärite @fi
definition: Liittää aineiston säveltäjän, julkaisijan tai musiikintutkijan antamaan järjestysnumeroon, opusnumeroon tai temaattisen teosluettelon numeroon. @fi
scope note: Musiikkiaineiston numeromäärite sisältää selosteen, esimerkiksi no., op. tai BWV, ja se voi sisältää numeron, kirjaimen, sanan, minkä tahansa muun merkin tai näiden yhdistelmän. @fi
label: hat numerische Bezeichnung einer Musikressource @de
definition: Setzt ein Werk in Beziehung zu einer laufenden Nummer, einer Opus-Nummer oder einer Werkverzeichnisnummer, die einem Musikwerk durch eine Komponistin/einen Komponisten, einen Verlag oder eine Musikwissenschaftlerin/einen Musikwissenschaftler zugewiesen wird. @de
scope note: Darunter fallen einleitende Begriffe (zum Beispiel Nr., op., BWV) sowie gegebenenfalls Ziffern, Buchstaben, Wörter, beliebige andere Zeichen oder eine Kombination davon. @de
label: 有音乐资源的数字标识 @zh-hans
definition: 将一种资源与作为作曲者、出版者或者音乐学家给一种音乐资源分配的序列号、作品号或主题索引号的一个命名关联起来。 @zh-hans
scope note: 音乐资源的数字标识包括诸如no.、op.、BWV之类的说明文字、并可以包括数字、字母、单词、任何其他字符、或者它们的组合。 @zh-hans
definition: Obra que és una obra musical que té un identificador d’obra que és un número d’ordre, un número d’opus o un número d’índex temàtic assignat a una obra musical per un compositor, un editor o un musicòleg. @ca
label: zenei forrás számjelzése a következő: @hu
definition: Hozzákapcsol egy forrást egy sorozati számhoz, opusszámhoz vagy tematikus indexszámhoz, amelyet egy zeneszerző, egy kiadó vagy egy zenetudós rendel hozzá egy zenei forráshoz. @hu
scope note: Egy zenei forrás számjelzése magában foglal feliratot is, mint például no., op., BWV, és állhat számokból, betűkből, szavakból és bármely egyéb karakterből, vagy ezek kombinációjából. @hu
has subproperty: has opus number
has subproperty: has serial number
has subproperty: has thematic index number
label: müzikal kaynağın sayısal tanımlayıcısı ile ilişkilidir @tr
definition: Bir kaynağı, bir besteci, yayıncı veya müzikolog tarafından bir müzik kaynağına atanan seri numarası, beste numarası veya tematik dizin numarası ile ilişkilendirir. @tr
scope note: Bir müzik kaynağının sayısal gösterimi, örn., no., op., BWV gibi bir başlık içerir ve bir rakam, bir harf, bir kelime, herhangi bir başka karakter veya bunların kombinasyonunu içerebilir. @tr

is numeric designation of musical resource of
status: Published
type: Property
lexical alias: numericDesignationOfMusicalResourceOf.en
inverse of: has numeric designation of musical resource
definition: Relates a nomen to a musical resource that has an identifier for resource that is a serial number, opus number, or thematic index number assigned to a musical resource by a composer, publisher, or a musicologist.
label: is numerieke aanduiding van muziek-resource van @nl
label: هو تسمية رقمية لمصدر موسيقي لـ @ar
definition: يربط تسمية بمصدر موسيقي له معرف لمصدر عبارة عن عن رقم مسلسل، رقم قطعة موسيقية، رقم كشاف موضوعى مخصص لمصدر موسيقى من جانب ملحن، ناشر، أو عالم موسيقى. @ar
label: er numerisk betegnelse af musikressource af @da
definition: Relaterer et nomen til en musikressource der har en identifikator for ressource, som er et serienummer, opusnummer, eller tematisk indeksnummer, tildelt til en musikressource af en komponist, udgiver, eller musikforsker. @da
label: numeerinen määrite @fi
label: ist numerische Bezeichnung einer Musikressource von @de
definition: Setzt ein Nomen in Beziehung zu einer Musikressource, die über einen Identifikator für eine Ressource verfügt, der eine laufende Nummer, eine Opus-Nummer oder eine Werkverzeichnisnummer darstellt, die einer Musikressource durch eine Komponistin/einen Komponisten, einen Verlag oder eine Musikwissenschaftlerin/einen Musikwissenschaftler zugewiesen wird. @de
definition: Liittää nomenin musiikkiaineistoon, jolla on tunnisteena säveltäjän, julkaisijan tai musiikkitieteilijän sarjanumero, opusnumero tai temaattisen teosluettelon numero. @fi
label: 是……的音乐资源的数字标识 @zh-hans
definition: 将一个命名与有一个资源标识符（即作曲者、出版者或者音乐学家分配的序列号、作品号或主题索引号）的一种音乐资源关联起来。 @zh-hans
label: számjelzése a következő zenei forrásnak: @hu
definition: Hozzákapcsol egy noment egy zenei forráshoz, amely rendelkezik egy olyan forrásazonosítóval, amely egy zeneszerzőtől, kiadótól vagy egy zenetudóstól származó, a zenei forrást jelölő sorozati szám, opusszám vagy egy tematikus indexszám. @hu
has subproperty: is opus number of
has subproperty: is serial number of
has subproperty: is thematic index number of
label: müzikal kaynağının sayısal tanımlamasıdır @tr
definition: Bir ismi, bir besteci, yayıncı veya müzikolog tarafından bir müzik kaynağına atanan bir seri numarası, opus numarası veya tematik dizin numarası olan bir kaynak tanımlayıcısına sahip bir müzik kaynağıyla ilişkilendirir. @tr

has officer
status: Published
definition: Relates an agent to an agent who holds an office in an agent.
type: Property
lexical alias: officer.en
inverse of: is officer of
sub property of: has related agent of agent
label: har embedsmand @da
definition: Relaterer en agent der har et embede i en ledelse eller der leder en agent til en agent. @da
label: heeft functionaris @nl
label: له موظف مسؤول @ar
definition: يربط بين وكيل يشغل منصبًا في أو يشرف على وكيل ووكيل. @ar
label: viranhaltija (toimija) aineistossa @fi
definition: Liittää toimijaan viranhaltijana tai johtajana toimivan toimijan. @fi
label: hat leitende Angestellte/leitenden Angestellten @de
definition: Setzt einen Akteur in Beziehung zu einem Akteur, der ein Amt innehat oder einen Akteur befehligt. @de
label: 有任职者 @zh-hans
definition: 将一个行为者与在一个行为者任职的一个行为者关联起来。 @zh-hans
definition: Relaciona un agent amb un agent que té un càrrec en un agent. @ca
label: tisztviselője a következő: @hu
definition: Hozzákapcsol egy tisztséget betöltő ágenst vagy egy utasítást adó ágenst egy ágenshez. @hu
has subproperty: has chief executive
has subproperty: has trustee
label: yetkili ile ilişkilidir @tr
definition: Bir temsilcide görev yapan veya bir temsilciye komuta eden temsilciyi bir temsilciyle ilişkilendirir. @tr

is officer of
status: Published
definition: Relates an agent to an agent holding an office in or commanding an agent.
type: Property
inverse of: has officer
lexical alias: officerOf.en
sub property of: has related agent of agent
label: er embedsmand i @da
definition: Relaterer en agent til en agent hvor en agent har et embede eller som en person leder. @da
label: heeft functionaris van @nl
label: له مسؤول عن @ar
definition: يربط بين وكيل ووكيل يشغل منصبًا أو يُشرف على وكيل. @ar
label: toimihenkilö @fi
definition: Liittää yhteistoimijan toimijaan, jolla on yhteistoimijassa toimi tai virka. @fi
label: hat leitende Angestellte/leitenden Angestellten von @de
definition: Setzt einen Akteur in Beziehung zu einem Akteur, der ein Amt innehat oder einen Akteur leitet. @de
label: 是……的任职者 @zh-hans
definition: 将一个行为者与在一个行为者中任职或掌控一个行为者的一个行为者关联起来。 @zh-hans
label: és directiu de @ca
definition: Relaciona un agent amb un agent que ocupa un càrrec en un agent o que comanda un agent. @ca
label: tisztviselője: @hu
definition: Hozzákapcsol egy ágenst egy tisztséget betöltő vagy utasítást adó ágenshez. @hu
has subproperty: is chief executive of
has subproperty: is trustee of
label: yetkilisi ile ilişkilidir @tr
definition: Bir temsilciyi, bir makamda görev yapan veya bir temsilciye komuta eden bir temsilci ile ilişkilendirir. @tr

is on disc with
status: Published
definition: Relates a resource to a resource that is contained on the same disc as a resource.
type: Property
sub property of: is on carrier unit with
lexical alias: onDiscWith.en
label: er på disc med @da
definition: Relaterer en ressource til en ressource, der er udgivet på den samme disc som en ressource, der beskrives. @da
label: is op disk met @nl
label: levyllä myös (aineisto) @fi
label: هو على قرص مع @ar
definition: يربط بين مصدر ومصدر موجود على القرص نفسه كمصدر @ar
definition: Liittää aineiston samalle levylle tallennettuun toiseen aineistoon. @fi
label: ist auf Disk mit @de
definition: Setzt eine Ressource in Beziehung zu einer Ressource, die auf derselben Disk enthalten ist, wie eine Ressource. @de
label: 与……合盘 @zh-hans
definition: 将一种资源与和一种资源一起包含在同一片盘中的一种资源关联起来。 @zh-hans
label: azonos lemezen a következővel: @hu
definition: Hozzákapcsol egy forrást egy forráshoz, amely ugyanazon a lemezen található, mint a forrás. @hu
label: ile aynı disk üzerinde yer alır @tr
definition: Bir kaynağı, kaynakla aynı diskte bulunan bir diğer kaynakla ilişkilendirir. @tr

has onscreen participant
status: Published
type: Property
lexical alias: onscreenParticipant.en
definition: Relates a resource to an agent who contributes to a nonfiction moving image resource by taking an active role as a participant.
inverse of: is onscreen participant of
scope note: Appearance on screen to provide contextual or background information is excluded.
sub property of: has contributor (Deprecated)
see also: has onscreen presenter
label: har programmedvirkende @da
definition: Relaterer et udtryk til en agent, der har bidraget til en levende billed-ressource af faktuel karakter ved at påtage sig en aktiv rolle som deltager. @da
scope note: Optræden på skærmen for at give kontekstuel eller baggrundsinformation er ikke omfattet. @da
label: heeft deelnemer in beeld @nl
label: له مشارك على الشاشة @ar
definition: يربط مصدر بوكيل يُساهم في مصدر صور متحركة غير خيالية من خلال القيام بدور نشط كمشارك. @ar
scope note: يُستبعد المظهر الذي يظهر على الشاشة لتقديم معلومات تتعلق بالسياق أو الخلفية. @ar
label: aineiston liikkuvaan kuvaan osallistuja @fi
definition: Liittää aineiston toimijaan, joka osallistuu ei-fiktiivisen liikkuvan kuvan teoksen aineiston tekemiseen ottamalla aktiivisen roolin osallistujana. @fi
scope note: Ei koske esiintymistä lisä- tai taustatietojen kertojana. @fi
label: hat On-Screen-Teilnehmerin/On-Screen-Teilnehmer @de
definition: Setzt eine Ressource in Beziehung zu einem Akteur, der zu einer Dokumentarfilmressource beiträgt, indem er eine aktive Rolle als Teilnehmer einnimmt. @de
scope note: Darunter fallen keine Bildschirmauftritte, die Kontext- oder Hintergrundinformationen liefern. @de
label: 有屏幕参与者 @zh-hans
definition: 将一种资源与通过积极参与而对一种非虚构动态图像资源有贡献的一个行为者关联起来。 @zh-hans
scope note: 不包括提供背景信息在屏幕上出现的情况。 @zh-hans
label: képernyőn megjelenő résztvevője a következő: @hu
definition: Hozzákapcsol egy forrást egy ágenshez, amely egy dokumentarista vagy tényirodalmi mozgóképforráshoz hozzájárul azzal, hogy résztvevőként aktív szerepet játszik benne. @hu
scope note: Az olyan képernyőn való megjelenés, amely környezetfüggő vagy háttérinformációkat nyújt, nem tartozik ide. @hu
label: ekran katılımcısı ile ilişkilidir @tr
definition: Bir kaynağı, katılımcı olarak aktif rol alarak kurgusal olmayan hareketli görüntü kaynağına katkıda bulunan bir temsilci ile ilişkilendirir. @tr
scope note: Bağlamsal veya arka plan bilgisi sağlamak için ekranda görünme hariçtir. @tr

is onscreen participant of
status: Published
type: Property
lexical alias: onscreenParticipantOf.en
definition: Relates an agent to a resource that includes a contribution by an agent of taking an active role as a participant.
inverse of: has onscreen participant
scope note: Appearance on screen to provide contextual or background information is excluded.
sub property of: is contributor of (Deprecated)
see also: is onscreen presenter of
label: er programmedvirkende i @da
definition: Relaterer en agent, der har bidraget til en levende non-fiction billed-ressource ved at påtage sig en aktiv rolle som deltager til en ressource. @da
scope note: Optræden på skærmen for at give kontekstuel eller baggrundsinformation er ikke omfattet. @da
label: is deelnemer in beeld van @nl
label: هو مشارك على الشاشة لـ @ar
definition: يربط بين وكيل ومصدر يتضمن إسهام وكيل في القيام بدور نشط كمشارك. @ar
scope note: يُستبعد المظهر الذي يظهر على الشاشة لتقديم معلومات تتعلق بالسياق أو الخلفية. @ar
label: liikkuvaan kuvaan osallistuja (toimija) aineistossa @fi
definition: Liittää aineiston toimijaan, jossa toimija on osallisena ei-fiktiivisen liikkuvan kuvan teoksen aineiston tekemiseen ottamalla aktiivisen roolin osallistujana. @fi
scope note: Ei koske esiintymistä lisä- tai taustatietojen kertojana. @fi
label: ist On-Screen-Teilnehmerin/On-Screen-Teilnehmer von @de
definition: Setzt einen Akteur in Beziehung zu einer Ressource, zu der ein Akteur beiträgt, indem er eine aktive Rolle als Teilnehmer einnimmt. @de
scope note: Darunter fallen keine Bildschirmauftritte, die Kontext- oder Hintergrundinformationen liefern. @de
label: 是……的屏幕参与者 @zh-hans
definition: 将一个行为者与包括作为积极参与者的一个行为者的贡献的一种资源关联起来。 @zh-hans
scope note: 不包括提供背景信息在屏幕上出现的情况。 @zh-hans
label: képernyőn megjelenő résztvevője a következőnek: @hu
definition: Hozzákapcsol egy ágenst egy forráshoz, amely magában foglalja egy résztvevőként aktív szerepet vállaló ágens közreműködését. @hu
scope note: Az olyan képernyőn való megjelenés, amely környezetfüggő vagy háttérinformációkat nyújt, nem tartozik ide. @hu
label: ekran katılımcısıdır @tr
definition: Bir temsilciyi, katılımcı olarak aktif rol alan temsilcinin katkısını içeren bir kaynakla ilişkilendirir. @tr
scope note: Bağlamsal veya arka plan bilgisi sağlamak için ekranda görünme hariçtir. @tr

has onscreen presenter
status: Published
definition: Relates a resource to an agent who is a performer who contributes to a resource by appearing on screen to provide contextual or background information.
type: Property
sub property of: has performer
inverse of: is onscreen presenter of
lexical alias: onscreenPresenter.en
scope note: Appearance in nonfiction moving image materials or in introductions to fiction moving image materials is included. Appearance on screen in a non-performing role is excluded.
see also: has onscreen participant
label: har programvært @da
definition: Relaterer en ressource til en performer, der har bidraget til en ressource ved at vise sig på skærmen for at give kontekstuel eller baggrundsinformation. @da
scope note: Optræden i levende billedmaterialer af faktuel karakter eller i introduktioner til levende billedmaterialer af fiktiv karakter er omfattet. Optræden på skærmen i en ikke-fremførende rolle er ikke omfattet. @da
label: heeft presentator op beeld @nl
label: esittelijä aineistossa @fi
label: له مُقدم برامج على الشاشة @ar
definition: يربط بين مصدر ومؤدٍ يُساهم في مصدر من خلال الظهور على الشاشة لتقديم معلومات تتعلق بالسياق أو الخلفية.قد يظهر مقدم عرض على الشاشة في مواد الصور المتحركة غير الخيالية أو أثناء تقديم مواد لصور متحركة خيالية. @ar
scope note: يتم تضمين الظهور في مواد الصور المتحركة غير الخيالية أو أثناء تقديم مواد لصور متحركة خيالية.يُستبعد من ذلك الظهور على الشاشة في دور غير مؤدِ. @ar
definition: Liittää aineiston esiintyjään, joka on aineistossa osallisena esiintymällä televisiossa tai elokuvassa taustatiedon antajana. Voi esiintyä dokumentaarisissa elokuvissa tai fiktioelokuvien johdannoissa. @fi
scope note: Koskee dokumentaarisessa elokuvassa tai fiktiivisen elokuvan johdannossa esiintymistä. @fi
label: hat On-Screen-Präsentatorin/On-Screen-Präsentator @de
definition: Setzt eine Ressource in Beziehung zu einer Ausführenden/einem Ausführenden, die/der zu einer Ressource beiträgt, indem sie/er auf dem Bildschirm erscheint, um Kontext- und Hintergrundinformationen zu liefern. @de
scope note: Darunter fallen Auftritte in nicht-fiktionalen Bewegtbildmaterialien oder in Einführungen zu fiktionalen Bewegtbildmaterialien. Darunter fallen keine Bildschirmauftritte in einer passiven Rolle. @de
label: 有屏幕主持人 @zh-hans
definition: 将一种资源与作为一个表演者通过出现在屏幕上提供语境或背景信息对一种资源有贡献的一个行为者关联起来。 @zh-hans
scope note: 包括在非虚构动态图像资料中或者在虚构动态图像资料的介绍中的出现。不包括在屏幕中作为非表演角色的出现。 @zh-hans
definition: Relaciona un recurs amb un agent que és un intèrpret que contribueix a un recurs apareixent en pantalla per proporcionar informació contextual o dels antecedents. @ca
label: képernyőn megjelenő előadó a következő: @hu
definition: Hozzákapcsol egy forrást egy előadóhoz, aki képernyőn jelenik meg és szövegösszefüggésre vonatkozó vagy háttérinformációt szolgáltat, hozzájárulva ezzel egy forráshoz. Egy képernyőn megjelenő előadó tényszerű mozgókép-anyagokban vagy fikciós mozgóképanyagok bevezetőiben látható. @hu
scope note: A tényszerű mozgókép-anyagokban vagy fikciós mozgókép-anyagok bevezetőiben való megjelenés is bele tartozik. Képernyőn nem előadói szerepben való megjelenés nem tartozik bele. @hu
label: ekran sunucusu ile ilişkilidir @tr
definition: Bir kaynağı, bağlamsal veya arka plan bilgisi sağlamak için ekranda görünerek kaynağa katkıda bulunan sunucu ile ilişkilendirir. Ekran sunucusu, kurgu olmayan hareketli görüntü materyallerinde veya kurgu olan hareketli görüntülerin tanıtımlarında görünebilir. @tr
scope note: Kurgusal olmayan hareketli görüntü materyallerinde veya kurgu hareketli görüntü materyallerine girişlerinde yer alma dahildir. Performans göstermeyen bir rolde ekranda yer alma hariçtir. @tr

is onscreen presenter of
status: Published
definition: Relates a performer who contributes to a resource by appearing on screen to provide contextual or background information. an on-screen presenter may appear in nonfiction moving image materials or in introductions to fiction moving image materials to a resource.
type: Property
sub property of: is performer of
inverse of: has onscreen presenter
lexical alias: onscreenPresenterOf.en
scope note: Appearance in nonfiction moving image materials or in introductions to fiction moving image materials is included. Appearance on screen in a non-performing role is excluded.
see also: is onscreen participant of
label: er programvært på skærmen i @da
definition: Relaterer en udøver, der bidrager til en ressource ved at optræde på en skærm for at give kontekstuel- eller baggrundsinformation til en ressource. @da
scope note: En programvært kan optræde i levende billedmaterialer af faktuel karakter eller i introduktioner til levende billedmaterialer af fiktiv karakter. Optræden på skærmen i en ikke-optrædende rolle er ikke omfattet. @da
label: is presentator in beeld van @nl
label: هو مقدم على الشاشة لـ @ar
definition: يربط مؤدٍ يُساهم في مصدر من خلال الظهور على الشاشة لتقديم معلومات تتعلق بالسياق أو الخلفية. قد يظهر مقدم عرض على الشاشة في مواد الصور المتحركة غير الخيالية أو أثناء تقديم مواد لصور متحركة خيالية إلى أحد المصادر. @ar
scope note: يتضمن الظهور في مواد الصور المتحركة غير الخيالية أو أثناء تقديم مواد لصور متحركة خيالية. يُستبعد من ذلك الظهور على الشاشة في دور غير مؤدِ. @ar
label: esittelijänä aineistossa @fi
definition: Liittää toimijan aineistoon, jonka tekemiseen hän osallistuu esiintymällä televisiossa tai elokuvassa taustatiedon antajana. @fi
scope note: Koskee ei-fiktiivisessä elokuvassa tai fiktiivisen elokuvan johdannossa esiintymistä. Ei koske esiintymistä ei-esittävässä roolissa. @fi
label: ist On-Screen-Präsentatorin/On-Screen-Präsentator von @de
definition: Setzt eine Ausführende/einen Ausführenden in Beziehung zu einer Ressource, zu der sie/er beiträgt, indem sie/er auf dem Bildschirm erscheint, um Kontext- und Hintergrundinformationen zu liefern. @de
scope note: Darunter fallen Auftritte in nicht-fiktionalen Bewegtbildmaterialien oder in Einführungen zu fiktionalen Bewegtbildmaterialien. Darunter fallen keine Bildschirmauftritte in einer passiven Rolle. @de
label: 是……的屏幕主持人 @zh-hans
definition: 将通过出现在屏幕上提供语境或背景信息对一种资源有贡献的一个表演者（屏幕主持人可出现在非虚构动态图像资料中或者在虚构动态图像资料的介绍中）与一种资源关联起来。 @zh-hans
scope note: 包括在非虚构动态图像资料中或者在虚构动态图像资料的介绍中的出现。不包括在屏幕中作为非表演角色的出现。 @zh-hans
label: képernyőn megjelenő előadója a következőnek: @hu
definition: Hozzákapcsol egy előadót egy forráshoz, aki a forráshoz hozzájárulva képernyőn jelenik meg és szövegösszefüggésre vonatkozó vagy háttérinformációt szolgáltat. Egy képernyőn megjelenő előadó tényszerű mozgóképanyagokban vagy fikciós mozgókép-anyagok bevezetőiben látható. @hu
scope note: A tényszerű mozgóképanyagokban vagy fikciós mozgóképanyagok bevezetőiben való megjelenés is idetartozik. Képernyőn nem előadói szerepben való megjelenés nem tartozik ide. @hu
label: ekran sunucusudur @tr
definition: Bağlamsal veya arka plan bilgisi sağlamak için ekranda görünerek bir kaynağa katkıda bulunan bir sanatçıyı ifade eder. bir ekran sunucusu, kurgusal olmayan hareketli görüntü materyallerinde veya kurgusal hareketli görüntü materyallerinin tanıtımlarında bir kaynakta görünebilir. @tr
scope note: Kurgusal olmayan hareketli görüntü materyallerinde veya kurgu hareketli görüntü materyallerine girişlerinde yer alma dahildir. Performans göstermeyen bir rolde ekranda yer alma hariçtir. @tr

is opera adaptation of
status: Published
definition: Relates a resource to a resource that is adapted as an opera.
type: Property
sub property of: is adaptation of
inverse of: is adapted as opera
lexical alias: operaAdaptationOf.en
label: er operabearbejdelse af @da
definition: Relaterer en ressource til en ressource, der er blevet bearbejdet til opera. @da
label: is operabewerking van @nl
label: هو اقتباس أوبرالي لـ @ar
definition: يربط بين مصدر ومصدر مقتبس كمصدر أوبرالي. @ar
label: oopperasovitus aineistosta @fi
definition: Liittää aineiston oopperaksi sovitettuun aineistoon. @fi
label: ist Opernbearbeitung von @de
definition: Setzt eine Ressource in Beziehung zu einer Ressource, die als Oper bearbeitet ist. @de
label: 是……的歌剧改编 @zh-hans
definition: 将一种资源与被改编为歌剧的一种资源关联起来。 @zh-hans
label: operafeldolgozása a következőnek: @hu
definition: Hozzákapcsol egy forrást egy forráshoz, amelyet operaként adaptáltak. @hu
label: opera uyarlamasıdır @tr
definition: Bir kaynağı, opera olarak uyarlanmış bir kaynakla ilişkilendirir. @tr

has opus number
status: Published
type: Property
lexical alias: opusNumber.en
sub property of: has numeric designation of musical resource
definition: Relates a resource to a nomen that is a numeric designation of musical resource assigned from a list of resources of a composer indicating the chronological order of composition.
inverse of: is opus number of
label: heeft opusnummer @nl
label: له رقم قطعة موسيقية @ar
definition: يربط بين مصدر وتسمية رقمية لمصدر موسيقي مخصص من قائمة مصادر لمؤلف موسيقى تشير إلى ترتيب زمنى للقطع الموسيقية. @ar
label: har opusnummer @da
definition: Relaterer en ressource til en numersik betengelse for en musikressource, tildelt fra en liste af ressourcer af en komponist, som indikerer den kronoligiske rækkefølge af kompositionen. @da
label: opusnumero aineistolle @fi
definition: Liittää aineiston musiikkiteoksen numeeriseen määritteeseen, joka on sävellykset aikajärjestyksessä esittävästä säveltäjän aineistoluettelosta otettu numerointi. @fi
label: hat Opus-Nummer @de
definition: Setzt eine Ressource in Beziehung zu einer numerische Bezeichnung einer Musikressource, die von einer Komponistin/einem Komponisten oder einem Verlag vergeben wird oder gemäß einem Nachschlagewerk oder Werkverzeichnis verwendet wird. Sie gibt meist Aufschluss über die chronologische Reihenfolge der Komposition innerhalb eines Gesamtwerks. @de
label: 有作品编号 @zh-hans
definition: 将一种资源与作为根据作曲者资源列表分配、表示作曲时间顺序的音乐资源的一个数字标识的一个命名关联起来。 @zh-hans
definition: Relaciona un recurs amb un nomen que és una designació numèrica d’un recurs musical que s’assigna a partir d’una llista de recursos d’un compositor que indica l’ordre cronològic de composició. @ca
label: opusszáma a következő: @hu
definition: Hozzákapcsol egy forrást egy zenei forrás számjelzéséhez, amelyet egy zeneszerző forrásainak a komponálás kronológiai sorrendjét jelölő jegyzékéből rendeltek hozzá. @hu
label: opus numarası ile ilişkilidir @tr
definition: Bir kaynağı, bir bestecinin kronolojik beste sırasını gösteren bir kaynak listesinden belirlenen müzikal kaynağın sayısal belirteciyle ilişkilendirir. @tr

is opus number of
status: Published
type: Property
lexical alias: opusNumberOf.en
sub property of: is numeric designation of musical resource of
inverse of: has opus number
definition: Relates a nomen to a musical resource that has an identifier for resource that is a numeric designation assigned from a list of resources of a composer indicating chronological order of composition.
label: is opusnummer van @nl
label: هو رقم قطعة موسيقية لـ @ar
definition: يربط تسمية بمصدر موسيقي له معرف لمصدر عبارة عن تسمية رقمية مخصصة من قائمة مصادر لمؤلف موسيقى تشير إلى ترتيب زمنى للقطع الموسيقية. @ar
label: er opusnummer af @da
definition: Relaterer et nomen til en musikressource, som har en identifikator for ressource, der er en numerisk betegnelse tildelt fra en liste af ressourcer af en komponist der indikerer den kronoligiske rækkefølge af kompositionen. @da
label: opusnumero aineistossa @fi
label: ist Opus-Nummer von @de
definition: Setzt ein Nomen in Beziehung zu einer Musikressource, die über einen Identifikator für eine Ressource verfügt, der von einer Komponistin/einem Komponisten oder einem Verlag vergeben wird oder gemäß einem Nachschlagewerk oder Werkverzeichnis verwendet wird. Er gibt meist Aufschluss über die chronologische Reihenfolge der Komposition innerhalb eines Gesamtwerks. @de
definition: Liittää nomenin musiikkiaineistoon, jolla on säveltäjän aineistoluettelosta otettu numeerinen, sävellyksen kronologisen järjestyksen kertova tunniste. @fi
label: 是……的作品号 @zh-hans
definition: 将一个命名与有根据作曲者资源列表分配、表示作曲时间顺序的一个数字标识作为一个资源标识的一种音乐资源关联起来。 @zh-hans
label: opusszáma a következőnek: @hu
definition: Hozzákapcsol egy noment egy zenei forráshoz, amely rendelkezik egy a zeneszerző forrásainak jegyzékéből vett olyan forrásazonosítóval, amely egy számjelzéssel jelzi a kompozíció kronológiai sorrendjét. @hu
label: opus numarasıdır @tr
definition: Bir ismi, bir bestecinin kronolojik kompozisyon sırasını gösteren kaynaklar listesinden atanan sayısal bir atama olan kaynak için bir tanımlayıcıya sahip bir müzik kaynağıyla ilişkilendirir. @tr

is oratorio adaptation of
status: Published
type: Property
lexical alias: oratorioAdaptationOf.en
definition: Relates a resource to a resource that is adapted as an oratorio.
inverse of: is adapted as oratorio
sub property of: has source
label: er oratoriebearbejdelse af @da
definition: Relaterer en ressource til en ressource, der er blevet bearbejdet som et oratorium. @da
label: is oratoriumbewerking van @nl
label: هو اقتباس موسيقى دينية لـ @ar
definition: يربط بين مصدر ومصدر تم اقتباسه كموسيقى دينية. @ar
label: oratoriosovitus aineistosta @fi
definition: Liittää aineiston oratorioksi sovitettuun aineistoon. @fi
label: ist Oratorienbearbeitung von @de
definition: Setzt eine Ressource in Beziehung zu einer Ressource, die als Oratorium bearbeitet ist. @de
label: 是……的清唱剧改编 @zh-hans
definition: 将一种资源与被改编为清唱剧的一种资源关联起来。 @zh-hans
label: oratórium-feldolgozása a következőnek: @hu
definition: Hozzákapcsol egy forrást egy forráshoz, amelyet oratóriumként adaptáltak. @hu
label: oratoryo uyarlamasıdır @tr
definition: Bir kaynağı, oratoryo olarak uyarlanmış bir kaynakla ilişkilendirir. @tr

has organizer
status: Published
type: Property
lexical alias: organizer.en
definition: Relates a resource to an agent who organizes a conference, exhibition, or other event that gives rise to a resource.
inverse of: is organizer of
sub property of: has other agent associated with resource (Deprecated)
label: har arrangør @da
definition: Relaterer en ressource til en agent, der har arrangeret den udstilling, event eller konference eller det kursus eller program etc., der gav anledning til en ressource. @da
label: heeft organisator @nl
label: له مُنَظِّم @ar
definition: يربط مصدر بوكيل يُنظم مؤتمر، معرض، أو حدث آخر يسفر عن مصدر. @ar
label: järjestäjä aineistossa @fi
definition: Liittää aineiston toimijaan, joka järjestää konferenssin, näyttelyn tai muun tapahtuman, jonka seurauksena syntyy aineisto. @fi
label: hat Veranstalterin/Veranstalter @de
definition: Setzt eine Ressource in Beziehung zu einem Akteur, der eine Konferenz, eine Ausstellung oder ein anderes Ereignis organisiert beziehungsweise veranstaltet, aus der/dem eine Ressource hervorgeht. @de
label: 有组织者 @zh-hans
definition: 将一种资源与组织会议、展览或其他事件以产生一种资源的一个行为者关联起来。 @zh-hans
label: szervezője a következő: @hu
definition: Hozzákapcsol egy forrást egy ágenshez, amely egy forrás létrejöttét eredményező konferenciát, kiállítást vagy egyéb eseményt szervez. @hu
label: organizatör ile ilişkilidir @tr
definition: Bir kaynağı, bir kaynağa yol açan bir konferans, sergi veya başka bir etkinlik düzenleyen bir temsilci ile ilişkilendirir. @tr

is organizer of
status: Published
type: Property
lexical alias: organizerOf.en
definition: Relates an agent to a resource that involves a responsibility of an agent for organizing a conference, exhibition, or other event that gives rise to a resource.
inverse of: has organizer
sub property of: is other agent associated with resource of (Deprecated)
label: er arrangør af @da
definition: Relaterer en agent, der organiserer en udstilling, et event, en konference etc. der gav ophav til en ressource til en ressource. @da
label: is organisator van @nl
label: هو مُنَظِّم لـ @ar
definition: يربط بين وكيل ومصدر ينطوي على مسؤولية وكيل عن تنظيم مؤتمر، معرض، أو حدث آخر يسفر عن مصدر. @ar
label: järjestäjä (toimija) aineistossa @fi
definition: Liittää toimijan aineistoon, jossa toimija vastaa konferenssin, näyttelyn tai muun tapahtuman, jonka seurauksena syntyy aineisto, järjestämisestä. @fi
label: ist Veranstalterin/Veranstalter von @de
definition: Setzt einen Akteur in Beziehung zu einer Ressource, bei der ein Akteur für die Organisation beziehungsweise Veranstaltung einer Konferenz, einer Ausstellung oder eines anderen Ereignisses verantwortlich ist, aus der/dem eine Ressource hervorgeht. @de
label: 是……的组织者 @zh-hans
definition: 将一个行为者与涉及组织会议、展览或其他事件以产生一种作品的一个行为者的责任的一种资源关联起来。 @zh-hans
label: szervezője a következőnek: @hu
definition: Hozzákapcsol egy ágenst egy forráshoz, amelyhez hozzátartozik az ágens felelőssége egy forrás létrejöttét eredményező konferencia, kiállítás vagy más esemény szervezéséért. @hu
label: organizatörüdür @tr
definition: Bir temsilciyi, bir kaynağa yol açan bir konferans, sergi veya başka bir etkinliği düzenlemekte görevli bir temsilcinin sorumluluğunu içeren bir kaynakla ilişkilendirir. @tr

has other agent associated with a resource (Deprecated)
status: Deprecated
scope note: Book designers, platemakers, etc., agents, etc., to whom correspondence is addressed, agents, etc., honoured by a festschrift, directors, cinematographers, sponsoring bodies, production companies, institutions, etc., hosting an exhibition or event, etc., curators, binders, restorationists, etc., are included.. (Deprecated)
definition: Relates a resource to a person, family, or corporate body other than a creator, custodian, owner, producer, publisher, distributor or manufacturer associated with a manifestation. (Deprecated)
lexical alias: otherAgentAssociatedWithAResource.en
type: Property
has subproperty: is audio engineer of
has subproperty: has casting director
has subproperty: is DJ of
has subproperty: is dubbing director of
has subproperty: is music programmer of

has other agent associated with resource (Deprecated)
status: Deprecated
definition: Relates a resource to an agent other than a creator, custodian, owner, producer, publisher, distributor, or manufacturer associated with a resource. (Deprecated)
type: Property
inverse of: is other agent associated with resource of (Deprecated)
lexical alias: otherAgentAssociatedWithResource.en
label: har anden agent knyttet til ressource @da
definition: Relaterer en ressource til en agent forskellig fra skaber, forvalter, ejer, producer, udgiver eller distributør knyttet til en ressource. @da
has subproperty: has addressee
has subproperty: has annotator
has subproperty: has appellant
has subproperty: has appellee
has subproperty: has autographer
has subproperty: has binder
has subproperty: has court governed
has subproperty: has curator (Deprecated)
has subproperty: has dedicatee
has subproperty: has dedicator
has subproperty: has defendant
has subproperty: has degree committee member
has subproperty: has degree granting institution
has subproperty: has director
has subproperty: has director of photography
has subproperty: has editorial director
has subproperty: has founder agent of resource
has subproperty: has granting institution or faculty (Deprecated)
has subproperty: has honouree
has subproperty: has host institution
has subproperty: has illuminator
has subproperty: has inscriber
has subproperty: has issuing agent
has subproperty: has judge
has subproperty: has medium
has subproperty: has organizer
has subproperty: has participant in treaty
has subproperty: has plaintiff
has subproperty: has producer
has subproperty: has production company
has subproperty: has researcher
has subproperty: has restorationist
has subproperty: has sponsoring agent of resource

is other agent associated with resource of (Deprecated)
status: Deprecated
definition: Relates an agent to a resource that involves a responsibility other than creating, having custody, owning, producing, publishing, distributing, or manufacturing. (Deprecated)
type: Property
inverse of: has other agent associated with resource (Deprecated)
lexical alias: otherAgentAssociatedWithResourceOf.en
label: er anden agent forbundet med ressource @da
definition: Relaterer en agent, der er forbundet med en ressource på en anden måde end som ophav til en ressource. @da
has subproperty: is addressee of
has subproperty: is annotator of
has subproperty: is appellant of
has subproperty: is appellee of
has subproperty: is autographer of
has subproperty: is binder of
has subproperty: is court governed of
has subproperty: is curator of (Deprecated)
has subproperty: is dedicatee of
has subproperty: is dedicator of
has subproperty: is defendant of
has subproperty: is degree committee member of
has subproperty: is degree granting institution of
has subproperty: is director of
has subproperty: is director of photography of
has subproperty: is editorial director of
has subproperty: is founder agent of resource of
has subproperty: is honouree of
has subproperty: is host institution of
has subproperty: is illuminator of
has subproperty: is inscriber of
has subproperty: is issuing agent of
has subproperty: is judge of
has subproperty: is medium of
has subproperty: is organizer of
has subproperty: is participant in treaty of
has subproperty: is plaintiff of
has subproperty: is producer of
has subproperty: is production company of
has subproperty: is researcher of
has subproperty: is restorationist of
has subproperty: has sponsored resource of agent

has other designation associated with agent (Deprecated)
status: Deprecated
definition: Relates a resource to a word, phrase, or abbreviation indicating incorporation or legal status of an agent, or any term serving to differentiate a an agent from other agents, etc., or a term other than a title that is associated with an agent’s name. (Deprecated)
type: Property
lexical alias: otherDesignationAssociatedWithAgent.en
label: har anden forklarende tilføjelse til agent @da
definition: Relaterer en ressource til et ord, frase eller forkortelse, der forklarer en agents art eller juridiske status, eller en tilføjelse, der tjener til at skelne agenten fra andre agenter etc., eller en term andet end titel der er knyttet til agentens navn. @da

has other distinguishing characteristic of resource (Deprecated)
status: Deprecated
definition: Relates a resource to a characteristic, other than form, date, or place of origin, that serves to differentiate a resource from another resource with the same preferred title of resource. (Deprecated)
type: Property
lexical alias: otherDistinguishingCharacteristicOfResource.en
label: har andet særligt kendetegn ved ressourcen @da
definition: Relaterer en ressource til et kendetegn, bortset fra form af ressource, dato af ressource, sted af ressource, indholdstype, eller sprog, der tjener til at skelne én ressource fra en anden ressource med samme titel eller fra et navn på en anden agent. @da

has other title information
status: Published
definition: Relates a resource to a word, character, or group of words or characters that appears in conjunction with, and is subordinate to, a title proper of a resource.
type: Property
sub property of: has title
lexical alias: otherTitleInformation.en
label: har anden titelinformation @da
definition: Relaterer en ressource til et ord, tegn eller en gruppe af ord og/eller tegn, der optræder i forbindelse med, og er underordnet, en ressources hovedtitel. @da
label: heeft andere titelinformatie @nl
label: له بيانات أخرى لعنوان @ar
definition: يربط بين مصدر وكلمة، حرف، أو مجموعة كلمات أو تمثيلات تظهر بمصاحبة عنوان مُنَاسِب لمصدر، وتكون تابعًا له. @ar
label: aineiston muu nimeketieto @fi
definition: Liittää aineiston sanaan, merkkiin tai ryhmään sanoja ja/tai merkkejä, jotka esiintyvät aineiston päänimekkeen kanssa ja sille alisteisina. @fi
label: hat Titelzusatz @de
definition: Setzt eine Ressource in Beziehung zu einem Wort, einem Zeichen oder einer Gruppe von Wörtern oder Zeichen, die in Verbindung mit dem Haupttitel einer Ressource erscheinen und diesem nachgeordnet sind. @de
label: 有其他题名信息 @zh-hans
definition: 将一种资源与和一种资源的正题名一起出现并附属于正题名的一个词、字符、或一组词或字符关联起来。 @zh-hans
label: egyéb címinformációja a következő: @hu
definition: Hozzákapcsol egy forrást egy szóhoz, karakterhez, vagy szavak vagy karakterek egy csoportjához, amely egy forrás főcímével párosulva, vagy annak alávetve jelenik meg. @hu
label: diğer başlık bilgisi ile ilişkilidir @tr
definition: Bir kaynağı, bir kaynağın başlığıyla birlikte görünen ve ona bağlı olan bir kelime, karakter veya kelime ya da karakter grubuyla ilişkilendirir. @tr

has other title information of series
status: Published
definition: Relates a resource to a word, character, or group of words or characters that appears in conjunction with, and is subordinate to, a title proper of a series.
type: Property
lexical alias: otherTitleInformationOfSeries.en
label: har anden titelinformation for serie @da
definition: Relaterer en ressource til et ord, tegn eller en gruppe af ord og/eller tegn, der optræder i forbindelse med, og er underordnet, en series hovedtitel. @da
label: heeft andere titelinformatie van reeks @nl
label: له بيانات عنوان أخرى لسلسلة @ar
definition: يربط بين مصدر وكلمة، حرف، أو مجموعة كلمات أو تمثيلات تظهر بمصاحبة عنوان مُنَاسِب لسلسلة، وتكون تابعًا لها. @ar
label: sarjan muu nimeketieto aineistolle @fi
definition: Liittää aineiston sanaan, merkkiin tai ryhmään sanoja ja/tai merkkejä, jotka esiintyvät sarjan päänimekkeen kanssa ja sille alisteisina. @fi
label: hat Titelzusatz einer Reihe @de
definition: Setzt eine Ressource in Beziehung zu einem Wort, einem Zeichen oder einer Gruppe von Wörtern oder Zeichen, die in Verbindung mit dem Haupttitel einer Ressource erscheinen und diesem nachgeordnet sind. @de
label: 有丛编的其他提名信息 @zh-hans
definition: 将一种资源与和一种丛编的正题名一起出现并附属于正题名的一个词、字符、或一组词或字符关联起来。 @zh-hans
label: sorozati egyéb címinformációja a következő: @hu
definition: Hozzákapcsol egy forrást egy szóhoz, karakterhez, vagy szavak vagy karakterek egy csoportjához, amely egy sorozat főcímével párosulva, vagy annak alávetve jelenik meg. @hu
label: serinin diğer başlık bilgisi ile ilişkilidir @tr
definition: Bir kaynağı, bir dizinin başlığıyla birlikte görünen ve ona bağlı olan bir kelime, karakter veya kelime ya da karakter grubuyla ilişkilendirir. @tr

has other title information of subseries (Deprecated)
status: Deprecated
definition: Relates a resource to a word, character, or group of words or characters that appears in conjunction with, and is subordinate to, a title proper of a subseries. (Deprecated)
type: Property
lexical alias: otherTitleInformationOfSubseries.en
label: har anden titelinformation for underserie @da
definition: Relaterer en ressource til et ord, tegn eller en gruppe af ord og/eller tegn, der optræder i forbindelse med, og er underordnet, en underseries hovedtitel. @da

has owner
status: Published
definition: Relates a resource to an agent who has current or former legal possession of a resource.
type: Property
inverse of: is owner of
lexical alias: owner.en
label: har ejer @da
definition: Relaterer en ressource til en agent, der er i lovlig besiddelse af en ressource. @da
label: heeft eigenaar @nl
label: aineiston omistaja @fi
label: له مالك @ar
definition: يربط مصدر بوكيل له ملكية قانونية لمصدر. @ar
definition: Liittää aineiston toimijaan, jolla on aineiston laillinen omistus. @fi
label: hat Eigentümerin/Eigentümer @de
definition: Setzt eine Ressource in Beziehung zu einem Akteur, der im rechtmäßigen Besitz einer Ressource ist. @de
label: 有拥有者 @zh-hans
definition: 将一种资源与拥有对一种资源当前或先前法定所有权的一个行为者关联起来。 @zh-hans
definition: Relaciona un recurs amb un agent que té la propietat legal actual o anterior d’un recurs. @ca
label: tulajdonosa a következő: @hu
definition: Hozzákapcsol egy forrást egy ágenshez, amelynek jogszerű tulajdonában van egy forrás. @hu
has subproperty: has current owner
has subproperty: has former owner
label: sahip ile ilişkilidir @tr
definition: Bir kaynağı, bir kaynağın yasal mülkiyetine sahip bir temsilci ile ilişkilendirir. @tr

is owner of
status: Published
definition: Relates an agent to a resource that involves a responsibility of an agent for legal possession.
type: Property
inverse of: has owner
lexical alias: ownerOf.en
label: er ejer af @da
definition: Relaterer en agent, der er i lovlig besiddelse af en ressource til en ressource. @da
label: is eigenaar van @nl
label: هو مالك لـ @ar
definition: يربط بين وكيل ومصدر ينطوي على مسؤولية وكيل عن الملكية القانونية. @ar
label: omistaja (toimija) aineistossa @fi
definition: Liittää toimijan aineistoon, jonka toimija laillisesti omistaa. @fi
label: ist Eigentümerin/Eigentümer von @de
definition: Setzt einen Akteur in Beziehung zu einer Ressource, die im rechtmäßigen Besitz eines Akteurs ist. @de
label: 是……的拥有者 @zh-hans
definition: 将一个行为者与涉及法定所有权的一个行为者的责任的一种资源关联起来。 @zh-hans
label: tulajdonosa a következőnek: @hu
definition: Hozzákapcsol egy ágenst egy forráshoz, amelyhez hozzátartozik az ágens tulajdonjog iránti felelőssége. @hu
has subproperty: is current owner of
has subproperty: is former owner of
label: sahibidir @tr
definition: Bir temsilciyi, yasal mülkiyete ilişkin bir temsilcinin sorumluluğunu içeren bir kaynakla ilişkilendirir. @tr

has panelist
status: Published
definition: Relates a resource to an agent who is a performer who contributes to a resource by participating in a program, often broadcast, where topics are discussed, usually with participation of experts in fields related to the discussion.
type: Property
sub property of: has performer
inverse of: is panelist of
lexical alias: panelist.en
label: har paneldeltager @da
definition: Relaterer en ressource til en optrædende, der har bidraget til en ressource ved at deltage i et program, ofte transmitteret, hvor emner diskuteres, normalt med deltagelse af fagfolk inden for felter relateret til diskussionen. @da
label: heeft panellid @nl
label: panelisti aineistossa @fi
label: له مشارك في برنامج @ar
definition: يربط بين مصدر ومؤدِ يُساهم في مصدر من خلال المشاركة في برنامج، غالبًا مُذاع، حيث تتم مناقشة موضوعات، عادةً بمشاركة خبراء في المجالات المتعلقة بموضوع النقاش. @ar
label: hat Diskussionsteilnehmerin/Diskussionsteilnehmer @de
definition: Setzt eine Ressource in Beziehung zu einer Ausführenden/einem Ausführenden, die/der zu einer Ressource beiträgt, indem sie/er an einer Veranstaltung (meist einer Sendung) teilnimmt, in der Themen üblicherweise mit Expertinnen/Experten diskutiert werden. @de
definition: Liittää aineiston esiintyjään, joka joka osallistuu aineiston tekemiseen osallistumalla ohjelmaan (usein lähetettyyn), jossa keskustellaan eri aiheista tavallisesti keskusteluun liittyvien aiheiden asiantuntijoiden kanssa. @fi
label: 有访谈嘉宾 @zh-hans
definition: 将一种资源与作为一个表演者通过参与节目（经常是广播节目，其中讨论话题，通常有讨论相关领域专家参与）对一种资源有贡献的一个行为者关联起来。 @zh-hans
definition: Relaciona un recurs amb un agent que és un intèrpret que contribueix a un recurs participant en un programa, sovint emès, on es discuteixen temes, habitualment amb la participació d’experts en els camps relacionats amb la discussió. @ca
label: vitafórumtagja a következő: @hu
definition: Hozzákapcsol egy forrást egy előadóhoz, aki egy programban való részvételével hozzájárul egy forráshoz, amely többnyire olyan sugárzott műsor, ahol témákat vitatnak meg, rendszerint a beszélgetés témájában jártas szakértők részvételével. @hu
label: panelist ile ilişkilidir @tr
definition: Bir kaynağı, genellikle tartışma konusu ile ilgili alanlarda uzman olan kişilerin katılımıyla konuların tartışıldığı, sıklıkla radyo ve televizyonda yayınlanan bir programa katılarak, kaynağa katkı sunan sunucu ile ilişkilendirir. @tr

is panelist of
status: Published
definition: Relates an agent to a resource that includes a contribution by an agent of participating in a program, often broadcast, where topics are discussed, usually with participation of experts in fields related to the discussion.
type: Property
sub property of: is performer of
inverse of: has panelist
lexical alias: panelistOf.en
label: er paneldeltager i @da
definition: Relaterer en udøver der bidrager til en ressource ved at deltage i et program, ofte transmitteret, hvor emner diskuteres, normat med deltagelse af fagfolk indenfor felter, der er relateret til diskussionen til en ressource. @da
label: is panellid van @nl
label: panelistina aineistossa @fi
label: هو مشارك في برنامج لـ @ar
definition: يربط بين وكيل ومصدر يتضمن إسهام وكيل بالمشاركة في برنامج، غالبًا مُذاع، حيث تتم مناقشة موضوعات، عادةً بمشاركة خبراء في المجالات المتعلقة بموضوع النقاش. @ar
definition: Liittää toimijan aineistoon, jonka tekemiseen hän osallistuu panelistina (useimmiten lähetetyssä) ohjelmassa, jossa keskustellaan eri aiheista tavallisesti keskusteluun liittyvien aiheiden asiantuntijoiden kanssa. @fi
label: ist Diskussionsteilnehmerin/Diskussionsteilnehmer von @de
definition: Setzt einen Akteur in Beziehung zu einer Ressource, zu der ein Akteur beiträgt, indem er an einer Veranstaltung (meist in einer Sendung) teilnimmt, in der Themen üblicherweise mit Expertinnen/Experten diskutiert werden. @de
label: 是……的访谈嘉宾 @zh-hans
definition: 将一个行为者与包括参与节目（经常是广播节目，其中讨论话题，通常有讨论相关领域专家参与）一个行为者的贡献的一种资源关联起来。 @zh-hans
label: vitafórumtagja a következőnek: @hu
definition: Hozzákapcsol egy ágenst egy forráshoz, amely magában foglalja egy ágens közreműködését egy programban, gyakran sugárzott műsorban, való részvételével, amelyen témákat vitatnak meg, rendszerint a beszélgetés témájában jártas szakértők részvételével. @hu
label: panelistidir @tr
definition: Bir temsilciyi, genellikle tartışma ile ilgili alanlarda uzmanların katılımıyla konuların tartışıldığı, sıklıkla yayınlanan bir programa katılan temsilcinin katkısını içeren bir kaynakla ilişkilendirir. @tr

has papermaker
status: Published
type: Property
lexical alias: papermaker.en
definition: Relates a resource to an agent who is responsible for the making of paper used in a resource.
inverse of: is papermaker of
label: har papirproducent @da
definition: Relaterer en ressource til en agent, der er ansvarlig for fremstilling af papir, som er anvendt til fremstilling af en ressource. @da
label: heeft papierproducent @nl
sub property of: has related agent of resource
label: له صانع ورق @ar
definition: يربط مصدر بوكيل مسؤول عن إنتاج الورق المستخدم في صناعة مصدر. @ar
label: aineiston paperin valmistaja @fi
definition: Liittää aineiston toimijaan, joka vastaa aineiston valmistamiseen käytetyn paperin valmistamisesta. @fi
label: hat Papiermacherin/Papiermacher @de
definition: Setzt eine Ressource in Beziehung zu einem Akteur, der für die Produktion von Papier verantwortlich ist, das zur Herstellung einer Ressource verwendet wird. @de
label: 有造纸者 @zh-hans
definition: 将一种资源与负责一种资源中所使用的纸张之制造的一个行为者关联起来。 @zh-hans
definition: Relaciona un recurs amb un agent que és responsable de l’elaboració del paper usat en un recurs. @ca
label: papírgyártója a következő: @hu
definition: Hozzákapcsol egy forrást egy ágenshez, amely felelős egy forrás gyártásához használt papír előállításáért. @hu
label: kağıt üreticisi ile ilişkilidir @tr
definition: Bir kaynağı, bir kaynağı üretmek için kullanılan kağıdın üretiminden sorumlu olan bir temsilci ile ilişkilendirir. @tr

is papermaker of
status: Published
type: Property
lexical alias: papermakerOf.en
definition: Relates an agent to a resource that involves a responsibility of an agent for making paper.
inverse of: has papermaker
label: er papirproducent af @da
definition: Relaterer en agent, der er ansvarlig for at producere papir der bruges til at fremstille en manifestation til en ressource. @da
label: is papiermaker van @nl
sub property of: has related resource of agent
label: هو صانع ورق لـ @ar
definition: يربط بين وكيل ومصدر ينطوي على مسؤولية وكيل عن إنتاج ورق. @ar
label: paperin valmistaja (toimija) aineistossa @fi
definition: Liittää toimijan aineistoon, jossa toimija vastaa paperin valmistamisesta. @fi
label: ist Papiermacherin/Papiermacher von @de
definition: Setzt einen Akteur in Beziehung zu einer Ressource, bei der ein Akteur für die Produktion von Papier verantwortlich ist. @de
label: 是……的造纸者 @zh-hans
definition: 将一个行为者与涉及造纸的一个行为者的责任的一种资源关联起来。 @zh-hans
definition: Relaciona un agent amb un recurs que implica una responsabilitat d’un agent en l’elaboració del paper. @ca
label: papírgyártója a következőnek: @hu
definition: Hozzákapcsol egy ágenst egy forráshoz, amelyhez hozzátartozik az ágens felelőssége a papír előállításáért. @hu
label: kağıt üreticisidir @tr
definition: Bir temsilciyi, bir temsilcinin kağıt yapma sorumluluğunu içeren bir kaynakla ilişkilendirir. @tr

has parallel designation of edition
status: Published
definition: Relates a resource to a designation of edition in another language or script.
type: Property
lexical alias: parallelDesignationOfEdition.en
label: har parallel udgavebetegnelse @da
definition: Relaterer en ressource til en betegnelse for en udgave på et andet sprog og/eller i et andet alfabet end det som er anvendt ved angivelsen af udgavebetegnelsen. @da
label: heeft parallelle aanduiding van editie @nl
label: aineiston painoksen rinnakkainen määrite @fi
label: له تسمية موازية لطبعة @ar
definition: يربط بين مصدر وتسميه لطبعة بلغة أو نص مختلف عن تلك المُسجلة داخل تسمية لعنصر طابعه. @ar
definition: Liittää aineiston painoksen määritteeseen toisella kielellä ja/tai kirjoitusjärjestelmällä. @fi
label: hat parallele Ausgabebezeichnung @de
definition: Setzt eine Ressource in Beziehung zu einer Ausgabebezeichnung in einer Sprache oder Schrift, die von der bereits erfassten Ausgabezeichnung abweicht. @de
label: 有版本的并列标识 @zh-hans
definition: 将一种资源与用另一种语言或文字的一个版本标识关联起来。 @zh-hans
definition: Relaciona un recurs amb una designació d’edició mencionada d’una edició en qualsevol altra llengua o escriptura. @ca
label: kiadás párhuzamos jelölése a következő: @hu
definition: Hozzákapcsol egy forrást egy kiadás jelöléséhez egy olyan nyelven vagy írásrendszerben, amely eltér a kiadás elemben jelölttől. @hu
label: paralel basım tanımlayıcısı ile ilişkilidir @tr
definition: Bir kaynağı, bir baskı öğesinde kaydedilenden farklı bir dil veya alfabedeki bir baskı tanımıyla ilişkilendirir. @tr

has parallel designation of named revision of edition
status: Published
definition: Relates a resource to a designation of a named revision of an edition in another language or script.
type: Property
lexical alias: parallelDesignationOfNamedRevisionOfEdition.en
label: har parallel betegnelse for en navngivet revision af en udgave @da
definition: Relaterer en ressource til en betegnelse for en navngivet revision af en udgave på et andet sprog og/eller i et andet alfabet end det som er anvendt ved angivelsen af den navngivne revision. @da
label: heeft parallelle aanduiding van benoemde herziening van editie @nl
label: له تسمية موازية لمراجعة مسماة لطبعة @ar
definition: يربط بين مصدر وتسمية لمراجعة مسماة لطبعة بلغة أو نص مختلف عن تلك المُسجلة داخل تسمية مراجعة مسماه لعنصر طابعه. @ar
label: aineiston nimetyn uudistetun painoksen rinnakkainen määrite @fi
definition: Nimetyn uudistetun painoksen määrite toisella kielellä ja/tai kirjoitusjärjestelmällä. @fi
label: hat parallele Ausgabebezeichnung einer näher erläuterten Überarbeitung @de
definition: Setzt eine Ressource in Beziehung zu einer Ausgabebezeichnung einer näher erläuterten Überarbeitung in einer oder Schrift, die von der bereits erfassten Ausgabezeichnung einer näher erläuterten Überarbeitung abweicht. @de
label: 有版本的命名修订的并列标识 @zh-hans
definition: 将一种资源与一个版本的命名修订的用另一种语言或文字的标识关联起来。 @zh-hans
definition: Relaciona un recurs amb una designació d’una revisió mencionada d’una edició en qualsevol altra llengua o escriptura. @ca
label: kiadás nevesített átdolgozásának párhuzamos jelölése a következő: @hu
definition: Hozzákapcsol egy forrást egy kiadás nevesített átdolgozásának jelöléséhez egy olyan nyelven vagy írásrendszerben, amely eltér a kiadás elemben jelölt nevesített átdolgozástól. @hu
label: paralel adlandırılmış basım revizyonu tanımlayıcısı ile ilişkilidir @tr
definition: Bir kaynağı, bir baskı öğesinin adlandırılmış bir gözden geçirmede kaydedilenden farklı bir dildeki veya alfabedeki bir baskının adlandırılmış bir gözden geçirmenin tanımıyla ilişkilendirir. @tr

has parallel name of distributor
status: Published
definition: Relates a resource to a name of distributor in a language or script that differs from that recorded in a name of distributor element.
type: Property
lexical alias: parallelNameOfDistributor.en
label: har parallelt distributørnavn @da
definition: Relaterer en ressource til et distributørnavn på et andet sprog og/eller i et andet alfabet end det som er anvendt ved angivelsen af distributørnavnet. @da
label: heeft parallelle naam van distributeur @nl
label: aineiston jakelijan rinnakkainen nimi @fi
label: له اسم موازي للموزع @ar
definition: يربط بين مصدر واسم موزع بلغة أو نص مختلف عن تلك المُسجل بإسم عنصر موزع. @ar
definition: Liittää aineiston jakelijan nimeen, joka on jakelijan nimi toisella kielellä tai kirjoitusjärjestelmällä, ja joka eroaa jakelija-elementtiin tallennetusta nimestä. @fi
label: hat parallelen Vertriebsnamen @de
definition: Setzt eine Ressource in Beziehung zu einem Vertriebsnamen in einer Sprache oder Schrift, die von dem bereits erfassten Vertriebsnamen abweicht. @de
label: 有发行者的并列名称 @zh-hans
definition: 将一种资源与用不同于记录在发行者名称元素中之语言或文字的发行者的名称关联起来。 @zh-hans
label: terjesztő párhuzamos neve a következő: @hu
definition: Hozzákapcsol egy forrást egy terjesztő nevéhez egy olyan nyelven vagy írásrendszerben, amely eltér a terjesztő neve elemben jelölttől. @hu
label: paralel dağıtımcı adı ile ilişkilidir @tr
definition: Bir kaynağı, dağıtımcı öğesinin adında kaydedilenden farklı bir dildeki veya alfabedeki bir dağıtımcı adıyla ilişkilendirir. @tr

has parallel name of manufacturer
status: Published
definition: Relates a resource to a name of manufacturer in a language or script that differs from that recorded in a name of manufacturer element.
type: Property
lexical alias: parallelNameOfManufacturer.en
label: har parallelt producentnavn @da
definition: Relaterer en ressource til et producentnavn på et andet sprog og/eller i et andet alfabet end det som er anvendt ved angivelsen af producentnavnet. @da
label: heeft parallelle naam van vervaardiger @nl
label: valmistajan rinnakkainen nimi aineistolle @fi
label: له اسم موازي للمُصّنع @ar
definition: يربط بين مصدر واسم مُصّنع بلغة أو نص مختلف عن تلك المُسجل بإسم عنصر مُصّنع. @ar
definition: Liittää aineiston nimeen, joka on valmistajan nimi toisella kielellä ja/tai kirjoitusjärjestelmällä. @fi
label: hat parallelen Herstellername @de
definition: Setzt eine Ressource in Beziehung zu einem Herstellernamen in einer Sprache oder Schrift, die von dem bereits erfassten Herstellernamen abweicht. @de
label: 有生产者的并列名称 @zh-hans
definition: 将一种资源与用不同于记录在生产者名称元素中之语言或文字的生产者的名称关联起来。 @zh-hans
label: gyártó párhuzamos neve a következő: @hu
definition: Hozzákapcsol egy forrást egy gyártó nevéhez egy olyan nyelven vagy írásrendszerben, amely eltér a gyártó neve elemben jelölttől. @hu
label: paralel üretici adı ile ilişkilidir @tr
definition: Bir kaynağı, üretici adı ögesine kaydedilenden farklı bir dildeki veya komut dosyasındaki üretici adı ile ilişkilendirir. @tr

has parallel name of producer
status: Published
definition: Relates a resource to a name of producer in a language or script that differs from that recorded in a name of producer element.
type: Property
lexical alias: parallelNameOfProducer.en
label: har parallelt producentnavn @da
definition: Relaterer en ressource til et producernavn på et andet sprog og/eller i et andet alfabet end det som er anvendt ved angivelsen af producernavnet @da
label: heeft parallelle naam van producent @nl
label: aineiston tuottajan rinnakkainen nimi @fi
label: له اسم مُنتِج موازي @ar
definition: يربط بين مصدر وإسم مُنتِج بلغة أو نص مختلف عن ذلك المُسجل بإسم عنصر مُنتِج. @ar
definition: Liittää aineiston tuottajan nimeen kielellä tai kirjoitusjärjestelmällä, joka eroaa kustantaja-elementtiin tallennetusta nimestä. @fi
label: hat parallelen Erzeugernamen @de
definition: Setzt eine Ressource in Beziehung zu einem Erzeugernamen in einer Sprache oder Schrift, die von dem bereits erfassten Erzeugernamen abweicht. @de
label: 有制作者的并列名称 @zh-hans
definition: 将一种资源与用不同于记录在制作者名称元素中之语言或文字的制作者的名称关联起来。 @zh-hans
label: párhuzamos előállítói neve a következő: @hu
definition: Hozzákapcsol egy forrást egy előállítói névhez egy olyan nyelven vagy írásrendszerben, amely eltér az előállító neve elemben jelölttől. @hu
label: paralel yapımcı adı ile ilişkilidir @tr
definition: Bir kaynağı, bir yapımcının adıyla ilişkilendirir. @tr

has parallel name of publisher
status: Published
definition: Relates a resource to a name of publisher name in a language or script that differs from that recorded in a name of publisher element.
type: Property
lexical alias: parallelNameOfPublisher.en
label: har parallelt udgivernavn @da
definition: Relaterer en ressource til et udgivernavn på et andet sprog og/eller i et andet alfabet end det som er anvendt ved angivelsen af udgivernavnet. @da
label: heeft parallelle naam van uitgever @nl
label: aineiston kustantajan rinnakkainen nimi @fi
label: له اسم ناشر موازي @ar
definition: يربط بين مصدر وإسم ناشر بلغة أو نص مختلف عن ذلك المُسجل بإسم عنصر ناشر. @ar
definition: Liittää aineiston kustantajan nimeen kielellä tai kirjoitusjärjestelmällä, joka eroaa kustantaja-elementtiin tallennetusta nimestä. @fi
label: hat parallelen Verlagsnamen @de
definition: Setzt eine Ressource in Beziehung zu einem Verlagsnamen in einer Sprache oder Schrift, die von dem bereits erfassten Verlagsnamen abweicht. @de
label: 有出版者的并列名称 @zh-hans
definition: 将一种资源与用不同于记录在出版者名称元素中之语言或文字的出版者的名称关联起来。 @zh-hans
label: párhuzamos kiadói neve a következő: @hu
definition: Hozzákapcsol egy forrást egy kiadó nevéhez egy olyan nyelven vagy írásrendszerben, amely eltér a kiadó neve elemben jelölttől. @hu
label: paralel yayıncı adı ile ilişkilidir @tr
definition: Bir kaynağı, üreticinin adı öğesinde kaydedilenden farklı bir dilde veya metinde üreticinin adıyla ilişkilendirir. @tr

has parallel other title information
status: Published
definition: Relates a resource to an other title information in a language or script that differs from that recorded in an other title information element.
type: Property
sub property of: has title
lexical alias: parallelOtherTitleInformation.en
label: har parallel anden titelinformation @da
definition: Relaterer en ressource til andre titeloplysninger på et andet sprog og/eller i et andet alfabet end det som er anvendt ved angivelsen af andre titeloplysninger. @da
label: heeft parallelle overige titelinformatie @nl
label: له بيانات عنوان أخرى بديلة @ar
definition: يربط بين مصدر وبيانات أخرى لعنوان بلغة أو نص مختلف عن تلك المُسجلة داخل عنصر بيانات عنوان أخر. @ar
label: rinnakkainen muu nimiketieto aineistolle @fi
definition: Liittää aineiston tietoelementtiin tallennetusta muusta nimiketiedosta eroavaan toiseen nimeketietoon toisella kielellä ja/tai kirjoitusjärjestelmällä. @fi
label: hat parallelen Titelzusatz @de
definition: Setzt eine Ressource in Beziehung zu einem Titelzusatz in einer Sprache oder Schrift, der von dem bereits erfassten Titelzusatz abweicht. @de
label: 有并列其他题名信息 @zh-hans
definition: 将一种资源与用不同于记录在其他题名信息元素中一种语言或文字的其他题名信息关联起来。 @zh-hans
label: párhuzamos egyéb címinformációja a következő: @hu
definition: Hozzákapcsol egy forrást egyéb címinformációhoz egy olyan nyelven vagy írásrendszerben, amely eltér az egyéb címinformáció elemében jelölttől. @hu
has subproperty: has parallel other title information of series
label: paralel diğer başlık bilgisi ile ilişkilidir @tr
definition: Bir kaynağı, farklı başlık bilgisi öğesinde kaydedilenden farklı bir dil veya metindeki diğer başlık bilgisiyle ilişkilendirir. @tr

has parallel other title information of series
status: Published
definition: Relates a resource to an other title information of a series in a language or script that differs from that recorded in an other title information of series element.
type: Property
lexical alias: parallelOtherTitleInformationOfSeries.en
label: har parallel anden titelinformation for serie @da
definition: Relaterer en ressource til andre titeloplysninger for en serie på et andet sprog og/eller i et andet alfabet end det som er anvendt ved angivelsen af andre titeloplysninger for en serie. @da
sub property of: has parallel other title information
label: heeft parallelle overige titelinformatie van reeks @nl
label: له بيانات عنوان أخرى بديلة لسلسلة @ar
definition: يربط بين مصدر وبيانات عنوان أخرى لسلسة بلغة أو نص مختلف عن تلك المُسجلة داخل عنصر بيانات عنوان أخرى لسلسة. @ar
label: sarjan rinnakkainen muu nimiketieto aineistolle @fi
definition: Liittää aineiston tietoelementtiin tallennetusta muusta sarjan nimiketiedosta eroavaan toiseen nimeketietoon toisella kielellä ja/tai kirjoitusjärjestelmällä. @fi
label: hat parallelen Titelzusatz einer Reihe @de
definition: Setzt eine Ressource in Beziehung zu einem Titelzusatz einer Reihe in einer Sprache oder Schrift, der von dem bereits erfassten Titelzusatz einer Reihe abweicht. @de
label: 有丛编的并列其他题名信息 @zh-hans
definition: 将一种资源与用不同于记录在丛编其他题名信息元素中一种语言或文字的丛编其他题名信息关联起来。 @zh-hans
label: sorozat párhuzamos egyéb címinformációja a következő: @hu
definition: Hozzákapcsol egy forrást egy sorozat egyéb címinformációjához egy olyan nyelven vagy írásrendszerben, amely eltér a sorozat elemében jelölt egyéb címinformációtól. @hu
has subproperty: has parallel other title information of subseries (Deprecated)
label: serinin paralel diğer başlık bilgisi ile ilişkilidir @tr
definition: Bir kaynağı, bir dizinin farklı başlık bilgisi öğesinde kaydedilenden farklı bir dil veya metindeki dizinin farklı başlık bilgisiyle ilişkilendirir. @tr

has parallel other title information of subseries (Deprecated)
status: Deprecated
definition: Relates a resource to an other title information of a subseries in a language or script that differs from that recorded in an other title information of subseries element. (Deprecated)
type: Property
lexical alias: parallelOtherTitleInformationOfSubseries.en
label: har parallel anden titelinformation for underserie @da
definition: Relaterer en ressource til andre titeloplysninger for en serie på et andet sprog og/eller i et andet alfabet end det som er anvendt ved angivelsen af andre titeloplysninger for en underserie. @da
sub property of: has parallel other title information of series

has parallel place of distribution
status: Published
definition: Relates a resource to a place of distribution in a language or script that differs from that recorded in a place of distribution element.
type: Property
lexical alias: parallelPlaceOfDistribution.en
label: har parallelt distributionssted @da
definition: Relaterer en ressource til et distributionssted på et andet sprog og/eller i et andet alfabet end det som er anvendt ved angivelsen af distributionsstedet. @da
sub property of: has place of distribution
label: heeft parallelle plaats van distributie @nl
label: aineiston rinnakkainen jakelupaikka @fi
label: له مكان توزيع موازي @ar
definition: يربط بين مصدر ومكان توزيع بلغة أو نص مختلف عن ذلك المُسجل داخل مكان عنصر توزيع. @ar
definition: Liittää aineiston jakelupaikkaan toisella kielellä ja/tai kirjoitusjärjestelmällä. @fi
label: hat parallelen Vertriebsort @de
definition: Setzt eine Ressource in Beziehung zu einem Vertriebsort in einer Sprache oder Schrift, die von dem bereits erfassten Vertriebsort abweicht. @de
label: 有并列发行地点 @zh-hans
definition: 将一种资源与用不同于记录在发行地点元素中之语言或文字的发行地点关联起来。 @zh-hans
label: párhuzamos terjesztési helye a következő: @hu
definition: Hozzákapcsol egy forrást egy terjesztő helyéhez egy olyan nyelven vagy írásrendszerben, amely eltér a terjesztési hely elemben jelölttől. @hu
label: paralel dağıtım yeri ile ilişkilidir @tr
definition: Bir kaynağı, bir dağıtım yeri öğesinde kaydedilenden farklı bir dildeki veya yazıdaki bir dağıtım yeri ile ilişkilendirir.. @tr

has parallel place of manufacture
status: Published
definition: Relates a resource to a place of manufacture in a language or script that differs from that recorded in a place of manufacture element.
type: Property
lexical alias: parallelPlaceOfManufacture.en
label: har parallelt produktionssted - publicerede ressourcer @da
definition: Relaterer en ressource til et fremstillingssted på et andet sprog og/eller i et andet alfabet end det som er anvendt ved angivelsen af fremstillingsstedet. @da
sub property of: has place of manufacture
label: heeft parallelle plaats van vervaardiging @nl
label: aineiston rinnakkainen valmistuspaikka @fi
label: له مكان تصنيع موازي @ar
definition: يربط بين مصدر ومكان تصنيع بلغة أو نص مختلف عن ذلك المُسجل داخل مكان عنصر توزيع. @ar
definition: Liittää aineiston valmistuspaikkaan toisella kielellä ja/tai kirjoitusjärjestelmällä. @fi
label: hat parallelen Herstellungsort @de
definition: Setzt eine Ressource in Beziehung zu einem Herstellungsort in einer Sprache oder Schrift, die von dem bereits erfassten Herstellungsort abweicht. @de
label: 有并列生产地点 @zh-hans
definition: 将一种资源与用不同于记录在生产地点元素中之语言或文字的生产地点关联起来。 @zh-hans
label: párhuzamos gyártási helye a következő: @hu
definition: Hozzákapcsol egy forrást egy gyártási helyhez egy olyan nyelven vagy írásrendszerben, amely eltér a gyártási hely elemben jelölttől. @hu
label: paralel üretim yeri ile ilişkilidir @tr
definition: Bir kaynağı, imalat yeri öğesinde kaydedilenden farklı bir dilde veya metinde, bir imalat yeri ile ilişkilendirir. @tr

has parallel place of production
status: Published
definition: Relates a resource to a place of production in a language or script that differs from that recorded in a place of production element.
type: Property
lexical alias: parallelPlaceOfProduction.en
label: har parallelt produktionssted - upublicerede ressourcer @da
definition: Relaterer en ressource til et produktionssted på et andet sprog og/eller i et andet alfabet end det som er anvendt ved angivelsen af produktionsstedet. @da
sub property of: has place of production
label: heeft parallelle plaats van productie @nl
label: aineiston rinnakkainen tuotantopaikka @fi
label: له مكان إنتاج موازي @ar
definition: يربط بين مصدر ومكان إنتاج بلغة أو نص مختلف عن ذلك المُسجل داخل مكان عنصر إنتاج. @ar
definition: Liittää aineiston tuotantopaikkaan toisella kielellä ja/tai kirjoitusjärjestelmällä. @fi
label: hat parallelen Entstehungsort @de
definition: Setzt eine Ressource in Beziehung zu einem Entstehungsort in einer Sprache oder Schrift, die von dem bereits erfassten Entstehungsort abweicht. @de
label: 有并列制作地点 @zh-hans
definition: 将一种资源与用不同于记录在制作地点元素中之语言或文字的制作地点关联起来。 @zh-hans
label: párhuzamos előállítási helye a következő: @hu
definition: Hozzákapcsol egy forrást egy előállítási helyhez egy olyan nyelven vagy írásrendszerben, amely eltér az előállítás helye elemben jelölttől. @hu
label: paralel yapım yeri ile ilişkilidir @tr
definition: Bir kaynağı, yapım yeri unsurunda kaydedilenden farklı bir dilde veya metinde, bir üretim yeri ile ilişkilendirir. @tr

has parallel place of publication
status: Published
definition: Relates a resource to a place of publication in a language or script that differs from that recorded in a place of publication element.
type: Property
lexical alias: parallelPlaceOfPublication.en
label: har parallelt publiceringssted @da
definition: Relaterer en ressource til et publiceringssted på et andet sprog og/eller i et andet alfabet end det som er anvendt ved angivelsen af publiceringsstedet. @da
sub property of: has place of publication
label: heeft parallelle plaats van publicatie @nl
label: aineiston rinnakkainen kustannuspaikka @fi
label: له مكان نشر موازي @ar
definition: يربط بين مصدر ومكان نشر بلغة أو نص مختلف عن ذلك المُسجل داخل مكان عنصر نشر. @ar
definition: Liittää aineiston kustannuspaikkaan toisella kielellä ja/tai kirjoitusjärjestelmällä. @fi
label: hat parallelen Erscheinungsort @de
definition: Setzt eine Ressource in Beziehung zu einem Erscheinungsort in einer Sprache oder Schrift, die von dem bereits erfassten Erscheinungsort abweicht. @de
label: 有并列出版地点 @zh-hans
definition: 将一种资源与用不同于记录在出版地点元素中之语言或文字的出版地点关联起来。 @zh-hans
label: párhuzamos kiadási helye a következő: @hu
definition: Hozzákapcsol egy forrást egy kiadási helyhez egy olyan nyelven vagy írásrendszerben, amely eltér a kiadás helye elemben jelölttől. @hu
label: paralel yayın yeri ile ilişkilidir @tr
definition: Bir kaynağı, yayın yeri öğesinde kaydedilenden farklı bir dilde veya metinde, bir yayın yeri ile ilişkilendirir. @tr

has parallel statement of responsibility relating to edition
status: Published
definition: Relates a resource to a statement of responsibility relating to an edition in a language or script that differs from that recorded in a statement of responsibility relating to an edition element.
type: Property
lexical alias: parallelStatementOfResponsibilityRelatingToEdition.en
label: har parallel ophavsangivelse relateret til udgave @da
definition: Relaterer en ressource til en ophavsangivelse på et andet sprog eller i et andet alfabet end det som er anvendt ved angivelsen af en ophavsangivelse til en underserie. @da
label: heeft parallelle verantwoordelijkheidsvermelding gerelateerd aan editie @nl
label: painoksen rinnakkainen vastuullisuusmerkintö aineistossa @fi
label: له بيان موازي لمسؤولية مرتبطة بطبعة @ar
definition: يربط بين مصدر وبيان مسؤولية مرتبط بطبعة بلغة أو نص مختلف عن تلك المُسجلة داخل بيان المسؤولية المرتبط بعنصر طابعه. @ar
label: hat parallele Verantwortlichkeitsangabe, die sich auf eine Ausgabe bezieht @de
definition: Setzt eine Ressource in Beziehung zu einer Verantwortlichkeitsangabe einer Ausgabe in einer Sprache oder Schrift, die von der bereits erfassten Verantwortlichkeitsangabe einer Ausgabe abweicht. @de
definition: Liittää aineiston sen erikieliseen painokseen tai käsikirjoitukseen liittyvään vastuullisuusmerkintöön. @fi
label: 有和版本有关的并列责任说明 @zh-hans
definition: 将一种资源与和版本有关的用不同于记录在和版本有关的责任说明元素中另一种语言或文字的一个责任说明关联起来。 @zh-hans
label: kiadáshoz kapcsolódó párhuzamos felelősségi közlése a következő: @hu
definition: Hozzákapcsol egy forrást egy kiadáshoz kapcsolódó felelősségi közléshez egy olyan nyelven vagy írásrendszerben, amely eltér a kiadás elemben jelölt felelősségi közléstől. @hu
label: basım ile ilgili paralel sorumluluk bildirimi ile ilişkilidir @tr
definition: Bir kaynağı, bir basım öğesiyle ilgili bir sorumluluk bildiriminde kaydedilenden farklı bir dildeki veya alfabedeki bir basımla ilgili bir sorumluluk bildirimiyle ilişkilendirir. @tr

has parallel statement of responsibility relating to named revision of edition
status: Published
definition: Relates a resource to a statement of responsibility relating to a named revision of an edition in a language or script that differs from that recorded in a statement of responsibility relating to a named revision of an edition element.
type: Property
lexical alias: parallelStatementOfResponsibilityRelatingToNamedRevisionOfEdition.en
label: har parallel ophavsangivelse relateret til en navngivet revision af en udgave @da
definition: Relaterer en ressource til en ophavsangivelse på et andet sprog eller i et andet alfabet end det som er anvendt ved angivelsen af den navngivne revision af en udgave. @da
label: heeft parallelle verantwoordelijkheidsvermelding gerelateerd aan benoemde herziening van editie @nl
label: nimettyyn uudistettuun painokseen liittyvä rinnakkainen vastuullisuusmerkintö aineistossa @fi
label: له بيان موازي لمسؤولية متعلقة بالمراجعة المسماة لطبعة @ar
definition: يربط بين مصدر وبيان مسؤولية متعلق بمراجعة مسماة لطبعة بلغة أو نص مختلف عن تلك المُسجلة داخل بيان المسؤولية المرتبط بمراجعة مسماه لعنصر طابعه. @ar
label: hat parallele Verantwortlichkeitsangabe, die sich auf eine näher erläuterte Überarbeitung einer Ausgabe bezieht @de
definition: Setzt eine Ressource in Beziehung zu einer Verantwortlichkeitsangabe einer näher erläuterten Überarbeitung in einer Sprache oder Schrift, die von der bereits erfassten Verantwortlichkeitsangabe einer näher erläuterten Überarbeitung abweicht. @de
definition: Liittää aineiston erikieliseen nimettyyn uudistettuun painokseen tai käsikirjoitukseen liittyvään vastuullisuusmerkintöön. @fi
label: 有和版本的命名修订有关的并列责任说明 @zh-hans
definition: 将一种资源与和版本的命名修订有关的用不同于记录在和版本的命名修订有关的责任说明元素中另一种语言或文字的一个责任说明关联起来。 @zh-hans
label: kiadás nevesített átdolgozásához kötődő párhuzamos felelősségi közlése a következő: @hu
definition: Hozzákapcsol egy forrást egy kiadás nevesített átdolgozásához kapcsolódó felelősségi közléshez egy olyan nyelven vagy írásrendszerben, amely eltér a kiadás nevesített átdolgozása elemben jelölt felelősségi közléstől. @hu
label: adlandırılmış basım revizyonu le ilgili paralel sorumluluk bildirimi ile ilişkilidir @tr
definition: Bir kaynağı, bir baskı öğesinin adlandırılmış bir gözden geçirilmesi ile ilgili bir sorumluluk bildiriminde kaydedilenden farklı bir dilde veya alfabede bir baskının adlandırılmış bir revizyonuyla ilgili bir sorumluluk bildirimiyle ilişkilendirir. @tr

has parallel statement of responsibility relating to series
status: Published
definition: Relates a resource to a statement of responsibility relating to series in a language or script that differs from that recorded in a statement of responsibility relating to series element.
type: Property
lexical alias: parallelStatementOfResponsibilityRelatingToSeries.en
label: har parallel ophavsangivelse relateret til serie @da
definition: Relaterer en ressource til en ophavsangivelse relateret til en serie på et andet sprog eller i et andet alfabet end det som er anvendt ved angivelsen af en ophavsangivelse til en serie. @da
label: heeft parallelle verantwoordelijkheidsvermelding gerelateerd aan reeks @nl
label: sarjan rinnakkainen vastuullisuusmerkintö aineistossa @fi
label: له بيان موزاي لمسؤولية مرتبطة بسلسلة @ar
definition: يربط بين مصدر وبيان مسؤولية متعلق بسلسلة بلغة أو نص مختلف عن تلك المُسجلة داخل بيان المسؤولية المرتبط بعنصر سلسلة. @ar
definition: Liittää aineiston sarjan vastuullisuusmerkintöön toisella kielellä ja/tai kirjoitusjärjestelmällä. @fi
label: hat parallele Verantwortlichkeitsangabe, die sich auf eine Reihe bezieht @de
definition: Setzt eine Ressource in Beziehung zu einer Verantwortlichkeitsangabe einer Reihe in einer Sprache oder Schrift, die von der bereits erfassten Verantwortlichkeitsangabe einer Reihe abweicht. @de
label: 有和丛编有关的并列责任说明 @zh-hans
definition: 将一种资源与和丛编有关的用不同于记录在和丛编有关的责任说明元素中另一种语言或文字的一个责任说明关联起来。 @zh-hans
label: sorozathoz kapcsolódó párhuzamos felelősségi közlése a következő: @hu
definition: Hozzákapcsol egy forrást egy sorozathoz kapcsolódó felelősségi közléshez egy olyan nyelven vagy írásrendszerben, amely eltér a sorozat elemében jelölt felelősségi közléstől. @hu
label: seri ile ilgili paralel sorumluluk bildirimi ile ilişkilidir @tr
definition: Bir kaynağı, dizi öğesiyle ilgili bir sorumluluk bildiriminde kaydedilenden farklı bir dildeki veya alfabedeki diziyle ilgili bir sorumluluk bildirimiyle ilişkilendirir. @tr

has parallel statement of responsibility relating to subseries (Deprecated)
status: Deprecated
definition: Relates a resource to a statement of responsibility relating to subseries in a language or script that differs from that recorded in a statement of responsibility relating to subseries element. (Deprecated)
type: Property
lexical alias: parallelStatementOfResponsibilityRelatingToSubseries.en
label: har parallel ophavsangivelse relateret til underserie @da
definition: Relaterer en ressource til en ophavsangivelse relateret til en underserie på et andet sprog og/eller i et andet alfabet end det som er anvendt ved angivelsen af en ophavsangivelse til en underserie. @da

has parallel statement of responsibility relating to title proper
status: Published
definition: Relates a resource to a statement of responsibility relating to title proper in a language or script that differs from that recorded in a statement of responsibility relating to title proper element.
type: Property
sub property of: has statement of responsibility
lexical alias: parallelStatementOfResponsibilityRelatingToTitleProper.en
label: har parallel ophavsangivelse relateret til hovedtitel @da
definition: Relaterer en ressource til en ophavsangivelse på et andet sprog eller i et andet alfabet end det som er anvendt ved angivelsen af en ophavsangivelse til en hovedtitel. @da
label: heeft parallelle verantwoordelijkheidsvermelding gerelateerd aan hoofdtitel @nl
label: päänimekkeen rinnakkainen vastuullisuusmerkintö aineistossa @fi
label: له بيان مسؤولية موازي مرتبط بالعنوان نفسه @ar
definition: يربط بين مصدر وبيان مسؤولية متعلق بعنوان مُنَاسِب بلغة أو نص مختلف عن تلك المُسجلة داخل بيان المسؤولية المرتبط بعنصر العنوان نفسه. @ar
label: hat parallele Verantwortlichkeitsangabe, die sich auf einen Haupttitel bezieht @de
definition: Setzt eine Ressource in Beziehung zu einer Verantwortlichkeitsangabe eines Haupttitels in einer Sprache oder Schrift, die von der bereits erfassten Verantwortlichkeitsangabe eines Haupttitels abweicht. @de
definition: Liittää aineiston sen erikieliseen painoksen tai käsikirjoituksen päänimekkeeseen liittyvään vastuullisuusmerkintöön. @fi
label: 有和正题名有关的并列责任说明 @zh-hans
definition: 将一种资源与和正题名有关的用不同于记录在和正题名有关的责任说明元素中另一种语言或文字的一个责任说明关联起来。 @zh-hans
label: főcímhez kapcsolódó párhuzamos felelősségi közlése a következő: @hu
definition: Hozzákapcsol egy forrást egy főcímhez kapcsolódó felelősségi közléshez egy olyan nyelven vagy írásrendszerben, amely eltér a főcím elemében jelölt felelősségi közléstől. @hu
label: esas başlık ile ilgili paralel sorumluluk bildirimi ile ilişkilidir @tr
definition: Bir kaynağı, başlık öğesiyle ilgili bir sorumluluk bildiriminde kaydedilenden farklı bir dil veya alfabedeki başlıkla ilgili bir sorumluluk bildirimi ile ilişkilendirir. @tr

has parallel title of series
status: Published
definition: Relates a resource to a nomen that is a title of series in another language or script.
type: Property
lexical alias: parallelTitleOfSeries.en
label: har parallel hovedtitel for serie @da
definition: Relaterer en ressource til en hovedtitel for en serie på et andet sprog og/eller i et andet alfabet. @da
sub property of: has parallel title proper
inverse of: is parallel title of series of
label: heeft parallelle hoofdtitel van reeks @nl
label: له عنوان موزاي لسلسلة @ar
definition: يربط بين مصدر وعنوان سلسلة بلغة أخرى أو نص آخر. @ar
label: sarjan rinnakkainen nimeke aineistolle @fi
definition: Liittää aineiston sarjan nimekkeeseen toisella kielellä tai kirjoitusjärjestelmällä. @fi
label: hat Paralleltitel einer Reihe @de
definition: Setzt eine Ressource in Beziehung zu einem Titel einer Reihe, der in einer anderen Sprache oder einer anderen Schrift vorliegt. @de
label: 有丛编的并列题名 @zh-hans
definition: 将一种资源与作为用另一种语言或文字的一个丛编题名的一个命名关联起来。 @zh-hans
definition: Relaciona un recurs amb un nomen que és un títol d’una col·lecció en una altra llengua o escriptura. @ca
label: párhuzamos sorozatcíme a következő: @hu
definition: Hozzákapcsol egy forrást egy sorozat címéhez egy másik nyelven vagy írásmódban. @hu
has subproperty: has parallel title proper of subseries (Deprecated)
label: serinin paralel başlığı ile ilişkilidir @tr
definition: Bir kaynağı başka bir dilde veya alfabedeki bir dizinin başlığıyla ilişkilendirir. @tr

has parallel title proper
status: Published
definition: Relates a resource to a nomen that is a title proper in another language or script.
type: Property
sub property of: has title
lexical alias: parallelTitleProper.en
scope note: An alternative title in another language and/or script is treated as part of the parallel title proper.
label: har parallel hovedtitel @da
definition: Relaterer en ressource til en hovedtitel på et andet sprog og/eller i et andet alfabet. @da
scope note: En alternativ titel på et andet sprog eller i et andet alfabet behandles som del af en parallel hovedtitel. @da
inverse of: is parallel title proper of
label: heeft parallelle hoofdtitel @nl
label: له عنوان موزاي مُنَاسِب @ar
definition: يربط بين مصدر وعنوان مُنَاسِب بلغة أخرى أو نص آخر. @ar
scope note: يتم التعامل مع عنوان بديل في لغة و / أو نص آخر كجزء من العنوان الموازي المناسب. @ar
label: aineiston rinnakkainen päänimeke @fi
definition: Liittää aineiston päänimekkeeseen toisella kielellä tai kirjoitusjärjestelmällä. @fi
scope note: Vaihtoehtoista nimekettä toisella kielellä ja/tai kirjoitusjärjestelmällä pidetään rinnakkaisen päänimekkeen osana. @fi
label: hat Paralleltitel @de
definition: Setzt eine Ressource in Beziehung zu einem Haupttitel in einer anderen Sprache oder einer anderen Schrift. @de
scope note: Ein Alternativtitel in einer anderen Sprache oder einer anderen Schrift wird als Teil des Paralleltitels behandelt. @de
label: 有并列正题名 @zh-hans
definition: 将一种资源与作为用另一种语言或文字的一个正题名的一个命名关联起来。 @zh-hans
scope note: 用另一种语言和/或文字的一种交替题名被处理为并列正题名的部分。 @zh-hans
definition: Relaciona un recurs amb un nomen que és un títol propi en una altra llengua o escriptura. @ca
label: párhuzamos főcíme a következő: @hu
definition: Hozzákapcsol egy forrást egy főcímhez egy másik nyelven vagy írásmódban. @hu
scope note: Más nyelven és/vagy írásmódban a vagylagos címet a párhuzamos főcím részeként kell kezelni. @hu
has subproperty: has parallel title of series
label: paralel esas başlık ile ilişkilidir @tr
definition: Bir kaynağı başka bir dilde veya komut dosyasındaki bir başlıkla ilişkilendirir. @tr
scope note: Başka bir dilde ve / veya komut dosyasındaki alternatif bir başlık, uygun paralel başlığın bir parçası olarak ele alınır. @tr

is parallel title proper of
status: Published
lexical alias: parallelTitleProperOf.en
definition: Relates a nomen to a resource that has a title proper in another language or script.
type: Property
inverse of: has parallel title proper
label: is parallelle hoofdtitel van @nl
label: هو عنوان موزاي مُوَافِق لـ @ar
definition: يربط تسمية بمصدر له عنوان مُوَافِق بلغة أخرى أو نص آخر. @ar
label: er parallel hovedtitel på @da
definition: Relaterer et nomen til en ressource, som har en hovedtitel på et andet sprog eller skriftsystem. @da
label: rinnakkainen päänimeke @fi
definition: Liittää nomenin aineistoon, jonka päänimeke on toisella kielellä tai kirjoitusjärjestelmällä. @fi
label: ist Paralleltitel von @de
definition: Setzt ein Nomen in Beziehung zu einer Ressource, die einen Haupttitel in einer anderen Sprache oder einer anderen Schrift hat. @de
label: 是……的并列正题名 @zh-hans
definition: 将一个命名与有用另一种语言或文字的正题名的一种资源关联起来。 @zh-hans
label: párhuzamos főcíme a következőnek: @hu
definition: Hozzákapcsol egy noment egy forráshoz, amelynek más nyelven vagy írásrendszerben is van főcíme. @hu
label: paralel başlığıdır @tr
definition: Bir ismi, başka bir dilde veya yazıda uygun bir başlığı olan bir kaynakla ilişkilendirir. @tr

has parallel title proper of subseries (Deprecated)
status: Deprecated
definition: Relates a resource to a title proper of a subseries in another language or script. (Deprecated)
type: Property
lexical alias: parallelTitleProperOfSubseries.en
label: har parallel hovedtitel for underserie @da
definition: Relaterer en ressource til en hovedtitel for en underserie på et andet sprog og/eller i et andet alfabet. @da
sub property of: has parallel title of series

is paraphrased as
status: Published
definition: Relates a resource to a resource that restates a content of another resource in a different form.
type: Property
sub property of: has derivative
inverse of: is paraphrase of
lexical alias: paraphrasedAs.en
label: er parafraseret som @da
definition: Relaterer en ressource til en ressource, der gentager en oprindelig ressource indhold i en anden form. @da
label: is geparafraseerd als @nl
label: parafraasi aineistosta @fi
label: معاد صياغته كـ @ar
definition: يربط بين مصدر ومصدر يعيد صياغة محتوى مصدر آخر في شكل مختلف. @ar
definition: Liittää aineiston aineistoon, joka toisintaa toisen aineiston sisällön eri muodossa. @fi
label: ist paraphrasiert als @de
definition: Setzt eine Ressource in Beziehung zu einer Ressource, die einen Inhalt einer anderen Ressource in einer anderen Form neu darstellt. @de
label: 被演绎为 @zh-hans
definition: 将一种资源与用不同形式重述另一种资源之内容的一种资源关联起来。 @zh-hans
label: parafrazeálja a következőként: @hu
definition: Hozzákapcsol egy forrást egy forráshoz, amely újrafogalmazza egy másik forrás tartalmát eltérő formában. @hu
definition: Relaciona un recurs amb un recurs que replanteja un contingut d’un altre recurs en una forma diferent. @ca
label: olarak yeniden yorumlanmıştır @tr
definition: Bir kaynağı, başka bir kaynağın içeriğini farklı bir biçimde yeniden ifade eden bir kaynakla ile ilişkilendirir. @tr

is paraphrase of
status: Published
definition: Relates a resource to a resource used as a basis for a restating of the content of another resource in a different form.
type: Property
sub property of: has source
inverse of: is paraphrased as
lexical alias: paraphraseOf.en
label: er parafrase over @da
definition: Relaterer en ressource til en ressource, der er anvendt som grundlag for en parafrase, dvs. en gentagelse af en oprindelig ressources indhold i en anden form. @da
label: is parafrase van @nl
label: parafraasi (aineisto) @fi
label: هو إعادة صياغة لـ @ar
definition: يربط بين مصدر ومصدر يُستخدم كأساس لإعادة صياغة محتوى مصدر آخر في شكل مختلف. @ar
definition: Liittää aineiston aineistoon, joka toisintaa toisen aineiston sisällön eri muodossa. @fi
label: ist Paraphrase von @de
definition: Setzt eine Ressource in Beziehung zu einer Ressource, die als Grundlage für eine Neuformulierung des Inhalts einer anderen Ressource in einer anderen Form verwendet wird. @de
label: 是……的演绎 @zh-hans
definition: 将一种资源与被用来作为以不同形式重述另一种资源之内容的基础的一种资源关联起来。 @zh-hans
label: parafrázisa a következőnek: @hu
definition: Hozzákapcsol egy forrást egy forráshoz, amelyet alapként használnak egy parafrázishoz, azaz egy forrásmű tartalmának újrafogalmazásához eltérő formában. @hu
label: yeniden yorumlanmasıdır @tr
definition: Bir kaynağı, başka bir kaynağın içeriğinin farklı bir biçimde yeniden ifade edilmesi için temel olarak kullanılan bir kaynakla ilişkilendirir. @tr

is parodied as
status: Published
definition: Relates a resource to a resource that imitates the style or content of another resource for comic effect.
type: Property
sub property of: is imitated as
inverse of: is parody of
lexical alias: parodiedAs.en
label: er parodieret som @da
definition: Relaterer en ressource til en ressource, der efterligner en oprindelig ressources stil eller indhold for at opnå en komisk effekt. @da
label: is geparodieerd als @nl
label: parodia aineistosta @fi
label: هو محاكاة ساخرة كـ @ar
definition: يربط بين مصدر ومصدر يقلد أسلوب أو محتوى مصدر آخَر ليُحدث تأثيرًا هزليًا. @ar
definition: Liittää aineiston aineistoon, joka imitoi toisen aineiston sisältöä tai tyyliä koomisen vaikutelman luomiseksi. @fi
label: ist parodiert als @de
definition: Setzt eine Ressource in Beziehung zu einer Ressource, die den Stil oder Inhalt einer anderen Ressource imitiert, um einen lustigen Effekt zu erzielen. @de
label: 被戏仿为 @zh-hans
definition: 将一种资源与带喜剧效果模仿另一种资源的风格和内容的一种资源关联起来。 @zh-hans
label: parodizálva a következőként: @hu
definition: Hozzákapcsol egy forrást egy forráshoz, amely egy másik forrás stílusát vagy tartalmát utánozza a komikus hatás kedvéért. @hu
label: olarak parodileştirilmiştir @tr
definition: Bir kaynağı, komedi etkisi için başka bir kaynağın biçimini veya içeriğini taklit eden kaynakla ilişkilendirir. @tr

is parody of
status: Published
definition: Relates a resource to a resource whose style or content is imitated for comic effect.
type: Property
sub property of: is imitation of
inverse of: is parodied as
lexical alias: parodyOf.en
label: er parodi på @da
definition: Relaterer en ressource til en ressource, hvis stil eller indhold efterlignes for at opnå en komisk effekt. @da
label: is parodie op @nl
label: parodian perustana oleva aineisto @fi
label: هو محاكاة ساخرة لـ @ar
definition: يربط بين مصدر ومصدر يتم تقليد أسلوبه أو محتواه ليُحدث تأثيرًا هزليًا. @ar
definition: Liittää aineiston aineistoon, jonka tyyliä tai sisältöä jäljitellään humoristisesti. @fi
label: ist Parodie von @de
definition: Setzt eine Ressource in Beziehung zu einer Ressource, deren Stil oder Inhalt für eine lustige Wirkung nachgeahmt wird. @de
label: 是……的戏仿 @zh-hans
definition: 将一种资源与其风格和内容被模仿而达到戏剧效果的一种资源关联起来。 @zh-hans
label: paródiája a következőnek: @hu
definition: Egy forrást hozzákapcsol egy forráshoz, amelynek stílusát vagy tartalmát utánozzák a komikus hatás kedvéért. @hu
label: parodisidir @tr
definition: Bir kaynağı, biçimi veya içeriği komik etki için taklit edilen bir kaynakla ilişkilendirir. @tr

has participant in treaty
status: Published
type: Property
lexical alias: participantInTreaty.en
definition: Relates a resource to an agent who has signed, ratified, or acceded to a treaty.
inverse of: is participant in treaty of
sub property of: has other agent associated with resource (Deprecated)
label: har traktatdeltager @da
definition: Relaterer en ressource til en regering, mellemstatslig organisation eller anden agent, der har underskrevet, ratificeret eller tiltrådt en traktat. @da
label: heeft deelnemer in verdrag @nl
label: له مُشَارِك في معاهدة @ar
definition: يربط مصدر بوكيل وقّع، أبرَم، أو انضم إلى معاهدة. @ar
label: valtiosopimuksen allekirjoittaja @fi
definition: Liittää aineiston toimijaan joka on allekirjoittanut tai ratifioinut valitosopimuksen tai liittynyt valtiosopimukseen. @fi
label: hat Vertragspartnerin/Vertragspartner @de
definition: Setzt eine Ressource in Beziehung zu einem Akteur, der ein Abkommen unterzeichnet, ratifiziert hat oder ihm beigetreten ist. @de
label: 有条约的参与者 @zh-hans
definition: 将一种资源与签署、批准或加入一个条约的一个行为者关联起来。 @zh-hans
label: szerződő fele a következő: @hu
definition: Hozzákapcsol egy forrást egy ágenshez, amely aláírt, ratifikált vagy jóváhagyott egy szerződést. @hu
label: antlaşmanın katılımcısı ile ilişkilidir @tr
definition: Bir kaynağı, bir anlaşmayı imzalayan, onaylayan veya anlaşmaya katılan bir temsilci ile ilişkilendirir. @tr

is participant in treaty of
status: Published
type: Property
lexical alias: participantInTreatyOf.en
definition: Relates a government, international intergovernmental body, or other agent who has signed, ratified, or acceded to a treaty to a resource.
inverse of: has participant in treaty
sub property of: is other agent associated with resource of (Deprecated)
label: er traktatdeltager i @da
definition: Relaterer en regering, mellemstatslig instans eller anden agent, der har underskrevet, ratificeret eller tiltrådt til en traktat til en ressource. @da
label: is deelnemer in verdrag van @nl
label: هو مُشَارِك في معاهدة لـ @ar
definition: يربط بين مصدر وحكومة أو هيئة حكومية دولية، أو وكيل آخر وقّع، أبرَم، أو انضم إلى معاهدة. @ar
label: valtiosopimuksen allekirjoittaja (yhteistoimija) @fi
definition: Liittää aineistoon hallituksen, hallitustenvälisen toimielimen tai muun yhteistoimijan, joka on allekirjoittanut tai ratifioinut valitosopimuksen tai liittynyt valtiosopimukseen. @fi
label: ist Vertragspartnerin/Vertragspartner von @de
definition: Setzt einen Akteur in Beziehung zu einer Ressource, bei der eine Regierung, eine internationale zwischenstaatliche Körperschaft oder ein anderer Akteur ein Abkommen unterzeichnet, ratifiziert hat oder ihm beigetreten ist. @de
label: 是……的条约的参与者 @zh-hans
definition: 将签署、批准或加入一个条约的一个政府、国际政府间组织或其他行为者与一种资源关联起来。 @zh-hans
label: résztvevője a következő szerződésnek: @hu
definition: Hozzákapcsol egy kormányt, nemzetközi kormányközi szervet, vagy egyéb szerződést aláíró, ratifikáló vagy jóváhagyó ágenst egy forráshoz. @hu
label: antlaşmasının katılımcısıdır @tr
definition: Bir kaynağa bir anlaşmayı imzalamış, onaylamış veya katılmış bir hükümeti, uluslararası hükümetler arası organı veya başka bir aracıyı ilişkilendirir. @tr

has partner
status: Published
type: Property
lexical alias: partner.en
definition: Relates an agent to an agent who is a colleague working with a related agent in an activity of common interest, most often a business partnership.
sub property of: has colleague
label: har partner @da
definition: Relaterer en agent til en kollega, der arbejder sammen med en anden agent med en aktivitet af fælles interesse, i de fleste tilfælde, et forretningspartnerskab. @da
label: heeft bedrijfspartner @nl
label: له شريك @ar
definition: يربط بين وكيل ووكيل هو زميل يعمل مع وكيل ذي صلة في نشاط محل اهتمام مشترك، غالبًا شراكة تجارية. @ar
label: kumppani (toimija) @fi
definition: Liittää toimijan toimijaan, joka on kollega, joka toimii toisen toimijan kanssa yhteiseksi hyväksi, useimmiten liikekumppanina. @fi
label: hat Partnerin/Partner @de
definition: Setzt einen Akteur in Beziehung zu einer Kollegin/einem Kollegen, die/der mit einem in Beziehung stehenden Akteur in einer Tätigkeit von gemeinsamem Interesse, meist in einer Geschäftspartnerschaft, zusammenarbeitet. @de
label: 有合伙人 @zh-hans
definition: 将一个行为者与作为同事与一个相关行为者在共同兴趣范围内一起工作（最常见的是商业合伙人）的一个行为者关联起来。 @zh-hans
label: partnere a következő: @hu
definition: Hozzákapcsol egy ágenst egy kolléga ágenshez, aki egy másik ágenssel dolgozik egy közös érdekű tevékenységben, leggyakrabban üzleti partnerségben. @hu
label: partner ile ilişkilidir @tr
definition: Bir temsilciyi, ilgili bir temsilciyle ortak ilgi alanına giren bir faaliyette, çoğunlukla bir iş ortaklığında çalışan bir meslektaş olan bir temsilciyle ilişkilendirir. @tr

has part nomen
status: Published
lexical alias: partNomen.en
definition: Relates a nomen to a nomen that is a discrete component of another nomen.
type: Property
inverse of: is part of nomen
label: heeft deel nomen @nl
label: لها تسمية جزئية @ar
definition: يربط بين تسمية وتسمية هي جزء منفصل من تسمية آخرى. @ar
label: har delnomen @da
definition: Relaterer et nomen til et nomen der er en diskret komponent af et andet nomen. @da
label: nomenin osa @fi
definition: Liittää nomenin nomeniin, joka on itsenäinen osa toista nomenia. @fi
label: hat Teil-Nomen @de
definition: Setzt ein Nomen in Beziehung zu einem Nomen, das ein eigenständiger Bestandteil eines anderen Nomens ist. @de
label: 有部分命名 @zh-hans
definition: 将一个命名与作为另一个命名之独立组成部分的一个命名关联起来。 @zh-hans
label: résznomenje a következő: @hu
definition: Hozzákapcsol egy noment egy nomenhez, amely egy másik nomen elkülöníthető alkotóeleme. @hu
label: isim bileşeni ile ilişkilidir @tr
definition: Bir ismi, başka bir ismin ayrı bir parçası olan bir isimle ilişkilendirir. @tr

is part of nomen
status: Published
lexical alias: partOfNomen.en
definition: Relates a nomen to a nomen that has another nomen as a discrete component.
type: Property
inverse of: has part nomen
label: is deel van nomen @nl
label: هي تسمية جزئية @ar
definition: يربط بين تسمية وتسمية لها تسمية أخرى كجزء منفصل. @ar
label: er del af nomen @da
definition: Relaterer et nomen til et nomen, som har et andet nomen som diskret komponent. @da
label: nomenin osa @fi
definition: Liittää nomenin nomeniin, jonka itsenäinen osa toinen nomen on. @fi
label: ist Teil von (Nomen) @de
definition: Setzt ein Nomen in Beziehung zu einem Nomen, das ein anderes Nomen als einzelnen Bestandteil enthält. @de
label: 是命名的部分 @zh-hans
definition: 将一个命名与有另一个命名作为独立组成部分的一个命名关联起来。 @zh-hans
label: résznomene a következőnek: @hu
definition: Hozzákapcsol egy noment egy nomenhez, amelynek van egy másik nomenje, mint elkülöníthető alkotóelem. @hu
label: ismin bir bileşenidir @tr
definition: Bir ismi, farklı bir unsur olarak başka bir ismi olan isimle ilişkilendirir. @tr

is part of place
status: Published
lexical alias: partOfPlace.en
definition: Relates a place to a place that encompasses another place.
type: Property
sub property of: has related place of place
inverse of: has part place
label: is deel van plaats @nl
label: هو جزء من مكان @ar
definition: يربط بين مكان ومكان يشتمل على مكان آخر. @ar
label: er del af sted @da
definition: Relaterer et sted til et sted der omfatter et andet sted. @da
label: paikan osa @fi
definition: Liittää paikan paikkaan, joka sisältää toisen paikan. @fi
label: ist Teil von Geografikum @de
definition: Setzt ein Geografikum in Beziehung zu einem Geografikum, das ein anderes Geografikum umschließt. @de
label: 是地点的部分 @zh-hans
definition: 将一个地点与包含另一个地点的一个地点关联起来。 @zh-hans
label: része a következő helynek: @hu
definition: Hozzákapcsol egy helyet egy olyan helyhez, amely magában foglal egy másik helyet. @hu
label: yerin bir bileşenidir @tr
definition: Bir yeri başka bir yeri içeren bir yer ile ilişkilendirir. @tr

is part of resource
status: Published
definition: Relates a resource to a resource that has another resource as a discrete component.
type: Property
sub property of: has whole-part resource relationship with (Deprecated)
inverse of: has part resource
lexical alias: partOfResource.en
label: er indeholdt i @da
definition: Relaterer en ressource til en større ressource, som ressourcen udgør en separat del af. @da
alternative label: is contained in resource
label: is deel van resource @nl
label: هو جزء من المصدر @ar
definition: يربط بين مصدر ومصدر له مصدر آخر كعنصر منفصل. @ar
alternative label: هو متضمن في مصدر @ar
alternative label: er indholdt i ressource @da
label: aineiston osa @fi
definition: .Liittää aineiston aineistoon, johon itsenäisenä osana sisältyy toinen aineisto @fi
alternative label: sisältyy aineistoon @fi
label: ist Teil von Ressource @de
definition: Setzt eine Ressource in Beziehung zu einer Ressource, die eine andere Ressource als einzelnen Bestandteil enthält. @de
alternative label: ist enthalten in (Ressource) @de
alternative label: 被包含在资源中 @zh-hans
label: 是资源的部分 @zh-hans
definition: 将一种资源与有另一种资源作为独立组成部分的一种资源关联起来。 @zh-hans
alternative label: a következő forrás tartalmazza: @hu
label: része a következő forrásnak: @hu
definition: Hozzákapcsol egy forrást egy forráshoz, amelynek elkülöníthető alkotóelemként része egy másik forrás. @hu
has subproperty: is facsimile part of
has subproperty: is inserted in
has subproperty: is issue of
has subproperty: is special issue of
has subproperty: is subseries of
has subproperty: is subcollection of
alternative label: kaynağın bileşenidir @tr
label: kaynağın bir bileşenidir @tr
definition: Bir kaynağı, ayrık olarak başka kaynak içeren bir kaynak ile ilişkilendirir. @tr

is part of timespan
status: Published
lexical alias: partOfTimespan.en
definition: Relates a timespan to a timespan that has another timespan as a component.
type: Property
sub property of: has related timespan of timespan
inverse of: has part timespan
label: is deel van tijdspanne @nl
label: هو جزء من فترة زمنية @ar
definition: يربط بين فترة زمنية وفترة زمنية لها فترة زمنية أخرى كعنصر. @ar
label: er del af tidsforløb @da
definition: Relaterer et tidsforløb, der har et andet tidsforløb som kompnent. @da
label: ajanjakson osa @fi
definition: Liittää ajanjakson ajanjaksoon, jonka itsenäisenä osana on toinen ajanjakso. @fi
label: ist Teil von (Zeitraum) @de
definition: Setzt einen Zeitraum in Beziehung zu einem Zeitraum, der einen anderen Zeitraum als Bestandteil enthält. @de
label: 是时间段的部分 @zh-hans
definition: 将一个时间段与有另一个时间段作为其组成部分的一个时间段关联起来。 @zh-hans
label: része a következő időtartamnak: @hu
definition: Hozzákapcsol egy időtartamot egy időtartamhoz, amelynek egy másik időtartam alkotóelemként a része. @hu
label: zaman aralığının bir bileşenidir @tr
definition: Bir zaman aralığını, bileşen olarak başka bir zaman aralığına sahip olan bir zaman aralığıyla ilişkilendirir. @tr

has part place
status: Published
lexical alias: partPlace.en
definition: Relates a place to a place that is located within another place.
type: Property
sub property of: has related place of place
inverse of: is part of place
label: heeft deel plaats @nl
label: له جزء مكان @ar
definition: يربط بين مكان ومكان يقع داخل مكان آخر. @ar
label: har sted for del @da
definition: Relaterer et sted til et sted, der er placeret inden for et andet sted. @da
label: paikan osa @fi
definition: Liittää paikan paikkaan, joka sijaitsee toisen paikan sisällä. @fi
label: hat Teil-Geografikum @de
definition: Setzt ein Geografikum in Beziehung zu einem Geografikum, das von einem anderen Geografikum umschlossen ist. @de
label: 有部分地点 @zh-hans
definition: 将一个地点与位于另一个地点内部的一个地点关联起来。 @zh-hans
label: részhelye a következő: @hu
definition: Hozzákapcsol egy helyet egy helyhez, amely egy másik helyen belül található. @hu
label: yer bileşeni ile ilişkilidir @tr
definition: Bir yeri, başka bir yerin içinde bulunan bir yer ile ilişkilendirir. @tr

has part resource
status: Published
definition: Relates a resource to a resource that is a discrete component of another resource.
type: Property
sub property of: has whole-part resource relationship with (Deprecated)
inverse of: is part of resource
lexical alias: partResource.en
label: er indeholder af @da
definition: Relaterer en ressource til en ressource, der udgør en separat del af en større ressource. @da
alternative label: is container of resource
label: heeft deel-resource @nl
label: له جزء مصدر @ar
definition: يربط بين مصدر ومصدر عبارة عن مكون منفصل من مصدر آخر. @ar
alternative label: هو حاوية لمصدر @ar
alternative label: er container af ressource @da
label: aineiston osa @fi
definition: Liittää aineiston aineistoon, joka on toisen aineiston erillinen osa. @fi
alternative label: sisältää aineiston @fi
label: hat Teilressource @de
definition: Setzt eine Ressource in Beziehung zu einer Ressource, die ein einzelner Bestandteil einer anderen Ressource ist. @de
alternative label: ist enthält eine Ressource @de
alternative label: 是资源的整体 @zh-hans
label: 有部分资源 @zh-hans
definition: 将一种资源与作为另一种资源之独立部分的一种资源关联起来。 @zh-hans
alternative label: befoglalója a következő forrásnak: @hu
label: részforrása a következő: @hu
definition: Hozzákapcsol egy forrást egy forráshoz, amely egy másik forrás elkülöníthető alkotóeleme. @hu
has subproperty: has facsimile part
has subproperty: has insert
has subproperty: has issue
has subproperty: has special issue
has subproperty: has subseries
has subproperty: has subcollection
label: kaynak bileşeni ile ilişkilidir @tr
definition: Bir kaynağı, başka bir kaynağın ayrık bir parçası olan kaynakla ilişkilendirir. @tr

has part timespan
status: Published
lexical alias: partTimespan.en
definition: Relates a timespan to a timespan that is a component of another timespan.
type: Property
sub property of: has related timespan of timespan
inverse of: is part of timespan
label: heeft deel tijdspanne @nl
label: له جزء من فترة زمنية @ar
definition: يربط بين فترة زمنية وفترة زمنية التي هي عنصر عن فترة زمنية أخرى. @ar
label: har tidsforløb for del @da
definition: Relaterer et tidsforløb til et tidsforløb, der er en komponent af et andet tidsforløb. @da
label: ajanjakson osa @fi
definition: Liittää ajanjakson ajanjaksoon, joka on toisen ajanjakson itsenäinen osa. @fi
label: hat Teil-Zeitraum @de
definition: Setzt einen Zeitraum in Beziehung zu einem Zeitraum, der ein Bestandteil von einem anderen Zeitraum ist. @de
label: 有部分时间段 @zh-hans
definition: 将一个时间段与作为另一个时间段的组成部分的一个时间段关联起来。 @zh-hans
label: időtartamrésze a következő: @hu
definition: Hozzákapcsol egy időtartamot egy időtartamhoz, amely egy másik időtartam alkotóeleme. @hu
label: zaman aralığı bileşeni ile ilişkilidir @tr
definition: Bir zaman aralığını, başka bir zaman aralığının bileşeni olan bir zaman aralığıyla ilişkilendirir. @tr

has performer
status: Published
definition: Relates a resource to an agent who contributes to a resource by performing music, acting, dancing, speaking, and other roles, often in a musical or dramatic presentation.
type: Property
sub property of: has contributor (Deprecated)
inverse of: is performer of
lexical alias: performer.en
label: har performer @da
definition: Relaterer en ressource til en agent, der har bidraget til en ressource ved at opføre musik, spille skuespil, danse, tale etc., ofte i en musikalsk eller dramatisk præsentation etc. @da
label: heeft uitvoerder @nl
label: aineiston esittäjä @fi
label: له مؤدٍ @ar
definition: يربط مصدر بوكيل يُساهم في مصدر من خلال أداء موسيقى، تمثيل، رقص، حوار، وغيرها من الأدوار التي غالبًا تكون في عرض موسيقي أو درامي. @ar
definition: Liittää aineiston tanssijana, näyttelijänä, puhujana tai muissa rooleissa osallistuvaan toimijaan, usein musiikillisessa tai draamallisessa esityksessä. @fi
label: hat Ausführende/Ausführenden @de
definition: Setzt eine Ressource in Beziehung zu einem Akteur, der zu einer Ressource beiträgt, indem er, oftmals in einer musikalischen oder dramatischen Darbietung, Musik aufführt, schauspielt, tanzt, spricht oder eine andere Rolle übernimmt. @de
label: 有表演者 @zh-hans
definition: 将一种资源与通过表演音乐、扮演、舞蹈、说话和其他角色（经常是在音乐或戏剧呈现中）而对一种资源有贡献的一个行为者关联起来。 @zh-hans
label: előadója a következő: @hu
definition: Hozzákapcsol egy forrást egy ágenshez, amely zene, színjátszás, tánc, élőbeszéd stb. előadásával árul hozzá a forráshoz, többnyire zenei vagy drámai bemutatóban. @hu
has subproperty: has actor
has subproperty: has commentator
has subproperty: has conductor
has subproperty: has dancer
has subproperty: has host
has subproperty: has instrumentalist
has subproperty: has moderator
has subproperty: has narrator
has subproperty: has onscreen presenter
has subproperty: has panelist
has subproperty: has puppeteer
has subproperty: has singer
has subproperty: has speaker
has subproperty: has storyteller
has subproperty: has instructor
has subproperty: has instructor (Deprecated)
label: sanatçı ile ilişkilidir @tr
definition: Bir kaynağı, genellikle müzikal veya dramatik bir performansta müzik yaparak, oyunculuk yaparak, dans ederek, konuşarak veya başka bir rolle kaynağa katkıda bulunan bir temsilciyle ilişkilendirir. @tr

has performer, narrator, and/or presenter (Deprecated)
status: Deprecated
definition: Relates a resource to an agent responsible for performing, narrating, and/or presenting a resource. (Deprecated)
lexical alias: performerNarratorAndOrPresenter.en
type: Property

is performer of
status: Published
definition: Relates an agent to a resource that includes a contribution by an agent of performing music, acting, dancing, speaking, etc.
type: Property
sub property of: is contributor of (Deprecated)
inverse of: has performer
lexical alias: performerOf.en
label: er performer i @da
definition: Relaterer en agent, der har bidraget til en ressource ved at opføre musik, spille skuespil, danse, tale etc., ofte i en musik- eller dramapræsentation etc. til en ressource. @da
label: is uitvoerder van @nl
label: هو مؤدٍ لـ @ar
definition: يربط بين وكيل ومصدر يتضمن إسهام وكيل في أداء موسيقى، تمثيل، رقص، حوار، إلخ. @ar
label: esittäjä (toimija) aineistossa @fi
definition: Liittää toimijan aineistoon, jossa toimija on osallisena tanssijana, näyttelijänä, puhujana tai muissa rooleissa, usein musiikillisessa tai draamallisessa esityksessä. @fi
label: ist Ausführende/Ausführender von @de
definition: Setzt einen Akteur in Beziehung zu einer Ressource, zu der ein Akteur beiträgt, indem er Musik aufführt, schauspielt, tanzt oder spricht und so weiter. @de
label: 是……的表演者 @zh-hans
definition: 将一个行为者与包括表演音乐、扮演、舞蹈、说话等的一个行为者的贡献的一种资源关联起来。 @zh-hans
label: előadója a következőnek: @hu
definition: Hozzákapcsol egy ágenst egy forráshoz, amely magában foglalja az ágens közreműködését zene, színjátszás, tánc, élőbeszéd, stb. előadásában. @hu
has subproperty: is actor of
has subproperty: is commentator of
has subproperty: is conductor of
has subproperty: is dancer of
has subproperty: is host of
has subproperty: is instructor of
has subproperty: is instrumentalist of
has subproperty: is moderator of
has subproperty: is narrator of
has subproperty: is onscreen presenter of
has subproperty: is panelist of
has subproperty: is puppeteer of
has subproperty: is singer of
has subproperty: is speaker of
has subproperty: is storyteller of
label: sanatçısıdır @tr
definition: Bir temsilciyi, müzik yapan, oynayan, dans eden, konuşan vb. temsilcinin katkılarını içeren bir kaynakla ilişkilendirir. @tr

has period of activity of agent
status: Published
definition: Relates an agent to a timespan during which an agent is active in their primary field of endeavor.
type: Property
sub property of: has date associated with agent (Deprecated)
lexical alias: periodOfActivityOfAgent.en
label: har aktivitetsperiode for agent @da
definition: Relaterer en ressource til en periode, hvori en agent var aktiv i sit primære virkefelt. @da
inverse of: is period of activity of agent of
label: heeft periode van activiteit van actor @nl
label: toimijan toiminta-aika @fi
label: له فترة نشاط لوكيل @ar
definition: يربط بين وكيلً وتاريخ أو نطاق تواريخ تُشير إلى فترة كان الوكيل نشطًا في مجال عمله الأساسي. @ar
definition: Liittää henkilön ajanjaksoon, jonka aikana henkilö on ollut aktiivinen ensisijaisella toiminta-alallaan. @fi
label: hat Wirkungszeitraum eines Akteurs @de
definition: Setzt einen Akteur in Beziehung zu einem Datum oder einer Reihen von Daten, die auf einen Zeitraum hinweisen, in dem ein Akteur in seinem primären Tätigkeitsfeld aktiv ist. @de
label: 有行为者的活跃时期 @zh-hans
definition: 将一个行为者与一个行为者在其主要努力领域中活跃的时间段关联起来。 @zh-hans
definition: Relaciona un agent amb un interval de temps durant el qual un agent és actiu en el seu camp pimari o esforç. @ca
label: ágens működési területe a következő: @hu
definition: Hozzákapcsol egy ágenst egy dátumhoz vagy dátumtartományhoz, amely arra az időszakra utal, amely alatt egy ágens aktív fő működési területén. @hu
label: temsilcinin faaliyet dönemi ile ilişkilidir @tr
definition: Bir temsilciyi, birincil çalışma alanında aktif olduğu bir dönemi gösteren bir tarih veya tarih aralığıyla ilişkilendirir. @tr

is period of activity of agent of
status: Published
type: Property
lexical alias: periodOfActivityOfAgentOf.en
inverse of: has period of activity of agent
definition: Relates a timespan to an agent who is active in its primary field of endeavour during a timespan.
sub property of: is date associated with agent of (Deprecated)
label: is actieve periode van actor van @nl
label: هي فترة لنشاط وكيل لـ @ar
definition: تربط بين فترة زمنية ووكيل نشط في مجال عمله الأساسي خلال فترة زمنية. @ar
label: er aktivitetsperiode af agent af @da
definition: Relaterer et tidsforløb til en agent, som er virksom indenfor sit primære virksomhedsområde under et tidforløb. @da
label: toimijan toiminta-aika @fi
definition: Liittää ajanjakson toimijaan, joka on ollut aktiivinen ensisijaisella toiminta-alallaan ajanjakson aikana. @fi
label: ist Wirkungszeitraum eines Akteurs von @de
definition: Setzt einen Zeitraum in Beziehung zu einem Akteur, der in einem Zeitraum in seinem primären Tätigkeitsfeld aktiv ist. @de
label: 是……的行为者的活跃期 @zh-hans
definition: 将一个时间段与在一个时间段中活跃于其主要努力领域的一个行为者关联起来。 @zh-hans
label: tevékenységi időszaka a következő ágensnek: @hu
definition: Hozzákapcsol egy időtartamot egy ágenshez, amely fő működési területén egy időtartam alatt aktív. @hu
label: temsilcisinin faaliyet dönemidir @tr
definition: Bir zaman aralığını, bir zaman aralığı boyunca birincil çalışma alanında aktif olan bir temsilciyle ilişkilendirir. @tr

has photographer
status: Published
definition: Relates a resource to an agent who is responsible for creating a photographic resource.
type: Property
sub property of: has creator
inverse of: is photographer of
lexical alias: photographer.en
label: har fotograf @da
definition: Relaterer en ressource til en agent, der er ansvarlig for at have skabt en fotografisk ressource. @da
label: heeft fotograaf @nl
label: aineiston valokuvaaja @fi
label: له مصوِّر فوتوجرافي @ar
definition: يربط مصدر بوكيل مسؤول عن إنشاء مصدر فوتوجرافي. @ar
definition: Liittää aineiston toimijaan, joka vastaa valokuva-aineiston luomisesta. @fi
label: hat Fotografin/Fotograf @de
definition: Setzt eine Ressource in Beziehung zu einem Akteur, der für die Schaffung eines fotografischen Werks verantwortlich ist. @de
label: 有摄影者 @zh-hans
definition: 将一种资源与负责创建一种摄影资源的一个行为者关联起来。 @zh-hans
label: fényképésze a következő: @hu
definition: Hozzákapcsol egy forrást egy ágenshez, amely felelős egy fényképészeti forrás megalkotásáért. @hu
label: fotoğrafçı ile ilişkilidir @tr
definition: Bir kaynağı, fotoğrafik bir kaynak oluşturmaktan sorumlu olan bir temsilci ile ilişkilendirir. @tr

is photographer of
status: Published
definition: Relates an agent to a resource that is a photographic resource that involves a responsibility of an agent for photography.
type: Property
sub property of: is creator of
inverse of: has photographer
lexical alias: photographerOf.en
label: er fotograf til @da
definition: Relaterer en agent der er ansvarlig for at have skabt et nyt fotografisk værk til en ressource. @da
label: is fotograaf van @nl
label: هو مصور لـ @ar
definition: يربط بين وكيل ومصدر يمثل مصدرًا فوتوغرافيًا يتضمن مسؤولية وكيل عن التصوير الفوتوغرافي. @ar
label: valokuvaaja (toimija) aineistossa @fi
definition: Liittää toimijan aineistoon, jossa toimija vastaa valokuva-aineiston luomisesta. @fi
label: ist Fotografin/Fotograf von @de
definition: Setzt einen Akteur in Beziehung zu einer Ressource, bei der ein Akteur für die Fotografie verantwortlich ist. @de
label: 是……的摄影者 @zh-hans
definition: 将一个行为者与作为一种摄影资源并涉及一个行为者对摄影的责任的一种资源关联起来。 @zh-hans
label: fényképésze a következőnek: @hu
definition: Hozzákapcsol egy ágenst egy fényképészeti forráshoz, amelyhez hozzátartozik egy ágens felelőssége a fotózásért. @hu
label: fotoğrafçısıdır @tr
definition: Bir temsilciyi, fotografçılığa ilişkin bir temsilcinin sorumluluğunu içeren fotografik bir kaynakla ilişkilendirir. @tr

has place associated with agent (Deprecated)
status: Deprecated
definition: Relates an agent to a significant location associated with an agent, or a place where an agent resides or has resided or has some connection. (Deprecated)
type: Property
lexical alias: placeAssociatedWithAgent.en
label: har sted forbundet med agent @da
definition: Relaterer en ressource til et væsentligt sted, der er forbundet med en agent, eller et sted hvor en agent bor eller har boet eller har en forbindelse til. @da
inverse of: is place associated with agent of (Deprecated)
sub property of: has related place of agent
has subproperty: has location of headquarters (Deprecated)

is place associated with agent of (Deprecated)
status: Deprecated
type: Property
lexical alias: placeAssociatedWithAgentOf.en
inverse of: has place associated with agent (Deprecated)
definition: Relates a place to an agent who is associated with a place. (Deprecated)
sub property of: has related agent of place

has place associated with resource (Deprecated)
status: Deprecated
type: Property
lexical alias: placeAssociatedWithResource.en
definition: Relates a resource to a significant location associated with an agent, or a place where an agent resides or has resided or has some connection. (Deprecated)
inverse of: is place associated with resource of (Deprecated)
sub property of: has related place of resource

is place associated with resource of (Deprecated)
status: Deprecated
type: Property
lexical alias: placeAssociatedWithResourceOf.en
inverse of: has place associated with resource (Deprecated)
definition: Relates a place to a resource that is associated with a place. (Deprecated)
sub property of: has related resource of place

has place of birth
status: Published
definition: Relates an agent to a place where an agent is born.
type: Property
lexical alias: placeOfBirth.en
label: har fødested @da
definition: Relaterer en ressource til en landsby, by, region, stat og/eller land, hvor en agent blev født. @da
inverse of: is place of birth of
sub property of: has related place of agent
label: heeft geboorteplaats @nl
label: له مكان ميلاد @ar
definition: يربط بين وكيل ومكان وُلِد فيه وكيل. @ar
label: toimijan synnyinpaikka @fi
definition: Liittää toimijan paikkaan, jossa toimija syntyi. @fi
label: hat Geburtsort @de
definition: Setzt einen Akteur in Beziehung zu einem Geografikum, in dem ein Akteur geboren ist. @de
label: 有出生地点 @zh-hans
definition: 将一个行为者与一个行为者出生的地点关联起来。 @zh-hans
definition: Relaciona un agent amb un lloc on és nascut un agent. @ca
label: születésének helye a következő: @hu
definition: Hozzákapcsol egy ágenst egy helyhez, ahol az ágens született. @hu
label: doğum yeri ile ilişkilidir @tr
definition: Bir temsilciyi, bir temsilcinin doğduğu yerle ilişkilendirir. @tr

is place of birth of
status: Published
type: Property
lexical alias: placeOfBirthOf.en
inverse of: has place of birth
definition: Relates a place to an agent who was born in a place.
sub property of: has related agent of place
label: is geboorteplaats van @nl
label: هو مكان الميلاد لـ @ar
definition: يربط بين مكان ووكيل وُلد في مكان. @ar
label: er fødested af @da
definition: Relaterer et sted til en agent, som var født et sted. @da
label: toimijan syntymäpaikka @fi
definition: Liittää paikan toimijaan, joka on syntynyt paikassa. @fi
label: ist Geburtsort von @de
definition: Setzt ein Geografikum in Beziehung zu einem Akteur, der an einem Ort geboren wurde. @de
label: 是……的出生地点 @zh-hans
definition: 将一个地点与在一个地点出生的一个行为者关联起来。 @zh-hans
label: születési helye a következőnek: @hu
definition: Hozzákapcsol egy helyet egy ágenshez, aki azon a helyen született. @hu
label: doğum yeridir @tr
definition: Bir yeri, o yerde doğmuş olan bir temsilciyle ilişkilendirir. @tr

has place of capture
status: Published
definition: Relates a resource to a place associated with recording, filming, etc., the content of a resource.
type: Property
lexical alias: placeOfCapture.en
label: har optagelsessted @da
definition: Relaterer en ressource til et sted, hvor et udtryks indhold, optagelse, indspilning etc., blev optaget. @da
inverse of: is place of capture of
sub property of: has related place of resource
label: heeft plaats van vastleggen @nl
label: له مكان التقاط @ar
definition: يربط بين مصدر ومكان مرتبط بتسجيل، تصوير، إلخ.، محتوى مصدر. @ar
label: aineiston tallennuspaikka @fi
definition: Liittää aineiston paikkaan, joka liitty aineiston sisällön äänittämiseen, filmaamiseen tms. @fi
label: ist Aufzeichnungsort @de
definition: Setzt eine Ressource in Beziehung zu einem Geografikum, das mit der Aufnahme, dem Filmen und so weiter des Inhalts einer Ressource in Verbindung steht. @de
label: 有摄录地点 @zh-hans
definition: 将一种资源与和一种资源的内容的录制、拍摄等有关的一个地点关联起来。 @zh-hans
label: rögzítés helye a következő: @hu
definition: Hozzákapcsol egy forrást egy helyhez, amely egy forrás tartalmának rögzítéséhez, filmezéséhez, stb. kapcsolódik. @hu
label: kayıt yeri ile ilişkilidir @tr
definition: Bir kaynağı, bir kaynağın içeriğinin kaydedilmesi, filme alınması vb. ile bağlantılı bir yerle ilişkilendirir. @tr

is place of capture of
status: Published
type: Property
lexical alias: placeOfCaptureOf.en
inverse of: has place of capture
definition: Relates a place to a resource that has content recorded, filmed, etc. in a place.
sub property of: has related resource of place
label: is plaats van vastleggen van @nl
label: هو مكان التقاط لـ @ar
definition: يربط مكان بمصدر له محتوى مُسجل، مصور...إلخ، في مكان. @ar
label: er optagelsessted af @da
definition: Relaterer et sted til en ressource, som har indhold indspillet, filmet etc. på et sted. @da
label: aineiston tallennuspaikka @fi
definition: Liittää paikan aineistoon, jonka sisältö on äänitetty, kuvattu tms. paikassa. @fi
label: ist Aufzeichnungsort von @de
definition: Setzt ein Geografikum in Beziehung zu einer Ressource, die über Inhalt verfügt, der an einem Ort aufgenommen, gefilmt und so weiter wird. @de
label: 是……的摄录的地点 @zh-hans
definition: 将一个地点与有在一个地点录制、摄影等的内容的一种资源关联起来。 @zh-hans
label: rögzítési helye a következőnek: @hu
definition: Hozzákapcsol egy helyet egy forráshoz, amelynek tartalmát egy bizonyos helyen rögzítették, filmezték stb. @hu
label: kayıt yeridir @tr
definition: Bir yeri, bir yerde kaydedilmiş, filme alınmış vb. içeriği olan bir kaynakla ilişkilendirir. @tr

has place of conference
status: Published
definition: Relates a resource to a place where a conference, exhibition, or other formally named and convened event that gives rise to a resource is held.
type: Property
sub property of: has related place of agent
lexical alias: placeOfConference.en
label: har sted for konference etc. @da
definition: Relaterer en korporation til et sted, hvor en konference, en kongres, et møde, en udstilling, en messe, en festival etc. blev afholdt. @da
inverse of: is place of conference of
label: heeft plaats van conferentie @nl
label: konferenssin paikka @fi
label: له مكان مؤتمر @ar
definition: يربط بين مصدر ومكان محلي عُقد فيه مؤتمر، اجتماع، جلسة، معرض، مهرجان، إلخ. @ar
definition: Liittää aineiston paikkaan, jossa konferenssi, kongressi, kokous, nättely, messut, festivaalit yms. järjestettiin. @fi
label: hat Ort einer Konferenz @de
definition: Setzt eine Ressource in Beziehung zu einem lokalen Ort, an dem eine Konferenz, ein Kongress, eine Ausstellung, eine Messe, ein Festival und so weiter stattgefunden hat. @de
label: 有会议的地点 @zh-hans
definition: 将一种资源与产生一种资源的一次会议、展览或其他正式命名并举办的活动的地点关联起来。 @zh-hans
definition: Relaciona un recurs amb un lloc on té lloc una conferència, exposició o qualsevol altre esdeveniment formalment esmentat i convocat que dona lloc a un recurs. @ca
label: konferenciahelyszíne a következő: @hu
definition: Hozzákapcsol egy forrást egy lokális helyhez, ahol konferenciát, kongresszust, találkozót, kiállítást, vásárt, fesztivált, stb. tartanak. @hu
label: konferans yeri ile ilişkilidir @tr
definition: Bir kaynağı, konferans, kongre, toplantı, sergi, fuar, festival vb. düzenlenen yerel bir konum ile ilişkilendirir. @tr

is place of conference of
status: Published
type: Property
lexical alias: placeOfConferenceOf.en
inverse of: has place of conference
definition: Relates a place to a conference, exhibition, or other formally named and convened event that gives rise to a resource and that is held in a place.
sub property of: has related agent of place
label: is plaats van conferentie van @nl
label: هو مكان لمؤتمر لـ @ar
definition: يربط بين مكان ومؤتمر، معرض، أو أي حدث آخر سُمي وعُقد رسميًا وأسفر عن مصدر وعُقد في مكان ما. @ar
label: er sted for konference for @da
definition: Relaterer et sted til en konference, udstilling, eller anden formelt navngivet og indkaldt begivenhed, der giver ophav til en ressource og der afholdes et sted. @da
label: konferenssin paikka @fi
definition: Liittää paikan paikassa pidettyyn konferenssiin, näyttelyyn tai muuhun tapahtumaan, jonka seurauksena sntyy aineisto. @fi
label: ist Ort einer Konferenz von @de
definition: Setzt ein Geografikum in Beziehung zu einer Konferenz, einer Ausstellung oder einer anderen formal benannten und einberufenen Veranstaltung, aus der eine Ressource hervorgeht. @de
label: 是……的会议的地点 @zh-hans
definition: 将一个地点与作为一个导致一种资源产生并在一个地点举行的一次会议、展览或其他正式命名并举办的活动关联起来。 @zh-hans
label: konferenciahelyszíne a következőnek: @hu
definition: Hozzákapcsol egy helyet egy konferenciához, kiállításhoz vagy más hivatalos névvel rendelkező és szervezett eseményhez, amely egy forrás létrejöttét eredményezi és egy helyen tartanak. @hu
label: konferansının yeridir @tr
definition: Bir yeri, bir kaynağa yol açan ve bir yerde düzenlenen bir konferans, sergi veya resmi olarak adlandırılmış ve toplanmış diğer etkinliklerle ilişkilendirir. @tr

has place of death
status: Published
definition: Relates an agent to a place where an agent dies.
type: Property
lexical alias: placeOfDeath.en
label: har dødssted @da
definition: Relaterer en ressource til en landsby, by, region, stat og/eller land, hvor en agent døde. @da
inverse of: is place of death of
sub property of: has related place of agent
label: heeft plaats van overlijden @nl
label: له مكان وفاة @ar
definition: يربط بين وكيل ومكان توفي فيه وكيل. @ar
label: toimijan kuolinpaikka @fi
definition: Liittää toimijan paikkaan, jossa toimija kuoli. @fi
label: hat Sterbeort @de
definition: Setzt einen Akteur in Beziehung zu einem Geografikum, in dem ein Akteur gestorben ist. @de
label: 有去世地点 @zh-hans
definition: 将一个行为者与一个行为者去世的地点关联起来。 @zh-hans
label: halálozásának helye a következő: @hu
definition: Hozzákapcsol egy ágenst egy helyhez, ahol az ágens elhunyt. @hu
label: ölüm yeri ile ilişkilidir @tr
definition: Bir temsilciyi, bir temsilcinin öldüğü bir yerle ilişkilendirir. @tr

is place of death of
status: Published
type: Property
lexical alias: placeOfDeathOf.en
inverse of: has place of death
definition: Relates a place to an agent who died in a place.
sub property of: has related agent of place
label: is sterfplaats van @nl
label: هو مكان وفاة لـ @ar
definition: يربط بين مكان ووكيل توفي في مكان. @ar
label: er dødssted af @da
definition: Relaterer et sted til en agent, som døde et sted. @da
label: toimijan kuolinpaikka @fi
definition: Liittää paikan toimijaan, joka on kuollut paikassa. @fi
label: ist Sterbeort von @de
definition: Setzt ein Geografikum in Beziehung zu einem Akteur, der an einem Ort gestorben ist. @de
label: 是……的去世地点 @zh-hans
definition: 将一个地点与在一个地点去世的一个行为者关联起来。 @zh-hans
label: halálozási helye a következőnek: @hu
definition: Hozzákapcsol egy helyet egy ágenshez, aki azon a helyen halt meg. @hu
label: ölüm yeridir @tr
definition: Bir yeri, o yerde ölmüş olan bir temsilciyle ilişkilendirir. @tr

has place of distribution
status: Published
definition: Relates a resource to a place associated with the distribution of a published resource.
type: Property
lexical alias: placeOfDistribution.en
label: har distributionssted @da
definition: Relaterer en ressource til et sted forbundet med distributionen af en ressource i publiceret form. @da
inverse of: is place of distribution of
sub property of: has related place of resource
label: heeft plaats van distributie @nl
label: aineiston jakelupaikka @fi
label: له مكان توزيع @ar
definition: يربط بين مصدر ومكان مرتبط بتوزيع مصدر منشور. @ar
definition: Liittää aineiston paikkaan, joka liittyy julkaistun aineiston jakeluun. @fi
label: hat Vertriebsort @de
definition: Setzt eine Ressource in Beziehung zu einem Geografikum, das mit dem Vertrieb einer veröffentlichten Ressource in Verbindung steht. @de
label: 有发行地点 @zh-hans
definition: 将一种资源与和一种出版资源的发行有关的一个地点关联起来。 @zh-hans
label: terjesztés helye a következő: @hu
definition: Hozzákapcsol egy forrást egy helyhez, amely egy publikált forrás terjesztéséhez kapcsolódik. @hu
has subproperty: has parallel place of distribution
label: dağıtım yeri ile ilişkilidir @tr
definition: Bir kaynağı, yayımlanmış bir kaynağın dağıtımıyla bağlantılı bir yerle ilişkilendirir. @tr

is place of distribution of
status: Published
type: Property
lexical alias: placeOfDistributionOf.en
inverse of: has place of distribution
definition: Relates a place to a resource that is a published resource that is distributed from a place.
sub property of: has related resource of place
label: is plaats van distributie van @nl
label: هو مكان توزيع لـ @ar
definition: يربط مكان بمصدر عبارة عن مصدر منشور ووُزع من مكان. @ar
label: er distributionssted af @da
definition: Relaterer et sted til en ressource, som er en udgivet ressourse, der er distribueret fra et sted. @da
label: aineiston jakelupaikka @fi
definition: Liittää paikan julkaistuun aineistoon, jota jaellaan paikasta käsin. @fi
label: ist Vertriebsort von @de
definition: Setzt ein Geografikum in Beziehung zu einer veröffentlichten Ressource, die an einem Ort vertrieben wird. @de
label: 是……的发行的地点 @zh-hans
definition: 将一个地点与作为一种出版资源从一个地点发行的一种资源关联起来。 @zh-hans
label: terjesztési helye a következőnek: @hu
definition: Hozzákapcsol egy helyet egy kiadott forráshoz, amelyet egy bizonyos helyen terjesztenek. @hu
label: dağıtım yeridir @tr
definition: Bir yeri, bir yerden dağıtılan yayınlanmış bir kaynak olan bir kaynakla ilişkilendirir. @tr

has place of manufacture
status: Published
definition: Relates a resource to a place that is associated with the printing, duplicating, casting, or other method of manufacturing of a published resource.
type: Property
lexical alias: placeOfManufacture.en
label: har produktionssted - publicerede ressourcer @da
definition: Relaterer en ressource til sted forbundet med trykning, duplikering, støbning etc. af en ressource i publiceret form. @da
inverse of: is place of manufacture of
sub property of: has related place of resource
label: heeft plaats van vervaardiging @nl
label: aineiston valmistuspaikka @fi
label: له مكان تصنيع @ar
definition: يربط بين مصدر ومكان مرتبط بطبع، نسخ، طَرَح، أو مرتبط بأي طريقة أخرى بتصنيع مصدر منشور. @ar
definition: Liittää aineiston paikkaan, aikaan, joka liittyy julkaistun aineiston painamiseen, monistamiseen, kirjasinten valamiseen tai muuhun valmistustapaan. @fi
label: hat Herstellungsort @de
definition: Setzt eine Ressource in Beziehung zu einem Geografikum, das mit dem Druck, der Vervielfältigung, dem Guss oder einer anderen Herstellungsmethode einer veröffentlichten Ressource in Verbindung steht. @de
label: 有生产地点 @zh-hans
definition: 将一种资源与一种出版资源的印刷、复制、铸造或其他生产方式有关的一个地点关联起来。 @zh-hans
label: gyártási helye a következő: @hu
definition: Hozzákapcsol egy forrást egy helyhez, amely egy kiadott forrás nyomtatásához, sokszorosításához, öntéséhez vagy más módú gyártásához kapcsolódik. @hu
has subproperty: has parallel place of manufacture
label: üretim yeri ile ilişkilidir @tr
definition: Bir kaynağı, yayınlanmış bir kaynağın basımı, çoğaltılması, yayınlanması veya diğer üretim yöntemleriyle ilişkili bir yerle ilişkilendirir. @tr

is place of manufacture of
status: Published
type: Property
lexical alias: placeOfManufactureOf.en
inverse of: has place of manufacture
definition: Relates a place to a resource that is a published resource that is printed, duplicated, cast, etc. in a place.
sub property of: has related resource of place
label: is plaats van vervaardiging van @nl
label: هو مكان تصنيع لـ @ar
definition: يربط مكان بمصدر عبارة عن مصدر منشور طُبع، ونُسخ، وبُث...إلخ، في مكان. @ar
label: er fremstillingssted af @da
definition: Relaterer et sted til en ressource, som er en udgivet ressourse, der er trykt, dupliceret, støbt, etc. et sted. @da
label: aineiston valmistuspaikka @fi
definition: Liittää paikan julkaistuun aineistoon, joka on painettu, monistettu, valettu kirjainten osalta tms. paikassa. @fi
label: ist Herstellungsort von @de
definition: Setzt ein Geografikum in Beziehung zu einer veröffentlichten Ressource, die an einem Ort gedruckt, vervielfältigt, gegossen und so weiter wird. @de
label: 是……的生产的地点 @zh-hans
definition: 将一个地点与作为一种出版资源在一个地点印刷、复制、铸造等的一种资源关联起来。 @zh-hans
label: gyártási helye a következőnek: @hu
definition: Hozzákapcsol egy helyet egy kiadott forráshoz, amelyet egy bizonyos helyen nyomtattak, sokszoroztak, öntöttek, stb. @hu
label: üretim yeridir @tr
definition: Bir yeri, bir yerde basılmış, çoğaltılmış, basılmış vb. yayınlanmış bir kaynak olan kaynakla ilişkilendirir. @tr

has place of origin of resource
status: Published
definition: Relates a resource to a place from which a resource originated.
type: Property
lexical alias: placeOfOriginOfResource.en
label: har oprindelsessted for ressourcen @da
definition: Relaterer en ressource til et land eller andet område, hvorfra en ressource stammer. @da
inverse of: is place of origin of resource of
sub property of: has related place of resource
label: heeft plaats van herkomst van resource @nl
label: له مكان لمنشأ مصدر @ar
definition: يربط بين مصدرً ومكان نشأ منه مصدر @ar
label: aineiston alkuperään liittyvä paikka @fi
definition: Liittää aineiston paikkaan, jossa aineisto on saanut alkunsa. @fi
label: hat Ursprungsort einer Ressource @de
definition: Setzt eine Ressource in Beziehung zu einem Geografikum, aus dem eine Ressource stammt. @de
label: 有资源的原地点 @zh-hans
definition: 将一种资源与一种资源起源的一个地点关联起来。 @zh-hans
label: forrás származási helye a következő: @hu
definition: Hozzákapcsol egy forrást egy helyhez, ahonnan egy forrás származik. @hu
label: kaynağın menşei yeri ile ilişkilidir @tr
definition: Bir kaynağı, kaynağın ortaya çıktığı yerle ilişkilendirir. @tr

is place of origin of resource of
status: Published
type: Property
lexical alias: placeOfOriginOfResourceOf.en
inverse of: has place of origin of resource
definition: Relates a place to a resource which originated from a place.
sub property of: has related resource of place
label: is plaats van herkomst van resource van @nl
label: هو مكان لمنشأ مصدر لـ @ar
definition: يربط مكان بمصدر نشأ من مكان @ar
label: er oprindelsessted for ressourcen af @da
definition: Relaterer et sted til en ressource, som har oprindelse fra et sted. @da
label: aineiston alkuperään liittyvä paikka @fi
definition: Liittää paikan aineistoon, joka on saanut alkunsa paikassa. @fi
label: ist Ursprungsort einer Ressource von @de
definition: Setzt ein Geografikum in Beziehung zu einer Ressource, die aus einem Geografikum stammt. @de
label: 是……的资源的原地点 @zh-hans
definition: 将一个地点与起源于一个地点的一种资源关联起来。 @zh-hans
label: származási helye a következő forrásnak: @hu
definition: Hozzákapcsol egy helyet egy forráshoz, amely arról a helyről származik. @hu
label: kaynağının menşei yeridir @tr
definition: Bir yeri, bir yerle bağlantılı olan bir kaynakla ilişkilendirir. @tr

has place of production
status: Published
definition: Relates a resource to a place that is associated with the inscription, fabrication, construction, or other method of production of an unpublished resource.
type: Property
lexical alias: placeOfProduction.en
label: har produktionssted - upublicerede ressourcer @da
definition: Relaterer en ressource til et sted forbundet med indgravering, fremstilling, konstruktion etc. af en ressource i upubliceret form. @da
inverse of: is place of production of
sub property of: has related place of resource
label: heeft plaats van productie @nl
label: aineiston tuotantopaikka @fi
label: له مكان إنتاج @ar
definition: يربط بين مصدر ومكان مرتبط بتسجيل، أو تصنيع، أو إنشاء، أو مرتبط بأي طريقة أخرى بإنتاج مصدر غير منشور. @ar
definition: Liittää aineiston paikkaan, joka liittyy julkaisemattoman aineiston aivertamiseen, valmistamiseen, kokoamiseen tai muuhun tuotantotapaan. @fi
label: hat Entstehungsort @de
definition: Setzt eine Ressource in Beziehung zu einem Geografikum, das mit der Beschriftung, der Fabrikation, der Konstruktion oder einer anderen Entstehungsmethode einer unveröffentlichten Ressource in Verbindung steht. @de
label: 有制作地点 @zh-hans
definition: 将一种资源与一种非出版资源的镌刻、制造、构建或其他制作方法有关的一个地点关联起来。 @zh-hans
label: előállítás helye a következő: @hu
definition: Hozzákapcsol egy forrást egy helyhez, amely egy kiadatlan forrás írásához, összeállításához, készítéséhez vagy más módú előállításához kapcsolódik. @hu
has subproperty: has parallel place of production
label: yapım yeri ile ilişkilidir @tr
definition: Bir kaynağı, yayınlanmamış bir kaynağın yazımı, üretimi, yapımı veya diğer üretim yöntemleriyle bağlantılı bir yerle ilişkilendirir. @tr

is place of production of
status: Published
type: Property
lexical alias: placeOfProductionOf.en
inverse of: has place of production
definition: Relates a place to a resource that is an unpublished resource that is inscribed, fabricated, constructed, etc. in a place.
sub property of: has related resource of place
label: is plaats van productie van @nl
label: هو مكان إنتاج @ar
definition: يربط مكان بمصدر عبارة عن مصدر غير منشور تم تأليفه، تجميعه، إنتاجه في مكان. @ar
label: er produktionssted af @da
definition: Relaterer et sted til en ressource, som er en ikke udgivet ressource, der er indskrevet, fremstillet, konstrueret, etc. et sted. @da
label: aineiston tuotantopaikka @fi
definition: Liittää paikan julkaisemattomaan aineistoon, joka on kaiverrettu, valmistettu, koottu tms. paikassa. @fi
label: ist Entstehungsort von @de
definition: Setzt ein Geografikum in Beziehung zu einer unveröffentlichten Ressource, die an einem Ort beschriftet, fabriziert, konstruiert und so weiter wird. @de
label: 是……的制作的地点 @zh-hans
definition: 将一个地点与作为一种非出版资源在一个地点镌刻、制造、构建等的一种资源关联起来。 @zh-hans
label: előállítási helye a következőnek: @hu
definition: Hozzákapcsol egy helyet egy kiadatlan forráshoz, amelyet egy bizonyos helyen írtak, készítettek, szerkesztettek stb. @hu
label: yapım yeridir @tr
definition: Bir yeri, bir yerde yazılı olan, imal edilen, yapılan vb. yayınlanmamış bir kaynakla ilişkilendirir. @tr

has place of publication
status: Published
definition: Relates a resource to a place that is associated with the publication, release, or issuing of a published resource.
type: Property
lexical alias: placeOfPublication.en
label: har publiceringssted @da
definition: Relaterer en ressource til et sted forbundet med publicering, offentliggørelse eller udgivelse af en ressource. @da
inverse of: is place of publication of
sub property of: has related place of resource
label: heeft plaats van publicatie @nl
label: aineiston julkaisupaikka @fi
label: له مكان نشر @ar
definition: يربط بين مصدر ومكان مرتبط بنشر، تحرير، أو إصدار مصدر منشور. @ar
definition: Liittää aineiston paikkaan, joka liittyy julkaistun aineiston kustantamiseen, julkaisemiseen tai ilmestymiseen. @fi
label: hat Erscheinungsort @de
definition: Setzt eine Ressource in Beziehung zu einem Geografikum, das mit der Veröffentlichung, dem Release oder der Herausgabe einer veröffentlichten Ressource in Verbindung steht. @de
label: 有出版地点 @zh-hans
definition: 将一种资源与一种出版资源的出版、发布或发行有关的一个地点关联起来。 @zh-hans
definition: Relaciona un recurs amb un lloc que s’associa amb la publicació, la posada en circulació o l’emissió d’un recurs publicat. @ca
label: kiadási helye a következő: @hu
definition: Hozzákapcsol egy forrást egy helyhez, amely egy forrás kiadásához, kibocsájtásához vagy megjelentetéséhez kapcsolódik. @hu
has subproperty: has parallel place of publication
label: yayın yeri ile ilişkilidir @tr
definition: Bir kaynağı, yayınlanmış bir kaynağın, yayımlanması, piyasaya sürülmesi veya çıkarılması ile bağlantılı bir yerle ilişkilendirir. @tr

is place of publication of
status: Published
type: Property
lexical alias: placeOfPublicationOf.en
inverse of: has place of publication
definition: Relates a place to a resource that is a published resource that is published, released, or issued in a place.
sub property of: has related resource of place
label: is plaats van publicatie van @nl
label: هو مكان نشر لـ @ar
definition: يربط مكان بمصدر عبارة عن مصدر منشور تم نشره، بثه، أو إصداره في مكان. @ar
label: er publiceringssted af @da
definition: Relaterer et sted til en ressource, som er en udgiven ressource, der er publiceret, frigivet, eller udgivet et sted. @da
label: aineiston kustannuspaikka @fi
definition: Liittää paikan julkaistuun aineistoon, joka on kustannettu, julkaistu, ilmestynyt tms. paikassa. @fi
label: ist Erscheinungsort von @de
definition: Setzt ein Geografikum in Beziehung zu einer veröffentlichten Ressource, die an einem Ort veröffentlicht, freigegeben oder herausgegeben wird. @de
label: 是……的出版的地点 @zh-hans
definition: 将一个地点与作为一种出版资源在一个地点出版、发布或发行等的一种资源关联起来。 @zh-hans
label: közzétételi helye a következőnek: @hu
definition: Hozzákapcsol egy helyet egy kiadott forráshoz, amelyet egy bizonyos helyen adtak ki, bocsájtottak ki vagy jelentettek meg. @hu
label: yayın yeridir @tr
definition: Bir yeri, bir yerde yayınlanan, piyasaya sürülen veya çıkarılan yayınlanmış bir kaynak olan kaynakla ilişkilendirir. @tr

has place of residence
status: Published
definition: Relates an agent to a place where an agent resides or has resided.
type: Property
lexical alias: placeOfResidence.en
scope note: A place where an agent has worked or studied is included.
label: har opholdssted etc. @da
definition: Relaterer en ressource til en landsby, by, region, stat og/eller land, hvor en agent bor eller har boet, eller andet væsentligt sted forbundet med agenten, bortset fra fødested, dødssted eller bopæl. @da
scope note: Sted, hvor en agent har arbejdet eller studeret er omfattet. @da
inverse of: is place of residence of
sub property of: has related place of agent
label: heeft plaats van verblijf @nl
label: asuinpaikka @fi
label: له مكان إقامة @ar
definition: يربط بين وكيل وبلدة، مدينة، مُقاطعة، ولاية، أو بلد يقيم فيها الوكيل أو أقام فيها بالفعل، أو أي مكان هام آخر مرتبط بوكيل بخلاف مكان الميلاد أو مكان الوفاة، أو الإقامة. @ar
scope note: يشمل ذلك مكان عمل فيه وكيل أو درس فيه. @ar
scope note: Koskee paikkaa, jossa toimija on työskennellyt tai opiskellut. @fi
label: hat Wohnort @de
definition: Setzt einen Akteur in Beziehung zu einem Ort, einer Stadt, einem Bundesland, einem Staat oder einem Land, in dem er wohnt oder gewohnt hat, oder zu einem anderen bedeutenden Ort, der mit einem Akteur in Verbindung steht, außer dem Geburts-, Sterbe- oder Wohnort. @de
scope note: Darunter fällt ein Geografikum, in dem ein Akteur gearbeitet oder studiert hat. @de
definition: Liittää toimijan kaupunkiin, maakuntaan, osavaltioon tai maahan, jossa hän asuu tai on asunut, tai muuhun häneen liittyvään merkittävään paikkaan kuin syntymä-, kuolin- tai asuinpaikka. @fi
label: 有居住地 @zh-hans
definition: 将一个行为者与一个行为者居住或居住过的地点关联起来。 @zh-hans
scope note: 包括一个行为者工作过或学习过的一个地点。 @zh-hans
definition: Relaciona un agent amb un lloc on un agent resideix o ha residit. @ca
label: lakóhelye a következő: @hu
definition: Hozzákapcsol egy ágenst egy településhez, régióhoz, államhoz vagy országhoz, amely az ágens jelenlegi vagy volt lakhelye, vagy az ágenshez kapcsolódó egyéb fontos helyhez, amely nem születési vagy halálozási hely, illetve lakhely. @hu
scope note: A hely, ahol egy ágens dolgozott vagy tanult, szintén idetartozik. @hu
label: ikamet yeri ile ilişkilidir @tr
definition: Bir temsilciyi, bir temsilcinin şu an veya önceden ikamet ettiği bir kasaba, şehir, il, eyalet veya ülke veya doğum yeri, ölüm yeri veya ikamet yeri dışında bir temsilci ile baplantılı olan başka bir önemli yer ile ilişkilendirir. @tr
scope note: Bir temsilcinin çalıştığı veya öğrenim gördüğü yer dahildir. @tr

is place of residence of
status: Published
type: Property
lexical alias: placeOfResidenceOf.en
inverse of: has place of residence
definition: Relates a place to an agent who resides or has resided in, or is associated other than birth, death, or residence with a place.
sub property of: has related agent of place
label: is verblijfplaats van @nl
label: هو مكان إقامة لـ @ar
definition: يربط بين مكان ووكيل يُقيم أو أقام، أو مرتبط بمكان ما بخلاف الولادة أو الوفاة أو الإقامة. @ar
label: er opholdsted af @da
definition: Relaterer et sted til en agent, som bor eller har boet, eller er knyttet på anden måde end gennem fødsel, død, eller boende med et sted. @da
label: ist Wohnort von @de
definition: Setzt ein Geografikum in Beziehung zu einem Akteur, der in diesem Geografikum wohnt oder gewohnt hat oder aus anderen Gründen als Geburt, Tod oder Wohnsitz mit diesem in Verbindung steht. @de
label: asuinpaikka toimijalle @fi
definition: Liittää paikan toimijaan, joka asuu tai on asunut paikassa tai on muuten kuin syntymän, kuoleman tai oleskelun kautta suhteessa paikkaan. @fi
label: 是……的居住地点 @zh-hans
definition: 将一个地点与在一个地点居住或居住过或者和出生、去世、或居住以外相关的一个地点的一个行为者关联起来。 @zh-hans
label: lakóhelye a következőnek: @hu
definition: Hozzákapcsol egy helyet egy ágenshez, amelynek az a jelenlegi vagy volt lakhelye, vagy születésén, halálán vagy lakóhelyén kívül más módon kapcsolódik hozzá. @hu
label: ikamet yeridir @tr
definition: Bir yeri, o yerde ikamet eden veya ikamet etmiş olan ya da o yerle doğum, ölüm veya ikamet dışında bir ilişkisi olan bir temsilciyle ilişkilendirir. @tr

has plaintiff
status: Published
definition: Relates a resource to an agent who brings a suit in a civil proceeding.
type: Property
sub property of: has other agent associated with resource (Deprecated)
inverse of: is plaintiff of
lexical alias: plaintiff.en
label: har sagsøgende @da
definition: Relaterer een ressource til en agent, der anlægger en civil sag. @da
label: heeft aanklager @nl
label: henkilökantaja @fi
label: له مُدَّعي @ar
definition: يربط مصدر بوكيل يرفع دعوى في إجراءات مدنية. @ar
definition: Liittää aineiston toimijaan, joka nostaa kanteen siviilioikeudenkäyntiin. @fi
label: hat Zivilklägerin/Zivilkläger @de
definition: Setzt eine Ressource in Beziehung zu einem Akteur, der eine Klage in ein Zivilverfahren einbringt. @de
label: 有原告 @zh-hans
definition: 将一种资源与在民事诉讼中起诉的一个行为者关联起来。 @zh-hans
label: felperese a következő: @hu
definition: Hozzákapcsol egy forrást egy ágenshez, amely polgárjogi eljárás keretében pert indít. @hu
label: davacı ile ilişkilidir @tr
definition: Bir kaynağı, bir hukuk davasına taşıyan bir temsilci ile ilişkilendirir. @tr

is plaintiff of
status: Published
definition: Relates an agent to a resource that involves a responsibility of an agent for bringing a suit in a civil proceeding.
type: Property
sub property of: is other agent associated with resource of (Deprecated)
inverse of: has plaintiff
lexical alias: plaintiffOf.en
label: er sagsøger af @da
definition: Relaterer en agent der anlægger en civil sag til en ressource. @da
label: is aanklager van @nl
label: هو مُدَّعي لـ @ar
definition: يربط بين وكيل ومصدر ينطوي على مسؤولية وكيل عن رفع دعوى مدنية. @ar
label: henkilökantaja (toimija) aineistossa @fi
definition: Liittää toimijan aineistoon, jossa toimija vastaa kanteen nostamisesta siviilioikeudenkäyntiin. @fi
label: ist Zivilklägerin/Zivilkläger von @de
definition: Setzt einen Akteur in Beziehung zu einer Ressource, bei der ein Akteur eine Klage in ein Zivilverfahren einbringt. @de
label: 是……的原告 @zh-hans
definition: 将一个行为者与涉及民事诉讼中一个起诉行为者责任的一种资源关联起来。 @zh-hans
label: felperese a következőnek: @hu
definition: Hozzákapcsol egy ágenst egy forráshoz, amelyhez hozzátartozik egy ágens felelőssége egy per elindításáért egy polgári jogi eljárásban. @hu
label: davacısıdır @tr
definition: Bir temcilciyi, bir hukuk davasında dava açmak için bir temsilcinin sorumluluğunu içeren bir kaynakla ilişkilendirir @tr

has platemaker
status: Published
definition: Relates a resource to an agent who is responsible for preparing plates used in the making of printed images or text in a resource.
type: Property
inverse of: is platemaker of
lexical alias: platemaker.en
label: har plademager @da
definition: Relaterer en ressource til en agent, der har været involveret i fremstillingen af en ressource ved at forberede plader, der anvendes til fremstilling af trykte billeder og/eller tekst. @da
label: heeft platenmaker @nl
label: painolaatan valmistaja @fi
sub property of: has related agent of resource
label: له مُحضر سطح طباعي @ar
definition: يربط مصدر بوكيل مسؤول عن إنتاج مصدر من خلال إعداد اللوحات المستخدمة في إنتاج الصور المطبوعة أو النص. @ar
definition: Liittää aineiston toimijaan, joka on vastuussa aineiston valmistamisesta valmistamalla painettujen kuvien tai tekstin valmistuksessa käytettäviä painolaattoja tai -levyjä. @fi
label: hat Druckformherstellerin/Druckformhersteller @de
definition: Setzt eine Ressource in Beziehung zu einem Akteur, der für die Herstellung einer Ressource verantwortlich ist, indem er Druckformen für die Produktion von gedruckten Bildern oder gedrucktem Text anfertigt. @de
label: 有制版者 @zh-hans
definition: 将一种资源与负责准备用于在一种资源中制作印刷图像或文字的印版的一个行为者关联起来。 @zh-hans
definition: Relaciona un recurs amb un agent que és responsable de la preparació de les planxes usades en l’elaboració d’imatges o de text imprès en un recurs. @ca
label: nyomólemez-készítője a következő: @hu
definition: Hozzákapcsol egy forrást egy ágenshez, amely felelős egy forrás gyártásáért oly módon, hogy nyomtatott képek vagy szövegek előállításánál használt lemezeket készít elő. @hu
label: levhacı ile ilişkilidir @tr
definition: Bir kaynağı, bir kaynaktaki basılı görüntülerin veya metnin oluşturulmasında kullanılan plakaların hazırlanmasından sorumlu olan bir temsilci ile ilişkilendirir. @tr

is platemaker of
status: Published
definition: Relates an agent to a resource that involves a responsibility of an agent for preparing plates used in the making of printed images or text.
type: Property
inverse of: has platemaker
lexical alias: platemakerOf.en
label: er plademager af @da
definition: Relaterer en agent, der har været involveret i fremstillingen af en ressource ved at forberede plader, der anvendes til fremstilling af trykte billeder og/eller tekst til en ressource. @da
label: is plaatmaker van @nl
sub property of: has related resource of agent
label: هو مُحضِّر سطح طباعى لـ @ar
definition: يربط بين وكيل ومصدر ينطوي على مسؤولية وكيل عن تجهيز الأسطح المستخدمة في إنتاج صور أو نص مطبوع. @ar
label: painolaatan valmistaja (toimija) aineistossa @fi
definition: Liittää toimijan aineistoon, jossa toimija vastaa painettujen kuvien tai tekstin valmistuksessa käytettävien painolaattojen tai -levyjen valmistuksesta. @fi
label: ist Druckformherstellerin/Druckformhersteller von @de
definition: Setzt einen Akteur in Beziehung zu einer Ressource, bei der ein Akteur für die Anfertigung von Druckformen für die Produktion von gedruckten Bildern oder gedrucktem Text verantwortlich ist. @de
label: 是……的制版者 @zh-hans
definition: 将一个行为者与涉及准备用于制作图像和/或文字印刷平版的一个行为者的责任的一种资源关联起来。 @zh-hans
definition: Relaciona un agent amb un recurs que implica una responsabilitat d’un agent en la preparació de les planxes usades en l’elaboració d’imatges impreses o text imprès. @ca
label: nyomólemez-készítője a követezőnek: @hu
definition: Hozzákapcsol egy ágenst egy forráshoz, amelyhez hozzátartozik az ágens felelőssége nyomólemezek előkészítéséért nyomtatott képek vagy szövegek előállításához. @hu
label: levhacısıdır @tr
definition: Bir temsilciyi, basılı görüntülerin veya metnin yapımında kullanılan baskı kalıplarını hazırlamakla görevli bir temsilcinin sorumluluğunu içeren bir kaynakla ilişkilendirir. @tr

has plate number for notated music
status: Published
definition: Relates a resource to a nomen that is an identifier for resource other than a publisher number for notated music, assigned by a publisher to a notated music resource to indicate the printing plate used in the printing process.
type: Property
sub property of: has identifier for resource
lexical alias: plateNumberForNotatedMusic.en
scope note: A plate number for notated music sometimes includes initials, abbreviations, or words identifying the publisher. It is sometimes followed by a number corresponding to the number of pages or plates or a number corresponding to an individual page or plate.
label: har pladenummer for noteret musik @da
definition: Relaterer en ressource til en noteret musikressource af en udgiver. @da
scope note: Pladenummer for noteret musik indeholder sommetider initialer, forkortelser eller ord der identificerer udgiveren og følges sommetider af et nummer der tilsvarer antallet af sider eller plader. @da
inverse of: is plate number for notated music of
label: heeft plaatnummer voor bladmuziek @nl
label: nuottiaineiston laattanumero @fi
label: له رقم لوحة لمدونة موسيقية @ar
definition: يربط بين مصدر وترقيم محدد خصصه ناشر لمصدر موسيقى مدونة. @ar
scope note: يتضمن رقم لوحة لموسيقى مدونة أحيانًا استهلاليات، إختصارات، أو كلمات التى تُعرّف بالناشر.يُتبع أحيانًا برقم يشير إلى رقم الصفحات أو اللوحات أو رقم يشير إلى صفحة أو لوحة واحدة. @ar
definition: Liittää aineiston kustantajan nuottikirjoitukselle antamaan laattanumeroon. @fi
scope note: Nuottiaineiston laattanumero sisältää joskus kustantajaa identifioivia alkukirjaimia, lyhenteitä tai sanoja. Numeron perässä voi olla vastaavien sivujen tai laattojen numerot tai yksittäisten sivujen ja laattojen numerot. @fi
label: hat Druckplattennummer für Noten @de
definition: Setzt eine Ressource in Beziehung zu einer Bezeichnung einer Zählung, die einer notierten Musikressource vom Verlag zugewiesen wird. @de
scope note: Eine Druckplattennummer für Noten enthält manchmal Initialen, Abkürzungen oder Wörter, die den Verlag identifizieren. Ihr folgt manchmal eine Zahl, die der Zahl der Seiten oder Platten entspricht oder eine Zahl, die einer einzelnen Seite oder Platte entspricht. @de
label: 有乐谱版号 @zh-hans
definition: 将一种资源与作为出版者给一种资源分配以表示印刷过程中所用印版的除乐谱出版者编号以外的一种资源的标识符的一个命名关联起来。 @zh-hans
scope note: 乐谱的版号有时候包括标识出版社的首字母缩写、缩略语或单词。乐谱的版号有时候后接对应于页数或版数的一个数字或者对应于一个个别页或版的一个数字。 @zh-hans
definition: Relaciona un recurs amb un nomen que és un identificador de recurs diferent d’un número d’editor de música notada, assignat per un editor a un recurs de música notada per indicar la planxa d’impressió usada en el procés d’impressió. @ca
label: zenei műjegyzéki lemezszáma a következő: @hu
definition: Hozzákapcsol egy forrást egy kiadó által egy zenei lejegyzésnek adott számozásjelöléshez. @hu
scope note: A zenei műjegyzéki lemezszám néha magába foglal kezdőbetűket, rövidítéseket vagy a kiadót megnevező szavakat. Időnként egy az oldalak vagy a lemezek számának, vagy egyedi oldalnak vagy lemeznek megfelelő szám követi. @hu
label: notaya alınmış müziğin plaka numarası ile ilişkilidir @tr
definition: Bir kaynağı, bir yayıncı tarafından müzik notası haline getirilmiş kaynağına verilen bir numaralandırma belirteciyle ilişkilendirir. @tr
scope note: Notaları yazılan müziğin plak numarası kimi zaman baş harfleri, kısaltmaları veya yayımcıyı tanımlanan sözcükleri içerir. Bazen ardına sayfa veya plak sayısına karşılık gelen bir numara ya da münferit sayfa veya plağa karşılık gelen bir numara gelir. @tr

is plate number for notated music of
status: Published
type: Property
lexical alias: plateNumberForNotatedMusicOf.en
sub property of: is identifier for resource of
scope note: A plate number for notated music sometimes includes initials, abbreviations, or words identifying the publisher. It is sometimes followed by a number corresponding to the number of pages or plates or a number corresponding to an individual page or plate.
inverse of: has plate number for notated music
definition: Relates a nomen to a notated music resource that has an identifier for resource other than a publisher number for notated music, assigned by a publisher to indicate the printing plate used in the printing process.
label: is plaatnummer voor bladmuziek van @nl
label: هو رقم لوحة لمدونة موسيقية لـ @ar
scope note: يتضمن رقم لوحة لموسيقى مدونة أحيانًا استهلاليات، إختصارات، أو كلمات التى تُعرّف بالناشر.تُتبع أحيانًا برقم يشير إلى رقم الصفحات أو اللوحات أو رقم يشير إلى صفحة أو لوحة واحدة. @ar
definition: يربط بين تسمية ومدونة موسيقية لها معرف لمصدر بخلاف رقم ناشر خاص بمدونة موسيقيه، التى يخصصها ناشر لتحديد اللوحات المطبوعة المستخدمة في عملية الطباعة. @ar
label: er pladenummer for noteret musik af @da
scope note: Et pladenummer for musik indeholder sommetider initialer, forkortelser eller ord som idenficerer udgiveren. Det er nogen gange efterfulgt af et tal der svarer til antallet af sider eller plader, eller et tal der svarer til en individuel side eller plade. @da
definition: Relaterer et nomen til en noteret musikressource, som har en ressourceidentifkator anden end et editionsnummer for noteret musik, tildelt af en udgiver for at angive den trykplade der blev brugt i trykprocessen. @da
label: nuottiaineiston laatan numero @fi
scope note: Nuottiaineiston laattanumero sisältää joskus kustantajaa identifioivia alkukirjaimia, lyhenteitä tai sanoja. Numeron perässä voi olla vastaavien sivujen tai laattojen numerot tai yksittäisten sivujen ja laattojen numerot. @fi
definition: Liittää nomenin musiikkiaineistoon, jonka tunniste ei ole kustantajan nuottiaineistolle antama numero vaan nuottiaineiston laatan numero. Nuottiaineiston laatan numero ilmaisee, mitä ilmaisee, painolaattaa on käytetty painamisprosessissa. @fi
label: ist Druckplattennummer für Noten von @de
scope note: Eine Druckplattennummer für Noten enthält manchmal Initialen, Abkürzungen oder Wörter, die den Verlag identifizieren. Ihr folgt manchmal eine Zahl, die der Zahl der Seiten oder Platten entspricht oder eine Zahl, die einer einzelnen Seite oder Platte entspricht. @de
definition: Setzt ein Nomen in Beziehung zu einer Noten-Ressource, die über einen Identifikator für eine Ressource verfügt, der von einem Verlag zugewiesen wird, um die im Druckprozess verwendete Druckplatte anzugeben, und bei dem es sich nicht um die Noten-Bestellnummer handelt. @de
label: 是……的乐谱的版号 @zh-hans
scope note: 乐谱的版号有时候包括标识出版社的首字母缩写、缩略语或单词。乐谱的版号有时候后接对应于页数或版数的一个数字或者对应于一个个别页或版的一个数字。 @zh-hans
definition: 将一个命名与有出版者分配以表示印刷过程中所用印版的除乐谱出版者编号以外的一个资源标识符的一种乐谱资源关联起来。 @zh-hans
label: zenei műjegyzéki lemezszáma a következőnek: @hu
scope note: Hozzákapcsol egy noment egy zeneilejegyzés-forráshoz, amelynek a forrásazonosítója eltér a kiadói műjegyzékszámtól, amellyel a kiadó a nyomtatás során használt nyomólemezt jelöli. @hu
definition: A zenei műjegyzéki lemezszám néha magába foglal kezdőbetűket, rövidítéseket vagy a kiadót megnevező szavakat. Get failed: 404 Connection aborted on request @hu
label: notaya alınmış müziğinin plaka numarasıdır @tr
scope note: Notaları yazılan müziğin plak numarası kimi zaman baş harfleri, kısaltmaları veya yayımcıyı tanımlanan sözcükleri içerir. Bazen ardına sayfa veya plak sayısına karşılık gelen bir numara ya da münferit sayfa veya plağa karşılık gelen bir numara gelir. @tr
definition: Bir ismi, basım sürecinde kullanılan baskı kalıbını belirtmek için bir yayıncı tarafından atanan, müzik notası için bir yayıncı numarası dışında bir kaynak tanımlayıcısına sahip bir notaya alınmış müzik kaynağıyla ilişkilendirir. @tr

has playing speed
status: Published
definition: Relates a resource to a speed at which an audio carrier must be operated to produce the sound intended.
type: Property
sub property of: has sound characteristic
lexical alias: playingSpeed.en
label: har omdrejningshastighed @da
definition: Relaterer en ressource til en hastighed, som en lydbærer skal betjenes ved for at producere den ønskede lyd. @da
label: heeft afspeelsnelheid @nl
label: له سرعة تشغيل @ar
definition: يربط بين مصدر وسرعة يجب أن يشغل بها حامل صوت لكي ينتج الصوت المطلوب. @ar
label: toistonopeus aineistolle @fi
definition: Liittää aineiston nopeuteen, jolla äänitallenne on toistettava äänen tuottamiseksi tarkoitetulla tavalla. @fi
label: hat Abspielgeschwindigkeit @de
definition: Setzt eine Ressource in Beziehung zu einer Geschwindigkeit, mit der ein Tonträger für die korrekte Wiedergabe abgespielt werden muss. @de
label: 有播放速度 @zh-hans
definition: 将一种资源与一种音频载体要产生所期望的声音必须操作的速度关联起来。 @zh-hans
label: lejátszási sebessége a következő: @hu
definition: Hozzákapcsol egy forrást egy sebességhez, amelyen egy hanghordozónak működnie kell, hogy a kívánt hangot elő tudják állítani. @hu
label: çalma hızı ile ilişkilidir @tr
definition: Bir kaynağı, amaçlanan sesi üretmek için bir ses taşıyıcısının çalıştırılması gereken hız ile ilişkilendirir. @tr

has polarity
status: Published
definition: Relates a resource to a relationship of the colours and tones in an image to the colours and tones of the object reproduced.
type: Property
lexical alias: polarity.en
label: har polaritet @da
definition: Relaterer en ressource til et forhold mellem farver og nuancer i et billede og farver og nuancer i den reproducerede genstand. @da
label: heeft polariteit @nl
label: له استقطاب ألوان @ar
definition: يربط بين مصدر وعلاقة خاصة بالألوان ودرجات الألوان في صورة ما بألوان ودرجات شيء/لون معاد إنتاجه. @ar
label: polariteetti aineistossa @fi
definition: Liittää aineiston suhteeseen, joka kuvan väreillä ja valoisuudella on kuvan kohteen väreihin ja valoisuuteen. @fi
label: hat Polarität @de
definition: Setzt eine Ressource in Beziehung zum Verhältnis der Farben und Tönungen in einem Bild zu den Farben und Tönungen des reproduzierten Objekts. @de
label: 有极性 @zh-hans
definition: 将一种资源与一个图像中色彩和色调与被复制对象的色彩和色调的关系关联起来。 @zh-hans
label: polaritása a következő: @hu
definition: Hozzákapcsol egy forrást egy kép színei és tónusai, valamint a reprodukált objektum színei és tónusai között fennálló kapcsolathoz. @hu
label: polarite ile ilişkilidir @tr
definition: Bir kaynağı, bir görüntüdeki renklerin ve tonların, yeniden üretilen nesnenin renkleri ve tonlarıyla olan bağlantısıyla ilişkilendirir. @tr

has praeses
status: Published
definition: Relates a resource to an agent who is a faculty moderator of an academic disputation, normally proposing a thesis and participating in the ensuing disputation.
type: Property
sub property of: has creator
inverse of: is praeses of
lexical alias: praeses.en
label: har præses @da
definition: Relaterer en ressource til en agent, der er fakultetsordstyrer for et akademisk afhandlingsforsvar, normalt ved at fremsætte en tese og deltage i det efterfølgende afhandlingsforsvar. @da
label: heeft preses @nl
label: preeses @fi
label: له رئيس جلسة @ar
definition: يربط مصدر بوكيل يعمل بصفته رئيس جلسة أعضاء هيئة التدريس في مناظرة أكاديمية، ويقترح عادة مبحثا ويشارك في المناظرة اللاحقة. @ar
definition: Liittää aineiston toimijaan, joka on vastuussa väitöskirjan esittelystä väitöstilasuudessa tiedekunnan edustajana ja osallistuu keskusteluun väitöstilaisuuden puheenjohtajana. @fi
label: hat Praeses @de
definition: Setzt eine Ressource in Beziehung zu einem Akteur, der auf Fakultätsseite eine akademische Disputation moderiert, normalerweise eine These vorschlägt und an der sich daraus ergebenden Disputation teilnimmt. @de
label: 有评审人 @zh-hans
definition: 将一种资源与作为学术辩论的主持教师（通常是提出一个论题并参与后续的辩论）的一个行为者关联起来。 @zh-hans
label: elnöke a következő: @hu
definition: Hozzákapcsol egy forrást egy ágenshez, aki egy tudományos vita kari moderátora, aki szokásos módon előterjeszt egy értekezést és részt vesz az azt követő vitában. @hu
label: danışman ile ilişkilidir @tr
definition: Bir kaynağı akademik bir tartışmanın fakülte moderatörü olan, normalde bir tez öneren ve ardından gelen tartışmaya katılan bir temsilci ile ilişkilendirir. @tr

is praeses of
status: Published
definition: Relates an agent to a resource that involves a responsibility as a faculty moderator of an academic disputation, normally proposing a thesis and participating in the ensuing disputation.
type: Property
sub property of: is creator of
inverse of: has praeses
lexical alias: praesesOf.en
label: er præses i @da
definition: Relaterer en agent der er fakultetsordstyrer for et akademisk afhandlingsforsvar, normalt ved at fremsætte en tese og deltage i det efterfølgende afhandlingsforsvar til en ressource. @da
label: is preses van @nl
label: هو رئيس جلسة لـ @ar
definition: يربط بين وكيل ومصدر ينطوي على مسؤوليته رئاسة جلسة أعضاء هيئة التدريس في مناظرة أكاديمية، ويقترح عادة أطروحة ويشارك في المناظرة اللاحقة. @ar
label: preeses (toimija) aineistossa @fi
definition: Liittää toimijan aineistoon, jossa toimija vastaa väitöskirjan esittelystä väitöstilasuudessa tiedekunnan edustajana ja osallistuu keskusteluun väitöstilaisuuden puheenjohtajana. @fi
label: ist Praeses von @de
definition: Setzt einen Akteur in Beziehung zu einer Ressource, bei der ein Akteur auf Fakultätsseite eine akademische Disputation moderiert, normalerweise eine These vorschlägt und an der sich daraus ergebenden Disputation teilnimmt. @de
label: 是……的评审人 @zh-hans
definition: 将一个行为者与涉及作为学术辩论的主持教师（通常是提出一个论题并参与后续的辩论）责任的一种资源关联起来。 @zh-hans
label: elnöke a következőnek: @hu
definition: Hozzákapcsol egy ágenst egy forráshoz, amelyhez hozzátartozik egy tudományos vita kari moderátorának felelőssége, aki szokásos módon előterjeszt egy szakdolgozatot, és részt vesz az azt követő vitában. @hu
label: danışmanıdır @tr
definition: Bir temsilciyi, normalde bir tez öneren ve ardından gelen tartışmaya katılan, akademik bir tartışmanın fakülte moderatörü olarak sorumluluk içeren bir kaynakla ilişkilendirir. @tr

is preceded by
status: Published
definition: Relates a resource to a resource whose chronological coverage is before that of another resource.
type: Property
sub property of: has sequential resource relationship with (Deprecated)
inverse of: is succeeded by
lexical alias: precededBy.en
label: er forudgået af @da
definition: Relaterer en ressource til en ressource, der går forud for den efterfølgende ressource, fx på et tidligere tidspunkt eller før noget i en fortælling. @da
label: is voorafgegaan door @nl
label: edeltävä aineisto @fi
label: هو مسبوق بـ @ar
definition: يربط بين مصدر ومصدر تكون تغطيته الزمنية قبل التغطية الخاصة بمصدر آخر. @ar
definition: Liittää aineiston aineistoon, jonka ajallinen kattavuus on aineiston ajallista kattavuutta varhaisempi. @fi
label: ist vorangegangen ist @de
definition: Setzt eine Ressource in Beziehung zu einer Ressource, deren zeitliches Geschehen vor dem einer anderen Ressource liegt. @de
label: 被……作为先前 @zh-hans
definition: 将一种资源与在时间覆盖面上在另一种资源之前的一种资源关联起来。 @zh-hans
label: megelőzi a következő: @hu
definition: Hozzákapcsol egy forrást egy forráshoz, amely kronológiai narratívában megelőz egy rákövetkező forrást. @hu
has subproperty: is absorption in part of
has subproperty: is absorption of
has subproperty: is continuation of
has subproperty: is merger of
has subproperty: has prequel
has subproperty: is replacement in part of
has subproperty: is replacement of
has subproperty: is separated from
has subproperty: is sequel to (Deprecated)
has subproperty: is split from
label: takip eder @tr
definition: Bir kaynağı, kronolojik kapsamı başka bir kaynaktan önce olan bir kaynakla ilişkilendirir. @tr

has predecessor
status: Published
definition: Relates an agent who precedes a related agent to an agent.
type: Property
inverse of: has successor
lexical alias: predecessor.en
label: har forgænger @da
definition: Relaterer en agent der går forud for en anden agent til en agent. @da
label: heeft voorganger @nl
label: له سَلَف @ar
definition: يربط بين وكيل ووكيل يسبق وكيل ذو صلة. @ar
label: yhteistoimijan edeltäjä @fi
definition: Liittää yhteisön toista yhteistoimijaa edeltäneeseen yhteistoimijaan. @fi
label: hat Vorgängerin/Vorgänger @de
definition: Setzt einen Akteur in Beziehung zu einem Akteur, der einem Akteur vorausgeht. @de
label: 有前身 @zh-hans
definition: 将一个作为一个相关行为者前身的行为者与一个行为者关联起来。 @zh-hans
label: elődje a következő: @hu
definition: Hozzákapcsol egy ágenst, amely egy kapcsolódó ágens elődje, egy ágenshez. @hu
label: önceki ile ilişkilidir @tr
definition: İlgili bir temsilciden önce gelen bir temsilciyi bir temsilciyle ilişkilendirir. @tr

has predecessor of split
status: Published
definition: Relates an agent who split or divided into a related agent to an agent.
type: Property
inverse of: has product of split
lexical alias: predecessorOfSplit.en
label: har forgænger til opsplitning @da
definition: Relaterer en agent der blev opdelt eller opsplittet i en anden agent til en agent. @da
label: heeft voorganger van splitsing @nl
label: له وكيل سابق نتيجة انفصال @ar
definition: يربط بين وكيل ووكيل انفصل أو انقسم إلى وكيل ذي صلة. @ar
label: jakautunut yhteisö @fi
definition: Liittää yhteistoimijan yhteistoimijaan, joka on jakautunut tai eronnut liittyväksi yhteistoimijaksi. @fi
label: hat Vorgängerin/Vorgänger einer Aufteilung @de
definition: Setzt einen Akteur in Beziehung zu einem Akteur, der einem anderen Akteur nachfolgt oder aus ihm hervorgeht. @de
label: 有分出行为者的前身 @zh-hans
definition: 将一个行为者与被分出或被划分成一个相关行为者的一个行为者关联起来。 @zh-hans
label: szétválás előtti jogelődje a következő: @hu
definition: Hozzákapcsol egy ágenst, amely szétválik vagy egy kapcsolódó ágens részévé válik, egy ágenshez. @hu
label: ana kuruluş ile ilişkilidir @tr
definition: İlgili bir temsilciye bölünmüş veya ayrılmış bir temsilciyi bir temsilciyle ilişkilendirir. @tr

has preferred citation
status: Published
definition: Relates a resource to a citation for a resource in the form preferred by a creator, publisher, custodian, indexing or abstracting service, or other agent.
type: Property
lexical alias: preferredCitation.en
label: har foretrukken referenceform @da
definition: Relaterer en ressource til en reference til en ressource i den form, der foretrækkes af et ophav, en udgiver, en forvalter eller virksomheder der udarbejder referater og abstracts etc. @da
label: heeft voorkeurscitatie @nl
label: ensisijainen viittausmuoto aineistolle @fi
label: له استشهاد مُفضل @ar
definition: يربط بين مصدر واستشهاد لمصدر في الشكل المفضل للمنشئ، الناشر، الجهة المودعة، خدمة التكشيف والاستخلاص، أو وكيل آخر. @ar
definition: Liittää aineiston viittausmuotoon, jonka teoksen tekijä, kustantaja, aineiston säilyttäjä, kuvailija, tiivistelmän tekijä tai muu toimija on valinnut aineistosta ensisijaisesti käytettäväksi. @fi
label: hat bevorzugte Zitierweise @de
definition: Setzt eine Ressource in Beziehung zu einer Zitierweise für eine Ressource, die von einer geistigen Schöpferin/einem geistigen Schöpfer, einem Verlag, einer Verwahrerin/einem Verwahrer, einem Indexierungs- oder Abstract-Service und so weiter bevorzugt wird. @de
label: 有首选引文 @zh-hans
definition: 将一种资源与以创作者、出版者、保管者、索引或文摘机构或其他行为者首选形式的一种资源的引文关联起来。 @zh-hans
label: előnyben részesített hivatkozása a következő: @hu
definition: Hozzákapcsol egy forrást egy forrásra utaló hivatkozáshoz olyan formában, amelyet egy létrehozó, kiadó, gyűjteményvezető, indexelő vagy referáló szolgáltatás vagy egyéb ágens előnyben részesít. @hu
label: tercih edilen atıf ile ilişkilidir @tr
definition: Bir kaynağı, yaratıcısı, yayıncısı, sorumlusu, dizinleme veya özetleme hizmeti veya diğer temsilci tarafından tercih edilen biçimde bir kaynak için bir atıfla ilişkilendirir. @tr

has preferred name of agent
status: Published
definition: Relates an agent to a nomen that is a name of agent that is selected for preference in a specific application or context.
type: Property
sub property of: has name of agent
lexical alias: preferredNameOfAgent.en
label: har foretrukken navneform for agent @da
definition: Relaterer en ressource til et navn eller en navneform, der er valgt til identifikation af en person. @da
inverse of: is preferred name of agent of
label: heeft geprefereerde naam van actor @nl
label: له اسم مُفضل لوكيل @ar
definition: يربط بين وكيل واسم وكيل ااُختير كاسم مُفضل في تطبيق محدد أو سياق محدد. @ar
label: toimijan ensisijainen nimi @fi
definition: Liittää toimijan nimeen, joka on valittu toimijan ensisijaiseksi nimeksi tietyssä sovelluksessa tai kontekstissa. @fi
label: hat bevorzugten Namen eines Akteurs @de
definition: Setzt einen Akteur in Beziehung zu einem Namen eines Akteurs, der in einer bestimmten Anwendung oder in einem bestimmten Kontext als Vorzugsform bestimmt wird. @de
label: 有行为者的首选名称 @zh-hans
definition: 将一个行为者与作为一个行为者的名称并在一个特定的应用或语境中被首选的一个命名关联起来。 @zh-hans
definition: Relaciona un agent amb un nomen que és un nom d’agent que se selecciona com a preferent en una aplicació o un context específic. @ca
label: ágens előnyben részesített névalakja a következő: @hu
definition: Hozzákapcsol egy ágenst egy ágensnévhez, amelyet egy adott alkalmazásban vagy összefüggésben előnyben részesítenek. @hu
label: tercih edilen temsilci adı ile ilişkilidir @tr
definition: Bir temsilciyi, belirli bir uygulama veya bağlamda tercih için seçilen temsilci ismiyle ilişkilendirir. @tr

is preferred name of agent of
status: Published
sub property of: is name of agent of
type: Property
lexical alias: preferredNameOfAgentOf.en
definition: Relates a nomen to an agent who has a name of agent that is selected for preference in a specific application or context.
inverse of: has preferred name of agent
label: is geprefereerde naam van actor van @nl
label: هو اسم مفضل لوكيل لـ @ar
definition: يربط بين تسمية ووكيل له اسم وكيل اُختير كاسم مفضل ضمن تطبيق محدد أو سياق محدد. @ar
label: er foretrukket navn på agent på @da
definition: Relaterer et nomen til en agent, som har et agentnavn, der er valgt som foretrukket i en specifik applikation eller et specifikt sammenhæng. @da
label: Toimijan ensisijainen nimi @fi
definition: Liittää nomenin toimijaan, jolla on tietyssä sovelluksessa tai kontekstissa ensisijaiseksi valittu toimijan nimi. @fi
label: ist bevorzugter Name eines Akteurs von @de
definition: Setzt ein Nomen in Beziehung zu einem Akteur, der über einen Namen für einen Akteur verfügt, der in einer bestimmten Anwendung oder in einem bestimmten Kontext als Vorzugsform bestimmt wird. @de
label: 是……的行为者的首选名称 @zh-hans
definition: 将一个命名与有在一个特定的应用或语境下被首选的一个行为者名称的一个行为者关联起来。 @zh-hans
label: előnyben részesített neve a következő ágensnek: @hu
definition: Egy noment hozzákapcsol egy ágenshez, amelynek van egy olyan ágensneve, amelyet egy adott alkalmazásban vagy kontextusban előnyben részesítenek. @hu
label: temsilcisinin tercih edilen adıdır @tr
definition: Bir ismi, belirli bir uygulamada veya bağlamda tercih edilmeyen temsilci adına sahip bir temsilciyle ilişkilendirir. @tr

has preferred name of entity
status: Published
type: Property
lexical alias: preferredNameOfEntity.en
definition: Relates an entity to a nomen that is a name of entity that is selected for preference in a specific application or context.
sub property of: has name of entity
inverse of: is preferred name of entity of
label: heeft geprefereerde naam van entiteit @nl
label: له اسم مفضل لكيان @ar
definition: يربط بين كيان واسم كيان اُختير كاسم مفضل ضمن تطبيق محدد أو سياق محدد. @ar
label: har foretrukket navn på entitet @da
definition: Relaterer en entitet til et navn på entitet der er valgt som foretrukket i en specifik applikation eller et specifikt sammenhæng. @da
label: entiteetin ensisijainen nimi @fi
definition: Liittää entiteetin ensisijaiseksi tietyssä sovelluksessa tai kontekstissa ensisijaiseksi valittuun entiteetin nimeen. @fi
label: hat bevorzugten Namen einer Entität @de
definition: Setzt eine Entität in Beziehung zu einem Namen einer Entität, der in einer bestimmten Anwendung oder in einem bestimmten Kontext als Vorzugsform bestimmt wird. @de
label: 有实体的首选名称 @zh-hans
definition: 将一个实体与一个作为实体名称并在特定应用或语境下优先选用的命名关联起来。 @zh-hans
definition: Relaciona una entitat amb un nomen que és un nom d’entitat que se selecciona com a preferent en una aplicació o un context específic. @ca
label: entitás előnyben részesített neve a következő: @hu
definition: Hozzákapcsol egy entitást egy entitásnévhez, amelyet egy adott alkalmazásban vagy kontextusban előnyben részesítenek. @hu
label: tercih edilen varlık adı ile ilişkilidir @tr
definition: Bir varlığı, belirli bir uygulama veya bağlamda tercih edilen bir varlığın adıyla ilişkilendirir. @tr

is preferred name of entity of
status: Published
type: Property
lexical alias: preferredNameOfEntityOf.en
definition: Relates a nomen to an entity that has a name of entity that is selected for preference in a specific application or context.
sub property of: is name of entity of
inverse of: has preferred name of entity
label: is geprefereerde naam van entiteit van @nl
label: هو اسم مُفضل لكيان لـ @ar
definition: يربط بين تسمية وكيان له اسم كيان اُختير كاسم مُفضل في تطبيق محدد أو سياق محدد. @ar
label: er foretrukket navn på entitet af @da
definition: Relaterer et nomen til en entitet, som har et entitetsnavn, der er valgt som foretrukket i en specifik applikation eller et specifikt sammenhæng. @da
label: entiteetin ensisijainen nimi @fi
definition: Liittää nomenin entiteettiin, jolla on on tietyssä sovelluksessa tai kontekstissa ensisijaiseksi valittu entiteetin nimi. @fi
label: ist bevorzugter Name einer Entität von @de
definition: Setzt ein Nomen in Beziehung zu einer Entität, die über einen Namen für eine Entität verfügt, der in einer bestimmten Anwendung oder in einem bestimmten Kontext als Vorzugsform bestimmt wird. @de
label: 是……的实体的首选名称 @zh-hans
definition: 将一个命名与有在一个特定的应用或语境中被首选的一个实体名称的一个实体关联起来。 @zh-hans
label: előnyben részesített neve a következő entitásnak: @hu
definition: Hozzákapcsol egy noment egy entitáshoz, amelynek van egy olyan entitásneve, amelyet egy adott alkalmazásban vagy kontextusban előnyben részesítenek. @hu
label: varlığının tercih edilen adıdır @tr
definition: Bir ismi, belirli bir uygulama veya bağlamda seçilen bir varlığın tercih edilen adıyla ilişkilendirir. @tr

has preferred name of place
status: Published
definition: Relates a place to a nomen that is a name of place that is selected for preference in a specific application or context.
type: Property
sub property of: has name of place
lexical alias: preferredNameOfPlace.en
label: har foretrukken navneform for et sted @da
definition: Relaterer en ressource til et navn eller en navneform, der er valgt til identifikation af et sted. @da
inverse of: is preferred name of place of
label: heeft geprefereerde naam van plaats @nl
label: له اسم مُفضل لمكان @ar
definition: يربط بين مكان واسم مكان اُختير كاسم مُفضل في تطبيق محدد أو سياق محدد. @ar
label: paikan ensisijainen nimi @fi
definition: Liittää paikan nimeen, joka on valittu ensisijaiseksi tietyssä sovelluksessa tai kontekstissa. @fi
label: hat bevorzugten Namen eines Geografikums @de
definition: Setzt ein Geografikum in Beziehung zu einem Namen eines Geografikums, der in einer bestimmten Anwendung oder in einem bestimmten Kontext als Vorzugsform bestimmt wird. @de
label: 有地点的首选名称 @zh-hans
definition: 将一个地点与作为在一个特定的应用或语境中被首选的一个地点名称的一个命名关联起来。 @zh-hans
definition: Relaciona un lloc amb un nomen que és un nom de lloc que se selecciona com a preferent en una aplicació o un context específic. @ca
label: előnyben részesített helyneve a következő: @hu
definition: Hozzákapcsol egy helyet egy helynévhez, amelyet egy adott alkalmazásban vagy összefüggésben előnyben részesítenek. @hu
label: tercih edilen yer adı ile ilişkilidir @tr
definition: Bir yeri, belirli bir uygulama veya içerikte tercih edilmek üzere seçilen yer adıyla ilişkilendirir. @tr

is preferred name of place of
status: Published
sub property of: is name of place of
type: Property
lexical alias: preferredNameOfPlaceOf.en
definition: Relates a nomen to a place that has a name of place that is selected for preference in a specific application or context.
inverse of: has preferred name of place
label: is geprefereerde naam van plaats van @nl
label: هو اسم مفضل لمكان لـ @ar
definition: يربط بين تسمية ومكان له اسم مكان اختير كاسم مفضل في تطبيق محدد أو في سياق محدد. @ar
label: er fortrukket stednavn på @da
definition: Relaterer et nomen til et sted, der har et stednavn, som er valgt som foretrukket i en specifik applikation eller i et specifikt sammenhæng. @da
label: paikan ensisijainen nimi @fi
definition: Liittää nomenin paikkaan, jolla on ensisijaiseksi tietyssä sovelluksessa tai kontekstissa valittu paikannimi. @fi
label: ist bevorzugter Name eines Geografikums von @de
definition: Setzt ein Nomen in Beziehung zu einem Geografikum, das über einen Namen für ein Geografikum verfügt, der in einer bestimmten Anwendung oder in einem bestimmten Kontext als Vorzugsform bestimmt wird. @de
label: 是……的地点的首选名称 @zh-hans
definition: 将一个命名与有在一个特定的应用或语境中被首选的一个地点名称的一个地点关联起来。 @zh-hans
label: előnyben részesített helyneve a következőnek: @hu
definition: Hozzákapcsol egy noment egy helyhez, amelynek van egy olyan helyneve, amelyet egy adott alkalmazásban vagy kontextusban előnyben részesítenek. @hu
label: yerinin tercih edilen adıdır @tr
definition: Bir ismi, belirli bir uygulamada veya bağlamda tercih edilen bir yer adına sahip bir yerle ilişkilendirir. @tr

has preferred name of timespan
status: Published
sub property of: has name of timespan
type: Property
lexical alias: preferredNameOfTimespan.en
definition: Relates a timespan to a nomen that is a name of timespan that is selected for preference in a specific application or context.
inverse of: is preferred name of timespan of
label: heeft geprefereerde naam van tijdspanne @nl
label: له اسم مفضل لفترة زمنية @ar
definition: يربط بين فترة زمنية واسم لفترة زمنية اُختيرت كاسم مفضل ضمن تطبيق محدد أو سياق محدد. @ar
label: har foretrukket navn på tidsforløb @da
definition: Relaterer et tidsforløb til et navn på tidsforløb, der er valgt som foretrukket i en specifik applikation eller i et specifikt sammenhæng. @da
label: ajanjakson ensisijainen nimi @fi
definition: Liittää ajanjakson ensisijaiseksi tietyssä sovelluksessa tai kontekstissa valittuun ajanjakson nimeen. @fi
label: hat bevorzugten Namen eines Zeitraums @de
definition: Setzt einen Zeitraum in Beziehung zu einem Namen eines Zeitraums, der in einer bestimmten Anwendung oder in einem bestimmten Kontext als Vorzugsform bestimmt wird. @de
label: 有时间段的首选名称 @zh-hans
definition: 将一个时间段与作为一个时间段的名称并在一个特定的应用或语境中被首选的一个命名关联起来。 @zh-hans
definition: Relaciona un interval de temps amb un nomen que és un nom d’interval de temps que se selecciona com a preferent en una aplicació o un context específic. @ca
label: időtartam előnyben részesített neve a következő: @hu
definition: Hozzákapcsol egy időtartamot egy időtartamnévhez, amely egy adott alkalmazásban vagy összefüggésben előnyben részesítenek. @hu
label: tercih edilen zaman aralığı adı ile ilişkilidir @tr
definition: Bir zaman aralığını, belirli bir uygulama veya bağlamda tercih için seçilmiş bir zaman aralığının adıyla ilişkilendirir. @tr

is preferred name of timespan of
status: Published
sub property of: is name of timespan of
type: Property
lexical alias: preferredNameOfTimespanOf.en
definition: Relates a nomen to a timespan that has a name of timespan that is selected for preference in a specific application or context.
inverse of: has preferred name of timespan
label: is geprefereerde naam van tijdspanne van @nl
label: هو اسم مفضل لفترة زمنية لـ @ar
definition: ييربط تسمية بفترة زمنية لها اسم فترة زمنية اُختيرت كاسم مفضل في تطبيق محدد أو سياق محدد. @ar
label: er foretrukket navn på tidsperiode for @da
definition: Relaterer et nomen til et tidsforløb, der har et navn på tidsforløb, der er valgt som foretrukket i en specifik applikation eller et specifikt sammenhæng. @da
label: ajanjakson ensisijainen nimi @fi
definition: Liittää nomenin ajanjaksoon, jolla on ensisijaiseksi tietyssä sovelluksessa tai kontekstissa valittu ajanjakson nimi. @fi
label: ist bevorzugter Name eines Zeitraums von @de
definition: Setzt ein Nomen in Beziehung zu einem Zeitraum, der über einen Namen für einen Zeitraum verfügt, der in einer bestimmten Anwendung oder in einem bestimmten Kontext als Vorzugsform bestimmt wird. @de
label: 是……的时间段的首选名称 @zh-hans
definition: 将一个命名与有在一个特定的应用或语境中被首选的一个时间段名称的一个时间段关联起来。 @zh-hans
label: előnyben részesített időtartamneve a következőnek: @hu
definition: Hozzákapcsol egy noment egy időtartamhoz, amelynek van egy olyan időtartamneve, amelyet egy adott alkalmazásban vagy kontextusban előnyben részesítenek. @hu
label: zaman aralığının tercih edilen adıdır @tr
definition: Bir ismi, belirli bir uygulamada veya bağlamda tercih edilen bir zaman aralığı adına sahip bir zaman aralığıyla ilişkilendirir. @tr

has preferred title of resource
status: Published
definition: Relates a resource to a nomen that is a title of resource that is selected for preference in a specific application or context.
type: Property
sub property of: has title of resource
lexical alias: preferredTitleOfResource.en
inverse of: is preferred title of resource of
label: har foretrukken titel for ressourcen @da
definition: Relaterer en ressource til en titel eller titelform, der er valgt til identifikation af ressourcen. @da
label: heeft geprefereerde titel van resource @nl
label: له عنوان مفضل لمصدر @ar
definition: يربط بين مصدر وعنوان مصدر اُختير كعنوان مُفضل في تطبيق محدد أو سياق محدد. @ar
label: aineiston ensisijainen nimeke @fi
definition: Liittää aineiston nimekkeeseen, joka on valittu ensisijaiseksi tietyssä sovelluksessa tai kontekstissa. @fi
label: hat bevorzugten Titel einer Ressource @de
definition: Setzt eine Ressource in Beziehung zu einem Titel einer Ressource, der in einer bestimmten Anwendung oder in einem bestimmten Kontext als Vorzugsform bestimmt wird. @de
label: 有资源的首选题名 @zh-hans
definition: 将一种资源与作为资源的一个题名并在一个特定的应用或语境下被首选的一个命名关联起来。 @zh-hans
definition: Relaciona un recurs amb un nomen que és un títol d’un recurs que se selecciona com a preferent en una aplicació o un context específic. @ca
label: forrás előnyben részesített címe a következő: @hu
definition: Hozzákapcsol egy forrást egy forrás címéhez, amelyet egy adott alkalmazásban vagy összefüggésben előnyben részesítenek. @hu
label: tercih edilen kaynak başlığı ile ilişkilidir @tr
definition: Bir kaynağı, belirli bir uygulama veya bağlamda tercih edilmek üzere seçilmiş bir kaynak başlığıyla ilişkilendirir. @tr

is preferred title of resource of
status: Published
sub property of: is title of resource of
type: Property
lexical alias: preferredTitleOfResourceOf.en
definition: Relates a nomen to a resource that has a title of resource that is selected for preference in a specific application or context.
inverse of: has preferred title of resource
label: is geprefereerde titel van resource van @nl
label: هو عنوان مفضل لمصدر لـ @ar
definition: يربط تسمية بمصدر له عنوان اُختير كعنوان مفضل ضمن تطبيق محدد أو سياق محدد. @ar
label: er foretrukken titel af ressource @da
definition: Relaterer et nomen til en ressource, som har en ressourcetitel der er valgt som foretrukken in en specifik applikation eller i et specifikt sammenhæng. @da
label: aineiston ensisijainen nimeke @fi
definition: Liittää nomenin aineistoon, jolla on tietyssä sovelluksessa tai kontekstissa ensisijaiseksi valittu aineiston nimeke. @fi
label: ist bevorzugter Titel einer Ressource von @de
definition: Setzt ein Nomen in Beziehung zu einer Ressource, die über einen Titel für eine Ressource verfügt, der in einer bestimmten Anwendung oder in einem bestimmten Kontext als Vorzugsform bestimmt wird. @de
label: 是……的资源的首选题名 @zh-hans
definition: 将一个命名与有在一个特定的应用或语境中被首选的一个资源题名的一种资源关联起来。 @zh-hans
label: előnyben részesített címe a következő forrásnak: @hu
definition: Hozzákapcsol egy noment egy forráshoz, amely rendelkezik egy olyan forráshoz tartozó címmel, amelyet egy adott alkalmazásban vagy kontextusban előnyben részesítenek. @hu
label: kaynağının tercih edilen başlığıdır @tr
definition: Bir ismi, belirli bir uygulama veya bağlamda tercih edilen bir kaynak adına sahip bir kaynakla ilişkilendirir. @tr

has prequel
status: Published
definition: Relates a resource to a resource that extends the narrative of another resource backwards in time.
type: Property
sub property of: is preceded by
inverse of: is prequel to (Deprecated)
lexical alias: prequel.en
label: er forløber @da
definition: Relaterer en ressource til en ressource, der udvider en tidligere ressources fortælling bagud i tiden. @da
alternative label: is sequel to
label: heeft prequel @nl
label: aineiston esiosa @fi
alternative label: aineiston jatko-osa @fi
label: له بادئه @ar
definition: يربط بين مصدر ومصدر يوسع السرد لمصدر آخر يسبقه زمنيًا. @ar
alternative label: هو تَتِمّة لـ @ar
alternative label: er efterfølger til @da
definition: Liittää aineiston aineistoon, joka laajentaa toisenaineiston kerrontaa ajassa taaksepäin. @fi
label: hat Prequel @de
definition: Setzt eine Ressource in Beziehung zu einer Ressource, die den Erzählstrang einer anderen Ressource zeitlich rückwärts erweitert. @de
alternative label: ist Sequel zu @de
alternative label: 是……的续篇 @zh-hans
label: 有前篇 @zh-hans
definition: 将一种资源与把另一种资源的叙述在时间上往回延伸的一种资源关联起来。 @zh-hans
alternative label: folytatással rendelkezik @hu
label: előzménye a következő: @hu
definition: Hozzákapcsol egy forrást egy forráshoz, amely időben visszafelé terjeszti ki egy másik forrás narratíváját. @hu
alternative label: devamı niteliğindedir @tr
label: önceki ile ilişkilidir @tr
definition: Bir kaynağı, başka bir kaynağın anlatımını zamanda geriye doğru götürerek genişleten bir kaynakla ilişkilendirir. @tr

is prequel to (Deprecated)
status: Deprecated
definition: Relates a resource to a resource whose narrative is extended backwards in time by the later resource.. (Deprecated)
type: Property
sub property of: is succeeded by
inverse of: has prequel
lexical alias: prequelTo.en
label: er forhistorie til @da
definition: Relaterer en ressource til en ressource, hvis fortælling udvides bagud i tid af en senere ressource. @da

has presentation format
status: Published
definition: Relates a resource to a format that is used in the production of a projected image.
type: Property
sub property of: has projection characteristic of motion picture film
lexical alias: presentationFormat.en
label: har fremvisningsformat @da
definition: Relaterer en ressource til et format, der er anvendt ved fremstillingen af et projiceret billede. @da
label: heeft presentatieformaat @nl
label: له شكل عرض @ar
definition: يربط بين مصدر وصيغة مُستخدمة في إنتاج صورة مرئية. @ar
label: aineiston esitysformaatti @fi
definition: Liittää aineiston heijastettavan kuvan tuottamisessa käytettävään formaattiin. @fi
label: hat Wiedergabeformat @de
definition: Setzt eine Ressource in Beziehung zu einem Format, das bei der Entstehung eines projizierten Bilds verwendet wird. @de
label: 有呈现格式 @zh-hans
definition: 将一种资源与用于一个投影图像制作的格式关联起来。 @zh-hans
label: prezentációs formátuma a következő: @hu
definition: Hozzákapcsol egy forrást egy formátumhoz, amelyet egy kivetített kép előállításához használnak. @hu
label: sunum formatı ile ilişkilidir @tr
definition: Bir kaynağı, yansıtılan bir görüntünün üretiminde kullanılan formatla ilişkilendirir. @tr

has presenter
status: Published
definition: Relates a resource to an agent mentioned in an "X presents" credit for moving image materials and who is probably associated with production, finance, or distribution in some way.
type: Property
sub property of: has contributor (Deprecated)
inverse of: is presenter of
lexical alias: presenter.en
label: har presenter @da
definition: Relaterer en ressource til en agent, der er nævnt i en fortekst i levende billedmaterialer som ”X præsenterer”, og som sandsynligvis er knyttet til produktion, finansiering eller distribution på en eller anden måde. @da
label: heeft presenterende @nl
label: esittäjä aineistossa @fi
label: له مُقدم @ar
definition: يربط مصدر بوكيل وارد ذكره في "أحد التقديمات" مسؤول عن نقل مواد صور متحركة وربما يكون مرتبطا بطريقة ما بالإنتاج أو التمويل أو التوزيع @ar
definition: Liittää aineiston toimijaan, joka mainitaan alku- tai lopputekstien "X esittää:" -merkinnössä ja joka todennäköisesti liittyy liikkuvan kuvan teoksen aineiston tuotantoon, rahoitukseen tai jakeluun jollakin tavoin. @fi
label: hat Präsentatorin/Präsentator @de
definition: Setzt eine Ressource in Beziehung zu einem Akteur, der in einem "X präsentiert"-Vorspann für Bewegtbildmaterialien erwähnt wird und der wahrscheinlich mit der Produktion, Finanzierung oder dem Vertrieb in Verbindung steht. @de
label: 有出品人 @zh-hans
definition: 将一种资源与一种动态图像资源的摄制人员名单中以“某某 出品”（X presents）的方式被提及的且和制作、财务或发行等有某些联系的一个行为者关联起来。 @zh-hans
label: bemutatja a következő: @hu
definition: Hozzákapcsol egy forrást egy mozgóképanyag „az X bemutatja:” stáblistaelemében említett ágenshez, amely valószínűleg valamilyen módon az előállításhoz, a finanszírozáshoz vagy a terjesztéshez kapcsolódik. @hu
label: sunucu ile ilişkilidir @tr
definition: Bir kaynağı, hareketli görüntü materyalleri için "X sunar" atıfında adı geçen ve muhtemelen yapım, finans veya dağıtımla bir şekilde bağlantılı olan bir temsilci ile ilişkilendirir. @tr

is presenter of
status: Published
definition: Relates an agent to a resource with an "X presents:" credit in a resource of a moving image for an agent who is probably associated with production, finance, or distribution in some way.
type: Property
sub property of: is contributor of (Deprecated)
inverse of: has presenter
lexical alias: presenterOf.en
label: er præsentator i @da
definition: Relaterer en agent, der er nævnt i en fortekst i levende billedmaterialer som ”X præsenterer”-tekst, og som sandsynligvis er knyttet til produktion, finansiering eller distribution på en eller anden måde til en ressource. @da
label: is presenterende van @nl
label: هو مُقدم لـ @ar
definition: يربط بين وكيل ومصدر ذو اعتماد "أحد التقديمات:" في مصدر لفيلم لوكيل قد يكون مرتبطًا بطريقة ما بالإنتاج، أو التمويل، أو التوزيع. @ar
label: esittäjä (toimija) aineistossa @fi
definition: Liittää aineiston toimijaan, joka mainitaan alku- tai lopputekstien "X esittää:" -merkinnössä ja joka todennäköisesti liittyy liikkuvan kuvan teoksen aineiston tuotantoon, rahoitukseen tai jakeluun jollakin tavoin. @fi
label: ist Präsentatorin/Präsentator von @de
definition: Setzt einen Akteur in Beziehung zu einer Ressource, bei der ein Akteur in einem "X präsentiert"-Vorspann einer Bewegtbildressource erwähnt wird und der wahrscheinlich mit Produktion, Finanzierung oder Vertrieb in Verbindung steht. @de
label: 是……的出品人 @zh-hans
definition: 将一个行为者与在一种动态图像资源的摄制人员名单中以“某某 出品”（X presents）的方式提及一个行为者且该行为者和该片的制作、财务或发行等有某些联系的一种资源关联起来。 @zh-hans
label: bemutatója a következőnek: @hu
definition: Hozzákapcsol egy ágenst egy mozgóképforráshoz, amelynek „az X bemutatja:” stáblistaeleme arra az ágensre vonatkozik, amely valószínűleg valamilyen módon az előállításhoz, a finanszírozáshoz vagy a terjesztéshez kapcsolódik. @hu
label: sunucusudur @tr
definition: Bir temsilciyi, muhtemelen bir şekilde yapım, finans veya dağıtımla bağlantılı olan bir temsilci için hareketli bir görüntü kaynağında "X sunar" atfına sahip bir kaynakla ilişkilendirir. @tr

has preservation facsimile
status: Published
definition: Relates a resource to a resource that consists of an exact reproduction on preservation-quality media, such as acid-free permanent or archival paper.
type: Property
sub property of: has facsimile
inverse of: is preservation facsimile of
lexical alias: preservationFacsimile.en
label: har bevaringsfaksimile @da
definition: Relaterer en ressource til en resssource, der består af en nøjagtig reproduktion på et medium af bevaringskvalitet, såsom syrefrit permanent- eller arkivpapir. @da
label: heeft conservatiefacsimile @nl
label: aineiston säilytyskopio @fi
label: له نسخة طبق الأصل محفوظة @ar
definition: يربط بين مصدر ومصدر يتكون من استنساخ كامل على وسيط حفظ عالي الجودة، مثل الأوراق الدائمة الخالية من الأحماض أو أوراق المحفوظات الأرشيفية. @ar
definition: Liittää aineiston aineistoon, joka on sen täsmällinen jäljennös. Jäljennöksen valmistuksessa on käytetty säilytyskelpoista materiaalia, esim. arkistopaperia. @fi
label: hat Bestandserhaltungsfaksimile @de
definition: Setzt eine Ressource in Beziehung zu einer Ressource, die aus einer exakten Reproduktion auf bestandserhaltenden Medien, wie zum Beispiel säurefreiem Papier oder Archivpapier, besteht. @de
label: 有保存摹真品 @zh-hans
definition: 将一种资源与由在诸如脱酸的永久用纸或档案纸等具有保存品质的媒介上的精确复制品组成的资源关联起来。 @zh-hans
label: megőrzési hasonmása a következő: @hu
definition: Hozzákapcsol egy forrást egy forráshoz, amely pontos újraalkotás olyan megőrzés-minőségű médiumon, mint például a savmentes tartós vagy archiváló papír. @hu
label: koruma kopyası ile ilişkilidir @tr
definition: Bir kaynağı, asitsiz kalıcı veya arşiv kağıdı gibi koruma kalitesinde medya üzerinde tam bir çoğaltmadan oluşan bir kaynakla ilişkilendirir. @tr

is preservation facsimile of
status: Published
definition: Relates a resource to a resource that is used as a basis for an exact reproduction on preservation-quality media, such as acid-free permanent or archival paper.
type: Property
sub property of: is facsimile of
inverse of: has preservation facsimile
lexical alias: preservationFacsimileOf.en
label: er bevaringsfaksimile af @da
definition: Relaterer en ressource til en ressource, der er anvendt som grundlag for en nøjagtig reproduktion på et medium af bevaringskvalitet, såsom syrefrit permanent- eller arkivpapir. @da
label: is conservatiefacsimile van @nl
label: aineiston säilytyskopio @fi
label: هو نسخة طبق الأصل محفوظة لـ @ar
definition: يربط بين مصدر ومصدر يُستخدم كأساس لإعادة إنتاج طبق الأصل على وسيط حفظ عالي الجودة، مثل الأوراق الدائمة الخالية من الأحماض أو أوراق المحفوظات الأرشيفية. @ar
definition: Liittää aineiston täsmällisen jäljennöksen perustana olevaan aineistoon. Jäljennöksen valmistuksessa on käytetty arkistokelpoista materiaalia, esim. arkistopaperia. @fi
label: ist Bestandserhaltungsfaksimile von @de
definition: Setzt eine Ressource in Beziehung zu einer Ressource, die als Grundlage für eine exakte Reproduktion auf bestandserhaltenden Medien, wie zum Beispiel säurefreiem Papier oder Archivpapier, verwendet wird. @de
label: 是……的保存摹真品 @zh-hans
definition: 将一种资源与被用作在诸如脱酸的永久用纸或档案纸等具有保存品质的媒介上的精确复制品之基础的一种资源关联起来。 @zh-hans
label: megőrzési hasonmása a következőnek: @hu
definition: Hozzákapcsol egy forrást egy olyan forráshoz, amelyet pontos másolat alapjaként használnak egy olyan megőrzés-minőségű közegen, mint például a savmentes tartós vagy archiváló papír. @hu
label: koruma kopyasıdır @tr
definition: Bir kaynağı, asitsiz kağıt veya arşiv kağıdı gibi koruma kalitesi medyasında tam çoğaltma için temel olarak kullanılan bir kaynakla ilişkilendirir. @tr

has prime meridian
status: Published
type: Property
lexical alias: primeMeridian.en
definition: Relates a resource to a line of constant longitude passing through a given place on the surface of the earth and the terrestrial poles, from which longitude east and west is measured.
label: heeft nulmeridiaan @nl
label: له خط الطول الأول @ar
definition: يربط بين مصدر وخط طول ثابت يمر عبر مكان معين على سطح الأرض والأقطاب الأرضية، والتي يقاس منها خط الطول شرقًا وغربًا. @ar
label: har primær meredian @da
definition: Relaterer en ressource til en linje med konstant længdegrad, der passerer et givet sted på jordoverfladen og på de jordbaserede poler, hvorfra østlig og vestlig længdegrad måles. @da
label: nollameridiaani aineistossa @fi
definition: Liittää aineiston pysyvän pituusasteen viivaan, joka kulkee maan pinnalla olevan tietyn paikan ja maapallon napojen läpi, ja josta itäinen ja läntinen pituusaste mitataan. @fi
label: hat Nullmeridian @de
definition: Setzt eine Ressource in Beziehung zu einer Linie konstanter Länge, die durch ein bestimmtes Geografikum auf der Erdoberfläche und den Erdpolen verläuft und von der aus die Längengrade Ost und West gemessen werden. @de
label: 有本初子午线 @zh-hans
definition: 将一种资源与穿过地球表面一个指定的地点和地球两极并以此测量东经和西经的一条恒定经线关联起来。 @zh-hans
label: kezdő hosszúsági köre a következő: @hu
definition: Hozzákapcsol egy forrást ahhoz az állandó hosszúsági körhöz, amely egy adott helyen áthalad a Föld felszínén és a földi pólusokon, és amelytől a keleti és nyugati hosszúsági fokokat mérik. @hu
label: başlangıç meridyeni ile ilişkilidir @tr
definition: Bir kaynağı, dünya yüzeyinde belirli bir yerden ve doğu ve batı boylamlarının ölçüldüğü karasal kutuplardan geçen sabit bir boylam çizgisiyle ilişkilendirir. @tr

has printer
status: Published
definition: Relates a resource to an agent who is responsible for manufacturing a resource of printed text, notated music, or other content from type or plates.
type: Property
sub property of: has manufacturer
inverse of: is printer of
lexical alias: printer.en
label: har trykker @da
definition: Relaterer en ressource til en agent, der har været involveret i fremstillingen af en ressource af trykt tekst, noteret musik etc. fra skrift eller plader, såsom en bog, en avis, et magasin, en plakat, et partitur etc. @da
label: heeft drukker @nl
label: aineiston painaja @fi
label: له طابعة @ar
definition: يربط مصدر بوكيل مسؤول عن إنتاج مصدر لنص مطبوع، موسيقى مدونة أو محتوى من نوع أو من لوحات آخرى. @ar
definition: Liittää aineiston toimijaan, joka on vastuussa painetun tekstin, nuottiaineiston tai muun aineiston valmistamiseen painolaatalta tai -levyltä. @fi
label: hat Druckerin/Drucker @de
definition: Setzt eine Ressource in Beziehung zu einem Akteur, der für die Herstellung einer Ressource von gedrucktem Text, Noten oder anderem Inhalt durch Drucktypen oder Druckformen verantwortlich ist. @de
label: 有印刷者 @zh-hans
definition: 将一种资源与负责生产用活字或平版印刷文字、乐谱或其他内容的一种资源的一个行为者关联起来。 @zh-hans
label: nyomdásza a következő: @hu
definition: Hozzákapcsol egy forrást egy ágenshez, amely felelős egy nyomtatott szöveg, kottázott zene vagy egyéb tartalom forrásának nyomdai szedésből vagy lemezekből történő gyártásáért. @hu
label: matbaacı ile ilişkilidir @tr
definition: Bir kaynağı, basılı metin, notalı müzik veya diğer içerik kaynaklarını yazı veya plakalardan üretmekten sorumlu olan bir temsilci ile ilişkilendirir. @tr

is printer of
status: Published
definition: Relates an agent to a resource that involves a responsibility of an agent for manufacturing printed text, notated music, etc., from type or plates, such as a book, newspaper, magazine, broadside, score, etc.
type: Property
sub property of: is manufacturer of
inverse of: has printer
lexical alias: printerOf.en
label: er trykker af @da
definition: Relaterer en agent, der har været involveret i fremstillingen af en ressource af trykt tekst, noteret musik etc. fra typer eller plader, såsom en bog, en avis, et tidsskrift, en plakat, et partitur etc. til en ressource. @da
label: is drukker van @nl
label: هو فني طباعة لـ @ar
definition: يربط بين وكيل ومصدر ينطوي على مسؤولية وكيل عن إنتاج نص مطبوع، موسيقى مدونة، إاخ.، من نوع أو من لوحات، مثل كتاب، جريدة، مجلة، نشرة مطوِيّة، توزيع الموسيقي، إلخ. @ar
label: painaja (toimija) aineistossa @fi
definition: Liittää aineiston toimijaan, joka vastaa painetun tekstin, nuottiaineiston tai muun aineiston valmistamisesta painolaatalta tai -levyltä. @fi
label: ist Druckerin/Drucker von @de
definition: Setzt einen Akteur in Beziehung zu einer Ressource, bei der ein Akteur für die Herstellung von gedrucktem Text, Noten und so weiter durch Drucktypen oder Druckformen, wie zum Beispiel in einem Buch, in einer Zeitung, in einem Magazin, in einem Einblattdruck, in einer Partitur oder ähnlichem, verantwortlich ist. @de
label: 是……的印刷者 @zh-hans
definition: 将一个行为者与涉及用活字或平版生产印刷文字、乐谱等（例如图书、报纸、杂志、海报、总谱等）的一个行为者的责任的一种资源关联起来。 @zh-hans
label: nyomdásza a következőnek: @hu
definition: Hozzákapcsol egy ágenst egy forráshoz, amelyhez hozzátartozik az ágens felelőssége nyomtatott szöveg, zenei lejegyzés, stb. nyomdai szedéséből vagy nyomólemezekről történő gyártásáért, például könyv, hírlap, magazin, egyoldalas nyomtatvány, partitúra, stb. esetében. @hu
label: matbaacısıdır @tr
definition: Bir temsilciyi, kitap, gazete, dergi, ışık baskılı fotoğraf, partisyon vb. gibi daktilo veya baskı kalıplarından basılı metin, notalı müzik vb. üreten bir temsilcinin sorumluluğunu içeren bir kaynakla ilişkilendirir. @tr

has printmaker
status: Published
definition: Relates a resource to an agent who is responsible for creating a resource by making a relief, intaglio, or planographic printing surface.
type: Property
inverse of: is printmaker of
lexical alias: printmaker.en
label: har grafiker @da
definition: Relaterer en ressource til en agent, der har været involveret i fremstillingen af en ressource ved at lave en relief-, dybtryks- eller fladtryksoverflade. @da
label: heeft maker van platen @nl
label: aineiston kuvalaatan valmistaja @fi
sub property of: has creator
label: له طبّاع @ar
definition: يربط مصدر بوكيل مسؤول عن إنتاج مصدر بعمل سطح طباعة بارزة، أو غائرة، أو مستوية. @ar
definition: Liittää aineiston toimijaan, joka osallistuu aineiston valmistamiseen valmistamalla kohokuvan, syväpainon tai laakapainon painopinnan. @fi
label: hat Druckgrafikerin/Druckgrafiker @de
definition: Setzt eine Ressource in Beziehung zu einem Akteur, der für die Herstellung einer Ressource verantwortlich ist, indem er eine Hochdruck-, Tiefdruck- oder Flachdruckoberfläche erstellt. @de
label: 有印版制作者 @zh-hans
definition: 将一种资源与通过制作浮雕、凹版或平版印刷表面对一种资源的创建负责的一个行为者关联起来。 @zh-hans
definition: Relaciona un recurs amb un agent que és responsable de la creació d’un recurs fent una superfície d’impressió en relleu, gravada en profunditat o planogràfica. @ca
label: nyomtatványkészítője a következő: @hu
definition: Hozzákapcsol egy forrást egy ágenshez, amely felelős egy forrás gyártásáért oly módon, hogy egy domború, mélynyomásos (intaglio) vagy síknyomásos felületet készít. @hu
has subproperty: has collotyper
has subproperty: has engraver
has subproperty: has etcher
has subproperty: has lithographer
label: baskı sanatçısı ile ilişkilidir @tr
definition: Bir kaynağı, kabartma, çukur baskı veya planografik baskı yüzeyi oluşturarak bir kaynak oluşturmaktan sorumlu olan bir temsilci ile ilişkilendirir. @tr

is printmaker of
status: Published
definition: Relates an agent to a resource that involves a responsibility of an agent for making a relief, intaglio, or planographic printing surface.
type: Property
inverse of: has printmaker
lexical alias: printmakerOf.en
label: er grafiker af @da
definition: Relaterer en agent, der har været involveret i fremstillingen af en ressource ved at lave en relief-, dybtryks- eller fladtryksoverflade til en ressource. @da
label: is prentmaker van @nl
sub property of: is creator of
label: هو طبّاع لـ @ar
definition: يربط بين وكيل ومصدر ينطوي على مسؤولية وكيل عن عمل سطح طباعة بارزة، أو غائرة، أو مستوية. @ar
label: kuvalaatan valmistaja (toimija) aineistossa @fi
definition: Liittää toimijan aineistoon, jossa toimija vastaa kohokuvan, syväpainon tai laakapainon painopinnan valmistamisesta. @fi
label: ist Druckgrafikerin/Druckgrafiker von @de
definition: Setzt einen Akteur in Beziehung zu einer Ressource, bei der ein Akteur für die Herstellung einer Hochdruck-, Tiefdruck- oder Flachdruckoberfläche verantwortlich ist. @de
label: 是……的印版制作者 @zh-hans
definition: 将一个行为者与涉及制作浮雕、凹版或平版印刷表面的一个行为者的责任的一种资源关联起来。 @zh-hans
label: nyomtatványkészítője a következőnek: @hu
definition: Hozzákapcsol egy ágenst egy forráshoz, amelyhez hozzátartozik az ágens felelőssége egy relief, egy mélynyomásos vagy síknyomásos felület készítéséért. @hu
has subproperty: is collotyper of
has subproperty: is engraver of
has subproperty: is etcher of
has subproperty: is lithographer of
label: baskı sanatçısıdır @tr
definition: Bir temsilciyi, kabartma, oyuk veya planografik baskı yüzeyi yapmakla görevli bir temsilcinin sorumluluğunu içeren bir kaynakla ilişkilendirir. @tr

has producer
status: Published
definition: Relates a resource to an agent who is responsible for most of the business aspects of a production for screen, sound recording, television, webcast, etc.
type: Property
sub property of: has other agent associated with resource (Deprecated)
inverse of: is producer of
lexical alias: producer.en
label: har producer @da
definition: Relaterer en ressource til en agent, der er ansvarlig for størstedelen af de forretningsmæssige aspekter ved en produktion beregnet til lærred, lydoptagelse, tv, webcast etc. @da
label: heeft producent @nl
label: aineiston tuottaja @fi
label: له منتج @ar
definition: يربط مصدر بوكيل مسؤول عن تسجيل، تصنيع، إنشاء، أو بأي طريقة أخرى من طرق الإنتاج، مصدر غير منشور. @ar
definition: Liittää aineiston toimijaan, joka vastaa julkaisemattoman aineiston kaiverruksesta, valmistuksesta, kokoonpanosta tms. @fi
label: hat Produzentin/Produzent @de
definition: Setzt eine Ressource in Beziehung zu einem Akteur, der für das Gravieren, Fabrizieren, Konstruieren und so weiter einer unveröffentlichten Ressource verantwortlich ist. @de
label: 有制作者 @zh-hans
definition: 将一种资源与负责银幕、录音、电视、网络直播等制作的大部分商业运作的一个行为者关联起来。 @zh-hans
definition: Relaciona un recurs amb un agent que és responsable de la majoria dels aspectes comercials de la producció d’una pel·lícula, d’un enregistrament sonor, d’un programa de televisió, d’una emissió web, etc. @ca
label: előállítója a következő: @hu
definition: Hozzákapcsol egy forrást egy ágenshez, amely felelős egy kiadatlan forrás írásáért, összeállításáért, készítéséért vagy egyéb módú előállításáért. @hu
has subproperty: has audio producer
has subproperty: has film producer
has subproperty: has radio producer
has subproperty: has television producer
label: yapımcı ile ilişkilidir @tr
definition: Bir kaynağı, yayınlanmamış bir kaynağı yazmaktan, üretmekten, yapmaktan veya başka bir üretim yönteminden sorumlu olan bir temsilci ile ilişkilendirir. @tr

is producer of
status: Published
definition: Relates an agent to a resource that involves a responsibility of an agent for most of the business aspects of a production for screen, sound recording, television, webcast, etc.
type: Property
sub property of: is other agent associated with resource of (Deprecated)
inverse of: has producer
lexical alias: producerOf.en
label: er producer af @da
definition: Relaterer en agent, der er ansvarlig for størstedelen af de forretningsmæssige aspekter ved en produktion beregnet til lærred, lydoptagelse, tv, webcast etc. til en ressource. @da
label: is producent van @nl
label: هو مُنتج لـ @ar
definition: يربط بين وكيل ومصدر ينطوي على مسؤولية وكيل عن معظم جوانب العمل في إنتاج للشاشة، وللتسجيل الصوتي، وللتلفزيون، وللبث عبر الإنترنت، إلخ. @ar
label: tuottaja (toimija) aineistossa @fi
definition: Liittää toimijan aineistoon, jossa toimija vastaa suurimmasta osasta elokuvan liiketoimintaa. @fi
label: ist Produzentin/Produzent von @de
definition: Setzt einen Akteur in Beziehung zu einer Ressource, bei der ein Akteur für die meisten geschäftlichen Aspekte einer Produktion für die Leinwand, für eine Tonaufnahme, für das Fernsehen, für einen Webcast und so weiter verantwortlich ist. @de
label: 是……的制作者 @zh-hans
definition: 将一个行为者与涉及对银幕、录音、电视、网络直播等制作的大部分商业运作的一个行为者的责任的一种资源关联起来。 @zh-hans
label: producere a következőnek: @hu
definition: Hozzákapcsol egy ágenst egy forráshoz, amelyhez hozzátartozik egy ágens felelőssége képernyőre kerülő műsor, hangfelvétel, televíziós, webes közvetítés, stb. legtöbb üzleti vonatkozásáért. @hu
has subproperty: is audio producer of
has subproperty: is film producer of
has subproperty: is radio producer of
has subproperty: is television producer of
label: yapımcısıdır @tr
definition: Bir temsilciyi, ekran, ses kaydı, televiyon, web yayını vb.için bir prodüksiyonun ticari yönlerinin çoğundan sorumlu bir temsilcinin sorumluluğunu içeren bir kaynakla ilişkilendirir. @tr

has producer of unpublished resource
status: Published
definition: Relates a resource to an agent who is responsible for inscribing, fabricating, constructing, or other method of producing, an unpublished resource.
type: Property
lexical alias: producerOfUnpublishedResource.en
label: har producer af en upubliceret ressource @da
definition: Relaterer en ressource til en agent, der er ansvarlig for indgravering, fremstilling, konstruktion etc. af en manifestation i upubliceret form. @da
inverse of: is producer of unpublished resource of
label: heeft producent van ongepubliceerde resource @nl
label: له منتج لمصدر غير منشور @ar
definition: يربط مصدر بوكيل مسؤول عن تسجيل، تصنيع، إنشاء، إلخ. مصدر غير منشور. @ar
label: julkaisemattoman aineiston tuottaja @fi
definition: Liittää aineiston toimijaan, joka vastaa julkaisemattoman aineiston kaiverruksesta, valmistuksesta, kokoonpanosta tai muusta tuotantotavasta. @fi
label: hat Erzeugerin/Erzeuger einer unveröffentlichten Ressource @de
definition: Setzt eine Ressource in Beziehung zu einem Akteur, der für das Gravieren, Fabrizieren, Konstruieren und so weiter einer unveröffentlichten Ressource verantwortlich ist. @de
label: 有非出版资源的制作者 @zh-hans
definition: 将一种资源与负责一种非出版资源的镌刻、制造、构建或其他制作方法的一个行为者关联起来。 @zh-hans
definition: Relaciona un recurs amb un agent que és responsable de la inscripció, la fabricació, la construcció o un altre mètode de producció d’un recurs no publicat. @ca
label: kiadatlan forrás előállítója a következő: @hu
definition: Hozzákapcsol egy forrást egy ágenshez, amely felelős egy kiadatlan forrás írásáért, összeállításáért, készítéséért, stb. @hu
label: yayınlanmamış kaynağın yapımcısı ile ilişkilidir @tr
definition: Bir kaynağı, yayınlanmamış bir kaynağı yazmaktan, üretmekten, yapmaktan vb. sorumlu olan bir temsilci ile ilişkilendirir. @tr

is producer of unpublished resource of
status: Published
type: Property
lexical alias: producerOfUnpublishedResourceOf.en
definition: Relates an agent to a resource that involves a responsibility of an agent for inscribing, fabrication, construction, etc.
label: er producer af en upubliceret ressource af @da
definition: Relaterer agent der er ansvarlig for at indgravere, fremstille, konstruere etc. til en ressource, @da
inverse of: has producer of unpublished resource
label: is producent van ongepubliceerde resource van @nl
label: هو مُنتج لمصدر غير مشهور لـ @ar
definition: يربط بين وكيل ومصدر ينطوي على مسؤولية وكيل عن الكتابة، التصنيع، الإنشاء، إلخ. @ar
label: julkaisemattoman aineiston tuottaja (toimija) aineistossa @fi
definition: Liittää toimijan aineistoon, jossa toimija vastaa julkaistun aineiston painamisesta, monistamisesta, kirjasinten valamisesta tai muusta valmistustavasta. @fi
label: ist Erzeugerin/Erzeuger einer unveröffentlichten Manifestation von @de
definition: Setzt einen Akteur in Beziehung zu einer Ressource, bei der ein Akteur für das Gravieren, Fabrizieren, Konstruieren und so weiter verantwortlich ist. @de
label: 是……的非出版资源的制作者 @zh-hans
definition: 将一个行为者与涉及镌刻、制造、构建等的一个行为者的责任的一种资源关联起来。 @zh-hans
label: előállítója a következő kiadatlan forrásnak: @hu
definition: Hozzákapcsol egy ágenst egy forráshoz, amelyhez hozzátartozik az ágens íráshoz, összeállításhoz, készítéshez stb. fűződő felelőssége. @hu
label: yayınlanmamış kaynağının yapımcısıdır @tr
definition: Bir temsilciyi, yazma, fabrikasyon, yapım vb. için bir temsilcinin sorumluluğunu içeren bir kaynakla ilişkilendirir. @tr

has production company
status: Published
definition: Relates a resource to an agent who is responsible for managing the financial, technical, and organizational aspects of a production for stage, screen, sound recording, television, webcast, etc.
type: Property
sub property of: has other agent associated with resource (Deprecated)
inverse of: is production company of
lexical alias: productionCompany.en
label: har produktionsselskab @da
definition: Relaterer en ressource til en korporation, der er ansvarlig for økonomisk, teknisk og organisatorisk ledelse af en produktion beregnet til scene, lærred, lydoptagelse, tv, webcast etc. @da
label: heeft productiebedrijf @nl
label: aineiston tuotantoyhtiö @fi
label: له شركة إنتاج @ar
definition: يربط مصدر بوكيل مسؤول عن إدارة الجوانب المالية، التقنية، والتنظيمية في الإنتاج للمسرح، للسينما، للتسجيل الصوتي، للتليفزيون، للبث عبر الإنترنت، إلخ. @ar
definition: Liittää teoksen toimijaan, joka on vastuussa näyttämö-, elokuva-, äänite-, televisio-, suoratoistolähetys- tms. tuotannon taloudellisesta, teknisestä ja organisatorisesta johtamisesta. @fi
label: hat Produktionsfirma @de
definition: Setzt eine Ressource in Beziehung zu einem Akteur, der für das finanzielle, technische und organisatorische Management einer Produktion für die Bühne, den Bildschirm, die Tonaufnahme, das Fernsehen, für einen Webcast und so weiter verantwortlich ist. @de
label: 有制作公司 @zh-hans
definition: 将一种资源与负责舞台、播放、录音、网络直播等制作的资金、技术和组织方面管理的一个行为者关联起来。 @zh-hans
label: produkciós cége a következő: @hu
definition: Hozzákapcsol egy forrást egy ágenshez, amely felelős egy színpadi, film-, televíziós produkció, hangfelvétel, webes közvetítés, stb. pénzügyi, technikai és szervezeti vonatkozásának irányításáért. @hu
label: yapım şirketi ile ilişkilidir @tr
definition: Bir kaynağı, sahne, ekran, ses kaydı, televizyon, web yayını vb. için bir prodüksiyonun finansal, teknik ve organizasyonel yönlerini yönetmekten sorumlu olan bir temsilci ile ilişkilendirir. @tr

is production company of
status: Published
definition: Relates an agent to a resource that involves a responsibility of an agent for managing the financial, technical, and organizational aspects of a production for stage, screen, sound recording, television, webcast, etc.
type: Property
sub property of: is other agent associated with resource of (Deprecated)
inverse of: has production company
lexical alias: productionCompanyOf.en
label: er produktionsselskab for @da
definition: Relaterer en korporation, der er ansvarlig for økonomisk, teknisk og organisatorisk ledelse af en produktion beregnet til scene, lærred, lydoptagelse, tv, webcast etc. til en ressource. @da
label: is productiebedrijf van @nl
label: tuotantoyhtiö (aineistoon liittyvä yhteistoimija) @fi
label: هي شركة إنتاج لـ @ar
definition: يربط بين وكيل ومصدر ينطوي على مسؤولية وكيل إدارة الجوانب المالية، التقنية، والتنظيمية لإنتاج من أجل المسرح، شاشة العرض، التسجيل الصوتي، التلفزيون، البث عبر الإنترنت...إلخ. @ar
definition: Liittää toimijan aineistoon, jossa hän vastaa kuvien tallentamisesta joko sähköisesti tai filmille tai videolle, usein myös valaistuksen valitsemisesta ja järjestämisestä. @fi
label: ist Produktionsfirma von @de
definition: Setzt einen Akteur in Beziehung zu einer Ressource, die mit einer Verantwortung des Akteurs verbunden ist, das Management für die finanziellen, technischen und organisatorischen Aspekte einer Produktion für die Bühne, die Leinwand, die Tonaufnahme, das Fernsehen, für einen Webcast und so weiter zu verwalten. @de
label: 是……的制作公司 @zh-hans
definition: 将一个行为者与涉及一个行为者对舞台、播放、录音、电视、网络直播等制作的资金、技术和组织方面管理的责任的一种资源关联起来。 @zh-hans
label: produkciós cége a következőnek: @hu
definition: Hozzákapcsol egy ágenst egy forráshoz, amelyhez hozzátartozik az ágens felelőssége egy színpadi produkció, film, hangfelvétel, televíziós, webes közvetítés, stb. pénzügyi, technikai és szervezeti vonatkozásának irányításáért. @hu
label: yapım şirketidir @tr
definition: Bir temsilciyi, sahne, ekran, ses kaydı, televizyon, web yayını vb. için bir prodüksiyonun finansal, teknik ve organizasyonel yönlerini yönetme sorumluluğunu içeren bir kaynakla ilişkilendirir. @tr

has production designer
status: Published
definition: Relates a resource to an agent who is responsible for designing the overall visual appearance of a moving image production.
type: Property
sub property of: has contributor (Deprecated)
inverse of: is production designer of
lexical alias: productionDesigner.en
label: har produktionsdesigner @da
definition: Relaterer en ressource til en agent, der er ansvarlig for at have designet en levende billedproduktions overordnede visuelle udseende. @da
label: heeft productieontwerper @nl
label: aineiston lavastussuunnittelija @fi
label: له مصمم إنتاج @ar
definition: يربط مصدر بوكيل مسؤول عن تصميم المظهر المرئي العام لإنتاج فيلم. @ar
definition: Liittää aineiston toimijaan, joka vastaa elokuvatuotannon visuaalisen ilmeen suunnittelusta. @fi
label: hat Szenenbildnerin/Szenenbildner @de
definition: Setzt eine Ressource in Beziehung zu einem Akteur, der für die Gestaltung des gesamten visuellen Erscheinungsbilds einer Bewegtbildproduktion verantwortlich ist. @de
label: 有制作设计者 @zh-hans
definition: 将一种资源与负责设计动态图像制作整体视觉效果的一个行为者关联起来。 @zh-hans
label: látványtervezője a következő: @hu
definition: Hozzákapcsol egy forrást egy ágenshez, amely felelős egy mozgókép-produkció átfogó vizuális megjelenítésének a tervezéséért. @hu
label: yapım tasarımcısı ile ilişkilidir @tr
definition: Bir kaynağı, hareketli görüntü yapımının genel görsel görünümünü tasarlamaktan sorumlu olan bir temsilci ile ilişkilendirir. @tr

is production designer of
status: Published
definition: Relates an agent to a resource that includes a contribution by an agent of designing the overall visual appearance of a moving image production.
type: Property
sub property of: is contributor of (Deprecated)
inverse of: has production designer
lexical alias: productionDesignerOf.en
label: er produktionsdesigner for @da
definition: Relaterer en agent, der er ansvarlig for at have designet en levende billedproduktions overordnede visuelle udseende til en ressource. @da
label: is productieontwerper van @nl
label: هو مصمم إنتاج لـ @ar
definition: يربط بين وكيل ومصدر يتضمن إسهام وكيل في تصميم الصورة المرئية العامة لإنتاج أفلام. @ar
label: tuotannonsuunnittelija (toimija) aineistossa @fi
definition: Liittää toimijan aineistoon, jossa toimija vastaa elokuvatuotannon visuaalisen ilmeen suunnittelusta. @fi
label: ist Szenenbildnerin/Szenenbildner von @de
definition: Setzt einen Akteur in Beziehung zu einer Ressource, zu der ein Akteur beiträgt, indem er für die Gestaltung des gesamten visuellen Erscheinungsbilds einer Bewegtbildproduktion verantwortlich ist. @de
label: 是……的制作设计者 @zh-hans
definition: 将一个行为者与包括设计动态图像制作整体视觉效果的一个行为者的贡献的一种资源关联起来。 @zh-hans
label: látványtervezője a következőnek: @hu
definition: Hozzákapcsol egy ágenst egy forráshoz, amely magában foglalja egy tervező ágens közreműködését mozgókép-produkció általános vizuális megjelenésében. @hu
label: yapım tasarımcısıdır @tr
definition: Bir aracıyı, hareketli bir görüntü yapımının genel görsel görünümünü tasarlayan aracının katkısını içeren bir kaynakla ilişkilendirir @tr

has production method
status: Published
definition: Relates a resource to a process that is used to produce a resource.
type: Property
lexical alias: productionMethod.en
label: har produktionsmetode @da
definition: Relaterer en ressource til en proces anvendt til at fremstille en ressource. @da
label: heeft productiemethode @nl
label: له طريقة إنتاج @ar
definition: يربط بين مصدر وعملية مستخدمة في إنتاج مصدر. @ar
label: aineiston valmistusmenetelmä @fi
definition: Liittää aineiston aineiston tuottamisessa käytettävään menetelmään. @fi
label: hat Entstehungsmethode @de
definition: Setzt eine Ressource in Beziehung zu einem Verfahren, das angewendet wird, um eine Ressource zu erzeugen. @de
label: 有制作方法 @zh-hans
definition: 将一种资源与用于制作一种资源的一个过程关联起来。 @zh-hans
label: előállítási módszere a következő: @hu
definition: Hozzákapcsol egy forrást egy eljáráshoz, amelyet egy forrás előállítására használnak. @hu
has subproperty: has production method for manuscript (Deprecated)
has subproperty: has production method for tactile resource (Deprecated)
label: yapım yöntemi ile ilişkilidir @tr
definition: Bir kaynağı, bir kaynağı üretmek için kullanılan süreçle ilişkilendirir. @tr

has production method for manuscript (Deprecated)
status: Deprecated
definition: Relates a resource to the process used to produce an original manuscript or a copy.. (Deprecated)
type: Property
sub property of: has production method
lexical alias: productionMethodForManuscript.en

has production method for tactile resource (Deprecated)
status: Deprecated
definition: Relates a resource to the process used to produce a tactile resource (e.g., embossing, thermoform).. (Deprecated)
type: Property
sub property of: has production method
lexical alias: productionMethodForTactileResource.en

has production statement
status: Published
definition: Relates a resource to a statement that identifies a place of production, a producer, or a date of production of an unpublished resource.
type: Property
lexical alias: productionStatement.en
label: har produktionsbeskrivelse @da
definition: Relaterer en ressource til oplysninger, der identificerer produktionssted, producent og fremstillingsdato for en ressource i publiceret form. @da
scope note: A production statement includes a statement about the inscription, fabrication, construction, etc., of an unpublished resource.
label: heeft productievermelding @nl
label: aineiston tuotantomerkintö @fi
label: له بيان إنتاج @ar
definition: يربط بين مصدر وبيان يُحدد مكان إنتاج، منتج، أو تاريخ إنتاج خاص بمصدر غير منشور. @ar
scope note: يشمل بيان الإنتاج البيان المرتبط بالتسجيل، أو الصناعة، أو الإنشاء، إلخ. لمصدر غير منشور. @ar
scope note: Produktionsbeskrivelse omfatter en beskrivelse af inskription, fremstilling, konstruktion etc. af en ressource i ikke publiceret form. @da
definition: Liittää aineiston merkintöön, joka identifioi julkaisemattoman aineiston tuotantopaikan, tuottajan tai tuotantoajan. @fi
scope note: Tuotantomerkintö sisältää julkaisettoman aineiston kaivertamiseen, valmistamiseen, kokoamiseen tms. liittyvän merkinnön. @fi
label: hat Entstehungsangabe @de
definition: Setzt eine Ressource in Beziehung zu einer Angabe, die einen Entstehungsort, eine Produzentin/einen Produzenten oder ein Entstehungsdatum einer unveröffentlichten Ressource identifiziert. @de
scope note: Darunter fallen Angaben, die sich auf die Beschriftung, die Fabrikation und die Konstruktion und so weiter einer unveröffentlichten Ressource beziehen. @de
label: 有制作说明 @zh-hans
definition: 将一种资源与标识一种非出版资源的制作地、制作者或制作日期的一个说明关联起来。 @zh-hans
scope note: 制作说明包括关于一种非出版资源的镌刻、制造、构建等的一个说明。 @zh-hans
label: előállítási közlése a következő: @hu
definition: Hozzákapcsol egy forrást egy közléshez, amely azonosítja egy kiadatlan forrás előállítási helyét, előállítóját és az előállítás időpontját. @hu
scope note: Az előállítási közlések olyan közléseket tartalmaznak, amelyek egy kiadatlan forrás írására, összeállítására, készítésére stb. vonatkoznak. @hu
label: yapım bildirimi ile ilişkilidir @tr
definition: Bir kaynağı, yayınlanmamış bir kaynağın üretim yerini, üreticisini veya üretim tarihini tanımlayan bir bildirim ile ilişkilendirir. @tr
scope note: Bir üretim bildirimi, yayınlanmamış bir gösterimin yazımı, fabrikasyonu, yapımı vb. hakkında bir bildirimi içerir. @tr

has product of merger
status: Published
definition: Relates an agent who resulted from a merger of two or more other agents to an agent.
type: Property
inverse of: has component of merger
lexical alias: productOfMerger.en
label: har produkt af sammenlægning @da
definition: Relaterer en agent der er resultatet af en sammenlægning af to eller flere andre agenter til en agent. @da
label: heeft resultaat van fusie @nl
label: له نتاج اندماج @ar
definition: يربط بين وكيل ووكيل نتج عن اندماج وكيلين أو أكثر من الوكلاء الأخرين. @ar
label: yhdistymisestä muodostunut yhteistoimija @fi
definition: Kahden tai useamman yhteistoimijan yhdistymisestä muodostunut yhteistoimija. @fi
label: hat Ergebnis einer Fusion @de
definition: Setzt einen Akteur in Beziehung zu einem Akteur, der aus einer Fusion von zwei oder mehreren Akteuren entstanden ist. @de
label: 有合并而成的行为者 @zh-hans
definition: 将两个其他行为者合并后产生的一个行为者与一个行为者与关联起来。 @zh-hans
label: beolvadás eredménye a következő: @hu
definition: Hozzákapcsol egy ágenst, amelyet két vagy több más ágens összeolvadása eredményezett, egy ágenshez. @hu
label: birleşme sonucu oluşan tüzel kişi ile ilişkilidir @tr
definition: İki veya daha fazla temsilcinin birleşmesi sonucu ortaya çıkan bir temsilciyi bir temsilciyle ilişkilendirir. @tr

has product of split
status: Published
definition: Relates an agent who resulted from a split or division of a related agent to an agent.
type: Property
inverse of: has predecessor of split
lexical alias: productOfSplit.en
label: har produkt af en opsplitning @da
definition: Relaterer en agent der er resultatet af en opsplitning af to eller flere andre agenter til en agent. @da
label: heeft resultaat van splitsing @nl
label: له نتاج انفصال @ar
definition: يربط بين وكيل ووكيل نتج عن انفصال أو تقسيم وكيل ذي صلة. @ar
label: jakautumisesta muodostunut yhteistoimija @fi
definition: Liittää yhteistoimijan yhteistoimijaan, joka on seuraus toisen yhteistoimijan jakautumisesta. @fi
label: hat Ergebnis einer Aufteilung @de
definition: Setzt einen Akteur in Beziehung zu einem Akteur, der aus einer Aufteilung oder einer Teilung eines anderen Akteurs entstanden ist. @de
label: 有分出的行为者 @zh-hans
definition: 将一个相关行为者分出或划分后形成的一个行为者与一个行为者关联起来。 @zh-hans
label: szétválás terméke a következő: @hu
definition: Hozzákapcsol egy ágenst, amelyet egy kapcsolódó ágens szétválása vagy felosztása eredményezett, egy ágenshez. @hu
label: bölünme sonucu oluşan tüzel kişi ile ilişkilidir @tr
definition: İlgili bir temsilcinin bölünmesi veya ayrılması sonucu ortaya çıkan bir temsilciyi bir temsilciyle ilişkilendirir. @tr

has profession or occupation
status: Published
definition: Relates an agent to a vocation or avocation.
type: Property
lexical alias: professionOrOccupation.en
label: har profession eller beskæftigelse @da
definition: Relaterer en ressource til en agents erhverv eller bibeskæftigelse. @da
label: heeft beroep of bezigheid @nl
label: ammatti tai tehtävä @fi
label: له مهنة أو وظيفة @ar
definition: يربط بين وكيل ومهنة أو وظيفة وكيل @ar
definition: Liittää toimijan hänen ammattiinsa tai harrastukseensa. @fi
label: hat Beruf oder Tätigkeit @de
definition: Setzt einen Akteur in Beziehung zu seiner Berufung oder Nebenbeschäftigung. @de
label: 有职业和工作 @zh-hans
definition: 将一个行为者与一个职业或爱好关联起来。 @zh-hans
definition: Relaciona un agent amb una vocació o dedicació. @ca
label: szakterülete vagy foglalkozása a következő: @hu
definition: Hozzákapcsol egy ágenst egy ágens hivatásához vagy kiegészítő tevékenységéhez. @hu
label: iş veya meslek ile ilişkilidir @tr
definition: Bir temsilciyi, bir temsilcinin mesleği veya hobisi ile ilişkilendirir. @tr

has programmer
status: Published
definition: Relates a resource to an agent who is responsible for creating a computer program.
type: Property
sub property of: has creator
inverse of: is programmer of
lexical alias: programmer.en
label: har programmør @da
definition: Relaterer en ressource til en agent, der er ansvarlig for at have skabt et computerprogram. @da
label: heeft programmeur @nl
label: aineiston ohjelmoija @fi
definition: Liittää aineiston toimijaan, joka vastaa tietokoneohjelman luomisesta. @fi
label: له مُبرمج @ar
definition: يربط مصدر بوكيل مسؤول عن إنشاء برنامج كمبيوتر. @ar
label: hat Programmiererin/Programmierer @de
definition: Setzt eine Ressource in Beziehung zu einem Akteur, der für die Schaffung eines Computerprogramms verantwortlich ist. @de
label: 有编程者 @zh-hans
definition: 将一种资源与负责创建一种计算机程序的一个行为者关联起来。 @zh-hans
label: programozója a következő: @hu
definition: Hozzákapcsol egy forrást egy ágenshez, amely felelős egy számítógépes program megalkotásáért. @hu
label: programcı ile ilişkilidir @tr
definition: Bir kaynağı, bir bilgisayar programı oluşturmaktan sorumlu olan bir temsilci ile ilişkilendirir. @tr

is programmer of
status: Published
definition: Relates an agent to a resource that involves a responsibility of an agent for computer programming.
type: Property
sub property of: is creator of
inverse of: has programmer
lexical alias: programmerOf.en
label: er programmør af @da
definition: Relaterer en agent, der er ansvarlig for at have skabt et computerprogram til en ressource. @da
label: is programmeur van @nl
label: هو مُبرمج لـ @ar
definition: يربط بين وكيل ومصدر ينطوي على مسؤولية وكيل عن برمجة الكمبيوتر. @ar
label: ohjelmoija (toimija) aineistossa @fi
definition: Liittää toimijan aineistoon, jossa toimija vastaa tietokoneohjelman luomisesta. @fi
label: ist Programmiererin/Programmierer von @de
definition: Setzt einen Akteur in Beziehung zu einer Ressource, bei der ein Akteur für die Schaffung eines Computerprogramms verantwortlich ist. @de
label: 是……的编程者 @zh-hans
definition: 将一个行为者与涉及创建一个计算机程序的一个行为者的责任的一种资源关联起来。 @zh-hans
label: programozója a következőnek: @hu
definition: Hozzákapcsol egy ágenst egy forráshoz, amelyhez hozzátartozik egy ágens felelőssége számítógépes programozásért. @hu
label: programcısıdır @tr
definition: Bir temsilciyi, bilgisayar programlamayla görevli bir temsilcinin sorumluluğunu içeren bir kaynakla ilişkilendirir @tr

has projection characteristic of motion picture film
status: Published
definition: Relates a resource to a technical specification relating to the projection of a motion picture film.
type: Property
lexical alias: projectionCharacteristicOfMotionPictureFilm.en
label: har projektionskarakteristika for film @da
definition: Relaterer en ressource til en teknisk specifikation relateret til projektion af en film. @da
label: heeft kenmerken van de projectie van speelfilm @nl
label: elokuvafilmin projisointiominaisuudet aineistossa @fi
label: له خاصية عرض لفيلم صور متحركة @ar
definition: يربط بين مصدر ومواصفات فنية متعلقة بعرض فيلم صور متحركة. @ar
definition: Liittää aineiston elokuvafilmin projisointia koskevaan tekniseen määritykseen. @fi
label: hat Projektionseigenschaft von Filmen @de
definition: Setzt eine Ressource in Beziehung zu einer technischen Spezifikation, die sich auf die Projektion eines Films bezieht. @de
label: 有电影胶卷的投影特征 @zh-hans
definition: 将一种资源与和一种电影胶卷的投影有关的技术规格关联起来。 @zh-hans
label: mozgókép vetítési jellemzője a következő: @hu
definition: Hozzákapcsol egy forrást egy műszaki specifikációhoz, amely egy filmen lévő mozgókép vetítéséhez kapcsolódik. @hu
has subproperty: has presentation format
has subproperty: has projection speed
label: sinema filminin projeksiyon özelliği ile ilişkilidir @tr
definition: Bir kaynağı, bir sinema filminin projeksiyonu ile ilgili teknik özellikler ile ilişkilendirir. @tr

has projection of cartographic content
status: Published
definition: Relates a resource to a method or system used to represent the surface of the earth or of a celestial sphere on a plane.
type: Property
lexical alias: projectionOfCartographicContent.en
label: har projektion af kartografisk indhold @da
definition: Relaterer en ressource til en metode eller system anvendt til at repræsentere jordens overflade eller overfladen på et himmellegeme på et kort. @da
label: heeft projectie van cartografische content @nl
label: له إسقاط محتوى رسم خرائطي @ar
definition: يربط بين مصدر وطريقة أو نظام مستخدم لتمثيل سطح الأرض أو الكرة السماوية على مسطح. @ar
label: karttasisällön projektio aineistossa @fi
definition: Liittää aineiston maapallon tai taivaanpallon pinnan kaksiulotteiseen esittämiseen käytettyyn menetelmään tai järjestelmään. @fi
label: hat Projektion von kartografischem Inhalt @de
definition: Setzt eine Ressource in Beziehung zu einer Methode oder einem System, die/das angewendet wird, um die Oberfläche der Erde oder einer Himmelskugel auf einer Ebene zu repräsentieren. @de
label: 有地图内容的投影 @zh-hans
definition: 将一种资源与用于在一个平面上表示地球或天球表面的方法或系统关联起来。 @zh-hans
label: térképészeti tartalom vetülete a következő: @hu
definition: Hozzákapcsol egy forrást egy olyan módszerhez vagy rendszerhez, amelyet a Föld vagy egy égitest felszínének síkbeli ábrázolására használnak. @hu
label: kartografik içeriğin projeksiyonu ile ilişkilidir @tr
definition: Bir kaynağı, dünyanın veya bir gök küresinin yüzeyini bir düzlem üzerinde temsil etmek için kullanılan bir yöntem veya sistemle ilişkilendirir. @tr

has projection speed
status: Published
definition: Relates a resource to a speed at which a projected carrier must be operated to produce the moving image intended.
type: Property
sub property of: has projection characteristic of motion picture film
lexical alias: projectionSpeed.en
label: har projektionshastighed @da
definition: Relaterer en ressource til en hastighed, ved hvilken en projiceret bærer skal betjenes for at producere det ønskede levende billede. @da
label: heeft projectiesnelheid @nl
label: له سرعة عرض @ar
definition: يربط بين مصدر وسرعة يجب أن يشغل بها حامل عرض لكي ينتج عنه الصور المتحركة المطلوبة. @ar
label: projisointinopeus aineistolle @fi
definition: Liittää aineiston nopeuteen, jolla projisoitava tallenne tulee esittää liikkuvan kuvan näyttämiseksi tarkoitetulla tavalla. @fi
label: hat Projektionsgeschwindigkeit @de
definition: Setzt eine Ressource in Beziehung zu einer Geschwindigkeit, mit der ein projizierbarer Datenträger betrieben werden muss, um das beabsichtigte Bewegtbild zu erzeugen. @de
label: 有投影速度 @zh-hans
definition: 将一种资源与一种投影载体要产生所期望的动态图像必须操作的速度关联起来。 @zh-hans
label: vetítési sebessége a következő: @hu
definition: Hozzákapcsol egy forrást egy sebességhez, amelyen egy kivetített hordozónak működnie kell, hogy a kívánt mozgóképet elő tudják állítani. @hu
label: yansıtma hızı ile ilişkilidir @tr
definition: Bir kaynağı, amaçlanan hareketli görüntüyü üretmek için planlanmış bir taşıyıcının çalıştırılması gereken bir hızla ilişkilendirir. @tr

has project supervisor
status: Published
lexical alias: projectSupervisor.en
definition: Relates a resource to an agent who is an academic supervisor who is responsible for advising or supervising a project undertaken by a student that results in a resource.
type: Property
inverse of: is project supervisor of
label: heeft projectbegeleider @nl
label: له مشرف مشروع @ar
definition: يربط مصدر بمشرف أكاديمي يكون مسؤولاً عن تقديم المشورة أو الإشراف على مشروع يقوم به الطالب وينتج عنه مصدر. @ar
label: har projektvejleder @da
definition: Relaterer en ressource til en akademisk vejleder, som er ansvarlig for at rådgive eller vejlede et projekt, der udføres af en student, og som resulterer i en ressource. @da
label: projektin ohjaaja aineistossa @fi
definition: Liittää aineiston akateemiseen ohjaajaan, joka vastaa neuvonnasta tai valvonnasta opiskelijan projektissa, jonka tuloksena on aineisto. @fi
label: hat Projektbetreuerin/Projektbetreuer @de
definition: Setzt eine Ressource in Beziehung zu einer akademischen Betreuerin/einem akademischen Betreuer, die/der für die Betreuung und Aufsicht eines Projekts einer Studentin/eines Studenten verantwortlich ist, das zu einer Ressource führt. @de
label: 有项目主管 @zh-hans
definition: 将一种资源与负责为导致一种资源的学生所做的项目作咨询和监督的作为学术主管的一个行为者关联起来。 @zh-hans
definition: Relaciona un recurs amb un agent que és un supervisor acadèmic que és responsable d’assessorar o supervisar un projecte emprès per un estudiant que dona com a resultat un recurs. @ca
label: projekt témavezetője a következő: @hu
definition: Hozzákapcsol egy forrást egy témavezetőhöz, aki egy olyan hallgató által vállalt projekt tanácsadója és témavezetője, amely egy forrást eredményez. @hu
label: proje danışmanı ile ilişkilidir @tr
definition: Bir kaynağı, bir öğrenci tarafından üstlenilen ve bir kaynakla sonuçlanan bir projeye danışmanlık yapmaktan veya denetlemekten sorumlu olan bir akademik danışmanla ilişkilendirir. @tr

is project supervisor of
status: Published
lexical alias: projectSupervisorOf.en
definition: Relates an agent to a resource that involves a responsibility as an academic supervisor of a project undertaken by a student that results in a resource.
type: Property
inverse of: has project supervisor
label: is projectbegeleider van @nl
label: هو مشرف مشروع لـ @ar
definition: يربط بين وكيل ومصدر ينطوي على تحمل المسؤولية بصفته مشرف أكاديمي على مشروع ينفذه طالب يُسفر عن مصدر. @ar
label: er projektvejleder af @da
definition: Relaterer en agent til en ressource, som involverer et ansvar som akademisk vejleder af et projekt, der udføres af en strudent, og som resulterer i en ressource. @da
label: projektin ohjaaja aineistossa @fi
definition: Liittää toimijan aineistoon, jossa toimija akateemisena ohjaajana vastaa opiskelijan projektista, jonka tuloksena on aineisto. @fi
label: ist Projektbetreuerin/Projektbetreuer von @de
definition: Setzt einen Akteur in Beziehung zu einer Ressource, bei der eine akademische Betreuerin/ein akademischer Betreuer dafür verantwortlich ist, ein Projekt einer Studentin/eines Studenten zu beaufsichtigen oder zu betreuen, das zu einer Ressource führt. @de
label: 是……的项目主管 @zh-hans
definition: 将一个行为者与涉及导致一种资源的学生所做的项目的学术主管之责任的一种资源关联起来。 @zh-hans
label: projektvezetője a következőnek: @hu
definition: Hozzákapcsol egy ágenst egy forráshoz, amely magában foglalja egy projekt tudományos témavezetőjének a felelősségét, amely egy diák által készített művet eredményez. @hu
label: proje danışmanıdır @tr
definition: Bir temsilciyi, bir kaynakla sonuçlanan bir öğrencinin üstlendiği projenin akademik danışmanı olarak sorumluluk içeren bir kaynakla ilişkilendirir. @tr

has prominent member of agent
status: Published
definition: Relates an agent to an agent who is a well-known individual who is a member of an agent.
type: Property
lexical alias: prominentMemberOfFamily.en
label: har fremtrædende medlem af agent @da
definition: Relaterer en ressource til et velkendt individ, der er medlem af en agent. @da
inverse of: is prominent member of agent of
label: heeft prominent lid van actor @nl
label: yhteistoimijan tunnettu jäsen @fi
label: له عضو بارز لوكيل @ar
definition: يربط بين وكيل وفرد مشهور هو عضوًا لوكيل @ar
definition: Liittää yhteistoimijan tunnettuun henkilöön, joka on toimijan jäsen. @fi
label: hat bedeutendes Akteurmitglied @de
definition: Setzt einen Akteur in Beziehung zu einem bekannten Individuum, das Mitglied eines Akteurs ist. @de
label: 有行为者的著名成员 @zh-hans
definition: 将一个行为者与作为名人也作为一个行为者成员的一个行为者关联起来。 @zh-hans
definition: Relaciona un agent amb un agent que és un individu ben conegut que és un membre d’un agent. @ca
label: ágens kiemelkedő tagja a következő: @hu
definition: Hozzákapcsol egy ágenst egy jól ismert egyénhez, aki egy ágens tagja. @hu
label: temsilcinin seçkin üyesi ile ilişkilidir @tr
definition: Bir temsilciyi, temsilcinin üyesi olduğu tanınmış bir birey ile ilişkilendirir. @tr

is prominent member of agent of
status: Published
type: Property
lexical alias: prominentMemberOfFamilyOf.en
definition: Relates an agent to an agent who has a well-known individual as a member.
inverse of: has prominent member of agent
label: is prominent lid van actor van @nl
label: هو عضو بارز لوكيل لـ @ar
definition: يربط بين وكيل ووكيل له فرد مشهور كعضو. @ar
label: er fremtrædende medlem af agant af @da
definition: Relaterer en agent til en agent der har et velkendt individ som medlem. @da
label: toimijan tunnettu jäsen @fi
definition: Liittää toimijan tunnettuun toimijaan, jolla on jäsenenään tunnettu toimija @fi
label: ist bedeutendes Akteurmitglied von @de
definition: Setzt einen Akteur in Beziehung zu einem Akteur, der ein bekanntes Individuum als Mitglied hat. @de
label: 是……的行为者的著名成员 @zh-hans
definition: 将一个行为者与有一个著名个体作为其成员的一个行为者关联起来。 @zh-hans
label: kiemelkedő tagja a következő ágensnek: @hu
definition: Hozzákapcsol egy ágenst egy ágenshez, amelynek tagja egy jól ismert egyén. @hu
label: temsilcisinin seçkin üyesidir @tr
definition: Bir temsilciyi, üye olarak tanınmış bir bireye sahip olan bir temsilciyle ilişkilendirir. @tr

has publication statement
status: Published
definition: Relates a resource to a statement that identifies a place of publication, a publisher, or a date of publication of a published resource.
type: Property
lexical alias: publicationStatement.en
label: har publiceringsbeskrivelse @da
definition: Relaterer en ressource til oplysninger, der identificerer publiceringssted, udgiver og publiceringsdato for en publiceret ressource. @da
label: heeft publicatievermelding @nl
label: aineiston julkaisumerkintö @fi
label: له بيان نشر @ar
definition: يربط بين مصدر وبيان يُحدد مكان نشر، ناشر، أو تاريخ نشر خاص بمصدر منشور. @ar
definition: Liittää aineiston merkintöön, joka identifioi aineiston kustannuspaikan, kustantajan tai julkaisuajan. @fi
label: hat Veröffentlichungsangabe @de
definition: Setzt eine Ressource in Beziehung zu einer Angabe, die einen Erscheinungsort, einen Verlag oder ein Erscheinungsdatum einer veröffentlichten Ressource identifiziert. @de
label: 有出版说明 @zh-hans
definition: 将一种资源与标识一种出版资源的出版地、出版者或出版日期的一个说明关联起来。 @zh-hans
label: kiadási közlése a következő: @hu
definition: Hozzákapcsol egy forrást egy közléshez, amely azonosítja egy kiadott forrás kiadásának helyét, kiadóját és a kiadás időpontját. @hu
label: yayın bildirimi ile ilişkilidir @tr
definition: Bir kaynağı, yayınlanmış bir kaynağın yayın yerini, yayıncısını veya yayın tarihini tanımlayan bir bildirim ilişkilendirir. @tr

has publisher
status: Published
definition: Relates a resource to an agent who is responsible for publishing, releasing, or issuing a published resource.
type: Property
inverse of: is publisher of
lexical alias: publisher.en
label: har udgiver @da
definition: Relaterer en ressource til en agent, der er ansvarlig for at publicere, offentliggøre eller udgive en ressource. @da
label: heeft uitgever @nl
label: aineiston kustantaja @fi
label: له ناشر @ar
definition: يربط مصدر بوكيل مسؤول عن نشر، تحرير، أو إصدار مصدر منشور. @ar
definition: Liittää aineiston toimijaan, joka vastaa julkaistun manifestaation kustantamisesta, julkaisemisesta tai ilmestymisestä. @fi
label: hat Verlag @de
definition: Setzt eine Ressource in Beziehung zu einem Akteur, der für das Veröffentlichen, die Freigabe oder die Herausgabe einer Ressource verantwortlich ist. @de
label: 有出版者 @zh-hans
definition: 将一种资源与负责出版、发布或发行一种出版资源的一个行为者关联起来。 @zh-hans
label: kiadója a következő: @hu
definition: Hozzákapcsol egy forrást egy ágenshez, amely felelős egy kiadott forrás kiadásáért, kibocsájtásáért vagy megjelentetéséért. @hu
has subproperty: has broadcaster
label: yayıncı ile ilişkilidir @tr
definition: Bir kaynağı, yayınlanmış bir kaynağı yayınlamaktan, piyasaya sürmek veya çıkarmaktan sorumlu bir temsilci ile ilişkilendirir. @tr

has publisher number for notated music
status: Published
definition: Relates a resource to a nomen that is an identifier for resource other than a plate number for notated music, assigned by a publisher to a notated music resource.
type: Property
sub property of: has identifier for resource
lexical alias: publisherNumberForNotatedMusic.en
scope note: A publisher number for notated music sometimes includes initials, abbreviations, or words identifying the publisher.
label: har udgivers editionsnummer for noteret musik @da
definition: Relaterer en ressource til en nummereringsbetegnelse givet til en noteret musikressource af en udgiver. @da
scope note: Editionsnummer for noteret musik indeholder sommetider initialer, forkortelser eller ord der identificerer udgiveren. @da
inverse of: is publisher number for notated music of
label: heeft uitgeversnummer voor bladmuziek @nl
label: kustantajan nuottiaineistolle antama numero @fi
scope note: Kustantajan nuottiaineistolle antama numero, joka voi sisältää kustantajaa identifioivia sanoja, lyhenteitä tai kirjaimia. @fi
label: له رقم ناشر لموسيقى مدونة. @ar
definition: يربط بين مصدر وترقيم محدد خصصه ناشر لمصدر موسيقى مدونة. @ar
scope note: يتضمن رقم الناشر لموسيقى مدونة أحيانًا استهلاليات، إختصارات، أو كلمات التى تُعرّف بالناشر. @ar
definition: Liittää aineiston musiikin kustantajan nuottiaineistolle antamaan tunnisteeseen. @fi
label: hat Noten-Bestellnummer @de
definition: Setzt eine Ressource in Beziehung zu einer Bezeichnung einer Zählung, die einer notierten Musikressource vom Verlag zugewiesen wird. @de
scope note: Eine Noten-Bestellnummer enthält manchmal Initialen, Abkürzungen oder Wörter, die den Verlag identifizieren. @de
label: 有乐谱的出版者编号 @zh-hans
definition: 将一种资源与作为出版者给一种乐谱资源分配的除乐谱版号以外的一种资源的标识符的一个命名关联起来。 @zh-hans
scope note: 乐谱的出版者编号有时候包括标识出版社的首字母缩写、缩略语或单词。 @zh-hans
definition: Relaciona un recurs amb un nomen que és un identificador de recurs diferent d’un número de planxa per a música notada, assignat per un editor a un recurs de música notada. @ca
label: kiadói műjegyzékszáma a következő: @hu
definition: Hozzákapcsol egy forrást egy kiadó által egy zenei lejegyzésnek adott számozásjelöléshez. @hu
scope note: A kiadói műjegyzékszám néha magába foglal kezdőbetűket, rövidítéseket vagy a kiadót megnevező szavakat. @hu
label: notaya alınmış müzik için yayıncı numarası ile ilişkilidir @tr
definition: Bir kaynağı, bir yayıncı tarafından müzik notası haline getirilmiş kaynağına verilen bir numaralandırma belirteciyle ilişkilendirir. @tr
scope note: Notalı müziğin yayımcı numarası kimi zaman baş harfleri, kısaltmaları veya yayımcıyı tanımlanan sözcükleri içerir. @tr

is publisher number for notated music of
status: Published
type: Property
lexical alias: publisherNumberForNotatedMusicOf.en
sub property of: is identifier for resource of
definition: Relates a resource to a numbering designation assigned to a notated music resource by a publisher.
scope note: The number normally appears only on the title page, the cover, or the first page of music, and sometimes includes initials, abbreviations, or words identifying the publisher.
inverse of: has publisher number for notated music
label: is uitgeversnummer voor bladmuziek van @nl
label: هو رقم ناشر لموسيقى مدونة @ar
definition: يربط بين مصدر وترقيم محدد خصصه ناشر لمصدر موسيقى مدونة. @ar
scope note: يظهر الرقم عادة فقط على صفحة العنوان، الغلاف، أو الصفحة الأولى من الموسيقى، ويشمل أحيانًا على الاستهلاليات، أو الإختصارات، أو الكلمات التى تعرف بالناشر. @ar
label: er editionsnummer for noteret musik @da
definition: Relaterer en ressource til en nummerangivelse tildelt to en noteret musikressource af en udgiver. @da
scope note: Nummeret optræder normalt kun på titelsiden, omslaget, den første musikside, og indeholder nogen gange initialer, forkortelser g ord der identificerer udgiveren. @da
label: kustantajan nuottiaineistolle antama numero @fi
definition: Liittää musiikkiaineiston kustantajan nuottiaineistolle antamaan tunnisteeseen. @fi
scope note: Numero esiintyy yleensä jokaisen sivun alalaidassa ja joskus nimiösivulla. Numero voi sisältää kustantajaa identifioivia alkukirjainlyhenteitä, sanalyhenteitä tai sanoja. @fi
label: ist Noten-Bestellnummer von @de
definition: Setzt eine Ressource in Beziehung zu einer Bezeichnung einer Zählung, die einer notierten Musikressource vom Verlag zugewiesen wird. @de
scope note: Die Nummer erscheint normalerweise nur auf der Titelseite, der Einbanddecke oder der ersten Seite von Musikalien und enthält manchmal Initialen, Abkürzungen oder Wörter, die den Verlag identifizieren. @de
label: 是……的乐谱的出版者编号 @zh-hans
definition: 将一种资源与由出版者分配给一种乐谱资源的一个编号标识关联起来。 @zh-hans
scope note: 该编号通常出现在题名页、封面、或乐谱的第一页上，有时候包括标识出版者的首字母缩写、缩略语或词。 @zh-hans
label: kiadói műjegyzékszáma a következőnek: @hu
definition: Hozzákapcsol egy forrást egy kiadó által egy zenei lejegyzésnek adott számozásjelöléshez. @hu
scope note: A szám általában a címoldalon, a borítón vagy a zenei lejegyzés első oldalán jelenik meg, és néha magába foglal kezdőbetűket, rövidítéseket vagy a kiadót megnevező szavakat. @hu
label: notaya alınmış müziğinin yayıncı numarasıdır @tr
definition: Bir kaynağı, bir yayıncı tarafından müzik notası haline getirilmiş kaynağına verilen bir numaralandırma belirteciyle ilişkilendirir. @tr
scope note: Sayı normalde yalnızca başlık sayfasında, kapakta veya müziğin ilk sayfasında görünür ve ara sıra baş harfler, kısaltmalar veya yayıncıyı tanımlayan sözcükler içerir. @tr

is publisher of
status: Published
definition: Relates an agent to a resource that involves a responsibility of an agent for publishing, releasing, or issuing.
type: Property
inverse of: has publisher
lexical alias: publisherOf.en
label: er udgiver af @da
definition: Relaterer en agent, der er ansvarlig for at publicere, offentliggøre eller udsende en ressource til en ressource. @da
label: is uitgever van @nl
label: هو ناشر لـ @ar
definition: يربط بين وكيل ومصدر ينطوي على مسؤولية وكيل عن النشر، أو التحرير، أو الإصدار. @ar
label: kustantaja (toimija) aineistossa @fi
definition: Liittää toimijan aineistoon, jossa toimija vastaa kustantamisesta, julkaisemisesta tai ilmestymisestä. @fi
label: ist Verlag von @de
definition: Setzt einen Akteur in Beziehung zu einer Ressource, bei der ein Akteur für das Veröffentlichen, die Freigabe oder die Herausgabe verantwortlich ist. @de
label: 是……的出版者 @zh-hans
definition: 将一个行为者与涉及出版、发布或发行的一个行为者的责任的一种资源关联起来。 @zh-hans
label: kiadója a következőnek: @hu
definition: Hozzákapcsol egy ágenst egy forráshoz, amelyhez hozzátartozik az ágens felelőssége közzétételért, kiadásért vagy kibocsátásért. @hu
has subproperty: is broadcaster of
label: yayıncısıdır @tr
definition: Bir temsilciyi, yayınlama, piyasaya sürme veya çıkarmaya ilişkin bir temsilcinin sorumluluğunu içeren bir kaynakla ilişkilendirir. @tr

has puppeteer
status: Published
definition: Relates a resource to an agent who is a performer who contributes to a resource by manipulating, controlling, or directing puppets or marionettes in a moving image production or a musical or dramatic presentation or entertainment.
type: Property
sub property of: has performer
inverse of: is puppeteer of
lexical alias: puppeteer.en
label: har dukkefører @da
definition: Relaterer en ressource til en optrædende, der har bidraget til en ressource ved at manipulere, kontrollere eller styre dukker eller marionetter i en levende billedproduktion eller en musikalsk eller dramatisk præsentation eller i underholdning. @da
label: heeft poppenspeler @nl
label: nukettaja aineistossa @fi
label: له محرك عرائس @ar
definition: يربط بين مصدر ومؤدِ يُساهم في مصدر من خلال اللعب بالعرائس أو الدمى المتحركة أو التحكم فيها، أو توجيهها في إنتاج لصور متحركة أو في عرض موسيقي أو درامي أو ترفيهي. @ar
definition: Liittää aineiston esittäjään, joka on aineistoon osalllisena käsittelemällä, kontrolloimalla tai ohjaamalla nukkeja tai marionetteja elokuvatuotannossa tai musiikki- tai näytelmäesityksessä. @fi
label: hat Puppenspielerin/Puppenspieler @de
definition: Setzt eine Ressource in Beziehung zu einer Ausführenden/einem Ausführenden, die/der zu einer Ressource beiträgt, indem sie/er Puppen oder Marionetten in einer Bewegtbildproduktion oder einer musikalischen oder dramatischen Darbietung oder Aufführung bewegt, kontrolliert oder lenkt. @de
label: 有木偶表演者 @zh-hans
definition: 将一种资源与作为一个表演者通过在动态图像制作或者音乐或戏剧呈现或娱乐中操纵、控制、指引木偶对一种资源有贡献的一个行为者关联起来。 @zh-hans
definition: Relaciona un recurs amb un agent que és un intèrpret que contribueix a un recurs manipulant, controlant o dirigint titelles o marionetes en una producció d’imatge en moviment o en una representació o un espectacle musical o dramàtic. @ca
label: bábjátékosa a következő: @hu
definition: Hozzákapcsol egy forrást egy olyan előadóhoz, aki hozzájárul egy forráshoz azzal, hogy egy mozgókép-produkcióban, zenei vagy drámai bemutatóban vagy szórakoztató műsorban bábokat vagy marionettfigurákat manipulál, vezérel vagy kezel. @hu
label: kuklacı ile ilişkilidir @tr
definition: Bir kaynağı, hareketli görüntü üretiminde ya da müzikal veya dramayla ilgili gösterimde ya da eğlence programında değiştirerek, kontrol ederek veya kukla gibi oynatarak, kaynağa katkıda bulunan sanatçı ile ilişkilendirir. @tr

is puppeteer of
status: Published
definition: Relates an agent to a resource that includes a contribution by an agent of manipulating, controlling, or directing puppets or marionettes in a moving image production or a musical or dramatic presentation or entertainment
type: Property
sub property of: is performer of
inverse of: has puppeteer
lexical alias: puppeteerOf.en
label: er dukkefører i @da
definition: Relaterer en udøver der bidrager til en ressource ved at manipulere, kontrollere, eller føre dukker eller marionetter i en levende billedproduktion eller en musikalsk eller dramatisk præsentation eller underholdning til en ressource @da
label: is poppenspeler van @nl
label: nukettajana aineistossa @fi
label: هو محرك عرائس لـ @ar
definition: يربط بين وكيل ومصدر يتضمن إسهام وكيل في اللعب بالعرائس أو الدمى المتحركة أو التحكم فيها، أو توجيهها في إنتاج لصور متحركة أو في عرض موسيقي أو درامي أو ترفيهي. @ar
definition: Liittää toimijan aineistoon, jonka tekemiseen hän osallistuu käsittelemällä, kontrolloimalla tai ohjaamalla nukkeja tai marionetteja elokuvatuotannossa tai musiikki- tai näytelmäesityksessä. @fi
label: ist Puppenspielerin/Puppenspieler von @de
definition: Setzt einen Akteur in Beziehung zu einer Ressource, zu der ein Akteur beiträgt, indem er Puppen oder Marionetten in einer Bewegtbildproduktion oder einer musikalischen oder dramatischen Darbietung oder Aufführung bewegt, kontrolliert oder lenkt. @de
label: 是……的木偶表演者 @zh-hans
definition: 将一个行为者与包括在动态图像制作或者音乐或戏剧呈现或娱乐中操纵、控制、指引木偶的一个行为者的贡献的一种资源关联起来。 @zh-hans
label: bábjátékosa a következőnek: @hu
definition: Hozzákapcsol egy ágenst egy forráshoz, amely magában foglalja egy ágens közreműködését bábok vagy marionettfigurák manipulálásában, vezérlésében vagy irányításában egy mozgókép-produkcióban, zenei vagy drámai bemutatóban vagy szórakoztató műsorban. @hu
label: kuklacısıdır @tr
definition: Bir temsilciyi, hareketli bir görüntü yapımında veya müzikal ya da dramatik bir sunumda veya eğlencede kuklaları manipüle eden, kontrol eden veya yöneten bir temsilcinin katkısını içeren bir kaynakla ilişkilendirir. @tr

is radio adaptation of
status: Published
definition: Relates a resource to a resource that is adapted as a radio program.
type: Property
sub property of: is adaptation of
inverse of: is adapted as radio program
lexical alias: radioAdaptationOf.en
label: er radiobearbejdelse af @da
definition: Relaterer en ressource til en ressource, der er blevet bearbejdet til et radioprogram. @da
label: is radiobewerking van @nl
label: radiosovitus aineistosta @fi
label: هو اقتباس إذاعي لـ @ar
definition: يربط بين مصدر ومصدر تم تحويره كبرنامج إذاعي. @ar
definition: Liittää aineiston radio-ohjelmaksi sovitettuun aineistoon. @fi
label: ist Hörfunkbearbeitung von @de
definition: Setzt eine Ressource in Beziehung zu einer Ressource, die als Hörfunksendung bearbeitet ist. @de
label: 是……的广播改编 @zh-hans
definition: 将一种资源与被改编为广播节目的一种资源关联起来。 @zh-hans
label: rádiós feldolgozása a következőnek: @hu
definition: Hozzákapcsol egy forrást egy forráshoz, amelyet rádióműsorként adaptáltak. @hu
label: radyo uyarlamasıdır @tr
definition: Bir kaynağı, radyo programı olarak uyarlanmış bir kaynakla ilişkilendirir. @tr

has radio director
status: Published
definition: Relates a resource to an agent who is a director who is responsible for the general management and supervision of a radio program.
type: Property
sub property of: has director
inverse of: is radio director of
lexical alias: radioDirector.en
label: har radioinstruktør @da
definition: Relaterer en ressource til en instruktør, der er ansvarlig for ledelse af og tilsyn med et radioprogram. @da
label: heeft radioregisseur @nl
label: radio-ohjaaja aineistossa @fi
label: له مخرج إذاعي @ar
definition: يربط مصدر بوكيل يعمل بصفته مخرجًا مسؤولًا عن الإدارة العامة والإشراف على برنامج إذاعي. @ar
definition: Liittää aineiston toimijaan, joka ohjaajana vastaa radio-ohjelman yleisestä johtamisesta ja valvonnasta. @fi
label: hat Hörfunkregisseurin/Hörfunkregisseur @de
definition: Setzt eine Ressource in Beziehung zu einer Regisseurin/einem Regisseur (Akteur), die/der für das allgemeine Management und die Leitung einer Hörfunksendung verantwortlich ist. @de
label: 有广播导演 @zh-hans
definition: 将一种资源与作为一个导演并负责广播节目的总体管理和监督的一个行为者关联起来。 @zh-hans
label: rádiós rendezője a következő: @hu
definition: Hozzákapcsol egy forrást egy ágenshez, amely felelős egy rádióműsor általános menedzseléséért és felügyeletéért. @hu
label: radyo yönetmeni ile ilişkilidir @tr
definition: Bir kaynağı, bir radyo programının genel yönetimi ve denetiminden sorumlu bir yönetmen olan bir temsilci ile ilişkilendirir. @tr

is radio director of
status: Published
definition: Relates an agent to a resource that involves a responsibility of an agent for the general management and supervision of a radio program.
type: Property
sub property of: is director of
inverse of: has radio director
lexical alias: radioDirectorOf.en
label: er radioinstruktør af @da
definition: Relaterer en instruktør der er ansvarlig for ledelse og tilsyn med et radioprogram til en ressource. @da
label: is radioregisseur van @nl
label: radio-ohjaaja (toimija) aineistossa @fi
label: هو مخرج إذاعي لـ @ar
definition: يربط بين وكيل ومصدر ينطوي على مسؤولية وكيل الإدارة العامة والإشراف على برنامج إذاعي. @ar
definition: Liittää toimijan aineistoon, jossa toimija vastaa radio-ohjelman yleisestä johtamisesta ja valvonnasta. @fi
label: ist Hörfunkregisseurin/Hörfunkregisseur von @de
definition: Setzt einen Akteur in Beziehung zu einer Ressource, bei der ein Akteur für das allgemeine Management und die Leitung einer Hörfunksendung verantwortlich ist. @de
label: 是……的广播导演 @zh-hans
definition: 将一个行为者与涉及广播节目的总体管理和监督的一个行为者的责任的一种资源关联起来。 @zh-hans
label: rádiós rendezője a következőnek: @hu
definition: Hozzákapcsol egy ágenst egy forráshoz, amelyhez hozzátartozik az ágens felelőssége egy rádióműsor általános menedzseléséért és felügyeletéért. @hu
label: radyo yönetmenidir @tr
definition: Bir temsilciyi, bir radyo programının genel yönetimi ve denetimine ilişkin bir temsilcinin sorumluluğunu içeren bir kaynakla ilişkilendirir. @tr

has radio producer
status: Published
definition: Relates a resource to an agent who is a producer who is responsible for most of the business aspects of a radio program.
type: Property
sub property of: has producer
inverse of: is radio producer of
lexical alias: radioProducer.en
label: har radioproducer @da
definition: Relaterer en ressource til en producer, der er ansvarlig for størstedelen af de forretningsmæssige aspekter ved et radioprogram. @da
label: heeft radioproducent @nl
label: radiotuottajana aineistossa @fi
label: له مُنتِج إذاعي @ar
definition: يربط مصدر بوكيل يكون مُنتِجًا مسؤولًا عن معظم الجوانب التجارية لإنتاج برنامج إذاعي. @ar
definition: Liittää aineiston toimijaan, joka on vastuussa suurimmasta osasta radio-ohjelman liiketoimintaa. @fi
label: hat Hörfunkproduzentin/Hörfunkproduzenten @de
definition: Setzt eine Ressource in Beziehung zu einer Produzentin/einem Produzenten, die/der für die meisten geschäftlichen Aspekte einer Hörfunksendung verantwortlich ist. @de
label: 有广播制作者 @zh-hans
definition: 将一种资源与作为制作者并负责广播节目的大部分商业运作的一个行为者关联起来。 @zh-hans
label: rádiós producere a következő: @hu
definition: Hozzákapcsol egy forrást egy producer ágenshez, aki felelős egy rádióműsor üzleti vonatkozásainak a zöméért. @hu
label: radyo yapımcısı ile ilişkilidir @tr
definition: Bir kaynağı, bir radyo programının ticari yönlerinin çoğundan sorumlu yapımcı olan temsilci ile ilişkilendirir. @tr

is radio producer of
status: Published
definition: Relates an agent to a resource that involves a responsibility of an agent for most of the business aspects of the production of a radio program.
type: Property
sub property of: is producer of
inverse of: has radio producer
lexical alias: radioProducerOf.en
label: er radioproducer af @da
definition: Relaterer en producer der er ansvarlig for størstedelen af de forretningsmæssige aspekter ved et radioprogram, til en ressource. @da
label: is radioproducent van @nl
label: radiotuottajana aineistossa @fi
label: هو منتج إذاعي لـ @ar
definition: يربط بين وكيل ومصدر ينطوي على مسؤولية وكيل عن معظم الجوانب التجارية لإنتاج برنامج إذاعي. @ar
definition: Liittää toimijan aineistoon, jossa toimija vastaa suurimmasta osasta radio-ohjelman liiketoimintaa. @fi
label: ist Hörfunkproduzentin/Hörfunkproduzent von @de
definition: Setzt einen Akteur in Beziehung zu einer Ressource, bei der ein Akteur für die meisten geschäftlichen Aspekte einer Hörfunksendung verantwortlich ist. @de
label: 是……的广播制作人 @zh-hans
definition: 将一个行为者与涉及广播节目制作的大部分商业运作的一个行为者的责任的一种资源关联起来。 @zh-hans
label: rádióproducere a következőnek: @hu
definition: Hozzákapcsol egy ágenst egy forráshoz, amelyhez hozzátartozik egy ágens felelőssége egy rádióműsor legtöbb üzleti vonatkozásáért. @hu
label: radyo yapımcısıdır @tr
definition: Bir temsilciyi, bir radyo programının yapımının ticari yönlerinin çoğu için sorumluluğun bir temsilciye ait olduğu bir kaynakla ilişkilendirir. @tr

has radio program music
status: Published
definition: Relates a resource to a musical resource that complements a resource that is a radio program.
type: Property
sub property of: has music
inverse of: is music for radio program
lexical alias: radioProgramMusic.en
label: er radioprogrammusik @da
definition: Relaterer en ressource til en musikressource, der er anvendt i et radioprogram. @da
label: heeft radioprogramma-muziek @nl
label: له موسيقى برنامج إذاعي @ar
definition: يربط بين مصدر ومصدر موسيقي يُكمل مصدرًا يمثل برنامج إذاعي. @ar
label: radio-ohjelman musiikki (aineisto) @fi
definition: Liittää aineiston musiikkiaineistoon, joka täydentää aineistoa, joka on radio-ohjelma. @fi
label: hat Hörfunksendungsmusik @de
definition: Setzt eine Ressource in Beziehung zu einer Musikressource, die eine Hörfunksendung (Ressource) ergänzt. @de
label: 有广播节目音乐 @zh-hans
definition: 将一种资源与补充作为广播节目的一种资源的一种音乐资源关联起来。 @zh-hans
label: rádióműsor zenéje a következő: @hu
definition: Hozzákapcsol egy forrást egy zenei forráshoz, amely kiegészít egy rádióműsor-forrást. @hu
label: radyo programı müziği ile ilişkilidir @tr
definition: Bir kaynağı, bir radyo programı olan bir kaynağı tamamlayan bir müzik kaynağıyla ilişkilendirir. @tr

has radio script
status: Published
definition: Relates a resource to a resource that is textual resource that complements a resource that is a radio program.
type: Property
sub property of: is complemented by
inverse of: is script for radio program
lexical alias: radioScript.en
label: er radiomanuskript @da
definition: Relaterer en ressource til en ressource, der indeholder teksten til et radioprogram. @da
label: heeft radioscript @nl
label: radio-ohjelman käsikirjoitus (aineisto) @fi
label: له نص إذاعي @ar
definition: يربط بين مصدر ومصدر نصي يكمل عملًا يمثل برنامج إذاعي. @ar
definition: Liittää aineiston radio-ohjelma-aineistoon, joka käyttää käsikirjoitusta ja jota on täydennetty tekstiteoksella. @fi
label: hat Hörfunkskript @de
definition: Setzt eine Ressource in Beziehung zu einer textlichen Ressource, die eine Hörfunksendung ergänzt. @de
label: 有广播文稿 @zh-hans
definition: 将一种资源与补充作为一种广播节目的一种资源的作为一种文字资源的一种资源关联起来。 @zh-hans
definition: Relaciona un recurs amb un recurs que és un recurs textual que complementa un recurs que és un programa radiofònic. @ca
label: rádiószövegkönyve a következő: @hu
definition: Hozzákapcsol egy forrást egy szöveges forráshoz, amely kiegészít egy művet, ami egy rádióműsor. @hu
label: radyo metni ile ilişkilidir @tr
definition: Bir kaynağı, radyo programı olan bir eseri tamamlayan metinsel bir kaynakla ilişkilendirir. @tr

is radio script based on
status: Published
definition: Relates a resource to a resource that is adapted as a script for a radio program.
type: Property
sub property of: is adaptation of
inverse of: is adapted as radio script
lexical alias: radioScriptBasedOn.en
label: er radiomanuskript baseret på @da
definition: Relaterer en ressource til en ressource, der er blevet bearbejdet som manuskript til et radioprogram. @da
label: is radioscript gebaseerd op @nl
label: هو نص إذاعي معتمد على @ar
definition: يربط بين مصدر ومصدر تم تحويره كنص لبرنامج إذاعي. @ar
label: radiokäsikirjoituksen perustana oleva aineisto @fi
definition: Liittää aineiston radio-ohjelman käsikirjoitukseksi sovitettuun aineistoon. @fi
label: ist Hörfunkskript basierend auf @de
definition: Setzt eine Ressource in Beziehung zu einer Ressource, die als Skript für eine Hörfunksendung bearbeitet ist. @de
label: 是基于……的广播文稿 @zh-hans
definition: 将一种资源与被改编为广播节目文稿的一种资源关联起来。 @zh-hans
label: rádiós szövegkönyv a következőből: @hu
definition: Hozzákapcsol egy forrást egy forráshoz, amelyet egy rádióműsor forgatókönyveként adaptáltak. @hu
label: dayalı radyo metnidir @tr
definition: Bir kaynağı, bir radyo programı için metin olarak uyarlanmış bir kaynakla ilişkilendirir. @tr

has rapporteur
status: Published
type: Property
lexical alias: rapporteur.en
definition: Relates a resource to an agent who is an author who is appointed by an organization to report on the proceedings of its meetings.
inverse of: is rapporteur of
scope note: Responsibility limited to taking minutes is excluded.
sub property of: has author
see also: has minute taker
label: har rapportør @da
definition: Relaterer en ressource til en forfatter, der er udpeget af en organisation til at rapportere om udviklingen af dens møder. @da
scope note: Omfatter ikke ansvar begrænset til at tage referat. @da
label: heeft rapporteur @nl
label: له مقَرِّر @ar
definition: يربط مصدر بوكيل مؤلف تم تعيينه من جانب منظمة لإعداد تقارير عن وقائع اجتماعاتها. @ar
scope note: يتم استبعاد المسؤولية التي تقتصر على تدوين مضابط الجلسات. @ar
label: kokousten raportoija aineistossa @fi
definition: Liittää aineiston toimijaan, joka vastaa organisaation kokousmenettelyistä. @fi
scope note: Ei koske kokouksen pöytäkirjan laatimiseen rajautuvaa vastuuta. @fi
label: ist Berichterstatterin/Berichterstatter @de
definition: Setzt eine Ressource in Beziehung zu einer Verfasserin/einem Verfasser (Akteur), die/der von einer Organisation eingestellt ist, um über den Ablauf ihrer Sitzungen zu berichten. @de
scope note: Darunter fällt nicht die Verantwortlichkeit, die sich auf das Protokollschreiben beschränkt. @de
label: 有会务报告人 @zh-hans
definition: 将一种资源与作为一个著者并被一个组织指定为在其会议文集中报告的一个行为者关联起来。 @zh-hans
scope note: 不包括仅限于写会议记录的责任。 @zh-hans
label: raportőre a következő: @hu
definition: Hozzákapcsol egy forrást egy szerző ágenshez, akit egy szervezet megbíz azzal, hogy készítsen jelentést az üléseinek a lefolyásáról. @hu
scope note: Nem tartozik bele a jegyzőkönyvvezetésre korlátozódó szerzőség. @hu
label: raportör ile ilişkilidir @tr
definition: Bir kaynağı, bir kuruluş tarafından toplantılarının işleyişi hakkında rapor vermek üzere atanan bir yazar olan bir temsilci ile ilişkilendirir. @tr
scope note: Tutanak tutmakla sınırlı sorumluluk hariçtir. @tr

is rapporteur of
status: Published
type: Property
lexical alias: rapporteurOf.en
definition: Relates an agent to a resource that involves a responsibility of an agent for reporting on the proceedings of meetings of an organization.
inverse of: has rapporteur
sub property of: is author of
see also: is librettist of
label: er rapportør af @da
definition: Relaterer en forfatter, der er udpeget af en organisation til at rapportere om udviklingen af dens møder til en ressource. @da
label: is rapporteur van @nl
label: هو مقَرِّر لـ @ar
definition: يربط بين وكيل ومصدر ينطوي على مسؤولية وكيل عن إعداد تقرير عن وقائع اجتماعات منظمة. @ar
label: kokousten raportoija (toimija) aineistossa @fi
definition: Liittää toimijan aineistoon, jossa toimija vastaa organisaation kokousmenettelyistä. @fi
label: ist Berichterstatterin/Berichterstatter von @de
definition: Setzt einen Akteur in Beziehung zu einer Ressource, bei der ein Akteur für das Berichten über den Ablauf von Sitzungen einer Organisation verantwortlich ist. @de
label: 是……的会务报告人 @zh-hans
definition: 将一个行为者与涉及一个组织的会议文集报告的一个行为者的责任的一种资源关联起来。 @zh-hans
label: raportőre a következőnek: @hu
definition: Hozzákapcsol egy forrást egy ágenshez, amelyhez hozzátartozik egy ágens felelőssége egy szervezet üléseinek lefolyásáról szóló jelentésért. @hu
label: raportörüdür @tr
definition: Bir temsilciyi, bir kuruluşun toplantılarının tutanaklarını raporlamak için bir temsilcinin sorumluluğunu içeren bir kaynakla ilişkilendirir. @tr

has real identity
status: Published
definition: Relates an agent to a nomen that is a real appellation of an agent who uses another nomen.
type: Property
lexical alias: realIdentity.en
label: har virkelig identitet @da
definition: Relaterer en virkelig agent der antager en alternativ identitet til en agent. @da
label: heeft echte identiteit @nl
label: todellinen identiteetti @fi
label: له هوية حقيقية @ar
definition: يربط وكيل حقيقي يدّعي هوية بديلة لوكيل @ar
definition: Liittää todellisen toimijan oletettuun vaihtoehtoiseen identiteettiin. @fi
label: hat wirkliche Identität @de
definition: Setzt einen realen Akteur, der eine andere Identität annimmt, in Beziehung zu einem Akteur. @de
label: 有真实身份 @zh-hans
definition: 将一个行为者与作为使用另一个命名的一个行为者的一个真实称谓的一个命名关联起来。 @zh-hans
definition: Relaciona un agent amb un nomen que és una apel·lació real d’un agent que usa un altre nomen. @ca
label: valódi identitása a következő: @hu
definition: Hozzákapcsol egy valódi ágenst, aki felveszi egy ágens alternatív identitását. @hu
label: gerçek kimlik ile ilişkilidir @tr
definition: Alternatif bir kimlik üstlenmiş gerçek bir temsilciyi bir temsilciyle ilişkilendirir. @tr

is real identity of
status: Published
lexical alias: realIdentityOf.en
definition: Relates a nomen to an agent who has an appellation of agent that is a real identity.
type: Property
label: is echte identiteit van @nl
label: هي هوية حقيقية لـ @ar
definition: يربط بين تسمية ووكيل له تسمية وكيل عبارة عن هوية حقيقية. @ar
label: er reel identitet af @da
definition: Relaterer et nomen til en agent, som har en benævnelse for agent, der er en reel identitet. @da
label: todellinen identiteetti @fi
definition: Liittää nomenin toimijaan, jonka nimitys on todellinen identiteetti. @fi
label: ist wirkliche Identität von @de
definition: Setzt ein Nomen in Beziehung zu einem Akteur, der über eine Bezeichnung für einen Akteur verfügt, bei der es sich um eine wirkliche Identität handelt. @de
label: 是……的真实身份 @zh-hans
definition: 将一个命名与有真实身份作为行为者称谓的一个行为者关联起来。 @zh-hans
label: valódi identitása a következőnek: @hu
definition: Hozzákapcsol egy noment egy ágenshez, amelynek van egy olyan megnevezése az ágens számára, amely a valódi identitása. @hu
label: gerçek kimliğidir @tr
definition: Bir ismi, gerçek bir kimlik olan temsilci sıfatına sahip bir temsilciyle ilişkilendirir. @tr

has recording engineer
status: Published
definition: Relates a resource to an agent who contributes to a resource by supervising the technical aspects of a sound or video recording session.
type: Property
sub property of: has contributor (Deprecated)
inverse of: is recording engineer of
lexical alias: recordingEngineer.en
label: har indspilningstekniker @da
definition: Relaterer en ressource til en lydtekniker, der har bidraget til en ressource ved at føre tilsyn med de tekniske aspekter af en lyd- eller videooptagelse. @da
label: heeft opnametechnicus @nl
label: aineiston äänittäjä @fi
label: له مهندس تسجيل @ar
definition: يربط مصدر بوكيل يُساهم في مصدر من خلال الإشراف على الجوانب الفنية لمحتوى صوتي لجلسة تسجيل. @ar
definition: Liittää aineiston toimijaan, joka on aineistossa osallisena valvomalla äänityksen teknistä toteutusta. @fi
label: hat Aufnahmetechnikerin/Aufnahmetechniker @de
definition: Setzt eine Ressource in Beziehung zu einem Akteur, der zu einer Ressource beiträgt, indem er die technischen Aspekte einer Ton- oder Videoaufnahme überwacht. @de
label: 有录制工程师 @zh-hans
definition: 将一种资源与作为一个音频工程师通过监督一个录制过程中的技术方面而对一种资源有贡献的一个行为者关联起来。 @zh-hans
label: hangmérnöke a következő: @hu
definition: Hozzákapcsol egy forrást egy ágenshez, amely hozzájárul egy forráshoz azzal, hogy felügyeli egy hangok vagy videó rögzítését szolgáló munkamenet műszaki aspektusait. @hu
label: kayıt mühendisi ile ilişkilidir @tr
definition: Bir kaynağı, bir ses veya video kayıt oturumunun teknik yönlerini denetleyerek bir kaynağa katkıda bulunan bir temsilci ile ilişkilendirir. @tr

is recording engineer of
status: Published
definition: Relates an agent to a resource that includes a contribution by an agent of supervising the technical aspects of the audio content of a recording session.
type: Property
sub property of: is contributor of (Deprecated)
inverse of: has recording engineer
lexical alias: recordingEngineerOf.en
label: er indspilningstekniker for @da
definition: Relaterer en lydtekniker, der har bidraget til en ressource ved at føre tilsyn med de tekniske aspekter af en optagelsessession til en ressource. @da
label: is opnametechnicus van @nl
label: هو مهندس تسجيل لـ @ar
definition: يربط بين وكيل ومصدر يتضمن إسهام وكيل بالإشراف على الجوانب الفنية لمحتوى صوتي لجلسة تسجيل. @ar
label: äänittäjä (toimija) aineistossa @fi
definition: Liittää toimijan aineistoon, jossa toimija on osallisena valvomalla äänityksen teknistä toteutusta. @fi
label: ist Aufnahmetechnikerin/Aufnahmetechniker von @de
definition: Setzt einen Akteur in Beziehung zu einer Ressource, zu der ein Akteur beiträgt, indem er die technischen Aspekte des Audio-Inhalts einer Aufnahme überwacht. @de
label: 是……的录制工程师 @zh-hans
definition: 将一个行为者与包括监督一个录制过程中的音频内容的技术方面的一个行为者的贡献的一种资源关联起来。 @zh-hans
label: hangrögzítője a következőnek: @hu
definition: Hozzákapcsol egy ágenst egy forráshoz, amely magában foglalja az ágens közreműködését a hangtartalom rögzítését szolgáló munkamenet műszaki aspektusainak felügyeletében. @hu
label: ses kayıt mühendisidir @tr
definition: Bir temsilciyi, bir kayıt oturumunun ses içeriğinin teknik yönlerini denetleyen bir temsilcinin katkısını içeren bir kaynakla ilişkilendirir. @tr

has recording medium
status: Published
definition: Relates a resource to a type of medium used to record sound on an audio carrier.
type: Property
sub property of: has sound characteristic
lexical alias: recordingMedium.en
label: har optagemedie @da
definition: Relaterer en ressource til en type af medie, der er anvendt til at optage lyd på en lydbærer. @da
label: heeft opnamemedium @nl
label: له وسيط تسجيل @ar
definition: يربط بين مصدر ونوع وسيط مستخدم في تسجيل الصوت على حامل صوتي. @ar
label: aineiston äänen tallennusmedian tyyppi @fi
definition: Liittää aineiston tallennusmediaan, jolla ääni tallennetaan äänitallenteelle. @fi
label: hat Aufzeichnungsmedium @de
definition: Setzt eine Ressource in Beziehung zu einer Art des Mediums, das verwendet wird, um Ton auf einem Tonträger festzuhalten. @de
label: 有录音媒介 @zh-hans
definition: 将一种资源与用于在音频载体上记录声音的媒介类型关联起来。 @zh-hans
label: rögzítőmédiuma a következő: @hu
definition: Hozzákapcsol egy forrást egy médiumtípushoz, amelyet egy hanghordozóra való hangrögzítésre használnak. @hu
label: kayıt ortamı ile ilişkilidir @tr
definition: Bir kaynağı, bir ses taşıyıcısına ses kaydetmek için kullanılan bir ortam türüyle ilişkilendirir. @tr

has recording source
status: Published
lexical alias: recordingSource.en
definition: Relates a resource to a source of information for a metadata resource that is an unstructured description transcribed from a resource being described.
type: Property
label: heeft bron van overname @nl
label: له مصدر تسجيل @ar
definition: يربط بين مصدر ومصدر معلومات لمصدر ميتاداتا الذي يعد وصفًا غير مهيكل يتم نسخه من مصدر يتم وصفها. @ar
label: har optagelsesressource @da
definition: Relaterer en ressource til en informationskilde for en metadataressource, der er en ustruktureret beskrivelse transkiberet fra en ressource, der beskrives. @da
label: merkinnän lähde @fi
definition: Liittää aineiston metatietoaineiston tietolähteeseen, joka on kuvailtavasta aineistosta transkriboitu rakenteistamaton kuvailu. @fi
label: hat Aufnahmequelle @de
definition: Setzt eine Ressource in Beziehung zu einer Informationsquelle für eine Metadatenressource, bei der es sich um eine unstrukturierte Beschreibung handelt, die aus einer beschriebenen Ressource transkribiert ist. @de
label: 有记录信息源 @zh-hans
definition: 将一种资源与一种元数据资源（即转录自被描述资源的非结构化描述）的一个信息源关联起来。 @zh-hans
label: rögzítési forrása a következő: @hu
definition: Hozzákapcsol egy forrást egy metaadatforrás adatforrásához, amely egy forrás leírásából átírt, struktúrálatlan leírás. @hu
label: kayıt kaynağı ile ilişkilidir @tr
definition: Bir kaynağı, açıklanan bir kaynaktan yazıya aktarılan yapılandırılmamış bir tanım olan üst veri kaynağı için bir bilgi kaynağıyla ilişkilendirir. @tr

has recordist
status: Published
definition: Relates a resource to an agent who contributes to a resource by using a recording device to capture sound or video during a recording session.
type: Property
sub property of: has contributor (Deprecated)
inverse of: is recordist of
lexical alias: recordist.en
label: har tonemester @da
definition: Relaterer en ressource til en agent, der har bidraget til en ressource ved at anvende et optageudstyr til lyd og/eller video under en optagelse, inkl. feltoptagelser af naturlige lyde, folkloristiske begivenheder, musik etc. @da
label: heeft opnamemaker @nl
label: aineiston taltioija @fi
label: له فني تسجيل @ar
definition: يربط مصدر بوكيل يُساهم في مصدر من خلال استخدام جهاز تسجيل لالتقاط صوت أو فيديو أثناء جلسة تسجيل. @ar
definition: Liittää aineiston toimijaan, joka on aineistossa osallisena käyttämällä tallennuslaitetta äänen tai videon taltioimiseen tallennustilanteessa. @fi
label: hat Tonmeisterin/Tonmeister @de
definition: Setzt eine Ressource in Beziehung zu einem Akteur, der zu einer Ressource beiträgt, indem er mit einem Aufnahmegerät Ton oder Video aufnimmt. @de
label: 有录制者 @zh-hans
definition: 将一种资源与通过采用录制设备在录制期间摄录声音或视频而对一种资源有贡献的一个行为者关联起来。 @zh-hans
label: rögzítője a következő: @hu
definition: Hozzákapcsol egy forrást egy ágenshez, amely hozzájárul egy forráshoz azzal, hogy felvevőkészülék használatával hangokat vagy videót rögzít egy felvételi munkamenet alatt. @hu
label: kayıt teknisyeni ile ilişkilidir @tr
definition: Bir kaynağı, bir kayıt oturumu sırasında ses veya görüntü kaydetmek için bir kayıt cihazı kullanarak bir kaynağa katkıda bulunan bir temsilci ile ilişkilendirir. @tr

is recordist of
status: Published
definition: Relates an agent to a resource that includes a contribution by an agent of using a recording device to capture sound or video during a recording session, including field recordings of natural sounds, folkloric events, music, or other performances.
type: Property
sub property of: is contributor of (Deprecated)
inverse of: has recordist
lexical alias: recordistOf.en
label: er tonemester for @da
definition: Relaterer en agent, der har bidraget til en ressource ved at anvende et optageudstyr til at fange lyd og/eller video under en optagelsessession, inkl. feltoptagelser af naturlige lyde, folkloristiske begivenheder, musik etc. til en ressource. @da
label: is opnamemaker van @nl
label: هو فني تسجيل لـ @ar
definition: يربط بين وكيل ومصدر يتضمن إسهام وكيل في استخدام جهاز تسجيل لالتقاط الصوت أو الفيديو أثناء جلسة تسجيل، بما في ذلك التسجيلات الخارجية للأصوات الطبيعية أو الأحداث الفولكلورية أو الموسيقى أو العروض الأخرى. @ar
label: taltioija (toimija) aineistossa @fi
definition: Liittää toimijan aineistoon, jossa toimija on osallisena käyttämällä tallennuslaitetta äänen tai videon taltioimiseen tallennustilanteessa. @fi
label: ist Tonmeisterin/Tonmeister von @de
definition: Setzt einen Akteur in Beziehung zu einer Ressource, zu der ein Akteur beiträgt, indem er mit einem Aufnamegerät Ton oder Video aufnimmt. Darunter fallen Field Recordings natürlicher Geräusche, folkloristische Events, Musik oder ähnliches. @de
label: 是……的录制者 @zh-hans
definition: 将一个行为者与包括通过采用录制设备在录制期间摄录声音或视频（包括自然声音、民俗活动、音乐或其他表演的现场录制）的一个行为者的贡献的一种资源关联起来。 @zh-hans
label: rögzítője a következőnek: @hu
definition: Hozzákapcsol egy ágenst egy forráshoz, amely magában foglalja az ágens közreműködését hang vagy videó rögzítését szolgáló felvevő eszköz használatában egy felvétel során, beleértve természetes hangokat, folklór eseményeket, zenét vagy más előadásokat is. @hu
label: ses kayıt teknisyenidir @tr
definition: Bir temsilciyi, doğal seslerin, folklorik olayların, müziğin veya diğer performansların saha kayıtları da dahil olmak üzere, bir kayıt oturumu sırasında ses veya video yakalamak için bir kayıt cihazı kullanan temsilcisinin katkısını içeren bir kaynakla ilişkilendirir. @tr

has reduction ratio
status: Published
definition: Relates a resource to a numerical ratio of the size of a micro-image in relation to an original from which it was produced.
type: Property
lexical alias: reductionRatio.en
label: har reduktionsforhold @da
definition: Relaterer en ressource til et numerisk forhold for størrelsen på et mikrobillede i forhold til den original, som det er fremstillet ud fra. @da
label: heeft verkleiningsfactor @nl
label: له معدل تصغير @ar
definition: يربط بين مصدر ونسبة عددية لحجم صورة مصغرة بالنسبة للأصل الذي انتجت منه. @ar
label: pienennyssuhde aineistossa @fi
definition: Liittää aineiston numeeriseen suhdelukuun, joka ilmaisee mikrokokoiseksi pienennetyn kuvan suhteen alkuperäiseen kuvaan, josta pienennetty kuva on tuotettu. @fi
label: hat Verkleinerungsfaktor @de
definition: Setzt eine Ressource in Beziehung zu einem Zahlenverhältnis zwischen der Größe eines Mikro-Bilds im Verhältnis zu dem Original, von dem es hergestellt wird. @de
label: 有缩率 @zh-hans
definition: 将一种资源与缩微图像尺寸和其所复制的原件之间的数值比关联起来。 @zh-hans
label: csökkentési aránya a következő: @hu
definition: Hozzákapcsol egy forrást egy mikrokép méretének számarányához az eredetihez viszonyítva, amelyből azt előállították. @hu
label: küçültme oranı ile ilişkilidir @tr
definition: Bir kaynağı, mikro görüntünün boyutunun üretildiği orijinal görüntüye göre sayısal oranıyla ilişkilendirir. @tr

has reduction ratio designation
status: Published
type: Property
lexical alias: reductionRatioDesignation.en
definition: Relates a resource to a general designation of the size of a micro-image in relation to an original from which it was produced.
label: har reduktionsforholdsbetegnelse @da
definition: Relaterer en ressource til en almindelig betegnelse for størrelsen på et mikrobillede i forhold til den original, som det er fremstillet ud fra. @da
label: heeft aanduiding verkleiningfactor @nl
label: له تسمية نسبة تصغير الصور @ar
definition: يربط بين مصدر وتسمية عامة لحجم الصورة المصغرة وعلاقتها بالأصل الذي تم إنتاجها منه. @ar
label: pienennyssuhteen määrite aineistolle @fi
definition: Liittää aineiston yleiseen määritteeseen, joka ilmaisee mikrokokoiseksi pienennetyn kuvan suhteen alkuperäiseen kuvaan, josta pienennetty kuva on tuotettu. @fi
label: hat Bezeichnung des Verkleinerungsfaktors @de
definition: Setzt eine Ressource in Beziehung zu einer allgemeinen Bezeichnung für die Größe eines Mikro-Bilds im Verhältnis zum Original, von dem es hergestellt wird. @de
label: 有缩率标识 @zh-hans
definition: 将一种资源与缩微图像尺寸和其所复制的原件之间关系的一般标识关联起来。 @zh-hans
label: csökkenési arányjelölése a következő: @hu
definition: Hozzákapcsol egy forrást egy általános megjelöléshez, amely a mikrokép méretének az eredetiből viszonyított számarányára vonatkozik, amelyből azt előállították. @hu
label: küçültme oranı tanımlaması ile ilişkilidir @tr
definition: Bir kaynağı, üretildiği bir orijinale göre bir mikro görüntünün boyutunun genel bir tanımıyla ilişkilendirir. @tr

has reference source
status: Published
lexical alias: referenceSource.en
definition: Relates a nomen to a resource which provides evidence for the use of a nomen.
type: Property
inverse of: is reference source of
label: heeft naslagwerk @nl
label: له مصدر مرجعي @ar
definition: يربط بين تسمية ومرجع يقدم دليل على استخدام تسمية. @ar
label: har referfencekilde @da
definition: Relaterer et nomen til en ressource, som giver evidens for brugen af et nomen. @da
label: tietolähde @fi
definition: Liittää nomenin aineistoon, joka antaa todisteen nomenin käytöstä. @fi
label: hat Nachschlagewerk @de
definition: Setzt ein Nomen in Beziehung zu einer Quelle, in der die Verwendung eines Nomens nachgewiesen wird. @de
label: 有参考信息源 @zh-hans
definition: 将一个命名与为一个命名的使用提供证据的一种资源关联起来。 @zh-hans
label: felhasznált forrása a következő: @hu
definition: Hozzákapcsol egy noment egy forráshoz, amelyben bizonyíték van egy nomen használatára. @hu
label: referans kaynağı ile ilişkilidir @tr
definition: Bir ismi, bir ismin kullanımına dair ipucu sağlayan bir kaynakla ilişkilendirir. @tr

has referential resource relationship with (Deprecate)
type: Property
lexical alias: referentialResourceRelationship.en
definition: Relates a resource to a resource that references a related resource. (Deprecated)
label: har henvisende ressourcerelation med @da
definition: Relaterer en ressource til en ressource der henviser til en anden ressource. @da
status: Deprecated
has subproperty: has commemoration
has subproperty: is commemoration of

has regional encoding
status: Published
definition: Relates a resource to a designation for one or more regions of the world for which a videodisc or video game carrier is encoded, indicating that playback is restricted to a device configured to decode it.
type: Property
sub property of: has digital file characteristic
lexical alias: regionalEncoding.en
label: har regional kodning @da
definition: Relaterer en ressource til en kode, der identificerer den region i verden, som en videodisc er kodet til, og som forhindrer, at videodiscen bliver spillet på en afspiller solgt i en anden region. @da
label: heeft regiocodering @nl
label: aineiston aluekoodi @fi
label: له كود منطقة @ar
definition: يربط بين مصدر وتسمية لواحدة أو أكثر من مناطق العالم التي تم تشفير حامل الفيديو أو ألعاب الفيديو، يشير إلى أن عملية التشغيل مقصورة على الأجهزة المكودة بكود المنطقة فقط. @ar
definition: Liittää aineiston yhteen tai useampaan nimettyyn alueeseen, joille video tai videopelitallenne on koodattu niin, että se on toistettavissa vain sen koodin avaamiseen konfiguroiduilla laitteilla. @fi
label: hat Regionalcode @de
definition: Setzt eine Ressource in Beziehung zu einer Bezeichnung, die die Region(en) der Welt angibt, für die eine Videodisk oder ein Videospiel-Datenträger kodiert ist, und der verhindert, dass die Disk von einem Wiedergabegerät, das in einer anderen Region verkauft wurde, abgespielt werden kann. @de
label: 有地区编码 @zh-hans
definition: 将一种资源与视盘或视频游戏载体被编码后表示对设置解码回放的设备限制的世界上一个或多个地区的标识关联起来。 @zh-hans
label: regionális kódolása a következő: @hu
definition: Hozzákapcsol egy forrást egy a világ egy vagy több régiójára vonatkozó jelöléshez, amelyre egy videólemezt vagy egy videójáték-hordozót kódoltak, jelezve hogy a visszajátszás annak dekódolására konfigurált készülékre korlátozódik. @hu
label: bölgesel kodlama ile ilişkilidir @tr
definition: Bir kaynağı, bir video diskin veya video oyunu taşıyıcısının kodlandığı, dünyanın bir veya daha fazla bölgesi için bir atama ile ilişkilendirir; bu, oynatmanın kodu çözülecek şekilde yapılandırılmış bir aygıtla sınırlı olduğunu gösterir. @tr

has regional version
status: Published
lexical alias: regionalVersion.en
definition: Relates a resource to a resource that is created by changing the regional audience of a resource.
type: Property
sub property of: has transformation by audience
label: heeft regionale versie @nl
label: له إصدارة إقليمية @ar
definition: يربط بين مصدر ومصدر تم إنشاؤه عن طريق تغيير الجمهور الإقليمي لمصدر. @ar
label: har regional version @da
definition: Relaterer en ressource til en ressource, der er skabt ved at ændre det regionale publikum for en ressource. @da
label: aineiston alueellinen versio @fi
definition: Liittää aineiston alueellista kohdeyleisöä muuttamalla luotuun versioon. @fi
label: hat Regionalversion @de
definition: Setzt eine Ressource in Beziehung zu einer Ressource, die durch Änderung der regionalen Zielgruppe einer Ressource geschaffen wird. @de
label: 有地区版本 @zh-hans
definition: 将一种资源与通过改变一种资源的地区受众而创建的一种资源关联起来。 @zh-hans
label: regionális változata a következő: @hu
definition: Hozzákapcsol egy forrást egy forráshoz, amely egy forrás regionális közönségének megváltozása következtében jött létre. @hu
label: bölgesel sürüm ile ilişkilidir @tr
definition: Bir kaynağı, bir kaynağın bölgesel kitlesini değiştirerek oluşturulan bir kaynakla ilişkilendirir. @tr

is regional version of
status: Published
lexical alias: regionalVersionOf.en
definition: Relates a resource to a resource that has a regional audience that is changed to create a resource.
type: Property
sub property of: is transformation by audience of
inverse of: has regional version
label: is regionale versie van @nl
label: هو إصدارة إقليمية لـ @ar
definition: يربط بين مصدر ومصدر له جمهور إقليمي تم تغييره لإنشاء مصدر. @ar
label: er regional version af @da
definition: Relaterer en ressource til en ressource, som har et regionalt publikum, der ændres for at skabe en ressource. @da
label: aineiston alueellinen versio @fi
definition: Liittää aineiston alueellista yleisöä muuttamalla luotuun versioon. @fi
label: ist Regionalversion von @de
definition: Setzt eine Ressource in Beziehung zu einer Ressource, deren regionale Zielgruppe geändert wird, um eine Ressource zu schaffen. @de
label: 是……的地区版本 @zh-hans
definition: 将一种资源与有地区受众并被改变以创建一种资源的一种资源关联起来。 @zh-hans
label: regionális változata a következőnek: @hu
definition: Hozzákapcsol egy forrást egy forráshoz, amelynek regionális közönsége megváltozott egy forrás létrejövetele érdekében. @hu
label: bölgesel sürümüdür @tr
definition: Bir kaynağı, bir kaynak oluşturmak için değiştirilen yerel bir kitleyi içeren kaynakla ilişkilendirir. @tr

has related agent of agent
status: Published
definition: Relates an agent to an agent who is associated with an agent.
type: Property
lexical alias: relatedAgentOfAgent.en
label: har relateret agent @da
definition: Relaterer en ressource til en agent, der er knyttet til en beskreven ressource. @da
alternative label: related agent
sub property of: has related entity of agent
label: heeft gerelateerde actor van actor @nl
label: له وكيل مرتبط بوكيل @ar
definition: يربط بين وكيل ووكيل مرتبط بوكيل. @ar
alternative label: وكيل ذو صلة @ar
label: toimijaan liittyvä toimija @fi
definition: Liittää toimijan toiseen toimijaan liittyvään toimijaan. @fi
alternative label: aineistoon liittyvä toimija @fi
label: hat mit Akteur in Beziehung stehenden Akteur @de
definition: Setzt einen Akteur in Beziehung zu einem Akteur, der mit einem Akteur in Verbindung steht. @de
alternative label: In Beziehung stehender Akteur @de
alternative label: 关联行为者 @zh-hans
label: 有行为者的关联行为者 @zh-hans
definition: 将一个行为者与和一个行为者有关的一个行为者关联起来。 @zh-hans
alternative label: kapcsolódó ágens: @hu
label: ágens kapcsolódó ágense a következő: @hu
definition: Hozzákapcsol egy ágenst egy ágenshez kapcsolódó ágenshez. @hu
has subproperty: has colleague
has subproperty: has enrolled student
has subproperty: has fellow student
has subproperty: has friend
has subproperty: has officer
has subproperty: is officer of
has subproperty: has student
has subproperty: is student at
has subproperty: has teacher
alternative label: İlişkili temsilci @tr
label: temsilcinin ilgili temsilcisi ile ilişkilidir @tr
definition: Bir temsilciyi, bir temsilciyle bağlantılı olan bir temsilciyle ilişkilendirir. @tr

has related agent of entity
status: Published
lexical alias: relatedAgentOfEntity.en
definition: Relates an entity to an agent who is associated with an entity.
type: Property
sub property of: has related entity of entity
inverse of: has related entity of agent
label: heeft gerelateerde actor van entiteit @nl
label: له وكيل مرتبط بكيان @ar
definition: يربط بين كيان ووكيل مرتبط بكيان. @ar
label: har relateret agent for entitet @da
definition: Relaterer en entitet til en agent, der er knyttet til en entiet. @da
label: entiteettiin liittyvä toimija @fi
definition: Liittää entiteetin toimijaan, joka liittyy entiteettiin. @fi
label: hat mit Entität in Beziehung stehenden Akteur @de
definition: Setzt eine Entität in Beziehung zu einem Akteur, der mit einer Entität in Verbindung steht. @de
label: 有实体的关联行为者 @zh-hans
definition: 将一个实体与和一个实体有关的一个行为者关联起来。 @zh-hans
label: entitás kapcsolódó ágense a következő: @hu
definition: Hozzákapcsol egy entitást egy ágenshez, amelyet egy entitáshoz társítanak. @hu
label: varlığın ilgili temsilcisi ile ilişkilidir @tr
definition: Bir varlığı, varlıkla bağlantılı olan bir temsilciyle ilişkilendirir. @tr

has related agent of nomen
status: Published
lexical alias: relatedAgentOfNomen.en
definition: Relates a nomen to an agent who is associated with a nomen.
type: Property
inverse of: has related nomen of agent
sub property of: has related entity of nomen
label: heeft gerelateerde actor van nomen @nl
label: له وكيل مرتبط بتسمية @ar
definition: يربط بين تسمية ووكيل مرتبط بتسمية. @ar
label: har relateret agent for nomen @da
definition: Relaterer et nomen til en agent, der er knyttet til et nomen. @da
label: nomeniin liittyvä toimija @fi
definition: Liittää nomenin toimijaan, joka liittyy nomeniin. @fi
label: hat mit Nomen in Beziehung stehenden Akteur @de
definition: Setzt ein Nomen in Beziehung zu einem Akteur, der mit einem Nomen in Verbindung steht. @de
label: 有命名的关联行为者 @zh-hans
definition: 将一个命名与和一个命名有关的一个行为者关联起来。 @zh-hans
label: nomen kapcsolódó ágense a következő: @hu
definition: Hozzákapcsol egy noment egy ágenshez, amelyet egy nomenhez társítanak. @hu
label: ismin ilgili temsilcisi ile ilişkilidir @tr
definition: Bir ismi, isimle bağlantılı olan bir temsilciyle ilişkilendirir. @tr

has related agent of place
status: Published
lexical alias: relatedAgentOfPlace.en
definition: Relates a place to an agent who is associated with a place.
type: Property
inverse of: has related place of agent
sub property of: has related entity of place
label: heeft gerelateerde actor van plaats @nl
label: له وكيل مرتبط بمكان @ar
definition: يربط بين مكان ووكيل مرتبط بمكان. @ar
label: har agent relateret til sted @da
definition: Relaterer et sted til en agent, der er knyttet til et sted. @da
label: paikkaan liittyvä toimija @fi
definition: Liittää paikkaan toimijan, joka liittyy paikkaan. @fi
label: hat mit Geografikum in Beziehung stehenden Akteur @de
definition: Setzt ein Geografikum in Beziehung zu einem Akteur, der mit einem Geografikum in Verbindung steht. @de
label: 有地点的相关行为者 @zh-hans
definition: 将一个地点与和一个地点有关的一个行为者关联起来。 @zh-hans
label: hely kapcsolódó ágense a következő: @hu
definition: Hozzákapcsol egy helyet egy ágenshez, amelyet egy helyhez társítanak. @hu
has subproperty: is place associated with agent of (Deprecated)
has subproperty: is place of birth of
has subproperty: is place of conference of
has subproperty: is place of death of
has subproperty: is place of residence of
label: yerin ilgili temsilcisi ile ilişkilidir @tr
definition: Bir yeri, yerle bağlantılı olan bir temsilciyle ilişkilendirir. @tr

has related agent of resource
status: Published
lexical alias: relatedAgentOfResource.en
definition: Relates a resource to an agent who is associated with a resource.
type: Property
inverse of: has related resource of agent
sub property of: has related entity of resource
label: heeft gerelateerde actor van resource @nl
label: له وكيل مرتبط بمصدر @ar
definition: يربط مصدر بوكيل مرتبط بمصدر. @ar
label: har relateret agent for ressource @da
definition: Relaterer en ressource til en agent, der er knyttet til en ressource. @da
label: aineistoon liittyvä toimija @fi
definition: Liittää aineiston toimijaan, joka liittyy aineistoon. @fi
label: hat mit Ressource in Beziehung stehenden Akteur @de
definition: Setzt eine Ressource in Beziehung zu einem Akteur, der mit einer Ressource in Verbindung steht. @de
label: 有资源的相关行为者 @zh-hans
definition: 将一种资源与和一种资源有关的一个行为者关联起来。 @zh-hans
label: forrás kapcsolódó ágense a következő: @hu
definition: Hozzákapcsol egy forrást egy ágenshez, amelyet egy forráshoz társítanak. @hu
has subproperty: has modifier
has subproperty: has papermaker
has subproperty: has platemaker
label: kaynağın ilgili temsilcisi ile ilişkilidir @tr
definition: Bir kaynağı, kaynakla bağlantılı olan bir temsilci ile ilişkilendirir. @tr

has related agent of timespan
status: Published
lexical alias: relatedAgentOfTimespan.en
definition: Relates a timespan to an agent who is associated with a timespan.
type: Property
inverse of: has related timespan of agent
sub property of: has related entity of timespan
label: heeft gerelateerde actor van tijdspanne @nl
label: له وكيل مرتبط بفترة زمنية @ar
definition: يربط بين فترة زمنية ووكيل مرتبط بفترة زمنية. @ar
label: har relateret agent til tidsforløb @da
definition: Relaterer et tidsforløb til en agent, der er knyttet til et tidsforløb. @da
label: ajanjaksoon liittyvä toimija @fi
definition: Liittää ajanjakson toimijaan, joka liittyy ajanjaksoon. @fi
label: hat mit Zeitraum in Beziehung stehenden Akteur @de
definition: Setzt einen Zeitraum in Beziehung zu einem Akteur, der mit einem Zeitraum in Verbindung steht. @de
label: 有时间段的相关行为者 @zh-hans
definition: 将一个时间段与和一个时间段有关的一个行为者关联起来。 @zh-hans
label: időtartam kapcsolódó ágense a következő: @hu
definition: Hozzákapcsol egy időtartamot egy ágenshez, amelyet egy időtartamhoz társítanak. @hu
has subproperty: is date associated with agent of (Deprecated)
label: zaman aralığının ilgili temsilcisi ile ilişkilidir @tr
definition: Bir zaman aralığını, zaman aralığıyla bağlantılı olan bir temsilciyle ilişkilendirir. @tr

has related entity of agent
status: Published
lexical alias: relatedEntityOfAgent.en
definition: Relates an agent to an entity that is associated with an agent.
type: Property
sub property of: has related entity of entity
inverse of: has related agent of entity
label: heeft gerelateerde entiteit van actor @nl
label: له كيان مرتبط بوكيل @ar
definition: يربط بين وكيل وكيان مرتبط بوكيل. @ar
label: har relateret entitet for agent @da
definition: Relaterer en agent til en entitet, der er knyttet til en agent. @da
label: toimijaan liittyvä entiteetti @fi
definition: Liittää toimijan entiteettiin, joka liittyy toimijaan. @fi
label: hat mit Akteur in Beziehung stehende Entität @de
definition: Setzt einen Akteur in Beziehung zu einer Entität, die mit einem Akteur in Verbindung steht. @de
label: 有行为者的关联实体 @zh-hans
definition: 将一个行为者与和一个行为者有关的一个实体关联起来。 @zh-hans
label: ágens kapcsolódó entitása a következő: @hu
definition: Hozzákapcsol egy ágenst egy entitáshoz, amelyet egy ágenshez társítanak. @hu
has subproperty: has related agent of agent
has subproperty: has related nomen of agent
label: temsilcinin ilgili varlığı ile ilişkilidir @tr
definition: Bir temsilciyi, temsilciyle bağlantılı olan bir varlıkla ilişkilendirir. @tr

has related entity of entity
status: Published
lexical alias: relatedEntityOfEntity.en
definition: Relates an entity to an entity that is associated with an entity.
type: Property
label: heeft gerelateerde entiteit van entiteit @nl
label: له كيان مرتبط بكيان @ar
definition: يربط بين كيان وكيان مرتبط بكيان. @ar
label: har relateret entitet for entitet @da
definition: Relaterer en entitet til en entiet, der er knyttet til en entitet. @da
label: entiteettiin liittyvä entiteetti @fi
definition: Liittää entiteetin entiteettiin, joka liittyy entiteettiin. @fi
label: hat mit Entität in Beziehung stehende Entität @de
definition: Setzt eine Entität in Beziehung zu einer Entität, die mit eine Entität in Verbindung steht. @de
label: 有实体的关联实体 @zh-hans
definition: 将一个实体与和一个实体有关的一个实体关联起来。 @zh-hans
label: entitás kapcsolódó entitása a következő: @hu
definition: Hozzákapcsol egy entitást egy entitáshoz, amelyet egy entitáshoz társítanak. @hu
has subproperty: has related agent of entity
has subproperty: has related entity of agent
has subproperty: has related entity of nomen
has subproperty: has related entity of place
has subproperty: has related entity of resource
has subproperty: has related entity of timespan
has subproperty: has related nomen of entity
has subproperty: has related place of agent
has subproperty: has related place of entity
has subproperty: has related resource of agent
has subproperty: has related resource of entity
has subproperty: has related timespan of agent
has subproperty: has related timespan of entity
label: varlığın ilgili varlığı ile ilişkilidir @tr
definition: Bir varlığı, varlıkla bağlantılı olan bir varlıkla ilişkilendirir. @tr

has related entity of nomen
status: Published
lexical alias: relatedEntityOfNomen.en
definition: Relates a nomen to an entity that is associated with a nomen.
type: Property
sub property of: has related entity of entity
inverse of: has related nomen of entity
label: heeft gerelateerde entiteit van nomen @nl
label: له كيان متعلق بتسمية @ar
definition: يربط بين تسمية وكيان مرتبط بتسمية @ar
label: har relateret entitet for nomen @da
definition: Relaterer et nomen til en entitet, der er knyttet til et nomen. @da
label: nomeniin liittyvä entiteetti @fi
definition: Liittää nomenin entiteettiin, joka liittyy nomeniin. @fi
label: hat mit Nomen in Beziehung stehende Entität @de
definition: Setzt ein Nomen in Beziehung zu einer Entität, die mit einem Nomen in Verbindung steht. @de
label: 有命名的关联实体 @zh-hans
definition: 将一个命名与和一个命名有关的一个实体关联起来。 @zh-hans
label: nomen kapcsolódó entitása a következő: @hu
definition: Hozzákapcsol egy noment egy entitáshoz, amelyet egy nomenhez társítanak. @hu
has subproperty: has related agent of nomen
has subproperty: has related nomen of nomen
has subproperty: has related place of nomen
has subproperty: has related resource of nomen
has subproperty: has related timespan of nomen
label: ismin ilgili varlığı ile ilişkilidir @tr
definition: Bir ismi, isimle bağlantılı olan bir varlıkla ilişkilendirir. @tr

has related entity of place
status: Published
lexical alias: relatedEntityOfPlace.en
definition: Relates a place to an entity that is associated with a place.
type: Property
sub property of: has related entity of entity
inverse of: has related place of entity
label: heeft gerelateerde entiteit van plaats @nl
label: له كيان متعلق بمكان @ar
definition: يربط بين مكان وكيان مرتبط بمكان. @ar
label: har relateret entitet for sted @da
definition: Relaterer et sted til en entitet, der er knyttet til et sted. @da
label: paikkaan liittyvä entiteetti @fi
definition: Liittää paikan entiteettiin, joka liittyy paikkaan. @fi
label: hat mit Geografikum in Beziehung stehende Entität @de
definition: Setzt ein Geografikum in Beziehung zu einer Entität, die mit einem Geografikum in Verbindung steht. @de
label: 有地点的关联实体 @zh-hans
definition: 将一个地点与和一个地点有关的一个实体关联起来。 @zh-hans
label: hely kapcsolódó entitása a következő: @hu
definition: Hozzákapcsol egy helyet egy entitáshoz, amelyet egy helyhez társítanak. @hu
has subproperty: has related agent of place
has subproperty: has related nomen of place
has subproperty: has related place of place
has subproperty: has related resource of place
has subproperty: has related timespan of place
label: yerin ilgili varlığı ile ilişkilidir @tr
definition: Bir yeri, yerle bağlantılı olan bir varlıkla ilişkilendirir. @tr

has related entity of resource
status: Published
lexical alias: relatedEntityOfResource.en
definition: Relates a resource to an entity that is associated with a resource.
type: Property
sub property of: has related entity of entity
inverse of: has related resource of entity
label: heeft gerelateerde entiteit van resource @nl
label: له كيان مرتبط بمصدر @ar
definition: يربط بين مصدر وكيان مرتبط بمصدر. @ar
label: har relateret entiet for ressource @da
definition: Relaterer en ressource til en entitet, der er knyttet til en ressource. @da
label: aineistoon liittyvä entiteetti @fi
definition: Liittää aineiston entiteettiin, joka liittyy aineistoon. @fi
label: hat mit Ressource in Beziehung stehende Entität @de
definition: Setzt eine Ressource in Beziehung zu einer Entität, die mit einer Ressource in Verbindung steht. @de
label: 有资源的关联实体 @zh-hans
definition: 将一种资源与和一种资源有关的一个实体关联起来。 @zh-hans
label: forrás kapcsolódó entitása a következő: @hu
definition: Hozzákapcsol egy forrást egy entitáshoz, amelyet egy forráshoz társítanak. @hu
has subproperty: has related agent of resource
has subproperty: has related nomen of resource
has subproperty: has related place of resource
has subproperty: heeft gerelateerde resource van resource
has subproperty: has related timespan of resource
label: kaynağın ilgili varlığı ile ilişkilidir @tr
definition: Bir kaynağı, bir kaynakla bağlantılı olan bir varlıkla ilişkilendirir. @tr

has related entity of timespan
status: Published
lexical alias: relatedEntityOfTimespan.en
definition: Relates a timespan to an entity that is associated with a timespan.
type: Property
sub property of: has related entity of entity
inverse of: has related timespan of entity
label: heeft gerelateerde entiteit van tijdspanne @nl
label: له كيان مرتبط بفترة زمنية @ar
definition: يربط بين فترة زمنية وكيان مرتبط بفترة زمنية @ar
label: har relateret entitet for tidsforløb @da
definition: Relaterer et tidsforløb til en entitet, der er knyttet til et tidsforløb. @da
label: ajanjaksoon liittyvä entiteetti @fi
definition: Liittää ajanjakson entiteettiin, joka liittyy ajanjaksoon. @fi
label: hat mit Zeitraum in Beziehung stehende Entität @de
definition: Setzt einen Zeitraum in Beziehung zu einer Entität, die mit einem Zeitraum in Verbindung steht. @de
label: 有时间段的关联实体 @zh-hans
definition: 将一个时间段与和一个时间段有关的一个实体关联起来。 @zh-hans
label: időtartam kapcsolódó entitása a következő: @hu
definition: Hozzákapcsol egy időtartamot egy entitáshoz, amelyet egy időtartamhoz társítanak. @hu
has subproperty: has related agent of timespan
has subproperty: has related nomen of timespan
has subproperty: has related place of timespan
has subproperty: has related resource of timespan
has subproperty: has related timespan of timespan
label: zaman aralığının ilgili varlığı ile ilişkilidir @tr
definition: Bir zaman aralığını, bir zaman aralığıyla bağlantılı olan bir varlıkla ilişkilendirir. @tr

has related nomen of agent
status: Published
lexical alias: relatedNomenOfAgent.en
definition: Relates an agent to a nomen that is associated with an agent.
type: Property
inverse of: has related agent of nomen
sub property of: has related entity of agent
label: heeft gerelateerde nomen van actor @nl
label: له تسمية مرتبطة بوكيل @ar
definition: يربط بين وكيل وتسمية مرتبطة بوكيل @ar
label: har relateret nomen for agent @da
definition: Relaterer en agent til et nomen der er knyttet til en agent. @da
label: toimijaan liittyvä nomen @fi
definition: Liittää toimijan nomeniin, joka liittyy toimijaan. @fi
label: hat mit Akteur in Beziehung stehendes Nomen @de
definition: Setzt einen Akteur in Beziehung zu einem Nomen, das mit einem Akteur in Verbindung steht. @de
label: 有行为者的关联命名。 @zh-hans
definition: 将一个行为者与和一个行为者有关的一个命名关联起来。 @zh-hans
definition: Relaciona un agent amb un nomen que s’associa amb un agent. @ca
label: ágens kapcsolódó nomenje a következő: @hu
definition: Hozzákapcsol egy ágenst egy nomenhez, amelyet egy ágenshez társítanak. @hu
label: temsilcinin ilgili ismi ile ile ilişkilidir @tr
definition: Bir temsilciyi, temsilciyle bağlantılı olan bir isimle ilişkilendirir. @tr

has related nomen of entity
status: Published
lexical alias: relatedNomenOfEntity.en
definition: Relates an entity to a nomen that is associated with an entity.
type: Property
sub property of: has related entity of entity
inverse of: has related entity of nomen
label: heeft gerelateerde nomen van entiteit @nl
label: له تسمية مرتبطة بكيان @ar
definition: يربط بين كيان وتسمية مرتبطة بكيان. @ar
label: har relateret nomen for entitet @da
definition: Relaterer en entiet til et nomen, som er knyttet til en entitet. @da
label: entiteettiin liittyvä nomen @fi
definition: Liittää entiteetin nomeniin, joka liittyy entiteettiin. @fi
label: hat mit Entität in Beziehung stehendes Nomen @de
definition: Setzt eine Entität in Beziehung zu einem Nomen, das mit einer Entität in Verbindung steht. @de
label: 有实体的关联命名 @zh-hans
definition: 将一个实体与和一个实体有关的一个命名关联起来。 @zh-hans
label: entitás kapcsolódó nomene a következő: @hu
definition: Hozzákapcsol egy entitást egy nomenhez, amelyet egy entitáshoz társítanak. @hu
label: varlığın ilgili ismi ile ilişkilidir @tr
definition: Bir varlığı, varlıkla bağlantılı olan bir isimle ilişkilendirir. @tr

has related nomen of nomen
status: Published
lexical alias: relatedNomenOfNomen.en
definition: Relates a nomen to a nomen that is associated with a nomen.
type: Property
sub property of: has related entity of nomen
label: heeft gerelateerde nomen van nomen @nl
label: له تسمية مرتبطة بتسمية @ar
definition: يربط بين تسمية وتسمية مرتبطة بتسمية @ar
label: har relateret nomen til nomen @da
definition: Relaterer et nomen til et nomen, som er knyttet til et nomen. @da
label: nomeniin liittyvä nomen @fi
definition: Liittää nomenin nomeniin, joka liittyy nomeniin. @fi
label: hat mit Nomen in Beziehung stehendes Nomen @de
definition: Setzt ein Nomen in Beziehung zu einem Nomen, das mit einem Nomen in Verbindung steht. @de
label: 有命名的关联命名 @zh-hans
definition: 将一个命名与和一个命名有关的一个命名关联起来。 @zh-hans
label: nomen kapcsolódó nomenje a következő: @hu
definition: Hozzákapcsol egy noment egy nomenhez, amelyet egy nomenhez társítanak. @hu
label: ismin ilgili ismi ile ilişkilidir @tr
definition: Bir ismi, isimle bağlantılı olan bir isimle ilişkilendirir. @tr

has related nomen of place
status: Published
lexical alias: relatedNomenOfPlace.en
definition: Relates a place to a nomen that is associated with a place.
type: Property
inverse of: has related place of nomen
sub property of: has related entity of place
label: heeft gerelateerde nomen van plaats @nl
label: له تسمية مرتبطة بمكان @ar
definition: يربط بين مكان وتسمية مرتبطة بمكان. @ar
label: har relateret nomen til sted @da
definition: Relaterer et sted til et nomen, som er knyttet til et sted. @da
label: paikkaan liittyvä nomen @fi
definition: Liittää paikan nomeniin, joka liittyy paikkaan. @fi
label: hat mit Geografikum in Beziehung stehendes Nomen @de
definition: Setzt ein Geografikum in Beziehung zu einem Nomen, das mit einem Geografikum in Verbindung steht. @de
label: 有地点的关联命名 @zh-hans
definition: 将一个地点与和一个地点有关的一个命名关联起来。 @zh-hans
label: hely kapcsolódó nomenje a következő: @hu
definition: Hozzákapcsol egy helyet egy nomenhez, amelyet egy helyhez társítanak. @hu
label: yerin ilgili ismi ile ilişkilidir @tr
definition: Bir yeri, yerle bağlantılı olan bir isimle ilişkilendirir. @tr

has related nomen of resource
status: Published
lexical alias: relatedNomenOfResource.en
definition: Relates a resource to a nomen that is associated with a resource.
type: Property
inverse of: has related resource of nomen
sub property of: has related entity of resource
label: heeft gerelateerde nomen van resource @nl
label: له تسمية مرتبطة بمصدر @ar
definition: يربط بين مصدر وتسمية مرتبطة بمصدر. @ar
label: har relateret nomen for ressource @da
definition: Relaterer en ressource til et nomen, som er knyttet til en ressource. @da
label: aineistoon liittyvä nomen @fi
definition: Liittää aineiston nomeniin, joka liittyy aineistoon. @fi
label: hat mit Ressource in Beziehung stehendes Nomen @de
definition: Setzt eine Ressource in Beziehung zu einem Nomen, das mit einer Ressource in Verbindung steht. @de
label: 有资源的关联命名 @zh-hans
definition: 将一种资源与和一种资源有关的一个命名关联起来。 @zh-hans
label: forrás kapcsolódó nomenje a következő: @hu
definition: Hozzákapcsol egy forrást egy nomenhez, amelyet egy forráshoz társítanak. @hu
has subproperty: has key title
has subproperty: has name of agent of resource
label: kaynağın ilgili ismi ile ilişkilidir @tr
definition: Bir kaynağı, kaynakla bağlantılı olan bir isimle ilişkilendirir. @tr

has related nomen of timespan
status: Published
lexical alias: relatedNomenOfTimespan.en
definition: Relates a timespan to a nomen that is associated with a timespan.
type: Property
inverse of: has related timespan of nomen
sub property of: has related entity of timespan
label: heeft gerelateerde nomen van tijdspanne @nl
label: له تسمية مرتبطة بفترة زمنية @ar
definition: يربط بين فترة زمنية وتسمية مرتبطة بفترة زمنية. @ar
label: har relateret @da
definition: Relaterer et tidsforløb til et nomen, som er knyttet til et tidsforløb. @da
label: ajanjaksoon liittyvä nomen @fi
definition: Nomen, joka liittyy ajanjaksoon. @fi
label: hat mit Zeitraum in Beziehung stehendes Nomen @de
definition: Setzt einen Zeitraum in Beziehung zu einem Nomen, das mit einem Zeitraum in Verbindung steht. @de
label: 有时间段的关联命名。 @zh-hans
definition: 将一个时间段与和一个时间段有关的一个命名关联起来。 @zh-hans
label: időtartam kapcsolódó nomenje a következő: @hu
definition: Hozzákapcsol egy időtartamot egy nomenhez, amelyet egy időtartamhoz társítanak. @hu
label: zaman aralığının ilgili ismi ile ilişkilidir @tr
definition: Bir zaman aralığını, zaman aralığıyla bağlantılı olan bir isimle ilişkilendirir. @tr

has related place of agent
status: Published
lexical alias: relatedPlaceOfAgent.en
definition: Relates an agent to a place that is associated with an agent.
type: Property
inverse of: has related agent of place
sub property of: has related entity of entity
label: heeft gerelateerde plaats van actor @nl
label: له مكان مرتبط بوكيل @ar
definition: يربط بين وكيل ومكان مرتبط بوكيل @ar
label: har relateret sted for agent @da
definition: Relaterer en agent til et sted, der er knyttet til en agent. @da
label: toimijaan liittyvä paikka @fi
definition: Liittää toimijan paikkaan, joka liittyy toimijaan. @fi
label: hat mit Akteur in Beziehung stehendes Geografikum @de
definition: Setzt einen Akteur in Beziehung zu einem Geografikum, das mit einem Akteur in Verbindung steht. @de
label: 有行为者的关联地点 @zh-hans
definition: 将一个行为者与和一个行为者有关的一个地点关联起来。 @zh-hans
label: ágens kapcsolódó helye a következő: @hu
definition: Hozzákapcsol egy ágenst egy helyhez, amelyet egy ágenshez társítanak. @hu
has subproperty: has place governed
has subproperty: has place associated with agent (Deprecated)
has subproperty: has place of birth
has subproperty: has place of conference
has subproperty: has place of death
has subproperty: has place of residence
label: temsilcinin ilgili yeri ile ilişkilidir @tr
definition: Bir temsilciyi, temsilciyle bağlantılı olan bir yerle ile ilişkilendirir. @tr

has related place of entity
status: Published
lexical alias: relatedPlaceOfEntity.en
definition: Relates an entity to a place that is associated with an entity.
type: Property
sub property of: has related entity of entity
inverse of: has related entity of place
label: heeft gerelateerde plaats van entiteit @nl
label: له مكان مرتبط بكيان @ar
definition: يربط بين كيان ومكان مرتبط بكيان. @ar
label: har relateret sted for entitet @da
definition: Relaterer en entiet til et sted, der er knyttet til en entitet. @da
label: entiteettiin liittyvä paikka @fi
definition: Liittää entiteetin paikkaan, joka liittyy entiteettiin. @fi
label: hat mit Entität in Beziehung stehendes Geografikum @de
definition: Setzt eine Entität in Beziehung zu einem Geografikum, das mit einer Entität in Verbindung steht. @de
label: 有实体的关联地点 @zh-hans
definition: 将一个实体与和一个实体有关的一个地点关联起来。 @zh-hans
label: entitás kapcsolódó helye a következő: @hu
definition: Hozzákapcsol egy entitást egy helyhez, amelyet egy entitáshoz társítanak. @hu
label: varlığın ilgili yeri ile ilişkilidir @tr
definition: Bir varlığı, varlıkla bağlantılı olan bir yerle ilişkilendirir. @tr

has related place of nomen
status: Published
lexical alias: relatedPlaceOfNomen.en
definition: Relates a nomen to a place that is associated with a nomen.
type: Property
inverse of: has related nomen of place
sub property of: has related entity of nomen
label: heeft gerelateerde plaats van nomen @nl
label: له مكان مرتبط بتسمية @ar
definition: يربط بين تسمية ومكان مرتبط بتسمية. @ar
label: har relateret sted for nomen @da
definition: Relaterer et nomen til et sted der er knyttet til et nomen. @da
label: nomeniin liittyvä paikka @fi
definition: Liittää nomenin paikkaan, joka liittyy nomeniin. @fi
label: hat mit Nomen in Beziehung stehendes Geografikum @de
definition: Setzt ein Nomen in Beziehung zu einem Geografikum, das mit einem Nomen in Verbindung steht. @de
label: 有命名的关联地点 @zh-hans
definition: 将一个地点与和一个命名有关的一个地点关联起来。 @zh-hans
label: nomen kapcsolódó helye a következő: @hu
definition: Hozzákapcsol egy noment egy helyhez, amelyet egy nomenhez társítanak. @hu
label: ismin ilgili yeri ile ilişkilidir @tr
definition: Bir ismi, isimle bağlantılı olan bir yerle ilişkilendirir. @tr

has related place of place
status: Published
lexical alias: relatedPlaceOfPlace.en
definition: Relates a place to a place that is associated with a place.
type: Property
sub property of: has related entity of place
label: heeft gerelateerde plaats van plaats @nl
label: له مكان مرتبط بمكان @ar
definition: يربط بين مكان ومكان مرتبط بمكان. @ar
label: har relateret sted for sted @da
definition: Relaterer et sted til et sted, der er knyttet til et sted. @da
label: paikkaan liittyvä paikka @fi
definition: Liittää paikan paikkaan, joka liittyy paikkaan. @fi
label: hat mit Geografikum in Beziehung stehendes Geografikum @de
definition: Setzt ein Geografikum in Beziehung zu einem Geografikum, das mit einem Geografikum in Verbindung steht. @de
label: 有地点的关联地点 @zh-hans
definition: 将一个地点与和一个地点有关的一个地点关联起来。 @zh-hans
label: hely kapcsolódó helye a következő: @hu
definition: Hozzákapcsol egy helyet egy helyhez, amelyet egy helyhez társítanak. @hu
has subproperty: is part of place
has subproperty: has part place
label: yerin ilgili yeri ile ilişkilidir @tr
definition: Bir yeri, bir yerle bağlantılı olan bir yer ile ilişkilendirir. @tr

has related place of resource
status: Published
lexical alias: relatedPlaceOfResource.en
definition: Relates a resource to a place that is associated with a resource.
type: Property
inverse of: has related resource of place
sub property of: has related entity of resource
label: heeft gerelateerde plaats van resource @nl
label: له مكان مرتبط بمصدر @ar
definition: يربط بين مصدر ومكان مرتبط بمصدر. @ar
label: har relateret sted for ressource @da
definition: Relaterer en ressource til et sted, der er knyttet til en ressource. @da
label: aineistoon liittyvä paikka @fi
definition: Liittää aineiston paikkaan, joka liittyy aineistoon. @fi
label: hat mit Ressource in Beziehung stehendes Geografikum @de
definition: Setzt eine Ressource in Beziehung zu einem Geografikum, das mit einer Ressource in Verbindung steht. @de
label: 有资源的相关地点 @zh-hans
definition: 将一种资源与和一种资源有关的一个地点关联起来。 @zh-hans
label: forrás kapcsolódó helye a következő: @hu
definition: Hozzákapcsol egy forrást egy helyhez, amelyet egy forráshoz társítanak. @hu
has subproperty: has place associated with resource (Deprecated)
has subproperty: has place of capture
has subproperty: has place of distribution
has subproperty: has place of manufacture
has subproperty: has place of origin of resource
has subproperty: has place of production
has subproperty: has place of publication
has subproperty: has place of resource
has subproperty: is location of collection of
has subproperty: is location of resource of
label: kaynağın ilgili yeri ile ilişkilidir @tr
definition: Bir kaynağı, kaynakla bağlantılı bir yerle ilişkilendirir. @tr

has related place of timespan
status: Published
lexical alias: relatedPlaceOfTimespan.en
definition: Relates a timespan to a place that is associated with a timespan.
type: Property
inverse of: has related timespan of place
sub property of: has related entity of timespan
label: heeft gerelateerde plaats van tijdspanne @nl
label: له مكان مرتبط بفترة زمنية @ar
definition: يربط بين فترة زمنية ومكان مرتبط بفترة زمنية. @ar
label: har relateret sted for tidsforløb @da
definition: Relaterer et tidsforløb til et sted, der er knyttet til et tidsforløb. @da
label: ajanjaksoon liittyvä paikka @fi
definition: Liittää ajanjakson paikkaan, joka liittyy ajanjaksoon. @fi
label: hat mit Zeitraum in Beziehung stehendes Geografikum @de
definition: Setzt einen Zeitraum in Beziehung zu einem Geografikum, das mit einem Zeitraum in Verbindung steht. @de
label: 有时间段的关联地点 @zh-hans
definition: 将一个时间段与和一个时间段有关的一个地点关联起来。 @zh-hans
label: időtartam kapcsolódó helye a következő: @hu
definition: Hozákapcsol egy időtartamot egy helyhez, amelyet egy időtartamhoz társítanak. @hu
label: zaman aralığının ilgili yeri ile ilişkilidir @tr
definition: Bir zaman aralığını, zaman aralığıyla bağlantılı olan bir yerle ilişkilendirir. @tr

has related resource of agent
status: Published
lexical alias: relatedResourceOfAgent.en
definition: Relates an agent to resource that is associated with an agent.
type: Property
inverse of: has related agent of resource
sub property of: has related entity of entity
label: heeft gerelateerde resource van actor @nl
label: له مصدر مرتبط بوكيل @ar
definition: يربط بين وكيل ومصدر مرتبط بوكيل. @ar
label: har relateret ressource til agent @da
definition: Relaterer en agent til en ressource, der er knyttet til en agent. @da
label: toimijaan liittyvä aineisto @fi
definition: Liittää toimijan aineistoon, joka liittyy toimijaan. @fi
label: hat mit Akteur in Beziehung stehende Ressource @de
definition: Setzt einen Akteur in Beziehung zu einer Ressource, die mit einem Akteur in Verbindung steht. @de
label: 有行为者的相关资源 @zh-hans
definition: 将一个行为者与和一个行为者有关的一种资源关联起来。 @zh-hans
label: ágens kapcsolódó forrása a következő: @hu
definition: Hozzákapcsol egy ágenst egy forráshoz, amelyet egy ágenshez társítanak. @hu
has subproperty: is modifier of
has subproperty: is papermaker of
has subproperty: is platemaker of
label: temsilcinin ilgili kaynağı ile ilişkilidir @tr
definition: Bir temsilciyi, temsilciyle bağlantılı olan bir kaynakla ilişkilendirir. @tr

has related resource of entity
status: Published
lexical alias: relatedResourceOfEntity.en
definition: Relates an entity to a resource that is associated with an entity.
type: Property
sub property of: has related entity of entity
inverse of: has related entity of resource
label: heeft gerelateerde resource van entiteit @nl
label: له مصدر مرتبط بكيان @ar
definition: يربط بين كيان ومصدر مرتبط بكيان. @ar
label: har relateret ressource for entitet @da
definition: Relaterer en entitet til en ressource, der er knyttet til en entitet. @da
label: entiteettiin liittyvä aineisto @fi
definition: Liittää entiteetin aineistoon, joka liittyy entiteettiin. @fi
label: hat mit Entität in Beziehung stehende Ressource @de
definition: Setzt eine Entität in Beziehung zu einer Ressource, die mit einer Entität in Verbindung steht. @de
label: 有实体的关联资源 @zh-hans
definition: 将一个身体与和一个实体有关的一种资源关联起来。 @zh-hans
label: entitás kapcsolódó forrása a következő: @hu
definition: Hozzákapcsol egy entitást egy forráshoz, amelyet egy entitáshoz társítanak. @hu
label: varlığın ilgili kaynağı ile ilişkilidir @tr
definition: Bir varlığı, varlıkla bağlantılı olan bir kaynakla ilişkilendirir. @tr

has related resource of nomen
status: Published
lexical alias: relatedResourceOfNomen.en
definition: Relates a nomen to a resource that is associated with a nomen.
type: Property
inverse of: has related nomen of resource
sub property of: has related entity of nomen
label: heeft gerelateerde resource van nomen @nl
label: له مصدر مرتبط بتسمية @ar
definition: يربط تسمية بمصدر مرتبط بتسمية. @ar
label: har relateret ressource for nomen @da
definition: Relaterer et nomen til en ressource, der er knyttet til et nomen. @da
label: nomeniin liittyvä aineisto @fi
definition: Liittää nomenin aineistoon, joka liittyy nomeniin. @fi
label: hat mit Nomen in Beziehung stehende Ressource @de
definition: Setzt ein Nomen in Beziehung zu einer Ressource, die mit einem Nomen in Verbindung steht. @de
label: 有命名的关联资源 @zh-hans
definition: 将一个命名与和一个命名有关的一种资源关联起来。 @zh-hans
label: nomen kapcsolódó forrása a következő: @hu
definition: Hozzákapcsol egy noment egy forráshoz, amelyet egy nomenhez társítanak. @hu
has subproperty: is key title of
has subproperty: is name of agent of resource of
has subproperty: is first alphanumeric designation of sequence of
has subproperty: is first chronological designation of sequence of
has subproperty: is last alphanumeric designation of sequence of
has subproperty: is last chronological designation of sequence of
has subproperty: is numbering within sequence of
definition: Relaciona un nomen amb un recurs que s’associa amb un nomen. @ca
label: ismin ilgili kaynağı ile ilişkilidir @tr
definition: Bir ismi, isimle bağlantılı olan bir kaynakla ilişkilendirir. @tr

has related resource of place
status: Published
lexical alias: relatedResourceOfPlace.en
definition: Relates a place to a resource that is associated with a place.
type: Property
inverse of: has related place of resource
sub property of: has related entity of place
label: heeft gerelateerde resource van plaats @nl
label: له مصدر مرتبط بمكان @ar
definition: يربط مكان بمصدر مرتبط بمكان. @ar
label: har relateret ressource for sted @da
definition: Relaterer et sted til en ressource, der er knyttet til et sted. @da
label: paikkaan liittyvä aineisto @fi
definition: Liittää paikan aineistoon, joka liittyy paikkaan. @fi
label: hat mit Geografikum in Beziehung stehende Ressource @de
definition: Setzt ein Geografikum in Beziehung zu einer Ressource, die mit einem Geografikum in Verbindung steht. @de
label: 有地点的相关资源 @zh-hans
definition: 将一个地点与和一个地点有关的一种资源关联起来。 @zh-hans
label: hely kapcsolódó forrása a következő: @hu
definition: Hozzákapcsol egy helyet egy forráshoz, amelyet egy helyhez társítanak. @hu
has subproperty: is place associated with resource of (Deprecated)
has subproperty: is place of capture of
has subproperty: is place of distribution of
has subproperty: is place of manufacture of
has subproperty: is place of origin of resource of
has subproperty: is place of production of
has subproperty: is place of publication of
has subproperty: is coordinates of cartographic content of
has subproperty: is place of resource of
has subproperty: has location of collection
has subproperty: has location of resource
definition: Relaciona un lloc amb un recurs que s’associa amb un lloc. @ca
label: yerin ilgili kaynağı ile ilişkilidir @tr
definition: Bir yeri, bir yerle bağlantılı olan kaynakla ilişkilendirir. @tr

heeft gerelateerde resource van resource
type: Property
alternative label: related resource
definition: Relates a resource to a resource that is associated with a resource.
sub property of: has related entity of resource
lexical alias: relatedResourceOfResource.en
status: Published
label: له مصدر مرتبط بمصدر @ar
definition: يربط بين مصدر ومصدر مرتبط بمصدر. @ar
alternative label: مصدر ذو صلة @ar
alternative label: liittyvä aineisto @fi
definition: Liittää aineiston siihen yhdistettyyn aineistoon @fi
label: hat mit Ressource in Beziehung stehende Ressource @de
definition: Setzt eine Ressource in Beziehung zu einer Ressource, die mit einer Ressource in Verbindung steht. @de
alternative label: In Beziehung stehende Ressource @de
label: aineistoon liittyvä aineisto @fi
alternative label: 相关资源 @zh-hans
definition: 将一种资源与和一种资源有关的一种资源关联起来。 @zh-hans
alternative label: recurs relacionat @ca
definition: Relaciona un recurs amb un recurs que s’associa amb un recurs @ca
alternative label: kapcsolódó forrás: @hu
label: kapcsolódó forrása a következő forrásnak: @hu
definition: Hozzákapcsol egy forrást egy forráshoz, amely egy forráshoz kapcsolódik. @hu
has subproperty: has binding of resource
has subproperty: is binding of resource of
has subproperty: has concordance
has subproperty: is concordance for
has subproperty: has index
has subproperty: is index for
has subproperty: has transformation
has subproperty: is transformation of
has subproperty: has holding
has subproperty: is holding of
has subproperty: is on resource with
alternative label: İlişkili kaynak @tr
definition: Bir kaynağı, bir kaynakla ilişkilendirilmiş bir kaynakla ilişkilendirir. @tr

has related resource of timespan
status: Published
lexical alias: relatedResourceOfTimespan.en
definition: Relates a timespan to a resource that is associated with a timespan.
type: Property
inverse of: has related timespan of resource
sub property of: has related entity of timespan
label: heeft gerelateerde resource van tijdspanne @nl
label: له مصدر مرتبط بفترة زمنية @ar
definition: يربط بين فترة زمنية ومصدر مرتبط بفترة زمنية. @ar
label: har relateret ressource for tidsforløb @da
definition: Relaterer et tidsforløb til en ressource, der er knyttet til et tidsforløb. @da
label: ajanjaksoon liittyvä aineisto @fi
definition: Liittää ajanjakson aineistoon, joka liittyy ajanjaksoon. @fi
label: hat mit Zeitraum in Beziehung stehende Ressource @de
definition: Setzt einen Zeitraum in Beziehung zu einer Ressource, die mit einem Zeitraum in Verbindung steht. @de
label: 有时间段的相关资源 @zh-hans
definition: 将一个时间段与和一个时间段有关的一种资源关联起来。 @zh-hans
label: időtartam kapcsolódó forrása a következő: @hu
definition: Hozzákapcsol egy időtartamot egy forráshoz, amelyet egy időtartamhoz társítanak. @hu
has subproperty: is date of capture of
has subproperty: is date of distribution of
has subproperty: is date of manufacture of
has subproperty: is date of production of
has subproperty: is date of publication of
has subproperty: is date of resource of
label: zaman aralığının ilgili kaynağı ile ilişkilidir @tr
definition: Bir zaman aralığını, bir zaman aralığyla bağlantılı olan bir kaynakla ilişkilendirir. @tr

has related timespan of agent
status: Published
lexical alias: relatedTimespanOfAgent.en
definition: Relates an agent to a timespan that is associated with an agent.
type: Property
inverse of: has related agent of timespan
sub property of: has related entity of entity
label: heeft gerelateerde tijdspanne van actor @nl
label: له فترة زمنية مرتبطة بوكيل @ar
definition: يربط بين وكيل وفترة زمنية مرتبطة بوكيل. @ar
label: har relateret tidsforløb for agent @da
definition: Relaterer en agent til et tidsforløb, der er knyttet til en agent. @da
label: toimijaan liittyvä ajanjakso @fi
definition: Liittää toimijan ajanjaksoon, joka liittyy toimijaan. @fi
label: hat mit Akteur in Beziehung stehenden Zeitraum @de
definition: Setzt einen Akteur in Beziehung zu einem Zeitraum, der mit einem Akteur in Verbindung steht. @de
label: 有行为者的关联时间段 @zh-hans
definition: 将一个行为者与和一个行为者有关的一个时间段关联起来。 @zh-hans
label: ágens kapcsolódó időtartama a következő: @hu
definition: Hozzákapcsol egy ágenst egy időtartamhoz, amelyet egy ágenshez társítanak. @hu
label: temsilcinin ilgili zaman aralığı ile ilişkilidir @tr
definition: Bir temsilciyi, temsilciyle bağlantılı olan bir zaman aralığıyla ilişkilendirir. @tr

has related timespan of entity
status: Published
lexical alias: relatedTimespanOfEntity.en
definition: Relates an entity to a timespan that is associated with an entity.
type: Property
sub property of: has related entity of entity
inverse of: has related entity of timespan
label: heeft gerelateerde tijdspanne van entiteit @nl
label: له فترة زمنية مرتبطة بكيان @ar
definition: يربط بين كيان وفترة زمنية مرتبطة بكيان. @ar
label: har relateret tidsforløb for entitet @da
definition: Relaterer en entitet til et tidsforløb, der er knyttet til en entitet. @da
label: entiteettiin liittyvä ajanjakso @fi
definition: Liittää entiteetin ajanjaksoon, joka liittyy entiteettiin. @fi
label: hat mit Entität in Beziehung stehenden Zeitraum @de
definition: Setzt eine Entität in Beziehung zu einem Zeitraum, der mit einer Entität in Verbindung steht. @de
label: 有实体的关联时间段 @zh-hans
definition: 将一个实体与和一个实体有关的一个时间段关联起来。 @zh-hans
label: entitás kapcsolódó időtartama a következő: @hu
definition: Hozzákapcsol egy entitást egy időtartamhoz, amelyet egy entitáshoz társítanak. @hu
label: varlığın ilgili zaman aralığı ile ilişkilidir @tr
definition: Bir varlığı, varlıkla bağlantılı olan bir zaman aralığıyla ilişkilendirir. @tr

has related timespan of nomen
status: Published
lexical alias: relatedTimespanOfNomen.en
definition: Relates a nomen to a timespan that is associated with a nomen.
type: Property
inverse of: has related nomen of timespan
sub property of: has related entity of nomen
label: heeft gerelateerde tijdspanne van nomen @nl
label: له فترة زمنية مرتبطة بتسمية @ar
definition: ييربط تسمية بفترة زمنية مرتبطة بتسمية @ar
label: har relateret tidsforløb for nomen @da
definition: Relaterer et nomen til et tidsforløb, der er knyttet til et nomen. @da
label: nomeniin liittyvä ajanjakso @fi
definition: Liittää nomenin ajanjaksoon, joka liittyy nomeniin. @fi
label: hat mit Nomen in Beziehung stehenden Zeitraum @de
definition: Setzt ein Nomen in Beziehung zu einem Zeitraum, der mit einem Nomen in Verbindung steht. @de
label: 有命名的关联时间段 @zh-hans
definition: 将一个命名与和一个命名有关的一个时间段关联起来。 @zh-hans
label: nomen kapcsolódó időtartama a következő: @hu
definition: Hozzákapcsol egy noment egy időtartamhoz, amelyet egy nomenhez társítanak. @hu
label: ismin ilgili zaman aralığı ile ilişkilidir @tr
definition: Bir ismi, isimle bağlantılı olan bir zaman aralığıyla ilişkilendirir. @tr

has related timespan of place
status: Published
lexical alias: relatedTimespanOfPlace.en
definition: Relates a place to a timespan that is associated with a place.
type: Property
inverse of: has related place of timespan
sub property of: has related entity of place
label: heeft gerelateerde tijdspanne van plaats @nl
label: له فترة زمنية مرتبطة بمكان @ar
definition: يربط بين مكان وفترة زمنية مرتبطة بمكان. @ar
label: har relateret tidsforløb for sted @da
definition: Relaterer et sted til et tidsforløb, der er knyttet til et sted. @da
label: paikkaan liittyvä ajanjakso @fi
definition: Liittää paikan ajanjaksoon, joka liittyy paikkaan. @fi
label: hat mit Geografikum in Beziehung stehenden Zeitraum @de
definition: Setzt ein Geografikum in Beziehung zu einem Zeitraum, der mit einem Geografikum in Verbindung steht. @de
label: 有地点的关联时间段 @zh-hans
definition: 将一个地点与和一个地点有关的一个时间段关联起来。 @zh-hans
label: hely kapcsolódó időtartama a következő: @hu
definition: Hozzákapcsol egy helyet egy időtartamhoz, amelyet egy helyhez társítanak. @hu
label: yerin ilgili zaman aralığı ile ilişkilidir @tr
definition: Bir yeri, bir yerle bağlantılı olan bir zaman aralığıyla ilişkilendirir. @tr

has related timespan of resource
status: Published
lexical alias: relatedTimespanOfResource.en
definition: Relates a resource to a timespan that is associated with a resource.
type: Property
inverse of: has related resource of timespan
sub property of: has related entity of resource
label: heeft gerelateerde tijdspanne van resource @nl
label: له فترة زمنية مرتبطة بمصدر @ar
definition: يربط بين مصدر وفترة زمنية مرتبطة بمصدر. @ar
label: har relateret tidsforløb for ressource @da
definition: Relaterer en ressource til et tidsforløb, der er knyttet til en ressource. @da
label: aineistoon liittyvä ajanjakso @fi
definition: Liittää aineiston ajanjaksoon, joka liittyy aineistoon. @fi
label: hat mit Ressource in Beziehung stehenden Zeitraum @de
definition: Setzt eine Ressource in Beziehung zu einem Zeitraum, der mit einer Ressource in Verbindung steht. @de
label: 有资源的关联时间段 @zh-hans
definition: 将一种资源与和一种资源有关的一个时间段关联起来。 @zh-hans
label: forrás kapcsolódó időtartama a következő: @hu
definition: Hozzákapcsol egy forrást egy időtartamhoz, amelyet egy forráshoz társítanak. @hu
has subproperty: has date associated with agent (Deprecated)
has subproperty: has date of distribution
has subproperty: has date of manufacture
has subproperty: has date of production
has subproperty: has date of publication
has subproperty: has date of resource
label: kaynağın ilgili zaman aralığı ile ilişkilidir @tr
definition: Bir kaynağı, kaynakla bağlantılı bir zaman aralığıyla ilişkilendirir. @tr

has related timespan of timespan
status: Published
lexical alias: relatedTimespanOfTimespan.en
definition: Relates a timespan to a timespan that is associated with a timespan.
type: Property
sub property of: has related entity of timespan
label: heeft gerelateerde tijdspanne van tijdspanne @nl
label: له فترة زمنية مرتبطة بفترة زمنية @ar
definition: يربط بين فترة زمنية وفترة زمنية مرتبطة بفترة زمنية. @ar
label: har relateret tidsforløb for tidsforløb @da
definition: Relaterer et tidsforløb til et tidsforløb, der er knyttet til et tidsforløb. @da
label: ajanjaksoon liittyvä ajanjakso @fi
definition: Liittää ajanjakson ajanjaksoon, joka liittyy ajanjaksoon. @fi
label: hat mit Zeitraum in Beziehung stehenden Zeitraum @de
definition: Setzt einen Zeitraum in Beziehung mit einem Zeitraum, der mit einem Zeitraum in Verbindung steht. @de
label: 有时间段的关联时间段 @zh-hans
definition: 将一个时间段与和一个时间段有关的一个时间段关联起来。 @zh-hans
label: időtartam kapcsolódó időtartama a következő: @hu
definition: Hozzákapcsol egy időtartamot egy időtartamhoz, amelyet egy időtartamhoz társítanak. @hu
has subproperty: is part of timespan
has subproperty: has part timespan
label: zaman aralığının ilgili zaman aralığı ile ilişkilidir @tr
definition: Bir zaman aralığını, zaman aralığıyla bağlantılı olan bir zaman aralığıyla ilişkilendirir. @tr

has relief representation
status: Published
type: Property
definition: Relates a resource to a cartographic representation of the surface forms of the earth or other celestial body, real or imaginary, by means of special graphic methods.
alternative label: has relief type
lexical alias: reliefRepresentation.en
label: heeft reliëftype @nl
label: له نوع بارز @ar
definition: يربط بين مصدر وطريقة تشير إلى الأبعاد الأفقية والرأسية لسطح الأرض وتضاريسها. @ar
label: har relieftype @da
definition: Relaterer en ressource til en metode til at angive de vandrette og lodrette dimensioner af landoverflade og terræn. @da
label: korkeuserojen esitystapa @fi
definition: Liittää aineiston maanpinnan ja pinnanmuodostuksen horisontaalisten ja vertikaalisten mittojen merkitsemisen menetelmään. @fi
label: hat Reliefdarstellung @de
definition: Setzt eine Ressource in Beziehung zu einer Methode zur Angabe der horizontalen und vertikalen Darstellung des Geländes. @de
alternative label: 有地形类型 @zh-hans
label: 有地形表现 @zh-hans
definition: 将一种资源与通过特殊图形方法对（真实或虚构）地球或其他天体的表面形状的地图表现关联起来。 @zh-hans
alternative label: té tipus de relleu @ca
label: té representació de relleu @ca
definition: Relaciona un recurs amb una representació cartogràfica de les formes de la superfície de la terra o d’un altre cos celeste, real o imaginari, mitjançant mètodes gràfics especials. @ca
label: domborzatábrázolás típusa a következő: @hu
definition: Hozzákapcsol egy forrást egy olyan jelölési módszerhez, amely a földfelszín és a terep vízszintes és függőleges méreteinek jelzésére irányul. @hu
alternative label: kabartma türü ile ilişkilidir @tr
label: kabartma temsili ile ilişkilidir @tr
definition: Bir kaynağı, arazi yüzeyinin ve arazinin yatay ve dikey boyutlarını gösteren bir yöntemle ilişkilendirir. @tr

is remade as
status: Published
definition: Relates a resource to a motion picture, radio program, television program, or video based on an earlier resource.
type: Property
sub property of: has derivative
inverse of: is remake of
lexical alias: remadeAs.en
label: er genindspillet som @da
definition: Relaterer en ressource til en ressource af en film, et radio- eller tv-program eller en video baseret på en tidligere ressource. @da
label: is opnieuw gemaakt als @nl
label: هو إعادة كـ @ar
definition: يربط بين مصدر وفيلم سينمائي، برنامج إذاعي، برنامج تليفزيوني، أو فيديو يعتمد على مصدر سابق. @ar
label: aineiston uusintaproduktio @fi
definition: Liittää aineiston elokuvaan, radio-ohjelmaan, televisio-ohjelmaan tai videoon, joka perustuu aiempaan aineistoon. @fi
label: ist Remake als @de
definition: Setzt eine Ressource in Beziehung zu einem Film, einer Hörfunksendung, einer Fernsehsendung oder einem Video, der/die/das auf einer früheren Ressource basiert. @de
label: 被重新制作为 @zh-hans
definition: 将一种资源与基于一种先前资源的一种新电影、广播节目、电视节目或视频的一种资源关联起来。 @zh-hans
label: újrafeldolgozása a következőként: @hu
definition: Hozzákapcsol egy forrást egy korábbi forráson alapuló mozgóképhez, rádióműsorhoz, televízióműsorhoz, vagy videóhoz. @hu
label: olarak yeniden yapılmıştır @tr
definition: Bir kaynağı, daha önceki bir kaynağa dayanan bir sinema filmi, radyo programı, televizyon programı veya video ile ilişkilendirir. @tr

is remake of
status: Published
definition: Relates a resource to a resource used as a basis for a new motion picture, radio program, television program, or video.
type: Property
sub property of: has source
inverse of: is remade as
lexical alias: remakeOf.en
label: er genindspilning af @da
definition: Relaterer en ressource til en ressource, der er anvendt som grundlag for en ny film, et nyt radioprogram, et nyt tv-program eller en ny video. @da
label: is remake van @nl
label: uusintaproduktio aineistosta @fi
label: هو إعادة إنتاج لـ @ar
definition: يربط بين مصدر ومصدر يُستخدم كأساس لفيلم سينمائي جديد، أو برنامج إذاعي، أو برنامج تليفزيوني، أو فيديو. @ar
definition: Liittää aineiston aineistoon, jota on käytetty uuden elokuvan, televisio-ohjelman, radio-ohjelman tai videon perustana. @fi
label: ist Remake von @de
definition: Setzt eine Ressource in Beziehung zu einer Ressource, die als Grundlage für einen neuen Film, eine neue Hörfunksendung, eine neue Fernsehsendung oder ein neues Video verwendet wird. @de
label: 是……的重新制作 @zh-hans
definition: 将一种资源与被用作一种新的电影、广播节目、电视节目或视频的基础的一种资源关联起来。 @zh-hans
label: újraalkotása a következőnek: @hu
definition: Hozzákapcsol egy forrást egy forráshoz, amelyet alapként használnak egy új mozgóképhez, rádióműsorhoz, televízióműsorhoz vagy videóhoz. @hu
label: yeniden yapımıdır @tr
definition: Bir kaynağı, yeni bir sinema filmi, radyo programı, televizyon programı veya video için temel olarak kullanılan bir kaynakla ilişkilendirir. @tr

has remix artist
status: Published
type: Property
lexical alias: remixArtist.en
definition: Relates a resource to an agent who is responsible for creating an audio resource by manipulating, recombining, mixing, and reproducing previously recorded sounds.
scope note: Remixing activities that do not substantially change the nature and content of the original resource, and mixing recorded tracks together to appear as one continuous track are excluded.
inverse of: is remix artist of
sub property of: has creator
see also: has DJ
label: har remixer @da
definition: Relaterer en ressource til en agent ansvarlig for at skabe en lydressource ved at manipulere, rekombinere, mixe og reproducere tidligere indspillede lyde. @da
scope note: Remix-aktiviteter der ikke væsentligt ændrer natur og indhold på originalværket, og mixning af indspillede lydspor til at fremstå som et uafbrudt spor er ikke omfattet. @da
label: heeft remixartiest @nl
label: له فنان ريميكس @ar
definition: يربط مصدر بوكيل مسؤول عن إنشاء مصدر صوتي من خلال معالجة المواد السمعية المسجلة مسبقًا وإعادة تجميعها ومزجها واستنساخها. @ar
scope note: تُستبعد أنشطة إعادة المزج التي لا تغير بشكل جوهري طبيعة ومحتوى المصدر الأصلي، وأنشطة مزج المسارات المسجلة لكي تبدو مسارًا واحدًا مستمرًا. @ar
label: äänitaiteilija aineistossa @fi
definition: Liittää aineiston toimijaan, joka vastaa ääniteoksen luomisesta manipuloimalla, yhdistelemällä, sekoittamalla ja uudelleen tuottamalla aiemmin äänitettyjä ääniä. @fi
scope note: Ei kata uudelleenmiksaamista, joka ei oleellisesti muuta alkuperäisen teoksen luonnetta ja sisältöä eikä aiemmin äänitettyjen musiikkikappaleiden yhdistämistä yhdeksi musiikkikappaleeksi. @fi
label: hat Remix Artist @de
definition: Setzt eine Ressource in Beziehung zu einem Akteur, der für das Schaffen einer Tonressource verantwortlich ist, indem er eine bestehende Tonaufnahme bearbeitet, rekombiniert, mischt und reproduziert. @de
scope note: Darunter fallen keine Nachbearbeitungen, die weder Art noch Inhalt der Originalressource wesentlich verändern, sowie das Zusammenmischen von aufgenommenen Einzelspuren (Kanälen) zu einem scheinbar ununterbrochen durchgehenden Klangerlebnis. @de
label: 有合成艺术家 @zh-hans
definition: 将一种资源与通过操纵、重新组合、混合和复制事先录制的声音而负责创建一种音频资源的一个行为者关联起来。 @zh-hans
scope note: 不包括不实质性改变原资源的性质和内容的合成活动、以及将录制的音轨混合成一个连续的音轨的活动。 @zh-hans
label: remixművésze a következő: @hu
definition: Hozzákapcsol egy forrást egy ágenshez, aki felelős egy audioforrás létrehozásáért korábban rögzített hangok manipulálásával, újrakombinálásával, keverésével és reprodukálásával. @hu
scope note: Nem tartoznak ide sem azok a remixelési tevékenységek, amelyek nem változtatják meg lényegesen az eredeti forrás jellegét és tartalmát, sem a rögzített sávok látszólag egy folyamatos sávként való összemixelése. @hu
label: remix sanatçısı ile ilişkilidir @tr
definition: Bir kaynağı, önceden kaydedilmiş sesleri değiştirerek, yeniden birleştirerek, karıştırarak ve yeniden üreterek bir ses kaynağı oluşturmaktan sorumlu olan bir temsilci ile ilişkilendirir. @tr
scope note: Orijinal kaynağın niteliğini ve içeriğini önemli ölçüde değiştirmeyen remiks faaliyetleri ve kaydedilen parçaların kesintisiz tek bir parça olarak görünecek şekilde birbirine karıştırılması hariçtir. @tr

is remix artist of
status: Published
type: Property
lexical alias: remixArtistOf.en
definition: Relates an agent to a resource that involves a responsibility of an agent for manipulating, recombining, mixing, and reproducing previously recorded sounds.
scope note: Remixing activities that do not substantially change the nature and content of the original resource, and mixing recorded tracks together to appear as one continuous track are excluded.
inverse of: has remix artist
sub property of: is creator of
see also: is DJ of
label: er remixer til @da
definition: Relaterer en agent til en lydressource, skabt ved at manipulere, rekombinere, mixet og reproducere tidligere indspillede lyde. @da
scope note: Remixaktiviteter der ikke væsentligt ændrer natur og indhold på den oprindelige ressource, og miksning af indspillede lydspår til at fremstå som et uafbrudt spor ekskluderes. @da
label: is remixartiest van @nl
label: هو فنان ريميكس لـ @ar
definition: يربط بين وكيل ومصدر ينطوي على مسؤولية وكيل عن معالجة المواد السمعية المسجلة مسبقًا وإعادة تجميعها ومزجها واستنساخها. @ar
scope note: تُستبعد أنشطة إعادة المزج التي لا تغير بشكل جوهري طبيعة ومحتوى المصدر الأصلي، وأنشطة مزج المسارات المسجلة لكي تبدو مسارًا واحدًا مستمرًا. @ar
label: uudelleenmiksaaja (toimija) aineistossa @fi
definition: Liittää toimijan aineistoon, jossa toimija vastaa aiemmin äänitettyjen äänten manipuloimisesta, yhdistelemisestä, sekoittamisesta ja uudelleen tuottamisesta. @fi
scope note: Ei kata uudelleenmiksaamista, joka ei oleellisesti muuta alkuperäisen teoksen luonnetta ja sisältöä eikä aiemmin äänitettyjen musiikkikappaleiden yhdistämistä yhdeksi musiikkikappaleeksi. @fi
label: ist Remix Artist von @de
definition: Setzt einen Akteur in Beziehung zu einer Ressource, bei der ein Akteur für das Bearbeiten, Rekombinieren, Mischen und Reproduzieren einer bestehenden Tonaufnahme verantwortlich ist. @de
scope note: Darunter fallen keine Nachbearbeitungen, die weder Art noch Inhalt der Originalressource wesentlich verändern, sowie das Zusammenmischen von aufgenommenen Einzelspuren (Kanälen) zu einem scheinbar ununterbrochen durchgehenden Klangerlebnis. @de
label: 是……的合成艺术家 @zh-hans
definition: 将一个行为者与涉及操纵、重新组合、混合和复制事先录制的声音的一个行为者的责任的一种资源关联起来。 @zh-hans
scope note: 不包括不实质性改变原资源的性质和内容的合成活动、以及将录制的音轨混合成一个连续的音轨的活动。 @zh-hans
label: remixművésze a következőnek: @hu
definition: Hozzákapcsol egy ágenst egy forráshoz, amelyhez hozzátartozik egy ágens felelőssége korábbi hangfelvételek manipulálásáért, újrakombinálásáért, keveréséért és reprodukálásáért. @hu
scope note: Nem tartoznak ide sem azok a remixelési tevékenységek, amelyek nem változtatják meg lényegesen az eredeti forrás jellegét és tartalmát, sem a rögzített sávok látszólag egy folyamatos sávként való összemixelése. @hu
label: remix sanatçısıdır @tr
definition: Bir temsilciyi, önceden kaydedilmiş sesleri düzenleme, yeniden birleştirme, karıştırma ve yeniden üretmeyle görevli bir temsilcinin sorumluluğunu içeren bir kaynakla ilişkilendirir. @tr
scope note: Orijinal kaynağın niteliğini ve içeriğini önemli ölçüde değiştirmeyen remiks faaliyetleri ve kaydedilen parçaların kesintisiz tek bir parça olarak görünecek şekilde birbirine karıştırılması hariçtir. @tr

is replaced by
status: Published
definition: Relates a resource to a resource whose content supersedes and renders obsolete the content of another resource.
type: Property
sub property of: is succeeded by
inverse of: is replacement of
lexical alias: replacedBy.en
scope note: This relationship applies generally to single-part units, multipart monographs, and integrating resources.
definition: Relaterer en ressource til en senere ressource, der er anvendt delvist i stedet for en tidligere ressource, normalt fordi den senere ressource indeholder opdateret eller ny information, der betyder, at den tidligere ressource er forældet. @da
scope note: Den her relation bruges generelt til enkeltstående monografier, flerbindsværker og integrerende ressourcer. @da
label: is vervangen door @nl
label: korvattu aineistolla @fi
label: هو مستبدَل بـ @ar
definition: يربط بين مصدر ومصدر يحل محتواه محل محتوى مصدر آخر ويجعله متقادمًا. @ar
scope note: تنطبق هذه العلاقة بشكل عام على وحدات من جزء واحد، مونوجرافيا متعددة الأجزاء، ومصادر متكاملة. @ar
label: er erstattet af @da
definition: Liittää aineiston aineistoon, jonka sisältö korvaa ja tekee vanhentuneeksi toisen aineiston. @fi
scope note: Koskee yleensä yksiosaisia yksiköitä, moniosaisia monografioita ja päivittyviä aineistoja. @fi
label: ist ersetzt durch @de
definition: Setzt eine Ressource in Beziehung zu einer Ressource, deren Inhalt den Inhalt einer anderen Ressource ersetzt und obsolet macht. @de
scope note: Diese Beziehung gilt allgemein für einteilige Einheiten, mehrteilige Monographien und integrierende Ressourcen. @de
label: 被……替代 @zh-hans
definition: 将一种资源与其内容替代并废止另一种资源之内容的一种资源关联起来。 @zh-hans
scope note: 这个关系一般适用于单部分单元、多部分单行出版物和集成性资源。 @zh-hans
label: helyettesíti a következő: @hu
definition: Hozzákapcsol egy forrást egy forráshoz, amelynek tartalma túlhaladja és elavulttá teszi egy másik forrás tartalmát. @hu
scope note: Ez a kapcsolat általában egyrészes egységekre, többrészes monográfiákra és integráló forrásokra alkalmazható. @hu
label: ile değiştirilmiştir @tr
definition: Bir kaynağı, içeriği başka kaynağın içeriğinin değiştiren ve onu geçersiz kılan bir kaynak ile ilişkilendirir. @tr
scope note: Bu ilişki genel olarak tek parçalı birimler, çok parçalı monograflar ve birleştirici kaynaklar için geçerlidir. @tr

is replaced in part by
status: Published
definition: Relates a resource to a resource whose content partially supersedes and renders obsolete the content of another resource.
type: Property
sub property of: is succeeded by
inverse of: is replacement in part of
lexical alias: replacedInPartBy.en
scope note: This relationship applies generally to single-part units, multipart monographs, and integrating resources.
label: er delvis erstattet af @da
definition: Relaterer en ressource til en senere ressource, der er delvist anvendt i stedet for et tidligere udtryk, normalt fordi den senere ressource indeholder opdateret eller ny information, der betyder, at den tidligere ressource er forældet. @da
scope note: Denne relation anvendes generelt til enkeltstående monografier, flerbindsværker og integrerende ressourcer. @da
label: is gedeeltelijk vervangen door @nl
label: osittain korvattu aineistolla @fi
label: هو مستبدَل جزئيًا @ar
definition: يربط بين مصدر ومصدر يحل محتواه جزئيا محل مصدر آخر ويجعل محتواه متقادمًا. @ar
scope note: تنطبق هذه العلاقة بشكل عام على وحدات من جزء واحد، مونوجرافيا متعددة الأجزاء، ومصادر متكاملة. @ar
definition: Liittää aineiston aineistoon, jonka sisältö osittain korvaa ja tekee vanhentuneeksi toisen aineiston. @fi
scope note: Koskee yleensä yksiosaisia yksiköitä, moniosaisia monografioita ja päivittyviä aineistoja. @fi
label: ist teilweise ersetzt durch @de
definition: Setzt eine Ressource in Beziehung zu einer Ressource, dessen Inhalt den Inhalt einer anderen Ressource teilweise ersetzt und obsolet macht. @de
scope note: Diese Beziehung gilt allgemein für einteilige Einheiten, mehrteilige Monographien und integrierende Ressourcen. @de
label: 被……部分替代 @zh-hans
definition: 将一种资源与其内容部分地替代并废止另一种资源之内容的一种资源关联起来。 @zh-hans
scope note: 这个关系一般适用于单部分单元、多部分单行出版物和集成性资源。 @zh-hans
label: részben helyettesíti a következő: @hu
definition: Hozzákapcsol egy forrást egy forráshoz, amelynek tartalma részben túlhaladja és elavulttá teszi egy másik forrás tartalmát. @hu
scope note: Ez a kapcsolat általában egyrészes egységekre, többrészes monográfiákra és integráló forrásokra alkalmazható. @hu
label: ile kısmen değiştirilmiştir @tr
definition: Bir kaynağı, içeriği kısmen başka bir kaynağın içeriğinin değiştiren ve onu geçersiz kılan bir kaynak ile ilişkilendirir. @tr
scope note: Bu ilişki genel olarak tek parçalı birimler, çok parçalı monograflar ve birleştirici kaynaklar için geçerlidir. @tr

is replacement in part of
status: Published
definition: Relates a resource to a resource whose content is partially superseded and rendered obsolete by the content of another resource.
type: Property
sub property of: is preceded by
inverse of: is replaced in part by
lexical alias: replacementInPartOf.en
scope note: This element applies in general to a static resource or an integrating resource.
label: er delvis erstatning af @da
definition: Relaterer en ressource til en tidligere ressource, hvis indhold er blevet delvist erstattet af en senere ressource, normalt fordi den senere ressource indeholder opdateret eller ny information, der betyder, at den tidligere ressource er forældet. @da
scope note: Denne relation anvendes generelt til enkeltstående monografier, flerbindsværker og integrerende ressourcer. @da
label: is gedeeltelijke vervanging van @nl
label: korvaa aineiston osittain @fi
label: هو استبدال في جزء لـ @ar
definition: يربط بين مصدر ومصدر يتم استبدال محتواه جزئيًا ويصبح متقادمًا في وجود محتوى مصدر آخر. @ar
scope note: ينطبق هذا العنصر بشكل عام على مصدر ثابت أو مصدر متكامل. @ar
definition: Liittää aineiston aineistoon, jonka sisällön toisen aineiston sisältö osittain korvaa ja tekee vanhentuneeksi. @fi
scope note: Tämä elementti soveltuu yleensä staattiseen tai päivittyvään aineistoon. @fi
label: ist teilweise Ersatz von @de
definition: Setzt eine Ressource in Beziehung zu einer Ressource, deren Inhalt teilweise durch den Inhalt einer anderen Ressource ersetzt und überflüssig wird. @de
scope note: Im Allgemeinen trifft dieses Element auf eine statische Ressource oder eine integrierende Ressource zu. @de
label: 是……的部分替代 @zh-hans
definition: 将一种资源与其内容被另一种资源之内容部分地替代并废止的一种资源关联起来。 @zh-hans
scope note: 该元素一般适用于一种静态资源或者集成性资源。 @zh-hans
label: részben helyettesíti a következőt: @hu
definition: Hozzákapcsol egy forrást egy forráshoz, amelynek tartalmát részben túlhaladja és elavulttá teszi egy másik forrás tartalma. @hu
scope note: Ezt az elemet általában az statikus vagy integráló forrásokra alkalmazzák. @hu
label: kısmen değiştirilmesidir @tr
definition: Bir kaynağı, içeriği başka bir kaynağın içeriği tarafından kısmen değiştirilmiş ve geçersiz kılınmış bir kaynakla ilişkilendirir. @tr
scope note: Bu öğe genel olarak durağan bir kaynak veya entegre bir kaynak için geçerlidir. @tr

is replacement of
status: Published
definition: Relates a resource to a resource whose content is superseded and rendered obsolete by the content of another resource.
type: Property
sub property of: is preceded by
inverse of: is replaced by
lexical alias: replacementOf.en
scope note: This element applies in general to a static resource or an integrating resource.
label: er erstatning af @da
definition: Relaterer en ressource til en tidligere ressource, hvis indhold er blevet erstattet af en senere ressource, normalt fordi den senere ressource indeholder opdateret eller ny information, der betyder, at den tidligere ressource er forældet. @da
scope note: Denne relation anvendes generelt til enkeltstående monografier, flerbindsværker og integrerende ressourcer. @da
label: is vervanging van @nl
label: korvattu aineisto @fi
label: هو استبدال لـ @ar
definition: يربط بين مصدر ومصدر يتم استبدال محتواه ويصبح متقادمًا في وجود محتوى مصدر آخر. @ar
scope note: ينطبق هذا العنصر بشكل عام على مصدر ثابت أو مصدر متكامل. @ar
definition: Liittää aineiston aineistoon, jonka sisällön toisen aineiston sisältö korvaa ja tekee vanhentuneeksi. @fi
label: ist Ersatz von @de
definition: Setzt eine Ressource in Beziehung zu einer Ressource, deren Inhalt durch den Inhalt einer anderen Ressource ersetzt und überflüssig wird. @de
scope note: Im Allgemeinen trifft dieses Element auf eine statische Ressource oder eine integrierende Ressource zu. @de
scope note: Tämä elementti soveltuu yleensä staattiseen tai päivittyvään aineistoon. @fi
label: 是……的替代 @zh-hans
definition: 将一种资源与其内容被另一种资源之内容替代并废止的一种资源关联起来。 @zh-hans
scope note: 该元素一般适用于一种静态资源或者集成性资源。 @zh-hans
label: helyettesíti a következőt: @hu
definition: Hozzákapcsol egy forrást egy forráshoz, amelynek tartalmát túlhaladja és elavulttá teszi egy másik forrás tartalma. @hu
scope note: Ezt az elemet általában az statikus vagy integráló forrásokra alkalmazzák. @hu
label: değiştirilmesidir @tr
definition: Bir kaynağı, içeriği başka bir kaynağın içeriği tarafından değiştirilmiş ve geçersiz kılınmış bir kaynakla ilişkilendirir. @tr
scope note: Bu öğe genel olarak durağan bir kaynak veya entegre bir kaynak için geçerlidir. @tr

is reprinted as
status: Published
definition: Relates a resource to a resource that reissues the same resource as a printed resource being described.
type: Property
sub property of: is reproduced as
inverse of: is reprint of
lexical alias: reprintedAs.en
label: er genoptrykt som @da
definition: Relaterer en ressource til en ressource, der genudgiver den samme ressource som en trykt beskreven ressource. @da
label: is herdrukt als @nl
label: uusintapainos aineistosta @fi
label: أعيد طباعته كـ @ar
definition: يربط بين مصدر ومصدر يُعيد إصدار نفس المصدر كمصدر مطبوع يتم وصفه. @ar
definition: Liittää aineiston uusintajulkaisuun samasta aineistosta kuin kuvailtavana oleva painettu aineisto. @fi
label: ist nachgedruckt als @de
definition: Setzt eine Ressource in Beziehung zu einer Ressource, die dieselbe Ressource wie die beschriebene, gedruckte Ressource neu heraus gibt. @de
label: 被重印为 @zh-hans
definition: 将一种资源与重新发行与所描述印刷资源同样资源的一种资源关联起来。 @zh-hans
label: reprintje a következőként: @hu
definition: Hozzákapcsol egy forrást egy olyan forráshoz, amely nyomtatott forrásként újrakiadása ugyanannak a forrásnak, amelyet éppen leírtak. @hu
label: olarak yeniden basılmıştır @tr
definition: Bir kaynağı, tanımlanan basılı bir kaynakla ve aynı kaynağın yeniden yayımlanmış hali olan bir kaynakla ilişkilendirir. @tr

is reprint of
status: Published
definition: Relates a resource to a resource that reissues the same resource as a printed resource being described.
type: Property
sub property of: is reproduction of
inverse of: is reprinted as
lexical alias: reprintOf.en
label: er genoptryk af @da
definition: Relaterer en ressource til en trykt ressource, der er anvendt som grundlag for en genudgivelse af en ressource. @da
label: is herdruk van @nl
label: uusintapainos aineistosta @fi
label: هو إعادة طبع لـ @ar
definition: يربط بين مصدر ومصدر يُعيد إصدار نفس المصدر مثل مصدر مطبوع يتم وصفه. @ar
definition: Liittää aineiston kuvailtavana olevasta painetusta aineistosta otettuun uusintapainokseen. @fi
label: ist Nachdruck von @de
definition: Setzt eine Ressource in Beziehung zu einer Ressource, die dieselbe Ressource wie die beschriebene, gedruckte Ressource neu heraus gibt. @de
label: 是……的重印 @zh-hans
definition: 将一种资源与重新发行和所描述印刷资源相同资源的一种资源关联起来。 @zh-hans
label: reprintje a következőnek: @hu
definition: Hozzákapcsol egy forrást egy olyan forráshoz, amely nyomtatott forrásként újrakiadása a leírt forrásnak. @hu
label: yeniden basımıdır @tr
definition: Bir kaynağı, tanımlanan basılı bir kaynakla ve aynı kaynağın yeniden yayımlanmış hali olan bir kaynakla ilişkilendirir. @tr

is reproduced as
status: Published
definition: Relates a resource to a resource that reproduces a related resource.
type: Property
sub property of: has equivalent
inverse of: is reproduction of
lexical alias: reproducedAs.en
label: er reproduceret som @da
definition: Relaterer en ressource til en ressource, der er en reproduktion af en anden ressource. @da
label: is gereproduceerd als @nl
label: jäljenne aineistosta @fi
label: أعيد استنساخه كـ @ar
definition: يربط بين مصدر ومصدر يستنسخ مصدر ذو صلة. @ar
definition: Liittää aineiston aineistoon, joka on toisen aineiston jäljenne. @fi
label: ist reproduziert als @de
definition: Setzt eine Ressource in Beziehung zu einer Ressource, die eine in Beziehung stehende Ressource reproduziert. @de
label: 被复制为 @zh-hans
definition: 将一种资源与复制一种相关资源的一种资源关联起来 @zh-hans
label: reprodukciója a következőként: @hu
definition: Hozzákapcsol egy forrást egy forráshoz, amely másolata egy kapcsolódó forrásnak. @hu
has subproperty: has digital transfer
has subproperty: has electronic reproduction
has subproperty: has facsimile
has subproperty: is reprinted as
label: olarak yeniden yapılmıştır @tr
definition: Bir kaynağı, ilgili kaynağı üreten başka bir kaynak ile ilişkilendirir. @tr

is reproduction of
status: Published
definition: Relates a resource to a resource that is used as a basis for a reproduction.
type: Property
sub property of: has equivalent
inverse of: is reproduced as
lexical alias: reproductionOf.en
label: er reproduktion af @da
definition: Relaterer en ressource til en ressource, der er anvendt som grundlag for en reproduktion. @da
label: is reproductie van @nl
label: jäljenne aineistosta @fi
label: هو إعادة إنتاج لـ @ar
definition: يربط بين مصدر ومصدر يُستخدم كأساس لإعادة الإنتاج. @ar
definition: Liittää aineiston jäljenteen perustana käytettyyn aineistoon. @fi
label: ist Reproduktion von @de
definition: Setzt eine Ressource in Beziehung zu einer Ressource, die als Grundlage für eine Reproduktion verwendet wird. @de
label: 是……的复制品 @zh-hans
definition: 将一种资源与被用作一种复制品之基础的一种资源关联起来。 @zh-hans
label: másolata a következőnek: @hu
definition: Hozzákapcsol egy forrást egy forráshoz, amelyet egy másolat alapjaként használnak. @hu
has subproperty: is digital transfer of
has subproperty: is electronic reproduction of
has subproperty: is facsimile of
has subproperty: is reprint of
label: yeniden yapımıdır @tr
definition: Bir kaynağı, yeniden üretim için temel olarak kullanılan bir kaynakla ilişkilendirir. @tr

has researcher
status: Published
type: Property
lexical alias: researcher.en
definition: Relates a resource to an agent who does research in support of the creation of a resource.
inverse of: is researcher of
sub property of: has other agent associated with resource (Deprecated)
label: har researcher @da
definition: Relaterer en ressource til en agent, der udfører forskning til støtte for skabelsen af en ressource. @da
label: heeft onderzoeker @nl
label: له باحث @ar
definition: يربط مصدر بوكيل يُساهم في إجراء بحث لدعم إنشاء مصدر. @ar
label: tutkija aineistossa @fi
definition: Liittää aineiston toimijaan, joka tekee aineiston syntymistä tukevaa tutkimusta. @fi
label: hat Forscherin/Forscher @de
definition: Setzt eine Ressource in Beziehung zu einem Akteur, der Forschung betreibt, um das Schaffen einer Ressource zu unterstützen. @de
label: 有研究者 @zh-hans
definition: 将一种资源与从事研究以支持一种资源的创作的一个行为者关联起来。 @zh-hans
label: kutatója a következő: @hu
definition: Hozzákapcsol egy forrást egy ágenshez, amely kutatást végez egy forrás megalkotásának támogatására. @hu
label: araştırmacı ile ilişkilidir @tr
definition: Bir kaynağı, bir kaynağın oluşturulmasını desteklemek için araştırma yapan bir temsilci ile ilişkilendirir. @tr

is researcher of
status: Published
type: Property
lexical alias: researchOf.en
definition: Relates an agent to a resource that involves a responsibility of an agent for research in support of a resource.
inverse of: has researcher
sub property of: is other agent associated with resource of (Deprecated)
label: er researcher for @da
definition: Relaterer en agent, der udfører forskning til støtte for skabelsen af en ressource til en ressource. @da
label: is onderzoeker van @nl
label: هو باحث لـ @ar
definition: يربط بين وكيل ومصدر ينطوي على مسؤولية وكيل عن البحث لدعم إنشاء مصدر. @ar
label: tutkija (toimija) aineistossa @fi
definition: Liittää toimijan aineistoon, jossa toimija vasta aineiston syntymistä tukevasta tutkimuksesta. @fi
label: ist Forscherin/Forscher von @de
definition: Setzt einen Akteur in Beziehung zu einer Ressource, bei der ein Akteur für die Forschung zur Unterstützung einer Ressource verantwortlich ist. @de
label: 是……的研究者 @zh-hans
definition: 将一个行为者与涉及对一种资源研究支持的一个行为者的责任的一种资源关联起来。 @zh-hans
label: kutatója a következőnek: @hu
definition: Hozzákapcsol egy ágenst egy forráshoz, amelyhez hozzátartozik az ágens felelőssége a forrást támogató kutatásért. @hu
label: araştırmacısıdır @tr
definition: Bir temsilciyi, bir kaynağı destekleyen araştırmayla sorumlu bir temsilcinin sorumluluğunu içeren bir kaynakla ilişkilendirir. @tr

has research supervisor
status: Published
lexical alias: researchSupervisor.en
definition: Relates a resource to an academic supervisor who is responsible for advising or supervising research that results in a resource.
type: Property
inverse of: is research supervisor of
label: heeft onderzoeksbegeleider @nl
label: له مشرف بحث @ar
definition: يربط مصدر بمشرف أكاديمي مسؤول عن تقديم المشورة أو الإشراف على الأبحاث التي تؤدي إلى مصدر. @ar
label: har forskningsvejleder @da
definition: Relaterer en ressource til en akademisk vejleder, som er ansvarlig for at rådgive @da
label: tutkimuksen ohjaaja aineistossa @fi
definition: Liittää toimijan akateemiseen ohjaajaan, joka vastaa aineistoon johtavan tutkimuksen valvomisesta tai tutkimuksessa neuvomisesta. @fi
label: hat Betreuerin/Betreuer von Forschungstätigkeiten @de
definition: Setzt eine Ressource in Beziehung zu einer akademischen Betreuerin/einem akademischen Betreuer, die/der Forschungstätigkeiten beaufsichtigt oder betreut, die zu einer Ressource führen. @de
label: 有研究主管 @zh-hans
definition: 将一种资源与负责为导致一种作品的研究作咨询和监督的一个学术主管关联起来。 @zh-hans
label: kutatás témavezetője a következő: @hu
definition: Hozzákapcsol eggy forrást egy témavezetőhöz, aki egy olyan kutatás tanácsadója és témavezetője, amely egy forrást eredményez. @hu
label: araştırma danışmanı ile ilişkilidir @tr
definition: Bir kaynağı, bir kaynakla sonuçlanan araştırmaya danışmanlık yapmaktan veya denetlemekten sorumlu olan bir akademik danışmanla ilişkilendirir. @tr

is research supervisor of
status: Published
lexical alias: researchSupervisorOf.en
definition: Relates an agent to a resource that involves a responsibility as an academic supervisor of research that results in a resource.
type: Property
inverse of: has research supervisor
label: is onderzoeksbegeleider van @nl
label: هو مشرف بحث لـ @ar
definition: يربط بين وكيل ومصدر ينطوي على تحمل المسؤولية بصفته مُشرف أكاديمي على الأبحاث التي تؤدي إلى مصدر. @ar
label: er forskningsvejleder af @da
definition: Relaterer en agent til en ressource, som involverer en akademisk forskningsvejleder, og som resulterer i en ressource. @da
label: tutkimuksen ohjaaja aineistossa @fi
definition: Liittää toimijan aineistoon, jossa akateeminen ohjaaja vastaa tutkimuksesta, jonka tuloksena on aineisto. @fi
label: ist Betreuerin/Betreuer von Forschungstätigkeiten von @de
definition: Setzt einen Akteur in Beziehung zu einer Ressource, bei der eine akademische Betreuerin/ein akademischer Betreuer dafür verantwortlich ist, die Forschungstätigkeiten zu beaufsichtigen oder zu betreuen, die zu einer Ressource führen. @de
label: 是……的研究主管 @zh-hans
definition: 将一个行为者与涉及导致一种资源的一项研究的学术主管之责任的一种资源关联起来。 @zh-hans
label: kutatási témavezetője a következőnek: @hu
definition: Hozzákapcsol egy ágenst egy forráshoz, amely magában foglalja egy tudományos témavezető a felelősségét egy kutatásért, amely egy művet eredményez. @hu
label: araştırma danışmanıdır @tr
definition: Bir temsilciyi, bir kaynakla sonuçlanan araştırmanın akademik danışmanı olarak sorumluluk içeren bir kaynakla ilişkilendirir. @tr

has resolution
status: Published
definition: Relates a resource to a clarity or fineness of detail in a digital image, expressed by a measurement of the image in pixels, etc.
type: Property
sub property of: has digital file characteristic
lexical alias: resolution.en
label: har opløsning @da
definition: Relaterer en ressource til et digitalt billedes skarphed eller finhedsgrad, udtrykt som en måling af pixels i et billede etc. @da
label: heeft resolutie @nl
label: له درجة وضوح @ar
definition: يربط بين مصدر ووضوح أو جودة التفاصيل في صورة رقمية، تم التعبير عنها بمقاييس الصورة بالبكسل، إلخ @ar
label: resoluutio aineistossa @fi
definition: Liittää aineiston digitaalisen kuvan tarkkuuteen, joka ilmaistaan pikseleinä tms. @fi
label: hat Auflösung @de
definition: Setzt eine Ressource in Beziehung zu einer Klarheit oder einem Feinheitsgrad der Details in einem digitalen Bild, die/der durch eine Abmessung des Bilds in Pixeln und so weiter ausgedrückt wird. @de
label: 有分辨率 @zh-hans
definition: 将一种资源与数字图像中由图像像素等的度量表达的细部清晰度或精细度关联起来。 @zh-hans
label: felbontása a következő: @hu
definition: Hozzákapcsol egy forrást a részletek világosságához vagy finomságához egy digitális képen, amely a kép pixelben, stb. megadott mértékében fejeződik ki. @hu
label: çözünürlük ile ilişkilidir @tr
definition: Bir kaynağı, görüntünün piksel vb. cinsinden ölçümüyle ifade edilen, dijital bir görüntüdeki ayrıntıların netliği veya inceliğiyle ilişkilendirir. @tr

has respondent
status: Published
definition: Relates a resource to an agent who is a candidate for a degree who defends or opposes a thesis provided by the praeses in an academic disputation.
type: Property
sub property of: has creator
inverse of: is respondent of
lexical alias: respondent.en
label: har respondent @da
definition: Relaterer en ressource til en kandidat til en akademisk grad, der forsvarer eller opponerer mod en tese, der er fremsat af præses i et akademisk afhandlingsforsvar. @da
label: heeft respondent @nl
label: respondentti @fi
label: له مُستَجِيب @ar
definition: يربط مصدر بوكيل باحث للحصول على درجة علمية يدافع عن أو يعارض أطروحة مقدمة من رؤساء جلسة علمية في مناظرة أكاديمية. @ar
definition: Liittää aineiston toimijaan, joka on oppiarvoa tavoitteleva kandidaatti, joka puolustaa tai opponoi preeseksen akateemisessa väitöstilaisuudessa esittelemää väitöskirjaa. @fi
label: hat Respondentin/Respondent @de
definition: Setzt eine Ressource in Beziehung zu einer Kandidatin/einem Kandidaten für einen akademischen Grad, die/der eine These, die vom Praeses in einer akademischen Disputation aufgestellt wird, verteidigt oder ablehnt. @de
label: 有答辩人 @zh-hans
definition: 将一种资源与作为学位候选人对在学位论文答辩中评审人提供的一篇论文提出支持或反对的一个行为者关联起来。 @zh-hans
label: válaszadója a következő: @hu
definition: Egy forrást hozzákapcsol egy ágenshez, aki az elnök által előterjesztett értekezést megvédi vagy opponálja egy tudományos vitában. @hu
label: tez yazarı ile ilişkilidir @tr
definition: Bir kaynağı, danışmanlar tarafından ortaya konan akademik bir tartışmada bir tezi savunan veya karşı çıkan bir mezun adayı olan temsilci ilişkilendirir. @tr

is respondent of
status: Published
definition: Relates an agent to a resource that is a thesis provided by the praeses in an academic disputation that is defended or opposed by a candidate for a degree.
type: Property
sub property of: is creator of
inverse of: has respondent
lexical alias: respondentOf.en
label: er respondent i @da
definition: Relaterer en kandidat til en akademisk grad, der forsvarer eller opponerer mod en tese, der er fremsat af præses i et akademisk afhandlingsforsvar til en ressource. @da
label: is respondent van @nl
label: respondentti (toimija aineistossa) @fi
label: هو مُستَجِيب لـ @ar
definition: يربط بين مصدر وباحث متقدم للحصول على درجة علمية يدافع عن أو يعارض أطروحة مقدمة من رؤساء جلسة علمية في مناظرة أكاديمية. @ar
definition: Liittää aineistoon oppiarvoa tavoitelevan kandidaatin, joka akateemisessa väitöstilaisuudessa puolustaa tai opponoi preeseksen esittelemää väitöskirjaa. @fi
label: ist Respondentin/Respondent von @de
definition: Setzt einen Akteur in Beziehung zu einer Ressource, bei der eine Kandidatin/ein Kandidat für einen akademischen Grad eine These, die vom Praeses in einer akademischen Disputation aufgestellt wird, verteidigt oder ablehnt. @de
label: 是……的答辩人 @zh-hans
definition: 将一个行为者与作为学位论文答辩中评审人提供的一篇论文的一种资源关联起来。 @zh-hans
definition: Relaciona un agent amb un recurs que és una tesi proposada pel praeses en una disputa acadèmica la qual defensa o a la qual s’oposa un candidat a un grau acadèmic. @ca
label: válaszadója a következőnek: @hu
definition: Hozzákapcsol egy jelöltet egy tudományos fokozathoz, és aki az elnök által előterjesztett értekezést megvédi vagy opponálja egy tudományos vitában. @hu
label: tez yazarıdır @tr
definition: Akademik bir tartışmada bir danışman tarafından sunulan bir tezi savunan veya karşı çıkan bir derece adayını bir kaynakla ilişkilendirir. @tr

has restorationist
status: Published
definition: Relates a resource to an agent who is responsible for the set of technical, editorial, and intellectual procedures aimed at compensating for the degradation of a resource by bringing it back to a state as close as possible to its original condition.
type: Property
sub property of: has other agent associated with resource (Deprecated)
inverse of: is restorationist of
lexical alias: restorationist.en
label: har konservator @da
definition: Relaterer en ressource til en agent, der har bidraget til en ressource ved at restaurere og/eller kombinere tidligere ressourcer, som kan være beskadigede eller fragmenterede, til at skabe en ny ressource. @da
label: heeft restaurator @nl
label: aineiston entisöijä @fi
label: له أخصائي ترميم @ar
definition: يربط مصدر بوكيل مسؤولًا عن مجموعة اجراءات فنية، وتحريرية، وفكرية تهدف إلى تعويض مصدر عن التدهور الذي لحق به بإعادته إلى حالة أقرب ما يكون إلى حالته الأصلية. @ar
definition: Liittää aineiston toimijaan, joka vastaa teknisistä, toimituksellisista ja tiedollisista toimenpiteistä, joiden tarkoitus on palauttaa huonokuntoinen aineisto mahdollisimman lähelle sen alkuperäistä kuntoa. @fi
label: hat Restauratorin/Restaurator @de
definition: Setzt eine Ressource in Beziehung zu einem Akteur, der für die technischen, redaktionellen und intellektuellen Verfahren verantwortlich ist, die darauf abzielen, die Zersetzung einer Ressource auszugleichen, indem sie in einen Zustand zurückversetzt wird, der ihrer ursprünglichen Beschaffenheit möglichst nahe kommt. @de
label: 有修复者 @zh-hans
definition: 将一种资源与负责为弥补资源的损毁而担负一系列技术、编辑和智力操作、使之尽可能恢复到原始状态的一个行为者关联起来。 @zh-hans
label: restaurátora a következő: @hu
definition: Hozzákapcsol egy forrást egy ágenshez, amely felelős technikai, szerkesztői és intellektuális eljárások összességéért, amelyek célja egy forrás romlásának ellensúlyozása, amivel azt az eredeti állapotához a lehető legközelebb képesek visszahozni. @hu
label: restorasyon uzmanı ile ilişkilidir @tr
definition: Bir kaynağı, orijinal durumuna mümkün olduğu kadar yakın bir duruma geri getirerek, bir kaynağın bozulmasını telafi etmeyi amaçlayan bir dizi teknik, editoryal ve fikri prosedürden sorumlu olan bir temsilci ile ilişkilendirir. @tr

is restorationist of
status: Published
definition: Relates an agent to a resource that involves a responsibility of an agent for compensation of degradation by bringing it back to a state as close as possible to its original condition using a set of technical, editorial, and intellectual procedures.
type: Property
sub property of: is other agent associated with resource of (Deprecated)
inverse of: has restorationist
lexical alias: restorationistOf.en
label: er konservator af @da
definition: Relaterer en agent, der er ansvarlig for rækken af tekniske, redaktionsmæssige og intellektuelle procedurer, der sigter mod at kompensere for forringelsen af en ressource ved at føre den tilbage til en tilstand, der er så tæt som muligt på dens oprindelige tilstand til en ressource. @da
label: is restaurator van @nl
label: هو أخصائي ترميم لـ @ar
definition: يربط بين وكيل ومصدر ينطوي على مسؤولية وكيل عن التعويض عن تدهور حالته عن طريق إعادته إلى حالته الأصلية قدر المستطاع باستخدام مجموعة من الإجراءات الفنية، والتحريرية، والفكرية. @ar
label: entisöijä (toimija) aineistossa @fi
definition: Liittää toimijan aineistoon, jossa toimija vastaa teknisistä, toimituksellisista ja tiedollisista toimenpiteistä, joiden tarkoitus on palauttaa huonokuntoinen aineisto mahdollisimman lähelle sen alkuperäistä kuntoa. @fi
label: ist Restauratorin/Restaurator von @de
definition: Setzt einen Akteur in Beziehung zu einer Ressource, bei der ein Akteur für die technischen, redaktionellen und intellektuellen Verfahren verantwortlich ist, die darauf abzielen, die Zersetzung einer Ressource auszugleichen, indem sie in einen Zustand zurückversetzt wird, der ihrer ursprünglichen Beschaffenheit möglichst nahe kommt. @de
label: 是……的修复者 @zh-hans
definition: 将一个行为者与涉及为弥补损毁而担负一系列技术、编辑和智力操作、使之尽可能恢复到原始状态的一个行为者的责任的一种资源关联起来。 @zh-hans
label: restaurátora a következőnek: @hu
definition: Hozzákapcsol egy ágenst egy forráshoz, amelyhez hozzátartozik az ágens felelőssége technikai, szerkesztői és intellektuális eljárások alkalmazásáért, amivel ellensúlyozza a forrás romlását, hogy az eredeti állapotához a lehető legközelebb állítsa azt vissza. @hu
label: restorasyon uzmanıdır @tr
definition: Bir temsilciyi, bir dizi teknik, editoryal ve entelektüel işlemler kullanarak orijinal haline mümkün olduğunca yakın bir duruma geri getirerek bozulmanın telafisinden sorumlu bir temsilcinin sorumluluğunu içeren bir kaynakla ilişkilendirir. @tr

has restrictions on access
status: Published
definition: Relates a resource to limitations placed on access to a resource.
type: Property
lexical alias: restrictionsOnAccess.en
label: har adgangsrestriktioner for ressource @da
definition: Relaterer en ressource til begrænsninger for adgang til en ressource. @da
label: heeft beperking op toegang @nl
label: له قيود على الإتاحة @ar
definition: يربط بين مصدر وقيود مفروضة على الوصول إلى مصدر ما. @ar
label: saatavuuden rajoitukset aineistolle @fi
definition: Liittää aineiston aineiston saatavuudelle asetettuihin rajoituksiin. @fi
label: hat Zugangsbeschränkung @de
definition: Setzt eine Ressource in Beziehung zu Beschränkungen des Zugangs zu einer Ressource. @de
label: 有获取限制 @zh-hans
definition: 将一种资源与对一种资源的获取设置的限制关联起来。 @zh-hans
label: hozzáférési korlátozása a következő: @hu
definition: Hozzákapcsol egy forrást egy korlátozáshoz, amelyet egy forráshoz való hozzáféréshez rendelnek. @hu
label: erişim kısıtlaması ile ilişkilidir @tr
definition: Bir kaynağı, bir kaynağa erişime getirilen sınırlamalarla ilişkilendirir. @tr

has restrictions on use
status: Published
definition: Relates a resource to a limitation placed on reproduction, publication, exhibition, etc., of a resource.
type: Property
lexical alias: restrictionsOnUse.en
label: har brugsrestriktioner for ressource @da
definition: Relaterer en ressource til begrænsninger relateret til ret til reproduktion, publicering, udstilling etc. af en ressource. @da
label: heeft beperking op gebruik @nl
label: له قيود على الاستخدام @ar
definition: يربط بين مصدر وقيود مفروضة على الاستنساخ، النشر، المعَرض، إلخ.، لمصدر ما. @ar
label: aineiston käyttöehdot @fi
definition: Liittää aineiston aineiston käyttörajoituksiin koskien esim. kopiointia, julkaisemista tai esille asettamista. @fi
label: hat Benutzungsbeschränkung @de
definition: Setzt eine Ressource in Beziehung zu einer Beschränkung der Verwendungsart einer Ressource, wie zum Beispiel Reproduktion, Veröffentlichung, Ausstellung und so weiter. @de
label: 有使用限制 @zh-hans
definition: 将一种资源与对一种资源的复制、出版、展览等设置的限制关联起来。 @zh-hans
label: felhasználási korlátozása a következő: @hu
definition: Hozzákapcsol egy forrást egy korlátozáshoz, amelyet egy forrás másolásához, publikálásához, kiállításához stb. rendelnek. @hu
label: kullanım kısıtlaması ile ilişkilidir @tr
definition: Bir kaynağı, kaynağın çoğaltılmasına, yayınlanmasına, sergilenmesine vb. konulan bir sınırlamayla ilişkilendirir. @tr

is reviewed by
status: Published
definition: Relates a resource to a resource that is a brief evaluation of a resource.
type: Property
inverse of: is review of
label: er anmeldt i @da
definition: Relaterer en ressource til en ressource, der indeholder en kort kritik af en beskreven ressource. @da
alternative label: is reviewed in
sub property of: is evaluated by
lexical alias: reviewedBy.en
label: is gerecenseerd in @nl
label: arvosteltu aineisto @fi
label: تمت مراجعته في @ar
definition: يربط بين مصدر ومصدر يحتوي على تقييم موجز لمصدر. @ar
definition: Liittää aineiston aineistosta tehtyyn tiiviiseen arviointiin. @fi
alternative label: arvioitu aineisto @fi
label: ist rezensiert in @de
definition: Setzt eine Ressource in Beziehung zu einer Ressource, bei der es sich um eine kurze Untersuchung einer Ressource handelt. @de
alternative label: 被评论于 @zh-hans
label: 被……评论 @zh-hans
definition: 将一种资源与作为一种资源之简要评价的一种资源关联起来。 @zh-hans
alternative label: és revisat en @ca
label: és revisat per @ca
definition: Relaciona un recurs amb un recurs que és una avaluació breu d’un recurs. @ca
label: szemlézve a következőben: @hu
definition: Hozzákapcsol egy forrást egy forráshoz, amely egy forrás rövid értékelése. @hu
alternative label: içinde incelenmiştir @tr
label: tarafından incelenmiştir @tr
definition: Bir kaynağı, bir kaynağın kısa bir değerlendirmesi olan kaynakla ilişkilendirir. @tr

is review of
status: Published
definition: Relates a resource to a resource used as a basis for a brief evaluation.
type: Property
sub property of: is description of
inverse of: is reviewed by
lexical alias: reviewOf.en
label: er anmeldelse af @da
definition: Relaterer en ressource til en ressource brugt som basis for en kort evaluering. @da
label: is recensie van @nl
label: arvostelu aineistosta @fi
label: هو مراجعة لـ @ar
definition: يربط بين مصدر ومصدر يُستخدم كأساس لتقييم موجز. @ar
definition: Liittää aineiston aineistoon, johon pohjautuu aineiston tiivis arviointi. @fi
label: ist Rezension von @de
definition: Setzt eine Ressource in Beziehung zu einer Ressource, die als Grundlage für eine kurze Untersuchung verwendet wird. @de
label: 是……的评论 @zh-hans
definition: 将一种资源与被用作一种简要评价之基础的一种资源关联起来。 @zh-hans
label: szemlézi a következőt: @hu
definition: Hozzákapcsol egy forrást egy forráshoz, amelyet egy rövid kiértékelés alapjaként használnak. @hu
label: incelemedir @tr
definition: Bir kaynağı, kısa bir değerlendirme için temel olarak kullanılan bir kaynakla ilişkilendirir. @tr

is revised as
status: Published
definition: Relates a resource to a resource that is an update, correction, or expansion of another resource.
type: Property
sub property of: has derivative
inverse of: is revision of
lexical alias: revisedAs.en
label: er revideret som @da
definition: Relaterer en ressource til en ressource, der er blevet opdateret, korrigeret eller udvidet. @da
label: is herzien als @nl
label: aineiston uudistettu versio @fi
label: هو مُنَقّح كـ @ar
definition: يربط بين مصدر ومصدر تم تحديثه، تصحيحه أو توسيعه. @ar
definition: Liittää aineiston aineistoon, joka on toisen aineiston päivtetty, korjattu tai laajennettu versio. @fi
label: ist überarbeitet als @de
definition: Setzt eine Ressource in Beziehung zu einer Ressource, die aktualisiert, korrigiert oder erweitert ist. @de
label: 被修订为 @zh-hans
definition: 将一种资源与作为另一种资源之更新、更正或扩充的一种资源关联起来。 @zh-hans
definition: Relaciona un recurs amb un recurs que és una actualització, correcció o ampliació d’un altre recurs. @ca
label: átdolgozása a következőként: @hu
definition: Hozzákapcsol egy forrást egy forráshoz, amelyet frissítettek, korrigáltak vagy bővítettek. @hu
label: olarak gözden geçirilmiştir @tr
definition: Bir kaynağı, başka bir kaynağın güncellemesi, düzeltmesi veya genişletilmesi olan bir kaynakla ilişkilendirir. @tr

is reviser of
status: Published
lexical alias: reviserOf.en
definition: Relates an agent to a resource that includes a contribution by an agent of making changes to the content.
type: Property
label: is herziener van @nl
label: هو مُراجع لـ @ar
definition: يربط بين مصدر ومصدر يتضمن إسهام وكيل في إجراء تغييرات المحتوى. @ar
label: er reviderer af @da
definition: Relaterer en agent til en ressource, som omfatter et bidrag af en agent ved at lave ændringer til indholdet. @da
label: aineiston tarkastaja (toimija) @fi
definition: Liittää toimijan aineistoon, jossa toimija on osallisena tekemällä muutoksia aineiston sisältöön. @fi
label: ist Überarbeiterin/Überarbeiter von @de
definition: Setzt einen Akteur in Beziehung zu eine Ressource, zu der ein Akteur beiträgt, indem er am Inhalt Veränderungen vornimmt. @de
label: 是……的修订者 @zh-hans
definition: 将一个行为者与包括对内容作改动的一个行为者的贡献的一种资源关联起来。 @zh-hans
label: átdolgozója a következőnek: @hu
definition: Hozzákapcsol egy ágenst egy forráshoz, amely magában foglalja egy ágens közreműködését a tartalom megváltoztatásában. @hu
label: gözden geçirilmişidir @tr
definition: Bir temsilciyi, içerikte değişiklik yapan temsilcinin katkısını içeren bir kaynakla ilişkilendirir. @tr

is revision of
status: Published
definition: Relates a resource to a resource that is updated, corrected, or expanded to create a new resource.
type: Property
sub property of: has source
inverse of: is revised as
lexical alias: revisionOf.en
label: er revision af @da
definition: Relaterer en ressource til en ressource, der er anvendt som grundlag for en opdateret, korrigeret eller udvidet version. @da
label: is herziening van @nl
label: aineiston uudistettu versio @fi
label: هو مُراجعة لـ @ar
definition: يربط بين مصدر ومصدر يُستخدم كأساس لنسخة مُحدثة، مُصححة، أو مُوسعة. @ar
definition: Liittää aineiston aineistoon, jota on päivitetty, korjattu tai laajennettu ja näin luotu uusi aineisto. @fi
label: ist Überarbeitung von @de
definition: Setzt eine Ressource in Beziehung zu einer Ressource, die als Grundlage für eine aktualisierte, korrigierte oder erweiterte Fassung verwendet wird. @de
label: 是……的修订 @zh-hans
definition: 将一种资源与被更新、更正或扩充以创建一种新的资源的一种资源关联起来。 @zh-hans
definition: Relaciona un recurs amb un recurs que s’actualitza, es corregeix o s’amplia per crear un recurs nou. @ca
label: átdolgozása a következőnek: @hu
definition: Hozzákapcsol egy forrást egy forráshoz, amelyet egy frissített, korrigált vagy kiterjesztett verzió alapjaként használnak. @hu
label: gözden geçirilmesidir. @tr
definition: Bir kaynağı, yeni bir kaynak oluşturmak için güncellenen, düzeltilen veya genişletilen bir kaynakla ilişkilendirir. @tr

has right ascension
status: Published
type: Property
lexical alias: rightAscension.en
definition: Relates a resource to the angular distance of a celestial body that is measured eastward on the equator from the vernal equinox to the hour circle through the body, from 0 to 24 hours.
label: har rektascension @da
definition: Relaterer en ressource til en vinkelafstand målt mod øst ved ækvator fra forårsjævndøgn til timekransen gennem et himmellegeme, fra 0 til 24 timer. @da
label: heeft rechte klimming @nl
label: له صعود مستقيم @ar
definition: يربط بين مصدر ومسافة زاوية مقاسة باتجاه الشرق على خط الاستواء من الاعتدال الربيعي إلى دائرة الساعة عبر جرم سماوي، من 0 إلى 24 ساعة. @ar
label: rektaskensio aineistossa @fi
label: hat Rektaszension @de
definition: Setzt eine Ressource in Beziehung zu einem Winkelabstand zwischen dem Frühlingspunkt und dem Längenkreis, der auf der Äquatorebene gegen den Uhrzeigersinn gemessen und in einem Maß von 0 bis 24 Stunden angegeben wird. @de
definition: Liittää aineiston taivaankappaleen kulmaetäisyyteen, joka on mitattu aikamitoissa taivaanekvaattoria pitkin kevättasauspisteestä vastapäivään. @fi
label: 有赤经 @zh-hans
definition: 将一种资源与天体赤道上从春分点到时圈向东度量的角距离（从0到24小时）关联起来。 @zh-hans
definition: Relaciona un recurs amb la distància angular d’un cos celeste que es mesura de 0 a 24 h, al llarg de l’equador en direcció est, des de l’equinocci vernal al cercle horari passant pel cos celeste. @ca
label: rektaszcenziója a következő: @hu
definition: Hozzákapcsol egy forrást az egyenlítőtől keletre mért szögtávolsághoz a tavaszi napéjegyenlőségtől az órakörig egy égitesten keresztül, 0-tól 24 óráig. @hu
label: yükseliş ile ilişkilidir @tr
definition: Bir kaynağı, bir gök cismin ilkbahar ekinoksundan ekvator üzerinde doğuya doğru ölçülen açısal mesafesini, 0'dan 24 saate kadar cismin içinden geçen saat çemberiyle ilişkilendirir. @tr

has right ascension and declination
status: Published
definition: Relates a resource to a place that is the location of a celestial body that is the coverage of a cartographic resource and is identified using the angles of right ascension and declination.
type: Property
sub property of: has coordinates of cartographic content
lexical alias: rightAscensionAndDeclination.en
label: har rektascension og deklination @da
definition: Relaterer en ressource til et system til identificering af den placering af et himmellegeme på himlen, der dækkes af en ressources kartografiske indhold, ved anvendelse af vinklerne for rektascension og deklination. @da
inverse of: is right ascension and declination of
label: heeft rechte klimming en declinatie @nl
label: له صعود مستقيم وانحراف @ar
definition: يربط بين مصدر ونظام لتحديد موقع جسم سماوي في السماء مغطى بمحتوى خرائطي لمصدر ما باستخدام زوايا الصعود المستقيم والانحراف. @ar
label: rektaskensio ja deklinaatio aineistossa @fi
definition: Liittää aineiston järjestelmään, joka määrittää aineiston kartografiseen sisältöön kuuluvan taivaankappaleen sijainnin käyttämällä rektaskension ja deklinaation kulmamittoja. @fi
label: hat Rektaszension und Deklination @de
definition: Setzt eine Ressource in Beziehung zu einem System zur Identifizierung der Position eines Himmelskörpers am Himmel, die vom kartografischen Inhalt einer Ressource, unter Verwendung der Winkel der Rektaszension und der Deklination, abgedeckt wird. @de
label: 有赤经和赤纬 @zh-hans
definition: 将一种资源与作为一个天体的位置并作为一种地图资源的覆盖范围并用赤经和赤纬的角度标识的一个地点关联起来。 @zh-hans
definition: Relaciona un recurs amb un lloc que és la localització d’un cos celeste que és l’àrea d'abast d’un recurs cartogràfic i s’identifica usant els angles d’ascensió recta i declinació. @ca
label: rektaszcenziója és deklinációja a következő: @hu
definition: Hozzákapcsol egy forrást egy rendszerhez, amelynek célja egy forrás kartográfiai tartalma által lefedett területen az égbolton egy égitest helyzetének meghatározása rektaszcenzióval és a deklináció szögeinek használatával. @hu
label: yükseliş ve sapma ile ilişkilidir @tr
definition: Bir kaynağı, doğru yükselme ve sapma açılarını kullanarak bir kaynağın kartografik içeriği tarafından kapsanan gökyüzündeki bir gök cisminin konumunu tanımlamaya yönelik bir sistemle ilişkilendirir. @tr

has scale
status: Published
definition: Relates a resource to a ratio of the dimensions of an image or three-dimensional form to the dimensions of the thing that is represented.
type: Property
lexical alias: scale.en
scope note: Scale can apply to horizontal, vertical, angular, and/or other measurements represented in the resource.
label: har målestoksforhold @da
definition: Relaterer en ressource til et forhold mellem et billede eller en tredimensionel form og dimensionerne for den ting, billedet eller formen repræsenterer. @da
scope note: Målestoksforhold kan gælde for horisontale, vertikale, kantede og/eller andre mål repræsenterede i en ressource. @da
label: heeft schaal @nl
label: له مقياس @ar
definition: يربط بين مصدر ونسبة أبعاد صورة أو شكل ثلاثي الأبعاد بأبعاد الشيء الذي يتم تمثيله. @ar
scope note: يمكن تطبيق المقياس على القياسات الأفقية والرأسية والزاوية و / أو غيرها من القياسات الممثلة في المصدر. @ar
label: aineiston mittakaava @fi
definition: Liittää aineiston kuvan tai kolmiulotteisen muodon aineiston mittojen suhteeseen sen esittämän kohteen mittoihin. @fi
scope note: Mittakaava voi koskea aineistossa esitettyjä horisontaalisia, vertikaalisia, kulma- tai muita mittoja. @fi
label: hat Maßstab @de
definition: Setzt eine Ressource in Beziehung zu einem Verhältnis der Maße eines Bilds oder einer dreidimensionalen Form zu den Maßen der Sache, die es/sie repräsentiert. @de
scope note: Ein Maßstab kann auf horizontale, vertikale, winklige und/oder andere Maße angewendet werden, die in einer Ressource repräsentiert sind. @de
label: 有比例尺 @zh-hans
definition: 将一种资源与一种图像或三维形式的尺寸与其所代表的东西的尺寸之比关联起来。 @zh-hans
scope note: 比例尺可应用于资源所代表的水平、垂直、角度和/或其他测量。 @zh-hans
label: méretaránya a következő: @hu
definition: Hozzákapcsol egy forrást egy forrásban megtestesített kép vagy háromdimenziós forma méretének és a forrás által ábrázolt dolog méretének viszonyításához. @hu
scope note: A méretarány alkalmazható egy forrásban reprezentált vízszintes, függőleges, ferde és/vagy más méretekre. @hu
has subproperty: has additional scale information
has subproperty: has horizontal scale of cartographic content
has subproperty: has scale of still image or three-dimensional form
has subproperty: has vertical scale of cartographic content
label: ölçek ile ilişkilidir @tr
definition: Bir kaynağı, bir görüntünün veya üç boyutlu formun boyutlarının temsil edilen şeyin boyutlarına oranıyla ilişkilendirir. @tr
scope note: Ölçek, kaynakta temsil edilen yatay, dikey, açısal ve/veya diğer ölçümlere uygulanabilir. @tr

has scale designation
status: Published
type: Property
lexical alias: scaleDesignation.en
definition: Relates a resource to a general designation of a lack of a ratio of the dimensions of the content of an image or three-dimensional form to the dimensions of the thing it represents.
label: har målestoksbetegnelse @da
definition: Relaterer en ressource til en almindelig betegnelse for manglen på forhold mellem indholdet af et billede eller en tredimensionel form, og dimensionerne for den ting, billedet eller formen repræsenterer. @da
label: heeft schaalaanduiding @nl
label: له تسمية مقياس @ar
definition: يربط بين مصدر وتسمية عامة لنقص نسبة أبعاد محتوى صورة أو شكل ثلاثي الأبعاد إلى أبعاد الشيء الذي تمثله. @ar
label: mittakaavan määrite aineistolle @fi
definition: Liittää aineiston yleiseen määritteeseen kuvan tai kolmiulotteisen muodon ja niiden esittämän asian mittojen välisten mittasuhteiden puuttumisesta. @fi
label: hat Maßstabsbezeichnung @de
definition: Setzt eine Ressource in Beziehung zu einer allgemeinen Bezeichnung für ein fehlendes Verhältnis der Abmessungen des Inhalts eines Bilds oder einer dreidimensionalen Form zu den Abmessungen der Sache, das es/sie repräsentiert. @de
label: 有比例尺标识 @zh-hans
definition: 将一种资源与关于一个图像或三维形式之内容的尺寸与其所表示的事物之尺寸之比缺失的一般标识关联起来。 @zh-hans
label: méretarány-jelölése a következő: @hu
definition: Hozzákapcsol egy forrást egy általános megjelöléshez, amely egy kép vagy egy háromdimenziós forma tartalmi dimenzióinak és az általa ábrázolt dolog dimenzióinak arányának hiányára vonatkozik. @hu
label: ölçek tanımlaması ile ilişkilidir @tr
definition: Bir kaynağı, bir görüntünün veya üç boyutlu formun içeriğinin boyutlarının temsil ettiği şeyin boyutlarına oranının eksikliğinin genel bir tanımıyla ilişkilendirir. @tr

has scale of still image or three-dimensional form
status: Published
definition: Relates a resource to a ratio of the dimensions of a still image or three-dimensional form embodied by a resource to the dimensions of the thing it represents.
type: Property
sub property of: has scale
lexical alias: scaleOfStillImageOrThreeDimensionalForm.en
label: har målestoksforhold for fast billede eller tredimensionel form @da
definition: Relaterer en ressource til et forhold mellem et fast billede eller en tredimensionel form i et udtryk og dimensionerne for den ting, billedet eller formen repræsenterer. @da
label: heeft schaal van stilstaand beeld of drie-dimensionale vorm @nl
label: له مقياس صورة ثابتة أو شكل ثلاثي الأبعاد @ar
definition: يربط بين مصدر ونسبة أبعاد صورة ثابتة أو شكل ثلاثي الأبعاد يجسده مصدر بأبعاد الشيء الذي يمثله. @ar
label: stillkuvan tai kolmiulotteisen muodon mittakaava aineistossa @fi
definition: Liittää aineiston suhteeseen, joka on stillkuvan tai kolmiulotteisen muodon mittojen suhde esitetyn kohteen mittoihin. @fi
label: hat Maßstab eines unbewegten Bilds oder einer dreidimensionalen Form @de
definition: Setzt eine Ressource in Beziehung zu einem Verhältnis der Maße eines unbewegten Bilds oder einer dreidimensionalen Form, das/die in einer Ressource verkörpert wird, zu den Maßen der Sache, die es/sie repräsentiert. @de
label: 有静态图像或三维形式的比例尺 @zh-hans
definition: 将一种资源与资源所具体化的静态图像或三维形式的尺寸与其所代表的实体尺寸之比关联起来。 @zh-hans
label: állókép vagy háromdimenziós forma méretaránya a következő: @hu
definition: Hozzákapcsol egy forrást egy forrásban megtestesített állókép vagy háromdimenziós forma méretének és a forrás által ábrázolt dolog méretének viszonyításához. @hu
label: durağan görüntü veya üç boyutlu formun ölçeği ile ilişkilidir @tr
definition: Bir kaynağı, bir hareketsiz görüntünün veya kaynak tarafından somutlaştırılan üç boyutlu formun boyutlarının, temsil ettiği öğenin boyutlarına oranıyla ilişkilendirir. @tr

has scheme of nomen
status: Published
lexical alias: schemeOfNomen.en
definition: Relates a nomen to a scheme in which a nomen is established.
scope note: The scheme can be a value or vocabulary encoding scheme or a syntax encoding scheme.
type: Property
label: heeft schema van nomen @nl
label: له خطة لتسمية @ar
definition: يربط بين تسمية وخطة يتكون من خلالها إنشاء التسمية. @ar
scope note: يمكن أن تكون الخطة عبارة عن قيمة أو خطة ترميز مصطلحات او خطة ترميز بناء جملة. @ar
label: har skema for nomen @da
definition: Relaterer et nomen til et skema, hvori der er etabelerat en appellation. @da
scope note: Skemaet kan være et værdi eller et vokabularkodningsskema, eller et syntakskodningsskema. @da
label: nomenin järjestelmä @fi
definition: Liittää nomenin järjestelmään, jossa nimitys on luotu. @fi
scope note: Järjestelmä voi olla arvojen, sanaston tai syntaksin merkintäjärjestelmä. @fi
label: hat Schema eines Nomens @de
definition: Setzt ein Nomen in Beziehung zu einem Schema, in dem eine Bezeichnung festgelegt ist. @de
scope note: Das Schema kann entweder ein Value oder Vocabulary Encoding Scheme oder ein Syntax Encoding Scheme sein. @de
label: 有命名的体系 @zh-hans
definition: 将一个命名与命名在其中建立的一个体系关联起来。 @zh-hans
scope note: 该体系可以是值或词表编码体系或者串编码体系 @zh-hans
definition: Relaciona un nomen amb un esquema en el qual s’estableix un nomen. @ca
label: nomen sémája a következő: @hu
definition: Hozzákapcsol egy noment egy sémához, amelyben egy megnevezés testet ölt. @hu
scope note: A séma lehet egy érték, vagy szótárkódolási séma, vagy egy szintaxis kódolási sémája. @hu
label: isim şeması ile ilişkilidir @tr
definition: Bir ismi, içinde bir unvanın oluşturulduğu bir şema ile ilişkilendirir. @tr
scope note: Şema bir değer veya kelime kodlama şeması veya bir sözdizimi kodlama şeması olabilir. @tr

has scope of usage (Deprecated)
status: Deprecated
type: Property
lexical alias: scopeOfUsage.en
definition: Relates a name to a type or form of resource associated with a name chosen as a preferred name for an agent. (Deprecated)
label: har anvendelsessammenhæng @da
definition: Relaterer et navn til en ressourcetype eller -form, der er knyttet til det navn, der er valgt som foretrukket navn for en agent. @da

has scope of validity
status: Published
lexical alias: scopeOfValidity.en
definition: Relates a resource to an unstructured or structured description of a range of resources for which the value of a metadata resource is valid.
type: Property
label: heeft scope van validiteit @nl
label: له نطاق صلاحية @ar
definition: يربط بين مصدر ووصف غير مهيكل أو مهيكل لمجموعة من الأعمال التي تكون قيمة مصدر الميتاداتا صالحة لها. @ar
label: har gyldighedsomfang @da
definition: Relaterer en ressource til en ustruktureret eller struktureret beskrivelse af en række ressourcer, for hvilke værdien af en metadataressource er gyldig. @da
label: aineiston voimassaoloaika @fi
definition: Liittää aineiston rakenteistettuun tai rakenteistamattomaan kuvaukseen aineistojen aikavälistä, jonka ajan metatietoaineiston arvo on voimassa. @fi
label: hat Gültigkeitsbereich @de
definition: Setzt eine Ressource in Beziehung zu einer unstrukturierten oder strukturierten Beschreibung eines breiten Spektrums von Ressourcen, für die der Wert einer Metadatenressource gültig ist. @de
label: 有适用范围 @zh-hans
definition: 将一种资源与一种元数据资源的取值对其有效的资源范围的非结构化或结构化描述关联起来。 @zh-hans
label: érvényes alkalmazási területe a következő: @hu
definition: Hozzákapcsol egy forrást egy forrástartomány struktúrálatlan vagy struktúrált leírásához, amelyre érvényes egy metaadatforrás értéke. @hu
label: geçerlilik kapsamı ile ilişkilidir @tr
definition: Bir kaynağı, bir üst veri kaynağının değerinin geçerli olduğu bir kaynak aralığının yapılandırılmamış veya yapılandırılmış bir tanımıyla ilişkilendirir. @tr

has screenplay
status: Published
definition: Relates a resource to a resource that is a textual resource that complements a resource that uses a screenplay.
type: Property
sub property of: is complemented by
inverse of: is screenplay for
lexical alias: screenplay.en
label: er manuskript @da
definition: Relaterer en ressource til en ressource, der indeholder teksten til en film, et tv-program eller en video. @da
label: heeft scenario @nl
label: käsikirjoitus (aineisto) @fi
label: له سيناريو @ar
definition: يربط بين مصدر ومصدر يتحقق كنص يكمل مصدر يستخدم سيناريو. @ar
definition: Liittää aineiston aineistoon, joka käyttää käsikirjoitusta ja jota on täydennetty tekstiteoksella. @fi
label: hat Drehbuch @de
definition: Setzt eine Ressource in Beziehung zu einer textlichen Ressource, die eine Ressource ergänzt, die ein Drehbuch verwendet. @de
label: 有影视剧剧本 @zh-hans
definition: 将一种资源与作为一种文字资源并补充使用一种影视剧剧本的一种资源的一种资源关联起来。 @zh-hans
definition: Relaciona un recurs amb un recurs que és un recurs textual que complementa un recurs que usa un guió. @ca
label: forgatókönyve a következő: @hu
definition: Hozzákapcsol egy forrást egy forráshoz, amely szövegként valósul meg és kiegészít egy forgatókönyvet használó forrást. @hu
has subproperty: has motion picture screenplay
has subproperty: has television screenplay
has subproperty: has video screenplay
label: senaryo ile ilişkilidir @tr
definition: Bir kaynağı, senaryo kullanan bir kaynağı tamamlayan ve metin olarak gerçekleştirilen bir kaynakla ilişkilendirir. @tr

is screenplay based on
status: Published
definition: Relates a resource to a resource that is adapted as a screenplay for a motion picture, television program, or video.
type: Property
sub property of: is adaptation of
inverse of: is adapted as screenplay
lexical alias: screenplayBasedOn.en
label: er drejebog baseret på @da
definition: Relaterer en ressource til en ressource, der er blevet bearbejdet til drejebog til en film, et tv-program eller en video. @da
label: is scenario gebaseerd op @nl
label: näytelmäsovitus aineistosta @fi
label: هو سيناريو معتمد على @ar
definition: يربط بين مصدر ومصدر تم تحويره كسيناريو لفيلم سينمائي، أو برنامج تليفزيوني، أو فيديو. @ar
definition: Liittää aineiston aineistoon, joka on sovitettu elokuvan, televisio-ohjelman tai videon käsikirjoitukseksi. @fi
label: ist Drehbuch basierend auf @de
definition: Setzt eine Ressource in Beziehung zu einer Ressource, die als Drehbuch für einen Film, eine Fernsehsendung oder ein Video bearbeitet ist. @de
label: 是基于……的影视剧剧本 @zh-hans
definition: 将一种资源与被改编为电影、电视节目或视频剧本的一种资源关联起来。 @zh-hans
label: forgatókönyv a következőből: @hu
definition: Hozzákapcsol egy forrást egy forráshoz, amelyet egy mozgókép, tévéműsor vagy videó forgatókönyveként adaptáltak. @hu
has subproperty: is motion picture screenplay based on
has subproperty: is television screenplay based on
has subproperty: is video screenplay based on
label: senaryo şuna dayanmaktadır @tr
definition: Bir kaynağı, sinema filmi, televizyon programı, ya da video senaryosu olarak uyarlanmış bir kaynakla ilişkilendirir. @tr

is screenplay for
status: Published
definition: Relates a resource to a resource that uses a screenplay and that is complemented by a textual resource.
type: Property
sub property of: is complemented by
inverse of: has screenplay
lexical alias: screenplayFor.en
label: er drejebog til @da
definition: Relaterer en ressource til en ressource, såsom en film, et skuespil, et tv-program eller en video, der anvender en ressources tekst som manuskript. @da
label: is scenario voor @nl
label: käsikirjoitusaineisto @fi
label: هو سيناريو لـ @ar
definition: يربط بين مصدر ومصدر يستخدم سيناريو ويكمله مصدر نصي. @ar
definition: Liittää aineiston aineistoon, joka käyttää käsikirjoitusta ja jota on täydennetty tekstiaineistolla. @fi
label: ist Drehbuch für @de
definition: Setzt eine Ressource in Beziehung zu einer Ressource, die ein Drehbuch verwendet und durch eine textliche Ressource vervollständigt wird. @de
label: 是……的影视剧剧本 @zh-hans
definition: 将一种资源与使用一种影视剧剧本并被一种文字资源补充的一种资源关联起来。 @zh-hans
label: forgatókönyv a következőhöz: @hu
definition: Hozzákapcsol egy forrást egy forgatókönyvet használó forráshoz, amelyet egy szöveges forrás egészít ki. @hu
has subproperty: is screenplay for motion picture
has subproperty: is screenplay for television program
has subproperty: is screenplay for video
label: senaryosu @tr
definition: Bir kaynağı, senaryo kullanan ve metinsel bir kaynakla tamamlanan bir kaynakla ilişkilendirir. @tr

is screenplay for motion picture
status: Published
definition: Relates a resource to a resource that is a motion picture that is complemented by a textual resource.
type: Property
sub property of: is screenplay for
inverse of: has motion picture screenplay
lexical alias: screenplayForMotionPicture.en
label: er manuskript til film @da
definition: Relaterer en ressource til en ressource, der anvender teksten som drejebog til en film. @da
label: is scenario voor speelfilm @nl
label: käsikirjoitus elokuvaan (aineisto) @fi
label: هو سيناريو لفيلم سينمائي @ar
definition: يربط بين مصدر ومصدر عبارة عن فيلم سينمائي يكمله مصدر نصي. @ar
definition: Liittää aineiston elokuva-aineistoon, jota on täydennetty tekstiaineistolla. @fi
label: ist Drehbuch für Film @de
definition: Setzt eine Ressource in Beziehung zu einer Filmressource, die durch eine textliche Ressource vervollständigt wird. @de
label: 是电影的剧本 @zh-hans
definition: 将一种资源与作为一种电影并被一种文字资源补充的一种资源关联起来。 @zh-hans
label: forgatókönyv mozgóképhez: @hu
definition: Hozzákapcsol egy forrást egy mozgókép-forráshoz, amelyet egy szöveges forrás egészít ki. @hu
label: sinema filmi için senaryodur @tr
definition: Bir kaynağı, metinsel kaynakla tamamlanan bir sinema filmi olan bir kaynakla ilişkilendirir. @tr

is screenplay for television program
status: Published
definition: Relates a resource to a resource that is a television program that is complemented by a textual resource.
type: Property
sub property of: is screenplay for
inverse of: has television screenplay
lexical alias: screenplayForTelevisionProgram.en
label: er manuskript til tv-program @da
definition: Relaterer en ressource til en ressource, der anvender teksten som drejebog til et TV-program. @da
label: is scenario voor televisieprogramma @nl
label: käsikirjoitus televisio-ohjelmaan (aineisto) @fi
label: هو سيناريو لبرنامج تليفزيوني @ar
definition: يربط بين مصدر ومصدر عبارة عن برنامج تليفزيوني يكمله مصدر نصي. @ar
definition: Liittää aineiston televisio-ohjelma-aineistoon, jota on täydennetty tekstiaineistolla. @fi
label: ist Drehbuch für Fernsehsendung @de
definition: Setzt eine Ressource in Beziehung zu einer Fernsehsendung, die durch eine textliche Ressource vervollständigt wird. @de
label: 是电视节目的剧本 @zh-hans
definition: 将一种资源与作为一种电视节目并被一种文字资源补充的一种资源关联起来。 @zh-hans
label: forgatókönyv televízióműsorhoz: @hu
definition: Hozzákapcsol egy forrást egy televízióműsor-forráshoz, amelyet egy szöveges forrás egészít ki. @hu
label: televizyon programı için oluşturulmuş bir senaryodur @tr
definition: Bir kaynağı, metinsel kaynakla tamamlanan bir televizyon programı olan bir kaynakla ilişkilendirir. @tr

is screenplay for video
status: Published
definition: Relates a resource to a resource that is a video that is complemented by a textual resource.
type: Property
sub property of: is screenplay for
inverse of: has video screenplay
lexical alias: screenplayForVideo.en
label: er bearbejdelse til video @da
definition: Relaterer en ressource til en ressource, der anvender teksten som drejebog til en video. @da
label: is scenario voor video @nl
label: käsikirjoitus videoon (aineisto) @fi
label: هو سيناريو لفيديو @ar
definition: يربط بين مصدر ومصدر عبارة عن فيديو يكمله مصدر نصي. @ar
definition: Liittää aineiston videoaineistoon, jota on täydennetty tekstiaineistolla. @fi
label: ist Drehbuch für Video @de
definition: Setzt eine Ressource in Beziehung zu einer Videoressource, die durch ein textliches Werk ergänzt wird. @de
label: 是视频的剧本 @zh-hans
definition: 将一种资源与作为一种视频并被一种文字资源补充的一种资源关联起来。 @zh-hans
label: forgatókönyv videóhoz: @hu
definition: Hozzákapcsol egy forrást videóforráshoz, amelyet egy szöveges forrás egészít ki. @hu
label: video için senaryodur @tr
definition: Bir kaynağı, metinsel kaynakla tamamlanan bir video olan bir kaynakla ilişkilendirir. @tr

has screenwriter
status: Published
definition: Relates a resource to an agent who is an author of a screenplay, script, or scene.
type: Property
sub property of: has author
inverse of: is screenwriter of
lexical alias: screenwriter.en
label: har manuskriptforfatter @da
definition: Relaterer en ressource til en forfatter af en drejebog, et manuskript eller en scene. @da
label: heeft scenarioschrijver @nl
label: aineiston käsikirjoittaja @fi
label: له كاتب سيناريو @ar
definition: يربط مصدر بوكيل هو مؤلف سيناريو، أو نص، أو مشهد. @ar
definition: Liittää aineiston toimijaan, joka on näytelmän, käsikirjoituksen tai kohtauksen kirjoittaja. @fi
label: hat Drehbuchautorin/Drehbuchautor @de
definition: Setzt eine Ressource in Beziehung zu einer Verfasserin/einem Verfasser eines Drehbuchs, eines Skripts oder einer Szene. @de
label: 有影视剧编剧 @zh-hans
definition: 将一种资源与作为影视剧剧本、脚本或场景著者的一个行为者关联起来。 @zh-hans
label: forgatókönyvírója a következő: @hu
definition: Hozzákapcsol egy forrást egy ágenshez, aki szerzője egy forgatókönyvnek, szövegkönyvnek vagy jelenetnek. @hu
label: senarist ile ilişkilidir @tr
definition: Bir kaynağı, senaryo, metin ya da sahne yazarı olan bir temsilci ile ilişkilendirir. @tr

is screenwriter of
status: Published
definition: Relates an agent to a resource that involves a responsibility of an agent for authoring a screenplay, script, or scene.
type: Property
sub property of: is author of
inverse of: has screenwriter
lexical alias: screenwriterOf.en
label: er manuskriptforfatter til @da
definition: Relaterer en forfatter af en drejebog, et manuskript eller en scene til en ressource. @da
label: is scenarioschrijver van @nl
label: هو كاتب سيناريو لـ @ar
definition: يربط بين وكيل ومصدر ينطوي على مسؤولية وكيل عن تأليف سيناريو، أو نص، أو مشهد. @ar
label: käsikirjoittaja (toimija) aineistossa @fi
definition: Liittää toimijan aineistoon, jossa toimija vastaa näytelmän, käsikirjoituksen tai kohtauksen kirjoittamisesta. @fi
label: ist Drehbuchautorin/Drehbuchautor von @de
definition: Setzt einen Akteur in Beziehung zu einer Ressource, bei der ein Akteur für das Verfassen eines Drehbuchs, eines Skripts oder einer Szene verantwortlich ist. @de
label: 是……的影视剧编剧 @zh-hans
definition: 将一个行为者与涉及写作影视剧剧本、脚本或场景的一个行为者的责任的一种资源关联起来。 @zh-hans
label: forgatókönyvírója a következőnek: @hu
definition: Hozzákapcsol egy ágenst egy forráshoz, amelyhez hozzátartozik egy ágens felelőssége egy forgatókönyv, szövegkönyv vagy jelenet szerzőségéért. @hu
label: senarist @tr
definition: Bir temsilciyi, bir senaryo, metin veya sahne yazmakla görevli bir temsilcinin sorumluluğunu içeren bir kaynakla ilişkilendirir. @tr

has script
status: Published
definition: Relates a resource to a set of characters or symbols used to express written language content of a resource.
type: Property
sub property of: has form of notation
lexical alias: script.en
label: har skrift @da
definition: Relaterer en ressource til et sæt af tegn og/eller symboler, der anvendes til at udtrykke det skrevne sprogindhold i en ressource. @da
label: heeft schrift @nl
label: aineiston kirjoitusjärjestelmä @fi
label: له نص @ar
definition: يربط بين مصدر ومجموعة من الأحرف أو الرموز المستخدمة للتعبير عن محتوى لغة مكتوبة لمصدر. @ar
definition: Liittää aineiston joukkoon merkkejä tai symboleja, joita käytetään aineiston kirjoitetun kielellisen sisällön ilmaisemiseen. @fi
label: hat Schrift @de
definition: Setzt eine Ressource in Beziehung zu einem Satz von Zeichen oder Symbolen der verwendet wird, um den geschriebenen Sprachinhalt einer Ressource auszudrücken. @de
label: 有文字 @zh-hans
definition: 将一种资源与用于表达一种资源的书写语言内容的字符或符号的集合关联起来。 @zh-hans
label: írása a következő: @hu
definition: Hozzákapcsol egy forrást karakterek vagy szimbólumok egy csoportjához, amelyet arra használnak, hogy egy forrás nyelvi tartalmát kifejezze. @hu
label: yazı sistemi ile ilişkilidir @tr
definition: Bir kaynağı, bir kaynağın yazılı dil içeriğini ifade etmek için kullanılan bir dizi karakter veya sembolle ilişkilendirir. @tr

is script for radio program
status: Published
definition: Relates a resource to a resource that is a radio program that is complemented by a textual resource.
type: Property
sub property of: is complemented by
inverse of: has radio script
lexical alias: scriptForRadioProgram.en
label: er manuskript til radioprogram @da
definition: Relaterer en ressource til en ressource, der anvender kildeværkets tekst som manuskript til et radioprogram. @da
label: is script voor radioprogramma @nl
label: käsikirjoitus radio-ohjelmaan (aineisto) @fi
label: هو نص لبرنامج إذاعي @ar
definition: يربط بين مصدر ومصدر عبارة عن برنامج إذاعي يكمله مصدر نصي. @ar
definition: Liittää aineiston radio-ohjelma-aineistoon, jota on täydennetty tekstiaineistolla. @fi
label: ist Skript für Hörfunksendung @de
definition: Setzt eine Ressource in Beziehung zu einer Hörfunksendung, die durch eine textliche Ressource vervollständigt wird. @de
label: 是广播节目的剧本 @zh-hans
definition: 将一种资源与作为一种广播节目并被一种文字资源补充的一种资源关联起来。 @zh-hans
label: szövegkönyv rádióműsorhoz: @hu
definition: Hozzákapcsol egy forrást egy rádióműsor-forráshoz, amelyet egy szöveges forrás egészít ki. @hu
label: radyo programı için komut dosyasıdır @tr
definition: Bir kaynağı, metinsel kaynakla tamamlanan ve bir radyo programı olan bir kaynakla ilişkilendirir. @tr

has script of nomen
status: Published
lexical alias: scriptOfNomen.en
definition: Relates a nomen to a set of characters or symbols with which an appellation is formed.
type: Property
label: heeft schrift van nomen @nl
label: له نص لتسمية @ar
definition: يربط بين تسمية ومجموعة من تمثيلات أو رموز تتكون من خلالها التسمية. @ar
label: har skriftsystem for nomen @da
definition: Relaterer et nomen til et set af tegn eller sympoler, som en appellation er dannet med. @da
label: nomenin kirjoitusjärjestelmä @fi
definition: Liittää nomenin merkkien ja symbolien joukkoon, josta nimitys muodostetaan. @fi
label: hat Schrift eines Nomens @de
definition: Setzt ein Nomen in Beziehung zu einem Satz von Zeichen oder Symbolen, mit denen eine Bezeichnung gebildet wird. @de
label: 有命名的文字 @zh-hans
definition: 将一个命名与用以形成一个称谓的一个字符或符号的集合关联起来。 @zh-hans
label: nomen írásrendszere a következő: @hu
definition: Hozzákapcsol egy noment egy karakter- vagy szimbólumkészlethez, amellyel egy megnevezést megformáznak. @hu
label: ismin yazı sistemi ile ilişkilidir @tr
definition: Bir ismi, bir unvanın oluşturulduğu bir dizi karakter veya sembolle ilişkilendirir. @tr

has sculptor
status: Published
definition: Relates a resource to an agent who is an artist who is responsible for creating a three-dimensional resource by modeling, carving, or similar technique.
type: Property
sub property of: has artist
inverse of: is sculptor of
lexical alias: sculptor.en
label: har skulptør @da
definition: Relaterer en ressource til en kunstner, der er ansvarlig for at have skabt et tredimensionelt værk vha. modellering, billedhuggerkunst eller en lignende teknik. @da
label: heeft beeldhouwer @nl
label: aineiston kuvanveistäjä @fi
label: له نَحّات @ar
definition: يربط مصدر بوكيل هو فنان ينطوي على مسؤوليته إنشاء مصدر ثلاثي الأبعاد عن طريق النمذجة أو النحت أو تقنية مشابهة. @ar
definition: Liittää aineiston toimijaan, joka vastaa kolmiulotteisen teoksen luomisesta muovaamalla, veistämällä tai vastaavalla tekniikalla. @fi
label: hat Bildhauerin/Bildhauer @de
definition: Setzt eine Ressource in Beziehung zu einer Künstlerin/einem Künstler, die/der für die Schaffung einer dreidimensionalen Ressource durch Modellieren, Schnitzen oder ähnliche Techniken verantwortlich ist. @de
label: 有雕塑家 @zh-hans
definition: 将一种资源与作为一个艺术家并通过模型、雕刻或类似技术负责创建一种三维资源的一个行为者关联起来。 @zh-hans
label: szobrásza a következő: @hu
definition: Hozzákapcsol egy forrást egy művész ágenshez, aki felelős egy háromdimenziós forrás megalkotásáért modellezési, faragási vagy hasonló technikával. @hu
label: heykeltıraş ile ilişkilidir @tr
definition: Bir kaynağı, kaynağı modelleme, oyma ya da benzer teknikle üç boyutlu bir kaynak olarak oluşturmaktan sorumlu sanatçı olan bir temsilci ile ilişkilendirir. @tr

is sculptor of
status: Published
definition: Relates an agent to a resource that involves a responsibility of an agent for three-dimensional modeling, carving, or similar technique.
type: Property
sub property of: is artist of
inverse of: has sculptor
lexical alias: sculptorOf.en
label: er skulptør til @da
definition: Relaterer en kunstner, der er ansvarlig for at have skabt en tredimensionel ressource vha. modellering, billedhuggerkunst eller lignende teknik til en ressource. @da
label: is beeldhouwer van @nl
label: هو نَحّات لـ @ar
definition: يربط بين وكيل ومصدر ينطوي على مسؤولية وكيل عن النمذجة ثلاثية الأبعاد، أو النحت، أو تقنية مماثلة. @ar
label: kuvanveistäjä (toimija) aineistossa @fi
definition: Liittää toimijan aineistoon, jossa toimija vastaa kolmiulotteisen teoksen luomisesta muovaamalla, veistämällä tai vastaavalla tekniikalla. @fi
label: ist Bildhauerin/Bildhauer von @de
definition: Setzt einen Akteur in Beziehung zu einer Ressource, bei der ein Akteur für dreidimensionales Modellieren, Schnitzen oder ähnliche Techniken verantwortlich ist. @de
label: 是……的雕塑家 @zh-hans
definition: 将一个行为者与涉及三维模型、雕刻或类似技术的一个行为者的责任的一种资源关联起来。 @zh-hans
label: szobrásza a következőnek: @hu
definition: Hozzákapcsol egy ágenst egy forráshoz, amelyhez hozzátartozik egy ágens felelőssége háromdimenziós modellezésért, faragásért vagy hasonló technikáért. @hu
label: heykeltıraşı @tr
definition: Bir temsilciyi, üç boyutlu modelleme, oyma veya benzer bir tekniğe ilişkin bir temsilcnin sorumluluğunu içeren bir kaynakla ilişkilendirir. @tr

has seller
status: Published
definition: Relates a resource to an agent who is a former owner of a resource who sells the item to another owner.
type: Property
sub property of: has former owner
inverse of: is seller of
lexical alias: seller.en
label: har sælger @da
definition: Relaterer en ressource til en tidligere ejer af en ressource, der har solgt denne ressource til en anden ejer. @da
label: heeft verkoper @nl
label: aineiston myyjä @fi
label: له بائع @ar
definition: يربط بين مصدر ومالك سابق لمصدر قام ببيع هذا المصدر إلى مالك آخر. @ar
definition: Liittää aineiston aiempaan omistajaan, joka on myynyt aineiston toiselle omistajalle. @fi
label: hat Verkäuferin/Verkäufer @de
definition: Setzt eine Ressource in Beziehung zu einer früheren Eigentümerin/einem früheren Eigentümer einer Ressource, die/der die Ressource einer anderen Eigentümerin/einem anderen Eigentümer verkauft hat. @de
label: 有出售者 @zh-hans
definition: 将一种资源与作为先前拥有者将资源出售给另一个拥有者的一个行为者关联起来。 @zh-hans
definition: Relaciona un recurs amb un agent que és un antic propietari d’un recurs que ven lítem a un altre propietari. @ca
label: értékesítője a következő: @hu
definition: Hozzákapcsol egy forrást egy forrás korábbi tulajdonosához, amely a forrást egy másik tulajdonosnak értékesítette. @hu
label: satıcı ile ilişkilidir @tr
definition: Bir kaynağı, kaynağı başka bir sahibe satan kaynağın eski sahibiyle ilişkilendirir. @tr

is seller of
status: Published
definition: Relates an agent to a resource that is sold to another owner who is an agent.
type: Property
sub property of: is former owner of
inverse of: has seller
lexical alias: sellerOf.en
label: er sælger af @da
definition: Relaterer en tidligere ejer af en ressource, der solgte den ressource til en ressource. @da
label: is verkoper van @nl
label: aineiston myyjä (toimija) @fi
label: هو بائع لـ @ar
definition: يربط بين وكيل ومصدر تم بيعه إلى مالك آخَر وكيل. @ar
definition: Liittää toimijan aineistoon, jonka toimija on myynyt toiselle omistajalle. @fi
label: ist Verkäuferin/Verkäufer von @de
definition: Setzt einen Akteur in Beziehung zu einer Ressource, die an eine andere Eigentümerin/einen anderen Eigentümer (Akteur) verkauft wird. @de
label: 是……的出售者 @zh-hans
definition: 将一个行为者与被出售给另一个拥有者的一种资源关联起来。 @zh-hans
label: értékesítője a következőnek: @hu
definition: Hozzákapcsol egy ágenst egy forráshoz, amelyet egy másik tulajdonos ágensnek adnak el. @hu
label: satıcısıdır @tr
definition: Bir temsilciyi, temsilci olan başka bir sahibine satılan bir kaynakla ilişkilendirir. @tr

is separated from
status: Published
definition: Relates a resource to a resource that is a diachronic resource that is continuing whose partial content is continued by another diachronic resource.
type: Property
sub property of: is preceded by
inverse of: is separated into
lexical alias: separatedFrom.en
label: er adskilt fra @da
definition: Relaterer en ressource til en ressource, hvoraf en del af indholdet er udskilt, så der er dannet en ny ressource. @da
label: is afgesplitst van @nl
label: eronnut aineistosta @fi
label: هو منفصل عن @ar
definition: يربط بين مصدر ومصدر ممتد زمنيًا ومستمر، ومحتواه الجزئي مستمر من خلال مصدر آخر ممتد زمنيًا. @ar
definition: Liittää aineiston diakroniseen aineistoon, jonka osittaista sisältöä jatkaa toinen aineisto. @fi
label: ist abgespalten von @de
definition: Setzt eine Ressource in Beziehung zu einer fortlaufenden diachronen Ressource, deren Inhalt teilweise durch eine andere diachrone Ressource fortgeführt wird. @de
label: 被从……分离出 @zh-hans
definition: 将一种资源与作为一种现行历时资源、其部分内容被另一种历时资源继承的一种资源关联起来。 @zh-hans
label: elválasztva a következőből: @hu
definition: Hozzákapcsol egy forrást egy folyamatos diakronikus forráshoz, amelynek részleges tartalmát egy másik diakronikus forrás folytatja. @hu
label: -den ayrılmıştır @tr
definition: Bir kaynağı, kısmi içeriği başka bir artzamanlı kaynak tarafından sürdürülen, halen devam eden artzamanlı bir kaynak olan kaynakla ilişkilendirir. @tr

is separated into
status: Published
definition: Relates a resource to a resource that is a diachronic resource that continues the partial content of another diachronic resource that is continuing.
type: Property
sub property of: is succeeded by
inverse of: is separated from
lexical alias: separatedInto.en
scope note: This element applies in general to a successive resource.
label: er delvis fortsat i @da
definition: Relaterer en ressource til en ressource, hvoraf en del af indholdet er udskilt fra en tidligere ressource, så en ny ressource er dannet. @da
scope note: Denne relation anvendes generelt for periodika. @da
label: is afgesplitst in @nl
label: aineistosta jakautunut @fi
label: هو مُنقَسِم إلى @ar
definition: يربط بين مصدر ومصدر ممتد زمنيًا يُكْمل المحتوى الجزئي لمصدر آخر ممتد زمنيًا ومستمر. @ar
scope note: ينطبق هذا العنصر بشكل عام على مصدر متتالي. @ar
definition: Liittää aineiston aineistoon, oka on diakroninen aineisto, joka jatkaa toisen diakronisen jatkuvan aineiston sisältöä osittain. @fi
scope note: Tämä elementti soveltuu yleensä peräkkäisesti ilmestyvään aineistoon. @fi
label: ist teilweise fortgesetzt von @de
definition: Setzt eine Ressource in Beziehung zu einer diachronen Ressource, die teilweise den Inhalt einer anderen fortlaufenden diachronen Ressource fortführt. @de
scope note: Im Allgemeinen trifft dieses Element auf eine sukzessive Ressource zu. @de
label: 被分出而成 @zh-hans
definition: 将一种资源与作为一种历时资源、继承另一种继续出版的历时资源的部分内容的一种资源关联起来。 @zh-hans
scope note: 该元素一般适用于一种相继资源。 @zh-hans
label: elválasztva a következőbe: @hu
definition: Hozzákapcsol egy forrást egy diakronikus forráshoz, amely egy másik folytatódó diakronikus forrás részleges tartalmát folytatja. @hu
scope note: Ez az elem általában a folyamatos forrásokra vonatkozik. @hu
label: ayrılmıştır @tr
definition: Bir kaynağı, sürmekte olan başka bir artzamanlı kaynağın kısmi içeriğini sürdüren artzamanlı bir kaynak olan kaynakla ilişkilendirir. @tr
scope note: Bu öğe, genel olarak ardışık bir kaynak için geçerlidir. @tr

has sequel
status: Published
definition: Relates a resource to a resource that extends the narrative of another resource forwards in time.
type: Property
sub property of: is succeeded by
inverse of: is sequel to (Deprecated)
lexical alias: sequel.en
label: er efterfølger @da
definition: Relaterer en ressource til en senere ressource, der fortsætter en tidligere ressources fortælling. @da
alternative label: is prequel to
label: heeft sequel @nl
label: aineiston jatko-osa @fi
alternative label: aineiston esiosa @fi
label: له تَتِمّة @ar
definition: يربط بين مصدر ومصدر يوسع السرد لمصدر آخر يسبقه زمنيًا. @ar
alternative label: له بادئه لـ @ar
alternative label: er forløber til @da
definition: Liitää aineiston aineistoon, joka laajentaa toisen aineiston kerrontaa ajassa eteenpäin. @fi
label: hat Sequel @de
definition: Setzt eine Ressource in Beziehung zu einer Ressource, die den Erzählstrang einer anderen Ressource zeitlich vorwärts erweitert. @de
alternative label: ist Prequel zu @de
alternative label: 是……的前篇 @zh-hans
label: 有续篇 @zh-hans
definition: 将一种资源与把另一种资源的叙述在时间上往前延伸的一种资源 @zh-hans
alternative label: előzménye a következőnek: @hu
label: folytatása a következő: @hu
definition: Hozzákapcsol egy forrást egy forráshoz, amely időben előre terjeszti ki egy másik forrás narratíváját. @hu
alternative label: öncesidir @tr
label: sonraki ile ilişkilidir @tr
definition: Bir kaynağı, başka kaynağın anlatımını zaman içinde ileri yönde genişleten bir kaynakla ilişkilendirir. @tr

is sequel to (Deprecated)
status: Deprecated
definition: Relates a resource to a resource whose narrative is continued by a later resource.. (Deprecated)
type: Property
sub property of: is preceded by
inverse of: has sequel
lexical alias: sequelTo.en
label: er efterfølger til @da
definition: Relaterer en ressource til en ressource, hvis fortælling fortsættes af en senere ressource. @da

has sequential resource relationship with (Deprecated)
status: Deprecated
type: Property
definition: Relates a resource to a resource that is preceded by or succeeded by a related resource. (Deprecated)
lexical alias: sequentialResourceRelationshipWith.en
label: har sekventiel ressource-relation med @da
definition: Relaterer en ressource til en ressource, der er forudgået af eller efterfulgt af en ressource. @da
has subproperty: is preceded by
has subproperty: is succeeded by

has sequential version
status: Published
lexical alias: sequentialVersion.en
definition: Relates a resource to a resource that is created by changing the extension plan of a resource from integrating to successive.
type: Property
sub property of: has transformation by extension plan
label: heeft sequentiële versie @nl
label: له إصدارة متتالية @ar
definition: يربط بين مصدر ومصدر تم إنشاؤه عن طريق تغيير خطة توسع المصدر من متكامل إلى متتالي. @ar
label: har sekventiel version @da
definition: Relaterer en ressource til en ressource, der er skabt ved at ændre udvidelsesplanen for en ressource fra integrerende til fortløbende. @da
label: peräkkäinen versio (aineisto) @fi
definition: Liittää aineiston aineistoon, joka on luotu vaihtamalla laajennussuunnitelma päivittyvästä peräkkäisesti ilmestyväksi. @fi
label: hat fortlaufende Version @de
definition: Setzt eine Ressource in Beziehung zu einer Ressource, die durch Änderung des Erweiterungsplans einer Ressource von integrierend auf sukzessiv erstellt wird. @de
label: 有序列版本 @zh-hans
definition: 将一种资源与通过将一种资源的扩充计划从集成性改变为相继性而被创建的一种资源关联起来。 @zh-hans
label: szekvenciális változata a következő: @hu
definition: Hozzákapcsol egy forrást egy forráshoz, amely egy forrás közlési tervének integrálóról folyamatossá való változásával jött létre. @hu
label: sonraki sürüm ile ilişkilidir @tr
definition: Bir kaynağı, bir kaynağın genişletme planını birleşimden ardışığa değiştirerek oluşturulan bir kaynakla ilişkilendirir. @tr

is sequential version of
status: Published
lexical alias: sequentialVersionOf.en
definition: Relates a resource to a resource that has an extension plan that is changed from successive to integrating to create a resource.
type: Property
sub property of: is transformation by extension plan of
inverse of: has sequential version
label: is sequentiële versie van @nl
label: هو إصدارة متتالية لـ @ar
definition: يربط بين مصدر ومصدر له خطة توسع تم تغييرها من متتالي إلى متكامل لإنشاء مصدر. @ar
label: er sekventiel version af @da
definition: Relaterer en ressource til en ressource, som har en udvidelsesplan, der er ændret fra fortløbende til integrerende for at skabe en ressource. @da
label: peräkkäinen versio (aineisto) @fi
definition: Liittää aineiston aineistoon, jolla on aineiston luomista varten peräkkäisesti ilmestyvästä päivittyväksi muutettu laajennussuunnitelma. @fi
label: ist fortlaufende Version von @de
definition: Setzt eine Ressource in Beziehung zu einer Ressource, deren Erweiterungsplan von sukzessiv auf integrierend geändert wird, um eine Ressource zu erstellen. @de
label: 是……的序列版本 @zh-hans
definition: 将一种资源与有扩充计划并被改变为从相继性到集成性以创建一种资源的一种资源关联起来。 @zh-hans
label: szekvenciális változata a következőnek: @hu
definition: Hozzákapcsol egy forrást egy forráshoz, amelynek a közlési terve folyamatosról integrálóvá változott egy forrás létrejövetele érdekében. @hu
label: sıralı sürümüdür @tr
definition: Bir kaynağı, bir kaynak oluşturmak için ardışıktan birleştirmeye değiştirilen bir genişletme planına sahip bir kaynakla ilişkilendirir. @tr

has serialized version
status: Published
lexical alias: serializedVersion.en
definition: Relates a resource to a resource that is created by changing the extension plan of a resource from static to successive.
type: Property
sub property of: has transformation by extension plan
label: heeft seriële versie @nl
label: له إصدارة متسلسلة @ar
definition: يربط بين مصدر ومصدر تم إنشاؤه عن طريق تغيير خطة توسع المصدر من ثابت إلى متتالي. @ar
label: har serialiseret version @da
definition: Relaterer en ressource til en ressource der er skabt ved at ændre udvidelsesplanen for en ressource fra statisk til fortløbende. @da
label: sarjaversio (aineisto) @fi
definition: Liittää aineiston aineistoon, joka on luotu vaihtamalla laajennussuunnitelma staattisesta peräkkäisesti ilmestyväksi. @fi
label: hat Fortsetzungs-Version @de
definition: Setzt eine Ressource in Beziehung zu einer Ressource, die durch Änderung des Erweiterungsplans einer Ressource von statisch auf sukzessiv erstellt wird. @de
label: 有序列化的版本 @zh-hans
definition: 将一种资源与通过将一种资源的扩充计划从静态到相继性变化而被创建的一种资源关联起来。 @zh-hans
label: sorozati változata a következő: @hu
definition: Hozzákapcsol egy forrást egy forráshoz, amely egy forrás közlési tervének statikusról folyamatossá való változásával jött létre. @hu
label: serileştirilmiş sürüm ile ilişkilidir @tr
definition: Bir kaynağı, bir kaynağın genişletme planını durağandan ardışığa değiştirerek oluşturulan bir kaynakla ilişkilendirir. @tr

is serialized version of
status: Published
lexical alias: serializedVersionOf.en
definition: Relates a resource to a resource that has an extension plan that is changed from successive to static to create a resource.
type: Property
sub property of: is transformation by extension plan of
inverse of: has serialized version
label: is seriële versie van @nl
label: هو إصدارة متسلسلة لـ @ar
definition: يربط بين مصدر ومصدر له خطة توسع تم تغييرها من متتالي إلى ثابت لإنشاء مصدر. @ar
label: er serialiseret version af @da
definition: Relaterer en ressource til en ressource, som har en udvidelsesplan, der er ændret fra fortløbende til statisk for at skabe en ressource. @da
label: ist Fortsetzungs-Version von @de
definition: Setzt eine Ressource in Beziehung zu einer Ressource, deren Erweiterungsplan von sukzessiv auf statisch geändert wird, um eine Ressource zu erstellen. @de
label: sarjaversio aineistosta @fi
definition: Liittää aineiston aineistoon, jolla on laajennussuunnitelma, joka on muutettu peräkkäisestä staattiseksi aineiston luomiseksi. @fi
label: 是……的序列化的版本 @zh-hans
definition: 将一种资源与有扩充计划并被改变为从相继性到静态以创建一种资源的一种资源关联起来。 @zh-hans
label: sorozati változata a következőnek: @hu
definition: Hozzákapcsol egy forrást egy forráshoz, amelynek a közlési terve folyamatosról statikussá változott egy forrás létrejövetele érdekében. @hu
label: serileştirilmiş sürümüdür @tr
definition: Bir kaynağı, bir kaynak oluşturmak için ardışıktan durağana değiştirilen bir genişletme planına sahip kaynakla ilişkilendirir. @tr

has serial number
status: Published
type: Property
lexical alias: serialNumber.en
sub property of: has numeric designation of musical resource
inverse of: is serial number of
definition: Relates a resource to a nomen that is a numeric designation of musical resource that is assigned by a composer or a reference source that indicates a sequence of musical resources that share the same title or that share the same title and the same representative medium of performance.
label: heeft serienummer @nl
label: له رقم تسلسلي @ar
definition: يربط بين مصدر وتسمية رقمية لمصدر موسيقي يخصص من جانب ملحن أو مصدر مرجعي يشير إلى تسلسل المصادر الموسيقية التي تشترك في نفس العنوان أو التي تشترك في نفس العنوان ونفس وسيلة الأداء الممثلة. @ar
label: har serienummer @da
definition: Relaterer en ressource til en numerisk betegnelse for en musikressource, som er tildelt af en komponist eller en referencekilde, som indikerer en sekvens af musikressourcer, som deler samme titel eller deler samme titel og den samme repræsentative besætning. @da
label: järjestysnumero aineistolle @fi
definition: Liittää aineiston musiikkiteoksen numeeriseen määritteeseen, joka on säveltäjän antama tai tietolähteestä otettu. Määrite ilmaisee saman nimekkeen tai saman nimekkeen ja saman edustavan esityskokoonpanon jakavien musiikkiaineistoten järjestystä. @fi
label: hat laufende Nummer @de
definition: Setzt eine Ressource in Beziehung zu einer numerischen Bezeichnung einer Musikressource, die von einer Komponistin/einem Komponisten vergeben oder aus einem Nachschlagewerk entnommen wird und auf eine Folge von Musikressourcen hinweist, die den gleichen Titel oder den gleichen Titel und die gleiche repräsentative Besetzung haben. @de
label: 有序列号 @zh-hans
definition: 将一种资源与作为由作曲者或参考信息源分配、表示有同样题名或者同样题名和同样表演表现媒介的音乐资源序列的音乐资源的数字标识的一个命名关联起来。 @zh-hans
definition: Relaciona un recurs amb un nomen que és una designació numèrica d’un recurs musical que és assignada per un compositor o una font de referència que indica una seqüència de recursos musicals que comparteixen el mateix títol o que comparteixen el mateix títol i el mateix repartiment d’execució representatiu. @ca
label: sorozati száma a következő: @hu
definition: Hozzákapcsol egy forrást egy zenei forrás számjelzéséhez, amelyet egy zeneszerző vagy egy irodalomjegyzékben szereplő forrás rendelt hozzá, amely az olyan zenei források sorrendjét jelöli, amelyek azonos címűek, vagy azonos a címük és a jellegzetes az előadásmédiumuk. @hu
label: seri numarası ile ilişkilidir @tr
definition: Bir kaynağı, aynı başlığı paylaşan veya aynı başlığı ve aynı temsili performans aracını paylaşan bir dizi müzik kaynağını gösteren bir besteci veya referans kaynağı tarafından belirlenen müzik kaynağının sayısal belirteciyle ilişkilendirir. @tr

is serial number of
status: Published
type: Property
lexical alias: serialNumberOf.en
sub property of: is numeric designation of musical resource of
inverse of: has serial number
definition: Relates a nomen to a musical resource that has a numeric designation of musical resource assigned by a composer or a reference source that indicates a sequence of musical resources that share the same title or that share the same title and the same representative medium of performance.
label: is serienummer van @nl
label: هو رقم مسلسل لـ @ar
definition: يربط تسمية بمصدر موسيقي له تسمية رقمية لمصدر موسيقي يخصص من جانب ملحن أو مصدر مرجعي يشير إلى تسلسل المصادر الموسيقية التي تشترك في نفس العنوان أو التي تشترك في نفس العنوان ونفس وسيلة الأداء الممثلة. @ar
label: er serienummer af @da
definition: Relaterer et nomen til en musikressource, som har en numerisk betegnelse af en musikressource, tildelt af en komponist eller af en referencekilde, som indikerer en sekvens af musikressourcer, som deler samme titel eller deler samme titel og den samme repræsentative besætning. @da
label: järjestysnumero aineistossa @fi
definition: Liittää nomenin musiikkiaineistoon, jolla on säveltäjän aineistoluettelosta tai tietolähteestä otettu järjestysnumero. Määrite ilmaisee saman nimekkeen tai saman nimekkeen ja saman edustavan esityskokoonpanon jakavien musiikkiaineistoten järjestystä. @fi
label: ist Opus-Nummer von @de
definition: Setzt ein Nomen in Beziehung zu einer Musikressource, die über eine numerische Bezeichnung einer Musikressource verfügt, die von einer Komponistin/einem Komponisten vergeben oder aus einem Nachschlagewerk entnommen wird und auf eine Folge von Musikressourcen hinweist, die den gleichen Titel oder den gleichen Titel und die gleiche repräsentative Besetzung haben. @de
label: 是……的序列号 @zh-hans
definition: 将一个命名与有由作曲者或参考信息源分配、表示有同样题名或者同样题名和同样表演表现媒介的音乐资源序列的音乐资源的一个数字标识的一种音乐资源关联起来。 @zh-hans
label: sorozatszáma a következőnek: @hu
definition: Hozzákapcsol egy noment egy zenei forráshoz, amely rendelkezik egy zeneszerző vagy egy irodalomjegyzékben szereplő forrás által hozzárendelt forrásazonosítóval, amely egy számjelzéssel az olyan zenei források sorrendjét jelöli, amelyek azonos címűek, vagy azonos mind a címük mind a jellegzetes előadásmédiumuk. @hu
label: seri numarasıdır @tr
definition: Bir ismi, aynı başlığı paylaşan veya aynı başlığı ve aynı temsili icra ortamını paylaşan bir dizi müzikal kaynağı gösteren bir besteci veya referans kaynağı tarafından atanmış sayısal bir müzikal kaynak tanımına sahip bir müzikal kaynakla ilişkilendirir. @tr

has series statement
status: Published
definition: Relates a resource to a statement that identifies a series that is associated with a resource and a numbering of a resource within the series,
type: Property
lexical alias: seriesStatement.en
scope note: A series statement may also include information identifying one or more subseries to which the resource being described belongs. A series statement sometimes includes statements of responsibility relating to a series or subseries.
label: har seriebeskrivelse @da
definition: Relaterer en ressource til oplysninger, der identificerer en serie, som en ressource er en del af, samt nummerering af en ressource i serien. @da
scope note: En seriebeskrivelse kan også indeholde oplysninger, der identificerer en eller flere underserier, som den beskrevne ressource er en del af. En seriebeskrivelse inkluderer sommetider en eller flere ophavsangivelser relaterede til serien eller underserien. @da
label: heeft reeksvermelding @nl
label: aineiston sarjamerkintö @fi
label: له بيان سلسلة @ar
definition: يربط بين مصدر وبيان يحدد سلسلة مرتبطة بمصدر وترقيم مصدر داخل سلسلة. @ar
scope note: قد يتضمن بيان السلسلة أيضًا معلومات تُحدد سلسلة فرعية واحدة أو أكثر ينتمي إليها المصدر الموصوف.وفي بعض الأحيان يتضمن بيان السلسلة بيانات المسؤولية المتعلقة بسلسلة أو سلسلة فرعية. @ar
definition: Liittää aineiston huomautukseen, joka sisältää tietoa aineistoon liittyvästä sarjasta. @fi
label: hat Gesamttitelangabe @de
definition: Setzt eine Ressource in Beziehung zu einer Angabe, die eine Reihe identifiziert, mit der eine Ressource in Verbindung steht und die eine Zählung einer Ressource innerhalb der Reihe aufweist. @de
scope note: Darunter können auch Informationen fallen, die eine Unterreihe oder mehrere Unterreihen identifizieren, zu der/denen die zu beschreibende Ressource gehört. Darunter können auch Verantwortlichkeitsangaben fallen, die sich auf eine Reihe oder Unterreihe beziehen. @de
scope note: Sarjamerkintöön voi kuulua myös yhden tai useamman kuvailtavaan aineistoon sisältyvän alasarjan identifioiva tieto. Joskus sarjamerkintö sisältää sarjaan tai alasarjaan liittyviä vastuullisuusmerkintöjä. @fi
label: 有丛编说明 @zh-hans
definition: 将一种资源与标识和一种资源有关的一种丛编以及一种资源在丛编中的编号的一个说明关联起来。 @zh-hans
scope note: 丛编说明还可以包括标识被描述资源所属于的一个或多个分丛编。丛编说明有时候包括与丛编或分丛编有关的责任说明。 @zh-hans
label: sorozati közlése a következő: @hu
definition: Hozzákapcsol egy forrást egy közléshez, amely azonosít egy forráshoz kapcsolódó sorozatot és a forrás sorozaton belüli számozását. @hu
scope note: Egy sorozati közlés magában foglalhat egy vagy több, a leírt forráshoz tartozó, alsorozatot azonosító információt. Időnként egy az oldalak vagy a lemezek számának, vagy egyedi oldalnak vagy lemeznek megfelelő szám követi. @hu
label: seri bildirimi ile ilişkilidir @tr
definition: Bir kaynağı, bir kaynakla ilişkili bir diziyi ve dizi içindeki bir kaynağın numaralandırmasını tanımlayan bir bildirim ile ilişkilendirir, @tr
scope note: Bir dizi bildirimi, ayrıca tanımlanan kaynağın ait olduğu bir veya daha fazla alt diziyi tanımlayan bilgileri içerebilir. Bir dizi bildirimi bazen bir diziye veya alt diziye ilişkin sorumluluk bildirimlerini de içerir. @tr

is set to music as
status: Published
definition: Relates a resource to a non-dramatic musical resource, other than an oratorio, that uses a text of another resource.
type: Property
sub property of: has derivative
inverse of: is musical setting of
lexical alias: setToMusicAs.en
label: er sat i musik som @da
definition: Relaterer en ressource til en ressource af et ikke-dramatisk musikværk, bortset fra et oratorium, der anvender en oprindelig ressources tekst. @da
label: is op muziek gezet als @nl
label: tekstiin perustuva musiikkiaineisto @fi
label: هو إعداد موسيقي كـ @ar
definition: يربط بين مصدر ومصدر موسيقي غير درامي، بخلاف الموسيقى الدينية، التي تستخدم نص مصدر آخر @ar
definition: Ei-näytelmällisen musiikkiaineiston (muun kuin oratorion) ekspressio, jonka teksti on peräisin toisesta aineistosta. @fi
label: ist vertont als @de
definition: Setzt eine Ressource in Beziehung zu einer nicht dramatischen Musikressource, bei der es sich nicht um ein Oratorium handelt, die den Text einer anderen Ressource verwendet. @de
label: 配乐为 @zh-hans
definition: 将一种资源与不同于清唱剧、使用另一种资源的文本的一种非戏剧音乐资源关联起来。 @zh-hans
label: zenei átiratként való feldolgozása a következő: @hu
definition: Hozzákapcsol egy forrást egy nem-drámai zenei forráshoz, amely nem oratórium, és amely egy másik forrás szövegét használja. @hu
label: şu olarak müzik biçiminde ayarlanmış: @tr
definition: Bir kaynağı, oratoryo dışında, başka kaynağın metnini kullanan belirgin nitelik taşımayan bir müzikal kaynak ile ilişkilendirir. @tr

has singer
status: Published
definition: Relates a resource to an agent who is a performer who contributes to a resource by using their voice, with or without instrumental accompaniment, to produce music.
type: Property
sub property of: has performer
inverse of: is singer of
lexical alias: singer.en
label: har sanger @da
definition: Relaterer en ressource til en optrædende, der har bidraget til en ressource ved at bruge sin stemme, med eller uden instrumentalledsagelse, til at skabe musik. @da
scope note: En sangers optræden kan omfatte egentlige ord, men gør det ikke nødvendigvis. @da
label: heeft zanger @nl
label: laulajana ainestossa @fi
label: له مغنِ @ar
definition: يربط مصدر بوكيل مؤدِ يُساهم بأحد المصادر من خلال أداء صوتي، بمصاحبة أو دون مصاحبة آلة موسيقية، لإنتاج أغنية. @ar
definition: Liittää toimijan aineistoon, jonka tekemiseen hän osallistuu esiintymällä lauluäänellä (soitinsäestyksellä tai ilman) tuottaakseen musiikkia. @fi
label: hat Sängerin/Sänger @de
definition: Setzt eine Ressource in Beziehung zu einer Ausführenden/einem Ausführenden, die/der zu einer Ressource beiträgt, indem sie/er durch ihre/seine Singstimme, mit oder ohne instrumentale Begleitung, Musik erzeugt. @de
label: 有演唱者 @zh-hans
definition: 将一种资源与作为一个表演者通过用其人声（不管是否有乐器伴奏）产生音乐而对一种资源有贡献的一个行为者关联起来。 @zh-hans
label: énekese a következő: @hu
definition: Hozzákapcsol egy forrást egy előadó ágenshez, aki hozzájárul egy forráshoz azzal, hogy a hangját használja zene előállítására hangszeres kísérettel vagy anélkül. @hu
label: şarkıcı ile ilişkilidir @tr
definition: Bir kaynağı, müzik üretmek için enstrüman eşliğinde veya eşliksiz olarak sesini kullanarak bir kaynağa katkıda bulunan bir sanatçı olan temsilci ile ilişkilendirir. @tr

is singer of
status: Published
definition: Relates an agent to a resource that includes a contribution by an agent who is a performer of voice, with or without instrumental accompaniment, to produce music.
type: Property
sub property of: is performer of
inverse of: has singer
lexical alias: singerOf.en
label: er sanger i @da
definition: Relaterer en udøver der bidrager til en ressource ved at bruge sin stemme, med eller uden instrumentalledsagelse, til at skabe musik til en ressource. @da
label: is zanger van @nl
label: laulajana ainestossa @fi
label: هو مغنِ لـ @ar
definition: يربط بين وكيل ومصدر يتضمن إسهام وكيل يقوم بأداء صوتي، بمصاحبة أو دون مصاحبة آلة موسيقية، لإنتاج أغنية. @ar
definition: Liittää toimijan aineistoon, jonka tekemiseen hän osallistuu esiintymällä lauluäänellä (soitinsäestyksellä tai ilman) tuottaakseen musiikkia. @fi
label: ist Sängerin/Sänger von @de
definition: Setzt einen Akteur in Beziehung zu einer Ressource, zu der ein Akteur beiträgt, indem er durch seine Singstimme, mit oder ohne instrumentale Begleitung, Musik erzeugt. @de
label: 是……的演唱者 @zh-hans
definition: 将一个行为者与包括作为人声表演者（不管是否有乐器伴奏）产生音乐的一个行为者的贡献的一种资源关联起来。 @zh-hans
label: énekese a következőnek: @hu
definition: Hozzákapcsol egy ágenst egy forráshoz, amely magában foglalja egy ágens közreműködését zenei produktum hanggal történő előadásában hangszeres kísérettel vagy anélkül. @hu
label: Şarkıcısı @tr
definition: Bir temsilciyi, müzik üretmek için enstrüman eşliğinde veya eşliksiz bir ses sanatçısı olan bir temsilcinin katkısını içeren bir kaynakla ilişkilendirir. @tr

has software developer
status: Published
type: Property
lexical alias: softwareDeveloper.en
definition: Relates a resource to an agent who contributes to a resource by researching, designing, implementing, or testing software.
inverse of: is software developer of
sub property of: has contributor (Deprecated)
label: har softwareudvikler @da
definition: Relaterer en ressource til en agent, der har bidraget til en ressource ved at researche, designe, implementere eller teste software. @da
label: heeft softwareontwikkelaar @nl
label: له مطور برمجيات @ar
definition: يربط مصدر بوكيل يُساهم في مصدر من خلال البحث في البرمجيات، أو تصميمها، أو تنفيذها، أو اختبارها. @ar
label: ohjelmistokehittäjä aineistossa @fi
definition: Liittää aineiston toimijaan, joka on osallisena aineistossa tutkimalla, suunnittelemalla, toteuttamalla tai testaamalla ohjelmistoa. @fi
label: hat Softwareentwicklerin/Softwareentwickler @de
definition: Setzt eine Ressource in Beziehung zu einem Akteur, der zu einer Ressource beiträgt, indem er Software untersucht, konzipiert, implementiert oder testet. @de
label: 有软件开发者 @zh-hans
definition: 将一种资源与通过研究、设计、实施或测试软件而对一种资源有贡献的一个行为者关联起来。 @zh-hans
label: szoftverfejlesztője a következő: @hu
definition: Hozzákapcsol egy forrást egy ágenshez, amely hozzájárul egy forráshoz azzal, hogy szoftvereket kutat, tervez, implementál vagy tesztel. @hu
label: yazılımcı ile ilişkilidir @tr
definition: Bir kaynağı, yazılım araştırarak, tasarlayarak, uygulayarak veya test ederek bir kaynağa katkıda bulunan bir temsilci ile ilişkilendirir. @tr

is software developer of
status: Published
type: Property
lexical alias: softwareDeveloperOf.en
definition: Relates an agent to a resource that includes a contribution by an agent of researching, designing, implementing, or testing software.
inverse of: has software developer
sub property of: is contributor of (Deprecated)
label: er softwareudvikler til @da
definition: Relaterer en agent, der har bidraget til en ressource ved at researche, designe, implementere eller teste software til en ressource. @da
label: is softwareontwikkelaar van @nl
label: هو مطور برمجيات لـ @ar
definition: يربط بين وكيل ومصدر يتضمن إسهام وكيل في البحث في البرمجيات، أو تصميمها، أو تنفيذها، أو اختبارها. @ar
label: ohjelmistokehittäjä (toimija) aineistossa @fi
definition: Liittää toimijan aineistoon, jossa toimija on osallisena aineistossa tutkimalla, suunnittelemalla, toteuttamalla tai testaamalla ohjelmistoa. @fi
label: ist Softwareentwicklerin/Softwareentwickler von @de
definition: Setzt einen Akteur in Beziehung zu einer Ressource, zu der ein Akteur beiträgt, indem er Software untersucht, konzipiert, implementiert oder testet. @de
label: 是……的软件开发者 @zh-hans
definition: 将一个行为者与包括研究、设计、实施或测试软件的一个行为者的贡献的一种资源关联起来。 @zh-hans
label: szoftverfejlesztője a következőnek: @hu
definition: Hozzákapcsol egy forrást egy forráshoz, amely magában foglalja az ágens közreműködését szoftverkutatásban, tervezésben, implementálásban vagy tesztelésben. @hu
definition: Relaciona un agent amb un recurs que inclou una contribució d’un agent en la recerca, el disseny, la posada en marxa o l’examen de programari. @ca
label: yazılımcısı @tr
definition: Bir temsilciyi, yazılımı araştıran, tasarlayan, uygulayan veya test eden temsilcinin katkılarını içeren bir kaynakla ilişkilendirir. @tr

has sound characteristic
status: Published
definition: Relates a resource to a technical specification relating to an encoding of sound in a resource.
type: Property
lexical alias: soundCharacteristic.en
label: har lydkarakteristika @da
definition: Relaterer en ressource til en teknisk specifikation relateret til kodning af lyd i en ressource. @da
label: heeft kenmerken geluid @nl
label: äänen ominaisuudet aineistossa @fi
label: له خاصية صوت @ar
definition: يربط بين مصدر ومواصفات فنية متعلقة بتشفير صوت في مصدر. @ar
definition: Liittää aineiston aineiston sisältämän äänen koodaamisen tekniseen määritykseen. @fi
label: hat Toneigenschaft @de
definition: Setzt eine Ressource in Beziehung zu einer technischen Spezifikation, die sich auf die Kodierung des Tons in einer Ressource bezieht. @de
label: 有声音特征 @zh-hans
definition: 将一种资源与和一种资源中的声音的编码有关的一个技术规格关联起来。 @zh-hans
label: hangjellemzője a következő: @hu
definition: Hozzákapcsol egy forrást egy műszaki specifikációhoz, amely egy forrásban a hang kódolásához kapcsolódik. @hu
has subproperty: has configuration of playback channels
has subproperty: has groove characteristic
has subproperty: has playing speed
has subproperty: has recording medium
has subproperty: has special playback characteristic
has subproperty: has tape configuration
has subproperty: has track configuration
has subproperty: has type of recording
label: ses özelliği ile ilişkilidir @tr
definition: Bir kaynağı, bir kaynaktaki ses kodlanmasıyla ilgili teknik özellikler ile ilişkilendirir. @tr

has sound content
status: Published
definition: Relates a resource to an indication of the presence or absence of sound embodied by a resource.
type: Property
lexical alias: soundContent.en
label: har lydindhold @da
definition: Relaterer en ressource til en tilstedeværelse eller fravær af lyd i en ressource. @da
scope note: Sound content is present in an resource with a content type of "recorded music", "sounds", or "spoken word."
label: heeft geluidscontent @nl
label: له محتوى صوت @ar
definition: يربط بين مصدر وإشارة إلى وجود أو عدم وجود صوت متجسد في مصدر. @ar
scope note: محتوى صوت متواجد في مصدر له نوع محتوى من "موسيقى مُسجلة"، " أصوات"، أو "كلمة منطوقة". @ar
scope note: Lydindhold findes i en ressource med indholdstype "indspillet musik", "lyd", eller "talet ord". @da
label: aineiston äänisisältö @fi
definition: Liittää aineiston ilmaukseen aineiston sisältämän äänen mukanaolosta tai puuttumisesta. @fi
scope note: Äänisisältö ilmaistaan aineistossa sisältötyypin arvolla "esitetty musiikki", "ääni" tai "puhe". @fi
label: hat Toninhalt @de
definition: Setzt eine Ressource in Beziehung zu einer Angabe über das Vorhandensein beziehungsweise Nichtvorhandensein von Ton, der durch eine Ressource verkörpert wird. @de
scope note: Toninhalte gibt es in einer Ressource mit dem Inhaltstyp aufgeführte Musik, Töne oder gesprochene Worte. @de
label: 有声音内容 @zh-hans
definition: 将一种资源与一种资源所具体化的声音出现或不出现的指示关联起来。 @zh-hans
scope note: 声音内容出现于有如下内容类型值的一种内容表达：“表演音乐”、“声音”、或“口语” @zh-hans
label: hangtartalma a következő: @hu
definition: Hozzákapcsol egy forrást egy forrásban megtestesülő, a hang jelenlétét vagy hiányát mutató jelöléshez. @hu
scope note: Hangtartalmat tartalmazó forrás a következő tartalomtípusokra vonatkozó értékekkel: „előadott zene”, „hangok” és „beszéd”. @hu
label: ses içeriği ile ilişkilidir @tr
definition: Bir kaynağı, bir kaynak tarafından somutlaştırılan sesin varlığının veya yokluğunun bir göstergesi ile ilişkilendirir. @tr
scope note: Ses içeriği, içerik türü "kaydedilmiş müzik", "sesler" veya "söz" olan kaynakta mevcuttur. @tr

has sound designer
status: Published
type: Property
lexical alias: soundDesigner.en
definition: Relates a resource to an agent who contributes to a resource by designing and creating audio or sound components.
inverse of: is sound designer of
sub property of: has contributor (Deprecated)
label: har lyddesigner @da
definition: Relaterer en ressource til en agent, der har bidraget til een ressource ved at designe og skabe audio-/lyddele. @da
label: heeft geluidsontwerper @nl
label: له مصمم صوت @ar
definition: يربط مصدر بوكيل يُساهم في مصدر من خلال تصميم عناصر سمعية أو صوتية وإنشائها. @ar
label: aineiston äänisuunnittelija @fi
definition: Liittää aineiston toimijaan, joka on aineistossa osallisena suunnittelemalla ja luomalla äänikomponentteja. @fi
label: hat Tongestalterin/Tongestalter @de
definition: Setzt eine Ressource in Beziehung zu einem Akteur, der zu einer Ressource beiträgt, indem er Tonelemente entwirft und erstellt. @de
label: 有音响设计者 @zh-hans
definition: 将一种资源与通过设计和创建音频或音响组成部分而对资源有贡献的一个行为者关联起来。 @zh-hans
label: hangtervezője a következő: @hu
definition: Hozzákapcsol egy forrást egy ágenshez, amely hozzájárul egy forráshoz azzal, hogy megtervezi és megalkotja a hang/audióelemeket. @hu
label: ses tasarımcısı ile ilişkilidir @tr
definition: Bir kaynağı, ses veya ses bileşenlerini tasarlayarak ve oluşturarak bir kaynağa katkıda bulunan bir temsilci ile ilişkilendirir. @tr

is sound designer of
status: Published
type: Property
lexical alias: soundDesignerOf.en
definition: Relates an agent to a resource that includes a contribution by an agent of designing and creating audio or sound components
inverse of: has sound designer
sub property of: is contributor of (Deprecated)
label: er lyddesigner for @da
definition: Relaterer en agent, der har bidraget til en ressource ved at designe og skabe audio-/lyddele til en ressource. @da
label: is geluidsontwerper van @nl
label: هو مصمم صوت لـ @ar
definition: يربط بين وكيل ومصدر ينطوي على مسؤولية وكيل عن تصميم عناصر سمعية أو صوتية وإنشائها. @ar
label: äänisuunnittelija (toimija) aineistossa @fi
definition: Liittää toimijan aineistoon, jossa toimija on osallisena suunnittelemalla ja luomalla äänikomponentteja. @fi
label: ist Tongestalterin/Tongestalter von @de
definition: Setzt einen Akteur in Beziehung zu einer Ressource, zu der ein Akteur beiträgt, indem er Tonelemente entwirft und erstellt. @de
label: 是……的音响设计者 @zh-hans
definition: 将一个行为者与包括设计并创作音频或音响组成部分的一个行为者的贡献的一种资源关联起来。 @zh-hans
label: hangtervezője a következőnek: @hu
definition: Hozzákapcsol egy ágenst egy forráshoz, amely magában foglalja az ágens közreműködését audio- vagy hangösszetevők tervezésében és létrehozásában. @hu
label: Ses tasarımcısı @tr
definition: Bir temsilciyi, ses veya ses bileşenleri tasarlayan ve oluşturan bir temsilcinin katkısını içeren bir kaynakla ilişkilendirir. @tr

has sounds
status: Published
lexical alias: sounds.en
type: Property
sub property of: is complemented by
definition: Relates a resource to a resource that is realized as sound and that complements a resource.
label: heeft geluiden @nl
label: له أصوات @ar
definition: يربط بين مصدر ومصدر يتم تحقيقه على أنه صوت ويكمل مصدر. @ar
label: har lyd @da
definition: Relaterer en ressource til en ressource, der er realiseret som lyd og som supplerer en ressource. @da
label: ääniaineisto @fi
definition: Liittää aineiston toista aineistoa täydentävään aineistoon, joka on toteutettu äänenä. @fi
label: hat Töne @de
definition: Setzt eine Ressource in Beziehung zu einer Ressource aus Tönen, die eine Ressource ergänzt. @de
label: 有声音 @zh-hans
definition: 将一种资源与被实现为声音并补充一种资源的一种资源关联起来。 @zh-hans
label: hangjai a következők: @hu
definition: Hozzákapcsol egy forrást egy forráshoz, amely a forrást kiegészítő hangban fejeződik ki. @hu
label: sesler ile ilişkilidir @tr
definition: Bir kaynağı, ses olarak gerçekleştirilen ve bir kaynağı tamamlayan bir kaynakla ilişkilendirir. @tr

is sounds for
status: Published
lexical alias: soundsFor.en
type: Property
sub property of: is complemented by
inverse of: has sounds
definition: Relates a resource to a resource that is complemented by a resource that is realized as sound.
label: is geluiden voor @nl
label: هي أصوات لـ @ar
definition: يربط بين مصدر ومصدر يُكمله مصدر يتم تحقيقه على أنه صوت. @ar
label: er lyde for @da
definition: Relaterer en ressource til en ressource, der er suppleret med en ressource, som er realiseret som lyd. @da
label: ääniaineisto @fi
definition: Liittää aineiston äänenä toteutetulla aineistolla täydennettyyn aineistoon. @fi
label: sind Töne für @de
definition: Setzt eine Ressource in Beziehung zu einer Ressource, die durch eine Ressource aus Tönen vervollständigt wird. @de
label: 是……的声音 @zh-hans
definition: 将一种资源与被一种资源补充并被实现为声音的一种资源关联起来。 @zh-hans
label: hangok a következőhöz: @hu
definition: Hozzákapcsol egy forrást egy forráshoz, amelyet egy hangként kifejezett forrás egészít ki. @hu
label: için seslerdir @tr
definition: Bir kaynağı, ses olarak gerçekleştirilen bir kaynak tarafından tamamlanan bir kaynakla ilişkilendirir. @tr

has source consulted
status: Published
lexical alias: sourceConsulted.en
definition: Relates a resource to a resource in which there is evidence for a metadata resource.
type: Property
inverse of: is source consulted of
label: heeft geraadpleegde bron @nl
label: له مصدر استشارة @ar
definition: يربط بين مصدر ومصدر يوجد فيه دليل على مصدر الميتاداتا. @ar
label: har konsulteret kilde @da
definition: Relaterer en ressource til en ressource i hvilken der er evidens for en metadataressource. @da
label: käytetty lähde @fi
definition: Liittää aineiston aineistoon, jossa on todiste metatietoaineistolle. @fi
label: hat konsultierte Quelle @de
definition: Setzt eine Ressource in Beziehung zu einer Ressource, die Hinweise auf eine Metadatenressource enthält. @de
label: 有被查阅的信息源 @zh-hans
definition: 将一种资源与其中有元数据资源之证据的一种资源关联起来。 @zh-hans
label: felhasznált forrása a következő: @hu
definition: Hozzákapcsol egy forrást egy forráshoz, amelyben egy metaadatforrást alátámasztó bizonyíték található. @hu
label: başvurulan kaynak ile ilişkilidir @tr
definition: Bir kaynağı, içinde bir üst veri kaynağı için bilgi bulunan bir kaynakla ilişkilendirir. @tr

is source consulted of
status: Published
lexical alias: sourceConsultedOf.en
definition: Relates a resource to a resource that is a metadata resource for which a resource provides evidence.
type: Property
inverse of: has source consulted
label: is bron geraadpleegd van @nl
label: هو مصدر استشارة لـ @ar
definition: يربط بين مصدر ومصدر هو عبارة عن مصدر ميتاداتا حيث يعطي مصدر حجة أو برهانًا له. @ar
label: er kilde konsulteret af @da
definition: Relaterer en ressource til en ressource, som er en metadataressource, som en ressource giver evidens for. @da
label: käytetty lähde metatietoaineistossa @fi
definition: Liittää aineiston metatietoaineistoon, jonka todisteena aineisto on. @fi
label: ist konsultierte Quelle von @de
definition: Setzt eine Ressource in Beziehung zu einer Metadatenressource, für die eine Ressource den Nachweis erbringt. @de
label: 是……的被查阅的信息源 @zh-hans
definition: 将一种资源与作为一种元数据资源而且一种资源提供其证据的一种资源关联起来。 @zh-hans
label: felhasznált forrása a következőnek: @hu
definition: Hozzákapcsol egy forrást egy olyan metaadatforráshoz, amelyhez egy forrás bizonyítékot szolgáltat. @hu
label: başvuru kaynağıdır @tr
definition: Bir kaynağı, kaynağın kanıt sağladığı bir üstveri kaynağı olan bir kaynakla ilişkilendirir. @tr

has speaker
status: Published
definition: Relates a resource to an agent who is a performer who contributes to a resource by speaking words.
type: Property
sub property of: has performer
inverse of: is speaker of
lexical alias: speaker.en
label: har taler @da
definition: Relaterer en ressource til en optrædende, der har bidraget til en ressource ved at fremføre ord, såsom en forelæsning, tale etc. @da
label: heeft spreker @nl
label: puhujana aineistossa @fi
label: له مُتحدث @ar
definition: يربط مصدر بوكيل مؤدِ يُساهم بأحد المصادر من خلال التحدث بكلمات. @ar
definition: Liittää toimijan aineistoon, jonka tekemiseen hän osallistuu puhumalla, kuten luennoimalla tai pitämällä puheen tms. @fi
label: hat Rednerin/Redner @de
definition: Setzt eine Ressource in Beziehung zu einer Ausführenden/einem Ausführenden, die/der zu einer Ressource beiträgt, indem sie/er ein Musikinstrument spielt. @de
label: 有演说者 @zh-hans
definition: 将一种资源与作为一个表演者通过讲话而对一种资源有贡献的一个行为者关联起来。 @zh-hans
label: élőszavas előadója a következő: @hu
definition: Hozzákapcsol egy forrást egy előadó ágenshez, aki egy forráshoz élőszóval járul hozzá. @hu
label: konuşmacı ile ilişkilidir @tr
definition: Bir kaynağı, sözler söyleyerek bir kaynağa katkıda bulunan bir sanatçı olan temsilci ile ilişkilendirir. @tr

is speaker of
status: Published
definition: Relates an agent to a resource that includes a contribution by an agent of speaking words, such as a lecture, speech, etc.
type: Property
sub property of: is performer of
inverse of: has speaker
lexical alias: speakerOf.en
label: er taler i @da
definition: Relaterer en udøver der bidrager til en ressource ved at fremføre ord, fx en forelæsning, tale, etc. til en ressource @da
label: is spreker van @nl
label: puhujana aineistossa @fi
label: هو متحدث لـ @ar
definition: يربط بين وكيل ومصدر يتضمن إسهام وكيل بالتحدث بكلمات، كما في محاضرة، خطبة، إلخ. @ar
definition: Liittää toimijan aineistoon, jonka tekemiseen hän osallistuu puhumalla, kuten luennoimalla tai pitämällä puheen tms. @fi
label: ist Rednerin/Redner von @de
definition: Setzt einen Akteur in Beziehung zu einer Ressource, zu der ein Akteur beiträgt, indem er Worte, wie zum Beispiel einen Vortrag, eine Rede oder ähnliches, spricht. @de
label: 是……的演说者 @zh-hans
definition: 将一个行为者与包括有诸如讲座和演讲之类讲话的一个行为者的贡献的一种资源关联起来。 @zh-hans
label: élőszavas előadója a következőnek: @hu
definition: Hozzákapcsol egy ágenst egy forráshoz, amely magában foglalja egy ágens élőszóbeli közreműködését, például előadásként, beszédként stb. @hu
label: Konuşmacısı @tr
definition: Bir temsilciyi, ders, konuşma vb. gibi kelimeleri söyleyen temsilcinin katkısını içerildiği bir kaynakla ilişkilendirir. @tr

has special effects provider
status: Published
type: Property
lexical alias: specialEffectsProvider.en
definition: Relates a resource to an agent who contributes to a moving image or audio resource by designing and creating on-set special effects such as on-set mechanical effects and in-camera optical effects.
inverse of: is special effects provider of
sub property of: has contributor (Deprecated)
label: har leverandør af specialeffekter @da
definition: Relaterer en ressource til en agent, der har bidraget til en levende billed- eller audioressource ved at designe og skabe specialeffekter på stedet som fx mekaniske effekter og optiske kameraeffekter. @da
label: heeft aanbieder speciale effecten @nl
label: له مُوَرّد للمؤثرات الخاصة @ar
definition: يربط مصدر بوكيل يُساهم في مصدر فيلم سينمائي أو مصدر صوتي من خلال تصميم مؤثرات خاصة وإنشائها أثناء التصوير، مثل المؤثرات الميكانيكية والمؤثرات البصرية في الكاميرا. @ar
label: erikoistehosteiden tekijä @fi
definition: Liittää aineiston toimijaan, joka on osallisena liikkuvan kuvan aineiston tai ääniteosaineiston tekemisessä suunnittelemalla ja luomalla taltioinnin aikana tapahtuvat erikoistehosteet, kuten mekaaniset tehosteet ja kameralla toteutettavat optiset tehosteet. @fi
label: hat Special-effects-Provider @de
definition: Setzt eine Ressource in Beziehung zu einem Akteur, der zu einer Bewegtbild- oder Tonressource beiträgt, indem er am Set Spezialeffekte wie mechanische Effekte und optische Effekte in der Kamera entwirft und erstellt. @de
label: 有特殊效果提供者 @zh-hans
definition: 将一种资源与通过设计并创作现场特殊效果（例如现场机械效果和相机光学效果）而对一种动态图像或音频资源作出贡献的一个行为者关联起来。 @zh-hans
label: speciális effektusok szolgáltatója a következő: @hu
definition: Hozzákapcsol egy forrást egy ágenshez, amely hozzájárul egy mozgókép- vagy hangzóforráshoz azzal, hogy megtervezi és megalkotja az olyan helyszíni speciális effektusokat, mint például a helyszíni mechanikai hatások és kamerán belüli optikai effektusok. @hu
label: özel efekt sağlayıcısı ile ilişkilidir @tr
definition: Bir kaynağı, sette mekanik efektler ve kamera içi optik efektler gibi sette özel efektler tasarlayarak ve yaratarak hareketli bir görüntü veya ses kaynağına katkıda bulunan bir temsilci ile ilişkilendirir. @tr

is special effects provider of
status: Published
type: Property
lexical alias: specialEffectsProviderOf.en
definition: Relates an agent to a resource that includes a contribution designing and creating on-set special effects, such as on-set mechanical effects and in-camera optical effects.
inverse of: has special effects provider
sub property of: is contributor of (Deprecated)
label: er leverandør af specialeffekter til @da
definition: Relaterer en agent, der har bidraget til et udtryk af en levende billed- eller audioressource ved at designe og skabe specialeffekter på stedet til kulisser såsom mekaniske kulisseeffekter og optiske kameraeffekter til en ressource. @da
label: is aanbieder speciale effecten van @nl
label: هو مورد للمؤثرات الخاصة لـ @ar
definition: يربط بين وكيل ومصدر يشمل المساهمة في تصميم مؤثرات خاصة وإنشائها أثناء التصوير، مثل المؤثرات الميكانيكية المُحددة والمؤثرات البصرية في الكاميرا. @ar
label: erikoistehosteiden tekijä (toimija) aineistossa @fi
label: ist Special-effects-Provider von @de
definition: Setzt einen Akteur in Beziehung zu einer Ressource, die einen Beitrag zum Entwurf und zur Erstellung von Spezialeffekten am Set leistet, wie zum Beispiel mechanische Effekte am Set und optische Effekte in der Kamera. @de
definition: Liittää toimijan aineistoon, jonka tekemiseen toimija osallistuu suunnittelemalla ja luomalla taltioinnin aikana tapahtuvat erikoistehosteet, kuten mekaaniset tehosteet ja kameralla toteutettavat optiset tehosteet. @fi
label: 是……的特殊效果提供者 @zh-hans
definition: 将一个行为者与包括设计并创作现场特殊效果（例如现场机械效果和相机光学效果）的贡献的一种资源关联起来。 @zh-hans
label: speciális effektusok szolgáltatója a következőnek: @hu
definition: Hozzákapcsol egy forrást egy ágenshez, amely magában foglalja a közreműködést olyan helyszíni speciális effektusok tervezésében és létrehozásában, mint a mechanikai és kamerán belüli optikai hatások. @hu
label: Özel efektler sağlayan @tr
definition: Bir temsilciyi, mekanik efektler ve kamera ışık efektleri gibi sette özel efektlerin tasarlanması ve oluşturulmasına katkı sağlayan bir kaynakla ilişkilendirir. @tr

has special issue
status: Published
definition: Relates a resource to a resource that is an issue that is devoted to a specific topic.
type: Property
sub property of: has part resource
inverse of: is special issue of
lexical alias: specialIssue.en
label: er særnummer @da
definition: Relaterer en ressource til en ressource, der består af et enkelt nummer eller et tillæg til et periodikum eller en avis, helliget et bestemt emne og med eller uden nummerering. @da
label: heeft themanummer @nl
label: له إصدار خاص @ar
definition: يربط بين مصدر ومصدر عبارة عن عدد مخصص لموضوع محدد. @ar
label: erikoisnumero (aineisto) @fi
definition: Liittää aineiston aineistoon, joka on tietylle aiheelle omistettu numero. @fi
label: hat Sonderausgabe @de
definition: Setzt eine Ressource in Beziehung zu einer Ausgabe, die einem bestimmten Thema gewidmet ist. @de
label: 有特刊 @zh-hans
definition: 将一种资源与作为完全关于一个特定话题的一期的一种资源关联起来。 @zh-hans
label: különszáma a következő: @hu
definition: Hozzákapcsol egy forrást egy forráshoz, amely egy adott témának szentelt szám. @hu
label: özel sayı ile ilişkilidir @tr
definition: Bir kaynağı, belirli bir konuya yönelik bir sayı olan bir kaynakla ilişkilendirir. @tr

is special issue of
status: Published
definition: Relates a resource to a resource that has an issue that is devoted to a specific topic.
type: Property
sub property of: is part of resource
inverse of: has special issue
lexical alias: specialIssueOf.en
label: er særnummer af @da
definition: Relaterer en ressource til et periodikum eller avis, der indeholder et enkelt nummer eller et tillæg helliget et bestemt emne, med eller uden periodikanummerering, som fx. et jubilæumsnummer af en tidsskrift eller avis. @da
label: is themanummer van @nl
label: aineiston erikoisnumero @fi
label: إصدار خاص لـ @ar
definition: يربط بين مصدر ومصدر له عدد مخصص لموضوع محدد. @ar
definition: Liittää aineiston aineistoon, jolla on tietylle aiheelle omistettu numero. @fi
label: ist Sonderausgabe von @de
definition: Setzt eine Ressource in Beziehung zu einer Ressource, die eine Ausgabe einem bestimmten Thema gewidmet hat. @de
label: 是……的特刊 @zh-hans
definition: 将一种资源与有完全关于一个特定话题的一期的一种资源关联起来。 @zh-hans
label: különszáma a következőnek: @hu
definition: Hozzákapcsol egy forrást egy forráshoz, amely egy speciális témának szentelt számmal rendelkezik. @hu
label: özel konusu @tr
definition: Bir kaynağı, belirli bir konuya adanmış bir nüshası olan bir kaynakla ilişkilendirir. @tr

has special playback characteristic
status: Published
definition: Relates a resource to an equalization system, noise-reduction system, or other processing that is used in making an audio recording.
type: Property
sub property of: has sound characteristic
lexical alias: specialPlaybackCharacteristic.en
label: har særlige afspilningskarakteristika @da
definition: Relaterer en ressource til et equalizersystem, støjbegrænsningssystem etc., der er anvendt til at lave en lydoptagelse. @da
label: heeft speciale afspeelkenmerken @nl
label: aineiston äänentoiston erityisominaisuudet @fi
label: له خاصية خاصة للتشغيل @ar
definition: يربط بين مصدر ونظام موازن الترددات، نظام خفض ضوضاء، أو غيرها من النظم المُستخدمة في إعداد تسجيل صوتي. @ar
definition: Liittää aineiston äänitteen äänityksessä käytettyyn taajuuskorjausjärjestelmään, kohinanvaimennusjärjestelmään tai muuhun prosessointiin. @fi
label: hat besondere Wiedergabeeigenschaft @de
definition: Setzt eine Ressource in Beziehung zu einem Ausgleichssystem, einem Störgeräusch-Reduktionssystem oder einer anderen Verarbeitung, das/die bei der Erstellung von Audioaufnahmen verwendet wird. @de
label: 有特别回放特征 @zh-hans
definition: 将一种资源与在一种录音制作中所使用的平衡系统、降噪系统或其他处理关联起来。 @zh-hans
label: speciális visszajátszási jellemzője a következő: @hu
definition: Hozzákapcsol egy forrást egy kiegyenlítési rendszerhez, hangcsökkentő rendszerhez vagy egyéb eljáráshoz, amelyet egy hangfelvétel készítésénél használnak. @hu
label: özel oynatma özelliği ile ilişkilidir @tr
definition: Bir kaynağı, bir ekolayzer sistemi, gürültü azaltma sistemi veya bir ses kaydı yaparken kullanılan diğer işlemlerle ilişkilendirir. @tr

is split from
status: Published
definition: Relates a resource to a resource that is a diachronic resource that is completed whose partial content is continued by another diachronic resource.
type: Property
sub property of: is preceded by
inverse of: is split into
lexical alias: splitFrom.en
scope note: This element applies in general to a successive resource.
label: er delvis fortættelse af @da
definition: Relaterer en ressource til en ressource, der er delt i to eller flere separate ressourcer med nye titler. @da
scope note: Denne relation anvendes generelt for periodika. @da
label: is gesplitst uit @nl
label: jakautunut aineistosta @fi
label: هو منشطر من @ar
definition: يربط بين مصدر ومصدر ممتد زمنيًا ومكتمل، ومحتواه الجزئي مستمر من خلال مصدر آخر ممتد زمنيًا. @ar
scope note: ينطبق هذا العنصر بشكل عام على مصدر متتالي. @ar
definition: Liittää aineiston valmiiseen diakroniseen aineistoon, jonka osittaista sisältöä jatkaa toinen diakroninen aineisto. @fi
scope note: Tämä elementti soveltuu yleensä peräkkäisesti ilmestyvään aineistoon. @fi
label: ist teilweise Fortsetzung von @de
definition: Setzt eine Ressource in Beziehung zu einer abgeschlossenen diachronen Ressource, deren Inhalt teilweise durch eine andere diachrone Ressource fortgeführt wird. @de
scope note: Im Allgemeinen trifft dieses Element auf eine sukzessive Ressource zu. @de
label: 被从……分出 @zh-hans
definition: 将一种资源与作为一种已完成的历时资源、其部分内容被另一种历时资源继承的一种资源关联起来。 @zh-hans
scope note: 该元素一般适用于一种相继资源。 @zh-hans
label: kiválása a következőből: @hu
definition: Hozzákapcsol egy forrást egy befejezett diakronikus forráshoz, amelynek részleges tartalmát egy másik diakronikus forrás folytatja. @hu
scope note: Ez az elem általában a folyamatos forrásokra vonatkozik. @hu
label: ayrılır @tr
definition: Bir kaynağı, kısmi içeriğini başka bir artzamanlı kaynak tarafından sürdürülen, tamamlanmış art zamanlı bir kaynak olan kaynakla ilişkilendirir. @tr
scope note: Bu öğe, genel olarak ardışık bir kaynak için geçerlidir. @tr

is split into
status: Published
definition: Relates a resource to a resource that is a diachronic resource that continues the partial content of another diachronic resource that is completed.
type: Property
sub property of: is succeeded by
inverse of: is split from
lexical alias: splitInto.en
label: er opdelt i @da
definition: Relaterer et ressource til en ressource, der er resultatet af opdelingen af en tidligere ressource i to eller flere separate ressourcer. @da
label: is gesplitst tot @nl
label: هو منشطِر إلى @ar
definition: يربط بين مصدر ومصدر ممتد زمنيًا يُكْمل المحتوى الجزئي لمصدر آخر ممتد زمنيًا ومكتمل. @ar
label: jakautunut aineisto @fi
definition: Liittää aineiston aineistoon, joka on diakroninen aineisto, joka jatkaa toisen, valmiin diakronisen aineiston osittaista sisältöä. @fi
label: ist gesplittet in @de
definition: Setzt eine Ressource in Beziehung zu einer diachronen Ressource, die teilweise den Inhalt einer anderen abgeschlossenen, diachronen Ressource fortführt. @de
label: 被分成 @zh-hans
definition: 将一种资源与作为一种历时资源继承另一种已完成的历时资源的部分内容的一种资源关联起来。 @zh-hans
label: szétvált a következőbe: @hu
definition: Hozzákapcsol egy forrást egy diakronikus forráshoz, amely egy másik, befejezett diakronikus forrás részleges tartalmát folytatja. @hu
label: bölünmüştür @tr
definition: Bir kaynağı, tamamlanmış başka bir artzamanlı kaynağın kısmi içeriğini sürdüren artzamanlı bir kaynak olan bir kaynakla ilişkilendirir. @tr

is spoken word for resource
status: Published
lexical alias: spokenWordForResource.en
type: Property
sub property of: is complemented by
inverse of: has spoken word resource
definition: Relates a resource to a resource that is complemented by a vocal resource.
label: is gesproken woord voor resource @nl
label: هي كلمة منطوقة لمصدر @ar
definition: يربط بين مصدر ومصدر يكمله مصدر منطوق. @ar
label: er talet lyd for ressource @da
definition: Relaterer en ressource til en ressource, der er suppleret med en vokal ressource. @da
label: puheaineisto @fi
definition: Liittää aineiston puheaineistolla täydennettyyn aineistoon. @fi
label: ist gesprochenes Wort für (Ressource) @de
definition: Setzt eine Ressource in Beziehung zu einer Ressource, die durch eine gesprochene Ressource vervollständigt wird. @de
label: 是资源的口语 @zh-hans
definition: 将一种资源与被一种人声资源补充的一种资源关联起来。 @zh-hans
label: beszéd a következő forráshoz: @hu
definition: Hozzákapcsol egy forrást egy forráshoz, amelyet egy élőszavas forrás egészít ki. @hu
label: kaynak için sözlü eserdir @tr
definition: Bir kaynağı, sesli bir kaynakla tamamlanan bir kaynakla ilişkilendirir. @tr

has spoken word resource
status: Published
lexical alias: spokenWordResource.en
type: Property
sub property of: is complemented by
definition: Relates a resource to a resource that is a vocal resource and that complements a resource.
label: heeft gesproken woord-resource @nl
label: له مصدر كلمات منطوفة @ar
definition: يربط بين مصدر ومصدر عبارة عن مصدر منطوق ويكمل مصدرًا. @ar
label: har ressource, der er talet ord @da
definition: Relaterer en ressource til en ressource, der er en vokal ressourde og som supplerer en ressource. @da
label: puheaineisto @fi
definition: Liittää aineiston puheääniaineistoon, joka täydentää toista aineistoa. @fi
label: hat gesprochenes Wort (Ressource) @de
definition: Setzt eine Ressource in Beziehung zu einer gesprochenen Ressource, die eine Ressource ergänzt. @de
label: 有口语资源 @zh-hans
definition: 将一种资源与作为一种人声资源并补充一种资源的一种资源关联起来。 @zh-hans
label: beszédben kifejezett forrása a következő: @hu
definition: Hozzákapcsol egy forrást egy élőszavas forráshoz, amelyet egy forrás egészít ki. @hu
label: sözlü kaynak ile ilişkilidir @tr
definition: Bir kaynağı, bir kaynağı tamamlayan vokal kaynak olan bir kaynakla ilişkilendirir. @tr

has sponsored agent of agent
status: Published
definition: Relates an agent to an agent who is sponsored by another agent.
type: Property
inverse of: has sponsoring agent of agent
lexical alias: sponsoringAgentOfAgent.en
label: har sponsoreret entitet @da
definition: Relaterer en agent som en agent sponsorerer til en agent. @da
label: heeft gesponsorde actor van actor @nl
label: له وكيل راعي لوكيل @ar
definition: يربط بين وكيل ووكيل يرعاه وكيل. @ar
label: sponsori (toimija) @fi
definition: Liittää toimijaan toimijaa sponsoroivan toimijan. @fi
label: hat Akteur als Träger eines Akteurs von @de
definition: Setzt einen Akteur in Beziehung zu einem Akteur, den ein Akteur fördert. @de
label: 有行为者的赞助行为者 @zh-hans
definition: 将赞助一个行为者的一个行为者与一个行为者关联起来。 @zh-hans
label: ágens szponzorált ágense a következő: @hu
definition: Hozzákapcsol egy ágens által szponzorált ágenst egy ágenshez. @hu
label: temsilcinin sponsor olduğu temsilci ile ilişkilidir @tr
definition: Bir temsilcinin sponsor olduğu bir temsilciyi bir temsilciyle ilişkilendirir. @tr

has sponsored resource of agent
status: Published
definition: Relates an agent to a resource that involves a responsibility of an agent for sponsoring some aspect of a resource,
type: Property
sub property of: is other agent associated with resource of (Deprecated)
inverse of: has sponsoring agent of resource
lexical alias: sponsoriedResourceOfAgent.en
label: er sponsorerende institution for @da
definition: Relaterer en agent, der har sponsoreret et aspekt af en ressource, fx forskningsfinansiering, sponsorering af en event til en ressource. @da
scope note: Includes funding research and sponsoring an event that is the basis of a resource.
label: heeft gesponsorde resource van actor @nl
label: له مصدر راعي لوكيل @ar
definition: يربط بين وكيل ومصدر ينطوي على مسؤولية وكيل عن رعاية بعض جوانب مصدر. @ar
scope note: يشمل ذلك تمويل البحوث ورعاية حدث يكون أساس لمصدر. @ar
scope note: Omfatter finansiering af forskning og sponsorering af et event, der er basis for en ressource. @da
label: sponsori (toimija) aineistossa @fi
definition: Liittää toimijan aineistoon, jossa toimija vastaa aineiston sponsoroinnista joltakin osin. @fi
scope note: Kattaa tutkimuksen rahoituksen ja teoksen perustana olevan tapahtuman sponsoroinnin. @fi
label: hat Akteur als Trägerin/Träger eines Werks von @de
definition: Setzt einen Akteur in Beziehung zu einer Ressource, bei der ein Akteur für die finanzielle Unterstützung einzelner Aspekte einer Ressource verantwortlich ist. @de
scope note: Darunter fallen Forschungsförderungen und die finanzielle Unterstützung einer Veranstaltung, die die Grundlage eines Werks bilden. @de
label: 有行为者的被赞助资源 @zh-hans
definition: 将一个行为者与涉及赞助一种资源某个方面的一个行为者的责任的一种资源关联起来。 @zh-hans
scope note: 包括作为一种资源基础的科研资助和活动赞助 @zh-hans
label: ágens szponzorált forrása a következő: @hu
definition: Hozzákapcsol egy ágenst egy forráshoz, amelyhez hozzátartozik az ágens felelőssége egy mű szponzorálásának valamely vonatkozásáért. @hu
scope note: Magában foglalja kutatás finanszírozását és egy esemény szponzorálását, amely egy forrás alapját képezi. @hu
label: temsilcinin sponsor olduğu kaynak ile ilişkilidir @tr
definition: Bir temsilciyi, bir kaynağın bazı yönlerini desteklemekle görevli bir temsilcinin sorumluluğunu içeren bir kaynakla ilişkilendirir @tr
scope note: temsilcinin sponsor olduğu kaynak ile ilişkilidir @tr

has sponsoring agent of agent
status: Published
definition: Relates an agent sponsoring an agent to an agent.
type: Property
inverse of: has sponsored agent of agent
lexical alias: sponsoringAgentOfAgent.en
label: har sponsor @da
definition: Relaterer en agent der sponsorerer en agent til en agent. @da
label: heeft sponsor van actor @nl
label: له وكيل راعي لوكيل @ar
definition: يربط بين وكيل راعي لوكيل ووكيل. @ar
label: sponsoroiva toimija aineistossa @fi
definition: Liittää toimijaan toimijaa sponsoroivan toimijan. @fi
label: hat Trägerin/Träger eines Akteurs @de
definition: Setzt einen Akteur in Beziehung zu einem Akteur, der einen Akteur fördert. @de
label: 有行为者的赞助行为者 @zh-hans
definition: 将一个行为者与赞助一个行为者的一个行为者关联起来。 @zh-hans
label: ágens szponzoráló ágense a következő: @hu
definition: Hozzákapcsol egy ágenst szponzoráló ágenst egy ágenshez. @hu
label: temsilcinin sponsoru olan temsilci ile ilişkilidir @tr
definition: Bir temsilciyi, bir temsilciye sponsor olan bir temsilciyle ilişkilendirir @tr

has sponsoring agent of resource
status: Published
definition: Relates a resource to an agent who sponsors some aspect of a resource.
type: Property
sub property of: has other agent associated with resource (Deprecated)
inverse of: has sponsored resource of agent
lexical alias: sponsoringAgentOfResource.en
label: har sponsorerende korporation @da
definition: Relaterer en ressource til en agent, der har bidraget til en ressource via fx forskningsfinansiering, sponsorering af en event. @da
scope note: Includes funding research and sponsoring an event that is the basis of a resource.
label: heeft sponsor van resource @nl
label: له وكيل راعي لمصدر @ar
definition: يربط مصدر بوكيل يرعى بعض جوانب مصدر ما. @ar
scope note: يشمل ذلك تمويل البحوث ورعاية حدث يكون أساس لمصدر. @ar
label: aineistoa sponsoroiva toimija @fi
definition: Liittää aineiston sitä sponsoroivaan toimijaan. @fi
scope note: Kattaa tutkimuksen rahoituksen ja teoksen perustana olevan tapahtuman sponsoroinnin. @fi
label: hat Trägerin/Träger einer Ressource (Akteur) @de
definition: Setzt eine Ressource in Beziehung zu einem Akteur, der einzelne Aspekte einer Ressource finanziell unterstützt. @de
scope note: Darunter fallen Forschungsförderungen und die finanzielle Unterstützung einer Veranstaltung, die die Grundlage einer Ressource bilden. @de
label: 有资源的赞助行为者 @zh-hans
definition: 将一种资源与赞助一种资源某方面的一个行为者关联起来。 @zh-hans
scope note: 包括资助作为一种资源之基础的研究以及赞助作为一种资源之基础的一项活动。 @zh-hans
label: forrás szponzoráló ágense a következő: @hu
definition: Hozzákapcsol egy forráshoz egy ágenshez, amely a forrást valamilyen tekintetben szponzorálja. @hu
scope note: Magában foglalja kutatás finanszírozását és egy esemény szponzorálását, amely egy forrás alapját képezi. @hu
label: kaynağın sponsoru olan temsilci ile ilişkilidir @tr
definition: Bir kaynağı, bir kaynağın bazı yönlerine sponsor olan bir temsilci ile ilişkilendirir. @tr
scope note: kaynağın sponsoru olan temsilci ile ilişkilidir @tr

has stage director
status: Published
definition: Relates a resource to an agent who contributes to a stage resource through the general management and supervision of a performance.
type: Property
sub property of: has contributor (Deprecated)
inverse of: is stage director of
lexical alias: stageDirector.en
label: har sceneinstruktør @da
definition: Relaterer en ressource til en agent, der har bidraget til en ressource af et sceneværk gennem den generelle ledelse af og tilsyn med en forestilling. @da
label: heeft toneelregisseur @nl
label: näyttämöohjaaja aineistossa @fi
label: له مدير مسرح @ar
definition: يربط مصدر بوكيل يُساهم في مصدر مسرحي من خلال الإدارة العامة للأداء مسرحي والإشراف عليه. @ar
definition: Liittää aineiston toimijaan, joka on aineistossa osallisena johtamalla ja valvomalla näyttämöesitystä. @fi
label: hat Bühnenregisseurin/Bühnenregisseur @de
definition: Setzt eine Ressource in Beziehung zu einem Akteur, der zu einer Bühnenressource durch die allgemeine Betreuung und Leitung einer Darbietung beiträgt. @de
label: 有舞台导演 @zh-hans
definition: 将一种资源与通过对表演总体管理和监督而对一种舞台资源有贡献的一个行为者关联起来。 @zh-hans
label: színpadi rendezője a következő: @hu
definition: Hozzákapcsol egy forrást egy ágenshez, amely hozzájárul egy színpadi forráshoz azzal, hogy egy előadás általános menedzselését és felügyeletét végzi. @hu
label: sahne yönetmeni ile ilişkilidir @tr
definition: Bir kaynağı, bir performansın genel yönetimi ve denetimi yoluyla bir sahne kaynağına katkıda bulunan bir temsilci ile ilişkilendirir. @tr

is stage director of
status: Published
definition: Relates an agent to a resource that includes a contribution by an agent of general management and supervision of a stage performance.
type: Property
sub property of: is contributor of (Deprecated)
inverse of: has stage director
lexical alias: stageDirectorOf.en
label: er sceneinstruktør af @da
definition: Relaterer en agent, der har bidraget til en ressource af et sceneværk gennem den generelle ledelse af og tilsyn med en forestilling til en ressource. @da
label: is toneelregisseur van @nl
label: هو مدير مسرح لـ @ar
definition: يربط بين وكيل ومصدر يتضمن إسهام وكيل في الإدارة العامة لأداء مسرحي والإشراف عليه. @ar
label: näyttämöohjaaja (toimija) aineistossa @fi
definition: Liittää toimijan aineistoon, jossa toimija on osallisena johtamalla ja valvomalla näyttämöesitystä. @fi
label: ist Bühnenregisseurin/Bühnenregisseur von @de
definition: Setzt einen Akteur in Beziehung zu einer Ressource einer Bühnendarbietung, zu der ein Akteur durch die allgemeine Betreuung und Leitung beiträgt. @de
label: 是……的舞台导演 @zh-hans
definition: 将一个行为者与包括一个行为者对舞台表演总体管理和监督的贡献的一种资源关联起来。 @zh-hans
label: színpadi rendezője a következőnek: @hu
definition: Hozzákapcsol egy ágenst egy forráshoz, amely magában foglalja az ágens közreműködését egy színpadi előadás általános menedzselésében és felügyeletében. @hu
label: sahne yönetmeni @tr
definition: Bir temsilciyi, bir sahne performansının genel yönetim ve denetimten sorumlu bir temsilcinin katkısını içeren bir kaynakla ilişkilendirir. @tr

has statement of responsibility
status: Published
definition: Relates a resource to a statement relating to an identification or function of any agents responsible for the creation of, or who contributes to a realization of, the intellectual or artistic content of a resource.
type: Property
lexical alias: statementOfResponsibility.en
label: har ophavsangivelse @da
definition: Relaterer en ressource til oplysninger relaterede til identificering eller funktion af alle agenter, der er ansvarlige for at have skabt eller bidraget til realiseringen af det intellektuelle eller kunstneriske indhold af en ressource. @da
label: heeft verantwoordelijkheidsvermelding @nl
label: vastuullisuusmerkintö aineistossa @fi
label: له بيان مسؤولية @ar
definition: يربط بين مصدر وبيان متعلق بتحديد هوية أو وظيفة أي وكلاء مسؤولين عن إنشاء المحتوى الفكري أو الفني لمصدر، أو الذين يساهمون في تحقيقه. @ar
definition: Liittää aineiston merkintöön, joka liittyy aineiston henkisen tai taiteellisen sisällön luomisesta vastaavien tai sen toteuttamiseen osallistuvien toimijoiden tunnistamiseen tai tehtävään. @fi
label: hat Verantwortlichkeitsangabe @de
definition: Setzt eine Ressource in Beziehung zu einer Angabe, die mit der Identifizierung oder Funktion von Akteuren in Verbindung steht, die für die Schaffung des geistigen oder künstlerischen Inhalts einer Ressource verantwortlich sind oder zu dessen Realisierung beitragen. @de
label: 有责任说明 @zh-hans
definition: 将一种资源与和对一种资源的知识或艺术内容之创建负责或者对一种资源的知识内容或艺术内容之实现有贡献的任何行为者的识别和职能有关的一个说明关联起来。 @zh-hans
label: felelősségi közlése a következő: @hu
definition: Hozzákapcsol egy forrást egy közléshez, amely egy forrás szellemi vagy művészi tartalmának létrehozásáért vagy a megvalósulásában való közreműködésért felelős ágensek azonosítására vagy funkciójára vonatkozik. @hu
has subproperty: has parallel statement of responsibility relating to title proper
has subproperty: has statement of responsibility relating to title proper
definition: Relaciona un recurs amb una menció relativa a una identificació o funció de qualsevol agent responsable de la creació de, o que contribueix a una realització del contingut intel·lectual o artístic d’un recurs. @ca
label: sorumluluk bildirimi ile ilişkilidir @tr
definition: Bir kaynağı, bir kaynağın fikri veya sanatsal içeriğinin oluşturulmasından sorumlu olan veya gerçekleşmesine katkıda bulunan herhangi bir temsilcinin tanımlanması veya işlevi ile ilgili bir bildirim ile ilişkilendirir. @tr

has statement of responsibility relating to edition
status: Published
definition: Relates a resource to a statement relating to an identification of agents responsible for an edition being described but not to all editions.
type: Property
lexical alias: statementOfResponsibilityRelatingToEdition.en
label: har ophavsangivelse relateret til udgave @da
definition: Relaterer en ressource til oplysninger relateret til identificering af agenter, der er ansvarlige for en beskreven udgave men ikke alle udgaver. @da
label: heeft verantwoordelijkheidsvermelding gerelateerd aan editie @nl
label: painoksen vastuullisuusmerkintö aineistossa @fi
label: له بيان مسؤولية مرتبط بطبعة @ar
definition: يربط بين مصدر وبيان متعلق بتحديد هوية وكلاء مسؤولين عن طبعة تم وصفها ولكن ليس لجميع الطبعات. @ar
definition: Liittää aineiston merkintöön, joka liittyy kuvailtavana olevasta painoksesta, mutta ei kaikista painoksista, vastaavien toimijoiden tunnistamiseen. @fi
label: hat Verantwortlichkeitsangabe, die sich auf eine Ausgabe bezieht @de
definition: Setzt eine Ressource in Beziehung zu einer Angabe, die mit der Identifizierung von Akteuren in Verbindung steht, die für eine beschriebene Ausgabe, aber nicht für alle Ausgaben, verantwortlich sind. @de
label: 有和版本有关的责任说明 @zh-hans
definition: 将一种资源与和对所描述的一个版本负责而非对所有版本负责的行为者的一个标识有关的一个说明关联起来。 @zh-hans
label: kiadáshoz kötődő felelősségi közlése a következő: @hu
definition: Hozzákapcsol egy forrást egy közléshez, amely egy, de nem feltétlenül az összes, kiadás leírásáért felelős ágensek azonosítására vonatkozik. @hu
label: basıma ilişkin sorumluluk bildirimi ile ilişkilidir @tr
definition: Bir kaynağı, açıklanan bir basımdan sorumlu temsilcilerin tanımlanmasıyla ilgili bir bildirimle ilişkilendirir, ancak tüm basımlarla ilişkilendirmez. @tr

has statement of responsibility relating to named revision of edition
status: Published
definition: Relates a resource to a statement relating to an identification of agents responsible for a named revision of an edition.
type: Property
lexical alias: statementOfResponsibilityRelatingToNamedRevisionOfEdition.en
label: har ophavsangivelse relateret til en navngivet revision af en udgave @da
definition: Relaterer en ressource til oplysninger relateret til identificering af alle agenter, der er ansvarlige for en navngivet revision af en udgave. @da
label: heeft verantwoordelijkheidsvermelding gerelateerd aan benoemde herziening van editie @nl
label: له بيان مسؤولية مرتبط بمراجعة مسماة لطبعة @ar
definition: يربط بين مصدر وبيان متعلق بتحديد هوية وكلاء مسؤولين عن مراجعة المسماة لطبعة. @ar
label: nimetyn uudistetun painoksen vastuullisuusmerkintö @fi
definition: Liittää aineiston merkintöön, joka liittyy uudistetun painoksen henkisen tai taiteellisen sisällön luomisesta vastaavien tai sen toteuttamiseen osallistuvien toimijoiden tunnistamiseen. @fi
label: hat Verantwortlichkeitsangabe, die sich auf eine näher erläuterte Überarbeitung einer Ausgabe bezieht @de
definition: Setzt eine Ressource in Beziehung zu einer Angabe, die mit der Identifizierung von Akteuren in Verbindung steht, die für eine näher erläuterte Überarbeitung eines Ausgabe verantwortlich sind. @de
label: 有和版本的命名修订有关的责任说明 @zh-hans
definition: 将一种资源与和负责版本的命名修订的行为者的一个标识有关的一个说明关联起来。 @zh-hans
label: kiadás nevesített átdolgozásához kötődő felelősségi közlése a következő: @hu
definition: Hozzákapcsol egy forrást egy közléshez, amely egy kiadás nevesített átdolgozásáért felelős ágensek azonosítására vonatkozik. @hu
label: basımın adlandırılmış revizyonunun sorumluluk bildirimi ile ilişkilidir @tr
definition: Bir kaynağı, baskının adlandırılmış bir gözden geçirilmesinden sorumlu temsilcilerin tanımlanmasıyla ilgili bir bildirim ile ilişkilendirir. @tr

has statement of responsibility relating to series
status: Published
definition: Relates a resource to a statement relating to an identification of agents responsible for a series.
type: Property
lexical alias: statementOfResponsibilityRelatingToSeries.en
label: har ophavsangivelse relateret til serie @da
definition: Relaterer en ressource til oplysninger relateret til identificering af agenter, der er ansvarlige for en serie. @da
label: heeft verantwoordelijkheidsvermelding gerelateerd aan reeks @nl
label: sarjan vastuullisuusmerkintö aineistossa @fi
label: له بيان مسؤولية مرتبط بسلسلة @ar
definition: يربط بين مصدر وبيان متعلق بتحديد هوية وكلاء مسؤولين عن سلسلة. @ar
definition: Liittää aineiston merkintöön, joka liittyy sarjasta vastaavien toimijoiden tunnistamiseen. @fi
label: hat Verantwortlichkeitsangabe, die sich auf eine Reihe bezieht @de
definition: Setzt eine Ressource in Beziehung zu einer Angabe, die mit der Identifizierung von Akteuren in Verbindung steht, die für eine Reihe verantwortlich sind. @de
label: 有和丛编有关的责任说明 @zh-hans
definition: 将一种资源与和对一种丛编负责的行为者的一个标识有关的一个说明关联起来。 @zh-hans
label: sorozathoz kapcsolódó felelősségi közlése a következő: @hu
definition: Hozzákapcsol egy forrást egy közléshez, amely egy sorozatért felelős ágensek azonosítására vonatkozik. @hu
label: seriye ilişkin sorumluluk bildirimi ile ilişkilidir @tr
definition: Bir kaynağı, bir diziden sorumlu temsilcilerin tanımlanması ile ilgili bir bildirim ile ilişkilendirir. @tr

has statement of responsibility relating to subseries (Deprecated)
status: Deprecated
definition: Relates a resource to a statement relating to an identification of agents responsible for a subseries. (Deprecated)
type: Property
lexical alias: statementOfResponsibilityRelatingToSubseries.en
label: har ophavsangivelse relateret til underserie @da
definition: Relaterer en ressource til oplysninger relateret til identificering af en hvilken som helst agent eller agenter, der er ansvarlige for en underserie. @da

has statement of responsibility relating to title proper
status: Published
definition: Relates a resource to a statement associated with a title proper of a resource that relates to an identification or function of agents responsible for the creation of, or who contributes to a realization of, the intellectual or artistic content of a resource.
type: Property
sub property of: has statement of responsibility
lexical alias: statementOfResponsibilityRelatingToTitleProper.en
label: har ophavsangivelse relateret til hovedtitel @da
definition: Relaterer en ressource til en ophavsangivelse der knytter sig til en hovedtitel på en ressource, der relaterer sig til identificeringen eller funktionen af en hvilken som helst agent eller agenter, der er ansvarlige for at have skabt elle bidraget til realiseringen af det intellektuelle eller kunstneriske indhold af en ressource. @da
label: heeft verantwoordelijkheidsvermelding gerelateerd aan hoofdtitel @nl
label: päänimekkeeseen liittyvä vastuullisuusmerkintö @fi
label: له بيان مسؤولية مرتبط بالعنوان نفسه @ar
definition: يربط بين مصدر وبيان مرتبط بالعنوان نفسه لمصدر يتعلق بتعريف أو وظيفة الوكلاء المسؤولين عن إنشاء المحتوى الفكري أو الفني لمصدر، أو الذين يساهمون في تحقيقه. @ar
definition: Liittää aineiston päänimekkeeseen liittyvään vastuullisuusmerkintöön, joka liittyy aineiston henkisen tai taiteellisen sisällön luomisesta vastaavien tai sen toteuttamiseen osallistuvien toimijoiden tunnistamiseen tai tehtävään. @fi
label: hat Verantwortlichkeitsangabe, die sich auf einen Haupttitel bezieht @de
definition: Setzt eine Ressource in Beziehung zu einer Angabe, die mit einem Haupttitel in Verbindung steht und die sich auf die auf eine Identifizierung oder Funktion von Akteuren bezieht, die für die Schaffung des geistigen oder künstlerischen Inhalts einer Ressource verantwortlich sind oder zu dessen Realisierung beitragen. @de
label: 有与正题名相关的责任说明 @zh-hans
definition: 将一种资源与 和资源的正题名有关并且和对创建资源的知识或艺术内容负责或对实现资源的知识或艺术内容作贡献的一个行为者的标识或职能相关的说明关联起来。 @zh-hans
label: főcímhez kapcsolódó felelősségi közlése a következő: @hu
definition: Hozzákapcsol egy forrást egy forrás főcíméhez kapcsolódó közléshez, amely egy forrás szellemi vagy művészi tartalmának létrehozásáért vagy a megvalósulásában való közreműködésért felelős ágensek azonosítására vagy funkciójára vonatkozik. @hu
label: başlığa ilişkin sorumluluk bildirimi ile ilişkilidir @tr
definition: Bir kaynağı, bir kaynağın fikri veya sanatsal içeriğinin oluşturulmasından sorumlu olan veya gerçekleşmesine katkıda bulunan temsilcilerin tanımlanması veya işlevi ile ilgili bir kaynağa uygun bir başlıkla bağlantılı olan bir bildirimle ilişkilendirir. @tr

has static version
status: Published
lexical alias: staticVersion.en
definition: Relates a resource to a resource that is created by changing the extension plan of a resource from integrating to static.
type: Property
sub property of: has transformation by extension plan
label: heeft statische versie @nl
label: له إصدارة ثابتة @ar
definition: يربط بين مصدر ومصدر تم إنشاؤه عن طريق تغيير خطة توسع المصدر من تكامل إلى ثابت. @ar
label: har statisk version @da
definition: Relaterer en ressource til en ressource, som er skabt ved at ændre udvidelsesplanen for en ressource fra integrerende til statisk. @da
label: aineiston staattinen versio @fi
definition: Liittää aineiston aineistoon, joka on luotu vaihtamalla päivittyvä laajennussuunnitelma staattiseksi laajennussuunnitelmaksi. @fi
label: hat statische Version @de
definition: Setzt eine Ressource in Beziehung zu einer Ressource, die durch Änderung des Erweiterungsplans einer Ressource von integrierend auf statisch erstellt wird. @de
label: 有静态版本 @zh-hans
definition: 将一种资源与通过将一种资源的扩充计划从集成性到静态变化而被创建的一种资源关联起来。 @zh-hans
label: statikus változata a következő: @hu
definition: Hozzákapcsol egy forrást egy forráshoz, amely egy forrás közlési tervének integrálóról statikussá való változásával jött létre. @hu
label: durağan sürüm ile ilişkilidir @tr
definition: Bir kaynağı, bir kaynağın genişletme planını birleşimden durağana değiştirerek oluşturulan bir kaynakla ilişkilendirir. @tr

is static version of
status: Published
lexical alias: staticVersionOf.en
definition: Relates a resource to a resource that has an extension plan that is changed from static to integrated to create a resource.
type: Property
sub property of: is transformation by extension plan of
inverse of: has static version
label: is statische versie van @nl
label: هو إصدارة ثابثة لـ @ar
definition: يربط بين مصدر ومصدر يحتوي على خطة تمديد تم تغييرها من ثابت إلى تكامل لإنشاء مصدر. @ar
label: er statisk version af @da
definition: Relaterer en ressource til en ressource, som har en udvidelsesplan, der ændret fra fortløbende til integrerende for at skabe en ressource. @da
label: staattinen versio @fi
definition: Liittää aineiston aineistoon, jonka laajennussuunnitelma on vaihdettu päivittyvästä staattiseksi. @fi
label: ist statische Version von @de
definition: Setzt eine Ressource in Beziehung zu einer Ressource, deren Erweiterungsplan von statisch auf integrierend geändert wird, um eine Ressource zu erstellen. @de
label: 是……的静态版本 @zh-hans
definition: 将一种资源与有扩充计划并被改变为从静态到集成性以创建一种资源的一种资源关联起来。 @zh-hans
label: statikus változata a következőnek: @hu
definition: Hozzákapcsol egy forrást egy forráshoz, amelynek a közlési terve statikusról integrálóvá változott egy forrás létrejövetele érdekében. @hu
label: sabit sürümüdür @tr
definition: Bir kaynağı, bir kaynak oluşturmak için durağandan birleşime değiştirilen bir genişletme planına sahip bir kaynakla ilişkilendirir. @tr

has status of identification
status: Published
lexical alias: statusOfIdentification.en
definition: Relates a nomen to an indication of a level of authentication of the nomen of an entity.
type: Property
label: heeft status van identificatie @nl
label: لها حالة للتعريف @ar
definition: يربط بين تسمية ومؤشر لمستوى التَصدِيق لتسمية كيان. @ar
label: har status af identifikation @da
definition: Relaterer et nomen til en indikation af et autentificeringsniveau for en enheds nomen. @da
label: tunnistamistaso @fi
definition: Liittää nomenin ilmaukseen entiteetin nomenin oikeaksi todistamisen tasosta. @fi
label: hat Status einer Identifikation @de
definition: Setzt ein Nomen in Beziehung zu einer Angabe über einen Grad der Authentifizierung des Nomens einer Entität. @de
label: 有识别状态 @zh-hans
definition: 将一个命名与一个实体的命名的认证级别的指示关联起来。 @zh-hans
label: azonosítás státusza a következő: @hu
definition: Hozzákapcsol egy noment egy entitás nomenjének hitelesítési szintjére vonatkozó jelzéshez. @hu
label: tanımlama durumu ile ilişkilidir @tr
definition: Bir ismi, bir varlığın isminin kimlik doğrulama seviyesinin bir göstergesi ile ilişkilendirir. @tr

has storyteller
status: Published
definition: Relates a resource to an agent who is a performer who contributes to a resource by relaying a story with dramatic or theatrical interpretation.
type: Property
sub property of: has performer
inverse of: is storyteller of
lexical alias: storyteller.en
label: har kunstnerisk fortæller @da
definition: Relaterer en ressource til en optrædende, der har bidraget til en ressource ved at gengive en ophavspersons oprindelige historie med dramatisk eller teatralsk fortolkning. @da
label: heeft verhalenverteller @nl
label: tarinankertojana aineistossa @fi
label: له راوي قصص @ar
definition: يربط مصدر بوكيل مؤدِ يُساهم بأحد المصادر من خلال نقل قصة أصلية ووصفها بصورة درامية أو مسرحية. @ar
definition: Liittää toimijan aineistoon, jonka tekemiseen hän osallistuu esittäjänä tekijän alkuperäisen tarinan draamallisella tai teatraalisella tulkinnalla. @fi
label: hat Geschichtenerzählerin/Geschichtenerzähler @de
definition: Setzt eine Ressource in Beziehung zu einer Ausführenden/einem Ausführenden, die/der zu einer Ressource beiträgt, indem sie/er eine Geschichte mit dramatischer oder theatralischer Interpretation wiedergibt. @de
label: 有说书人 @zh-hans
definition: 将一种资源与作为一个表演者通过用戏剧化解释转达故事而对一种资源有贡献的一个行为者关联起来。 @zh-hans
label: történetmesélője a következő: @hu
definition: Hozzákapcsol egy forrást egy előadó ágenshez, amely hozzájárul egy forráshoz azzal, hogy egy alkotó eredeti történetét drámai vagy színházi értelmezéssel tolmácsolja. @hu
label: hikaye anlatıcısı ile ilişkilidir @tr
definition: Bir kaynağı, bir hikayeyi dramatik veya teatral bir yorumla aktararak bir kaynağa katkıda bulunan bir sanatçı olan temsilci ile ilişkilendirir. @tr

is storyteller of
status: Published
definition: Relates an agent to a resource that includes a contribution by an agent who is a performer of relaying a story with dramatic or theatrical interpretation.
type: Property
sub property of: is performer of
inverse of: has storyteller
lexical alias: storytellerOf.en
label: er historiefortæller i @da
definition: Relaterer en udøver der bidrager til en ressource ved at give en ophavspersons oprindelige historie med dramatisk eller teatralsk fortolkning til en ressource. @da
label: is verhalenverteller van @nl
label: tarinankertojana aineistossa @fi
label: هو راوي قصص لـ @ar
definition: يربط بين وكيل ومصدر يتضمن إسهام وكيل يقوم بنقل قصة أصلية ووصفها بصورة درامية أو مسرحية. @ar
definition: Liittää toimijan aineistoon, jonka tekemiseen hän osallistuu esittäjänä tekijän alkuperäisen tarinan draamallisella tai teatraalisella tulkinnalla. @fi
label: ist Geschichtenerzählerin/Geschichtenerzähler von @de
definition: Setzt einen Akteur in Beziehung zu einer Ressource, zu der ein Akteur beiträgt, indem er eine Geschichte mit dramatischer oder theatralischer Interpretation wiedergibt. @de
label: 是……的说书人 @zh-hans
definition: 将一个行为者与包括有作为表演者用戏剧化解释转达故事的一个行为者的贡献的一种资源关联起来。 @zh-hans
label: történetmesélője a következőnek: @hu
definition: Hozzákapcsol egy ágenst egy forráshoz, amely magában foglalja egy ágens közreműködését egy történet dramatizált vagy színházi interpretációjában. @hu
label: Hikaye anlatıcısı @tr
definition: Bir temsilciyi, dramatik veya teatral yorumla bir hikayeyi aktaran bir sanatçı olan bir temsilcinin katkısını içeren bir kaynakla ilişkilendirir. @tr

has strings of coordinate pairs
status: Published
definition: Relates a resource to a system for identifying the precise area covered by the cartographic content of a resource using coordinates for each vertex of a polygon.
type: Property
sub property of: has coordinates of cartographic content
lexical alias: stringsOfCoordinatePairs.en
label: har hjørnekoordinater @da
definition: Relaterer en ressource til et system til identificering af det præcise areal, der dækkes af en ressources kartografiske indhold; anvender koordinater for hvert af en polygons toppunkter. @da
inverse of: is strings of coordinate pairs of
label: heeft tekenreeksen van coördinatenparen @nl
label: koordinaattiparit aineistossa @fi
label: له خطوط إحداثيات مزدوجة @ar
definition: يربط بين مصدر ونظام لتحديد المنطقة المعينة التي يغطيها المحتوى الخرائطي لمصدر ما باستخدام إحداثيات لكل قمة مضلع. @ar
definition: Liittää aineiston järjestelmään, joka täsmällisesti määrittää kartografisen aineiston kattaman alueen käyttämällä monikulmion jokaisen kärjen koordinaatteja. @fi
label: hat Reihen von Koordinatenpaaren @de
definition: Setzt eine Ressource in Beziehung zu einem System zur Identifizierung des genauen Gebiets, das durch den kartografischen Inhalt einer Ressource abgedeckt wird, indem Koordinaten für jeden Eckpunkt eines Vielecks verwendet werden. @de
label: 有坐标对串 @zh-hans
definition: 将一种资源与使用一个多边形每个角的坐标标识一种资源的地图内容所覆盖的精确范围的一个系统关联起来。 @zh-hans
label: koordinátapár-láncai a következők: @hu
definition: Hozzákapcsol egy forrást egy rendszerhez, amelynek célja, hogy azonosítson egy forrás kartográfiai tartalma által lefedett pontos területet, használva a poligon minden egyes töréspontjára vonatkozó koordinátát. @hu
label: koordinat çifti dizgesi ile ilişkilidir @tr
definition: Bir kaynağı, bir çokgenin her köşesi için koordinatlar kullanarak bir kaynağın kartografik içeriği tarafından kapsanan kesin alanı tanımlamaya yönelik bir sistemle ilişkilendirir. @tr

has student
status: Published
type: Property
lexical alias: student.en
definition: Relates an agent to an agent who receives instruction from a related agent.
inverse of: has teacher
sub property of: has related agent of agent
label: har student @da
definition: Relaterer en agent til en agent, der modtager undervisning af en anden agent. @da
label: heeft student @nl
label: له طالب @ar
definition: يربط بين وكيل ووكيل يتلقى تعليمات من وكيل ذي صلة. @ar
label: oppilas (toimija) @fi
definition: Liittää toimijan toimijaan joka saa opetusta toiselta, liittyvältä toimijalta. @fi
label: hat Studentin/Student @de
definition: Setzt einen Akteur in Beziehung zu einem Akteur, der von einem in Beziehung stehenden Akteur unterrichtet wird. @de
label: 有学生 @zh-hans
definition: 将一个行为者与从一个相关行为者接受教学的一个行为者关联起来。 @zh-hans
label: tanulója a következő: @hu
definition: Hozzákapcsol egy ágenst egy ágenshez, aki egy kapcsolódó ágenstől oktatásban részesül. @hu
label: öğrenci ile ilişkilidir @tr
definition: Bir temsilciyi, ilgili bir temsilciden eğitim alan bir temsilciyle ilişkilendirir. @tr

is student at
status: Published
type: Property
lexical alias: studentAt.en
definition: Relates an agent to an agent who is an educational institution that provides instruction to an agent.
inverse of: has enrolled student
sub property of: has related agent of agent
label: er studerende på @da
definition: Relaterer en agent til en uddannelsesinstitution, der giver undervisning til en agent. @da
label: is student aan @nl
label: هو طالب في @ar
definition: يربط بين وكيل ووكيل هو مؤسسة تعليمية تقدم التعليم لوكيل. @ar
label: oppilas (toimija) @fi
definition: Liittää henkilön henkilöön, joka saa opetusta toiselta toimijalta. @fi
label: ist Studentin/Student an @de
definition: Setzt einen Akteur in Beziehung zu einer Bildungseinrichtung, die einem Akteur Unterricht erteilt. @de
label: 是……处的学生 @zh-hans
definition: 将一个行为者与作为教育机构为一个行为者提供教学的一个行为者关联起来。 @zh-hans
label: tanulója a következőnek: @hu
definition: Hozzákapcsol egy ágenst egy oktatási intézmény ágenshez, amely oktatást nyújt egy ágens számára. @hu
label: öğrencisidir @tr
definition: Bir temsilciyi, bir temsilciye eğitim sağlayan bir eğitim kurumu olan bir temsilciyle ilişkilendirir. @tr

has subject
status: Published
type: Property
lexical alias: subject.en
definition: Relates a resource to a topic that a resource is about.
inverse of: is subject of
label: har emne @da
definition: Relaterer en ressource til en ressources emne, fx en indikation om hvad en ressource handler om. @da
label: heeft onderwerp @nl
label: له موضوع @ar
definition: يربط بين مصدر وموضوع يدور حوله مصدر. @ar
label: aineiston aihe @fi
definition: Liittää aineiston aineiston aiheeseen. @fi
label: hat Thema @de
definition: Setzt eine Ressource in Beziehung zu einem Thema, von dem eine Ressource handelt. @de
label: 有主题 @zh-hans
definition: 将一种资源与一种资源所关于的一个论题关联起来。 @zh-hans
label: tárgya a következő: @hu
definition: Hozzákapcsol egy forrást egy témához, amely jelzi, hogy miről szól a forrás. @hu
has subproperty: is description of
label: konu ile ilişkilidir @tr
definition: Bir kaynağı, bir kaynak hakkındaki bir konuyla ilişkilendirir. @tr

is subject of
status: Published
type: Property
lexical alias: subjectOf.en
definition: Relates a resource to a resource that is about a resource.
inverse of: has subject
label: er emne i @da
definition: Relaterer en ressoure til en ressource, der handler om en ressource. @da
label: is onderwerp van @nl
label: هو موضوع لـ @ar
definition: يربط بين مصدر ومصدر يتعلق بمصدر. @ar
label: aineisto aiheena @fi
definition: Liittää aineiston aineistoon, jonka aiheena aineisto on. @fi
label: ist Thema von @de
definition: Setzt eine Ressource in Beziehung zu einer Ressource, von der eine Ressource handelt. @de
label: 是……的主题 @zh-hans
definition: 将一种资源与关于一种资源的一种资源关联起来。 @zh-hans
label: tárgya a következőnek: @hu
definition: Hozzákapcsol egy forrást egy forráshoz, ami egy forrásról szól. @hu
has subproperty: is described by
has subproperty: is evaluated by
label: Konu @tr
definition: Bir kaynağı, bir kaynak hakkındaki kaynakla ilişkilendirir. @tr

has subseries
status: Published
definition: Relates a resource to a resource that is a successive aggregating resource that is inspired by the overall editorial policy, scope, and style of another successive aggregating resource.
type: Property
sub property of: has part resource
inverse of: is subseries of
lexical alias: subseries.en
label: er underserie @da
definition: Relaterer en ressource til en serie eller et flerbindsværk der konsekvent optræder i en større ressource; en titel på en større ressource optræder på alle udgaver eller dele af underserien. @da
label: heeft onderserie @nl
label: aineiston alasarja @fi
label: له سلسلة فرعية @ar
definition: يربط بين مصدر ومصدر تجميعي متتالي مستوحى من السياسة التحريرية الشاملة، والمجال، وأسلوب مصدر تجميعي متتالي آخر. @ar
definition: Liittää aineiston peräkkäiseen aggregoivaan aineistoon, johon on vaikuttanut toisen peräkkäisen aggregoivan aineiston yleinen toimituksellinen käytäntö, laajuus ja tyyli. @fi
label: hat Unterreihe @de
definition: Setzt eine Ressource in Beziehung zu einer sukzessiven, aggregierenden Ressource, die an die allgemeine redaktionelle Vorgehensweise, den Geltungsbereich und den Stil einer anderen sukzessiven, aggregierenden Ressource angelehnt ist. @de
label: 有分丛编 @zh-hans
definition: 将一种资源与作为一种相继合集性资源并且被另一种相继合集性资源的总体编辑政策、编辑范围和编辑风格启发的一种资源关联起来。 @zh-hans
label: alsorozata a következő: @hu
definition: Hozzákapcsol egy forrást egy folyamatos aggregáló forráshoz, amelyre egy másik folyamatos aggregáló forrás szerkesztési elve, tárgyköre és stílusa volt hatással. @hu
label: alt seri ile ilişkilidir @tr
definition: Bir kaynağı, başka bir ardışık toplama kaynağının genel yayın politikasından, kapsamından ve biçiminden ilham alan ardışık toplama kaynağı olan bir kaynakla ilişkilendirir. @tr

is subseries of
status: Published
definition: Relates a resource to a resource that is a successive aggregating resource that inspires the editorial policy, scope, and style of another successive aggregating resource.
type: Property
sub property of: is part of resource
inverse of: has subseries
lexical alias: subseriesOf.en
label: er underserie af @da
definition: Relaterer en ressource til en ressource, i hvilket en del optræder regelmæssigt; titlen på den større ressource optræder på alle numre eller dele af underserien. @da
label: is onderreeks van @nl
label: aineiston alasarja @fi
label: هو سلسلة فرعية لـ @ar
definition: يربط بين مصدر ومصدر تجميعي متتالي يلهِم السياسة التحريرية، المجال، والأسلوب لمصدر تجميعي مُتتالي آخَر. @ar
definition: Liittää aineiston peräkkäisesti ilmestyvään aggregoivaan aineistoon, josta toinen peräkkäinen aggregoiva aineisto saa vaikutteita toimitukselliseen käytäntöön, laajuuteen ja tyyliin. @fi
label: ist Unterreihe von @de
definition: Setzt eine Ressource in Beziehung zu einer sukzessiven, aggregierenden Ressource, die die redaktionelle Vorgehensweise, den Geltungsbereich und den Stil einer anderen sukzessiven, aggregierenden Ressource beeinflusst. @de
label: 是……的分丛编 @zh-hans
definition: 将一种资源与作为一种相继合集性资源并且启发另一种相继合集性资源的编辑政策、编辑范围和编辑风格的一种资源关联起来。 @zh-hans
label: alsorozata a következőnek: @hu
definition: Hozzákapcsol egy forrást egy folyamatos aggregáló forráshoz, amely hatással van egy másik folyamatos aggregáló forrás szerkesztési elveire, tárgykörére és stílusára. @hu
label: alt sersidir @tr
definition: Bir kaynağı, başka bir ardışık toplama kaynağının yayın politikasına, kapsamına ve biçimine ilham veren ardışık toplama kaynağı olan bir kaynakla ilişkilendirir. @tr

is succeeded by
status: Published
definition: Relates a resource to a resource whose chronological coverage is after that of another resource.
type: Property
sub property of: has sequential resource relationship with (Deprecated)
inverse of: is preceded by
lexical alias: succeededBy.en
label: er efterfulft af @da
definition: Relaterer en ressource til en ressource, der følger efter en forudgående ressource, dvs. på et senere tidspunkt eller efter noget i en fortælling etc. @da
label: is gevolgd door @nl
label: myöhempi aineisto @fi
label: هو متبوع بـ @ar
definition: يربط بين مصدرًا ومصدر تكون تغطيته الزمنية بعد التغطية الخاصة بمصدر آخر. @ar
definition: Liittää aineiston aineistoon joka on toista aineistoa ajallisesti tai kerronnallisesti edellä. @fi
label: ist gefolgt von @de
definition: Setzt eine Ressource in Beziehung zu einer Ressource, deren zeitliches Geschehen nach dem einer anderen Ressource liegt. @de
label: 被……后继 @zh-hans
definition: 将一种资源与其年代覆盖范围在另一种资源之后的一种资源关联起来。 @zh-hans
label: folytatja @hu
definition: Hozzákapcsol egy forrást egy forráshoz, amely kronológiai narratívában követ egy másik forrást, azaz időben későbbi vagy azutáni. @hu
has subproperty: is absorbed by
has subproperty: is absorbed in part by
has subproperty: is continued by
has subproperty: is merged to form
has subproperty: is prequel to (Deprecated)
has subproperty: is replaced by
has subproperty: is replaced in part by
has subproperty: is separated into
has subproperty: has sequel
has subproperty: is split into
label: tarafından bir işin yerine getirilmesi @tr
definition: Bir kaynağı, kronolojik kapsamı başka bir kaynaktan sonra olan bir kaynakla ilişkilendirir. @tr

has successor
status: Published
definition: Relates an agent who succeeds or follows a related agent to an agent.
type: Property
inverse of: has predecessor
lexical alias: successor.en
label: har efterfølger @da
definition: Relaterer en agent der efterfølger eller kommer efter en anden agent til en agent. @da
label: heeft opvolger @nl
label: له خَلِيفَة @ar
definition: يربط بين وكيل ووكيل يخلف أو يلي وكيل ذو صلة. @ar
label: seuraaja (yhteistoimija) @fi
definition: Liittää yhteistoimijan toista yhteistoimijaa seuraavaan tai jatkavaan yhteistoimijaan. @fi
label: ist Nachfolgerin/Nachfolger @de
definition: Setzt einen Akteur in Beziehung zu einem Akteur, der einem anderen Akteur nachfolgt oder aus ihm hervorgeht. @de
label: 有后继 @zh-hans
definition: 将一个后继或紧随一个相关行为者的行为者与一个行为者关联起来。 @zh-hans
label: utódja a következő: @hu
definition: Hozzákapcsol egy ágenst, amely egy kapcsolódó ágenst követ vagy annak utódja, egy ágenshez. @hu
label: yerine geçen ile ilişkilidir @tr
definition: İlgili bir temsilciden sonra gelen veya onu takip eden bir temsilciyi bir temsilciyle ilişkilendirir. @tr

has summarization of content
status: Published
definition: Relates a resource to an abstract, summary, synopsis, or other description of the content of a resource.
type: Property
lexical alias: summarizationOfContent.en
label: har opsummering af indhold @da
definition: Relaterer en ressource til et abstrakt, et resumé, en synopsis etc. af en ressources indhold. @da
label: heeft samenvatting van content @nl
label: sisällön yhteenveto aineistossa @fi
label: له تلخيص محتوى @ar
definition: يربط بين مصدر ومستخلص، ملخص، موجز، أو وصف آخر لمحتوى أحد المصادر. @ar
definition: Liittää aineiston tiivistelmään, yhteenvetoon, synopsikseen tai muuhun aineiston sisällön kuvaukseen. @fi
label: hat Zusammenfassung eines Inhalts @de
definition: Setzt eine Ressource in Beziehung zu einem Abstract, einer Zusammenfassung, einer Synopse oder einer anderen Beschreibung des Inhalts einer Ressource. @de
label: 有内容的概述 @zh-hans
definition: 将一种资源与一种资源的内容的摘要、概要、大纲或其他描述关联起来。 @zh-hans
label: tartalom összefoglalása a következő: @hu
definition: Hozzákapcsol egy forrást egy forrás tartalmának a referátumához, összefoglalásához, szinopszisához, vagy egyéb leírásához. @hu
label: içeriğin özetlenmesi ile ilişkilidir @tr
definition: Bir kaynağı, bir kaynağın içeriğinin özü, özeti, sinopsisi veya kaynak içeriğinin başka bir açıklaması ile ilişkilendirir. @tr

has summary
status: Published
definition: Relates a resource to a resource that is a brief description of a resource.
type: Property
inverse of: is summary of
label: er opsummeret som @da
definition: Relaterer en ressource til en ressource, der består af en kortfattet gengivelse af en oprindelig ressources indhold. @da
alternative label: is summarized as
sub property of: is described by
lexical alias: summary.en
label: is samengevat als @nl
label: tiivistelmän sisältävä aineisto @fi
label: هو مُلَخّص كـ @ar
definition: يربط بين مصدر ومصدر يتكون من تلخيص موجز لمحتوى مصدر آخَر. @ar
definition: Liittää aineiston aineistoon, joka on lyhyt kuvaus sen sisällöstä. @fi
alternative label: tiivistelmä aineistosta @fi
label: ist zusammenfasst als @de
definition: Setzt eine Ressource in Beziehung zu einer Ressource, die aus einer kurzen Wiederholung des Inhalts einer anderen Ressource besteht. @de
alternative label: 被提要为 @zh-hans
label: 有提要 @zh-hans
definition: 将一种资源与作为一种资源简要描述的一种资源关联起来。 @zh-hans
alternative label: és sumaritzat com @ca
label: té sumari @ca
definition: Relaciona un recurs amb un recurs que és una descripció breu d’un recurs. @ca
label: összefoglalva a következőként: @hu
definition: Hozzákapcsol egy forrást egy forráshoz, amely egy másik forrás tartalmának rövid összegzéséből áll. @hu
has subproperty: has abstract
alternative label: olarak özetlenmiştir @tr
label: özet ile ilişkilidir @tr
definition: Bir kaynağı, kaynağın kısa bir açıklaması olan kaynakla ilişkilendirir. @tr

is summary of
status: Published
definition: Relates a resource to a resource that is briefly described by a resource.
type: Property
inverse of: has summary
lexical alias: summaryOf.en
label: er resume af @da
definition: Relaterer en ressource til en ressource, der er anvendt som grundlag for en kortfattet sammenfatning af dens indhold. @da
sub property of: is description of
label: is samenvatting van @nl
label: yhteenveto aineistosta @fi
label: هو مُلخص لـ @ar
definition: يربط بين مصدر ومصدر يُستخدم كأساس لخلاصة موجز لمحتواه. @ar
definition: Liittää aineiston aineistoon, jonka sisältö esitellään aineistossa lyhyellä kuvauksella. @fi
label: ist Zusammenfassung von @de
definition: Setzt eine Ressource in Beziehung zu einer Ressource, die als Grundlage für eine kurze Zusammenfassung ihres Inhalts verwendet wird. @de
label: 是……的提要 @zh-hans
definition: 将一种资源与被一种资源简要描述的一种资源关联起来。 @zh-hans
label: összefoglalása a következőnek: @hu
definition: Hozzákapcsol egy forrást egy forráshoz, amelyet tartalma rövid összegzésének az alapjaként használnak. @hu
has subproperty: is abstract of
label: özetidir @tr
definition: Bir kaynağı, bir kaynak tarafından kısaca açıklanan bir kaynakla ilişkilendirir. @tr

has supplement
status: Published
definition: Relates a resource to a resource that updates or otherwise complements a predominant resource.
type: Property
sub property of: is augmented by
inverse of: is supplement to
lexical alias: supplement.en
label: er supplement @da
definition: Relaterer en ressource til en ressource, der opdaterer eller på anden måde komplementerer hovedressourcen. @da
label: heeft supplement @nl
label: suplementti (aineisto) @fi
label: له إضَافَة @ar
definition: يربط بين مصدر ومصدر يقوم بتحديث مصدر سائد أو يكمله بطريقة أخرى. @ar
definition: Liittää aineiston aineistoon, joka päivittää tai muutoin täydentää vallitsevaa aineistoa. @fi
label: hat Supplement @de
definition: Setzt eine Ressource in Beziehung zu einer Ressource, die eine Hauptressource aktualisiert oder auf andere Weise ergänzt. @de
label: 有补编 @zh-hans
definition: 将一种资源与更新或补充一种主要资源的一种资源关联起来。 @zh-hans
label: szuplementuma a következő: @hu
definition: Hozzákapcsol egy forrást egy forráshoz, amely egy domináns forrást frissít vagy más módon kiegészít. @hu
label: ek ile ilişkilidir @tr
definition: Bir kaynağı, güncelleyen veya başka şekilde tamamlayan baskın bir kaynakla ilişkilendirir. @tr

has supplementary content
status: Published
definition: Relates a resource to an indication of the kinds of resource that supplement the main resources that are embodied by an augmentation aggregate.
type: Property
lexical alias: supplementaryContent.en
label: har supplerende indhold @da
definition: Relaterer en ressource til en indikation af indhold der opdaterer eller supplerer en ressources primære indhold. @da
label: heeft aanvullende content @nl
label: lisätty aineistosisältö @fi
label: له محتوى تكميلي @ar
definition: يربط بين مصدر ومؤشر لأنواع المصادر التي تُكمل المصادر الرئيسية التي يتم تجسيدها بواسطة إضافة تجميعة. @ar
definition: Liittää aineiston ilmaukseen niistä aineistoista, jotka täydentävät laajennusaggregaatin sisältämiä aineistoja. @fi
label: hat ergänzenden Inhalt @de
definition: Setzt eine Ressource in Beziehung zu einer Angabe der Ressourcenarten, die die Hauptressourcen ergänzen, welche durch ein Erweiterungsaggregat verkörpert werden. @de
label: 有补充内容 @zh-hans
definition: 将一种资源与补充被一种附增合集具体化的主要资源的资源的类型的指示关联起来。 @zh-hans
label: kiegészítő tartalma a következő: @hu
definition: Hozzákapcsol egy forrást egy forrás azon típusainak a jelöléséhez, amelyek kiegészítik az aggregátumban megtestesülő fő forrásokat. @hu
label: tamamlayıcı içerik ile ilişkilidir @tr
definition: Bir kaynağı, bir çoğaltma topluluğu tarafından somutlaştırılan ana kaynakları tamamlayan kaynak türlerinin göstergesiyle ilişkilendirir. @tr

is supplement to
status: Published
definition: Relates a resource to a resource that is updated or otherwise complemented by an augmenting resource.
type: Property
sub property of: is augmentation of
inverse of: has supplement
lexical alias: supplementTo.en
label: er supplement til @da
definition: Relaterer en ressource til en ressource, der er opdateret eller på anden måde komplementeret af den berigende ressource. @da
label: is supplement op @nl
label: suplementti aineistoon @fi
label: هو إضَافَة لـ @ar
definition: يربط بين مصدر ومصدر تم تحديثه أو استكماله بطريقة أخرى بمصدر مُزيَّد. @ar
definition: Liittää aineiston aineistoon, jota laajentava aineisto päivittää tai muutoin täydentää. @fi
label: ist Supplement zu @de
definition: Setzt eine Ressource in Beziehung zu einer Ressource, die durch eine erweiternde Ressource aktualisiert oder in anderer Weise vervollständigt wird. @de
label: 是……的补编 @zh-hans
definition: 将一种资源与被一种附增资源更新或补充的一种资源关联起来。 @zh-hans
label: szuplementuma a következőnek: @hu
definition: Hozzákapcsol egy forrást egy forráshoz, amelyet egy bővítő mű frissít vagy más módon kiegészít. @hu
label: ektir @tr
definition: Bir kaynağı, bir artırılmış kaynak tarafından başka bir şekilde tamamlanmış veya güncellenmekte olan bir kaynakla ilişkilendirir. @tr

has surname
status: Published
type: Property
lexical alias: surname.en
definition: Relates an agent to a name used as a family name.
label: har efternavn @da
definition: Relaterer en agent til et navn, der anvendes som familienavn. @da
inverse of: is surname of
label: heeft achternaam @nl
label: له اسم عائلة @ar
definition: يربط بين وكيل واسم يُستخدم كاسم عائلة. @ar
label: toimijan sukunimi @fi
definition: Liittää toimijan suvun nimenä käytettyyn nimeen. @fi
label: hat Nachname @de
definition: Setzt einen Akteur in Beziehung zu einem Namen, der als Familienname benutzt wird. @de
label: 有姓 @zh-hans
definition: 将一个行为者与用作家族姓氏的一个名称关联起来。 @zh-hans
label: vezetékneve a következő: @hu
definition: Hozzákapcsol egy ágenst egy vezetéknévként használt névhez. @hu
label: soyadı ile ilişkilidir @tr
definition: Bir temsilciyi, aile adı olarak kullanılan bir isimle ilişkilendirir. @tr

has surveyor
status: Published
definition: Relates a resource to an agent who is a contributor agent of cartography who provides measurements or dimensional relationships for a geographic area.
type: Property
sub property of: has contributor (Deprecated)
inverse of: is surveyor of
lexical alias: surveyor.en
label: har landmåler @da
definition: Relaterer en ressource til en agent, der har bidraget til en kartografisk ressource ved at tilvejebringe opmålinger eller målestoksforhold til det geografiske område, der er repræsenteret. @da
label: heeft landmeter @nl
label: maanmittari aineistossa @fi
label: له مسّاح @ar
definition: يربط مصدر بوكيل مُساهم في رسم الخرائط ويُوفر القياسات أوالعلاقات بين الأبعاد لمنطقة جغرافية. @ar
definition: Liittää aineiston toimijaan, joka myötävaikuttaa kartantekijänä maantieteellisen alueen mittojen tai mittasuhteiden tuottamisessa. @fi
label: hat Landvermesserin/Landvermesser @de
definition: Setzt eine Ressource in Beziehung zu einer Beiträgerin/einem Beiträger einer Kartografie (Akteur), die/der Messwerte oder Abmessungsverhältnisse für den dargestellten geografischen Bereich zur Verfügung stellt. @de
label: 有测绘者 @zh-hans
definition: 将一种资源与作为地图绘制的贡献者行为者并为一个地理区域提供测量或尺寸关系的一个行为者关联起来。 @zh-hans
label: földmérője a következő: @hu
definition: Hozzákapcsol egy forrást egy kartográfia közreműködő ágenséhez, amely egy földrajzi területről méréseket vagy dimenziós összefüggéseket szolgáltat. @hu
label: topograf ile ilişkilidir @tr
definition: Bir kaynağı, bir coğrafi alan için ölçümler veya boyutsal ilişkiler sağlayan, kartografyaya katkıda bulunan bir temsilci olan bir temsilci ile ilişkilendirir. @tr

is surveyor of
status: Published
definition: Relates an agent to a cartographic resource that incorporates a contribution by an agent of providing measurements or dimensional relationships for a geographic area that is represented.
type: Property
sub property of: is contributor of (Deprecated)
inverse of: has surveyor
lexical alias: surveyorOf.en
label: er landmåler i @da
definition: Relaterer en agent, der har bidraget til en kartografisk ressource ved at sørge for opmålinger eller målestoksforhold til et repræsenteret geografisk område til en ressource. @da
label: is landmeter van @nl
label: هو مسّاح لـ @ar
definition: يربط بين وكيل ومصدر رسم خرائطي يتضمن إسهام وكيل بتقديم القياسات أوالعلاقات بين الأبعاد لمنطقة جغرافية يتم تمثيلها. @ar
label: maanmittari (toimija) aineistossa @fi
definition: Liittää toimijan kartografiseen aineistoon, jossa toimija on osallisena maantieteellisen alueen mittojen tai mittasuhteiden tuottamisessa. @fi
label: ist Landvermesserin/Landvermesser von @de
definition: Setzt einen Akteur in Beziehung zu einer kartografischen Ressource, zu der ein Akteur beiträgt, indem er Messwerte oder Abmessungsverhältnisse für einen dargestellten geografischen Bereich zur Verfügung stellt. @de
label: 是……的测绘者 @zh-hans
definition: 将一个行为者与包括为一个地理区域提供测量或尺寸关系的一个行为者的贡献的一种地图资源关联起来。 @zh-hans
label: földmérője a következőnek: @hu
definition: Hozzákapcsol egy ágenst egy kartográfiai forráshoz, amely magában foglalja az ágens közreműködését a reprezentált földrajzi terület mérésében vagy dimenziós összefüggéseinek szolgáltatásában. @hu
label: topograf @tr
definition: Bir temsilciyi, temsil edilen bir coğrafi alan için ölçümler veya boyutsal ilişkiler sağlama temsilcisinin katkısını içeren bir kartografik kaynakla ilişkilendirir. @tr

has system of organization
status: Published
definition: Relates a resource to a system of arranging materials in an archival resource or a collection.
type: Property
lexical alias: systemOfOrganization.en
label: har organiseringssystem @da
definition: Relaterer en ressource til et system til organisering af materialer i en arkivressource eller samling. @da
label: heeft systeem van organisatie @nl
label: aineiston järjestämisperiaate @fi
label: له نظام للترتيب @ar
definition: يربط بين مصدر ونظام ترتيب المواد في مصدر أرشيفي أو مجموعة أرشيفية. @ar
definition: Liitää aineiston arkiston tai kokoelman järjestämisessä käytettyyn järjestelmään. @fi
label: Ordnungssystem @de
definition: Setzt eine Ressource in Beziehung zu einem System, um Materialien in einer archivalischen Ressource oder einer Sammlung zu ordnen. @de
label: 有组织体系 @zh-hans
definition: 将一种资源与一种档案资源或一种收藏中编排资料的一个体系关联起来。 @zh-hans
label: szervezeti rendszere a következő: @hu
definition: Hozzákapcsol egy forrást egy anyagok rendezésére szolgáló rendszerhez egy levéltári forrásban vagy gyűjteményben. @hu
label: organizasyon sistemi ile ilişkilidir @tr
definition: Bir kaynağı, bir arşiv kaynağındaki veya koleksiyondaki materyalleri bir düzenleme sistemiyle ilişkilendirir. @tr

has tape configuration
status: Published
definition: Relates a resource to a number of tracks on an audiotape.
type: Property
sub property of: has sound characteristic
lexical alias: tapeConfiguration.en
label: har båndkonfiguration @da
definition: Relaterer en ressource til et antal spor på et lydbånd. @da
label: heeft bandconfiguratie @nl
label: له بنية شريط @ar
definition: يربط بين مصدر وعدد المسارات على شريط صوت. @ar
label: ääninauhan raitojen määrä aineistossa @fi
definition: Liittää aineiston ääninauhalla olevien ääniraitojen lukumäärään. @fi
label: hat Bandkonfiguration @de
definition: Setzt eine Ressource in Beziehung zu einer Anzahl der Spuren auf einem Tonband. @de
label: 有磁带配置 @zh-hans
definition: 将一种资源与录音磁带上的音轨数关联起来。 @zh-hans
label: felvevőszalag konfigurációja a következő: @hu
definition: Hozzákapcsol egy forrást a sávok számához egy audiószalagon. @hu
label: bant yapılandırması ile ilişkilidir @tr
definition: Bir kaynağı bir ses kasetindeki bir dizi parça ile ilişkilendirir. @tr

has teacher
status: Published
type: Property
lexical alias: teacher.en
definition: Relates an agent to an agent who instructs a related agent.
inverse of: has student
sub property of: has related agent of agent
label: har lærer @da
definition: Relaterer en agent til en agent, der underviser en anden agent. @da
label: heeft leraar @nl
label: له مدرس @ar
definition: يربط بين وكيل ووكيل يقوم بتعليم وكيل ذي صلة. @ar
label: opettaja (toimija) @fi
definition: Liittää toimijan toista toimijaa opettavaan liittyvään toimijaan. @fi
label: hat Lehrerin/Lehrer @de
definition: Setzt einen Akteur in Beziehung zu einem Akteur, der einen in Beziehung stehenden Akteur unterrichtet. @de
label: 有教师 @zh-hans
definition: 将一个行为者与给予一个相关行为者教学的一个行为者关联起来。 @zh-hans
label: tanára a következő: @hu
definition: Hozzákapcsol egy ágenst egy ágenshez, aki egy kapcsolódó ágenst oktat. @hu
label: öğretmen ile ilişkilidir @tr
definition: Bir temsilciyi, ilgili bir temsilciye talimat veren bir temsilciyle ilişkilendirir. @tr

has instructor
type: Property
sub property of: has performer
inverse of: is instructor of
definition: Relates a resource to an agent who is a performer who contributes to a resource by teaching or providing a demonstration.
label: har lærer @da
definition: Relaterer en ressource til en optrædende, der har bidraget til en ressource ved at give instruktion eller en demonstration. @da
lexical alias: instructor.en
status: Published

is television adaptation of
status: Published
definition: Relates a resource to a resource that is adapted as a television program.
type: Property
sub property of: is adaptation of
inverse of: is adapted as television program
lexical alias: televisionAdaptationOf.en
label: er tv-bearbejdelse af @da
definition: Relaterer en ressource til en ressource, der er blevet bearbejdet til et tv-program. @da
label: is televisiebewerking van @nl
label: televisiosovitus aineistosta @fi
label: هو اقتباس تلفزيوني لـ @ar
definition: يربط بين مصدر ومصدر تم تحويره كبرنامج تليفزيوني. @ar
definition: Liittää aineiston televisio-ohjelmaksi sovitettuun aineistoon. @fi
label: ist Fernsehbearbeitung von @de
definition: Setzt eine Ressource in Beziehung zu einer Ressource, die als Fernsehsendung bearbeitet ist. @de
label: 是……的电视改编 @zh-hans
definition: 将一种资源与被改编为电视节目的一种资源关联起来。 @zh-hans
label: televíziós feldolgozása a következőnek: @hu
definition: Hozzákapcsol egy forrást egy forráshoz, amelyet televízióműsorként adaptáltak. @hu
label: televizyon uyarlamasıdır @tr
definition: Bir kaynağı, televizyon programı olarak uyarlanmış bir kaynakla ilişkilendirir. @tr

has television director
status: Published
definition: Relates a resource to an agent who is a director who is responsible for the general management and supervision of a television program.
type: Property
sub property of: has director
inverse of: is television director of
lexical alias: televisionDirector.en
label: har tv-instruktør @da
definition: Relaterer en ressource til en instruktør, der er ansvarlig for ledelse af og tilsyn med et tv-program. @da
label: heeft televisieregisseur @nl
label: televisio-ohjaaja aineistossa @fi
label: له مخرج تلفزيوني @ar
definition: يربط مصدر بوكيل يعمل بصفته مخرجًا مسؤولًا عن الإدارة العامة والإشراف على برنامج تليفزيوني. @ar
definition: Liittää aineiston toimijaan, joka ohjaajana vastaa televisio-ohjelman yleisestä johtamisesta ja valvonnasta. @fi
label: hat Fernsehregisseurin/Fernsehregisseur @de
definition: Setzt eine Ressource in Beziehung zu einer Regisseurin/einem Regisseur, die/der für das allgemeine Management und die Leitung einer Fernsehsendung verantwortlich ist. @de
label: 有电视导演 @zh-hans
definition: 将一种资源与作为一个导演并负责电视节目的总体管理和监督的一个行为者关联起来。 @zh-hans
label: televíziós rendezője a következő: @hu
definition: Hozzákapcsol egy forrást egy ágenshez, amely felelős egy televízióműsor általános menedzseléséért és felügyeletéért. @hu
label: televizyon yönetmeni ile ilişkilidir @tr
definition: Bir kaynağı, bir televizyon programının genel yönetimi ve denetiminden sorumlu bir yönetmen olan bir temsilci ile ilişkilendirir. @tr

is television director of
status: Published
definition: Relates an agent to a resource that involves a responsibility of an agent for the general management and supervision of a television program.
type: Property
sub property of: is director of
inverse of: has television director
lexical alias: televisionDirectorOf.en
label: er tv-instruktør af @da
definition: Relaterer en instruktør der er ansvarlig for ledelse og tilsyn med et tv-program til en ressource. @da
label: is televisieregisseur van @nl
label: telvisio-ohjaaja (toimija) aineistossa @fi
label: هو مخرج تلفزيوني لـ @ar
definition: يربط بين وكيل ومصدر ينطوي على مسؤولية وكيل الإدارة العامة والإشراف على برنامج تليفزيوني. @ar
definition: Liittää toimijan aineistoon, jossa toimija vastaa televisio-ohjelman esityksen yleisestä johtamisesta ja valvonnasta. @fi
label: ist Fernsehregisseurin/Fernsehregisseur von @de
definition: Setzt einen Akteur in Beziehung zu einer Ressource, bei der ein Akteur für das allgemeine Management und die Leitung einer Fernsehsendung verantwortlich ist. @de
label: 是……的电视导演 @zh-hans
definition: 将一个行为者与涉及电视节目的总体管理和监督的一个行为者的责任的一种资源关联起来。 @zh-hans
label: televíziós rendezője a következőnek: @hu
definition: Hozzákapcsol egy ágenst egy forráshoz, amelyhez hozzátartozik az ágens felelőssége egy televízióműsor általános menedzseléséért és felügyeletéért. @hu
label: televizyon yönetmenidir. @tr
definition: Bir temsilciyi, bir televizyon programının genel yönetimi ve denetimine ilişkin bir temsilcinin sorumluluğunu içeren bir kaynakla ilişkilendirir. @tr

has television producer
status: Published
definition: Relates a resource to an agent who is a producer who is responsible for most of the business aspects of a television program.
type: Property
sub property of: has producer
inverse of: is television producer of
lexical alias: televisionProducer.en
label: har tv-producer @da
definition: Relaterer en ressource til en producer, der er ansvarlig for størstedelen af de forretningsmæssige aspekter ved et tv-program. @da
label: heeft televisieproducent @nl
label: televisiotuottajana aineistossa @fi
label: له مُنتِج تلفزيوني @ar
definition: يربط مصدر بوكيل يكون مُنتِجًا مسؤولًا عن معظم الجوانب التجارية لإنتاج برنامج تليفزيوني. @ar
definition: Liittää aineiston toimijaan, joka on vastuussa suurimmasta osasta televisio-ohjelman liiketoimintaa. @fi
label: hat Fernsehproduzentin/Fernsehproduzenten @de
definition: Setzt eine Ressource in Beziehung zu einer Produzentin/einem Produzenten, die/der für die meisten geschäftlichen Aspekte einer Fernsehsendung verantwortlich ist. @de
label: 有电视制作者 @zh-hans
definition: 将一种资源与作为制作者并负责电视节目的大部分商业运作的一个行为者关联起来。 @zh-hans
label: televíziós producere a következő: @hu
definition: Hozzákapcsol egy forrást egy producer ágenshez, aki felelős egy televízióműsor üzleti vonatkozásainak a zöméért. @hu
label: televizyon yapımcısı ile ilişkilidir @tr
definition: Bir kaynağı, bir televizyon programının ticari yönlerinin çoğundan sorumlu yapımcı olan temsilci ile ilişkilendirir. @tr

is television producer of
status: Published
definition: Relates an agent to a resource that involves a responsibility of an agent for most of the business aspects of the production of a television program.
type: Property
sub property of: is producer of
inverse of: has television producer
lexical alias: televisionProducerOf.en
label: er tv-producer af @da
definition: Relaterer en producer der er ansvarlig for størstedelen af de forretningsmæssige aspekter ved et tv-program, til en ressource. @da
label: is televisieproducent van @nl
label: televisiotuottajana aineistossa @fi
label: هو منتج تليفزيوني لـ @ar
definition: يربط بين وكيل ومصدر ينطوي على مسؤولية وكيل عن معظم الجوانب التجارية لإنتاج برنامج تليفزيوني. @ar
definition: Liittää toimijan aineistoon, jossa toimija vastaa suurimmasta osasta televisio-ohjelman liiketoimintaa. @fi
label: ist Fernsehproduzentin/Fernsehproduzent von @de
definition: Setzt einen Akteur in Beziehung zu einer Ressource, bei der ein Akteur für die meisten geschäftlichen Aspekte einer Fernsehsendung verantwortlich ist. @de
label: 是……的电视制作人 @zh-hans
definition: 将一个行为者与涉及电视节目制作的大部分商业运作的一个行为者的责任的一种资源关联起来。 @zh-hans
label: televízió-producere a következőnek: @hu
definition: Hozzákapcsol egy ágenst egy forráshoz, amelyhez hozzátartozik az ágens felelőssége egy televízióműsor üzleti vonatkozásainak a zöméért. @hu
label: Televizyon yapımcısı @tr
definition: Bir temsilciyi, bir televizyon programının yapımının ticari yönlerinin çoğu için sorumluluğun bir temsilciye ait olduğu bir kaynakla ilişkilendirir. @tr

has television program music
status: Published
definition: Relates a resource to a musical resource that complements a resource that is a television program.
type: Property
sub property of: has music
inverse of: is music for television program
lexical alias: televisionProgramMusic.en
label: er tv-programmusik @da
definition: Relaterer en ressource til en musikressource. der er anvendt i et tv-program. @da
label: heeft televisieprogramma-muziek @nl
label: له موسيقي برنامج تليفزيوني @ar
definition: يربط بين مصدر ومصدر موسيقي يُكمل مصدرًا يمثل برنامج تليفزيوني. @ar
label: televisio-ohjelman musiikki (aineisto) @fi
label: hat Fernsehsendungsmusik @de
definition: Setzt eine Ressource in Beziehung zu einer Musikressource, die eine Fernsehsendung ergänzt. @de
definition: Liittää aineiston televisio-ohjelma-aineistoa täydentävään musiikkiaineistoon. @fi
label: 有电视节目音乐 @zh-hans
definition: 将一种资源与补充作为电视节目的一种资源的一种音乐资源关联起来。 @zh-hans
label: televízióműsor zenéje a következő: @hu
definition: Hozzákapcsol egy forrást egy zenei forráshoz, amely kiegészít egy televízióműsor-forrást. @hu
label: televizyon programı müziği ile ilişkilidir @tr
definition: Bir kaynağı, bir televizyon programı olan bir kaynağı tamamlayan bir müzik kaynağıyla ilişkilendirir. @tr

has television screenplay
status: Published
definition: Relates a resource to a resource that is a textual resource that complements a resource that is a television program.
type: Property
sub property of: has screenplay
inverse of: is screenplay for television program
lexical alias: televisionScreenplay.en
label: er tv-manuskript @da
definition: Relaterer en ressource til en ressource, der indeholder teksten til et tv-program. @da
label: heeft televisiescenario @nl
label: televisio-ohjelman käsikirjoitus (aineisto) @fi
label: له سيناريو تليفزيوني @ar
definition: يربط بين مصدر ومصدر نصي يكمل مصدرًا يمثل برنامج تليفزيوني. @ar
definition: Liittää aineiston televisio-ohjelma-aineistoon, joka käyttää käsikirjoitusta ja jota on täydennetty tekstiteoksella. @fi
label: hat Fernsehdrehbuch @de
definition: Setzt eine Ressource in Beziehung zu einer textlichen Ressource, die eine Fernsehsendung ergänzt. @de
label: 有电视剧本 @zh-hans
definition: 将一种资源与补充作为一种电视节目的一种资源的作为一种文字资源的一种资源关联起来。 @zh-hans
label: televíziós forgatókönyve a következő: @hu
definition: Hozzákapcsol egy forrást egy szöveges forráshoz, amely kiegészít egy forrást, ami egy televízióműsor. @hu
label: televizyon senaryosu ile ilişkilidir @tr
definition: Bir kaynağı, televizyon programı olan bir kaynağı tamamlayan metinsel kaynak olan bir kaynakla ilişkilendirir. @tr

is television screenplay based on
status: Published
definition: Relates a resource to a resource that is adapted as a screenplay for a television program.
type: Property
sub property of: is screenplay based on
inverse of: is adapted as television screenplay
lexical alias: televisionScreenplayBasedOn.en
label: er tv-manuskript baseret på @da
definition: Relaterer en ressource til en ressource, der er blevet bearbejdet til manuskript til et tv-program. @da
label: is televisiescenario gebaseerd op @nl
label: هو سيناريو تليفزيوني معتمد على @ar
definition: يربط بين مصدر ومصدر تم تحويره كسيناريو لبرنامج تليفزيوني. @ar
label: televisiokäsikirjoituksen perustana oleva aineisto @fi
definition: Liittää aineiston televiso-ohjelman käsikirjoitukseksi sovitettuun aineistoon. @fi
label: ist Fernsehdrehbuch basierend auf @de
definition: Setzt eine Ressource in Beziehung zu einer Ressource, die als Drehbuch für eine Fernsehsendung bearbeitet ist. @de
label: 是基于……的电视剧本 @zh-hans
definition: 将一种资源与被改编为电视节目剧本的一种资源关联起来。 @zh-hans
label: televíziós forgatókönyv a következőből: @hu
definition: Hozzákapcsol egy forrást egy forráshoz, amelyet egy televízióműsor forgatókönyveként adaptáltak. @hu
label: uyarlanan televizyon senaryosudur @tr
definition: Bir kaynağı, bir televizyon programı için senaryo olarak uyarlanmış bir kaynakla ilişkilendirir. @tr

has term of rank or honour or office
status: Published
definition: Relates an agent to a word or phrase indicative of royalty, nobility, rank, honour, or office, or a term of address for an agent of religious vocation.
type: Property
label: har agents titel @da
definition: Relaterer en ressource til et ord eller frase, der angiver kongelighed, adelskab, gejstlig rang eller embede, eller en tiltaleform for en agent med religiøst hverv. @da
label: heeft term van rang, eer of ambt @nl
label: henkilön arvonimi tai asema @fi
label: له لقب رتبة، شرف، أو منصب @ar
definition: يربط بين وكيل وكلمة أو عبارة تُشير إلى رتبة، منصب ملكي، أو نبيل، أو منصب كنسيَّ، وهو لقب لوكيل له مهنة دينية، أو لقب آخر يدل على رتبة، شرف، أو منصب @ar
definition: Liittää henkilön sanaan tai ilmaukseen, joka osoittaa kuninkaallista tai aatelisarvoa, kirkollista virkaa tai asemaa tai uskonnolliseen tehtävään liittyvää puhuttelua. @fi
label: hat Rang-, Ehren- oder Amtsbezeichnung @de
definition: Setzt einen Akteur in Beziehung zu einem Wort oder einer Phrase, das/die auf die Zugehörigkeit zu einem Fürstentum, zum Adel, auf einen kirchlichen Rang oder ein kirchliches Amt hinweist, zu einer Anrede für einen Akteur mit religiöser Berufung oder zu einem anderen Begriff, der auf einen Rang, eine Ehre oder ein Amt hinweist. @de
scope note: A term of rank, honour, or office, includes initials or abbreviations representing an academic degree, or membership in an organization.
alternative label: has term of rank, honour, or office
lexical alias: termOfRankOrHonourOrOffice.en
label: 有等级或荣誉或职位的头衔 @zh-hans
definition: 将一个行为者与表示皇室、贵族、教会级别或职位、或者一个宗教职业行为者的称谓的一个单词或短语、或者其他等级或荣誉或职位的头衔关联起来。 @zh-hans
label: rangot, hódolatot vagy hivatalt kifejező szava a következő: @hu
definition: Hozzákapcsol egy ágenst egy királyi, nemesi, egyházi rangot vagy hivatalt jelentő szóhoz vagy kifejezéshez, vagy az ágensnek szóló vallási megszólítási formához, vagy egyéb rangot, hódolatot vagy hivatalt kifejező szóhoz. @hu
alternative label: té com a terme de rang, distinció o càrrec @ca
label: té com a terme de rang o de distinció o de càrrec @ca
definition: Relaciona un agent amb una paraula o frase indicativa de reialesa, de noblesa, de rang, de distinció o de càrrec, o terme de tractament d’una persona de vocació religiosa. @ca
scope note: Un terme de rang, de distinció o de càrrec, inclou inicials o abreviacions que representen un grau acadèmic o la pertinença a una organització. @ca
label: rütbe, onur veya makam ile ilişkilidir @tr
definition: Bir temsilciyi, kraliyet, soyluluk veya dini rütbe veya makama işaret eden bir kelime veya ifadeyle, dini mesleğe sahip bir temsilciye ilişkin bir hitap terimiyle veya rütbe, onur veya makama işaret eden başka bir terimle ilişkilendirir. @tr

has terms of availability
status: Published
definition: Relates a resource to a condition under which a publisher, distributor, etc., will normally supply a resource or the price of a resource.
type: Property
lexical alias: termsOfAvailability.en
label: har anskaffelsesvilkår @da
definition: Relaterer en ressource til en etingelse, under hvilke udgiveren, distributøren etc. normalt vil levere en ressource eller prisen på en ressource. @da
label: heeft voorwaarden voor beschikbaarheid @nl
label: له شروط إتاحة @ar
definition: يربط بين مصدر وحالة يقوم عادةً بموجبها ناشر، موزع، إلخ. بتوريد مصدر أو ثمن مصدر. @ar
label: aineiston saatavuusehdot @fi
definition: Liittää aineiston kustantajan, jakelijan tms. asettamiin aineiston toimitusta tai hintaa määrittäviin ehtoihin. @fi
label: hat Bezugsbedingung @de
definition: Setzt eine Ressource in Beziehung zu einem Preis oder einer Kondition, zu dem/der ein Verlag, Vertrieb und so weiter eine Ressource normalerweise liefert. @de
label: 有获得方式 @zh-hans
definition: 将一种资源与出版者、发行者等通常提供一种资源的条件或者一种资源的价格关联起来。 @zh-hans
label: hozzáférési feltétele a következő: @hu
definition: Hozzákapcsol egy forrást egy feltételhez, amely szerint a kiadó, terjesztő, stb. a szokásos módon szolgáltat majd egy forrást, vagy határozza meg a forrás árát. @hu
label: elde edilebilirlik koşulları ile ilişkilidir @tr
definition: Bir kaynağı, bir yayıncının, dağıtımcının vb. normalde bir kaynağı veya bir kaynağın fiyatını tedarik edeceği koşulla ilişkilendirir. @tr

is text for resource
status: Published
type: Property
sub property of: is complemented by
inverse of: has text resource
definition: Relates a resource to a resource that is complemented by a resource that is a textual resource.
label: is tekst voor resource @nl
label: هو نص لمصدر @ar
definition: يربط بين مصدر ومصدر الذي يكمله مصدر عبارة عن مصدر نصي. @ar
label: er tekstressource @da
definition: Relaterer en ressource til en ressource, der er suppleret med en ressource, der er en tekstressource. @da
label: tekstiaineisto @fi
definition: liittää aineiston aineistoon, jota on täydennetty tekstiaineistolla. @fi
label: ist Text für Ressource @de
definition: Setzt eine Ressource in Beziehung zu einer Ressource, die durch eine textliche Ressource vervollständigt wird. @de
lexical alias: textForResource.en
label: 是资源的文本 @zh-hans
definition: 将一种资源与被一种资源补充并是一种文字资源的一种资源关联起来。 @zh-hans
label: szöveg a következő forráshoz: @hu
definition: Hozzákapcsol egy forrást egy forráshoz, amelyet egy szöveges forrás egészít ki. @hu
has subproperty: is lyrics for
label: kaynak için metindir @tr
definition: Bir kaynağı, metinsel bir kaynak olan bir kaynak tarafından tamamlanan bir kaynakla ilişkilendirir. @tr

has text resource
status: Published
type: Property
sub property of: is complemented by
definition: Relates a resource to a resource that is a textual resource that complements a resource.
label: heeft tekst-resource @nl
label: له مصدر نصي @ar
definition: يربط بين مصدر ومصدر عبارة عن مصدر نصي يكمل مصدر. @ar
label: har tekstressource @da
definition: Relaterer en ressource til en ressource, der er en tekstressource, der supplerer en ressource. @da
label: tekstiaineisto @fi
definition: liittää aineiston aineistoon, joka on toista aineistoa täydentävä tekstiaineisto. @fi
label: ist Textressource @de
definition: Setzt eine Ressource in Beziehung zu einer textlichen Ressource, das eine Ressource ergänzt. @de
lexical alias: textResource.en
label: 有文本资源 @zh-hans
definition: 将一种资源与作为一种文字资源并补充一种资源的一种资源关联起来。 @zh-hans
label: szöveges forrása a következő: @hu
definition: Hozzákapcsol egy forrást egy szöveges forráshoz, amelyet egy forrás egészít ki. @hu
has subproperty: has lyrics
definition: Relaciona un recurs amb un recurs que és un recurs textual que complementa un recurs. @ca
label: metin kaynağı ile ilişkilidir @tr
definition: Bir kaynağı, bir kaynağı tamamlayan metinsel kaynak olan bir kaynakla ilişkilendirir. @tr

has thematic index number
status: Published
type: Property
lexical alias: thematicIndexNumber.en
definition: Relates a resource to a numeric designation of musical resource that is assigned from a list of resources of a composer, usually arranged in chronological order or by categories, with the theme given for each composition or for each section of large compositions.
sub property of: has numeric designation of musical resource
inverse of: is thematic index number of
label: heeft thematische index-nummer @nl
label: له رقم كشاف موضوعي @ar
definition: يربط بين مصدر وتسمية رقمية لمصدر موسيقي مخصص من قائمة مصادر لمؤلف موسيقى، وعادةً ما يتم ترتيبها بترتيب زمني أو حسب الفئات، مع تحديد الموضوع لكل تلحين أو لكل قسم من المقطوعات الكبيرة. @ar
label: har tematisk indeksnummer @da
definition: Relaterer en ressource til en numerisk betegnelse for en musikressource, som er tildelt fra en liste af ressourcer af en komponist, normalt arrangeret i kronologisk rækkefølge eller efter kategorier, med temaet angivet for enhver komposition eller for enhver del af store kompostioner. @da
label: aineiston temaattisen aineistoluettelon numero @fi
definition: Liittää aineiston musiikkiaineiston numeeriseen määritteeseen, joka on otettu säveltäjän aineistoluettelosta. aineistoluettelo on tavallisesti järjestetty aikajärjestykseen tai kategorioittain sisältäen teeman jokaisesta sävellyksestä tai laajan sävellyksen jokaisesta osasta. @fi
label: hat Werkverzeichnisnummer @de
definition: Setzt eine Ressource in Beziehung zu einer numerischen Bezeichnung einer Musikressource aus einem Ressourcenverzeichnis einer Komponistin/eines Komponisten, das in einer chronologischen Reihenfolge oder nach Kategorien angeordnet ist. Zusätzlich können darin Notenzitate in Form von Incipits oder thematischem Material für jede Komposition oder für jede Passage längerer Kompositionen aufgeführt sein. @de
label: 有主题索引号 @zh-hans
definition: 将一种资源与根据作曲者的资源列表分配、通常按年代顺序或类别顺序排列、并有每个谱曲或更大谱曲每个部分的主题的音乐资源的数字标识关联起来。 @zh-hans
label: tematikus indexszáma a következő: @hu
definition: Hozzákapcsol egy forrást egy zenei forrás számjelzéséhez, amelyet egy zeneszerző forrásainak a komponálás kronológiai sorrendje vagy kategóriák szerint rendezett jegyzékéből rendeltek hozzá, amely minden zeneművet vagy a nagyobb zeneművek egyes szakaszait témával látja el. @hu
label: tematik dizin numarası ile ilişkilidir @tr
definition: Bir kaynağı, bir bestecinin eserlerinden oluşan bir listeden belirlenen, genellikle kronolojik sıraya veya kategorilere göre düzenlenmiş, her bir beste veya büyük bestelerin her bir bölümü için temanın verildiği müzik eserinin sayısal bir belirteciyle ilişkilendirir. @tr

is thematic index number of
status: Published
type: Property
lexical alias: thematicIndexNumberOf.en
sub property of: is numeric designation of musical resource of
inverse of: has thematic index number
definition: Relates a nomen to a musical resource that has an identifier for resource that is a numeric designation assigned from a list of resources of a composer, usually arranged in chronological order or by categories, with the theme given for each composition or for each section of large compositions.
label: is thematisch indexnummer van @nl
label: هو رقم كشاف موضوعى لـ @ar
definition: يربط تسمية بمصدر موسيقي له معرف لمصدر عبارة عن تسمية رقمية مخصصة من قائمة مصادر المؤلف، وعادةً ما يتم ترتيبها بترتيب زمني أو حسب الفئات، مع تحديد الموضوع لكل تلحين أو لكل قسم من المقطوعات الكبيرة. @ar
label: er tematisk indeksnummer af @da
definition: Relaterer et nomen til en musikressource, som har en identifikator for ressource, der er en numerisk betegnelse tildelt fra en liste af ressourcer af en komponist, normalt arrangerede i kronologisk rækkefølge eller efter kategorier, med temaet angivet for enhever komposition eller for enhver del af en stor komposition. @da
label: temaattisen aineistoluettelon numero aineistolle @fi
definition: Liittää nomenin musiikkiaineistoon, jolla on säveltäjän aineistoluettelosta otettu numeerinen määrite. Aineistoluettelo on tavallisesti järjestetty aikajärjestykseen tai kategorioittain sisältäen teeman jokaisesta sävellyksestä tai laajan sävellyksen jokaisesta osasta. @fi
label: ist Werkverzeichnisnummer von @de
definition: Setzt ein Nomen in Beziehung zu einer Musikressource, die über einen Identifikator für eine Ressource in Form einer numerischen Bezeichnung aus einem Ressourcenverzeichnis einer Komponistin/eines Komponisten verfügt, das in einer chronologischen Reihenfolge oder nach Kategorien angeordnet ist. Zusätzlich können darin Notenzitate in Form von Incipits oder thematischem Material für jede Komposition oder für jede Passage längerer Kompositionen aufgeführt sein. @de
label: 是……的主题索引号 @zh-hans
definition: 将一个命名与有根据作曲者资源列表分配、通常按年代顺序或类别顺序排列、并有作为每个谱曲或更大谱曲每个部分的主题的资源之数字标识的一个资源标识的一种音乐资源关联起来。 @zh-hans
label: tematikus indexszáma a következőnek: @hu
definition: Hozzákapcsol egy noment egy zenei forráshoz, amely rendelkezik egy zeneszerző forrásainak a komponálás kronológiai sorrendjének vagy kategóriák szerint rendezett jegyzékéből hozzárendelt forrásazonosítóval, egy számjelzéssel, amely minden zeneművet vagy a nagyobb zeneművek egyes szakaszait témával látja el. @hu
label: konu ile ilgili dizin numarasıdır @tr
definition: Bir ismi, bir bestecinin genellikle kronolojik sıraya veya kategorilere göre düzenlenmiş, her bir beste veya büyük bestelerin her bir bölümü için tema verilen bir kaynak listesinden atanan sayısal bir tanımlayıcı olan kaynak olan bir müzikal kaynakla ilişkilendirir. @tr

has title
status: Published
definition: Relates an entity to a nomen that is an appellation in natural language and phrasing used in common discourse.
type: Property
lexical alias: title.en
label: har titel @da
definition: Relaterer en ressource til et ord, tegn, eller gruppe af ord og/eller tegn, som en ressource, eller en ressource som er indeholdt i denne, er kendt under.. @da
sub property of: has appellation of entity
label: heeft titel @nl
label: nimeke @fi
label: له عنوان @ar
definition: يربط بين كيان وإسم فىي لغة طبيعية وفي العبارات المستخدمة في الخطاب العام. @ar
definition: Liittää entiteetin luonnollisen kielen ja sanamuodon mukaiseen, yleisessä diskurssissa käytettyyn nimitykseen. @fi
label: hat Titel @de
definition: Setzt eine Entität in Beziehung zu einer Bezeichnung in natürlicher Sprache und Ausdrucksweise, die beim normalen Sprechen und Schreiben verwendet wird. @de
label: 有题名 @zh-hans
definition: 将一个实体与作为用自然语言和普通话语措词表达的一个命名关联起来。 @zh-hans
definition: Relaciona una entitat amb un nomen que és una apel·lació en llenguatge i frases naturals usada en el discurs comú. @ca
label: címe a következő: @hu
definition: Hozzákapcsol egy entitást egy természetes nyelvi megnevezéshez és a közbeszéd során használt megfogalmazáshoz. @hu
has subproperty: has abbreviated title
has subproperty: has earlier title proper (Deprecated)
has subproperty: has later title proper (Deprecated)
has subproperty: has other title information
has subproperty: has parallel other title information
has subproperty: has parallel title proper
has subproperty: has title of resource
has subproperty: has title proper
label: başlık ile ilişkilidir @tr
definition: Bir varlığı, ortak söylemde kullanılan ifade ve doğal dildeki bir unvanla ilişkilendirir. @tr

has title of resource
status: Published
definition: Relates a resource to a nomen that is an appellation of resource in natural language and phrasing used in common discourse.
type: Property
lexical alias: titleOfResource.en
label: har ressourcetitel @da
definition: Relaterer en ressource til en ressourcebenævnelse på naturligt sprog og med naturlige formuleringer, brugt i fælles diskurs. @da
sub property of: has title
label: heeft titel van resource @nl
label: له عنوان لمصدر @ar
definition: يربط مكان بتسمية مصدر فىي اللغة الطبيعية وفي العبارات المستخدمة في الخطاب العام. @ar
label: aineiston nimeke @fi
definition: Liittää aineiston luonnollisen kielen ja sanamuodon mukaiseen, yleisessä diskurssissa käytettyyn aineiston nimitykseen. @fi
label: hat Titel einer Ressource @de
definition: Setzt eine Ressource in Beziehung zu einer Bezeichnung für eine Ressource in natürlicher Sprache und Ausdrucksweise, die beim normalen Sprechen und Schreiben verwendet wird. @de
label: 有资源的题名 @zh-hans
definition: 将一种资源与作为用自然语言和普通话语措词表达的资源的称谓的一个命名关联起来。 @zh-hans
definition: Relaciona un recurs amb un nomen que és una apel·lació de recurs en llenguatge i frases naturals usada en el discurs comú. @ca
label: forrás címe a következő: @hu
definition: Hozzákapcsol egy forrást egy forrás természetes nyelvi megnevezéséhez és a közbeszéd során használt megfogalmazásához. @hu
has subproperty: has preferred title of resource
has subproperty: has title of series
has subproperty: has variant title of resource
label: kaynak başlığı ile ilişkilidir @tr
definition: Bir kaynağı, doğal dilde ve ortak söylemde kullanılan ifadelerdeki bir kaynak unvanıyla ilişkilendirir. @tr

is title of resource of
status: Published
sub property of: is appellation of entity of
type: Property
lexical alias: titleOfResourceOf.en
definition: Relates a nomen to a resource that has an appellation of resource in natural language and phrasing used in common discourse.
inverse of: has title of resource
label: is titel van resource van @nl
label: هو عنوان لمصدر لـ @ar
definition: يربط تسمية بمصدر له تسمية مصدر في لغة طبيعية وفي العبارات المستخدمة في الخطاب العام. @ar
label: er titel af ressource af @da
definition: Relaterer et nomen til en ressource der har en ressourcebenævnelse på naturligt sprog og med naturlig formulering, anvendt i almindelig samtale. @da
label: aineiston nimeke @fi
definition: Liittää nomenin aineistoon, jolla on yleisessä diskurssissa käytetty nimitys luonnollisella kielellä ja sanamuodolla. @fi
label: ist Titel einer Reihe von @de
definition: Setzt ein Nomen in Beziehung zu einer Ressource, die über eine Bezeichnung für eine Ressource in natürlicher Sprache und Ausdrucksweise verfügt, die beim normalen Sprechen und Schreiben verwendet wird. @de
label: 是……的资源的题名 @zh-hans
definition: 将一个命名与有用自然语言和普通话语措词表达的资源的称谓的一种资源关联起来。 @zh-hans
label: címe a következő forrásnak: @hu
definition: Hozzákapcsol egy noment egy forráshoz, amely rendelkezik egy a forráshoz tartozó természetes nyelvű megnevezéssel és a közbeszédben használt megfogalmazással. @hu
has subproperty: is preferred title of resource of
has subproperty: is title of series of
has subproperty: is variant title of resource of
label: kaynağının başlığıdır @tr
definition: Bir ismi, ortak söylemde kullanılan ifade ve günlük dilde kaynak olarak nitelendirilen bir kaynakla ilişkilendirir. @tr

has title of series
status: Published
definition: Relates a resource to a name of a series appearing on a resource of a part of a series.
type: Property
lexical alias: titleOfSeries.en
label: har hovedtitel for serie @da
definition: Relaterer en ressource til et navn på en ressource, der optræder på en ressource af en del af en serie. @da
sub property of: has title of resource
inverse of: is title of series of
label: heeft titel van reeks @nl
label: له عنوان لسلسلة @ar
definition: يربط بين مصدر واسم سلسلة تظهر على مصدر لجزء من سلسلة. @ar
label: sarjan nimeke aineistolle @fi
definition: Liittää aineiston sarjan nimeen, joka esiintyy aineistossa, joka on sarjan osa. @fi
label: hat Titel einer Reihe @de
definition: Setzt eine Ressource in Beziehung zu einem Namen einer Reihe, der auf einer Ressource als Teil einer Reihe erscheint. @de
label: 有丛编题名 @zh-hans
definition: 将一种资源与出现在丛编一部分的一种资源上的一个丛编的名称关联起来。 @zh-hans
label: sorozatcíme a következő: @hu
definition: Hozzákapcsol egy forrást egy sorozat megnevezéséhez, amely a sorozat részét képező forráson van feltüntetve. @hu
has subproperty: has title proper of subseries (Deprecated)
label: seri başlığı ile ilişkilidir @tr
definition: Bir kaynağı, bir dizinin bir bölümünün kaynağında görünen bir bölüm adıyla ilişkilendirir. @tr

is title of series of
status: Published
type: Property
lexical alias: titleOfSeriesOf.en
sub property of: is title of resource of
inverse of: has title of series
definition: Relates a nomen to a resource that has a title that identifies a series to which a resource belongs.
label: is reekstitel van @nl
label: هو عنوان لسلسلة لـ @ar
definition: يربط تسمية بمصدر له عنوان يحدد سلسلة تنتمي إليها مصدر. @ar
label: er serietitel af @da
definition: Relaterer et navn til en ressource, som har en titel, der identificerer en serie som en ressource tilhører. @da
label: sarjan nimeke aineistolle @fi
definition: Liittää nomenin aineistoon, jolla on nimeke, joka ilmaisee, mihin sarjaan aineisto kuuluu. @fi
label: ist Titel einer Reihe von @de
definition: Setzt ein Nomen in Beziehung zu einer Ressource, die über einen Titel verfügt, der die Reihe identifiziert, zu der eine Ressource gehört. @de
label: 是……的丛编的题名 @zh-hans
definition: 将一个命名与有识别一种资源所属于的一种丛编的题名的一资源关联起来。 @zh-hans
label: sorozati címe a következőnek: @hu
definition: Hozzákapcsol egy noment egy forráshoz, amelynek van egy olyan címe, amely azonosítja azt a sorozatot, amelyhez a forrás tartozik. @hu
has subproperty: is title proper of subseries of (Deprecated)
has subproperty: is parallel title of series of
label: serisinin başlığıdır @tr
definition: Bir ismi, kaynağın ait olduğu bir diziyi tanımlayan bir başlığa sahip kaynakla ilişkilendirir. @tr

has title proper
status: Published
definition: Relates a resource to a chief name of a resource, that is, a title normally used when naming a resource.
type: Property
sub property of: has title
lexical alias: titleProper.en
scope note: An alternative title is treated as part of the title proper.
label: har hovedtitel @da
definition: Relaterer en ressource til et hovednavn på en ressource, dvs. en titel, der normalt anvendes, når en ressource navngives. @da
scope note: En alternativ titel behandles som del af en hovedtitel. @da
inverse of: is title proper of
label: heeft hoofdtitel @nl
label: له العنوان نفسه @ar
definition: يربط بين مصدر ومصدر له اسم بارز (اسم رئيسي)، وهذا يعني استخدام عنوان يستخدم عادةً عند تسمية مصدر. @ar
scope note: يتم التعامل مع العنوان البديل كجزء من العنوان نفسه. @ar
label: aineiston päänimeke @fi
definition: Liittää aineiston aineiston ensisijaiseen nimekkeeseen eli aineiston nimeämisessä normaalisti käytettyyn nimekkeeseen. @fi
scope note: Vaihtoehtoista nimekettä pidetään päänimekkeen osana. @fi
label: hat Haupttitel @de
definition: Setzt eine Ressource in Beziehung zu einem Hauptnamen einer Ressource, das heißt einem Titel, der normalerweise bei der Benennung einer Ressource verwendet wird. @de
scope note: Ein Alternativtitel wird als Teil eines Haupttitels behandelt. @de
label: 有正题名 @zh-hans
definition: 将一种资源与一种资源的一个主要名称（亦即命名一种资源所通常使用的一个题名）关联起来。 @zh-hans
scope note: 交替题名被处理为正题名的部分。 @zh-hans
label: főcíme a következő: @hu
definition: Hozzákapcsol egy forrást egy forrás fő megnevezéséhez, azaz a forrás általánosan használt címéhez. @hu
scope note: Az alternatív címet a főcím részeként kezelik. @hu
label: başlık ile ilişkilidir @tr
definition: Bir kaynağı, bir kaynağın ana adıyla, yani normalde bir kaynağı adlandırırken kullanılan başlıkla ilişkilendirir. @tr
scope note: Alternatif bir başlık, asıl başlığın bir parçası olarak ele alınır. @tr

is title proper of
status: Published
type: Property
lexical alias: titleProperOf.en
inverse of: has title proper
definition: Relates a nomen to a resource that has a chief name of a resource, that is, a title normally used when naming a resource.
scope note: An alternative title is treated as part of the title proper.
label: is hoofdtitel van @nl
label: هو عنوان مناسب لـ @ar
definition: تسمية ومصدر له اسم بارز (اسم رئيسي)، وهذا يعني استخدام عنوان يستخدم عادةً عند تسمية مصدر. @ar
scope note: يتم التعامل مع العنوان البديل كجزء من العنوان نفسه. @ar
label: er hovedtitel af @da
definition: Relaterer et nomen til en ressource, som har et hovednavn på en ressource, dvs. en titel som man normalt bruger når man navngiver en ressource. @da
scope note: En alternativ titel behandles som en del af hovedtitlen. @da
label: päänimeke aineistolle @fi
definition: Liittää nomenin aineistoon, jolla on ensisijainen aineiston nimi eli aineiston nimeämisessä normaalisti käytetty nimeke. @fi
scope note: Vaihtoehtoista nimekettä pidetään päänimekkeen osana. @fi
label: ist Haupttitel von @de
definition: Setzt ein Nomen in Beziehung zu einer Ressource, die über einen Hauptnamen, das heißt einem Titel, der normalerweise bei der Benennung einer Ressource verwendet wird, verfügt. @de
scope note: Ein Alternativtitel wird als Teil eines Haupttitels behandelt. @de
label: 是……的正题名 @zh-hans
definition: 将一个命名与有一个主要名称（亦即命名一种资源所通常使用的一个题名）的一种资源关联起来。 @zh-hans
scope note: 交替题名被处理为正题名的部分。 @zh-hans
label: főcíme a következőnek: @hu
definition: Hozzákapcsol egy noment egy forrás fő megnevezéséhez, azaz a forrás általánosan használt címéhez. @hu
scope note: Az alternatív címet a főcím részeként kezelik. @hu
label: uygun başlık @tr
definition: Bir ismi, bir kaynağın asıl ismi olan, yani normalde bir kaynağı isimlendirirken kullanılan bir başlığa sahip kaynakla ilişkilendirir. @tr
scope note: Alternatif bir başlık, asıl başlığın bir parçası olarak ele alınır. @tr

has title proper of subseries (Deprecated)
status: Deprecated
definition: Relates a resource to a name of a series appearing on a resource of a part of a subseries. (Deprecated)
type: Property
lexical alias: titleProperOfSubseries.en
label: har hovedtitel for underserie @da
definition: Relaterer en ressource til et navn på en ressource, der optræder på en ressource af en del af en underserie. @da
sub property of: has title of series
inverse of: is title proper of subseries of (Deprecated)

is title proper of subseries of (Deprecated)
status: Deprecated
type: Property
lexical alias: titleProperOfSubseriesOf.en
sub property of: is title of series of
inverse of: has title proper of subseries (Deprecated)

has track configuration
status: Published
definition: Relates a resource to a configuration of an audio track on a sound-track film.
type: Property
sub property of: has sound characteristic
lexical alias: trackConfiguration.en
label: har sporkonfiguration @da
definition: Relaterer en ressource til en konfiguration af lydsporet til en film med lydspor. @da
label: heeft trackconfiguratie @nl
label: له بنية مسار @ar
definition: يربط بين مصدر وضبط مسار صوتي على مسار صوت فيلم. @ar
label: aineiston ääniraidan sijainti @fi
definition: Liittää aineiston ääniraidan asemointiin äänifilmissä. @fi
label: hat Tonspurlage @de
definition: Setzt eine Ressource in Beziehung zu einer Positionierung der Tonspur auf einem Film mit Tonspur. @de
label: 有音轨配置 @zh-hans
definition: 将一种资源与原声电影片上的音轨配置关联起来。 @zh-hans
label: sávkonfigurációja a következő: @hu
definition: Hozzákapcsol egy forrást egy hangsávos filmen a hangsáv konfigurációjának részleteihez. @hu
label: parça yapılandırması ile ilişkilidir @tr
definition: Bir kaynağı, bir ses bandındaki bir ses parçasının yapılandırmasıyla ilişkilendirir. @tr

has transcriber
status: Published
definition: Relates a resource to an agent who contributes to a resource by writing down or notating unwritten or unnotated content, or by changing it from one system of notation to another.
type: Property
sub property of: has contributor (Deprecated)
inverse of: is transcriber of
lexical alias: transcriber.en
scope note: Transcription of a musical resource for a different instrument or performing group is excluded.
see also: has arranger of music
label: har nedskriver @da
definition: Relaterer en ressource til en agent, der har bidraget til en ressource af et værk ved at nedskrive eller notere uskrevet eller ikke-noteret indhold, eller ved at ændre det fra et notationssystem til et andet. @da
scope note: Afskrift af en musikressource for et andet instrument, eller optrædende gruppe, er ikke omfattet. @da
label: heeft transcribeerder @nl
label: aineiston transkriboija @fi
label: له ناسخ @ar
definition: يربط مصدر بوكيل يُساهم في مصدر بواسطة كتابة أو تدوين محتوى لم تسبق كتابته أو تدوينه، أو عن طريق تغييره من نظام تدوين إلى آخر. @ar
scope note: يُستبعد اِستِنساخ مصدر موسيقي لآلة أو مجموعة أداء مختلفة. @ar
scope note: Tähän ei kuulu musiikkiteoksen transkribointi eri soittimelle tai esitysryhmälle. @fi
label: hat Transkribiererin/Transkribierer @de
definition: Setzt eine Ressource in Beziehung zu einem Akteur, der zu einer Ressource beiträgt, indem er ungeschriebenen und nicht notierten Inhalt niederschreibt oder ihn von einem Notationssystem in ein anderes überträgt. @de
scope note: Darunter fällt keine Transkription einer Musikressource für ein anderes Instrument oder ein anderes aufführendes Ensemble. @de
definition: Liittää aineiston toimijaan, joka osallistuu aineiston tekemiseen kirjoittamalla muistiin tai nuotintamalla kirjoittattoman tai nuotintamattoman sisällön tai muuttamalla sen merkintäjärjestelmästä toiseen. @fi
label: 有转写者 @zh-hans
definition: 将一种资源与通过写下或记谱之前未写下或未记谱的内容或者将其从一种记谱体系改成另一种记谱体系而对一种资源有贡献的一个行为者关联起来。 @zh-hans
scope note: 不包括为不同乐器或表演组合所作的音乐资源的改写。 @zh-hans
label: átírója a következő: @hu
definition: Hozzákapcsol egy forrást egy ágenshez, amely korábban le nem írt vagy le nem jegyzett tartalom leírásával vagy lejegyzésével, vagy egyik jelölési rendszerről a másikra történő átvitelével járul hozzá egy forráshoz. @hu
scope note: Egy zenei forrás átirata egy másik hangszerre vagy előadói csoportra nem tartozik ide. @hu
label: yazıya aktaran ile ilişkilidir @tr
definition: Bir kaynağı, yazılı olmayan veya not edilmemiş içeriği yazarak veya not ederek ya da bir notasyon sisteminden diğerine değiştirerek bir kaynağa katkıda bulunan bir temsilci ile ilişkilendirir. @tr
scope note: Bir müzik kaynağının farklı bir enstrüman veya performans grubu için transkripsiyonu hariçtir. @tr

is transcriber of
status: Published
definition: Relates an agent to a resource that includes a contribution by an agent of writing down or notating previously unwritten or unnotated content, or by changing it from one system of notation to another.
type: Property
sub property of: is contributor of (Deprecated)
inverse of: has transcriber
lexical alias: transcriberOf.en
scope note: Transcription of a musical resource for a different instrument or performing group is excluded.
see also: is arranger of music of
label: er afskriver af @da
definition: Relaterer en agent, der har bidraget til en ressource ved at nedskrive eller notere uskrevet eller ikke-noteret indhold, eller ved at ændre det fra et notationssystem til et andet til en ressource. @da
scope note: Afskrift af en musikressource for et andet instrument eller optrædende gruppe er ikke omfattet. @da
label: is transcribeerder van @nl
label: هو ناسخ لـ @ar
definition: يربط بين وكيل ومصدر يتضمن إسهام وكيل في كتابة أو تدوين محتوى لم يسبق كتابته أو تدوينه، أو عن طريق تغييره من نظام تدوين إلى آخر. @ar
scope note: يُستبعد نسخ مصدر موسيقي لآلة أو مجموعة أداء مختلفة. @ar
label: transkriboija (toimija) aineistossa @fi
definition: Liittää toimijan aineistoon, jossa toimija on osallisena kirjoittamalla muistiin tai nuotintamalla aiemmin kirjoittamattoman tai nuotintamattoman sisällön tai muuttamalla sen nuotinnusjärjestelmästä toiseen. @fi
scope note: Tähän ei kuulu musiikkiteoksen transkribointi eri soittimelle tai esitysryhmälle. @fi
label: ist Transkribiererin/Transkribierer von @de
definition: Setzt einen Akteur in Beziehung zu einer Ressource, zu der ein Akteur beiträgt, indem er ungeschriebenen und nicht notierten Inhalt niederschreibt oder ihn von einem Notationssystem in ein anderes überträgt. @de
scope note: Darunter fällt keine Transkription einer Musikressource für ein anderes Instrument oder ein anderes aufführendes Ensemble. @de
label: 是……的转写者 @zh-hans
definition: 将一个行为者与包括写下或记谱之前未写下或未记谱的内容或者将其从一种记谱体系改成另一种记谱体系的一个行为者的贡献的资源关联起来。 @zh-hans
scope note: 不包括为不同乐器或表演组合所作的音乐资源的改写。 @zh-hans
label: átírója a következő: @hu
definition: Hozzákapcsol egy ágenst egy forráshoz, amely magában foglalja az ágens közreműködését korábban le nem írt vagy le nem jegyzett tartalom leírásában vagy lejegyzésében, vagy egyik jelölési rendszerről a másikra történő átvitelében. @hu
scope note: Egy zenei forrás átirata egy másik hangszerre vagy előadói csoportra nem tartozik ide. @hu
label: kopyalayıcı @tr
definition: Bir temsilciyi, daha önce yazılmamış veya belirtilmemiş içeriği yazan veya not eden veya bir gösterim sisteminden diğerine değiştiren temsilcinin katkısını içeren bir kaynakla ilişkilendirir. @tr
scope note: Bir müzik kaynağının farklı bir enstrüman veya performans grubu için transkripsiyonu hariçtir. @tr

has transformation
status: Published
lexical alias: transformation.en
definition: Relates a resource to a resource that is created by changing the scope or editorial policy, the genre or literary form, the target audience, or the style of a resource.
type: Property
sub property of: heeft gerelateerde resource van resource
label: heeft transformatie @nl
label: له تحول @ar
definition: يربط بين مصدر ومصدر تم إنشاؤه عن طريق تغيير المجال أو السياسة التحريرية، النوع أو الشكل الأدبي، الجمهور المستهدف، أو أسلوب مصدر. @ar
label: har omdannelse @da
definition: Relaterer en ressource til en ressurce, som er skabt ved at ændre formål eller udgivelsespolicy, emne eller literær form, målpublikum, eller stil af ressource. @da
label: aineiston muutos @fi
definition: Liittää aineiston aineistoon, joka on luotu muuttamalla aineiston laajuutta tai toimituksellista käytäntöä, genreä tai kirjallista muotoa, kohdeyleisöä tai tyyliä. @fi
label: hat Transformation @de
definition: Setzt eine Ressource in Beziehung zu einer Ressource, die durch eine Änderung des Geltungsbereichs, der redaktionelle Vorgehensweise, des Genres oder der literarischen Form, der Zielgruppe oder des Stils einer Ressource erstellt wird. @de
label: 有转换 @zh-hans
definition: 将一种资源与通过改变一种资源的范围或编辑政策、体裁或文学形式、目标受众或风格而被创建的一种资源关联起来。 @zh-hans
label: átalakítása a következő: @hu
definition: Hozzákapcsol egy forrást egy forráshoz, amely egy forrás alkalmazási területének vagy szerkesztési elveinek, a műfajának vagy műnemének, a célközönségének vagy a stílusának megváltoztatásával jött létre. @hu
has subproperty: has transformation by audience
has subproperty: has transformation by genre
has subproperty: has transformation by policy
has subproperty: has transformation by style
label: dönüşüm ile ilişkilidir @tr
definition: Bir kaynağı, bir kaynağın kapsamını veya yayın politikasını, türünü veya edebi biçimini, hedef kitlesini veya biçimini değiştirerek oluşturulan bir kaynakla ilişkilendirir. @tr

has transformation by audience
status: Published
lexical alias: transformationByAudience.en
definition: Relates a resource to a resource that is created by changing the audience of a resource.
type: Property
sub property of: has transformation
label: heeft transformatie door doelgroep @nl
label: له تحول وفق الجمهور @ar
definition: يربط بين مصدر ومصدر تم إنشاؤه عن طريق تغيير جمهور لمصدر. @ar
label: har omdannelse ved publikum @da
definition: Relaterer en ressourcce til en ressource, der er skabt ved at ændre publikum for en ressource. @da
label: aineiston kohdeyleisön muutos @fi
definition: Liittää aineiston aineistoon, joka on luotu muuttamalla aineiston kohderyhmää. @fi
label: hat Transformation hinsichtlich der Zielgruppe @de
definition: Setzt eine Ressource in Beziehung zu einer Ressource, die aufgrund einer Änderung der Zielgruppe einer Ressource erstellt wird. @de
label: 有按受众的转换 @zh-hans
definition: 将一种资源与通过改变一种资源的受众而被创建的一种资源关联起来。 @zh-hans
label: közönség miatti átalakítása a következő: @hu
definition: Hozzákapcsol egy forrást egy forráshoz, amely egy forrás közönségének megváltozása következtében jött létre. @hu
has subproperty: has carrier version
has subproperty: has language version
has subproperty: has regional version
label: hedef kitleye göre dönüşüm ile ilişkilidir @tr
definition: Bir kaynağı, bir kaynağın kitlesini değiştirerek oluşturulan bir kaynakla ilişkilendirir. @tr

is transformation by audience of
status: Published
lexical alias: transformationByAudienceOf.en
definition: Relates a resource to a resource that has an audience that is changed to create a resource.
type: Property
sub property of: is transformation of
inverse of: has transformation by audience
label: is transformatie door doelgroep van @nl
label: هو تحول وفق الجمهور لـ @ar
definition: يربط بين مصدر ومصدر له جمهور تم تغييره لإنشاء مصدر. @ar
label: er omdannelse ved publikum af @da
definition: Relaterer en ressource til en ressource, der har et putlikum, som ændres for at skabe en ressource. @da
label: aineiston muuttunut kohdeyleisö @fi
definition: Liittää aineiston aineistoon, jolla on uuden aineiston luomiseksi muutettu kohderyhmä. @fi
label: ist Transformation hinsichtlich der Zielgruppe von @de
definition: Setzt eine Ressource in Beziehung zu einer Ressource, deren Zielgruppe geändert wird, um eine Ressource zu erstellen. @de
label: 是……的按受众的转换 @zh-hans
definition: 将一种资源与有受众并被改变以创建一种资源的一种资源关联起来。 @zh-hans
label: a közönség miatti átalakítása a következőnek: @hu
definition: Hozzákapcsol egy forrást egy forráshoz, amelynek a közönsége megváltozott egy forrás létrejövetele érdekében. @hu
has subproperty: is carrier version of
has subproperty: is language version of
has subproperty: is regional version of
label: izleyicisinin değişimidir @tr
definition: Bir kaynağı, bir kaynak oluşturmak için değiştirilen bir kitleye sahip bir kaynakla ilişkilendirir. @tr

has transformation by extension plan
status: Published
lexical alias: transformationByExtensionPlan.en
definition: Relates a resource to a resource that is created by changing the extension plan of a resource.
type: Property
sub property of: has transformation by policy
label: heeft transformatie door extensieplan @nl
label: له تحول وفق خطة توسع @ar
definition: يربط بين مصدر ومصدر تم إنشاؤه عن طريق تغيير خطة توسع لمصدر. @ar
label: har omdannelse ved udvidelsesplan @da
definition: Relaterer en ressource til en ressource der er skabt ved at ændre udvidelsesplanen for en ressource. @da
label: laajennussuunnitelmalla muutettu aineisto @fi
definition: Liittää aineiston aineistoon, joka on luotu muuttamalla aineiston laajennussuunnitelmaa. @fi
label: hat Transformation hinsichtlich des Erweiterungsplans @de
definition: Setzt eine Ressource in Beziehung zu einer Ressource, die aufgrund einer Änderung des Erweiterungsplans einer Ressource erstellt wird. @de
label: 有通过扩充计划的转换 @zh-hans
definition: 将一种资源与通过改变一种资源的扩充计划而创建的一种资源关联起来。 @zh-hans
label: közlési terv változása miatti átalakítása a következő: @hu
definition: Hozzákapcsol egy forrást egy forráshoz, amely egy forrás közlési tervének megváltozása következtében jött létre. @hu
has subproperty: has sequential version
has subproperty: has serialized version
has subproperty: has static version
label: genişletme planına göre dönüşüm ile ilişkilidir @tr
definition: Bir kaynağı, kaynağın genişletme planını değiştirerek oluşturulan bir kaynakla ilişkilendirir. @tr

is transformation by extension plan of
status: Published
lexical alias: transformationByExtensionPlanOf.en
definition: Relates a resource to a resource that has an extension plan that is changed to create a resource.
type: Property
sub property of: is transformation by policy of
inverse of: has transformation by extension plan
label: is transformatie door extensieplan van @nl
label: هو تحول وفق خطة توسع @ar
definition: يربط بين مصدر ومصدر يحتوي على خطة توسع تم تغييرها لإنشاء مصدر. @ar
label: er omdannelse ved udvidelsesplan for @da
definition: Relaterer en ressource til en ressource, der har en udvidelsesplan, som ændres for at skabe en ressourece. @da
label: laajennussuunnitelman muutos aineistossa @fi
definition: Liittää aineiston aineistoon, jolla on aineiston luomista varten muutettu laajennussuunnitelma. @fi
label: ist Transformation hinsichtlich des Erweiterungsplans von @de
definition: Setzt eine Ressource in Beziehung zu einer Ressource, deren Erweiterungsplan geändert wird, um eine Ressource zu erstellen. @de
label: 是通过……的扩充计划的转换 @zh-hans
definition: 将一种资源与有一种扩充计划并被改变以创建一种资源的一种资源关联起来。 @zh-hans
label: a közlési terv változása miatti átalakítása a következőnek: @hu
definition: Hozzákapcsol egy forrást egy forráshoz, amelynek a közlési terve megváltozott egy forrás létrejövetele érdekében. @hu
has subproperty: is sequential version of
has subproperty: is serialized version of
has subproperty: is static version of
label: genişletme planının değişimidir @tr
definition: Bir kaynağı, bir kaynak oluşturmak için değiştirilen bir genişletme planına sahip bir kaynakla ilişkilendirir. @tr

has transformation by genre
status: Published
lexical alias: transformationByGenre.en
definition: Relates a resource to a resource that is created by changing the genre or literary form of a resource.
type: Property
sub property of: has transformation
label: heeft transformatie door genre @nl
label: له تحول وفق النَوع @ar
definition: يربط بين مصدر ومصدر تم إنشاؤه عن طريق تغيير النوع أو الشكل الأدبي لمصدر. @ar
label: har omdannelse ved genre @da
definition: Relaterer en ressource til en ressource, som er skabt ved at ændre en ressources genre eller litterære form. @da
label: muutettu aineiston genre @fi
definition: Liittää aineiston aineistoon, joka on luotu muuttamalla aineiston tyyliä. @fi
label: hat Transformation hinsichtlich des Genres @de
label: 有按体裁的转换 @zh-hans
definition: 将一种资源与通过改变一种资源的体裁或文学形式而被创建的一种资源关联起来。 @zh-hans
label: műfaj szerinti átalakítása a következő: @hu
definition: Hozzákapcsol egy forrást egy forráshoz, amely egy forrás műfajának vagy műnemének a megváltoztatásával jött létre. @hu
label: türe göre dönüşüm ile ilişkilidir @tr
definition: Bir kaynağı, türü veya edebi biçimi değiştirilerek oluşturulan bir kaynakla ilişkilendirir. @tr

is transformation by genre of
status: Published
lexical alias: transformationByGenreOf.en
definition: Relates a resource to a resource that has a genre that is changed to create a resource.
type: Property
sub property of: is transformation of
inverse of: has transformation by genre
label: is transformatie door genre van @nl
label: هو تحول وفق النَوع لـ @ar
definition: يربط بين مصدر ومصدر له نَوع تم تغييره لإنشاء مصدر. @ar
label: er omdannelse ved genre af @da
definition: Relaterer en ressource til en ressource, som har en genre, der er ændret for at skabe en ressource. @da
label: genren muutos aineistolle @fi
definition: Liittää aineiston aineistoon, jonka genreä on muutettu uuden aineiston luomiseksi. @fi
label: ist Transformation hinsichtlich des Genres von @de
definition: Setzt eine Ressource in Beziehung zu einer Ressource, deren Genre geändert wird, um eine Ressource zu schaffen. @de
label: 是……的按体裁的转换 @zh-hans
definition: 将一种资源与有体裁并被改变以创建一种资源的一种资源关联起来。 @zh-hans
label: műfaj szerinti átalakítása a következőnek: @hu
definition: Hozzákapcsol egy forrást egy forráshoz, amelynek a műfaja megváltozott egy forrás létrejövetele érdekében. @hu
label: türüne göre değişimidir @tr
definition: Bir kaynağı, bir kaynak oluşturmak için değiştirilen bir türe sahip bir kaynakla ilişkilendirir. @tr

has transformation by policy
status: Published
lexical alias: transformationByPolicy.en
definition: Relates a resource to a resource that is created by changing the scope or editorial policy of a resource.
type: Property
sub property of: has transformation
label: heeft transformatie door beleid @nl
label: له تحول وفق سياسة @ar
definition: يربط بين مصدر ومصدر تم إنشاؤه عن طريق تغيير المجال أو السياسة التحريرية لمصدر. @ar
label: har omdannelse ved policy @da
definition: Relaterer en ressource til en ressource, som er skabt ved at ændre formålet eller udgivelsespolicyn for en ressourece. @da
label: toimituksellisella käytännöllä muutettu aineisto @fi
definition: Liittää aineiston aineistoon, joka on luotu muuttamalla aineiston alaa tai toimituksellista käytäntöä. @fi
label: hat Transformation hinsichtlich der Vorgehensweise @de
definition: Setzt eine Ressource in Beziehung zu einer Ressource, die aufgrund einer Änderung des Geltungsbereichs oder der redaktionellen Vorgehensweise einer Ressource erstellt wird. @de
label: 有按政策的转换 @zh-hans
definition: 将一种资源与通过改变一种资源的范围或编辑政策而被创建的一种资源关联起来。 @zh-hans
label: szerkesztési elvek szerinti átalakítása a következő: @hu
definition: Hozzákapcsol egy forrást egy forráshoz, amely egy forrás alkalmazási területének vagy szerkesztési elveinek a megváltoztatásával jött létre. @hu
has subproperty: has transformation by extension plan
label: ilkeye göre dönüşüm ile ilişkilidir @tr
definition: Bir kaynağı, kapsamı veya içerik politikası değiştirilerek oluşturulan bir kaynakla ilişkilendirir. @tr

is transformation by policy of
status: Published
lexical alias: transformationByPolicyOf.en
definition: Relates a resource to a resource that has a policy that is changed to create a resource.
type: Property
sub property of: is transformation of
inverse of: has transformation by policy
label: is transformatie door beleid van @nl
label: هو تحول وفق سياسة لـ @ar
definition: يربط بين مصدر ومصدر له سياسة تم تغييرها لإنشاء مصدر. @ar
label: er omdannelse ved policy af @da
definition: Relaterer en ressource til en ressource, som har en policy der er ændret for at skabe en ressource. @da
label: toimituksellisella käytännöllä muutettu aineisto @fi
definition: Liittää aineiston aineistoon, jolla on aineiston luomiseksi muutettu toimituksellinen käytäntö. @fi
label: ist Transformation hinsichtlich der Vorgehensweise von @de
definition: Setzt eine Ressource in Beziehung zu einer Ressource, deren Verfahrensweise geändert wird, um eine Ressource zu schaffen. @de
label: 是……的按政策的转换 @zh-hans
definition: 将一种资源与有政策并被改变以创建一种资源的一种资源关联起来。 @zh-hans
label: szerkesztési elvek szerinti átalakítása a következőnek: @hu
definition: Hozzákapcsol egy forrást egy forráshoz, amelynek a szerkesztési elvei megváltoztak egy forrás létrejövetele érdekében. @hu
has subproperty: is transformation by extension plan of
label: ilkesel değişimdir @tr
definition: Bir kaynağı, bir kaynak oluşturmak için değiştirilen bir politikaya sahip bir kaynakla ilişkilendirir. @tr

has transformation by style
status: Published
lexical alias: transformationByStyle.en
definition: Relates a resource to a resource that is created by changing the style of a resource.
type: Property
sub property of: has transformation
label: heeft transformatie door stijl @nl
label: له تحول وفق أسلوب @ar
definition: يربط بين مصدر ومصدر تم إنشاؤه عن طريق تغيير أسلوب مصدر. @ar
label: har omdannelse ved stil @da
definition: Relaterer en ressource til en ressource, som er skabt ved at ændre en ressources stil. @da
label: muutettu aineiston tyyli @fi
definition: Liittää aineiston aineistoon, joka on luotu muuttamalla aineiston tyyliä. @fi
label: hat Transformation hinsichtlich des Stils @de
definition: Setzt eine Ressource in Beziehung zu einer Ressource, die aufgrund einer Änderung des Stils einer Ressource erstellt wird. @de
label: 有按风格的转换 @zh-hans
definition: 将一种资源与通过改变一种资源的风格而被创建的一种资源关联起来。 @zh-hans
label: stílus szerinti átalakítása a következő: @hu
definition: Hozzákapcsol egy forrást egy forráshoz, amely egy forrás stílusának megváltozása következtében jött létre. @hu
label: biçime göre dönüşüm ile ilişkilidir @tr
definition: Bir kaynağı, bir kaynağın biçimi değiştirilerek oluşturulan bir kaynakla ilişkilendirir. @tr

is transformation by style of
status: Published
lexical alias: transformationByStyleOf.en
definition: Relates a resource to a resource that has a style that is changed to create a resource.
type: Property
sub property of: is transformation of
inverse of: has transformation by style
label: is transformatie door stijl van @nl
label: هو تحول وفق أسلوب لـ @ar
definition: يربط بين مصدر ومصدر له نمط تم تغييره لإنشاء مصدر. @ar
label: er omdannelse ved stil af @da
definition: Relaterer en ressourece til en ressource, som har en stil, der er ændret for at skabe en ressource. @da
label: tyylin muutos aineistolle @fi
definition: Liittää aineiston aineistoon, jonka tyyliä on muutettu uuden aineiston luomiseksi. @fi
label: ist Transformation hinsichtlich des Stil von @de
definition: Setzt eine Ressource in Beziehung zu einer Ressource, deren Stil geändert wird, um eine Ressource zu schaffen. @de
label: 是……的按风格的转换 @zh-hans
definition: 将一种资源与有风格并被改变以创建一种资源的一种资源关联起来。 @zh-hans
label: stílus szerinti átalakítása a következőnek: @hu
definition: Hozzákapcsol egy forrást egy forráshoz, amelynek a stílusa megváltozott egy forrás létrejövetele érdekében. @hu
label: biçeme göre değişimidir @tr
definition: Bir kaynağı, bir kaynak oluşturmak için değiştirilen bir biçime sahip bir kaynakla ilişkilendirir. @tr

is transformation of
status: Published
lexical alias: transformationOf.en
definition: Relates a resource to a resource that has a scope or editorial policy, genre or literary form, target audience, or style that is changed to create a resource.
type: Property
sub property of: heeft gerelateerde resource van resource
inverse of: has transformation
label: is transformatie van @nl
label: هو تحول لـ @ar
definition: يربط بين مصدر ومصدر له مجال أو سياسة تحريرية، نوع أو شكل أدبي، جمهور مستهدف، أو أسلوب تم تغييره لإنشاء مصدر. @ar
label: er omdannelse af @da
definition: Relaterer en ressource til en ressource, som har et formål eller redaktionel policy, genre eller litterær form, målgruppe, eller stil, der ændres for at skabe en ressource. @da
label: muutettu aineisto @fi
definition: Liittää aineiston aineistoon, jonka laajuutta tai toimituksellista käytäntöä, genreä tai kirjallista muotoa, kohdeyleisöä tai tyyliä on muutettu uuden aineiston luomiseksi. @fi
label: ist Transformation von @de
definition: Setzt eine Ressource in Beziehung zu einer Ressource, deren Geltungsbereich, redaktionelle Vorgehensweise, Genre oder literarische Form, Zielgruppe oder Stil geändert wird, um eine Ressource zu erstellen. @de
label: 是……的转换 @zh-hans
definition: 将一种资源与有范围或编辑政策、体裁或文学形式、目标受众或风格并被改变以创建一种资源的一种资源关联起来。 @zh-hans
label: átalakítása a következőnek: @hu
definition: Hozzákapcsol egy forrást egy forráshoz, amelynek alkalmazási területe vagy szerkesztési elvei, a műfaja vagy műneme, a célközönsége vagy a stílusa megváltoztak egy forrás létrejövetele érdekében. @hu
has subproperty: is transformation by audience of
has subproperty: is transformation by genre of
has subproperty: is transformation by policy of
has subproperty: is transformation by style of
label: değişimi @tr
definition: Bir kaynağı, bir kaynak oluşturmak için değiştirilen bir kapsam veya yayın politikası, tür veya edebi biçim, hedef kitle veya biçime sahip bir kaynakla ilişkilendirir. @tr

is translated as
status: Published
definition: Relates a resource to a resource whose language is a modification of another resource.
type: Property
sub property of: has derivative
inverse of: is translation of
lexical alias: translatedAs.en
label: er oversat til @da
definition: Relaterer en ressource til en ressource, der oversætter det oprindelige udtryks tekst til et andet sprog end det, der er anvendt i den originale ressource. @da
label: is vertaald als @nl
label: هي مترجمة كـ @ar
definition: يربط بين مصدر ومصدر يترجم نص مصدر آخر إلى لغة مختلفة. @ar
label: käännösaineisto @fi
definition: Liittää aineiston aineistoon, joka kääntää toisen aineiston tekstin. @fi
label: ist übersetzt als @de
definition: Setzt eine Ressource in Beziehung zu einer Ressource, die die Texte einer anderen Ressource in eine andere Sprache übersetzt. @de
label: 被翻译为 @zh-hans
definition: 将一种资源与其语言为另一种资源的修改的一种资源关联起来。 @zh-hans
definition: Relaciona un recurs amb un recurs la llengua del qual és una modificació d’un altre recurs. @ca
label: fordítva a következőként: @hu
definition: Hozzákapcsol egy forrást egy forráshoz, amely egy másik forrás szövegét egy másik nyelvre fordítja. @hu
has subproperty: has dubbed version
label: olarak tercüme edilir @tr
definition: Bir kaynağı, dili başka bir kaynağın düzenlenmesi olan bir kaynakla ilişkilendirir. @tr

is translation of
status: Published
definition: Relates a resource to a resource whose language is modified to create a new resource that is different from another resource.
type: Property
sub property of: has source
inverse of: is translated as
lexical alias: translationOf.en
label: er oversættelse af @da
definition: Relaterer en ressource til en ressource, der er blevet oversat, dvs. teksten er udtrykt i et andet sprog end det, der er anvendt i den originale ressource. @da
label: is vertaling van @nl
label: käännös aineistosta @fi
label: هو ترجمة لـ @ar
definition: يربط بين مصدر ومصدر تم ترجمته، مثل النص المعبر عنه بلغة مختلفة عن لغة مصدر أصلي. @ar
definition: Liittää aineiston toiseen kieleen sovitettuun ja käännettyyn aineistoon. @fi
label: ist Übersetzung von @de
definition: Setzt eine Ressource in Beziehung zu einer Ressource, die übersetzt wurde. Das heißt, dass der Text in einer Sprache ausgedrückt wird, die sich von der der Originalressource unterscheidet. @de
label: 是……的翻译 @zh-hans
definition: 将一种资源与其语言被修改而创建不同于另一种资源的一种资源关联起来。 @zh-hans
definition: Relaciona un recurs amb un recurs la llengua del qual es modifica per crear un nou recurs que és diferent d’un altre recurs. @ca
label: fordítása a következőnek: @hu
definition: Hozzákapcsol egy forrást egy forráshoz, amelyet lefordítottak, azaz a nyelvben kifejezett szöveg különbözik egy eredeti forrás nyelvétől. @hu
has subproperty: is dubbed version of
label: tercümesidir @tr
definition: Bir kaynağı, başka bir kaynaktan farklı yeni bir kaynak oluşturmak için dili düzenlenen kaynakla ilişkilendirir. @tr

has translator
status: Published
definition: Relates a resource to an agent who contributes to a resource by expressing linguistic content of a resource in a language different from that of previous resources.
type: Property
sub property of: has contributor (Deprecated)
inverse of: is translator of
lexical alias: translator.en
scope note: Translation of linguistic content between forms of the same language from different time periods is included.
label: har oversætter @da
definition: Relaterer en ressource til en agent, der har bidraget til en ressource ved at udtrykke en ressources sproglige indhold på et andet sprog end det, der er anvendt i tidligere udtryk af en oprindelige ressource. @da
scope note: Oversættelse af sprogligt indhold mellem former af det samme sprog fra forskellige tidsperioder er omfattet. @da
label: heeft vertaler @nl
label: aineiston kääntäjä @fi
label: له مُترجم @ar
definition: يربط مصدر بوكيل يُساهم في مصدر من خلال التعبير عن المحتوى اللغوي لمصدر بلغة مختلفة عن تلك الموجودة في المصادر السابقة. @ar
scope note: يتضمن ترجمة المحتوى اللغوي بين أشكال اللغة نفسها خلال فترات زمنية مختلفة. @ar
definition: Liittää aineiston toimijaan, joka on aineistossa osallisena ilmaisemalla teoksen kielellisen sisällön toisella kielellä. @fi
scope note: Kääntäjä voi myös kääntää kielisisältöä saman kielen eri aikakausien kielimuotojen välillä. @fi
label: hat Übersetzerin/Übersetzer @de
definition: Setzt eine Ressource in Beziehung zu einem Akteur, der zu einer Ressource beiträgt, indem er sprachlichen Inhalt einer Ressource in einer Sprache ausdrückt, die sich von früheren Ressourcen unterscheidet. @de
scope note: Darunter fallen Übersetzungen sprachlichen Inhalts zwischen Formen derselben Sprache aus verschiedenen Zeitperioden. @de
label: 有译者 @zh-hans
definition: 将一种资源与通过用不同于先前资源的语言的另一种语言来表达一种资源的语言内容而对一种资源有贡献的一个行为者关联起来。 @zh-hans
scope note: 包括语言内容在同一种语言的不同时期的形式之间的翻译。 @zh-hans
label: fordítója a következő: @hu
definition: Hozzákapcsol egy forrást egy ágenshez, amely a forrás nyelvi tartalmának a korábbi forrásoktól eltérő nyelven történő kifejezésével járul hozzá a forráshoz. @hu
scope note: Ugyanannak a nyelvnek a különböző időszakokból származó formái közötti nyelvi tartalom fordítása is ide tartozik. @hu
label: çevirmen ile ilişkilidir @tr
definition: Bir kaynağı, bir kaynağın dilsel içeriğini önceki kaynaklarınkinden farklı bir dilde ifade ederek kaynağa katkıda bulunan bir temsilci ile ilişkilendirir. @tr
scope note: Aynı dilin farklı zaman dilimlerindeki biçimleri arasındaki dilsel içeriğin çevirisi de dahildir. @tr

is translator of
status: Published
definition: Relates an agent to a resource that includes a contribution by an agent of expressing the linguistic content of the resource in a different language.
type: Property
sub property of: is contributor of (Deprecated)
inverse of: has translator
lexical alias: translatorOf.en
scope note: Translation of linguistic content between forms of the same language from different time periods is included.
label: er oversætter af @da
definition: Relaterer en agent, der har bidraget til en ressource ved at udtrykke værkets sproglige indhold på et andet sprog end det, der er anvendt i tidligere udtryk af en oprindelig ressource til en ressource. @da
scope note: En oversætter kan også oversætte sprogligt indhold mellem former af samme sprog fra forskellige tidsperioder. @da
label: is vertaler van @nl
label: هو مُترجم لـ @ar
definition: يربط بين وكيل ومصدر يتضمن إسهام وكيل في التعبير عن المحتوى اللغوي للمصدر بلغة مختلفة. @ar
scope note: يتضمن ترجمة المحتوى اللغوي بين أشكال تكون من نفس اللغة من فترات زمنية مختلفة. @ar
label: kääntäjä (toimija) aineistossa @fi
definition: Liittää toimijan aineistoon, jossa toimija on osallisena ilmaisemalla teoksen kielellisen sisällön toisella kielellä. @fi
scope note: Kääntäjä voi myös kääntää kielisisältöä saman kielen eri aikakausien kielimuotojen välillä. @fi
label: ist Übersetzerin/Übersetzer von @de
definition: Setzt einen Akteur in Beziehung zu einer Ressource, zu der ein Akteur beiträgt, indem er den sprachlichen Inhalt der Ressource in einer anderen Sprache ausdrückt. @de
scope note: Darunter fallen Übersetzungen sprachlichen Inhalts zwischen Formen derselben Sprache aus verschiedenen Zeitperioden. @de
label: 是……的译者 @zh-hans
definition: 将一个行为者与包括用另一种语言表达资源语言内容的一个行为者的贡献的一种资源关联起来。 @zh-hans
scope note: 包括同一种语言的不同时期的形式之间的语言内容的翻译。 @zh-hans
label: fordítója a következőnek: @hu
definition: Hozzákapcsol egy ágenst egy forráshoz, amely magában foglalja az ágens közreműködését a forrás nyelvi tartalmának más nyelven történő kifejezésével. @hu
scope note: Ugyanannak a nyelvnek a különböző időszakokból származó formái közötti nyelvi tartalom fordítása is ide tartozik. @hu
definition: Relaciona un agent amb un recurs que inclou una contribució d’un agent expressant el contingut lingüístic del recurs una llengua diferent. @ca
label: tercüman @tr
definition: Bir temsilciyi, kaynağın dil içeriğini farklı bir dilde ifade etme temsilcisinin katkısını içeren bir kaynakla ilişkilendirir. @tr
scope note: Aynı dilin farklı zaman dilimlerindeki biçimleri arasındaki dilsel içeriğin çevirisi de dahildir. @tr

has trustee
status: Published
type: Property
lexical alias: trustee.en
definition: Relates an agent to an officer granted powers of administration in an agent in order to act for its benefit.
inverse of: is trustee of
sub property of: has officer
label: har forvalter @da
definition: Relaterer en agent til en embedsmand, der har fået administrationsbeføjelse i en agent til at agere i dens interesse. @da
label: heeft trustee @nl
label: له مدير عام @ar
definition: يربط بين وكيل ومسؤول مُنح صلاحيات الإدارة فيها للعمل من أجل مصلحتها. @ar
label: edunvalvoja (toimija) @fi
definition: Liittää toimijan toimihenkilöön, jolla on valtuudet tehdä päätöksiä yhteisön eduksi. @fi
label: hat Treuhänderin/Treuhänder @de
definition: Setzt einen Akteur in Beziehung zu einer leitenden Angestellten/einem leitenden Angestellten, der/dem die Verwaltungsvollmachten über einen Akteur übertragen wird, um zu dessen Nutzen zu agieren. @de
label: 有受托人 @zh-hans
definition: 将一个行为者与在一个行为者中被赋予为其利益行动的权力一个任职者关联起来。 @zh-hans
label: vezetője a következő: @hu
definition: Hozzákapcsol egy ágenst egy tisztviselőhöz, aki adminisztratív hatalmat kap egy ágensben, hogy annak javára cselekedjék. @hu
label: yetkili ile ilişkilidir @tr
definition: Bir temsilciyi, bir temsilcinin yararına hareket etmesi için yönetim yetkisi verilmiş bir memurla ilişkilendirir. @tr

is trustee of
status: Published
type: Property
lexical alias: trusteeOf.en
definition: Relates an agent to an agent who grants powers of administration to an officer in order to act for its benefit.
inverse of: has trustee
sub property of: is officer of
label: er forvalter af @da
definition: Relaterer en agent til en agent, der giver administrationsbeføjelser til en embedsmand til at agere i dens interesse. @da
label: is trustee van @nl
label: هو مدير عام لـ @ar
definition: يربط بين وكيل ووكيل مُنح صلاحيات الإدارة فيها للعمل من أجل مصلحتها. @ar
label: edunvalvoja (toimija) @fi
definition: Liittää toimijan yhteistoimijaan, jossa toimihenkilöllä on valtuudet tehdä päätöksiä yhteisön eduksi. @fi
label: ist Treuhänderin/Treuhänder von @de
definition: Setzt einen Akteur in Beziehung zu einem Akteur, der einer leitenden Angestellten/einem leitenden Angestellten die Verwaltungsvollmachten überträgt, um zu dessen Nutzen zu agieren. @de
label: 是……的受托人 @zh-hans
definition: 将一个行为者与赋予一个任职者为其利益行动的权力的一个行为者关联起来。 @zh-hans
label: vezetője a következőnek: @hu
definition: Hozzákapcsol egy ágenst egy ágenshez, amely adminisztratív hatalommal ruházza fel egy tisztviselőt, hogy az ágens javára cselekedjen. @hu
label: çevirmendir @tr
definition: Bir temsilciyi, bir memura kendi yararına hareket etmesi için yönetim yetkileri veren bir temsilciyle ilişkilendirir. @tr

has type of binding
status: Published
definition: Relates a resource to a method used to bind a published or unpublished resource.
type: Property
label: heeft bindwijze @nl
label: له نوع تجيلد @ar
definition: يربط بين مصدر وطريقة مستخدمة لتجليد مصدر منشور أو غير منشور. @ar
label: har type af indbinding @da
definition: Relaterer en ressource til en metode brugt til at indbinde en udgiven eller ikke udgiven ressource. @da
label: aineiston sidostyyppi @fi
definition: Liittää aineiston menetelmään, jolla julkaistu tai julkaisematon aineisto on sidottu. @fi
label: hat Bindeart @de
definition: Setzt eine Ressource in Beziehung zu einer Methode, die verwendet wird, um eine veröffentlichte oder unveröffentlichte Ressource zu binden. @de
lexical alias: typeOfBinding.en
label: 有装订类型 @zh-hans
definition: 将一种资源与用于装订一种出版或非出版资源的方法关联起来。 @zh-hans
label: kötéstípusa a következő: @hu
definition: Hozzákapcsol egy forrást egy módszerhez, amelyet kiadott vagy kiadatlan forrás kötéséhez használnak. @hu
label: ciltleme türü ile ilişkilidir @tr
definition: Bir kaynağı, yayınlanmış veya yayınlanmamış bir kaynağı bağlamak için kullanılan bir yöntemle ilişkilendirir. @tr

has type of recording
status: Published
definition: Relates a resource to a method used to encode audio content for playback.
type: Property
sub property of: has sound characteristic
lexical alias: typeOfRecording.en
label: har indspillingskarakteristika @da
definition: Relaterer en ressource til en metode, der er anvendt til at kode lydindhold til afspilning. @da
label: heeft opname type @nl
label: له نوع تسجيل @ar
definition: يربط بين مصدر وطريقة مستخدمة في تشفير محتوى صوتي مطلوب للتشغيل. @ar
label: äänen tallennustapa aineistossa @fi
definition: Liittää aineiston menetelmään, jota on käytetty äänen tallentamiseksi äänentoistoa varten. @fi
label: hat Art einer Aufnahme @de
definition: Setzt eine Ressource in Beziehung zu einem Verfahren, das zur Kodierung von Audio-Inhalt für die Wiedergabe verwendet wird. @de
label: 有录音的类型 @zh-hans
definition: 将一种资源与用于编码供回放的音频内容的方法关联起来。 @zh-hans
label: felvételtípusa a következő: @hu
definition: Hozzákapcsol egy forrást egy módszerhez, amelyet audiótartalom kódolásához használnak visszajátszás céljára. @hu
label: kayıt türü ile ilişkilidir @tr
definition: Bir kaynağı, oynatma için ses içeriğini kodlamak için kullanılan yöntemle ilişkilendirir. @tr

has undifferentiated name indicator
status: Published
definition: Relates a name to a categorization indicating that a name is insufficient to differentiate between two or more entities.
type: Property
lexical alias: undifferentiatedNameIndicator.en
label: har ikke entydig navneindikator @da
definition: Relaterer en ressource til en kategorisering, der angiver, at de registrerede kerneelementer er utilstrækkelige til at skelne mellem to eller flere agenter med det samme navn. @da
label: heeft niet-onderscheiden naam indicatie @nl
label: yksilöimättömän nimen ilmaus aineistolle @fi
label: له مؤشر لاسم غير مميز @ar
definition: يربط بين اسم وفئة تشير إلى اسم غير كافِ للتمييز بين كيانين أو أكثر. @ar
definition: Liittää aineiston kategorisointiin, jolla ilmaistaan sen riittämättömyys kahden tai useamman entiteetin erottamiseen toisistaan. @fi
label: hat Indikator für nicht individualisierte Namen @de
definition: Setzt einen Namen in Beziehung zu einer Kategorisierung die angibt, dass ein Name nicht ausreicht, um zwischen zwei oder mehreren Entitäten zu unterscheiden. @de
label: 有未区分名称标识符 @zh-hans
definition: 将一个名称与表明一个名称不足以区分两个或更多实体的一个类别关联起来。 @zh-hans
label: nem differenciált névjelzője a következő: @hu
definition: Hozzákapcsol egy nevet egy kategorizáláshoz, jelezve, hogy a név nem alkalmas két vagy több entitás megkülönböztetésére. @hu
label: ayırt edilemeyen ad göstergesi ile ilişkilidir @tr
definition: Bir adı, bir adın iki veya daha fazla varlık arasında ayrım yapmak için yetersiz olduğunu gösteren bir sınıflandırmayla ilişkilendirir. @tr

has uniform resource locator
status: Published
definition: Relates a resource to an address of an online resource.
type: Property
lexical alias: uniformResourceLocator.en
scope note: A Uniform Resource Locators includes all resource identifiers intended to provide online access to a resource using a standard Internet browser.
alternative label: URL
label: har uniform resource locator @da
definition: Relaterer en ressource til en adresse på en ressource hvortil der er fjernadgang. @da
scope note: En Uniform Ressource Locator inkluderer alle ressourceidentifikatorer der har for hensigt at give online access til en ressource gennem at bruge en standard internetbrowser. @da
label: heeft Uniform Resource Locator @nl
label: له محّدد مصادر مُوحّد @ar
definition: يربط بين مصدر وعنوان لمصدر متاح على الخط المباشر @ar
scope note: تتضمن محّددات المصادر المُوحّدة كل معرفات المصدر التي تهدف إلى توفير الإتاحة على الخط المباشر لمصدر باستخدام متصفح إنترنت معياري @ar
alternative label: محّدد مصادر مُوحّد @ar
label: URL-osoite @fi
definition: Liittää aineiston verkkoaineiston osoitteeseen. @fi
scope note: URL-osoite käsittää kaikki aineiston tunnisteet, joiden tarkoituksena on antaa pääsy verkossa olevaan aineistoon standardia verkkoselainta käyttäen. @fi
label: hat Uniform Resource Locator @de
definition: Setzt eine Ressource in Beziehung zu einer Adresse einer Online-Ressource. @de
scope note: Darunter fallen alle Identifikatoren, die konzipiert sind, um unter Verwendung eines Standard-Internet-Browsers Online-Zugang auf eine Ressource anzubieten. @de
label: 有统一资源定位符 @zh-hans
definition: 将一种资源与一种联机资源的地址关联起来。 @zh-hans
scope note: 统一资源定位符包括使用标准的互联网浏览器对资源进行联机检索的所有资源标识符。 @zh-hans
alternative label: Egy egységes forrás-helymeghatározó (Uniform Resource Locator – URL) magába foglal minden olyan forrásazonosítót, amelynek célja, hogy egy forráshoz szabványos webböngésző használatáva online hozzáférést biztosítson. @hu
label: egységes forrás-helymeghatározója a következő: @hu
definition: Hozzákapcsol egy forrást egy online forrás webcíméhez. @hu
scope note: URL @hu
label: tekdüzen kaynak bulucu ile ilişkilidir @tr
definition: Bir kaynağı çevrimiçi bir kaynağın adresiyle ilişkilendirir. @tr
scope note: Tek Biçimli Kaynak Bulucusu, standart bir internet tarayıcısı kullanarak bir kaynağa çevrimiçi erişim sağlamayı amaçlayan tüm kaynak tanımlayıcıları içerir. @tr

has variant access point for entity
status: Published
sub property of: has access point for entity
type: Property
lexical alias: variantAccessPointForEntity.en
definition: Relates an entity to an access point for entity that is not selected for preference in a specific vocabulary encoding scheme.
inverse of: is variant access point for entity of
label: heeft variant ingang voor entiteit @nl
label: له نقطة إتاحة مختلفة لكيان @ar
definition: يربط بين كيان ونقطة إتاحة لكيان لم يتم اختياره كنقطة إتاحة مختلفة مفضلة في خطة ترميز مفردات محددة. @ar
label: har variant af søgeindgang for entitet @da
definition: Relaterer en entitet til en søgeindgang for entitet, der ikke er valgt som foretrukken i et specifikt vokabularkodningsskema. @da
label: entiteetin varianttihakutieto @fi
definition: Liittää entiteetin entiteetin hakutietoon, jota ei ole valittu ensisijaiseksi tietyn sanaston merkintäjärjestelmässä. @fi
label: hat zusätzlichen Sucheinstieg für eine Entität @de
definition: Setzt eine Entität in Beziehung zu einem Sucheinstieg für eine Entität, der in einem bestimmten Vocabulary Encoding Scheme nicht als Vorzugsform bestimmt wird. @de
label: 有实体的变异检索点 @zh-hans
definition: 将一个实体与没有在一个特定的词表编码体系中被首选的一个实体的检索点关联起来。 @zh-hans
label: entitás hozzáférésipont-változata a következő: @hu
definition: Hozzákapcsol egy entitást egy entitás hozzáférési pontjához, amelyet nem választanak ki egy adott szótárkódolási sémából előnyben részesítettként. @hu
has subproperty: has variant access point for agent
has subproperty: has variant access point for place
has subproperty: has variant access point for resource
has subproperty: has variant access point for timespan
label: varlık için alternatif erişim noktası ile ilişkilidir @tr
definition: Bir varlığı, belirli bir sözcük kodlama şemasında tercih için seçilmeyen varlığa ilişkin bir erişim noktasıyla ilişkilendirir. @tr

is variant access point for entity of
status: Published
sub property of: is access point for entity of
type: Property
lexical alias: variantAccessPointForEntityOf.en
definition: Relates a nomen to an entity that has an access point for entity that is not selected for preference in a specific vocabulary encoding scheme.
inverse of: has variant access point for entity
label: is variant ingang voor entiteit van @nl
label: هو نقطة وصول مختلفة لكيان لـ @ar
definition: يربط بين تسمية وكيان له نقطة وصول لكيان لم يتم اختيارها كنقطة وصول مختلفة مفضلة ضمن تطبيق محدد أو سياق محدد. @ar
label: er variansøgeindgang for entitet af @da
definition: Relaterer et nomen til en entitet, som har en søgeindgang for entitet, der ikke er valgt som foretrukken i et specifikt vokabularkodningsskema. @da
label: entiteetin varianttihakutieto @fi
definition: Liittää nomenin entiteettiin, jolla on entiteetin hakutieto, jota ei ole valittu ensisijaiseksi tietyssä sovelluksessa tai kontekstissa. @fi
label: ist zusätzlicher Sucheinstieg für eine Entität von @de
definition: Setzt ein Nomen in Beziehung zu einer Entität, die über einen Sucheinstieg für eine Entität verfügt, der in einem bestimmten Vocabulary Encoding Scheme nicht als Vorzugsform bestimmt wird. @de
label: 是……的实体的变异检索点 @zh-hans
definition: 将一个命名与有在一个特定的词表编码体系中未被首选的实体检索点的一个实体关联起来。 @zh-hans
label: hozzáférésipont-változat a következő entitás számára: @hu
definition: Hozzákapcsol egy noment egy olyan entitáshoz, amelynek van egy olyan hozzáférési pontja az entitás számára, amelyet egy adott szótárkódolási sémából kiválasztva nem részesítenek előnyben. @hu
label: varlığı için farklı erişim noktasıdır @tr
definition: Bir ismi, belirli bir sözcük kodlama şemasında tercih edilmeyen varlık için bir erişim noktasına sahip olan bir varlıkla ilişkilendirir. @tr

has variant name of agent
status: Published
definition: Relates an agent to a name of agent that is not selected for preference in a specific application or context.
type: Property
sub property of: has name of agent
lexical alias: variantNameOfAgent.en
label: har variantnavn for agent @da
definition: Relaterer en ressource til et navn eller en navneform, hvorunder en ressource er kendt, og som adskiller sig fra det navn eller den navneform, der er valgt som det foretrukne navn. @da
inverse of: is variant name of agent of
label: heeft variant naam van actor @nl
label: toimijan varianttinimi @fi
label: له اسم مختلف لوكيل @ar
definition: يربط وبين كيل واسم وكيل لم يتم اختياره كاسم مختلف مفضل ضمن تطبيق محدد أو سياق محدد. @ar
definition: Liittää toimijan nimeen, jota jota ei ole valittu ensisijaiseksi tietyssä sovelluksessa tai kontekstissa. @fi
label: hat abweichenden Namen eines Akteurs @de
definition: Setzt einen Akteur in Beziehung zu einem Name eines Akteurs, der in einer bestimmten Anwendung oder in einem bestimmten Kontext nicht als Vorzugsform bestimmt wird. @de
label: 有行为者的变异名称 @zh-hans
definition: 将一个行为者在一个特定的应用或语境中未被首选的一个行为者的名称关联起来。 @zh-hans
label: ágens névváltozata a következő: @hu
definition: Hozzákapcsol egy ágenst egy ágensnévhez, amelyet egy adott alkalmazásban vagy összefüggésben nem részesítenek előnyben. @hu
label: temsilcinin alternatif ismi ile ilişkilidir @tr
definition: Bir temsilciyi, belirli bir uygulamada veya bağlamda tercih için seçilmeyen temsilcinin ismiyle ilişkilendirir. @tr

is variant name of agent of
status: Published
sub property of: is name of agent of
type: Property
lexical alias: variantNameOfAgentOf.en
definition: Relates a nomen to an agent who has a name of agent that is not selected for preference in a specific application or context.
inverse of: has variant name of agent
label: is variant naam van actor van @nl
label: هو اسم مختلف لوكيل لـ @ar
definition: يربط بين تسمية ووكيل له اسم وكيل لم يتم اختياره كاسم مختلف مفضل ضمن تطبيق محدد أو سياق محدد. @ar
label: er variantnavn af agent på @da
definition: Relaterer et nomen til en agent, som har et agentnavn, der ikke er valgt som foretrukket i en specifik applikation eller et specifikt sammenhæng. @da
label: toimijan varianttinimi @fi
definition: Liittää nomenin toimijaan, jolla on toinen toimijan nimi, jota ei ole valittu ensisijaiseksi tietyssä sovelluksessa tai kontekstissa. @fi
label: ist abweichender Name eines Akteurs von @de
definition: Setzt ein Nomen in Beziehung zu einem Akteur, der über einen Namen für einen Akteur verfügt, der in einer bestimmten Anwendung oder in einem bestimmten Kontext nicht als Vorzugsform bestimmt wird. @de
label: 是……的行为者的变异名称 @zh-hans
definition: 将一个命名与有在一个特定的应用或语境下未被首选的一个行为者名称的一个行为者关联起来。 @zh-hans
label: névváltozata a következő ágensnek: @hu
definition: Hozzákapcsol egy noment egy ágenshez, amelynek van egy olyan ágensneve, amelyet egy adott alkalmazásban vagy kontextusban nem részesítenek előnyben. @hu
label: temsilcinin farklı ismi @tr
definition: Bir ismi, belirli bir uygulamada veya bağlamda tercih edilmeyen bir temsilci adına sahip temsilciyle ilişkilendirir. @tr

has variant name of entity
status: Published
type: Property
lexical alias: variantNameOfEntity.en
definition: Relates an entity to a name of entity that is not selected for preference in a specific application or context.
sub property of: has name of entity
inverse of: is variant name of entity of
label: heeft variant naam van entiteit @nl
label: له اسم مختلف لكيان @ar
definition: يربط بين كيان واسم كيان لم يتم اختياره كاسم مفضل ضمن تطبيق محدد أو سياق محدد. @ar
label: har variantnavn på entitet @da
definition: Relaterer en entitet til et navn på entitet, som ikke er valgt som foretrukket i en specifik applikation eller i et specifikt sammenhæng. @da
label: entiteetin varianttinimi @fi
definition: Liittää entiteetin nimeen, jota ei tietyssä sovelluksessa tai kontekstissa ole valittu ensisijaiseksi entiteetin nimeksi. @fi
label: hat abweichenden Namen einer Entität @de
definition: Setzt eine Entität in Beziehung zu einem Name einer Entität, der in einer bestimmten Anwendung oder in einem bestimmten Kontext nicht als Vorzugsform bestimmt wird. @de
label: 有实体的变异名称 @zh-hans
definition: 将一个实体与一个作为实体名称并不在特定应用或语境下优先选用的命名关联起来。 @zh-hans
label: entitás névváltozata a következő: @hu
definition: Hozzákapcsol egy entitást egy entitásnévhez, amelyet egy adott alkalmazásban vagy kontextusban nem részesítenek előnyben. @hu
label: varlığın alternatif ismi ile ilişkilidir @tr
definition: Bir varlığı, belirli bir uygulama veya bağlamda tercih edilmeyen bir varlığın adıyla ilişkilendirir. @tr

is variant name of entity of
status: Published
type: Property
definition: Relates a nomen to an entity that has a name of entity that is not selected for preference in a specific application or context.
label: is variant naam van corporatie van @nl
label: هو اسم مختلف لكيان لـ @ar
definition: يربط بين تسمية وكيان لم يتم اختياره كاسم مختلف مفضل ضمن تطبيق محدد أو سياق محدد. @ar
label: er variantnavn på entitet af @da
definition: Relaterer et nomen til en entitet, som har et entitetsnavn, der ikke er valgt som foretrukket i en specifik applikation eller et specifikt sammenhæng. @da
label: entiteetin varianttinimi @fi
definition: Liittää nomenin entiteettiin, jolla on nimi, jota ei tietyssä sovelluksessa tai kontekstissa ole valittu ensisijaiseksi entiteetin nimeksi. @fi
label: ist abweichender Name einer Entität von @de
definition: Setzt ein Nomen in Beziehung zu einer Entität, die über einen Namen für eine Entität verfügt, der in einer bestimmten Anwendung oder in einem bestimmten Kontext nicht als Vorzugsform bestimmt wird. @de
sub property of: is name of entity of
inverse of: has variant name of entity
lexical alias: variantNameOfEntityOf.en
label: 是……的实体的变异名称 @zh-hans
definition: 将一个命名与有在一个特定的应用或语境中未被首选的一个实体名称的一个实体关联起来。 @zh-hans
label: névváltozata a következő entitásnak: @hu
definition: Hozzákapcsol egy noment egy entitáshoz, amelynek van egy olyan entitásneve, amelyet egy adott alkalmazásban vagy kontextusban nem részesítenek előnyben. @hu
has subproperty: is variant access point for agent of
has subproperty: is variant access point for place of
has subproperty: is variant access point for resource of
has subproperty: is variant access point for timespan of
label: varlığının farklı ismi @tr
definition: Bir ismi, belirli bir uygulama veya bağlamda seçilen bir varlığın tercih edilmeyen adıyla ilişkilendirir. @tr

has variant name of place
status: Published
type: Property
lexical alias: variantNameOfPlace.en
definition: Relates a place to a name of place that is not selected for preference in a specific application or context.
label: har variantnavn for et sted @da
definition: Relaterer et sted til en navn eller navneform, hvorunder et sted er kendt, og som adskiller sig fra det navn eller den navneform, der er valgt som foretrukket navn. @da
sub property of: has name of place
inverse of: is variant name of place of
label: heeft variant naam van plaats @nl
label: له اسم مختلف لمكان @ar
definition: يربط بين مكان واسم مكان لم يتم اختياره كاسم مختلف مفضل في تطبيق معين أو في سياق معين. @ar
label: paikan varianttinimi @fi
definition: Liittää paikan paikannimeen, jota ei ole valittu ensisijaiseksi tietyssä sovelluksessa tai kontekstissa. @fi
label: hat abweichenden Namen eines Geografikums @de
definition: Setzt ein Geografikum in Beziehung zu einem Namen eines Geografikums, der in einer bestimmten Anwendung oder in einem bestimmten Kontext nicht als Vorzugsform bestimmt wird. @de
label: 有地点的变异名称 @zh-hans
definition: 将一个地点与在一个特定的应用或语境中未被首选的一个地点名称关联起来。 @zh-hans
label: helynévváltozata a következő: @hu
definition: Hozzákapcsol egy helyet egy helynévhez, amelyet egy adott alkalmazásban vagy összefüggésben nem részesítenek előnyben. @hu
label: yerin alternatif ismi ile ilişkilidir @tr
definition: Bir yeri, belirli bir uygulama veya bağlamda tercih edilmeyen bir yer adıyla ilişkilendirir. @tr

is variant name of place of
status: Published
sub property of: is name of place of
type: Property
lexical alias: variantNameOfPlaceOf.en
definition: Relates a nomen to a place that has a name of place that is not selected for preference in a specific application or context.
inverse of: has variant name of place
label: is variant naam van plaats van @nl
label: هو اسم مختلف لمكان لـ @ar
definition: يربط بين تسمية ومكان له اسم مكان لم يتم اختياره كاسم مختلف مفضل ضمن تطبيق محدد أو سياق محدد. @ar
label: er variant til stednavn på @da
definition: Relaterer et nomen til et sted, der har et stednavn, som ikke er valgt som foretrukket i en specifik applikation eller et specifikt sammenhæng. @da
label: paikan varianttinimi @fi
definition: Liittää nomenin paikkaan, jolla on paikannimi, jota ei ole valittu ensisijaiseksi tietyssä sovelluksessa tai kontekstissa. @fi
label: ist abweichender Name eines Geografikums von @de
definition: Setzt ein Nomen in Beziehung zu einem Geografikum, das über einen Namen für ein Geografikum verfügt, der in einer bestimmten Anwendung oder in einem bestimmten Kontext nicht als Vorzugsform bestimmt wird. @de
label: 是……的地点的变异名称 @zh-hans
definition: 将一个命名与有在一个特定的应用或语境中未被首选的一个地点名称的一个地点关联起来。 @zh-hans
label: névváltozata a következő helynek: @hu
definition: Hozzákapcsol egy noment egy helyhez, amelynek van egy helyneve, amelyet egy adott alkalmazásban vagy kontextusban nem részesítenek előnyben. @hu
label: yerin farklı ismi @tr
definition: Bir ismi, belirli bir uygulamada veya bağlamda tercih edilmeyen bir yer adına sahip bir yerle ilişkilendirir. @tr

has variant name of timespan
status: Published
sub property of: has name of timespan
type: Property
lexical alias: variantNameOfTimespan.en
definition: Relates a timespan to a name of timespan that is not selected for preference in a specific application or context.
inverse of: is variant name of timespan of
label: heeft variant naam van tijdspanne @nl
label: له اسم مختلف لفترة زمنية @ar
definition: يربط بين فنرة زمنية واسم فترة زمنية لم يتم اختيارها كاسم مختلف مفضل ضمن تطبيق محدد أو سياق محدد. @ar
label: har variantnavn for tidsforløb @da
definition: Relaterer et tidsforløb til et navn på tidsforløb, der ikke er valgt som foretrukket i en specifik applikation eller i et specifikt sammenhæng. @da
label: ajanjakson varianttinimi @fi
definition: Liittää ajanjakson ajanjakson nimeen, jota ei ole valittu ensisijaiseksi tietyssä sovelluksessa tai kontekstissa. @fi
label: hat abweichenden Namen eines Zeitraums @de
definition: Setzt einen Zeitraum in Beziehung zu einem Namen eines Zeitraums, der in einer bestimmten Anwendung oder in einem bestimmten Kontext nicht als Vorzugsform bestimmt wird. @de
label: 有时间段的变异名称 @zh-hans
definition: 将一个时间段与未在一个特定的应用或语境中被首选的一个时间段的名称关联起来。 @zh-hans
label: időtartam névváltozata a következő: @hu
definition: Hozzákapcsol egy időtartamot egy időtartamnévhez, amelyet egy adott alkalmazásban vagy összefüggésben nem részesítenek előnyben. @hu
label: zaman aralığının alternatif ismi ile ilişkilidir @tr
definition: Bir zaman aralığını, belirli bir uygulamada veya bağlamda tercih için seçilmemiş bir zaman aralığının adıyla ilişkilendirir. @tr

is variant name of timespan of
status: Published
sub property of: is name of timespan of
type: Property
lexical alias: variantNameOfTimespanOf.en
definition: Relates a nomen to a timespan that has a name of timespan that is not selected for preference in a specific application or context.
inverse of: has variant name of timespan
label: is variant naam van tijdspanne van @nl
label: هو اسم مختلف لفترة زمنية لـ @ar
definition: ييربط تسمية بفترة زمنية لها اسم فترة زمنية لم يتم اختياره كاسم مختلف مفضل ضمن تطبيق محدد أو سياق محدد. @ar
label: er variantnavn på tidsforløb af @da
definition: Relaterer et nomen til et tidsforløb, der har et navn på tidsforløb, der ikke er valgt som foretrukket i en specifik applikation eller et specifikt sammenhæng. @da
label: ajanjakson varianttinimi @fi
definition: Liittää nomenin ajanjaksoon, jolla on ajanjakson nimi, jota ei ole valittu ensisijaiseksi tietyssä sovelluksessa tai kontekstissa. @fi
label: ist abweichender Name eines Zeitraums von @de
definition: Setzt ein Nomen in Beziehung zu einem Zeitraum, der über einen Namen für einen Zeitraum verfügt, der in einer bestimmten Anwendung oder in einem bestimmten Kontext nicht als Vorzugsform bestimmt wird. @de
label: 是……的时间段的变异名称 @zh-hans
definition: 将一个命名与有在一个特定的应用或语境中未被首选的一个时间段名称的一个时间段关联起来。 @zh-hans
label: névváltozata a következő időtartamnak: @hu
definition: Hozzákapcsol egy noment egy időtartamhoz, amelynek van egy időtartamneve, amelyet egy adott alkalmazásban vagy kontextusban nem részesítenek előnyben. @hu
definition: Relaciona un nomen amb un interval de temps que té un nom d’interval de temps que no se selecciona com a preferent en una aplicació o un context específic. @ca
label: zaman aralığının farklı ismi @tr
definition: Bir ismi, belirli bir uygulama veya bağlamda tercih edilmeyen bir bir zaman aralığı adına sahip zaman aralığı ile ilişkilendirir. @tr

has variant title of resource
status: Published
definition: Relates a resource to a title of resource that is not selected for preference in a specific application or context.
type: Property
sub property of: has title of resource
lexical alias: variantTitleOfResource.en
label: har varianttitel for ressource @da
definition: Relaterer en ressource til en titel, der er knyttet til en ressource, der afviger fra en titel, der er registreret som hovedtitel, parallel hovedtitel, andre titeloplysninger, andre parallel titeloplysninger, tidligere hovedtitel, senere hovedtitel, nøgletitel eller forkortet titel. @da
inverse of: is variant title of resource of
label: heeft variant titel van resource @nl
label: له عنوان مختلف لمصدر @ar
definition: يربط بين مصدر وعنوان مصدر لم يتم اختياره كعنوان مختلف مفضل في تطبيق محدد أو سياق محدد. @ar
label: aineiston varianttinimeke @fi
definition: Liittää aineiston aineiston nimekkeeseen, jota ei ole valittu ensisijaiseksi nimikkeeksi tietyssä sovelluksessa tai kontekstissa. @fi
label: hat abweichenden Titel einer Ressource @de
definition: Setzt eine Ressource in Beziehung zu einem Titel einer Ressource, der in einer bestimmten Anwendung oder in einem bestimmten Kontext nicht als Vorzugsform bestimmt wird. @de
label: 有资源的变异题名 @zh-hans
definition: 将一种资源与没有在一个特定的应用或语境中被首选的一个资源的题名关联起来。 @zh-hans
label: forrás címváltozata a következő: @hu
definition: Hozzákapcsol egy forrást egy forrás címéhez, amelyet egy adott alkalmazásban vagy összefüggésben nem részesítenek előnyben. @hu
label: kaynağın alternatif başlığı ile ilişkilidir @tr
definition: Bir kaynağı, belirli bir uygulama veya bağlamda tercih edilmek üzere seçilmemiş bir kaynak başlığıyla ilişkilendirir. @tr

is variant title of resource of
status: Published
sub property of: is title of resource of
type: Property
lexical alias: variantTitleOfResourceOf.en
definition: Relates a nomen to a resource that has a title of resource that is not selected for preference in a specific application or context.
inverse of: has variant title of resource
label: is variant titel van resource van @nl
label: هو عنوان مختلف لمصدر لـ @ar
definition: يربط تسمية بمصدر له عنوان مصدر لم يتم اختياره كعنوان مختلف مفضل ضمن تطبيق محدد أو سياق محدد. @ar
label: er varianttitel af ressource af @da
definition: Relaterer et nomen til en ressource, som har en ressourcetitel der ikke er valgt som foretrukken in en specifik applikation eller i et specifikt sammenhæng. @da
label: aineiston varianttinimi @fi
definition: Liittää nomenin aineistoon, jolla on aineiston nimi, jota ei ole valittu ensisijaiseksi tietyssä sovelluksessa tai kontekstissa. @fi
label: ist abweichender Titel einer Ressource von @de
definition: Setzt ein Nomen in Beziehung zu einer Ressource, die über einen Titel für eine Ressource verfügt, der in einer bestimmten Anwendung oder in einem bestimmten Kontext nicht als Vorzugsform bestimmt wird. @de
label: 是……的资源的变异题名 @zh-hans
definition: 将一个命名与有在一个特定的应用或语境中被未首选的一个资源题名的一种资源关联起来。 @zh-hans
label: címváltozata a következő forrásnak: @hu
definition: Hozzákapcsol egy noment egy forráshoz, amely rendelkezik egy olyan forráshoz tartozó címmel, amelyet egy adott alkalmazásban vagy kontextusban nem részesítenek előnyben. @hu
label: kaynağının alternatif adıdır @tr
definition: Bir ismi, belirli bir uygulamada veya bağlamda tercih edilmeyen kaynak adına sahip bir kaynakla ilişkilendirir. @tr

is variations based on
status: Published
definition: Relates a resource to a musical resource from which melodic, thematic, or harmonic material is taken to form a discrete theme, which is repeated one or more times with subsequent modifications.
type: Property
sub property of: has source
inverse of: is modified by variation as
lexical alias: variationsBasedOn.en
label: er variationer baseret på @da
definition: Relaterer en ressource til en musikressource, hvorfra der er taget melodisk, tematisk eller harmonisk materiale til dannelse af et bestemt tema, som gentages en eller flere gange med efterfølgende ændringer. @da
label: is variatie gebaseerd op @nl
label: muunnelma aineistosta @fi
label: هي تنويعات تعتمد على @ar
definition: يربط بين مصدر ومصدر موسيقي تؤخذ منه المواد اللحنية أو الموضوعية أو التناغمية لتشكل مقطوعة متميزة، تتكرر مرة واحدة أو أكثر مع تعديلات لاحقة. @ar
definition: Liittää aineiston musiikkiaineistoon, josta melodinen, temaattinen tai harmoninen aines on otettu erillisen, toistettavan ja muunneltavan teeman muodostamiseksi. @fi
label: ist Variationen basierend auf @de
definition: Setzt eine Ressource in Beziehung zu einer Musikressource, aus der melodisches, thematisches oder harmonisches Material entnommen wird, um ein einzelnes Thema zu bilden, das ein- oder mehrmals mit nachfolgenden Modifikationen wiederholt wird. @de
label: 是基于……的变奏曲 @zh-hans
definition: 将一种资源与其旋律、主题或和声材料被用来形成一个独立的主题、而这个主题又经过后续变化而反复一次或多次的一种音乐资源关联起来。 @zh-hans
label: változatok a következő alapján: @hu
definition: Hozzákapcsol egy forrást egy zenei forráshoz, amelyből dallami, tematikus vagy harmonikus anyagot emelnek ki egy különálló téma megalkotása céljából, amely egyszer vagy többször ismétlődik egymás utáni módosulásokkal. @hu
label: şuna dayalı alternatifler @tr
definition: Bir kaynağı, ardışık modifikasyonlarla bir veya daha fazla kez tekrar edilen ayrık bir tema oluşturmak üzere melodik, tematik veya harmonik materyalin alındığı bir müzik kaynağı ile ilişkilendirir. @tr

is verse adaptation of
status: Published
definition: Relates a resource to a resource that is adapted as a literary composition in verse form.
type: Property
sub property of: is adaptation of
inverse of: is adapted in verse as
lexical alias: verseAdaptationOf.en
label: er versbearbejdelse som @da
definition: Relaterer en ressource til en ressource, der er blevet bearbejdet som litterær komposition i versform. @da
label: is bewerking in versvorm van @nl
label: runomukaelma aineistosta @fi
label: هو اقتباس شعري لـ @ar
definition: يربط بين مصدر ومصدر تم تحويره كتكوين أدبي في شكل شعر. @ar
definition: Liittää aineiston aineistoon, joka on sovitettu runomuotoiseksi kirjalliseksi tuotokseksi. @fi
label: ist Gedichtbearbeitung von @de
definition: Setzt eine Ressource in Beziehung zu einer Ressource, die als literarische Dichtung in Versform bearbeitet ist. @de
label: 是……的韵文改编 @zh-hans
definition: 将一种资源与被改编为韵文形式文学写作的一种资源关联起来。 @zh-hans
label: verses feldolgozása a következőnek: @hu
definition: Hozzákapcsol egy forrást egy forráshoz, amelyet verses formájú irodalmi alkotásként adaptáltak. @hu
label: nazım uyarlamasıdır. @tr
definition: Bir kaynağı, nazım biçiminde edebi eser olarak uyarlanmış bir kaynakla ilişkilendirir. @tr

has vertical scale of cartographic content
status: Published
definition: Relates a resource to a scale of elevation or vertical dimension of the cartographic content of a resource.
type: Property
sub property of: has scale
lexical alias: verticalScaleOfCartographicContent.en
label: har vertikal skala for kartografisk indhold @da
definition: Relaterer en ressource til en koteskala eller skala for vertikal dimension for en ressources kartografiske indhold. @da
label: heeft verticale schaal van cartografische content @nl
label: له مقياس عَمُودِي لمحتوى رسم خرائطي @ar
definition: يربط بين مصدر ومقياس ارتفاع أو بُعد عَمُودِي لمحتوى رسم خرائطي لمصدر ما. @ar
label: aineiston kartografisen sisällön vertikaalinen mittakaava @fi
definition: Liittää aineiston kartografisen sisällön esittämään korkeuden tai vertikaalisen ulottuvuuden mittakaavaan. @fi
label: hat vertikalen Maßstab bei kartografischem Inhalt @de
definition: Setzt eine Ressource in Beziehung zu einem Maßstab der Höhe oder einem vertikalen Maß von kartografischem Inhalt einer Ressource. @de
label: 有地图内容的垂直比例尺 @zh-hans
definition: 将一种资源与资源的地图内容的高度或垂直尺寸的比例尺关联起来。 @zh-hans
label: kartográfiai tartalom függőleges méretaránya a következő: @hu
definition: Hozzákapcsol egy forrást egy kartográfiai tartalom emelkedési vagy függőleges dimenziójának a léptékéhez. @hu
label: kartografik içeriğin dikey ölçeği ile ilişkilidir @tr
definition: Bir kaynağı, kaynağın kartografik içeriğinin yükseklik ölçeği veya dikey boyutuyla ilişkilendirir. @tr

is video adaptation of
status: Published
definition: Relates a resource to a resource that is adapted for video.
type: Property
sub property of: is adaptation of
inverse of: is adapted as video
lexical alias: videoAdaptationOf.en
label: er videobearbejdelse af @da
definition: Relaterer en ressource til en ressource, der er blevet bearbejdet til video. @da
label: is videobewerking van @nl
label: videosovitus aineistosta @fi
label: هو اقتباس فيديوي لـ @ar
definition: يربط بين مصدر ومصدر تم تحويره لفيديو. @ar
definition: Liittää aineiston videolle sovitettuun aineistoon. @fi
label: ist Videobearbeitung von @de
definition: Setzt eine Ressource in Beziehung zu einer Ressource, die als Video bearbeitet ist. @de
label: 是……的视频改编 @zh-hans
definition: 将一种资源与被改编用于视频的一种资源关联起来。 @zh-hans
label: videófeldolgozása a következőnek: @hu
definition: Hozzákapcsol egy forrást egy forráshoz, amelyet videóként adaptáltak. @hu
label: video uyarlaması @tr
definition: Bir kaynağı, video için uyarlanan bir kaynakla ilişkilendirir. @tr

has video characteristic
status: Published
definition: Relates a resource to a technical specification relating to an encoding of video images in a resource.
type: Property
lexical alias: videoCharacteristic.en
label: har videokarakteristika @da
definition: Relaterer en ressource til en teknisk specifikation relateret til kodning af videobilleder i en ressource. @da
label: heeft kenmerken video @nl
label: videon ominaisuudet aineistossa @fi
label: له خاصية فيدبو @ar
definition: يربط بين مصدر ومواصفات فنية متعلقة بتشفير صور فيديو في مصدر. @ar
definition: Liittää aineiston aineiston sisältämän videon koodauksen tekniseen määritykseen. @fi
label: hat Video-Eigenschaft @de
definition: Setzt eine Ressource in Beziehung zu einer technischen Spezifikation, die sich auf die Kodierung der Videobilder in einer Ressource bezieht. @de
label: 视频特征 @zh-hans
definition: 将一种资源与和一种资源中的视频的编码有关的一个技术规格关联起来。 @zh-hans
label: videójellemzője a következő: @hu
definition: Hozzákapcsol egy forrást egy műszaki specifikációhoz, amely egy forrásban a videóképek kódolásához kapcsolódik. @hu
has subproperty: has broadcast standard
has subproperty: has video format
label: video özelliği ile ilişkilidir @tr
definition: Bir kaynağı, bir kaynaktaki video görüntülerinin kodlanmasıyla ilgili teknik özellikler ile ilişkilendirir. @tr

has video format
status: Published
definition: Relates a resource to a schema or standard that is used to encode the analog video content of a resource.
type: Property
sub property of: has video characteristic
lexical alias: videoFormat.en
label: har videoformat @da
definition: Relaterer en ressource til en standard etc., der anvendes til kodning af en ressources analoge videoindhold. @da
label: heeft videoformaat @nl
label: aineiston videoformaatti @fi
label: له شكل فيديو @ar
definition: يربط بين مصدر وخطة أو معيار مستخدم في تشفير محتوى الفيديو التناظري لمصدر. @ar
definition: Liittää aineiston standardiin tai skeemaan, jota on käytetty aineiston analogisen videon sisältöön. @fi
label: hat Videoformat @de
definition: Setzt eine Ressource in Beziehung zu einem Schema oder Standard, das/der zum Kodieren des analogen Videoinhalts einer Ressource verwendet wird. @de
label: 有视频格式 @zh-hans
definition: 将一种资源与用于对一种资源的模拟视频内容进行编码的一个方案或标准关联起来。 @zh-hans
label: videóformátuma a következő: @hu
definition: Hozzákapcsol egy forrást egy sémához vagy szabványhoz, amelyet egy forrás analóg videótartalmának a kódolására használnak. @hu
label: video formatı ile ilişkilidir @tr
definition: Bir kaynağı, bir kaynağın analog video içeriğini kodlamak için kullanılan bir şema veya standartla ilişkilendirir. @tr

is video game adaptation of
status: Published
type: Property
lexical alias: videoGameAdaptationOf.en
definition: Relates a resource to a resource that is adapted as a video game.
inverse of: is adapted as video game
sub property of: is adaptation of
label: er computerspilbearbejdelse af @da
definition: Relaterer en ressource til en ressource, der er blevet bearbejdet som et computerspil. @da
label: is computerspelbewerking van @nl
label: هو اقتباس لعبة فيديو لـ @ar
definition: يربط بين مصدر ومصدر مُقتبس كلعبة فيديو. @ar
label: videopelisovitus (aineisto) @fi
definition: Liittää aineiston aineistoon, joka on sovitettu videopeliksi. @fi
label: ist Videospielbearbeitung von @de
definition: Setzt eine Ressource in Beziehung zu einer Ressource, die als Videospiel bearbeitet ist. @de
label: 是……的视频游戏改编 @zh-hans
definition: 将一种资源与被改编为一种视频游戏的一种资源关联起来。 @zh-hans
label: videójáték-feldolgozása a következőnek: @hu
definition: Hozzákapcsol egy forrást egy forráshoz, amelyet videójátékként adaptáltak. @hu
label: video oyunu uyarlamasıdır @tr
definition: Bir kaynağı, video oyunu olarak uyarlanmış bir kaynakla ilişkilendirir. @tr

has video music
status: Published
definition: Relates a resource to a musical resource that complements a resource that is a video.
type: Property
sub property of: has music
inverse of: is music for video
lexical alias: videoMusic.en
label: er videomusik @da
definition: Relaterer en ressource til en musikressource, der er anvendt i en video. @da
label: heeft videomuziek @nl
label: له موسيقى فيديو @ar
definition: يربط بين مصدر ومصدر موسيقي يُكمل مصدرًا يمثل فيديو. @ar
label: videon musiikki (aineisto) @fi
definition: Liittää aineiston musiikkiaineistoon, joka täydentää videoaineistoa. @fi
label: hat Videomusik @de
definition: Setzt eine Ressource in Beziehung zu einer Musikressource, die ein Video ergänzt. @de
label: 有视频音乐 @zh-hans
definition: 将一种资源与补充作为视频的一种资源的一种音乐资源关联起来。 @zh-hans
label: videozenéje a következő: @hu
definition: Hozzákapcsol egy forrást egy zenei forráshoz, amely kiegészít egy videóforrást. @hu
label: video müziği ile ilişkilidir @tr
definition: Bir kaynağı, video olan bir kaynağı tamamlayan bir müzik kaynağıyla ilişkilendirir. @tr

has video screenplay
status: Published
definition: Relates a resource to a resource that is a textual resource that complements a resource that is a video.
type: Property
sub property of: has screenplay
inverse of: is screenplay for video
lexical alias: videoScreenplay.en
label: er videomanuskript @da
definition: Relaterer en ressource til en ressource, der indeholder teksten til en video. @da
label: heeft videoscenario @nl
label: videon käsikirjoitus (aineisto) @fi
label: له سيناريو فيديو @ar
definition: يربط بين مصدر ومصدر نصي يكمل مصدرًا يمثل فيديو. @ar
definition: Liittää aineiston videoaineistoon, joka käyttää käsikirjoitusta ja jota on täydennetty tekstiteoksella. @fi
label: hat Videodrehbuch @de
definition: Setzt eine Ressource in Beziehung zu einer textlichen Ressource, die ein Video ergänzt. @de
label: 有视频剧本 @zh-hans
definition: 将一种资源与补充作为一种视频的一种资源的作为一种文字资源的一种资源关联起来。 @zh-hans
label: videóforgatókönyve a következő: @hu
definition: Hozzákapcsol egy forrást egy szöveges forráshoz, amely kiegészít egy forrást, ami egy videó. @hu
label: video senaryosu ile ilişkilidir @tr
definition: Bir kaynağı, video olan bir kaynağı tamamlayan metinsel kaynak olan bir kaynakla ilişkilendirir. @tr

is video screenplay based on
status: Published
definition: Relates a resource to a resource that is adapted as a screenplay for a video.
type: Property
sub property of: is screenplay based on
inverse of: is adapted as video screenplay
lexical alias: videoScreenplayBasedOn.en
label: er videobearbejdelse baseret på @da
definition: Relaterer en ressource til en ressource, der er blevet bearbejdet som manuskript til en video. @da
label: is videoscenario gebaseerd op @nl
label: هو سيناريو فيديو معتمد على @ar
definition: يربط بين مصدر ومصدر تم تحويره كسيناريو لفيديو. @ar
label: videokäsikirjoituksen perustana oleva aineisto @fi
definition: Liittää aineiston videokäsikirjoituksen käsikirjoitukseksi sovitettuun aineistoon. @fi
label: ist Videodrehbuch basierend auf @de
definition: Setzt eine Ressource in Beziehung zu einer Ressource, die als Drehbuch für ein Video bearbeitet ist. @de
label: 是基于……的视频剧本 @zh-hans
definition: 将一种资源与被改编为视频剧本的一种资源关联起来。 @zh-hans
label: videóforgatókönyv a következőből: @hu
definition: Hozzákapcsol egy forrást egy forráshoz, amelyet egy videó forgatókönyveként adaptáltak. @hu
label: dayalı olan video senaryosudur @tr
definition: Bir kaynağı, bir video için senaryo olarak uyarlanmış bir kaynakla ilişkilendirir. @tr

has visual effects provider
status: Published
type: Property
lexical alias: visualEffectsProvider.en
definition: Relates a resource to an agent who contributes to a moving image resource by designing and creating post-production visual effects.
inverse of: is visual effects provider of
sub property of: has contributor (Deprecated)
label: har leverandør af visuelle effekter @da
definition: Relaterer en ressource til en agent, der har bidraget til en levende billed-ressource ved at designe og skabe visuelle effekter efter produktionen. @da
label: heeft aanbieder visuele effecten @nl
label: له مُوَرّد للمؤثرات المرئية @ar
definition: يربط مصدر بوكيل يُساهم في مصدر فيلم سينمائي من خلال تصميم وإنشاء مؤثرات مرئية لمرحلة ما بعد الإنتاج. @ar
label: aineiston visuaalisten tehosteiden tekijä @fi
definition: Liittää aineiston toimijaan, joka on osallisena liikkuvan kuvan aineiston tekemisessä suunnittelemalla ja luomalla visuaaliset tehosteet jälkituotantovaiheessa. @fi
label: hat Visual-effects-Provider @de
definition: Setzt eine Ressource in Beziehung zu einem Akteur, der zu einer Bewegtbildressource beiträgt, indem er in der Postproduktion visuelle Effekte entwirft und erstellt. @de
label: 有视觉效果提供者 @zh-hans
definition: 将一种资源与通过设计并创作后制作视觉效果而对一种动态图像资源作出贡献的一个行为者关联起来。 @zh-hans
label: vizuális effektusok szolgáltatója a következő: @hu
definition: Hozzákapcsol egy forrást egy ágenshez, amely hozzájárul egy mozgóképforráshoz azzal, hogy megtervezi és megalkotja az utómunkálati vizuális effektusokat. @hu
label: görsel efekt sağlayıcısı ile ilişkilidir @tr
definition: Bir kaynağı, üretim sonrası görsel efektleri tasarlayarak ve oluşturarak hareketli bir görüntü kaynağına katkıda bulunan bir temsilci ile ilişkilendirir. @tr

is visual effects provider of
status: Published
type: Property
lexical alias: visualEffectsProviderOf.en
definition: Relates an agent to a resource that includes a contribution by an agent of designing and creating post-production visual effects.
inverse of: has visual effects provider
sub property of: is contributor of (Deprecated)
label: er leverandør af visuelle effekter til @da
definition: Relaterer en agent, der har bidraget til en levende billed-ressource ved at designe og skabe visuelle effekter efter produktionen til en ressource. @da
label: is aanbieder visuele effecten van @nl
label: هو مورد للمؤثرات المرئية لـ @ar
definition: يربط بين وكيل ومصدر يتضمن إسهام وكيل في تصميم وإنشاء مؤثرات مرئية لمرحلة ما بعد الإنتاج. @ar
label: visuaalisten tehosteiden tekijä (toimija) aineistossa @fi
label: ist Visual-effects-Provider von @de
definition: Setzt einen Akteur in Beziehung zu einer Ressource, zu der ein Akteur beiträgt, indem er in der Postproduktion visuelle Effekte entwirft und erstellt. @de
definition: Liittää toimijan aineistoon, jonka tekemiseen toimija osallistuu suunnittelemalla ja luomalla visuaaliset tehosteet jälkituotantovaiheessa. @fi
label: 是……的视觉效果提供者 @zh-hans
definition: 将一个行为者与包括设计并创作制作后视觉效果的一个行为者的贡献的一种资源关联起来。 @zh-hans
label: vizuális effektusokat szolgáltatója a következőnek: @hu
definition: Hozzákapcsol egy forrást egy ágenshez, amely magában foglalja az ágens közreműködését utómunkálati vizuális effektusok tervezésében és létrehozásában. @hu
label: görsel efektler sağlayıcısıdır @tr
definition: Bir temsilciyi, yapım sonrası görsel efektleri tasarlayan ve oluşturan bir temsilcinin katkısını içeren bir kaynakla ilişkilendirir. @tr

has voice actor
status: Published
definition: Relates a resource to an agent who is an actor who contributes to a resource by providing the voice for characters in radio and audio productions and for animated characters in moving image resources, as well as by providing voice-overs in radio and television commercials, dubbed resources, etc.
type: Property
sub property of: has actor
inverse of: is voice actor of
lexical alias: voiceActor.en
label: har dubber @da
definition: Relaterer en ressource til en skuespiller, der har bidraget til en ressource ved at lægge stemme til figurer i radio- og audioproduktioner og til animerede figurer i levende billedværker, og ved at indtale tv-reklamer, synkroniserede ressourcer etc. @da
label: heeft stemacteur @nl
label: ääninäyttelijänä aineistossa @fi
label: له مُمثل صوتي @ar
definition: يربط بين مصدر ومؤدِ يُساهم بأحد المصادر من خلال التمثيل الصوتي لشخصيات في الإنتاج الإذاعي والسمعي، وللشخصيات الكرتونية في أعمال الصور المتحركة، إضافة إلى التعليق الصوتي في إعلانات الإذاعة والتليفزيون، والتعبيرات المدبلجة، إلخ. @ar
definition: Liittää toimijan aineistoon, jonka tekemiseen hän osallistuu antamalla äänen hahmoille radio- ja äänituotannoissa ja animoiduille hahmoille elokuva-aineistoissa sekä esiintymällä radio- ja TV-mainoksissa, dubatuissa aineistoissa tms. @fi
label: hat Sprecherin/Sprecher einer Rolle @de
definition: Setzt eine Ressource in Beziehung zu einer Schauspielerin/einem Schauspieler, die/der zu einer Ressource beiträgt, indem sie/er ihre/seine Stimme Charakteren in Hörfunk- und Audioproduktionen und animierten Charakteren in Bewegtbildressourcen leiht, sowie Stimmen in Hörfunk- und Fernsehwerbung, synchronisierten Ressourcen und so weiter spricht. @de
label: 有声音演员 @zh-hans
definition: 将一种资源与作为演员通过为在广播和音频制作中的角色和为动态图像资源中的动画角色提供人声以及为广播和电视广告、混声资源等提供画外音而对一种资源有贡献的一个行为者关联起来。 @zh-hans
definition: Relaciona un recurs amb un agent que és un actor que contribueix a un recurs prestant la seva veu als personatges de les produccions radiofòniques i d’àudio i als personatges animats de les obres d’imatge en moviment, així com les veus en off dels anuncis publicitaris de ràdio i televisió, en les expressions doblades, etc. @ca
label: szinkronszínésze a következő: @hu
definition: Hozzákapcsol egy forrást egy előadóhoz, aki hozzájárul egy forráshoz azzal, hogy rádió- és audió-produkciók szereplőinek, mozgóképforrások animált karaktereinek adja hangját, valamint rádiós és televíziós reklámokban, szinkronizált forrásokban stb. hangalámondást szolgáltat. @hu
label: seslendirme sanatçısı ile ilişkilidir @tr
definition: Bir kaynağı, radyo ve ses yapımlarındaki karakterler ve hareketli görüntü kaynaklarındaki animasyon karakterler için ses sağlayarak ve ayrıca radyo ve televizyon reklamlarında, dublajlı kaynaklarda vb. seslendirmeler yaparak bir kaynağa katkıda bulunan bir sanatçı ile ilişkilendirir. @tr

is voice actor of
status: Published
definition: Relates an agent to a resource that includes a contribution by an agent of providing the voice for characters in radio and audio productions and for animated characters in moving image resources, as well as voice-overs in radio and television commercials, dubbed resources, etc.
type: Property
sub property of: is actor of
inverse of: has voice actor
lexical alias: voiceActorOf.en
label: er dubber i @da
definition: Relaterer en skuespiller, der har bidraget til en ressource ved at lægge stemme til figurer i radio- og audioproduktioner og til animerede figurer i levende billed-ressourcer, og ved at indtale voice-overs i radio- og tv-reklamer, eftersynkroniserede ressourcer etc. til en ressource. @da
label: is stemacteur van @nl
label: ääninäyttelijänä aineistossa @fi
label: هو مُمثل صوتي لـ @ar
definition: يربط بين وكيل ومصدر يتضمن إسهام وكيل بالتمثيل الصوتي لشخصيات في الإنتاج الإذاعي والسمعي وللشخصيات الكرتونية في أعمال الصور المتحركة، إضافة إلى التعليق الصوتي في إعلانات الإذاعة والتليفزيون، والتعبيرات المدبلجة...إلخ. @ar
definition: Liittää toimijan aineistoon, jonka tekemiseen hän osallistuu antamalla äänen hahmoille radio- ja äänituotannoissa ja animoiduille hahmoille elokuva-aineistoissa sekä esiintymällä radio- ja TV-mainoksissa, dubatuissa aineistoissa tms. @fi
label: ist Sprecherin/Sprecher einer Rolle von @de
definition: Setzt einen Akteur in Beziehung zu einer Ressource, zu der ein Akteur beiträgt, indem er seine Stimme Charakteren in Hörfunk- und Audioproduktionen und animierten Charakteren in Bewegtbildwerken leiht und Begleitkommentare in Hörfunk- oder Fernsehwerbung, untertitelten Expressionen und so weiter zur Verfügung stellt. @de
label: 是……的声音演员 @zh-hans
definition: 将一个行为者与包括为在广播和音频制作中的角色和为动态图像作品中的动画角色提供人声以及为广播和电视广告提供画外音、配音等的一个行为者的贡献的一种资源关联起来。 @zh-hans
label: szinkronszínésze a következőnek: @hu
definition: Hozzákapcsol egy ágenst egy forráshoz, amely magában foglalja egy ágens közreműködését azzal, hogy rádió- és audió-produkciók szereplőinek, mozgóképforrások animált karaktereinek adja hangját, valamint rádiós és televíziós reklámokban, szinkronizált forrásokban stb. hangátvitelt szolgáltat. @hu
label: Seslendirme sanatçısıdır @tr
definition: Bir temsilciyi, radyo ve ses yapımlarındaki karakterler ve hareketli görüntü kaynaklarındaki animasyon karakterlerini seslendirmenin yanı sıra radyo ve televizyon reklamlarındaki seslendirmeler, dublajlı ifadeler vb. konusunda ses veren bir temsilcinin katkısını içeren bir kaynakla ilişkilendirir. @tr

has whole-part resource relationship with (Deprecated)
status: Deprecated
type: Property
definition: Relates a resource to a resource that is contained in or contains a related resource. (Deprecated)
lexical alias: wholePartResourceRelationshipWith.en
label: har helhed-del-ressource-relation med @da
definition: Relaterer en ressource til en ressource, der indgår i, eller indeholder en ressouce. @da
has subproperty: is part of resource
has subproperty: has part resource

has writer of added commentary (Deprecated)
status: Deprecated
definition: Relates a resource to an agent who contributes to a resource by providing an interpretation or critical explanation of an original resource. (Deprecated)
type: Property
sub property of: has writer of supplementary textual content (Deprecated)
inverse of: is writer of added commentary of (Deprecated)
lexical alias: writerOfAddedCommentary.en
label: har forfatter til tilføjet kommentar @da
definition: Relaterer en ressource til en agent, der har bidraget til en ressource ved at tilvejebringe en fortolkning eller kritik af en original ressource. @da

is writer of added commentary of (Deprecated)
status: Deprecated
definition: Relates an agent to a resource that includes a contribution of providing an interpretation or critical explanation. (Deprecated)
type: Property
sub property of: is writer of supplementary content of (Deprecated)
inverse of: has writer of added commentary (Deprecated)
lexical alias: writerOfAddedCommentaryOf.en
label: er forfatter til tilføjet kommentar til @da
definition: Relaterer en agent, der har bidraget til en ressource ved at sørge for en fortolkning eller kritisk forklaring af en oprindelig ressource til en ressource. @da

has writer of added lyrics (Deprecated)
status: Deprecated
definition: Relates a resource to a writer of words added to a musical resource. (Deprecated)
type: Property
sub property of: has writer of added text (Deprecated)
inverse of: is writer of added lyrics of (Deprecated)
lexical alias: writerOfAddedLyrics.en
scope note: Writing of lyrics in collaboration with a composer to form an original resource is excluded.. (Deprecated)
see also: has lyricist
label: har forfatter af tilføjede sangtekster @da
definition: Relaterer en ressource til en forfatter af ord, der er tilføjet en musikressource. @da
scope note: Forfattelse af sangtekster i samarbejde med en komponist for at skabe en originalressource er ikke omfattet. @da

is writer of added lyrics of (Deprecated)
status: Deprecated
definition: Relates an agent to a resource that includes a contribution of adding written words to music. (Deprecated)
type: Property
sub property of: is writer of added text of (Deprecated)
inverse of: has writer of added lyrics (Deprecated)
lexical alias: writerOfAddedLyricsOf.en
scope note: Writing of lyrics in collaboration with a composer to form an original resource is excluded.. (Deprecated)
see also: is lyricist of
label: er forfatter af tilføjede sangtekster til @da
definition: Relaterer en forfatter af ord, der er tilføjet til en musikressource til en ressource. @da
scope note: Forfattelse af sangtekster i samarbejde med en komponist for at skabe en originalressource er ikke omfattet. @da

has writer of added text (Deprecated)
status: Deprecated
definition: Relates a resource to an agent who contributes to a primarily non-textual resource by providing text, such as writing captions for photographs or descriptions of maps. (Deprecated)
type: Property
sub property of: has writer of supplementary textual content (Deprecated)
inverse of: is writer of added text of (Deprecated)
lexical alias: writerOfAddedText.en
label: har forfatter af tilføjet tekst @da
definition: Relaterer en ressource til en agent, der har bidraget til en ressource af et fortrinsvist ikke-tekstmæssigt værk ved at tilvejebringe tekst til den ikke-tekstmæssige ressource, fx ved at skrive billedtekster til fotos, beskrivelser af kort. @da
has subproperty: has writer of added lyrics (Deprecated)

is writer of added text of (Deprecated)
status: Deprecated
definition: Relates an agent to a resource that includes a contribution of adding text, such as captions for photographs or descriptions of maps. (Deprecated)
type: Property
sub property of: is writer of supplementary content of (Deprecated)
inverse of: has writer of added text (Deprecated)
lexical alias: writerOfAddedTextOf.en
label: er forfatter til tilføjet tekst til @da
definition: Relaterer en agent der har bidraget til et udtryk af en fortrinsvisikke-tekstlig ressource ved at sørge for tekst til den ikke-tekstlige ressource til en ressource. @da
has subproperty: is writer of added lyrics of (Deprecated)

has writer of afterword (Deprecated)
status: Deprecated
definition: Relates a resource to an agent who contributes to a resource by providing an afterword to an original resource. (Deprecated)
type: Property
sub property of: has writer of supplementary textual content (Deprecated)
inverse of: is writer of preface of (Deprecated)
lexical alias: writerOfAfterword.en
label: har forfatter af efterord @da
definition: Relaterer en ressource til en agent, der har bidraget til en ressource ved at tilvejebringe et efterskrift til en originalressource. @da

is writer of preface of (Deprecated)
status: Deprecated
definition: Relates an agent to a resource that includes a contribution of providing an afterword. (Deprecated)
type: Property
sub property of: is writer of supplementary content of (Deprecated)
inverse of: has writer of afterword (Deprecated)
lexical alias: writerOfAfterwordOf.en
label: er forfatter til efterord til @da
definition: Relaterer en agent der har bidraget til en ressource ved at sørge for et efterord til en oprindelig ressource til en ressource. @da

has writer of foreword (Deprecated)
status: Deprecated
type: Property
lexical alias: writerOfForeword.en
definition: Relates a resource to an agent who contributes to a resource by providing a foreword to an original resource. (Deprecated)
inverse of: is writer of foreword of (Deprecated)
sub property of: has contributor (Deprecated)
label: har forfatter til indledning @da
definition: Relaterer en ressource til en agent, der har bidraget til en ressource ved at tilvejebringe en indledning til den originale ressource. @da

is writer of foreword of (Deprecated)
status: Deprecated
type: Property
lexical alias: writerOfForewordOf.en
definition: Relates an agent to a resource that includes a contribution of providing a foreword. (Deprecated)
inverse of: has writer of foreword (Deprecated)
sub property of: is contributor of (Deprecated)
label: er forfatter til indledning til @da
definition: Relaterer en agent, der bidrager til en ressource ved at skrive en indledning til en oprindelig ressource til en ressource. @da

has writer of introduction (Deprecated)
status: Deprecated
definition: Relates a resource to an agent who contributes to a resource by providing an introduction to an original resource. (Deprecated)
type: Property
sub property of: has writer of supplementary textual content (Deprecated)
inverse of: is writer of afterword of (Deprecated)
lexical alias: writerOfIntroduction.en
label: har forfatter til introduktion @da
definition: Relaterer en ressource til en agent, der har bidraget til en ressource ved at tilvejebringe en introduktion til en original ressource. @da

is writer of afterword of (Deprecated)
status: Deprecated
definition: Relates an agent to a resource that includes a contribution of providing an introduction. (Deprecated)
type: Property
sub property of: is writer of supplementary content of (Deprecated)
inverse of: has writer of introduction (Deprecated)
lexical alias: writerOfIntroductionOf.en
label: er forfatter til introduktion til @da
definition: Relaterer en agent, der har bidraget til en ressource ved at sørge for en indledning til en oprindelig ressource til en ressource. @da

has writer of postface (Deprecated)
status: Deprecated
definition: Relates a resource to an agent who contributes to a resource by providing a postface to an original resource. (Deprecated)
type: Property
sub property of: has writer of supplementary textual content (Deprecated)
inverse of: is writer of postface of (Deprecated)
lexical alias: writerOfPostface.en
label: har forfatter af efterskrift @da
definition: Relaterer en ressource til en agent, der har bidraget til en ressource ved at tilvejebringe et efterskrift til en originalressource. @da

is writer of postface of (Deprecated)
status: Deprecated
definition: Relates an agent to a resource that includes a contribution of providing a postface. (Deprecated)
type: Property
sub property of: is writer of supplementary content of (Deprecated)
inverse of: has writer of postface (Deprecated)
lexical alias: writerOfPostfaceOf.en
label: er forfatter til efterskrift til @da
definition: Relaterer en agent, der har bidraget til een ressource ved at sørge for en efterskrift til en oprindelig ressource til en ressource. @da

has writer of preface (Deprecated)
status: Deprecated
definition: Relates a resource to an agent who contributes to a resource by providing a preface to an original resource. (Deprecated)
type: Property
sub property of: has writer of supplementary textual content (Deprecated)
inverse of: is writer of introduction of (Deprecated)
lexical alias: writerOfPreface.en
label: har forfatter til forord @da
definition: Relaterer en ressource til en agent, der har bidraget til en ressource ved at tilvejebringe et forord til en original ressource. @da

is writer of introduction of (Deprecated)
status: Deprecated
definition: Relates an agent who contributes to a resource by providing an introduction to an original resource to a resource. (Deprecated)
type: Property
sub property of: is writer of supplementary content of (Deprecated)
inverse of: has writer of preface (Deprecated)
lexical alias: writerOfPrefaceOf.en
label: er forfatter til forord til @da
definition: Relaterer en agent, der har bidraget til en ressource ved at sørge for et forord til den originale ressource til en ressource. @da

has writer of supplementary textual content (Deprecated)
status: Deprecated
definition: Relates a resource to an agent who contributes to a resource by providing supplementary textual content (e.g., an appendix, an introduction, a preface) to an original resource. (Deprecated)
type: Property
sub property of: has contributor (Deprecated)
inverse of: is writer of supplementary content of (Deprecated)
lexical alias: writerOfSupplementaryTextualContent.en
label: har forfatter til supplerende tekstindhold @da
definition: Relaterer en ressource til en agent, der har bidraget til en ressource ved at tilvejebringe supplerende tekstindhold, fx en indledning eller et forord til en original ressource. @da
has subproperty: has writer of added commentary (Deprecated)
has subproperty: has writer of added text (Deprecated)
has subproperty: has writer of afterword (Deprecated)
has subproperty: has writer of introduction (Deprecated)
has subproperty: has writer of postface (Deprecated)
has subproperty: has writer of preface (Deprecated)

is writer of supplementary content of (Deprecated)
status: Deprecated
definition: Relates an agent to a resource that includes a contribution of providing supplementary textual content such as an introduction or a preface. (Deprecated)
type: Property
sub property of: is contributor of (Deprecated)
inverse of: has writer of supplementary textual content (Deprecated)
lexical alias: writerOfSupplementaryTextualContentOf.en
label: er forfatter til supplerende tekstindhold til @da
definition: Relaterer en agent, der har bidraget til en ressource ved at sørge for supplerende tekstindhold, som fx en indledning eller et forord til en oprindeligg ressource til en ressource. @da
has subproperty: is writer of added commentary of (Deprecated)
has subproperty: is writer of added text of (Deprecated)
has subproperty: is writer of preface of (Deprecated)
has subproperty: is writer of afterword of (Deprecated)
has subproperty: is writer of postface of (Deprecated)
has subproperty: is writer of introduction of (Deprecated)

has year degree granted
status: Published
definition: Relates a resource to a timespan during which an academic degree is conferred by a granting institution or faculty.
type: Property
lexical alias: yearDegreeGranted.en
label: har år, hvor grad er tildelt @da
definition: Relaterer en ressource til et kalenderår, hvor en institution eller et fakultet har tildelt en kandidat en akademisk grad. @da
sub property of: has date of resource
inverse of: is year degree granted of
label: heeft jaar graad toegekend @nl
label: له عام منح درجة @ar
definition: يربط بين مصدر وفترة زمنية يتم خلالها منح درجة أكاديمية من قبل مؤسسة مانحة أو هيئة تدريس. @ar
label: tutkinnon myöntämisvuosi @fi
definition: Liittää aineiston ajanjaksoon, jolloin laitos tai tiedekunta on myöntänyt akateemisen oppiarvon. @fi
label: hat Jahr, in dem ein akademischer Grad verliehen wird @de
definition: Setzt eine Ressource in Beziehung zu einem Zeitraum, in dem ein akademischer Grad, der mit einer Hochschulschrift in Verbindung steht, von einer Institution oder Fakultät verliehen wird. @de
label: 有学位授予年份 @zh-hans
definition: 将一种资源与一个授予机构或院系在期间授予一个学位的一个时间段关联起来。 @zh-hans
label: fokozatszerzési éve a következő: @hu
definition: Hozzákapcsol egy forrást egy időtartamhoz, amelyben egy adományozó intézmény vagy kar tudományos fokozatot adott egy jelöltnek. @hu
label: akademik derecenin verildiği yıl ile ilişkilidir @tr
definition: Bir kaynağı, derece veren bir kurum veya fakülte tarafından akademik derecenin verildiği bir zaman aralığı ile ilişkilendirir. @tr

is year degree granted of
status: Published
lexical alias: yearDegreeGrantedOf.en
definition: Relates a timespan to a resource that is an academic degree conferred by a granting institution or faculty during a timespan.
type: Property
inverse of: has year degree granted
label: is jaar graad toegekend van @nl
label: هو عام منح درجة لـ @ar
definition: يربط بين فترة زمنية ومصدر هو عبارة عن درجة أكاديمية مُنحت بواسطة معهد أو كلية مانحة خلال فترة زمنية. @ar
label: er årstal for tildelning af grad af @da
definition: Relaterer et tidsforløb til en ressource, som er en akademisk grad, tildelt af en gradtildelende institution eller fakultet under et tidsforløb. @da
label: oppiarvon myöntämisvuosi @fi
definition: Liittää ajanjakson aineistoon, joka on opinnäyte, joka liittyy laitoksen tai tiedekunnan ajanjakson aikana myöntämään akateemiseen oppiarvoon. @fi
label: ist Jahr, in dem ein akademischer Grad verliehen wird von @de
definition: Setzt einen Zeitraum in Beziehung zu einer Hochschulschrift, für die in einem Zeitraum ein akademischer Grad von einer Institution oder Fakultät verliehen wird. @de
label: 是……的学位授予年 @zh-hans
definition: 将一个时间段与作为一种和在一个时间段内由授予机构或授予院系授予之学位的一种资源关联起来。 @zh-hans
label: évben fokozatott kapott a következő: @hu
definition: Hozzákapcsol egy időtartamot egy forráshoz, amely egy tudományos fokozat, amelyet egy időtartam alatt egy adományozó intézmény vagy kar adott. @hu
label: derecesinin verildiği yıldır @tr
definition: Bir zaman aralığını, bir zaman aralığında derece veren bir kurum veya fakülte tarafından verilen bir akademik derece olan bir kaynakla ilişkilendirir. @tr

Published
type: Concept

Deprecated
type: Concept

has access point for agent
status: Published
definition: Relates an agent to a nomen that is an appellation of agent in natural language that is taken from a vocabulary encoding scheme or is constructed using a string encoding scheme.
type: Property
lexical alias: accessPointForAgent.en
inverse of: is access point for agent of
sub property of: has access point for entity
label: heeft ingang voor actor @nl
label: له نقطة إتاحة لوكيل @ar
definition: يربط بين وكيل وتسمية لوكيل في اللغة الطبيعية المأخوذة من مخطط ترميز مفردات أو أنشئت باستخدام خطة ترميز سلسلة تمثيلات. @ar
label: har søgeindgang for agent @da
definition: Relaterer en agent til en benævnelse på agent på naturligt sprog, der er hentet fra et vokabularkodningsskema eller er konstrueret ved brug af et strengkodningsskema. @da
label: hakutieto toimijalle @fi
definition: Liittää toimijan luonnollisen kielen mukaiseen nimitykseen, joka on otettu jostakin sanaston merkintäjärjestelmästä tai muodostettu jotakin merkkijonon merkintäjärjestelmää käyttäen. @fi
label: hat Sucheinstieg für einen Akteur @de
definition: Setzt einen Akteur in Beziehung zu einer Bezeichnung für einen Akteur in natürlicher Sprache, die einem Vocabulary Encoding Scheme entnommen oder mit einem String Encoding Scheme konstruiert wird. @de
label: 有行为者的检索点 @zh-hans
definition: 将一个行为者与作为一个行为者的称谓、取自一个词表编码体系或者用一个串编码体系构建、用自然语言的一个命名关联起来。 @zh-hans
definition: Relaciona un agent amb un nomen que és una apel·lació d’agent en llenguatge natural que s’obté d’un esquema de codificació de vocabulari o s’elabora usant un esquema de codificació de cadenes. @ca
label: hozzáférési pontja ágenshez a következő: @hu
definition: Hozzákapcsol egy ágenst egy ágens olyan természetes nyelvű megnevezéséhez, amely egy szótárkódolási sémából származik, vagy egy karakterlánc-kódolási séma használatával szerkesztett. @hu
label: temsilci için erişim noktası ile ilişkilidir @tr
definition: Bir temsilciyi, bir kelime kodlama şemasından alınan veya bir dize kodlama şeması kullanılarak oluşturulan doğal dildeki bir temsilci unvanıyla ilişkilendirir. @tr

has access point for place
status: Published
definition: Relates a place to a nomen that is an appellation of place in natural language that is taken from a vocabulary encoding scheme or is constructed using a string encoding scheme.
type: Property
lexical alias: accessPointForPlace.en
inverse of: is access point for place of
sub property of: has access point for entity
label: heeft ingang voor plaats @nl
label: له نقطة وصول لمكان @ar
definition: يربط بين مكان وتسمية لمكان في اللغة الطبيعية المأخوذة من مخطط ترميز مفردات أو أنشئت باستخدام خطة ترميز سلسلة تمثيلات. @ar
label: har søgeindgang for sted @da
definition: Relaterer et sted til en benævnelse for sted på naturligt sprog, der er hentet fra et vokabularkodningsskema eller er konstrueret ved brug af et strengkodningsskema. @da
label: hakutieto paikalle @fi
definition: Liitää paikan luonnollisella kielellä olevaan paikan nimitykseen, joka on otettu jostakin sanaston merkintäjärjestelmästä tai muodostettu jotakin merkkijonon merkintäjärjestelmää käyttäen. @fi
label: hat Sucheinstieg für ein Geografikum @de
definition: Setzt ein Geografikum in Beziehung zu einer Bezeichnung für ein Geografikum in natürlicher Sprache, die einem Vocabulary Encoding Scheme entnommen oder mit einem String Encoding Scheme konstruiert wird. @de
label: 有地点的检索点 @zh-hans
definition: 将一个地点与作为一个地点的称谓、取自一个词表编码体系或者用一个串编码体系构建、用自然语言的一个命名关联起来。 @zh-hans
definition: Relaciona un lloc amb un nomen que és una apel·lació de lloc en llenguatge natural que s’obté d’un esquema de codificació de vocabulari o s’elabora usant un esquema de codificació de cadenes. @ca
label: hozzáférési pontja helyhez a következő: @hu
definition: Hozzákapcsol egy helyet egy hely szótárkódolási sémából vett vagy karakterlánc-kódolási séma felhasználásával konstruált természetes nyelvi megnevezéséhez. @hu
label: yer için erişim noktası ile ilişkilidir @tr
definition: Bir yeri, bir kelime kodlama şemasından alınan veya bir dize kodlama şeması kullanılarak oluşturulan yerel dildeki bir yer adıyla ilişkilendirir. @tr

has access point for resource
status: Published
definition: Relates a resource to a nomen that is an appellation of resource in natural language that is taken from a vocabulary encoding scheme or is constructed using a string encoding scheme.
type: Property
lexical alias: accessPointForResource.en
inverse of: is access point for resource of
sub property of: has access point for entity
label: heeft ingang voor resource @nl
label: له نقطة وصول لمصدر @ar
definition: يربط بين مصدر وتسمية مصدر في لغة طبيعية مأخوذة من خطة ترميز مفردات أو مبنية باستخدام خطة ترميز سلسلة تمثيلات. @ar
label: har søgeindgang for ressource @da
definition: Relaterer en ressource til en ressourcebenævnelse på naturligt sprog, der er hentet fra et vokabularkodningsskema eller er konstrueret ved brug af et strengkodningsskema. @da
label: hakutieto aineistolle @fi
definition: Liitää aineiston luonnollisella kielellä olevaan aineiston nimitykseen, joka on otettu jostakin sanaston merkintäjärjestelmästä tai muodostettu jotakin merkkijonon merkintäjärjestelmää käyttäen. @fi
label: hat Sucheinstieg für eine Ressource @de
definition: Setzt eine Ressource in Beziehung zu einer Bezeichnung für eine Ressource in natürlicher Sprache, die einem Vocabulary Encoding Scheme entnommen oder mit einem String Encoding Scheme konstruiert wird. @de
label: 有资源的检索点 @zh-hans
definition: 将一种资源与作为一种资源的称谓、取自一个词表编码体系或者用一个串编码体系构建、用自然语言的一个命名关联起来。 @zh-hans
definition: Relaciona un recurs amb un nomen que és una apel·lació de recurs en llenguatge natural que s’obté d’un esquema de codificació de vocabulari o s’elabora usant un esquema de codificació de cadenes. @ca
label: hozzáférési pont forráshoz a következő: @hu
definition: Hozzákapcsol egy forrást egy forrás, szótárkódolási sémából vett vagy karakterlánc-kódolási séma felhasználásával konstruált, természetes nyelvi megnevezéséhez. @hu
label: kaynak için erişim noktası ile ilişkilidir @tr
definition: Bir kaynağı, bir kelime kodlama şemasından alınan veya bir dizi kodlama şeması kullanılarak oluşturulan doğal dildeki bir kaynak unvanıyla ilişkilendirir. @tr

has access point for timespan
status: Published
definition: Relates a timespan to a nomen that is an appellation of timespan in natural language that is taken from a vocabulary encoding scheme or is constructed using a string encoding scheme.
type: Property
lexical alias: accessPointForTimespan.en
inverse of: is access point for timespan of
sub property of: has access point for entity
label: heeft ingang voor tijdspanne @nl
label: له نقطة وصول لفترة زمنية لـ @ar
definition: يربط بين فترة زمنية وتسمية لفترة زمنية في لغة طبيعية مأخوذة من خطة ترميز مفردات أو مبنية باستخدام خطة ترميز سلسلة تمثيلات. @ar
label: har søgeindgang for tidsforløb @da
definition: Relaterer et tidsforløb til en benævnelse på tidsforløb på naturligt sprog, der er hentet fra et vokabularkodninggskema eller er konstrueret ved brug af et strengkodningsskema. @da
label: hakutieto ajanjaksolle @fi
definition: Liittää ajanjakson luonnollisen kielen mukaiseen ajanjakson nimitykseen, joka on otettu jostakin sanaston merkintäjärjestelmästä tai muodostettu jotakin merkkijonon merkintäjärjestelmää käyttäen. @fi
label: hat Sucheinstieg für einen Zeitraum @de
definition: Setzt einen Zeitraum in Beziehung zu einer Bezeichnung für einen Zeitraum in natürlicher Sprache, die einem Vocabulary Encoding Scheme entnommen oder mit einem String Encoding Scheme konstruiert wird. @de
label: 有时间段的检索点 @zh-hans
definition: 将一个时间段与取自一个词表编码体系或者用一个串编码体系构建的一个时间段用自然语言的称谓的一个命名关联起来。 @zh-hans
definition: Relaciona un interval de temps amb un nomen que és una apel·lació d’interval de temps en llenguatge natural que s’obté d’un esquema de codificació de vocabulari o s’elabora usant un esquema de codificació de cadenes. @ca
label: hozzáférési pontja időtartamhoz a következő: @hu
definition: Hozzákapcsol egy időtartamot egy időtartam szótárkódolási sémából vett vagy karakterlánc-kódolási séma felhasználásával konstruált természetes nyelvi megnevezéshez. @hu
label: zaman aralığı için erişim noktası ile ilişkilidir @tr
definition: Bir zaman aralığını, bir kelime kodlama şemasından alınan veya bir dizi kodlama şeması kullanılarak oluşturulan doğal dildeki bir zaman aralığının unvanıyla ilişkilendirir. @tr

has authorized access point for agent
status: Published
definition: Relates an agent to an access point for agent that is selected for preference in a specific vocabulary encoding scheme.
type: Property
lexical alias: authorizedAccessPointForAgent.en
inverse of: is authorized access point for agent of
sub property of: has authorized access point for entity
label: heeft geautoriseerde ingang voor actor @nl
label: له نقطة اتاحة مقننة لوكيل @ar
definition: يربط بين وكيل ونقطة إتاحة لوكيل اُختيرت نقطة اتاحة مقننة مُفضلة في خطة ترميز مفردات محددة. @ar
label: har autoriseret søgeindgang for agent @da
definition: Relaterer en agent til en søgeindgang for agent, der er valgt som foretrukken i et særskit vokabularkodningsskema. @da
label: auktorisoitu hakutieto toimijalle @fi
definition: Liittää toimijan hakutietoon, joka on valittu toimijalle ensisijaiseksi tietyssä sanaston merkintäjärjestelmässä. @fi
label: hat normierten Sucheinstieg für einen Akteur @de
definition: Setzt einen Akteur in Beziehung zu einem Sucheinstieg für einen Akteur, der in einem bestimmten Vocabulary Encoding Scheme als Vorzugsform bestimmt wird. @de
label: 有行为者的规范检索点 @zh-hans
definition: 将一个行为者与在一个特定的词表编码体系中被首选的一个行为者检索点关联起来。 @zh-hans
label: autorizált hozzáférési pont ágenshez a következő: @hu
definition: Hozzákapcsol egy ágenst egy ágens hozzáférési pontjához, amelyet egy adott szótárkódolási sémából választanak ki előnyben részesítettként. @hu
label: temsilci için yetkili erişim noktası ile ilişkilidir @tr
definition: Bir temsilciyi, belirli bir kelime kodlama şemasında tercih edilmek üzere seçilen temsilcinin erişim noktasıyla ilişkilendirir. @tr

has authorized access point for place
status: Published
definition: Relates a place to an access point for place that is selected for preference in a specific vocabulary encoding scheme.
type: Property
lexical alias: authorizedAccessPointForPlace.en
inverse of: is authorized access point for place of
sub property of: has authorized access point for entity
label: heeft geautoriseerde ingang voor plaats @nl
label: له نقطة إتاحة مقننة لمكان @ar
definition: يربط بين مكان ونقطة إتاحة لمكان اُختيرت نقطة اتاحة مقننة مُفضلة في خطة ترميز مفردات محددة. @ar
label: har autoriseret søgeindgang for sted @da
definition: Relaterer et sted til en søgeindgang for sted, der er valgt som foretrukken i et særskilt vokabularkodningsskema. @da
label: auktorisoitu hakutieto paikalle @fi
definition: Liittää paikan hakutietoon, joka on valittu paikalle ensisijaiseksi tietyssä sanaston merkintäjärjestelmässä. @fi
label: hat normierten Sucheinstieg für ein Geografikum @de
definition: Setzt ein Geografikum in Beziehung zu einem Sucheinstieg für ein Geografikum, der in einem bestimmten Vocabulary Encoding Scheme als Vorzugsform bestimmt wird. @de
label: 有地点的规范检索点 @zh-hans
definition: 将一个地点与在一个特定的词表编码体系中被首选的一个地点检索点关联起来。 @zh-hans
label: autorizált hozzáférési pont helyhez a következő: @hu
definition: Hozzákapcsol egy helyet egy hely hozzáférési pontjához, amelyet egy adott szótárkódolási sémából választanak ki előnyben részesítettként. @hu
label: yer için yetkili erişim noktası ile ilişkilidir @tr
definition: Bir yeri, belirli bir kelime kodlama şemasında tercih edilmek üzere seçilen yer için yetkili erişim noktasıyla ilişkilendirir. @tr

has authorized access point for resource
status: Published
definition: Relates a resource to an access point for resource that is selected for preference in a specific vocabulary encoding scheme.
type: Property
lexical alias: authorizedAccessPointForResource.en
inverse of: is authorized access point for resource of
sub property of: has authorized access point for entity
label: heeft geautoriseerde ingang voor resource @nl
label: له نقطة إتاحة مقننة لمصدر @ar
definition: يربط بين مصدر ونقطة إتاحة لمصدر اُختيرت نقطة اتاحة مقننة مُفضلة في خطة ترميز مفردات محددة. @ar
label: har autoriseret søgeindgang for ressource @da
definition: Relaterer en ressource til en søgeindgang for ressource, der er valgt som foretrukken i et særskilt vokabularkodningsskema. @da
label: auktorisoitu hakutieto toimijalle @fi
definition: Liittää aineiston hakutietoon, joka on valittu aineistolle ensisijaiseksi tietyssä sanaston merkintäjärjestelmässä. @fi
label: hat normierten Sucheinstieg für eine Ressource @de
definition: Setzt eine Ressource in Beziehung zu einem Sucheinstieg für eine Ressource, der in einem bestimmten Vocabulary Encoding Scheme als Vorzugsform bestimmt wird. @de
label: 有资源的规范检索点 @zh-hans
definition: 将一种资源与在一个特定的词表编码体系中被首选的一个资源检索点关联起来。 @zh-hans
label: autorizált hozzáférési pont forráshoz a következő: @hu
definition: Hozzákapcsol egy forrást egy forrás hozzáférési pontjához, amelyet egy adott szótárkódolási sémából választanak ki előnyben részesítettként. @hu
label: kaynak için yetkili erişim noktası ile ilişkilidir @tr
definition: Bir kaynağı, belirli bir kelime kodlama şemasında tercih edilmek üzere seçilmiş kaynağın erişim noktası ile ilişkilendirir. @tr

has authorized access point for timespan
status: Published
definition: Relates a timespan to an access point for timespan that is selected for preference in a specific vocabulary encoding scheme.
type: Property
lexical alias: authorizedAccessPointForTimespan.en
inverse of: is authorized access point for timespan of
sub property of: has authorized access point for entity
label: heeft geautoriseerde ingang voor tijdspanne @nl
label: له نقطة إتاحة مقننة لفترة زمنية @ar
definition: يربط بين فترة زمنية ونقطة إتاحة لفترة زمنية اُختيرت نقطة اتاحة مقننة مُفضلة في خطة ترميز مفردات محددة. @ar
label: har autoriseret søgeindgang for tidsforløb @da
definition: Relaterer et tidsforløb for en søgeindgang til et tidsforløb, der er valgt som foretrukken i et særskilt vokabularkodingsskema. @da
definition: Liittää ajanjakson hakutietoon, joka on valittu ajanjaksolle ensisiaiseksi tietyssä sanaston merkintäjärjestelmässä. @fi
label: hat normierten Sucheinstieg für einen Zeitraum @de
definition: Setzt einen Zeitraum in Beziehung zu einem Sucheinstieg für einen Zeitraum, der in einem bestimmten Vocabulary Encoding Scheme als Vorzugsform bestimmt wird. @de
label: ajanjakson auktorisoitu hakutieto @fi
label: 有时间段的规范检索点 @zh-hans
definition: 将一个时间段与在一个特定的词表编码体系中被首选的一个时间段检索点关联起来。 @zh-hans
label: autorizált hozzáférési pont időtartamhoz a következő: @hu
definition: Hozzákapcsol egy időtartamot egy időtartam hozzáférési pontjához, amelyet egy adott szótárkódolási sémából választanak ki előnyben részesítettként. @hu
label: zaman aralığı için yetkili erişim noktası ile ilişkilidir @tr
definition: Bir zaman aralığını, belirli bir kelime kodlama şemasında tercih için seçilmeyen bir zaman aralığı için erişim noktasıyla ilişkilendirir. @tr

has colour
status: Published
definition: Relates a resource to a categorization reflecting a hue of the visual content of a resource.
type: Property
lexical alias: colour.en
label: heeft kleur @nl
label: له لون @ar
definition: يربط بين مصدر وفئة تعكس تدرجًا للمحتوى المرئي لمصدر. @ar
label: har farve @da
definition: Relaterer en ressouree til en kategorisering, som afspejler en nyance af det visuelle indhold af en ressource. @da
label: aineiston väri @fi
definition: Liittää aineiston kategorisointiin, joka ilmaisee aineiston visuaalisen sisällön värisävyn. @fi
label: hat Farbe @de
definition: Setzt eine Ressource in Beziehung zu einer Kategorisierung, die einen Farbton des bildlichen Inhalts einer Expression widerspiegelt. @de
label: 有颜色 @zh-hans
definition: 将一种资源与反映一种资源的视觉内容的色调的一个分类关联起来。 @zh-hans
label: a színe a következő: @hu
definition: Hozzákapcsol egy forrást egy forrás vizuális tartalmának színárnyalatát tükröző kategorizáláshoz. @hu
label: renk ile ilişkilidir @tr
definition: Bir kaynağı, kaynağın görsel içeriğinin tonunu yansıtan bir sınıflandırmayla ilişkilendirir. @tr

has identifier for place
status: Published
definition: Relates a place to a nomen that is an appellation of place that consists of a code, number, or other string, usually independent of natural language and social naming conventions, used to identify a place.
type: Property
lexical alias: identifierForPlace.en
inverse of: is identifier for place of
scope note: The coded string is usually independent of natural language and social naming conventions.
sub property of: has identifier for entity
label: heeft identificatie voor plaats @nl
label: له مُعرف لمكان @ar
definition: يربط بين مكان وتسمية لمكان تتكون من رمز، رقم، أو سلسلة تمثيلات أخرى، عادة ما تكون مستقلة عن اللغة الطبيعية وعن التسميات المتعارف عليها اجتماعيًا، المستخدمة في تحديد هوية مكان. @ar
scope note: عادة ما تكون سلسلة التمثيلات المرمزة مستقلة عن اللغة الطبيعية وعن التسميات المتعارف عليها اجتماعيًا. @ar
label: har identfikator for sted @da
definition: Relaterer et sted til en benævnelse for stedm der bestor af kode, nummer, eller anden streng, normalt uafhængigt af naturligt sprog og sociale navngivningskonventioner, brugt for at identificere et sted. @da
scope note: Den kodede streng er normalt uafhængig af naturligt sprog og sociale navngivningskonventioner. @da
label: paikan tunniste @fi
definition: Liittää paikan paikan nimitykseen, joka koostuu paikan identifiointiin käytettävästä koodista, luvusta tai muusta,tavallisesti luonnollisesta kielestä ja yleisistä nimeämiskäytännöistä riippumattomasta, merkkijonosta. @fi
scope note: Merkkijono on yleensä riippumaton luonnollisesta kielestä ja yleisistä nimeämiskäytännöistä. @fi
label: hat Identifikator für ein Geografikum @de
definition: Setzt ein Geografikum in Beziehung zu einer Bezeichnung für ein Geografikum, die aus einem Code, einer Nummer oder einer anderen Zeichenkette besteht, der/die normalerweise nicht in natürlicher Sprache und unabhängig von den sozialen Benennungskonventionen ist und zur Identifizierung eines Geografikums verwendet wird. @de
scope note: Die kodierte Zeichenkette ist normalerweise nicht in natürlicher Sprache und unabhängig von den sozialen Benennungskonventionen. @de
label: 有地点的标识符 @zh-hans
definition: 将一个地点与作为一个由代码、数字、或其他字符串构成、通常独立于自然语言和社会命名惯例、用以标识一个地点的一个地点称谓的命名关联起来。 @zh-hans
scope note: 编码串通常独立于自然语言和社会命名惯例。 @zh-hans
definition: Relaciona un lloc amb un nomen que és una apel·lació de lloc que consisteix en un codi, un número o una altra cadena, normalment independent del llenguatge natural i de les convencions lingüístiques socials, usat per identificar un lloc. @ca
label: azonosító helyhez a következő: @hu
definition: Hozzákapcsol egy helyet egy hely megnevezéséhez, amely egy kód-, szám-, vagy más típusú karakterláncból áll, amely általában független a természetes nyelvektől és társadalmi névkonvencióktól, és egy forrás azonosítására használják. @hu
scope note: A kódolt karakterlánc általában független a természetes nyelvektől és társadalmi névkonvencióktól. @hu
label: yerin tanımlayıcısı ile ilişkilidir @tr
definition: Bir yeri tanımlamak için kullanılan, genellikle yerel dil ve sosyal adlandırma kurallarından bağımsız bir kod, sayı veya başka bir diziden oluşan bir yer adı ile ilişkilendirir. @tr
scope note: Kodlanmış dizi genellikle doğal dilden ve sosyal adlandırma kurallarından bağımsızdır. @tr

has identifier for timespan
status: Published
definition: Relates a timespan to a nomen that is an appellation of timespan that consists of a code, number, or other string, usually independent of natural language and social naming conventions, used to identify a timespan.
type: Property
lexical alias: identifierForTimespan.en
inverse of: is identifier for timespan of
scope note: The coded string is usually independent of natural language and social naming conventions.
sub property of: has identifier for entity
label: heeft identificatie voor tijdspanne @nl
label: له مُعرف لفترة زمنية @ar
definition: يربط بين فترة زمنية وتسمية لفترة زمنية تتكون من رمز، رقم، أو سلسلة تمثيلات أخرى، عادة ما تكون مستقلة عن اللغة الطبيعية وعن التسميات المتعارف عليها اجتماعيًا، المستخدمة في تحديد هوية فترة زمنية. @ar
scope note: عادة ما تكون سلسلة التمثيلات المرمزة مستقلة عن اللغة الطبيعية وعن التسميات المتعارف عليها اجتماعيًا. @ar
label: har identifikator for tidsforløb @da
definition: Relaterer et tidsforløb til en benævnelse på tidsforløb, der består af kode, nummer, eller anden streng, normalt uafhængigt af naturligt sprog og sociale navngivningskonventioner, brugt for at identificere et tidsforløb. @da
scope note: Den kodede streng er normalt uafhængig af naturligt sprog og sociale navngivningskonventioner. @da
label: ajanjakson tunniste @fi
definition: Liittää ajanjakson ajanjakson nimitykseen, joka koostuu paikan identifiointiin käytettävästä koodista, luvusta tai muusta, tavallisesti luonnollisesta kielestä ja yleisistä nimeämiskäytännöistä riippumattomasta, merkkijonosta. @fi
scope note: Merkkijono on yleensä riippumaton luonnollisesta kielestä ja yleisistä nimeämiskäytännöistä. @fi
label: hat Identifikator für einen Zeitraum @de
definition: Setzt einen Zeitraum in Beziehung zu einer Bezeichnung für einen Zeitraum, die aus einem Code, einer Nummer oder einer anderen Zeichenkette besteht, der/die normalerweise nicht in natürlicher Sprache und unabhängig von den sozialen Benennungskonventionen ist und zur Identifizierung eines Zeitraums verwendet wird. @de
scope note: Die kodierte Zeichenkette ist normalerweise nicht in natürlicher Sprache und unabhängig von den sozialen Benennungskonventionen. @de
label: 有时间段的标识符 @zh-hans
definition: 将一个时间段与由代码、数字或其他串组成、通常独立于自然语言和社会命名惯例、用于标识一个时间段的作为一个时间段称谓的一个命名关联起来。 @zh-hans
scope note: 编码串通常独立于自然语言和社会命名惯例。 @zh-hans
definition: Relaciona un interval de temps amb un nomen que és una apel·lació d’interval de temps que consisteix en un codi, un número o qualsevol altra cadena, normalment independent del llenguatge natural i de les convencions lingüístiques socials, usada per identificar una obra. @ca
label: azonosító időtartamhoz a következő: @hu
definition: Hozzákapcsol egy időtartamot egy időtartam megnevezéséhez, amely kódból, számból vagy egyéb karakterláncból áll, általában a természetes nyelvtől és társadalmi elnevezési konvencióktól független, egy időtartam azonosítására használják. @hu
scope note: A kódolt karakterlánc általában független a természetes nyelvektől és társadalmi névkonvencióktól. @hu
label: zaman aralığının tanımlayıcısı ile ilişkilidir @tr
definition: Bir zaman aralığını, bir zaman aralığını tanımlamak için kullanılan, genellikle doğal dil ve sosyal adlandırma kurallarından bağımsız bir kod, sayı veya başka bir diziyi içeren bir zaman aralığı unvanıyla ilişkilendirir. @tr
scope note: Kodlanmış dizi genellikle doğal dilden ve sosyal adlandırma kurallarından bağımsızdır. @tr

has variant access point for agent
status: Published
definition: Relates an agent to an access point for agent that is not selected for preference in a specific vocabulary encoding scheme.
type: Property
lexical alias: variantAccessPointForAgent.en
inverse of: is variant access point for agent of
sub property of: has variant access point for entity
label: heeft variant ingang voor actor @nl
label: له نقطة إتاحة مختلفة لوكيل @ar
definition: يربط بين وكيل ونقطة إتاحة لوكيل لم يتم اختيارها كنقطة إتاحة مختلفة مفضلة في خطة ترميز مفردات محددة. @ar
label: har variantsøgeindgang for agent @da
definition: Relaterer en agent til en søgeindgang for agent, der ikke er valgt som foretrukken i et særskit vokabularkodningsskema. @da
label: varianttihakutieto toimijalle @fi
definition: Liittää toimijan toimijan hakutietoon, jota ei ole valittu ensisijaiseksi tietyssä sanaston merkintäjärjestelmässä @fi
label: hat zusätzlichen Sucheinstieg für einen Akteur @de
definition: Setzt einen Akteur in Beziehung zu einem Sucheinstieg für einen Akteur, der in einem bestimmten Vocabulary Encoding Scheme nicht als Vorzugsform bestimmt wird. @de
label: 有行为者的变异检索点 @zh-hans
definition: 将一个行为者与没有在一个特定的词表编码体系中被首选的一个行为者的检索点关联起来。 @zh-hans
label: hozzáférésipont-változata ágenshez a következő: @hu
definition: Hozzákapcsol egy ágenst egy ágens hozzáférési pontjához, amely egy adott szótárkódolási sémában nem részesítenek előnyben. @hu
label: temsilci için alternatif erişim noktası ile ilişkilidir @tr
definition: Bir temsilciyi, belirli bir kelime kodlama şemasında tercih edilmek üzere seçilmeyen temsilcinin erişim noktasıyla ilişkilendirir. @tr

has variant access point for place
status: Published
definition: Relates a place to an access point for place that is not selected for preference in a specific vocabulary encoding scheme.
type: Property
lexical alias: variantAccessPointForPlace.en
inverse of: is variant access point for place of
sub property of: has variant access point for entity
label: heeft variant ingang voor plaats @nl
label: له نقطة إتاحة مختلفة لمكان @ar
definition: يربط بين وكيل ونقطة إتاحة لمكان لم يتم اختيارها كنقطة إتاحة مختلفة مفضلة في خطة ترميز مفردات محددة. @ar
label: har variantsøgeindgang for sted @da
definition: Relaterer en agent til en søgeindgang for sted, der ikke er valgt som foretrukket i et særskilt vokabularkodningsskema. @da
label: varianttihakutieto paikalle @fi
definition: Liittää paikan paikan hakutietoon, jota ei ole valittu ensisijaiseksi tietyssä sanaston merkintäjärjestelmässä @fi
label: hat zusätzlichen Sucheinstieg für ein Geografikum @de
definition: Setzt ein Geografikum in Beziehung zu einem Sucheinstieg für ein Geografikum, der in einem bestimmten Vocabulary Encoding Scheme nicht als Vorzugsform bestimmt wird. @de
label: 有地点的变异检索点 @zh-hans
definition: 将一个地点与没有在一个特定的词表编码体系中被首选的一个地点的检索点关联起来。 @zh-hans
definition: Relaciona un lloc amb un punt d’accés de lloc que no se selecciona com a preferent en un esquema de codificació de vocabulari específic. @ca
label: hozzáférésipont-változat helyhez a következő: @hu
definition: Hozzákapcsol egy ágenst egy hely hozzáférési pontjához, amelyet egy adott szótárkódolási sémában nem részesítenek előnyben. @hu
label: yer için alternatif erişim noktası ile ilişkilidir @tr
definition: Bir yeri, belirli bir kelime kodlama şemasında tercih edilmeyen yerin erişim noktası ile ilişkilendirir. @tr

has variant access point for resource
status: Published
definition: Relates a resource to an access point for resource that is not selected for preference in a specific vocabulary encoding scheme.
type: Property
lexical alias: variantAccessPointForResource.en
inverse of: is variant access point for resource of
sub property of: has variant access point for entity
label: heeft variant ingang voor resource @nl
label: له نقطة إتاحة مختلفة لمصدر @ar
definition: يربط بين مصدر ونقطة إتاحة لمصدر لم يتم اختيارها كنقطة إتاحة مختلفة مفضلة في خطة ترميز مفردات محددة. @ar
label: har variantsøgeindgang for ressource @da
definition: Relaterer en ressource til en søgeindgang for ressource, der ikke er valgt som foretrukken i et særskilt vokabularkodningsskema. @da
label: varianttihakutieto aineistolle @fi
definition: Liittää aineiston aineiston hakutietoon, jota ei ole valittu ensisijaiseksi tietyssä sanaston merkintäjärjestelmässä @fi
label: hat zusätzlichen Sucheinstieg für eine Ressource @de
definition: Setzt eine Ressource in Beziehung zu einem Sucheinstieg für eine Ressource, der in einem bestimmten Vocabulary Encoding Scheme nicht als Vorzugsform bestimmt wird. @de
label: 有资源的变异检索点 @zh-hans
definition: 将一种资源与没有在一个特定的词表编码体系中被首选的一个资源的检索点关联起来。 @zh-hans
label: hozzáférésipont-változat forráshoz a következő: @hu
definition: Hozzákapcsol egy forrást egy forrás hozzáférési pontjához, amelyet egy adott szótárkódolási sémában nem részesítenek előnyben. @hu
label: kaynak için alternatif erişim noktası ile ilişkilidir @tr
definition: Bir kaynağı, belirli bir kelime kodlama şemasında tercih edilmek üzere seçilmemiş kaynağın erişim noktası ile ilişkilendirir. @tr

has variant access point for timespan
status: Published
definition: Relates a timespan to an access point for timespan that is not selected for preference in a specific vocabulary encoding scheme.
type: Property
lexical alias: variantAccessPointForTimespan.en
inverse of: is variant access point for timespan of
sub property of: has variant access point for entity
label: heeft variant ingang voor tijdspanne @nl
label: له نقطة إتاحة مختلفة لفترة زمنية @ar
definition: يربط بين فترة زمنية ونقطة إتاحة لفترة زمنية لم يتم اختيارها كنقطة إتاحة مختلفة مفضلة في خطة ترميز مفردات محددة. @ar
label: har variantsøgeindgang for tidsforløb @da
definition: Relaterer et tidsforløb for en søgeindgang til et tidsforløb, der ikke er valgt som foretrukket i et særskilt vokabularkodingsskema. @da
label: varianttihakutieto ajanjaksolle @fi
definition: Liittää ajanjakson ajanjakson hakutietoon, jota ei ole valittu ensisijaiseksi tietyssä sanaston merkintäjärjestelmässä. @fi
label: hat zusätzlichen Sucheinstieg für einen Zeitraum @de
definition: Setzt einen Zeitraum in Beziehung zu einem Sucheinstieg für einen Zeitraum, der in einem bestimmten Vocabulary Encoding Scheme nicht als Vorzugsform bestimmt wird. @de
label: 有时间段的变异检索点 @zh-hans
definition: 将一个时间段与没有在一个特定的词表编码体系中被首选的一个时间段的检索点关联起来。 @zh-hans
label: hozzáférésipont-változat időtartamhoz a következő: @hu
definition: Hozzákapcsol egy időtartamot egy időtartam hozzáférési pontjához, amelyet egy adott szótárkódolási sémában nem részesítenek előnyben. @hu
label: zaman aralığı için alternatif erişim noktası ile ilişkilidir @tr
definition: Bir zaman aralığını, belirli bir kelime kodlama şemasında tercih için seçilen bir zaman aralığını erişim noktası ile ilişkilendirir. @tr

is access point for agent of
status: Published
definition: Relates a nomen to an agent who has an appellation in natural language that is taken from a vocabulary encoding scheme or is constructed using a string encoding scheme.
type: Property
lexical alias: accessPointForAgentOf.en
inverse of: has access point for agent
sub property of: is access point for entity of
label: is ingang voor actor van @nl
label: هو نقطة إتاحة لوكيل لـ @ar
definition: يربط بين تسمية ووكيل له تسمية في اللغة الطبيعية المأخوذة من مخطط ترميز مفردات أو أنشئت باستخدام خطة ترميز سلسلة تمثيلات. @ar
label: er søgindgang for agent af @da
definition: Relaterer et nomen til en agent, der har en benævnelse på sted´på naturligt sprog, der er hentet fra et vokabularkodningsskema eller er konstrueret ved brug af et strengkodningsskema. @da
label: hakutieto toimijalle @fi
definition: Liittää nomenin toimijaan, jonka luonnollisen kielen mukainen nimitys on otettu jostakin sanaston merkintäjärjestelmästä tai muodostettu jotakin merkkijonon merkintäjärjestelmää käyttäen. @fi
label: ist Sucheinstieg für einen Akteur von @de
definition: Setzt ein Nomen in Beziehung zu einem Akteur, der eine Bezeichnung in natürlicher Sprache hat, die einem Vocabulary Encoding Scheme entnommen oder mit einem String Encoding Scheme konstruiert wird. @de
label: 是……的行为者的检索点 @zh-hans
definition: 将一个命名与有取自一个词表编码体系或者用一个串编码体系构建、用自然语言的一个称谓的一个行为者关联起来。 @zh-hans
label: hozzáférési pont a következő ágenshez: @hu
definition: Hozzákapcsol egy noment egy ágenshez, amelynek természetes nyelvű megnevezése egy szótárkódolási sémából származik, vagy egy karakterlánc-kódolási séma használatával szerkesztett. @hu
label: temsilcisi için erişim noktasıdır @tr
definition: Bir ismi, kelime kodlama şemasından alınan veya bir dizi kodlama şeması kullanılarak oluşturulan yerel dilde bir unvana sahip olan temsilciyle ilişkilendirir. @tr

is access point for place of
status: Published
definition: Relates a nomen to a place that has an appellation in natural language that is taken from a vocabulary encoding scheme or is constructed using a string encoding scheme.
type: Property
lexical alias: accessPointForPlaceOf.en
inverse of: has access point for place
sub property of: is access point for entity of
label: is ingang voor plaats van @nl
label: هي نقطة وصول لمكان لـ @ar
definition: يربط بين تسمية ومكان له اسم في لغة طبيعية مأخوذة من خطة ترميز مفردات أو مبنية باستخدام خطة ترميز سلسلة تمثيلات. @ar
label: er søgeindgang for sted af @da
definition: Relaterer et nomen til et sted, der har en benævngelse på naturligt sprog, der er hentet fra et vokabularkodningsskema eller er konstrueret ved brug af et strengkodningsskema. @da
label: hakutieto paikalle @fi
definition: Liittää nomenin paikkaan, jonka luonnollisen kielen mukainen nimitys on otettu jostakin sanaston merkintäjärjestelmästä tai muodostettu jotakin merkkijonon merkintäjärjestelmää käyttäen. @fi
label: ist Sucheinstieg für ein Geografikum von @de
definition: Setzt ein Nomen in Beziehung zu einem Geografikum, das eine Bezeichnung in natürlicher Sprache hat, die einem Vocabulary Encoding Scheme entnommen oder mit einem String Encoding Scheme konstruiert wird. @de
label: 有……的地点的检索点 @zh-hans
definition: 将一个命名与有取自一个词表编码体系或者用一个串编码体系构建、用自然语言的一个称谓的一个地点关联起来。 @zh-hans
label: hozzáférési pont a következő helyhez: @hu
definition: Hozzákapcsol egy noment egy helyhez, amelynek természetes nyelvű megnevezése egy szótárkódolási sémából származik, vagy egy karakterlánc-kódolási séma használatával szerkesztett. @hu
label: yeri için erişim noktasıdır @tr
definition: Bir ismi, bir kelime kodlama şemasından alınan veya bir dize kodlama şeması kullanılarak oluşturulan yerel dilde bir adı olan bir yerle ilişkilendirir. @tr

is access point for resource of
status: Published
definition: Relates a nomen to a resource that has an appellation in natural language that is taken from a vocabulary encoding scheme or is constructed using a string encoding scheme.
type: Property
lexical alias: accessPointForResourceOf.en
inverse of: has access point for resource
sub property of: is access point for entity of
label: is ingang voor resource van @nl
label: هي نقطة وصول لمصدر لـ @ar
definition: يربط تسمية بمصدر له اسم في لغة طبيعية مأخوذ من خطة ترميز مفردات أو مبنية باستخدام خطة ترميز سلسلة تمثيلات. @ar
label: er søgeindgang for ressource af @da
definition: Relaterer et nomen til en ressource, der har en benævnelse på naturligt sprog, der er hentet fra et vokabularkodningsskema eller er konstrueret ved brug af en strengkodningsskema. @da
label: hakutieto aineistolle @fi
definition: Liittää nomenin aineistoon, jonka luonnollisen kielen mukainen nimitys on otettu jostakin sanaston merkintäjärjestelmästä tai muodostettu jotakin merkkijonon merkintäjärjestelmää käyttäen. @fi
label: ist Sucheinstieg für eine Ressource von @de
definition: Setzt ein Nomen in Beziehung zu einer Ressource, die eine Bezeichnung in natürlicher Sprache hat, die einem Vocabulary Encoding Scheme entnommen oder mit einem String Encoding Scheme konstruiert wird. @de
label: 是……的资源的检索点 @zh-hans
definition: 将一个命名与有取自一个词表编码体系或者用一个串编码体系构建、用自然语言的一个称谓的一种资源关联起来。 @zh-hans
label: hozzáférési pont a következő forráshoz: @hu
definition: Hozzákapcsol egy noment egy forráshoz, amelynek természetes nyelvű megnevezése egy szótárkódolási sémából származik, vagy egy karakterlánc-kódolási séma használatával szerkesztett. @hu
label: kaynağı için erişim noktasıdır @tr
definition: Bir ismi, bir kelime kodlama şemasından alınan veya bir dize kodlama şeması kullanılarak oluşturulan yerel dildeki bir kaynak adlandırmasıyla ilişkilendirir. @tr

is access point for timespan of
status: Published
definition: Relates a nomen to a timespan that has an appellation in natural language that is taken from a vocabulary encoding scheme or is constructed using a string encoding scheme.
type: Property
lexical alias: accessPointForTimespanOf.en
inverse of: has access point for timespan
sub property of: is access point for entity of
label: is ingang voor tijdspanne van @nl
label: هي نقطة وصول لفترة زمنية لـ @ar
definition: ييربط تسمية بفترة زمنية لها اسم في لغة طبيعية مأخوذة من خطة ترميز مفردات أو مبنية باستخدام خطة ترميز سلسلة تمثيلات. @ar
label: er søgeindgang for tidsforløb af @da
definition: Relaterer et nomen til et tidsforløb, der har en benævnelse på naturligt sprog, der er hentet fra et vokabularkodningsskema eller er konstrueret ved at brue et strengkodningsskema. @da
label: hakutieto ajanjaksolle @fi
definition: Liittää nomenin ajanjaksoon, jonka luonnollisen kielen mukainen nimitys on otettu jostakin sanaston merkintäjärjestelmästä tai muodostettu jotakin merkkijonon merkintäjärjestelmää käyttäen. @fi
label: ist Sucheinstieg für einen Zeitraum von @de
definition: Setzt ein Nomen in Beziehung zu einem Zeitraum, der eine Bezeichnung in natürlicher Sprache hat, die einem Vocabulary Encoding Scheme entnommen oder mit einem String Encoding Scheme konstruiert wird. @de
label: 是……的时间段的检索点 @zh-hans
definition: 将一个命名与有取自一个词表编码体系或者用一个串编码体系构建、用自然语言的一个称谓的一个时间段关联起来。 @zh-hans
label: hozzáférési pont a következő időtartamhoz: @hu
definition: Hozzákapcsol egy noment egy időtartamhoz, amelynek természetes nyelvű megnevezése egy szótárkódolási sémából származik, vagy egy karakterlánc-kódolási séma használatával szerkesztett. @hu
label: zaman aralığı için erişim noktasıdır @tr
definition: Bir ismi, bir kelime kodlama şemasından alınan veya bir dize kodlama şeması kullanılarak oluşturulan yerel dildeki bir zaman aralığı adlandırmasıyla ilişkilendirir. @tr

is authorized access point for agent of
status: Published
definition: Relates a nomen to an agent who has an access point for agent that is selected for preference in a specific vocabulary encoding scheme.
type: Property
lexical alias: authorizedAccessPointForAgentOf.en
inverse of: has authorized access point for agent
sub property of: is authorized access point for entity of
label: is geautoriseerde ingang voor actor van @nl
label: هي نقطة إتاحة مقننة لوكيل لـ @ar
definition: يربط بين اسم ووكيل لديه نقطة وصول لوكيل اختيرت نقطة اتاحة مقننة مُفضلة فى خطة ترميز مفردات. @ar
label: er autoriseret søgeindgang for agent af @da
definition: Relaterer et nomen til en agent, der har en søgeindgang for agent, der er valgt som foretrukken i et særskilt vokabularkodningsskema. @da
label: auktorisoitu hakutieto toimijalle @fi
definition: Liittää nomenin toimijaan, jolla on tietyssä sanaston merkintäjärjestelmässä ensisijaiseksi valittu toimijan hakutieto. @fi
label: ist normierter Sucheinstieg für einen Akteur von @de
definition: Setzt ein Nomen in Beziehung zu einem Akteur, der über einen Sucheinstieg für einen Akteur verfügt, der in einem bestimmten Vocabulary Encoding Scheme als Vorzugsform bestimmt wird. @de
label: 是……的行为者的规范检索点 @zh-hans
definition: 将一个命名与有在一个特定的词表编码体系中被首选的行为者检索点的一个行为者关联起来。 @zh-hans
label: autorizált hozzáférési pont a következő ágenshez: @hu
definition: Hozzákapcsol egy noment egy ágenshez, amelynek van egy előnyben részesített hozzáférési pontja az ágenshez, amelyet egy adott szótárkódolási sémából választanak ki. @hu
label: temsilcisi için yetkili erişim noktasıdır @tr
definition: Bir ismi, belirli bir kelime kodlama şemasında tercih edilen temsilci için erişim noktası olan bir temsilciyle ilişkilendirir. @tr

is authorized access point for place of
status: Published
definition: Relates a nomen to a place that has an access point for place that is selected for preference in a specific vocabulary encoding scheme.
type: Property
lexical alias: authorizedAccessPointForPlaceOf.en
inverse of: has authorized access point for place
sub property of: is authorized access point for entity of
label: is geautoriseerde ingang voor plaats van @nl
label: هي نقطة إتاحة مقننة لمكان لـ @ar
definition: يربط بين اسم ومكان لديه نقطة وصول لمكان اختيرت نقطة اتاحة مقننة مُفضلة فى خطة ترميز مفردات. @ar
label: er autoriseret søgeindgang for sted af @da
definition: Relaterer et nomen til et sted, der har en søgeindgang for sted, der er valgt som foretrukken i et særskilt vokabularkodningsskema. @da
label: auktorisoitu hakutieto paikalle @fi
definition: Liittää nomenin paikkaan, jolla on tietyssä sanaston merkintäjärjestelmässä ensisijaiseksi valittu paikan hakutieto. @fi
label: ist normierter Sucheinstieg für ein Geografikum von @de
definition: Setzt ein Nomen in Beziehung zu einem Geografikum, das über einen Sucheinstieg für ein Geografikum verfügt, der in einem bestimmten Vocabulary Encoding Scheme als Vorzugsform bestimmt wird. @de
label: 是……的地点的规范检索点 @zh-hans
definition: 将一个命名与有在一个特定的词表编码体系中被首选的地点检索点的一个地点关联起来。 @zh-hans
label: autorizált hozzáférési pont a következő helyhez: @hu
definition: Hozzákapcsol egy noment egy helyhez, amelynek van egy előnyben részesített hozzáférési pontja a helyhez, amelyet egy adott szótárkódolási sémából választanak ki. @hu
label: yeri için erişim noktasıdır @tr
definition: Bir ismi, belirli bir kelime kodlama şemasında tercih edilen yer için erişim noktası olan bir yerle ilişkilendirir. @tr

is authorized access point for resource of
status: Published
definition: Relates a nomen to a resource that has an access point for resource that is selected for preference in a specific vocabulary encoding scheme.
type: Property
lexical alias: authorizedAccessPointForResourceOf.en
inverse of: has authorized access point for resource
sub property of: is authorized access point for entity of
label: is geautoriseerde ingang voor resource van @nl
label: هي نقطة إتاحة مقننة لمصدر لـ @ar
definition: يربط بين اسم ومصدر لديه نقطة وصول لمصدر اختيرت نقطة اتاحة مقننة مُفضلة فى خطة ترميز مفردات. @ar
label: er autoriseret søgeindgang for ressource af @da
definition: Relaterer et nomen til en ressource, der har en søgeindgang for ressource, der er valgt som foretrukken i et særskilt vokabularkodningsskema. @da
label: auktorisoitu hakutieto aineistolle @fi
definition: Liittää nomenin aineistoon, jolla on tietyssä sanaston merkintäjärjestelmässä ensisijaiseksi valittu aineiston hakutieto. @fi
label: ist normierter Sucheinstieg für eine Ressource von @de
definition: Setzt ein Nomen in Beziehung zu einer Ressource, die über einen Sucheinstieg für eine Ressource verfügt, der in einem bestimmten Vocabulary Encoding Scheme als Vorzugsform bestimmt wird. @de
label: 是……的资源的规范检索点 @zh-hans
definition: 将一个命名与有在一个特定的词表编码体系中被首选的资源检索点的一种资源关联起来。 @zh-hans
label: autorizált hozzáférési pont a következő forráshoz: @hu
definition: Hozzákapcsol egy noment egy forráshoz, amelynek van egy olyan előnyben részesített hozzáférési pontja a forráshoz, amelyet egy adott szótárkódolási sémából választanak ki. @hu
label: kaynağı için yetkili erişim noktasıdır @tr
definition: Bir ismi, belirli bir kelime kodlama şemasında tercih edilen kaynak için erişim noktası olan bir kaynakla ilişkilendirir. @tr

is authorized access point for timespan of
status: Published
definition: Relates a nomen to a timespan that has an access point for timespan that is selected for preference in a specific vocabulary encoding scheme.
type: Property
lexical alias: authorizedAccessPointForTimespanOf.en
inverse of: has authorized access point for timespan
sub property of: is authorized access point for entity of
label: is geautoriseerde ingang voor tijdspanne van @nl
label: هي نقطة إتاحة مقننة لفترة زمنية لـ @ar
definition: يربط بين اسم وفترة زمنية لديها نقطة وصول لفترة زمنية اختيرت نقطة اتاحة مقننة مُفضلة فى خطة ترميز مفردات. @ar
label: er autoriseret søgeindgang for tidsforløb af @da
definition: Relaterer et nomen til et tidsforløb, der har en søgeindgang, der er valgt som foretrukken i et særskilt vokabularkodningsskema. @da
label: auktorisoitu hakutieto ajanjaksolle @fi
definition: Liittää nomenin ajanjaksoon, jolla on tietyssä sanaston merkintäjärjestelmässässä ensisijaiseksi valittu ajanjakson hakutieto. @fi
label: ist normierter Sucheinstieg für einen Zeitraum von @de
definition: Setzt ein Nomen in Beziehung zu einem Zeitraum, der über einen Sucheinstieg für einen Zeitraum verfügt, der in einem bestimmten Vocabulary Encoding Scheme als Vorzugsform bestimmt wird. @de
label: 是……的时间段的规范检索点 @zh-hans
definition: 将一个命名与有在一个特定的词表编码体系中被首选的时间段检索点的一个时间段关联起来。 @zh-hans
label: autorizált hozzáférési pont a következő időtartamhoz: @hu
definition: Hozzákapcsol egy noment egy időtartamhoz, amelynek van egy előnyben részesített hozzáférési pontja az időtartamhoz, amelyet egy adott szótárkódolási sémából választanak ki. @hu
label: zaman aralığı için yetkili erişim noktasıdır @tr
definition: Bir ismi, belirli bir kelime kodlama şemasında tercih edilen zaman aralığı için erişim noktası olan bir zaman aralığıyla ilişkilendirir. @tr

is identifier for place of
status: Published
definition: Relates a nomen to a place that has a reference code taken from a vocabulary encoding scheme.
type: Property
lexical alias: identifierForPlaceOf.en
inverse of: has identifier for place
scope note: The coded string is usually independent of natural language and social naming conventions.
sub property of: is identifier for entity of
label: is identificatie voor plaats van @nl
label: هو مُعرف لمكان لـ @ar
definition: يربط بين تسمية ومكان له رمز إحالة مأخوذ من خطة ترميز مفردات. @ar
scope note: عادة ما تكون سلسلة التمثيلات المرمزة مستقلة عن اللغة الطبيعية وعن التسميات المتعارف عليها اجتماعيًا. @ar
label: er identifikator for sted af @da
definition: Relaterer et nomen til et sted der har en referencekode, der er hentet fra et vokabularkodningsskema. @da
scope note: Den kodede streng er normalt uafhængig af naturligt sprog og sociale navngivningskonventioner. @da
label: paikan tunniste @fi
definition: Liittää nomenin paikkaan, jolla on sanaston merkintäjärjestelmästä otettu viitekoodi. @fi
scope note: Merkkijono on yleensä riippumaton luonnollisesta kielestä ja yleisistä nimeämiskäytännöistä. @fi
label: ist Identifikator für ein Geografikum von @de
definition: Setzt ein Nomen in Beziehung zu einem Geografikum, das über einen Referenzcode verfügt, der aus einem Vocabulary Encoding Scheme entnommen wird. @de
scope note: Die kodierte Zeichenkette ist normalerweise nicht in natürlicher Sprache und unabhängig von den sozialen Benennungskonventionen. @de
label: 是……的地点的标识符 @zh-hans
definition: 将一个命名与有一个取自一个词表编码体系的指称代码的一个地点关联起来。 @zh-hans
scope note: 编码串通常独立于自然语言和社会命名惯例。 @zh-hans
label: azonosítója a következő helynek: @hu
definition: Hozzákapcsol egy noment egy helyhez, amelynek van egy szótárkódolási sémából származó hivatkozási kódja. @hu
scope note: A kódolt karakterlánc általában független a természetes nyelvektől és társadalmi névkonvencióktól. @hu
label: yerinin tanımlayıcısıdır @tr
definition: Bir ismi, kelime kodlama şemasından alınmış referans kodu olan bir yerle ilişkilendirir. @tr
scope note: Kodlanmış dizi genellikle doğal dilden ve sosyal adlandırma kurallarından bağımsızdır. @tr

is identifier for timespan of
status: Published
definition: Relates a nomen to a timespan that has a reference code taken from a vocabulary encoding scheme.
type: Property
lexical alias: identifierForTimespanOf.en
inverse of: has identifier for timespan
scope note: The coded string is usually independent of natural language and social naming conventions.
sub property of: is identifier for entity of
label: is ingang voor tijdspanne van @nl
label: هو مُعرف لفترة زمنية لـ @ar
definition: ييربط تسمية بفترة زمنية لها رمز إحالة مأخوذ من خطة ترميز مفردات. @ar
scope note: عادة ما تكون سلسلة التمثيلات المرمزة مستقلة عن اللغة الطبيعية وعن التسميات المتعارف عليها اجتماعيًا. @ar
label: er identifikator for tidsforløb af @da
definition: Relaterer et nomen til et tidsforløb, der har en referencekode, der er hentet fra et vokabularkodningsskema. @da
scope note: Den kodede streng er normalt uafhængig af naturligt sprog og sociale navngivningskonventioner. @da
label: ajanjakson tunniste @fi
definition: Liittää nomenin ajanjaksoon, jolla on sanaston merkintäjärjestelmästä otettu viitekoodi. @fi
scope note: Merkkijono on yleensä riippumaton luonnollisesta kielestä ja yleisistä nimeämiskäytännöistä. @fi
label: ist Identifikator für einen Zeitraum von @de
definition: Setzt ein Nomen in Beziehung zu einem Zeitraum, der über einen Referenzcode verfügt, der aus einem Vocabulary Encoding Scheme entnommen wird. @de
scope note: Die kodierte Zeichenkette ist normalerweise nicht in natürlicher Sprache und unabhängig von den sozialen Benennungskonventionen. @de
label: 是……的时间段的标识符 @zh-hans
definition: 将一个命名与有一个取自一个词表编码体系的指称代码的一个时间段关联起来。 @zh-hans
scope note: 编码串通常独立于自然语言和社会命名惯例。 @zh-hans
label: azonosítója a következő időtartamnak: @hu
definition: Hozzákapcsol egy noment egy időtartamhoz, amelynek van egy szótárkódolási sémából származó hivatkozási kódja. @hu
scope note: A kódolt karakterlánc általában független a természetes nyelvektől és társadalmi névkonvencióktól. @hu
label: zaman aralığının tanımlayıcısıdır @tr
definition: Bir ismi, kelime kodlama şemasından alınmış referans kodu olan bir zaman aralığıyla ilişkilendirir. @tr
scope note: Kodlanmış dizi genellikle doğal dilden ve sosyal adlandırma kurallarından bağımsızdır. @tr

is variant access point for agent of
status: Published
definition: Relates a nomen to an agent who has an access point for agent that is not selected for preference in a specific vocabulary encoding scheme.
type: Property
lexical alias: variantAccessPointForAgentOf.en
inverse of: has variant access point for agent
sub property of: is variant name of entity of
label: is variant ingang voor actor van @nl
label: هي نقطة إتاحة مختلفة لوكيل لـ @ar
definition: يربط بين تسمية ووكيل له نقطة إتاحة لوكيل لم يتم اختياره كنقطة إتاحة مختلفة مفضلة في خطة ترميز مفردات محددة. @ar
label: er variantsøgeindgang for agent af @da
definition: Relaterer et nomen til en agent, der har en søgeindgang for agent, der ikke er valgt som foretrukken i et særskilt vokabularkodningsskema. @da
label: varianttihakutieto toimijalle @fi
definition: Liittää nomenin toimijaan, jolla on toimijan hakutieto, jota ei ole valittu ensisijaiseksi tietyssä sanaston merkintäjärjestelmässä. @fi
label: ist zusätzlicher Sucheinstieg für einen Akteur von @de
definition: Setzt ein Nomen in Beziehung zu einem Akteur, der über einen Sucheinstieg für einen Akteur verfügt, der in einem bestimmten Vocabulary Encoding Scheme nicht als Vorzugsform bestimmt wird. @de
label: 是……的行为者的变异检索点 @zh-hans
definition: 将一个命名与有在一个特定的词表编码体系中未被首选的行为者检索点的一个行为者关联起来。 @zh-hans
label: hozzáférésipont-variánsa a következő ágensnek: @hu
definition: Hozzákapcsol egy noment egy ágenshez, amelynek van egy olyan hozzáférési pontja ágens számára, amelyet egy adott szótárkódolási sémában nem részesítenek előnyben. @hu
label: temsilci için farklı erişim noktası @tr
definition: Bir ismi, belirli bir kelime kodlama şemasında tercih edilmemiş bir temsilci için erişim noktasına sahip olan bir temsilciyle lişkilendirir. @tr

is variant access point for place of
status: Published
definition: Relates a nomen to a place that has an access point for entity that is not selected for preference in a specific vocabulary encoding scheme.
type: Property
lexical alias: variantAccessPointForPlaceOf.en
inverse of: has variant access point for place
sub property of: is variant name of entity of
label: is variant ingang voor plaats van @nl
label: هي نقطة إتاحة مختلفة لمكان لـ @ar
definition: يربط بين تسمية ومكان له نقطة إتاحة لكيان لم يتم اختياره كنقطة إتاحة مختلفة مفضلة في خطة ترميز مفردات محددة. @ar
label: er variantsøgeindgang for sted af @da
definition: Relaterer et nomen til et sted der har en søgeindgang for sted, der ikke er valgt som foretrukket i et særskilt vokabularkodningsskema. @da
label: varianttihakutieto paikalle @fi
definition: Liittää nomenin toimijaan, jolla on entiteetin hakutieto, jota ei ole valittu ensisijaiseksi tietyssä sanaston merkintäjärjestelmässä. @fi
label: ist zusätzlicher Sucheinstieg für ein Geografikum von @de
definition: Setzt ein Nomen in Beziehung zu einem Geografikum, das über einen Sucheinstieg für eine Entität verfügt, der in einem bestimmten Vocabulary Encoding Scheme nicht als Vorzugsform bestimmt wird. @de
label: 是……的地点的变异检索点 @zh-hans
definition: 将一个命名与有在一个特定的词表编码体系中未被首选的实体检索点的一个地点关联起来。 @zh-hans
label: hozzáférésipont-variánsa a következő helynek: @hu
definition: Hozzákapcsol egy noment egy helyhez, amelynek van egy olyan hozzáférési pontja entitás számára, amelyet egy adott szótárkódolási sémában nem részesítenek előnyben. @hu
label: yer için farklı erişim noktası @tr
definition: Bir ismi, belirli bir kelime kodlama şemasında tercih edilmeyen varlık için erişim noktası olan bir yerle ilişkilendirir. @tr

is variant access point for resource of
status: Published
definition: Relates a nomen to a resource that has an access point for resource that is not selected for preference in a specific vocabulary encoding scheme.
type: Property
lexical alias: variantAccessPointForResourceOf.en
inverse of: has variant access point for resource
sub property of: is variant name of entity of
label: is variant ingang voor resource van @nl
label: هي نقطة إتاحة مختلفة لمصدر لـ @ar
definition: يربط تسمية بمصدر له نقطة إتاحة لمصدر لم يتم اختياره كنقطة إتاحة مختلفة مفضلة في خطة ترميز مفردات محددة. @ar
label: er variantsøgeindgang for ressource af @da
definition: Relaterer et nomen til en ressource, der har en søgeindgang for ressource, der ikke er valgt som foretrukken i et særskilt vokabularkodningsskema. @da
label: varianttihakutieto aineistolle @fi
definition: Liittää nomenin aineistoon, jolla on aineiston hakutieto, jota ei ole valittu ensisijaiseksi tietyssä sanaston merkintäjärjestelmässä. @fi
label: ist zusätzlicher Sucheinstieg für eine Ressource von @de
definition: Setzt ein Nomen in Beziehung zu einer Ressource, die über einen Sucheinstieg für eine Ressource verfügt, der in einem bestimmten Vocabulary Encoding Scheme nicht als Vorzugsform bestimmt wird. @de
label: 是……的资源的变异检索点 @zh-hans
definition: 将一个命名与有在一个特定的词表编码体系中未被首选的资源检索点的一种资源关联起来。 @zh-hans
label: hozzáférésipont-változat a következő forráshoz: @hu
definition: Hozzákapcsol egy noment egy forráshoz, amelynek van egy olyan hozzáférési pontja forrás számára, amelyet egy adott szótárkódolási sémában nem részesítenek előnyben. @hu
label: kaynak için farklı erişim noktasıdır @tr
definition: Bir ismi, belirli bir kelime kodlama şemasında tercih edilmeyen bir kaynak için erişim noktası olan bir kaynakla ilişkilendirir. @tr

is variant access point for timespan of
status: Published
definition: Relates a nomen to a timespan that has an access point for timespan that is not selected for preference in a specific vocabulary encoding scheme.
type: Property
lexical alias: variantAccessPointForTimespanOf.en
inverse of: has variant access point for timespan
sub property of: is variant name of entity of
label: is variant ingang voor tijdspanne van @nl
label: هي نقطة إتاحة مختلفة لفترة زمنية لـ @ar
definition: ييربط تسمية بفترة زمنية لها نقطة إتاحة لفترة زمنية لم يتم اختيارها كنقطة إتاحة مختلفة مفضلة في خطة ترميز مفردات محددة. @ar
label: er variantsøgeindgagng for tidsforløb af @da
definition: Relaterer et nomen til et tidsforløb, der har en søgeindgang fro tidsforløb, der ikke er valgt som foretrukket i et særskilt vokabularkodningsskema. @da
label: varianttihakutieto ajanjaksolle @fi
definition: Liittää nomenin ajanjaksoon, jolla on ajanjakson hakutieto, jota ei ole valittu ensisijaiseksi tietyssä sanaston merkintäjärjestelmässä. @fi
label: ist zusätzlicher Sucheinstieg für einen Zeitraum von @de
definition: Setzt ein Nomen in Beziehung zu einem Zeitraum, der über einen Sucheinstieg für einen Zeitraum verfügt, der in einem bestimmten Vocabulary Encoding Scheme nicht als Vorzugsform bestimmt wird. @de
label: 是……的时间段的变异检索点 @zh-hans
definition: 将一个命名与有在一个特定的词表编码体系中未被首选的时间段检索点的一个时间段关联起来。 @zh-hans
label: hozzáférésipont-változata a következő időtartamnak: @hu
definition: Hozzákapcsol egy noment egy időtartamhoz, amelynek van egy olyan hozzáférési pontja időtartam számára, amelyet egy adott szótárkódolási sémában nem részesítenek előnyben. @hu
label: zaman aralığı için farklı erişim noktasıdır @tr
definition: Bir ismi, belirli bir kelime kodlama şemasında tercih edilmeyen bir zaman aralığı için erişim noktası olan bir zaman aralığıyla ilişkilendirir. @tr

is beginning of
status: Published
definition: Relates a timespan to a timespan that starts at the time that is a timespan.
type: Property
lexical alias: beginningOf.en
inverse of: has beginning
label: is begin van @nl
label: هو بداية لـ @ar
definition: يربط بين فترة زمنية وفترة زمنية تبدأ في وقت هو فترة زمنية. @ar
label: ajanjakson alku @fi
definition: Liittää ajanjakson ajanjakson ajankohtaan, josta ajanjakso alkaa. @fi
label: ist Anfang von @de
definition: Setzt einen Zeitraum in Beziehung zu einem Zeitraum, der zu diesem Zeitpunkt beginnt. Auch dieser wird als Zeitraum bezeichnet. @de
label: 是—…的开始 @zh-hans
definition: 将一个时间段与开始于作为一个时间段的时间的一个时间段关联起来。 @zh-hans
label: kezdete a következőnek: @hu
definition: Hozzákapcsol egy időtartamot egy időtartamhoz, amely akkor keződik, amikor az egy időtartam. @hu
label: başlangıcıdır @tr
definition: Bir zaman aralığını, zaman aralığı olan zamanda başlayan bir zaman aralığı ile ilişkilendirir. @tr

is coordinates of cartographic content of
status: Published
definition: Relates a place to a resource that is a cartographic resource that has an area of coverage that is described using a mathematical system to identify its boundaries or location.
type: Property
lexical alias: coordinatesOfCartographicContentOf.en
inverse of: has coordinates of cartographic content
sub property of: has related resource of place
label: is coördinaten van cartografische content van @nl
label: هو إحداثيات لمحتوى خرائطى لـ @ar
definition: يربط مكان بمصدر عبارة عن مصدر خرائطي له منطقة تغطية موصوفة باستخدام نظام رياضي لتحديد حدوده أو موقعه. @ar
label: er koordinater af kartografisk indhold af @da
definition: Relaterer et sted til en ressource, der er en kartografisk ressource, som lokaliserer et område ved at bruge et matematisk system for at identificere dets grænser eller lokation. @da
label: kartografisen aineiston koordinaatit @fi
definition: Liittää paikan aineistoon, joka on kartografinen aineisto, jonka kattama alue on kuvailtu käyttäen matemaattista järjestelmää rajojen ja sijainnin identifioimiseksi. @fi
label: sind Koordinaten von kartografischem Inhalt von @de
definition: Setzt ein Gebiet in Beziehung zu einer Ressource, die über einen Abdeckungsbereich einer kartografischen Ressource verfügt, der mit Hilfe eines mathematischen Systems beschrieben wird, um seine Grenzen oder Lage zu identifizieren. @de
label: 是……的地图内容的坐标 @zh-hans
definition: 将一个地点与作为一种地图资源、有覆盖范围、并被使用一个数学体系描述以标识其边界或位置的一种资源关联起来。 @zh-hans
label: kartográfiai tartalom koordinátái a következőnek: @hu
definition: Hozzákapcsol egy helyet egy kartográfiai forráshoz, amely az általa lefedett területet matematikai módszert használva ír le, hogy meghatározza a határát vagy a helyzetét. @hu
has subproperty: is longitude and latitude of
has subproperty: is right ascension and declination of
has subproperty: is strings of coordinate pairs of
label: kartografik içeriğinin koordinatlarıdır @tr
definition: Bir yeri, sınırlarını veya konumunu belirlemek için matematiksel bir sistem kullanılarak tanımlanan bir kapsama alanına sahip kartografik kaynak olan bir kaynakla ilişkilendirir. @tr

is ending of
status: Published
definition: Relates a timespan to a timespan that finishes at the time that is a timespan.
type: Property
lexical alias: endingOf.en
inverse of: has ending
label: is einde van @nl
label: هو نهاية لـ @ar
definition: يربط بين فترة زمنية وفترة زمنية تنتهي في وقت هو فترة زمنية. @ar
label: ajanjakson loppu @fi
definition: Liittää ajanjakson ajanjakson ajankohtaan, johon ajanjakso loppuu. @fi
label: ist Ende von @de
definition: Setzt einen Zeitraum in Beziehung zu einem Zeitraum, der zu diesem Zeitpunkt endet. Auch dieser wird als Zeitraum bezeichnet. @de
label: 是……的结束 @zh-hans
definition: 将一个时间段与结束于作为一个时间段的时间的一个时间段关联起来。 @zh-hans
label: vége a következőnek: @hu
definition: Hozzákapcsol egy időtartamot egy időtartamhoz, amely akkor végződik, amikor az egy időtartam. @hu
label: bitişidir @tr
definition: Bir zaman aralığını, zaman aralığı olan zamanda biten bir zaman aralığı ile ilişkilendirir. @tr

is fuller form of name of
status: Published
definition: Relates a nomen to an agent who has a fuller form of a name or part of a name represented by an initial, abbreviation, or shortened or otherwise modified form.
type: Property
lexical alias: fullerFormOfNameOf.en
inverse of: has fuller form of name
sub property of: is name of agent of
label: is meer volledige vorm van naam van @nl
label: هو شكل كامل لاسم لـ @ar
definition: يربط بين تسمية ووكيل له شكل كامل للإسم أو جزء من اسم يُعبر عنه بحروف أولية، اختصار، أو بطريقة أخرى أو بأي شكل مختصر أو معدل. @ar
label: er mere fuldstændig navneform på @da
definition: Relaterer et nomen til en agent, som har en mere fuldstændig navneform eller del af navn repræsenteret af et initial, en forkortelse, eller er forkortet eller modificeret på anden måde. @da
label: nimen täydellisempi muoto @fi
definition: Liittää toimijan nomeniin, jolla on nimi tai nimet, jotka sisältävät nimen alkukirjaimilla esitetyn, lyhenteellä lyhennetyn osan tai muuten muokatun nimen täydellisemmän nimenmuodon. @fi
label: ist vollständigere Namensform von @de
definition: Setzt ein Nomen in Beziehung zu einem Akteur, der über eine vollständigere Namensform oder einen Teil eines Namens verfügt, der nur durch eine Initiale, eine Abkürzung oder sonst irgendwie gekürzte oder anderweitig veränderte Form dargestellt wird. @de
label: 是……的名称的较完整形式 @zh-hans
definition: 将一个命名与有用首字母缩写、缩略语、缩短或其他修改形式表示的一个名称或一个名称的部分的较完整的形式的一个行为者关联起来。 @zh-hans
label: teljesebb névformája a következőnek: @hu
definition: Hozzákapcsol egy noment egy ágenshez, amelynek van egy teljesebb névformája, vagy nevének egy részét egy kezdőbetű, rövidítés vagy rövidített, illetve más módosító forma reprezentálja. @hu
label: isminin tam halidir @tr
definition: Bir ismi, bir ismin veya ismin bir kısmının baş harf, kısaltma veya kısaltılmış ya da başka bir şekilde değiştirilmiş bir formla temsil eden tam bir forma sahip temsilciyle ilişkilendirir. @tr

is given name of
status: Published
definition: Relates a nomen to an agent who uses a name given at birth or at some later point in addition to, or instead of, a surname.
type: Property
lexical alias: givenNameOf.en
inverse of: has given name
sub property of: is name of agent of
label: is voornaam van @nl
label: هو اسم أول لـ @ar
definition: يربط بين تسمية ووكيل يستخدم اسم سُمي به عند الولادة أو بعد ذلك إضافة إلى، أو بدلًا من، اسم عائلة. @ar
label: er fornavn på @da
definition: Relaterer et nomen til en agent, som bruger et navn givet ved fødslen eller senere udover, eller i stedet for, et efternavn. @da
label: etunimi @fi
definition: Liittää toimijan nomeniin, joka käyttää toimijalle syntymässä tai myöhempänä ajankohtana sukunimen lisäksi tai sen sijaan annettua nimeä. @fi
label: ist Vorname von @de
definition: Setzt ein Nomen in Beziehung zu einem Akteur, der einen Namen verwendet, der ihm bei der Geburt oder zu einem späteren Zeitpunkt, zusätzlich oder anstatt eines Nachnamens, gegeben wird. @de
label: 是……的名 @zh-hans
definition: 将一个命名与使用出生时或以后某个时间点被赋予的姓以外或取代姓的一个名的一个行为者关联起来。 @zh-hans
label: utóneve a következőnek: @hu
definition: Hozzákapcsol egy noment egy ágenshez, aki születésekor kapott utónevét használja, vagy később vette fel, vagy a vezetékneve helyett használja. @hu
label: adıdır @tr
definition: Bir ismi, soyadına ek olarak veya onun yerine doğumda veya daha sonraki bir zamanda verilen bir ad kullanan bir temsilciyle ilişkilendirir. @tr

has instructor (Deprecated)
definition: Relates a resource to an agent who is a performer who contributes to a resource by teaching or providing a demonstration. (Deprecated)
type: Property
lexical alias: instructor.en
sub property of: has performer
status: Deprecated
label: heeft instructeur @nl
label: له محاضر @ar
definition: يربط بين مصدرووكيل مؤدِ يساهم في مصدر عن طريق التدريس أو تقديم عرض توضيحي. @ar
label: har instruktør @da
definition: Relaterer en ressource til en agent, som er performer, der bidrager til en ressource, ved at undervise eller give en demonstration. @da
label: hat Ausbilderin/Ausbilder @de
definition: Setzt eine Ressource in Beziehung zu einer Ausführenden/einem Ausführenden, die/der zu einer Ressource beiträgt, indem sie/er unterrichtet oder etwas demonstriert. @de
definition: Liittää aineiston toimijaan, joka on aineistossa osallisena opettamalla tai antamalla havaintoesityksen. @fi
label: opettaja @fi
label: oktatója a következő: @hu
definition: Hozzákapcsol egy forrást egy előadó ágenshez, aki hozzájárul egy forráshoz azzal, hogy tanít vagy szemléltetést tart. @hu

has intended audience of nomen
status: Published
definition: Relates a nomen to a class of users for which a nomen is intended.
type: Property
lexical alias: intendedAudienceOfNomen.en
label: heeft beoogd publiek van nomen @nl
label: له جمهور مستهدف بتسمية @ar
definition: يربط بين تسمية وفئة المستخدمين الموجهة إليهم التسمية. @ar
label: har tiltænkt målgruppe for nomen @da
definition: Relaterer et nomen til en klasse af brugere som et nomen er tiltænkt. @da
label: nomenin kohderyhmä @fi
label: hat Zielgruppe eines Nomens @de
definition: Setzt ein Nomen in Beziehung zu einer Gruppe von Benutzenden, für die ein Nomen gedacht ist. @de
definition: Liittää nomenin käyttäjäkuntaan, jolle nomen on suunnattu. @fi
label: 有命名的目标受众 @zh-hans
definition: 将一个命名与一个命名的目标使用者的类关联起来。 @zh-hans
label: nomen célközönsége a következő: @hu
definition: Hozzákapcsol egy noment egy olyan használói osztályhoz, amelynek a noment szánják. @hu
label: ismin hedef kitlesi ile ilişkilidir @tr
definition: Bir ismi, ismin amaçlandığı bir kullanıcı sınıfı ile ilişkilendirir. @tr

has language of nomen
status: Published
definition: Relates a nomen to a language of a nomen.
type: Property
lexical alias: languageOfNomen.en
label: heeft taal van nomen @nl
label: له لغة لتسمية @ar
definition: يربط بين تسمية ولغة اسم. @ar
label: har sprog for nomen @da
definition: Relaterer et nomen til et sprog for en benævnelse. @da
label: nomenin kieli @fi
definition: Liittää nomenin nimityksen kieleen. @fi
label: hat Sprache eines Nomens @de
definition: Setzt ein Nomen in Beziehung zu einer Sprache von einer Bezeichnung. @de
label: 有命名的语言 @zh-hans
definition: 将一个命名与一个命名的一种语言关联起来。 @zh-hans
definition: Relaciona un nomen amb una llengua d’un nomen. @ca
label: nomen nyelve a következő: @hu
definition: Hozzákapcsol egy noment egy megnevezés nyelvéhez. @hu
label: ismin dili ile ilişkilidir @tr
definition: Bir ismi bir ünvan dili ile ilişkilendirir. @tr

has location
status: Published
definition: Relates a place to a delimitation of the physical territory of the place.
type: Property
lexical alias: location.en
label: heeft locatie @nl
label: له موقع @ar
definition: يربط بين مكان وترسيم حدود الأراضي الطبيعية لمكان. @ar
label: har lokation @da
definition: Relaterer et sted til en afgrænsning af stedets fysiske territorium. @da
label: sijainti @fi
definition: Liittää paikan paikan fyysisen alueen rajaukseen. @fi
label: hat Standort @de
definition: Setzt ein Geografikum in Beziehung zu einer Abgrenzung des physischen Gebiets eines Geografikums. @de
label: 有位置 @zh-hans
definition: 将一个地点与一个地点的物理区域的界定关联起来。 @zh-hans
label: elhelyezkedése a következő: @hu
definition: Hozzákapcsol egy helyet a hely fizikai területének lehatárolásához. @hu
label: konum ile ilişkilidir @tr
definition: Bir yeri, o yerin fiziksel bölgesinin sınırlandırılmasıyla ilişkilendirir. @tr

is longitude and latitude of
status: Published
definition: Relates a place to a resource that is a cartographic resource that has an area of coverage that is identified using longitude of the westernmost and easternmost boundaries and latitude of the northernmost and southernmost boundaries.
type: Property
lexical alias: longitudeAndLatitudeOf.en
inverse of: has longitude and latitude
sub property of: is coordinates of cartographic content of
label: is lengtegraad en breedtegraad van @nl
label: هو خط الطول وخط العرض لـ @ar
definition: يربط مكان بمصدر له مصدر خرائطي يحدد منطقة باستخدام خط الطول لأقصى الحدود الغربية والشرقية وخط العرض لأقصى الحدود الشمالية والجنوبية. @ar
label: er længdegrad og breddegrad af @da
definition: Relaterer et sted til en ressource, der er en kartografisk ressource, som har et dækningsområde, der er identificeret ved hjælp af længdegraden på de vestligste og østligste grænser og breddegraden på de nordligste og sydligste grænser. @da
label: pituus- ja leveysasteet @fi
definition: Liittää paikan aineistoon, joka on kartografinen aineisto, jonka kattama alue indentifioidaan käyttämällä läntisimmän ja itäisimmän rajan pituusastetta sekä pohjoisimman ja eteläisimmän rajan leveysastetta. @fi
label: ist Längengrad und Breitengrad von @de
definition: Setzt ein Gebiet in Beziehung zu einer kartografischen Ressource, deren Abdeckungsbereich anhand des Längengrads der westlichsten und östlichsten Grenze sowie des Breitengrads der nördlichsten und südlichsten Grenze identifiziert wird. @de
label: 是……的经度和纬度 @zh-hans
definition: 将一个地点与作为地图资源、有覆盖范围、用最西和最东边界的经度以及最北和最南边界的纬度标识的一种资源关联起来。 @zh-hans
label: hosszúsági és szélességi foka a következőnek: @hu
definition: Hozzákapcsol egy helyet egy kartográfiai forráshoz, amely egy terület elhelyezkedésének meghatározásához legnyugatibb és legkeletibb határainak hosszúsági, valamint a legészakibb és legdélibb határainak szélességi fokát használja. @hu
label: enlemi ve boylamıdır @tr
definition: Bir yeri, en batı ve en doğu sınırlarının boylamı ve en kuzey ve en güney sınırlarının enlemi kullanılarak tanımlanan bir kapsama alanına sahip kartografik kaynak olan bir kaynakla ilişkilendirir. @tr

has name of agent of resource
status: Published
definition: Relates a resource to a nomen that is a name of an agent who is responsible for distributing, printing, duplicating, casting, publishing, releasing, issuing, etc., a published resource, or inscribing, fabricating, constructing, etc., an unpublished resource.
type: Property
lexical alias: nameOfAgentOfResource.en
inverse of: is name of agent of resource of
sub property of: has related nomen of resource
label: heeft naam van actor van resource @nl
label: له اسم وكيل لمصدر @ar
definition: يربط بين مصدر واسم وكيل مسؤول عن توزيع، طباعة، نسخ، صب، نشر، تحرير، إصدار...إلخ، مصدرًا منشور، أو تسجيل، تصنيع، إنشاء...إلخ، مصدرًا غير منشور. @ar
label: har navn på agent for ressource @da
label: hat Namen eines Akteurs einer Ressource @de
definition: Setzt eine Ressource in Beziehung zu einem Namen eines Akteurs, der für den Vertrieb, den Druck, die Vervielfältigung, den Guss, das Veröffentlichen, das Release, die Herausgabe und so weiter einer veröffentlichten Ressource oder der für das Gravieren, Fabrizieren, Konstruieren und so weiter einer unveröffentlichten Ressource verantwortlich ist. @de
label: toimijan nimi @fi
definition: Liittää aineiston nomeniin, joka on painetun aineiston jakelusta, painamisesta, monistamisesta, julkaisemisesta jne. vastaavan toimijan nimi tai julkaisemattoman aineiston kirjoittamisesta, valmistamisesta, rakentamisesta jne. vastaavan toimijan nimi. @fi
label: 有资源的行为者的名称 @zh-hans
definition: 将一种资源与作为负责一种出版资源的经销、印刷、复制、铸造、出版、发布、发行等、或者一种非出版资源的镌刻、制造、构造等的一个行为者的名称的一个命名关联起来。 @zh-hans
label: forrás ágensének neve a következő: @hu
definition: Hozzákapcsol egy forrást egy nomenhez, amely egy olyan ágens neve, amely felelős egy kiadott forrás terjesztéséért, nyomtatásáért, sokszorosításáért, öntéséért, kiadásáért, kibocsájtásáért, megjelentetéséért stb., vagy egy kiadatlan forrás írásáért, összeállításáért, készítéséért, stb. @hu
label: kaynak temsilcisinin adı ile ilişkilidir @tr
definition: Bir kaynağı, yayınlanmış bir kaynağı dağıtmaktan, basmaktan, çoğaltmaktan, yayınlamaktan, piyasaya sürmekten, çıkarmaktan vb. veya yayınlanmamış bir kaynağı yazmaktan, üretmekten, yapmaktan vb. sorumlu olan bir aracının adı olan bir isimle ilişkilendirir. @tr

is name of agent of resource of
status: Published
definition: Relates a nomen to a resource that has a name of agent who is responsible for distribution, printing, duplication, casting, publication, release, issue, etc., or inscription, fabrication, construction, etc.
type: Property
lexical alias: nameOfAgentOfResourceOf.en
inverse of: has name of agent of resource
sub property of: has related resource of nomen
label: is naam van actor van resource van @nl
label: هو اسم وكيل لمصدر لـ @ar
definition: يربط تسمية بمصدر له اسم وكيل مسؤول عن التوزيع، الطباعة، النسخ، الصب، النشر، التحرير، الإصدار...إلخ، أو التسجيل، أو التصنيع، أو الإنشاء...إلخ. @ar
label: ist Name eines Akteurs einer Ressource von @de
definition: Setzt ein Nomen in Beziehung zu einer Ressource, die über einen Namen eines Akteurs verfügt, der für den Vertrieb, den Druck, die Vervielfältigung, den Guss, das Veröffentlichen, das Release, die Herausgabe und so weiter oder für das Gravieren, Fabrizieren, Konstruieren und so weiter verantwortlich ist. @de
label: toimijan nimi @fi
definition: Liittää nomenin aineistoon, jolla on painetun aineiston jakelusta, painamisesta, monistamisesta, julkaisemisesta jne. vastaavan toimijan nimi tai julkaisemattoman aineiston kirjoittamisesta, valmistamisesta, rakentamisesta jne. vastaavan toimijan nimi. @fi
label: 是……的资源的行为者的名称 @zh-hans
definition: 将一个命名与有负责发行、印刷、复制、铸造、出版、发布、经销等或者镌刻、制造、构建等的行为者的名称的一种资源关联起来。 @zh-hans
label: ágensneve a következő forrásnak: @hu
definition: Hozzákapcsol egy noment egy forráshoz, amelyhez hozzátartozik egy olyan ágensnek a neve, amely felelős a terjesztésért, nyomtatásért, sokszorosításért, öntéséért, kiadásért, kibocsájtásért, megjelentetésért stb., vagy írásáért, összeállításért, készítéséért, stb. @hu
label: kaynağının temsilcisinin adıdır @tr
definition: Bir ismi, dağıtım, basım, çoğaltma, yayınlama, piyasaya sürme, ihraç etme vb. işlemlerden veya yazım, üretim, yapım vb. işlemlerden sorumlu bir aracı ismi olan bir kaynakla ilişkilendirir. @tr

is parallel title of series of
status: Published
definition: Relates a nomen to a resource that has a title of series in another language or script.
type: Property
lexical alias: parallelTitleOfSeriesOf.en
inverse of: has parallel title of series
sub property of: is title of series of
label: is parallelle reekstitel van @nl
label: هو عنوان موازِ لسلسلة لـ @ar
definition: يربط تسمية بمصدر له عنوان سلسلة في لغة أخرى أو نص أخر. @ar
label: er parallel serietitel på @da
definition: Relaterer et nomen til en ressource, der har en serietitel på et andet sprog eller på en anden skrift. @da
label: sarjan rinnakkainen nimeke @fi
definition: Liittää nomenin aineistoon, jolla on sarjan nimeke toisella kielellä tai kirjoitusjärjestelmällä. @fi
label: ist Paralleltitel einer Reihe von @de
definition: Setzt ein Nomen in Beziehung zu einer Ressource, die einen Titel einer Reihe hat, der in einer anderen Sprache oder einer anderen Schrift vorliegt. @de
label: 是……的并列丛编题名 @zh-hans
definition: 将一个命名与有用另一种语言或文字的丛编题名的一种资源关联起来。 @zh-hans
label: párhuzamos sorozati címe a következőnek: @hu
definition: Hozzákapcsol egy noment egy forráshoz, amelynek van egy sorozatcíme más nyelven vagy írásrendszerben. @hu
label: serisinin paralel başlığıdır @tr
definition: Bir ismi,farklı bir dilde ya da metinde seri başlığı olan bir kaynakla ilişilendirir. @tr

has place of resource
status: Published
definition: Relates a resource to a place that is associated with the distribution, printing, duplicating, casting, publication, release, or issuing, etc., of a published resource, or the inscription, fabrication, construction, etc., of an unpublished resource.
type: Property
lexical alias: placeOfResource.en
inverse of: is place of resource of
sub property of: has related place of resource
label: heeft plaats van resource @nl
label: له مكان لمصدر @ar
definition: يربط بين مصدر ومكان مرتبط بطباعة، نسخ، صب، نشر، تحرير، إصدار...إلخ، مصدرًا منشورًا، أو تسجيل، تصنيع، إنشاء...إلخ، مصدرًا غير منشور. @ar
label: aineiston paikka @fi
definition: Liittää aineiston paikkaan, jossa julkaistu aineisto on kustannettu, julkaistu, ilmestynyt, painettu, monistettu, valettu kirjasinten osalta tai jaettu. Liittää aineiston paikkaan, jossa julkaisematon aineisto on kaiverrettu, valmistettu, koottu tai muuten tuotettu. @fi
label: hat Ort einer Ressource @de
definition: Setzt eine Ressource in Beziehung zu einem Geografikum, das mit dem Vertrieb, dem Druck, der Vervielfältigung, dem Guss, der Veröffentlichung, dem Release oder der Herausgabe und so weiter einer veröffentlichten Ressource oder mit der Beschriftung, der Fabrikation, der Konstruktion und so weiter einer unveröffentlichten Ressource in Verbindung steht. @de
label: 有资源的地点 @zh-hans
definition: 将一种资源与和一种出版资源的经销、印刷、复制、铸造、出版、发布或发行有关的一个地点、或者和一种非出版资源的镌刻、制造、构造或其他方式制作有关的一个地点关联起来。 @zh-hans
label: forrás helye a következő: @hu
definition: Hozzákapcsol egy forrást egy helyhez, amely egy kiadott forrás terjesztéséhez, nyomtatásához, sokszorosításához, öntéséhez, kiadásához, kibocsájtásához, megjelentetéséhez stb., vagy egy kiadatlan forrás írásához, összeállításához, készítéséhez stb. kapcsolódik. @hu
label: kaynak yeri ile ilişkilidir @tr
definition: Bir kaynağı, yayınlanmış bir kaynağın dağıtımı, basımı, çoğaltılması, yayınlanması, piyasaya sürülmesi veya çıkarılması vb. ile veya yayınlanmamış bir kaynağın yazımı, üretimi, yapımı vb. ile ilişkili bir yerle ilişkilendirir. @tr

is place of resource of
status: Published
definition: Relates a place to a resource that is a published resource that is distributed, printed, duplicated, cast, published, released, or issued, etc., or an unpublished resource that is inscribed, fabricated, constructed, etc., in a place.
type: Property
lexical alias: placeOfResourceOf.en
inverse of: has place of resource
sub property of: has related resource of place
label: is plaats van resource van @nl
label: هو مكان لمصدر لـ @ar
definition: يربط مكان بمصدر يُعد مصدرًا منشورًا يتم توزيعه، طباعته، نسخه، صبه، نشره، تحريره، أو إصداره...إلخ، أو يعد مصدرًا غير مطبوع يتم تسجيله أو تصنيعه أو إنشائه...إلخ، في مكان ما. @ar
label: aineiston paikka @fi
definition: Liittää paikan aineistoon, joka on kustannettu, julkaistu, ilmestynyt, painettu, monistettu, valettu kirjasinten osalta tai jaettu. Liittää aineiston paikkaan, jossa julkaisematon aineisto on kaiverrettu, valmistettu, koottu tai muuten tuotettu. @fi
label: ist Ort einer Ressource von @de
definition: Setzt ein Geografikum in Beziehung zu einer veröffentlichten Ressource, die an einem Geografikum vertrieben, gedruckt, vervielfältigt, gegossen, veröffentlicht, freigegeben oder herausgegeben und so weiter wird oder zu einer unveröffentlichte Ressource, die an einem Geografikum beschriftet, fabriziert, konstruiert und so weiter wird. @de
label: 是……的资源的地点 @zh-hans
definition: 将一个地点与作为一种出版资源在一个地点被发行、印刷、复制、铸造、出版、发布或经销等、或者一种非出版资源在一个地点被镌刻、制造、构造等的一种资源关联起来。 @zh-hans
label: helye a következő forrásnak: @hu
definition: Hozzákapcsol egy helyet egy kiadott forráshoz, amelyet terjesztenek, nyomtatnak, sokszorosítanak, öntenek, kiadnak, kibocsájtanak vagy megjelentetnek stb. vagy kiadatlan forráshoz, amelyet bejegyeznek, gyártanak, összeállítanak stb. egy helyen. @hu
label: kaynağının yeridir @tr
definition: Bir yeri, dağıtılan, basılan, çoğaltılan, yayınlanan, piyasaya sürülen veya çıkarılan, vb. yayınlanmış bir kaynak veya bir yere yazılan, üretilen, yapılan, vb. yayınlanmamış bir kaynak olan bir kaynakla ilişkilendirir. @tr

is reference source of
status: Published
definition: Relates a resource to a nomen for which evidence of use is provided by a resource.
type: Property
lexical alias: referenceSourceOf.en
inverse of: has reference source
label: is naslagwerk van @nl
label: هو مصدر مرجعي لـ @ar
definition: يربط بين مصدر وتسمية يتم تقديم دليل على استخدامها بواسطة مصدر. @ar
label: er referencekilde af @da
definition: Relaterer en ressource til et nomen, hvor evidens for brug gives af en ressource. @da
label: tietolähde @fi
definition: Liittää aineiston nomeniin, jonka käytöstä aineisto on todiste. @fi
label: ist Nachschlagewerk von @de
definition: Setzt eine Ressource in Beziehung zu einem Nomen, für das ein Verwendungsnachweis durch eine Ressource zur Verfügung gestellt wird. @de
label: 是……的参考信息源 @zh-hans
definition: 将一种资源与由一种资源提供其使用证据的一个命名关联起来。 @zh-hans
label: irodalomjegyzékben szereplő forrása a következőnek: @hu
definition: Hozzákapcsol egy forrást egy nomenhez, amelynek használatát egy forrás bizonyítja. @hu
label: referans kaynağıdır @tr
definition: Bir kaynağı, bir kaynak tarafından kullanıldığının kanıtını sunan bir isimle ilişkilendirir. @tr

is right ascension and declination of
status: Published
definition: Relates a place to a resource that is a cartographic resource that locates a celestial body that is the coverage of the resource and is identified using the angles of right ascension and declination.
type: Property
lexical alias: rightAscensionAndDeclinationOf.en
inverse of: has right ascension and declination
sub property of: is coordinates of cartographic content of
label: is rechte klimming en declinatie van @nl
label: هو صعود مستقيم وانحراف لـ @ar
definition: يربط مكان بمصدر عبارة عن مصدر خرائطي يحدد جرم سماوي عبارة عن تغطية المصدر ويتم تحديده باستخدام زوايا الصعود المستقيم والانحراف. @ar
label: er rektascension og deklination for @da
definition: Relaterer et sted til en ressource, som er en kartografisk ressource, der lokaliserer et himmellegeme, der er dækning for ressourcen, og som er identificeret ved hjælp af vinklerne for rekstascension og deklination. @da
label: rektaskensio ja deklinaatio @fi
definition: Liittää paikan aineistoon, joka on kartografinen aineisto, joka määrittää taivaankappaleen sijainnin ja teoksen sisällöllisen kattavuuden käyttämällä rektaskension ja deklinaation kulmamittoja. @fi
label: Rektaszension und Deklination von @de
definition: Setzt einen Ort in Beziehung zu einer kartografischen Ressource, die einen Himmelskörpers verortet, der Gegenstand der Ressource ist und anhand der Winkel der Rektaszension und der Deklination identifiziert wird. @de
label: 是……的赤经和赤纬 @zh-hans
definition: 将一个地点与作为地图资源、定位作为作品覆盖范围并用赤经和赤纬的角度标识的天体的一种资源关联起来。 @zh-hans
label: rektaszcenziója és deklinációja a következőnek: @hu
definition: Hozzákapcsol egy helyet egy kartográfiai forráshoz, amely rektaszcenzió és deklináció szögei segítségével határozza meg a forrás által lefedett égitestek helyzetét az égbolton. @hu
label: yükseliş ve düşüş @tr
definition: Bir yeri, kaynağın kapsamı olan ve yükseliş ve sapma açıları kullanılarak tanımlanan bir gök cisminin yerini belirleyen kartografik kaynak olan bir kaynakla ilişkilendirir. @tr

is strings of coordinate pairs of
status: Published
definition: Relates a place to a resource that is a cartographic resource that has an area of coverage that is identified by a polygon using coordinates for each vertex.
type: Property
lexical alias: stringsOfCoordinatePairsOf.en
inverse of: has strings of coordinate pairs
sub property of: is coordinates of cartographic content of
label: is tekenreeksen van coördinatenparen van @nl
label: هو خطوط إحداثيات مزدوجة لـ @ar
definition: يربط مكان بمصدر عبارة عن مصدر خرائطي يحدد بدقة منطقة معينة باستخدام إحداثيات لكل قمة مضلع. @ar
label: er strenge af koordinatpar for @da
definition: Relaterer et sted til en ressource, som er en kartografisk ressource, der har et dækningsområde, der identificeres af en polygon ved hjælp af koordinater for hvert toppunkt. @da
label: koordinaattiparit @fi
definition: Liittää paikan aineistoon, joka on kartografinen aineisto, jonka kattama alue identifioidaan polygonein käyttämällä monikulmion jokaisen kärjen koordinaatteja. @fi
label: sind Reihen von Koordinatenpaaren von @de
definition: Setzt ein Gebiet in Beziehung zu einer kartografischen Ressource, deren Abdeckungsbereich durch ein Vieleck mit Koordinaten für jeden Eckpunkt identifiziert wird. @de
label: 是……的坐标对串 @zh-hans
definition: 将一个地点与作为地图资源、有通过使用每个角的坐标表示的多边形标识的覆盖范围的一种资源关联起来。 @zh-hans
label: koordinátapár-láncai a következőnek: @hu
definition: Hozzákapcsol egy helyet egy kartográfiai forráshoz, amely egy pontos terület azonosításához a poligon csúcsainak koordinátáit használja. @hu
definition: Relaciona un lloc amb un recurs que és un recurs cartogràfic que té una àrea de cobertura que s’identifica per un polígon mitjançant les coordenades de cada vèrtex. @ca
label: koordinat çiftlerinin dizileridir @tr
definition: Bir yeri, her bir köşe için koordinatlar kullanılarak bir çokgenle tanımlanan bir kapsama alanına sahip bir kartografik kaynak olan bir kaynakla ilişkilendirir. @tr

is surname of
status: Published
definition: Relates a nomen to an agent who uses a family name.
type: Property
lexical alias: surnameOf.en
inverse of: has surname
sub property of: is name of agent of
label: is achternaam van @nl
label: هو اسم عائلة لـ @ar
definition: يربط بين تسمية ووكيل يستخدم اسم عائلة. @ar
label: er efternavn på @da
definition: Relaterer et nomen til en agent, som bruger et famillienavn @da
label: sukunimi @fi
definition: Liittää nomenin toimijaan, joka käyttää suvun nimeä. @fi
label: ist Nachname von @de
definition: Setzt ein Nomen in Beziehung zu einem Akteur, der einen Familiennamen verwendet. @de
label: 是……的姓 @zh-hans
definition: 将一个命名与使用家族名的一个行为者关联起来。 @zh-hans
label: vezetékneve a következőnek: @hu
definition: Hozzákapcsol egy noment egy ágenshez, aki családnevet használ. @hu
label: soyadıdır @tr
definition: Bir ismi, soyadını kullanan bir temsilciyle ilişkilendirir. @tr

is first alphanumeric designation of alternative sequence of
status: Published
definition: Relates a nomen to a resource that has a designation in the form of numbers or alphabetic characters that is used to indicate the first in a concurrent sequence of numbering of parts or iterations.
type: Property
lexical alias: firstAlphanumericDesignationOfAlternativeSequenceOf.en
inverse of: has first alphanumeric designation of alternative sequence
sub property of: is first alphanumeric designation of sequence of
label: is eerste alfanumerieke aanduiding van alternatieve volgorde van @nl
label: هو تسمية أبجدية رقمية أولى لتسلسل بديل لـ @ar
definition: يربط تسمية بمصدر له تسمية على شكل أرقام أو حروف هجائية مستخدمة لتشير إلى أول تسلسل رقمي متزامن للأجزاء أو الأعداد. @ar
label: vaihtoehtoisen numerointijakson ensimmäinen numero- tai kirjainmäärite @fi
definition: Liittää nomeniin aineistoon, jolla on numeroista tai kirjaimista muodostuva määrite, joka on aineiston osien tai iteraatioiden rinnakkaisen numerointijakson ensimmäinen määrite. @fi
label: ist alternative alphanumerische Bezeichnung der ersten Ausgabe oder des ersten Teils einer Folge von @de
definition: Setzt ein Nomen in Beziehung zu einer Ressource, die über eine Bezeichnung in Form von Nummern oder Buchstaben verfügt, die verwendet wird, um in einer alternativen Zählfolge der Ausgaben oder Iterationen auf die erste hinzuweisen. @de
label: 是……的交替序列的第一个字母数字标识 @zh-hans
definition: 将一个命名与有以数字或字母字符形式标识用于标识部分或更新后整体的并存编号序列中第一个的一种资源关联起来。 @zh-hans
label: alfanumerikus kezdőjelölése a következő alternatív sorrendiségének: @hu
definition: Hozzákapcsol egy noment egy forráshoz, amelynek megjelölése számok vagy alfabetikus karakterek formájában jelzi az elsőséget a részek vagy iterációk konkurens számozási sorrendjében. @hu
label: alternatif sırasının ilk alfanümerik tanımlanmasıdır @tr
definition: Bir ismi, daha büyük bir kaynağın bağımsız parçaları veya daha büyük bir kaynağın parçaları veya konuları sırasındaki konumunu tanımlayan bir belirteç olan bir kaynakla ilişkilendirir. @tr

is first alphanumeric designation of sequence of
status: Published
definition: Relates a nomen to a resource that has a designation in the form of numbers or alphabetic characters that is used to indicate the first in a sequence of numbering of parts or iterations.
type: Property
lexical alias: firstAlphanumericDesignationOfSequenceOf.en
inverse of: has first alphanumeric designation of sequence
sub property of: has related resource of nomen
label: is eerste alfanumerieke aanduiding van volgorde van @nl
label: هو تسمية أبجدية رقمية أولى لتسلسل لـ @ar
definition: يربط تسمية بمصدر له تسمية على شكل أرقام أو حروف هجائية مستخدمة لتشير إلى أول تسلسل رقمي للأجزاء أو الأعداد. @ar
label: numerointijakson ensimmäinen numero- tai kirjainmäärite @fi
definition: Liittää nomeniin aineistoon, jolla on numeroista tai kirjaimista muodostuva määrite, joka on aineiston osien tai iteraatioiden numerointijakson ensimmäinen määrite. @fi
label: ist alphanumerische Bezeichnung der ersten Ausgabe einer fortlaufenden Ressource von @de
definition: Setzt ein Nomen in Beziehung zu einer Ressource, die über eine Bezeichnung in Form von Nummern oder Buchstaben verfügt, die verwendet wird, um in einer Zählfolge der Ausgaben auf die erste hinzuweisen. @de
label: 是……的序列的第一个字母数字标识 @zh-hans
definition: 将一个命名与有以数字或字母字符形式标识用于标识部分或更新后整体的编号序列中第一个的一种资源关联起来。 @zh-hans
label: alfanumerikus kezdőjelölése a következő sorrendiségének: @hu
definition: Hozzákapcsol egy noment egy forráshoz, amelynek megjelölése számok vagy alfabetikus karakterek formájában jelzi az elsőséget a részek vagy iterációk számozási sorrendjében. @hu
has subproperty: is first alphanumeric designation of alternative sequence of
label: sırasının ilk alfanümerik tanımlanmasıdır @tr
definition: Bir ismi, parçaların veya yinelemelerin bir numaralandırma dizisindeki ilkini belirtmek için kullanılan sayılar veya alfabetik karakterler biçiminde tanımlaması olan bir kaynakla ilişkilendirir. @tr

is first chronological designation of alternative sequence of
status: Published
definition: Relates a nomen to a resource that has a designation in the form of a date or other timespan that is used to indicate the first in a concurrent sequence of numbering of parts or iterations.
type: Property
lexical alias: firstChronologicalDesignationOfAlternativeSequenceOf.en
inverse of: has first chronological designation of alternative sequence
sub property of: is first chronological designation of sequence of
label: is eerste chronologische aanduiding van alternatieve volgorde van @nl
label: هو تسمية زمنية أولى لتسلسل بديل لـ @ar
definition: يربط تسمية بمصدر له تسمية على شكل تاريخ أو فترة زمنية أخرى مستخدمة لتشير إلى أول تسلسل رقمي متزامن الأجزاء أو الأعداد. @ar
label: vaihtoehtoisen numerointijakson ensimmäinen aikamäärite @fi
definition: Liittää nomenin aineistoon, jolla on päivämäärästä tai muusta ajanjaksosta muodostuva määrite, joka on aineiston osien tai iteraatioiden rinnakkaisen numerointijakson ensimmäinen määrite. @fi
label: ist alternative chronologische Bezeichnung einer ersten Ausgabe einer fortlaufenden Ressource von @de
definition: Setzt ein Nomen in Beziehung zu einer Ressource, die über eine Bezeichnung in Form eines Datums oder eines anderen Zeitraums verfügt, die verwendet wird, um in einer alternativen Zählfolge der Ausgaben auf die erste hinzuweisen. @de
label: 是……的交替序列的第一个年代标识 @zh-hans
definition: 将一个命名与有以日期或其他时间段形式标识用于标识部分或更新后整体的并存编号序列中第一个的一种资源关联起来 @zh-hans
label: kronológiai kezdőjelölése a következő alternatív sorrendiségének: @hu
definition: Hozzákapcsol egy noment egy forráshoz, amelynek megjelölése dátum vagy más időtartam formájában jelzi az elsőséget a részek vagy iterációk konkurens számozási sorrendjében. @hu
label: alternatif sırasının ilk kronolojik tanımlanmasıdır @tr
definition: Bir isim, parçaların veya yinelemelerin eşzamanlı bir numaralandırma dizisinde ilkini belirtmek için kullanılan bir tarih veya başka bir zaman aralığı şeklinde bir tanıma sahip bir kaynakla ilişkilendirir. @tr

is first chronological designation of sequence of
status: Published
definition: Relates a nomen to a resource that has a designation in the form of a date or other timespan that is used to indicate the first in a sequence of numbering of parts or iterations.
type: Property
lexical alias: firstChronologicalDesignationOfSequenceOf.en
inverse of: has first chronological designation of sequence
sub property of: has related resource of nomen
label: is eerste chronologische aanduiding van volgorde van @nl
label: هو تسمية زمنية أولى لتسلسل لـ @ar
definition: يربط تسمية بمصدر له تسمية على شكل تاريخ أو فترة زمنية أخرى مستخدمة لتشير إلى أول تسلسل رقمي للأجزاء أو الأعداد. @ar
label: numerointijakson ensimmäinen aikamäärite @fi
definition: Liittää nomenin aineistoon, jolla on päivämäärästä tai muusta ajanjaksosta muodostuva määrite, joka on aineiston osien tai iteraatioiden numerointijakson ensimmäinen määrite. @fi
label: ist chronologische Bezeichnung der ersten Ausgabe einer fortlaufenden Ressource von @de
definition: Setzt ein Nomen in Beziehung zu einer Ressource, die über eine Bezeichnung in Form eines Datums oder eines anderen Zeitraums verfügt, die verwendet wird, um in einer Zählfolge der Ausgaben auf die erste hinzuweisen. @de
label: 是……的序列的第一个年代标识 @zh-hans
definition: 将一个命名与有以日期或其他时间段形式标识用于标识部分或更新后整体的编号序列中第一个的一种资源关联起来。 @zh-hans
label: kronológiai kezdőjelölése a következő sorrendiségének: @hu
definition: Hozzákapcsol egy noment egy forráshoz, amelynek megjelölése dátum vagy más időtartam formájában jelzi az elsőséget a részek vagy iterációk számozási sorrendjében. @hu
has subproperty: is first chronological designation of alternative sequence of
label: sırasının ilk kronolojik tanımlanmasıdır @tr
definition: Bir ismi, parçaların veya yinelemelerin numaralandırılması dizisinde ilkini belirtmek için kullanılan bir tarih veya başka bir zaman aralığı şeklinde bir tanıma sahip bir kaynakla ilişkilendirir. @tr

is last alphanumeric designation of alternative sequence of
status: Published
definition: Relates a nomen to a resource that has a designation in the form of numbers or alphabetic characters that is used to indicate the last in a concurrent sequence of numbering of parts or iterations.
type: Property
lexical alias: lastAlphanumericDesignationOfAlternativeSequenceOf.en
inverse of: has last alphanumeric designation of alternative sequence
sub property of: is last alphanumeric designation of sequence of
label: is laatste alfanumerieke aanduiding van alternatieve volgorde van @nl
label: هو تسمية أبجدية رقمية أخيرة لتسلسل بديل لـ @ar
definition: يربط تسمية بمصدر له تسمية على شكل أرقام أو حروف هجائية مستخدمة لتشير إلى آخر تسلسل رقمي متزامن للأجزاء أو الأعداد. @ar
label: vaihtoehtoisen numerointijakson viimeinen numero- tai kirjainmäärite @fi
definition: Liittää nomeniin aineistoon, jolla on numeroista tai kirjaimista muodostuva määrite, joka on aineiston osien tai iteraatioiden rinnakkaisen numerointijakson viimeinen määrite. @fi
label: ist alternative alphanumerische Bezeichnung der letzten Ausgabe einer fortlaufenden Ressource von @de
definition: Setzt ein Nomen in Beziehung zu einer Ressource, die über eine Bezeichnung in Form von Nummern oder Buchstaben verfügt, die verwendet wird, um in einer alternativen Zählfolge der Ausgaben auf die letzte hinzuweisen. @de
label: 是……的交替序列的最后一个字母数字标识 @zh-hans
definition: 将一个命名与有以数字或字母字符形式标识用于标识部分或更新后整体的并存编号序列中最后一个的一种资源关联起来。 @zh-hans
label: alfanumerikus zárójelölése a következő alternatív sorrendiségének: @hu
definition: Hozzákapcsol egy noment egy forráshoz, amelynek megjelölése számok vagy alfabetikus karakterek formájában jelzi az utolsót a részek vagy iterációk konkurens számozási sorrendjében. @hu
label: alternatif sırasının son alfanümerik tanımlanmasıdır @tr
definition: Bir isimi, parçaların veya yinelemelerin eşzamanlı bir numaralandırma dizisinin sonuncusunu belirtmek için kullanılan sayılar veya alfabetik karakterler biçiminde bir tanıma sahip bir kaynakla ilişkilendirir. @tr

is last alphanumeric designation of sequence of
status: Published
definition: Relates a nomen to a resource that has a designation in the form of numbers or alphabetic characters that is used to indicate the last in a sequence of numbering of parts or iterations.
type: Property
lexical alias: lastAlphanumericDesignationOfSequenceOf.en
inverse of: has last alphanumeric designation of sequence
sub property of: has related resource of nomen
label: is laatste alfanumerieke aanduiding van volgorde van @nl
label: هو تسمية أبجدية رقمية أخيرة لتسلسل لـ @ar
definition: يربط تسمية بمصدر له تسمية على شكل أرقام أو حروف هجائية مستخدمة لتشير إلى آخر تسلسل رقمي للأجزاء أو الأعداد. @ar
label: numerointijakson viimeinen numero- tai kirjainmäärite @fi
definition: Liittää nomeniin aineistoon, jolla on numeroista tai kirjaimista muodostuva määrite, joka on aineiston osien tai iteraatioiden numerointijakson viimeinen määrite. @fi
label: ist alphanumerische Bezeichnung der letzten Ausgabe einer fortlaufenden Ressource von @de
definition: Setzt ein Nomen in Beziehung zu einer Ressource, die über eine Bezeichnung in Form von Nummern oder Buchstaben verfügt, die verwendet wird, um in einer Zählfolge der Ausgaben auf die letzte hinzuweisen. @de
label: 是……的序列的最后一个字母数字标识 @zh-hans
definition: 将一个命名与有以数字或字母字符形式标识用于标识部分或更新后整体的编号序列中最后一个的一种资源关联起来。 @zh-hans
label: záró alfanumerikus megjelölése a következő sorrendiségének: @hu
definition: Hozzákapcsol egy noment egy forráshoz, amelynek megjelölése számok vagy alfabetikus karakterek formájában jelzi az utolsót a részek vagy iterációk számozási sorrendjében. @hu
has subproperty: is last alphanumeric designation of alternative sequence of
label: sırasının son alfanümerik tanımlanmasıdır @tr
definition: Bir ismi, parçaların veya yinelemelerin numaralandırılması dizisinin sonuncusunu belirtmek için kullanılan sayılar veya alfabetik karakterler biçiminde bir tanıma sahip bir kaynakla ilişkilendirir. @tr

is last chronological designation of alternative sequence of
status: Published
definition: Relates a nomen to a resource that has a designation in the form of a date or other timespan that is used to indicate the last in a concurrent sequence of numbering of parts or iterations.
type: Property
lexical alias: lastChronologicalDesignationOfAlternativeSequenceOf.en
inverse of: has last chronological designation of alternative sequence
sub property of: is last chronological designation of sequence of
label: is laatste chronologische aanduiding van alternatieve volgorde van @nl
label: هو تسمية زمنية أخيرة لتسلسل بديل لـ @ar
definition: يربط تسمية بمصدر له تسمية على شكل تاريخ أو فترة زمنية أخرى مستخدمة لتشير إلى آخر تسلسل رقمي متزامن للأجزاء أو الأعداد. @ar
label: vaihtoehtoisen numerointijakson viimeinen aikamäärite @fi
definition: Liittää aineistoon nomenin, joka on päivämäärästä tai muusta ajanjaksosta muodostuva määrite, joka on osien tai iteraatioiden rinnakkaisen numerointijakson viimeinen määrite. @fi
label: ist alternative chronologische Bezeichnung der letzten Ausgabe einer fortlaufenden Ressource von @de
definition: Setzt ein Nomen in Beziehung zu einer Ressource, die über eine Bezeichnung in Form eines Datums oder eines anderen Zeitraums verfügt, die verwendet wird, um in einer alternativen Zählfolge der Ausgaben auf die letzte hinzuweisen. @de
label: 是……的交替序列的最后一个年代标识 @zh-hans
definition: 将一个命名与有以日期或其他时间段形式标识用于标识部分或更新后整体的并存编号序列中最后一个的一种资源关联起来。 @zh-hans
label: kronológiai zárójelölése a következő alternatív sorrendiségének: @hu
definition: Hozzákapcsol egy noment egy forráshoz, amelynek megjelölése dátum vagy más időtartam formájában jelzi az utolsót a részek vagy iterációk konkurens számozási sorrendjében. @hu
label: alternatif sırasının son kronolojik tanımlanmasıdır @tr
definition: Bir ismi, parçaların veya yinelemelerin eşzamanlı bir numaralandırma dizisinin sonuncusunu belirtmek için kullanılan bir tarih veya başka bir zaman aralığı şeklinde bir tanıma sahip bir kaynakla ilişkilendirir. @tr

is last chronological designation of sequence of
status: Published
definition: Relates a nomen to a resource that has a designation in the form of a date or other timespan that is used to indicate the last in a sequence of numbering of parts or iterations.
type: Property
lexical alias: lastChronologicalDesignationOfSequenceOf.en
inverse of: has last chronological designation of sequence
sub property of: has related resource of nomen
label: is laatste chronologische aanduiding van volgorde van @nl
label: هو تسمية زمنية أخيرة لتسلسل لـ @ar
definition: يربط تسمية بمصدر له تسمية على شكل تاريخ أو فترة زمنية أخرى مستخدمة لتشير إلى آخر تسلسل رقمي للأجزاء أو الأعداد. @ar
label: numerointijakson viimeinen aikamäärite @fi
definition: Liittää nomenin aineistoon, jolla on päivämäärästä tai muusta ajanjaksosta muodostuva määrite, joka on osien tai iteraatioiden rinnakkaisen numerointijakson viimeinen määrite. @fi
label: ist chronologische Bezeichnung der letzten Ausgabe einer fortlaufenden Ressource von @de
definition: Setzt ein Nomen in Beziehung zu einer Ressource, die über eine Bezeichnung in Form eines Datums oder eines anderen Zeitraums verfügt, die verwendet wird, um in einer Zählfolge der Ausgaben auf die letzte hinzuweisen. @de
label: 是……的序列的最后一个年代标识 @zh-hans
definition: 将一个命名与有以日期或其他时间段形式标识用于标识部分或更新后整体的编号序列中最后一个的一种资源关联起来。 @zh-hans
label: kronológiai zárójelölése a következő sorrendiségének: @hu
definition: Hozzákapcsol egy noment egy forráshoz, amelynek megjelölése dátum vagy más időtartam formájában jelzi az utolsót a részek vagy iterációk számozási sorrendjében. @hu
has subproperty: is last chronological designation of alternative sequence of
label: sırasının son kronolojik tanımlanmasıdır @tr
definition: Bir ismi, parçaların veya yinelemelerin numaralandırılması dizisinin sonuncusunu belirtmek için kullanılan bir tarih veya başka bir zaman aralığı şeklinde bir tanıma sahip bir kaynakla ilişkilendirir. @tr

is numbering within sequence of
status: Published
definition: Relates a nomen to a resource that has a designation that identifies its position in a sequence of individual parts of a larger resource or parts or issues of a larger resource.
type: Property
lexical alias: numberingWithinSequenceOf.en
inverse of: has numbering within sequence
sub property of: has related resource of nomen
label: is nummering binnen volgorde van @nl
label: له ترقيم داخل تسلسل لـ @ar
definition: يربط تسمية بمصدر له تسميه تحدد موقعه داخل تسلسل أجزاء فردية من مصدر أكبر، أو أجزاء أو إصدارات لمصدر أكبر. @ar
label: numerointijakson sisäinen numerointi @fi
definition: Liittää nomenin aineistoon, jonka määrite identifioi sen sijainnin laajemman aineiston yksittäisten osien tai laajemman aineiston osien tai numeroiden jaksossa. @fi
label: ist Zählung innerhalb einer Reihe von @de
definition: Setzt ein Nomen in Beziehung zu einer Ressource, die über eine Bezeichnung verfügt, die ihre Position in einer Reihe einzelner Teile einer größeren Ressource oder Teilen oder Ausgaben einer größeren Ressource identifiziert. @de
label: 是在……的序列中的编号 @zh-hans
definition: 将一个命名与有标识其在一种较大资源中的个别部分或者一种较大资源中的部分或期的序列中的位置的一个标识的一种资源关联起来。 @zh-hans
label: sorrendiséget jelző számozása a következőnek: @hu
definition: Hozzákapcsol egy noment egy forráshoz, amelynek megjelölése azonosítja annak elhelyezkedését az egyedi részek sorrendiségében egy nagyobb mű részeként vagy részegységeként. @hu
label: sırası içinde numaralandırılmıştır @tr
definition: Bir ismi, daha büyük bir kaynağın bağımsız parçaları veya daha büyük bir kaynağın parçaları veya konuları dizisindeki konumunu tanımlayan tanıma olan bir kaynakla ilişkilendirir. @tr

is described with metadata by
status: Published
definition: Relates an entity to a resource that is a metadata resource for an entity.
type: Property
lexical alias: describedWithMetadataBy.en
inverse of: is metadata description of entity
sub property of: is described by
label: metatiedolla kuvailtu @fi
definition: Liittää entiteetin aineistoon, joka on entiteetin metatietoaineisto. @fi
label: 被……用元数据描述 @zh-hans
definition: 将一个实体与作为一个实体的一种元数据资源的一种资源关联起来。 @zh-hans
label: és descrit amb metadades per @ca
definition: Relaciona una entitat amb un recurs que és un recurs de metadades d’una entitat. @ca
has subproperty: has finding aid
label: tarafından üstveri ile tanımlanmıştır @tr
definition: Bir varlığı, bir varlık için bir üstveri kaynağı olan bir kaynakla ilişkilendirir. @tr

is metadata description of entity
status: Published
definition: Relates a resource to an entity that is described by a metadata resource.
type: Property
lexical alias: metadataDescriptionOfEntity.en
inverse of: is described with metadata by
sub property of: is description of
label: kuvailee metatiedolla @fi
definition: Liittää aineiston entiteettiin, joka on kuvailtu metatietoaineistolla. @fi
label: 是实体的元数据描述 @zh-hans
definition: 将一种资源与被一种元数据资源描述的一个实体关联起来。 @zh-hans
label: és descripció de metadades d’entitat @ca
definition: Relaciona un recurs amb una entitat que és descrita per un recurs de metadades. @ca
label: varlığın üstveri tanımlamasıdır @tr
definition: Bir kaynağı, bir üstveri kaynağı tarafından tanımlanan bir varlıkla ilişkilendirir. @tr

has collection accrual method
status: Published
definition: Relates a resource to a method of transfer of ownership of the resources that are added to a resource of a collection resource.
type: Property
lexical alias: collectionAccrualMethod.en
label: kokoelman kartuntamenetelmä @fi
definition: Liittää aineiston aineistojen omistajuuden siirtämisen menetelmään, jolla kartutetaan aineistoja kokoelma-aineistoon. @fi
label: 有收藏增加方法 @zh-hans
definition: 将一种资源与被增加到一种收藏资源的一种资源中去的资源的所有权转移的方法关联起来。 @zh-hans
label: té mètode d’acumulació de col·lecció de recursos @ca
definition: Relaciona un recurs amb un mètode de transferència de propietat dels recursos que s’afegeixen a un recurs d’un recurs de col·lecció de recursos. @ca
label: koleksiyon sağlama yöntemi ile ilişkilidir @tr
definition: Bir kaynağı, bir koleksiyon kaynağının kaynağına eklenen kaynakların mülkiyetinin devri yöntemiyle ilişkilendirir. @tr

has collection accrual policy
status: Published
definition: Relates a resource to a policy for selecting resources that are added to a resource of a collection resource.
type: Property
lexical alias: collectionAccrualPolicy.en
label: kokoelma-aineiston kartuttamisen linja @fi
definition: Liittää aineiston kokoelma-aineistoon lisättävien aineistojen valitsemisen linjaan. @fi
label: 有收藏增加政策 @zh-hans
definition: 将一种资源与被增加到一种收藏资源的一种资源中去的资源的选择政策关联起来。 @zh-hans
label: té política d’acumulació de col·lecció de recursos @ca
definition: Relaciona un recurs amb una política de selecció de recursos que s’afegeixen a un recurs d’un recurs de col·lecció de recursos. @ca
label: koleksiyon sağlama politikası ile ilişkilidir @tr
definition: Bir kaynağı, bir koleksiyon kaynağının kaynağına eklenen kaynakları seçmeye yönelik bir ilkeyle ilişkilendirir. @tr

has subcollection
status: Published
definition: Relates a resource to a resource of a collection resource that is a discrete component of a resource of another collection resource.
type: Property
lexical alias: subcollection.en
inverse of: is subcollection of
sub property of: has part resource
label: alakokoelma @fi
definition: Liittää manifestaation kokoelmateoksen manifestaatioon, joka on toisen kokoelmateoksen manifestaation erillinen osa. @fi
label: 有分收藏 @zh-hans
definition: 将一种资源与作为另一种收藏资源中的一种资源的一个独立组成部分的一种收藏资源中的一种资源关联起来。 @zh-hans
label: té subcol·lecció de recursos @ca
definition: Relaciona un recurs amb un recurs d’un recurs de col·lecció de recursos que és un component discret d’un recurs d’un altre recurs de col·lecció de recursos. @ca
label: alt koleksiyon ile ilişkilidir @tr
definition: Bir gösterimi, başka bir koleksiyon çalışmasının bir temsilinin ayrı bir bileşeni olan bir koleksiyon çalışmasının bir temsiliyle ile ilişkilendirir. @tr

is subcollection of
status: Published
definition: Relates a resource to a resource of a collection resource that has a resource of another collection resource as a discrete component.
type: Property
lexical alias: subcollectionOf.en
inverse of: has subcollection
sub property of: is part of resource
label: alakokoelma @fi
definition: Liittää manifestaation kokoelmateoksen manifestaatioon, johon sisältyy toisen kokoelmateoksen manifestaatio erillisenä osana. @fi
label: 是……的分收藏 @zh-hans
definition: 将一种资源与有另一种收藏资源中的一种资源作为一个独立组成部分的一种收藏资源的一种资源关联起来。 @zh-hans
label: és subcol·lecció de recursos de @ca
definition: Relaciona un recurs amb un recurs d’un recurs de col·lecció de recursos que té un recurs d’un altre recurs de col·lecció de recursos com un component discret. @ca
label: alt koleksiyonudur @tr
definition: Bir temsili, ayrı bir bileşen olarak başka bir koleksiyon çalışmasının bir temsili olan koleksiyon çalışmasının bir temsil ile ilişkilendirir. @tr

has holding
status: Published
definition: Relates a resource to a resource that is included in the resource of a collection resource.
type: Property
lexical alias: holding.en
inverse of: is holding of
sub property of: heeft gerelateerde resource van resource
label: aineisto kokelmassa @fi
definition: Liittää aineiston kokoelma-aineiston osaksi. @fi
label: 有馆藏 @zh-hans
definition: 将一种资源与被包括于一种收藏资源的资源中的一种资源关联起来。 @zh-hans
label: té fons @ca
definition: Relaciona un recurs amb un recurs que s’inclou en el recurs d’un recurs de col·lecció de recursos. @ca
label: koleksiyonda bulunan kopya ile ilişkilidir @tr
definition: Bir kaynağı, bir koleksiyon kaynağının kaynağına dahil olan bir kaynakla ilişkilendirir. @tr

is holding of
status: Published
definition: Relates a resource to a resource of a collection resource that includes the resource.
type: Property
lexical alias: holdingOf.en
inverse of: has holding
sub property of: heeft gerelateerde resource van resource
label: kokoelma-aineisto @fi
definition: Liittää aineiston kokoelma-aineistoon kuuluvaan aineistoon. @fi
label: 是……的馆藏 @zh-hans
definition: 将一种资源与包含该资源的一种收藏资源的一种资源关联起来。 @zh-hans
label: és fons de @ca
definition: Relaciona un recurs amb un recurs d’un recurs de col·lecció de recursos que inclou el recurs. @ca
label: koleksiyonda bulunan kopyasıdır @tr
definition: Bir kaynağı, kaynağı içeren bir koleksiyon kaynağının kaynağıyla ilişkilendirir. @tr

has location of collection
status: Published
definition: Relates a resource to a place where a collection resource is stored.
type: Property
lexical alias: locationOfCollection.en
inverse of: is location of collection of
sub property of: has related resource of place
label: kokoelman-aineiston sijainti @fi
definition: Liittää aineiston paikkaan, jossa kokoelma-aineistoa säilytetään. @fi
label: 有收藏的位置 @zh-hans
definition: 将一种资源与一种收藏资源被储存的一个地点关联起来。 @zh-hans
label: té localització de col·lecció de recursos @ca
definition: Relaciona un recurs amb un lloc on s’emmagatzema un recurs de col·lecció de recursos. @ca
label: koleksiyonun konumu ile ilişkilidir @tr
definition: Bir kaynağı, bir koleksiyon kaynağının kaynağının depolandığı bir yerle ilişkilendirir. @tr

is location of collection of
status: Published
definition: Relates a place to a resource of a collection resource that is stored in a place.
type: Property
lexical alias: locationOfCollectionOf.en
inverse of: has location of collection
sub property of: has related place of resource
label: kokoelman-aineiston sijainti @fi
definition: Paikka, jossa kokoelma-aineistoa säilytetään. @fi
label: 是……的收藏的地点 @zh-hans
definition: 将一个地点与被储存于一个地点的一种收藏资源的一种资源关联起来。 @zh-hans
label: és localització de col·lecció de recursos de @ca
definition: Relaciona un lloc amb un recurs d’un recurs de col·lecció de recursos que s’emmagatzema en un lloc. @ca
label: koleksiyonunun konumudur @tr
definition: Bir yeri, bir yerde saklanan bir koleksiyon kaynağının kaynağıyla ilişkilendirir. @tr

has location of resource
status: Published
definition: Relates a resource to a place where a resource is held, stored, or made available for access.
type: Property
lexical alias: locationOfResource.en
inverse of: is location of resource of
sub property of: has related resource of place
label: aineiston sijainti @fi
definition: Liittää aineiston tietyssä paikassa säilytettävään tai saataville asetettavaan aineistoon. @fi
label: 有资源的位置 @zh-hans
definition: 将一种资源与一种资源被收藏、储存或提供存取的一个地点关联起来。 @zh-hans
label: té localització de recurs @ca
definition: Relaciona un recurs amb un lloc on un recurs es aplegat, emmagatzemat o és fet disponible per a l’accés. @ca
label: kaynağın konumu ile ilişkilidir @tr
definition: Bir kaynağı, bir kaynağın tutulduğu, depolandığı veya erişim için hazır hale getirildiği bir yerle ilişkilendirir. @tr

is location of resource of
status: Published
definition: Relates a place to a resource that is held, stored, or made available for access in a place.
type: Property
lexical alias: locationOfResourceOf.en
inverse of: has location of resource
sub property of: has related place of resource
label: aineiston sijainti @fi
definition: Liittää paikan säilytettävään tai saataville asetattavaan aineistoon. @fi
label: 是……的资源的位置 @zh-hans
definition: 将一个地点与在一个地点收藏、储存或提供获取的一种资源关联起来。 @zh-hans
label: és localització de recurs de @ca
definition: Relaciona un lloc amb un recurs que es aplegat, emmagatzemat o és fet disponible per a l’accés en un lloc. @ca
label: kaynağının konumudur @tr
definition: Bir yeri, bir yerde tutulan, depolanan veya erişime açık hale getirilen bir kaynakla ilişkilendirir. @tr

is held with
status: Published
definition: Relates a resource to a resource that is held in the same collection as a resource.
type: Property
lexical alias: heldWith.en
sub property of: has accompanying resource relationship with (Deprecated)
label: yhdistetty aineistoon @fi
definition: Liittää aineiston saman kokoelman aineistoksi liitettyyn aineistoon. @fi
label: 和……一起收藏 @zh-hans
definition: 将一资源与和一种资源在同一个收藏中的一种资源关联起来。 @zh-hans
label: és aplegat amb @ca
definition: Relaciona un recurs amb un recurs que és aplegat en la mateixa col·lecció de recursos com un recurs. @ca
label: ile birlikte tutulur @tr
definition: Bir kaynağı, bir kaynakla aynı koleksiyonda tutulan bir kaynakla ilişkilendirir. @tr

has hierarchic finding aid
status: Published
definition: Relates a resource to a resource that is a metadata description set for the sub-collections and resources that are held by a collection resource.
type: Property
lexical alias: hierarchicFindingAid.en
inverse of: is hierarchic finding aid of
sub property of: has finding aid
label: hierarkkinen luettelo @fi
definition: Liitää aineiston kokoelma-aineistoon sisältyvien alakokoelmien ja kappaleiden metatietokokonaisuuteen. @fi
label: 有分级查询工具 @zh-hans
definition: 将一种资源与作为一种收藏资源所收入的分收藏和各种资源的元数据描述集合的一种资源关联起来。 @zh-hans
label: té instrument de descripció jeràrquic @ca
definition: Relaciona un recurs amb un recurs que és un conjunt de descripció de metadades per a les subcol·leccions i recursos que són aplegades per un recurs de col·lecció de recursos. @ca
label: hiyerarşik rehber bilgi ile ilişkilidir @tr
definition: Bir kaynağı, bir koleksiyon kaynağı tarafından sahip olunan alt koleksiyonlar ve kaynaklar için bir üstveri seti olan bir kaynakla ilişkilendirir. @tr

is hierarchic finding aid of
status: Published
definition: Relates a resource to a resource that is a collection resource that has a metadata description set for the sub-collections and resources that it holds.
type: Property
lexical alias: hierarchicFindingAidOf.en
inverse of: has hierarchic finding aid
sub property of: is finding aid of
label: hierarkkinen luettelo @fi
definition: Liittää aineiston kokoelma-aineistoon, jolla on siihen kuuluvia alakokoelmia ja aineistoja koskeva metatietokokonaisuus. @fi
label: 是……的分级查询工具 @zh-hans
definition: 将一种资源与作为一种收藏资源并有所收入的分收藏和各种资源的元数据描述集合的一种资源关联起来。 @zh-hans
label: és instrument de descripció jeràrquic de @ca
definition: Relaciona un recurs amb un recurs que és un recurs de col·lecció de recursos que té un conjunt de descripció de metadades per a les subcol·leccions i recursos que aplega. @ca
label: hiyerarşik rehber bilgisidir @tr
definition: Bir kaynağı, sahip olduğu alt koleksiyonlar ve kaynaklar için bir üstveri setine sahip bir koleksiyon kaynağı olan bir kaynakla ilişkilendirir. @tr

is on resource with
status: Published
definition: Relates a resource to a resource that is reproduced on the same resource as a resource.
type: Property
lexical alias: onResourceWith.en
sub property of: heeft gerelateerde resource van resource
label: aineistossa mukana @fi
definition: Liittää aineiston sen osaksi tehtyyn aineistoon. @fi
label: 在和……同一种资源上 @zh-hans
definition: 将一种资源与被复制于和一资源的同一种资源上的一种资源关联起来。 @zh-hans
label: és en un recurs amb @ca
definition: Relaciona un recurs amb un recurs que es reprodueix en el mateix recurs com un recurs. @ca
label: ile aynı kaynakta yer alır @tr
definition: Bir kaynağı, bir kaynakla aynı kaynakta yeniden üretilen bir kaynakla ilişkilendirir. @tr