Published
type: Concept

Deprecated
type: Concept

Unconstrained properties
licence: deed.en US
contributor: RSC Technical Working Group
creator: RDA Steering Committee
description: Properties that are derived from the elements of all of the RDA entities with semantics that are independent of the IFLA Library Reference Model.
description: RDA-elementeistä johdetut ominaisuudet ilman erityisiä tai implisiittisiä rajoituksia RDA-entiteeteille. @fi
issued: 2014-01-18
modified: 2025-06-03
publisher: ALA Digital Reference
rights: Copyright © 2020 American Library Association, Canadian Federation of Library Associations, and CILIP: Chartered Institute of Library and Information Professionals
title: Rajoittamattomat RDA-ominaisuudet @fi
type: http://rdaregistry.info/termList/RDALinkedDataWork/1003
preferred namespace prefix: rdau
type: Ontology
type: owl:Ontology
version info: v5.4.3

is respondent of
lexical alias: respondentOf.en
status: Published
type: Property
label: er respondent i @da
label: is respondent van @nl
label: ist Respondentin/Respondent von @de
label: respondentti (toimija aineistossa) @fi
label: tez yazarıdır @tr
label: válaszadója a következőnek: @hu
label: هو مُستَجِيب لـ @ar
label: 是……的答辩人 @zh-hans
sub property of: is creator of
inverse of: has respondent
definition: Akademik bir tartışmada bir danışman tarafından sunulan bir tezi savunan veya karşı çıkan bir derece adayını bir kaynakla ilişkilendirir. @tr
definition: Hozzákapcsol egy jelöltet egy tudományos fokozathoz, és aki az elnök által előterjesztett értekezést megvédi vagy opponálja egy tudományos vitában. @hu
definition: Liittää aineistoon oppiarvoa tavoitelevan kandidaatin, joka akateemisessa väitöstilaisuudessa puolustaa tai opponoi preeseksen esittelemää väitöskirjaa. @fi
definition: Relaciona un agent amb un recurs que és una tesi proposada pel praeses en una disputa acadèmica la qual defensa o a la qual s’oposa un candidat a un grau acadèmic. @ca
definition: Relaterer en kandidat til en akademisk grad, der forsvarer eller opponerer mod en tese, der er fremsat af præses i et akademisk afhandlingsforsvar til en ressource. @da
definition: Relates an agent to a resource that is a thesis provided by the praeses in an academic disputation that is defended or opposed by a candidate for a degree.
definition: Setzt einen Akteur in Beziehung zu einer Ressource, bei der eine Kandidatin/ein Kandidat für einen akademischen Grad eine These, die vom Praeses in einer akademischen Disputation aufgestellt wird, verteidigt oder ablehnt. @de
definition: يربط بين مصدر وباحث متقدم للحصول على درجة علمية يدافع عن أو يعارض أطروحة مقدمة من رؤساء جلسة علمية في مناظرة أكاديمية. @ar
definition: 将一个行为者与作为学位论文答辩中评审人提供的一篇论文的一种资源关联起来。 @zh-hans

is degree granting institution of
lexical alias: degreeGrantingInstitutionOf.en
status: Published
type: Property
label: er tildelende institution for @da
label: is graadverstrekkende instantie van @nl
label: ist grad-verleihende Institution von @de
label: oppiarvon myöntävä yhteisö (aineistoon liittyvä yhteistoimija) @fi
label: tez onaylayan kurumudur @tr
label: tudományos fokozatot adó intézménye a következőnek: @hu
label: هي مؤسسة مانحة درجة لـ @ar
label: 是……的学位授予机构 @zh-hans
sub property of: is other agent associated with resource of (Deprecated)
inverse of: has degree granting institution
definition: Bir temsilciyi, bir temsilci tarafından onaylanmış bir akademik derece ile ilişkili bir tez veya doktora tezi olan bir kaynakla ilişkilendirir. @tr
definition: Hozzákapcsol egy ágenst egy forráshoz, amely egy tudományos fokozat elnyeréséért benyújtott szakdolgozat vagy disszertáció, amelyet az ágens jóváhagyott. @hu
definition: Liittää toimijan aineistoon, joka on yhteisön hyväksymä akateemisen oppiarvon opinnäyte tai väitöskirja. @fi
definition: Relaterer en korporation der tildeler en akademisk grad til en ressource. @da
definition: Relates an agent to a resource that is a thesis or dissertation associated with an academic degree that is approved by an agent.
definition: Setzt einen Akteur in Beziehung zu einer Ressource, bei der es sich um eine Hochschulschrift handelt, die von einem Akteur genehmigt wird und mit einem akademischen Grad in Verbindung steht. @de
definition: يربط بين وكيل ومصدر عبارة عن أطروحة للحصول على درجة أكاديمية معتمدة من وكيل. @ar
definition: 将一个行为者与作为和被一个行为者批准的学位有关的有一篇学位论文的一种资源关联起来。 @zh-hans

is host institution of
lexical alias: hostInstitutionOf.en
status: Published
type: Property
label: er værtsinstitution for @da
label: ev sahibi kurumudur @tr
label: is hostorganisatie van @nl
label: ist gastgebende Institution von @de
label: isäntäorganisaatio (aineistoon liittyvä yhteistoimija) @fi
label: rendező intézménye a következőnek: @hu
label: هي مؤسسة مُضيفة لـ @ar
label: 是……的承办机构 @zh-hans
sub property of: is other agent associated with resource of (Deprecated)
inverse of: has host institution
definition: Bir kaynağa yol açan bir etkinliğe, sergiye, konferansa vb. ev sahipliği yapan bir aracıyı bir kaynakla ilişkilendirir. @tr
definition: Hozzákapcsol egy ágenshez, amely olyan eseményt, kiállítást, konferenciát, stb rendez, amelyből egy forrás keletkezik, egy forráshoz. @hu
definition: Liittää toimijan aineistoon, jolle alun antavan konferenssin, näyttelyn tai muun tapahtuman toimija sännöi, mutta jonka sisällöstä toimijalla on vähän tai ei lainkaan vastuuta. @fi
definition: Relaciona un agent amb un recurs que sorgeix d’un congrés, exposició o un altre esdeveniment l'amfitrió del qual és un agent amb poca o nula responsablitat pel contingut. @ca
definition: Relaterer en korporation, der afholder en event, udstilling, konference, etc., der fører til en ressource til en ressource. @da
definition: Relates an agent to a resource that arises from a conference, exhibition, or other event that is hosted by an agent with little or no responsibility for the content.
definition: Setzt einen Akteur in Beziehung zu einer Ressource, bei der der Akteur eine Veranstaltung, eine Ausstellung, eine Konferenz und so weiter ausrichtet, aus der eine Ressource hervorgeht. @de
definition: يربط وكيلًا يستضيف حدثًا، معرضًا، مؤتمرًا...إلخ، مما يؤدي إلى وجود مصدر. @ar
definition: 将一个行为者与一个行为者承办但对内容没有或很少责任的会议、展览或其他活动所产生的资源关联起来。 @zh-hans

is production company of
lexical alias: productionCompanyOf.en
status: Published
type: Property
label: er produktionsselskab for @da
label: is productiebedrijf van @nl
label: ist Produktionsfirma von @de
label: produkciós cége a következőnek: @hu
label: tuotantoyhtiö (aineistoon liittyvä yhteistoimija) @fi
label: yapım şirketidir @tr
label: هي شركة إنتاج لـ @ar
label: 是……的制作公司 @zh-hans
sub property of: is other agent associated with resource of (Deprecated)
inverse of: has production company
definition: Bir temsilciyi, sahne, ekran, ses kaydı, televizyon, web yayını vb. için bir prodüksiyonun finansal, teknik ve organizasyonel yönlerini yönetme sorumluluğunu içeren bir kaynakla ilişkilendirir. @tr
definition: Hozzákapcsol egy ágenst egy forráshoz, amelyhez hozzátartozik az ágens felelőssége egy színpadi produkció, film, hangfelvétel, televíziós, webes közvetítés, stb. pénzügyi, technikai és szervezeti vonatkozásának irányításáért. @hu
definition: Liittää toimijan aineistoon, jossa hän vastaa kuvien tallentamisesta joko sähköisesti tai filmille tai videolle, usein myös valaistuksen valitsemisesta ja järjestämisestä. @fi
definition: Relaterer en korporation, der er ansvarlig for økonomisk, teknisk og organisatorisk ledelse af en produktion beregnet til scene, lærred, lydoptagelse, tv, webcast etc. til en ressource. @da
definition: Relates an agent to a resource that involves a responsibility of an agent for managing the financial, technical, and organizational aspects of a production for stage, screen, sound recording, television, webcast, etc.
definition: Setzt einen Akteur in Beziehung zu einer Ressource, die mit einer Verantwortung des Akteurs verbunden ist, das Management für die finanziellen, technischen und organisatorischen Aspekte einer Produktion für die Bühne, die Leinwand, die Tonaufnahme, das Fernsehen, für einen Webcast und so weiter zu verwalten. @de
definition: يربط بين وكيل ومصدر ينطوي على مسؤولية وكيل إدارة الجوانب المالية، التقنية، والتنظيمية لإنتاج من أجل المسرح، شاشة العرض، التسجيل الصوتي، التلفزيون، البث عبر الإنترنت...إلخ. @ar
definition: 将一个行为者与涉及一个行为者对舞台、播放、录音、电视、网络直播等制作的资金、技术和组织方面管理的责任的一种资源关联起来。 @zh-hans

is court governed of
lexical alias: courtGovernedOf.en
status: Published
type: Property
label: er retsinstans underlagt @da
label: irányított bírósága a következőnek: @hu
label: is hof geregeerd van @nl
label: ist durch Verfahrensvorschriften geregeltes Gericht von @de
label: mahkeme yönetimindedir @tr
label: sääntöjen ohjaaman tuomioistuimen päätös aineistossa @fi
label: هي محكمة خاضعة لـ @ar
label: 是……的受管辖的法院 @zh-hans
sub property of: is other agent associated with resource of (Deprecated)
inverse of: has court governed
definition: Bir temsilciyi, resmi niteliğine bakılmaksızın, mahkeme kurallarla yönetilen bir mahkemenin bir kaynağıyla ilişkilendirir. @tr
definition: Hozzákapcsol egy ágenst egy forráshoz, amely bírósági szabályzatok által irányított bíróság hatálya alá tartozik, függetlenül a forrás hivatalos természetétől. @hu
definition: Liittää toimijan tuomioistuimen sääntöjen ohjaamaan tuomioistuinaineistoon riippumatta siitä, mikä on sääntöjen virallinen suhde aineistoon. @fi
definition: Relaterer en retsinstans underlagt retsregler, uanset hvad deres officiele art er til en ressource. @da
definition: Relates an agent to a resource of a court governed by court rules, regardless of their official nature to a resource.
definition: Setzt einen Akteur in Beziehung zu einer Ressource eines Gerichts, das durch gerichtliche Verfahrensvorschriften geregelt wird, unabhängig von deren förmlicher Rechtsnatur. @de
definition: يربط بين وكيل ومصدر من مصادر المحكمة يخضع للوائح المحاكم، دون النظر إلى الطابع الرسمي بأحد المصادر. @ar
definition: 将一个行为者与一个通过法院规则（不管其与资源的正式性质）受管辖的法院的资源关联起来。 @zh-hans

is collector of
lexical alias: collectorOf.en
status: Published
type: Property
label: aineiston kokoaja (toimija) @fi
label: er samler af @da
label: is verzamelaar van @nl
label: ist Sammlerin/Sammler von @de
label: koleksiyoncusudur @tr
label: kollektora a következőnek: @hu
label: هو جامع لـ @ar
label: 是……的收藏者 @zh-hans
sub property of: is creator of
inverse of: has collector
definition: Bir temsilciyi, diğer kaynaklar olan kaynakları seçerek ve düzenleyerek toplayan bir temsilcinin sorumluluğunu içeren bir kaynakla ilişkilendirir. @tr
definition: Hozzákapcsol egy ágenst egy forráshoz, amely különböző forrásokból származó, rendezett, leírt és katalogizált források gyűjteménye. @hu
definition: Liittää toimijan aineistoon, jossa hän vastaa uuden teoksen, kuten bibliografian tai hakemiston luomisesta valitsemalla, järjestämällä, koostamalla ja toimittamalla dataa, informaatiota tms. @fi
definition: Relaciona un agent amb un recurs que implica una responsabilitat d’un agent en la col·lecció de recursos que són altres recursos mitjançant la selecció i arranjament. @ca
definition: Relaterer en kurator der sammenfører ressourcer fra forskellige kilder, som så bliver arrangeret, beskrevet og katalogiseret som en samling til en ressource. @da
definition: Relates an agent to a resource that involves a responsibility of an agent for collecting by selecting and arranging resources that are other resources.
definition: Setzt einen Akteur in Beziehung zu einer Ressource, die von einem Akteur mit Ressourcen aus unterschiedlichen Quellen zusammengetragen wird, die dann als Sammlung geordnet, beschrieben oder katalogisiert werden. @de
definition: يربط بين وكيل ومصدر تم تجميعه مع مصادر من مصادر مختلفة رُتبت، وُصفت، وفُهرست كمجموعة. @ar
definition: 将一个行为者与涉及一个行为者通过选择和整理作为其他资源的资源而对收藏负责的一种资源关联起来。 @zh-hans

is collection registrar of
lexical alias: collectionRegistrarOf.en
status: Published
type: Property
label: er samlingsregistrator af @da
label: gyűjtemény-nyilvántartója a következőnek: @hu
label: is collectieregistrator van @nl
label: ist Registrarin/Registrar von @de
label: kokoelman luetteloija (toimija) aineistossa @fi
label: koleksiyon kayıt görevlisidir @tr
label: هو مسجل مجموعة لــ @ar
label: 是……的收藏登记者 @zh-hans
sub property of: is compiler of
inverse of: has collection registrar
definition: Bir temsilciyi, üstveri kaynağı oluşturmakla görevli bir temsilcinin sorumluluğunu içeren bir kaynakla ilişkilendirir. @tr
definition: Hozzákapcsol egy kurátort egy forráshoz, amelyet felsorol vagy leltárba vesz egy aggregáló forrás, mint például források gyűjteményét. @hu
definition: Liittää aineistoon toimijan, joka vastaa metatietoteoksen luomisesta. @fi
definition: Relaciona un agent amb un recurs que implica una responsabilitat d’un agent de la creació un recurs de metadades. @ca
definition: Relaterer en kurator der lister eller opstiller ressourcerne i en samlingsressource, som fx en samling af ressourcer til en ressource. @da
definition: Relates an agent to a resource that involves a responsibility of an agent for creating a metadata resource.
definition: Setzt eine Kuratorin/einen Kurator in Beziehung zu einer Ressource, die als aggregierte Ressource verzeichnet oder inventarisiert wird, wie zum Beispiel eine Sammlung von Ressourcen. @de
definition: يربط بين أَمِين معرض ومصدر مدرج في القائمة أو تم جرده في مصدر تجميعي مثل مجموعة من المصادر. @ar
definition: 将一个行为者与涉及创建一种元数据资源的一个行为者的责任的一种资源关联起来。 @zh-hans

is depositor of
lexical alias: depositorOf.en
status: Published
type: Property
label: aineiston tallettaja (toimija) @fi
label: er depositor af @da
label: is bruikleengever van @nl
label: ist Leihgeberin/Leihgeber von @de
label: letétbe helyezője a következőnek: @hu
label: mevduatçısıdır @tr
label: هو مُودِع لـ @ar
label: 是……的托存者 @zh-hans
sub property of: is current owner of
inverse of: has depositor
definition: Bir temsilciyi, mülkiyeti devretmeden başka bir temsilcinin gözetimine bırakılan bir kaynakla ilişkilendirir. @tr
definition: Hozzákapcsol egy ágenst egy forráshoz, amelyet egy másik ágens felügyelete alá helyez anélkül, hogy a tulajdonjogot átruházná. @hu
definition: Liittää toimijan aineistoon, jokaon luovutettu toisen toimijan haltuun siirtämättä omistajuutta. @fi
definition: Relaterer en nuværende ejer af en ressource deponeret i forvaring hos en anden agent, men der beholder det oprindelige ejerskab til en ressource. @da
definition: Relates an agent to a resource that is deposited into the custody of another agent without transferring ownership.
definition: Setzt einen Akteur in Beziehung zu einer Ressource, die in die Obhut eines anderen Akteurs gegeben wird, ohne das Eigentumsrecht zu übertragen. @de
definition: يربط بين وكيل ومصدر تم إيداعه في عهدة وكيل آخَر دون نقل الملكية. @ar
definition: 将一个行为者与被委托给另一个行为者保管但未转让所有权的一种资源关联起来。 @zh-hans

is film director of
lexical alias: filmDirectorOf.en
status: Published
type: Property
label: elokuvan ohjaaja (toimija) aineistossa @fi
label: er filminstruktør af @da
label: filminin yönetmenidir @tr
label: filmrendezője a következőnek: @hu
label: is filmregisseur van @nl
label: ist Filmregisseurin/Filmregisseur von @de
label: هو مخرج فيلم لـ @ar
label: 是……的电影导演 @zh-hans
sub property of: is director of
inverse of: has film director
definition: Bir temsilciyi, filme alınmış bir performansın genel yönetimi ve denetimine ilişkin bir temsilcinin sorumluluğunu içeren bir kaynakla ilişkilendirir. @tr
definition: Hozzákapcsol egy ágenst egy forráshoz, amelyhez hozzátartozik az ágens felelőssége egy filmforgatás általános menedzseléséért és felügyeletéért. @hu
definition: Liittää toimijan aineistoon, jossa toimija vastaa elokuvan yleisestä johtamisesta ja valvonnasta. @fi
definition: Relaterer en instruktør der er ansvarlig for ledelse og tilsyn med en filmoptagelse til en ressource. @da
definition: Relates an agent to a resource that involves a responsibility of an agent for the general management and supervision of a filmed performance.
definition: Setzt einen Akteur in Beziehung zu einer Ressource, bei der ein Akteur für das allgemeine Management und die Leitung einer verfilmten Darbietung verantwortlich ist. @de
definition: يربط بين وكيل ومصدر ينطوي على مسؤولية وكيل عن الإدارة العامة والإشراف على أداء مصور. @ar
definition: 将一个行为者与涉及拍摄表演的总体管理和监督的一个行为者的责任的一种资源关联起来。 @zh-hans

is radio director of
lexical alias: radioDirectorOf.en
status: Published
type: Property
label: er radioinstruktør af @da
label: is radioregisseur van @nl
label: ist Hörfunkregisseurin/Hörfunkregisseur von @de
label: radio-ohjaaja (toimija) aineistossa @fi
label: radyo yönetmenidir @tr
label: rádiós rendezője a következőnek: @hu
label: هو مخرج إذاعي لـ @ar
label: 是……的广播导演 @zh-hans
sub property of: is director of
inverse of: has radio director
definition: Bir temsilciyi, bir radyo programının genel yönetimi ve denetimine ilişkin bir temsilcinin sorumluluğunu içeren bir kaynakla ilişkilendirir. @tr
definition: Hozzákapcsol egy ágenst egy forráshoz, amelyhez hozzátartozik az ágens felelőssége egy rádióműsor általános menedzseléséért és felügyeletéért. @hu
definition: Liittää toimijan aineistoon, jossa toimija vastaa radio-ohjelman yleisestä johtamisesta ja valvonnasta. @fi
definition: Relaterer en instruktør der er ansvarlig for ledelse og tilsyn med et radioprogram til en ressource. @da
definition: Relates an agent to a resource that involves a responsibility of an agent for the general management and supervision of a radio program.
definition: Setzt einen Akteur in Beziehung zu einer Ressource, bei der ein Akteur für das allgemeine Management und die Leitung einer Hörfunksendung verantwortlich ist. @de
definition: يربط بين وكيل ومصدر ينطوي على مسؤولية وكيل الإدارة العامة والإشراف على برنامج إذاعي. @ar
definition: 将一个行为者与涉及广播节目的总体管理和监督的一个行为者的责任的一种资源关联起来。 @zh-hans

is television director of
lexical alias: televisionDirectorOf.en
status: Published
type: Property
label: er tv-instruktør af @da
label: is televisieregisseur van @nl
label: ist Fernsehregisseurin/Fernsehregisseur von @de
label: televizyon yönetmenidir. @tr
label: televíziós rendezője a következőnek: @hu
label: telvisio-ohjaaja (toimija) aineistossa @fi
label: هو مخرج تلفزيوني لـ @ar
label: 是……的电视导演 @zh-hans
sub property of: is director of
inverse of: has television director
definition: Bir temsilciyi, bir televizyon programının genel yönetimi ve denetimine ilişkin bir temsilcinin sorumluluğunu içeren bir kaynakla ilişkilendirir. @tr
definition: Hozzákapcsol egy ágenst egy forráshoz, amelyhez hozzátartozik az ágens felelőssége egy televízióműsor általános menedzseléséért és felügyeletéért. @hu
definition: Liittää toimijan aineistoon, jossa toimija vastaa televisio-ohjelman esityksen yleisestä johtamisesta ja valvonnasta. @fi
definition: Relaterer en instruktør der er ansvarlig for ledelse og tilsyn med et tv-program til en ressource. @da
definition: Relates an agent to a resource that involves a responsibility of an agent for the general management and supervision of a television program.
definition: Setzt einen Akteur in Beziehung zu einer Ressource, bei der ein Akteur für das allgemeine Management und die Leitung einer Fernsehsendung verantwortlich ist. @de
definition: يربط بين وكيل ومصدر ينطوي على مسؤولية وكيل الإدارة العامة والإشراف على برنامج تليفزيوني. @ar
definition: 将一个行为者与涉及电视节目的总体管理和监督的一个行为者的责任的一种资源关联起来。 @zh-hans

is donor of
lexical alias: donorOf.en
status: Published
type: Property
label: adományozója a következőnek: @hu
label: aineiston lahjoittaja (toimija) @fi
label: bağışçısıdır @tr
label: donor af @da
label: is schenker van @nl
label: ist Stifterin/Stifter von @de
label: هو مانح لـ @ar
label: 是……的捐赠者 @zh-hans
sub property of: is former owner of
inverse of: has donor
definition: Bir temsilciyi, başka bir sahibine bağışlanan bir kaynakla ilişkilendirir. @tr
definition: Hozzákapcsol egy ágenst egy forráshoz, amelyet egy másik tulajdonosnak adományoznak. @hu
definition: Relaterer en tidligere ejer af en ressource, der donerede den ressource til en anden ejer til en ressource. @da
definition: Relates an agent to a resource donated to another owner.
definition: Setzt einen Akteur in Beziehung zu einer Ressource, die einer anderen Eigentümerin/einem anderen Eigentümer überlassen wurde. @de
definition: ittää toimijan aineistoon, jonka toimija on lahjoittanut toiselle omistajalle. @fi
definition: يربط بين وكيل ومصدر تم التبرع به إلى مالك آخَر. @ar
definition: 将一个行为者与被捐赠给另一个拥有者的一种资源关联起来。 @zh-hans

is seller of
lexical alias: sellerOf.en
status: Published
type: Property
label: aineiston myyjä (toimija) @fi
label: er sælger af @da
label: is verkoper van @nl
label: ist Verkäuferin/Verkäufer von @de
label: satıcısıdır @tr
label: értékesítője a következőnek: @hu
label: هو بائع لـ @ar
label: 是……的出售者 @zh-hans
sub property of: is former owner of
inverse of: has seller
definition: Bir temsilciyi, temsilci olan başka bir sahibine satılan bir kaynakla ilişkilendirir. @tr
definition: Hozzákapcsol egy ágenst egy forráshoz, amelyet egy másik tulajdonos ágensnek adnak el. @hu
definition: Liittää toimijan aineistoon, jonka toimija on myynyt toiselle omistajalle. @fi
definition: Relaterer en tidligere ejer af en ressource, der solgte den ressource til en ressource. @da
definition: Relates an agent to a resource that is sold to another owner who is an agent.
definition: Setzt einen Akteur in Beziehung zu einer Ressource, die an eine andere Eigentümerin/einen anderen Eigentümer (Akteur) verkauft wird. @de
definition: يربط بين وكيل ومصدر تم بيعه إلى مالك آخَر وكيل. @ar
definition: 将一个行为者与被出售给另一个拥有者的一种资源关联起来。 @zh-hans

is enacting government of
lexical alias: enactingGovernmentOf.en
status: Published
type: Property
label: er udøvende jurisdiktion af @da
label: is vaststellende jurisdictie van @nl
label: ist normerlassende Gebietskörperschaft von @de
label: rendelkező joghatósága a következőnek: @hu
label: säätävän hallintoelimen päätös @fi
label: yasa çıkaran hükümetidir @tr
label: és govern promulgador de @ca
label: هي هيئة سن التشريعات لـ @ar
label: 是……的颁布政府 @zh-hans
sub property of: is creator of
inverse of: has enacting government
definition: Bir temsilciyi, bir hükümet organı tarafından çıkarılan bir yasa, yönetmelik, anayasa, mahkeme kuralı vb. olan bir kaynakla ilişkilendirir. @tr
definition: Hozzákapcsol egy ágenst egy forráshoz, amely egy kormányzati testület által beiktatott törvény, rendelet, alkotmány, bírósági határozat, stb. @hu
definition: Liittää toimijan valtiovallan aineistoon, kuten lakiin, asetukseen, perustuslakiin, tuomioistuinta koskevaan sääntöön tms. @fi
definition: Relaciona un agent amb un recurs que és una llei, un reglament, una constitució, una regla de funcionament d’un tribunal, etc. promulgada per una entitat governamental. @ca
definition: Relaterer en jurisdiktion der vedtager en lov, forordning, forfatning, retsplejeregel etc. til en ressource. @da
definition: Relates an agent to a resource that is a law, regulation, constitution, court rule, etc. enacted by a government body.
definition: Setzt einen Akteur in Beziehung zu einer Ressource, bei der es sich um ein Gesetz, eine Verordnung, eine Verfassung, eine Rechtsverordnung und so weiter handelt, das/die von einer Regierung erlassen wird. @de
definition: يربط بين وكيل ومصدر هو قانون، لائحة، دستور، حكم محكمة...إلخ، تسنه هيئة حكومية. @ar
definition: 将一个行为者与作为政府机构颁布的法律、法规、法院规则等的一种资源关联起来。 @zh-hans

is place governed by
lexical alias: placeGovernedOf.en
status: Published
type: Property
label: er jurisdiktion underlagt @da
label: is jurisdictie geregeerd van @nl
label: ist geregelte Gebietskörperschaft von @de
label: joghatósága a következőnek: @hu
label: soveltava lainkäyttöalue yhteisölle @fi
label: yönetilen yargı alanıdır @tr
label: és lloc regit per @ca
label: هو نطاق جغرافى خاضع لـ @ar
label: 是……的所管理辖区 @zh-hans
inverse of: has place governed
alternative label: is jurisdiction governed of
alternative label: és jurisdicció regida de @ca
definition: Bir temsilciyi, başka bir hükümet tarafından yürürlüğe konulan bir yasa, yönetmelik vb. tarafından yönetilen bir yargı yetkisi olan bir yerle ilişkilendirir. @tr
definition: Hozzákapcsol egy ágenst egy helyhez, amely egy másik igazgatási szerv által hozott törvény, rendelet stb. hatálya alá tartozó joghatóság. @hu
definition: Liittää toimijan paikkaan, joka on toisen julkishallinnollisen yhteisön säätämien lakien, asetusten tms. alainen. @fi
definition: Relaciona un lloc amb un agent que és un govern d’un lloc. @ca
definition: Relaterer en jurisdiktion, der er underlagt en lov, forordning etc., der var vedtaget af en anden domsmyndighed til en ressource. @da
definition: Relates a place to an agent who is a government of a place.
definition: Setzt einen Akteur in Beziehung zu einem Geografikum, das durch ein Gesetz, eine Verordnung und so weiter geregelt wird, das/die von einer anderen Regierung erlassen wurde. @de
definition: يربط بين وكيل ومكان يخضع لسلطة قضائية يحكمها قانون، لائحة تنظيمية...إلخ، سنتها حكومة أخرى. @ar
definition: 将一个地点与作为根据另一个政府所颁布的法律、法规等管理的一个辖区的政府的一个行为者关联起来。 @zh-hans

is conductor of
has subproperty: is choral conductor of
has subproperty: is instrumental conductor of
lexical alias: conductorOf.en
status: Published
type: Property
label: er dirigent af @da
label: is dirigent van @nl
label: ist Dirigentin/Dirigent von @de
label: johtajana aineistossa @fi
label: karmestere a következőnek: @hu
label: orkestra şefidir @tr
label: هو مايسترو لـ @ar
label: 是……的指挥 @zh-hans
sub property of: is performer of
inverse of: has conductor
definition: Bir temsilciyi, müzikal veya dramatik vb. bir sunumda bir performans grubuna liderlik eden bir temsilcinin katkısını içeren bir kaynakla ilişkilendirir. @tr
definition: Hozzákapcsol egy ágenst egy forráshoz, amely magában foglalja egy zenei vagy drámai bemutatóban, stb. előadói csoportot vezető ágens közreműködését. @hu
definition: Liittää toimijan aineistoon, jonka tekemisessä toimija on osallisena johtamalla esiintyjäryhmän esiintymistä musiikki- tai näytelmäesityksessä. @fi
definition: Relaterer en udøver, der bidrager til en musikalsk ressource ved at lede en udøvende gruppe i en musikalsk eller dramatisk præsentation etc. til en ressource. @da
definition: Relates an agent to a resource that includes a contribution by an agent of leading of a performing group in a musical or dramatic presentation, etc.
definition: Setzt einen Akteur in Beziehung zu einer Ressource, zu der ein Akteur beiträgt, indem er ein aufführendes Ensemble in einer musikalischen oder dramatischen Darbietung und so weiter leitet. @de
definition: يربط بين وكيل ومصدر يتضمن إسهام وكيل في قيادة فرقة عزف في عرض موسيقي أو درامي...إلخ. @ar
definition: 将一个行为者与包括领导音乐或戏剧呈现中的一个表演团体的一个行为者的贡献的一种资源关联起来。 @zh-hans

is actor of
has subproperty: is voice actor of
lexical alias: actorOf.en
status: Published
type: Property
label: aktörüdür @tr
label: er skuespiller i @da
label: is acteur van @nl
label: ist Schauspielerin/Schauspieler von @de
label: näyttelijänä aineistossa @fi
label: színésze a következőnek: @hu
label: هو ممثل لـ @ar
label: 是……的演员 @zh-hans
sub property of: is performer of
inverse of: has actor
definition: Bir temsilciyi, bir temsilcinin müzikal veya dramatik bir sunumda oyuncu olarak rol alan temsilcinin katkısını içeren bir kaynakla ilişkilendirir. @tr
definition: Hozzákapcsol egy ágenst egy forráshoz, amely magában foglalja egy ágensnek, mint a szereposztás egy tagjának vagy előadójának a közreműködését egy zenei vagy drámai bemutatóban. @hu
definition: Liittää toimijan aineistoon, jonka tekemiseen hän osallistuu näyttelemällä musiikki- tai näytelmäesityksessä. @fi
definition: Relaterer en udøver, der bidrager til en ressource ved at være skuespiller eller musiker i en musikalsk eller dramatisk præsentation etc. til en ressource. @da
definition: Relates an agent to a resource that includes a contribution by an agent of acting as a cast member or player in a musical or dramatic presentation.
definition: Setzt einen Akteur in Beziehung zu einer Ressource, zu der ein Akteur beiträgt, indem er als Ensemble-Mitglied oder Darstellerin/Darsteller in einer musikalischen oder dramatischen Darbietung fungiert. @de
definition: يربط بين وكيل ومصدر يتضمن إسهام وكيل يعمل كعضو فريق تمثيل أو كعازف في عرض موسيقي أو درامي. @ar
definition: 将一个行为者与包括在音乐或戏剧呈现中扮演角色或演奏的一个行为者的贡献的一种资源关联起来。 @zh-hans

is onscreen presenter of
see also: is onscreen participant of
lexical alias: onscreenPresenterOf.en
status: Published
type: Property
label: ekran sunucusudur @tr
label: er programvært på skærmen i @da
label: esittelijänä aineistossa @fi
label: is presentator in beeld van @nl
label: ist On-Screen-Präsentatorin/On-Screen-Präsentator von @de
label: képernyőn megjelenő előadója a következőnek: @hu
label: هو مقدم على الشاشة لـ @ar
label: 是……的屏幕主持人 @zh-hans
sub property of: is performer of
inverse of: has onscreen presenter
definition: Bağlamsal veya arka plan bilgisi sağlamak için ekranda görünerek bir kaynağa katkıda bulunan bir sanatçıyı ifade eder. bir ekran sunucusu, kurgusal olmayan hareketli görüntü materyallerinde veya kurgusal hareketli görüntü materyallerinin tanıtımlarında bir kaynakta görünebilir. @tr
definition: Hozzákapcsol egy előadót egy forráshoz, aki a forráshoz hozzájárulva képernyőn jelenik meg és szövegösszefüggésre vonatkozó vagy háttérinformációt szolgáltat. Egy képernyőn megjelenő előadó tényszerű mozgóképanyagokban vagy fikciós mozgókép-anyagok bevezetőiben látható. @hu
definition: Liittää toimijan aineistoon, jonka tekemiseen hän osallistuu esiintymällä televisiossa tai elokuvassa taustatiedon antajana. @fi
definition: Relaterer en udøver, der bidrager til en ressource ved at optræde på en skærm for at give kontekstuel- eller baggrundsinformation til en ressource. @da
definition: Relates a performer who contributes to a resource by appearing on screen to provide contextual or background information. an on-screen presenter may appear in nonfiction moving image materials or in introductions to fiction moving image materials to a resource.
definition: Setzt eine Ausführende/einen Ausführenden in Beziehung zu einer Ressource, zu der sie/er beiträgt, indem sie/er auf dem Bildschirm erscheint, um Kontext- und Hintergrundinformationen zu liefern. @de
definition: يربط مؤدٍ يُساهم في مصدر من خلال الظهور على الشاشة لتقديم معلومات تتعلق بالسياق أو الخلفية. قد يظهر مقدم عرض على الشاشة في مواد الصور المتحركة غير الخيالية أو أثناء تقديم مواد لصور متحركة خيالية إلى أحد المصادر. @ar
definition: 将通过出现在屏幕上提供语境或背景信息对一种资源有贡献的一个表演者（屏幕主持人可出现在非虚构动态图像资料中或者在虚构动态图像资料的介绍中）与一种资源关联起来。 @zh-hans
scope note: A tényszerű mozgóképanyagokban vagy fikciós mozgóképanyagok bevezetőiben való megjelenés is idetartozik. Képernyőn nem előadói szerepben való megjelenés nem tartozik ide. @hu
scope note: Appearance in nonfiction moving image materials or in introductions to fiction moving image materials is included. Appearance on screen in a non-performing role is excluded.
scope note: Darunter fallen Auftritte in nicht-fiktionalen Bewegtbildmaterialien oder in Einführungen zu fiktionalen Bewegtbildmaterialien. Darunter fallen keine Bildschirmauftritte in einer passiven Rolle. @de
scope note: En programvært kan optræde i levende billedmaterialer af faktuel karakter eller i introduktioner til levende billedmaterialer af fiktiv karakter. Optræden på skærmen i en ikke-optrædende rolle er ikke omfattet. @da
scope note: Koskee ei-fiktiivisessä elokuvassa tai fiktiivisen elokuvan johdannossa esiintymistä. Ei koske esiintymistä ei-esittävässä roolissa. @fi
scope note: Kurgusal olmayan hareketli görüntü materyallerinde veya kurgu hareketli görüntü materyallerine girişlerinde yer alma dahildir. Performans göstermeyen bir rolde ekranda yer alma hariçtir. @tr
scope note: يتضمن الظهور في مواد الصور المتحركة غير الخيالية أو أثناء تقديم مواد لصور متحركة خيالية. يُستبعد من ذلك الظهور على الشاشة في دور غير مؤدِ. @ar
scope note: 包括在非虚构动态图像资料中或者在虚构动态图像资料的介绍中的出现。不包括在屏幕中作为非表演角色的出现。 @zh-hans

is dancer of
lexical alias: dancerOf.en
status: Published
type: Property
label: dansçısıdır @tr
label: er danser i @da
label: is danser van @nl
label: ist Tänzerin/Tänzer von @de
label: tanssijana aineistossa @fi
label: táncosa a következőnek: @hu
label: هو راقص لـ @ar
label: 是……的舞蹈者 @zh-hans
sub property of: is performer of
inverse of: has dancer
definition: Bir temsilciyi, müzikal veya dramatik bir sunumda dans eden bir temsilcinin katkısını içeren bir kaynakla ilişkilendirir. @tr
definition: Hozzákapcsol egy ágenst egy forráshoz, amely magában foglalja egy zenei vagy drámai bemutatóban táncoló ágens közreműködését. @hu
definition: Liittää toimijan aineistoon jonka tekemiseen hän osallistuu tanssimalla musiikki- tai näyttämöesityksessä. @fi
definition: Relaterer en udøver, der bidrager til en ressource ved at danse i en musikalsk, dramatisk etc. præsentation til en ressource. @da
definition: Relates an agent to a resource that includes a contribution by an agent of dancing in a musical or dramatic presentation.
definition: Setzt einen Akteur in Beziehung zu einer Ressource, zu der ein Akteur beiträgt, indem er in einer musikalischen oder dramatischen Darbietung tanzt. @de
definition: يربط بين وكيل ومصدر يتضمن إسهام وكيل بالرقص في عرض موسيقي أو درامي. @ar
definition: 将一个行为者与包括在音乐或戏剧呈现中舞蹈的行为者的贡献的一种资源关联起来。 @zh-hans

is instructor of
lexical alias: instructorOf.en
status: Published
type: Property
label: er lærer i @da
label: eğitmenidir @tr
label: is instructeur van @nl
label: ist Ausbilderin/Ausbilder von @de
label: oktatója a következőnek: @hu
label: opettaja @fi
label: هو مُحاضر لـ @ar
label: 是……的教师 @zh-hans
sub property of: is performer of
inverse of: has instructor
definition: Bir temsilciyi, öğreten veya gösteri sunan temsilcinin katkısını içeren bir kaynakla ilişkilendirir. @tr
definition: Hozzákapcsol egy ágenst egy forráshoz, amely magában foglalja egy tanító vagy szemléltetést tartó ágens közreműködését. @hu
definition: Liittää toimijan aineistoon jonka tekemiseen hän osallistuu opettamalla tai esittelemällä. @fi
definition: Relaterer en udøver, der bidrager til en ressource ved at give instruktion eller demonstration til en ressource. @da
definition: Relates an agent to a resource that includes a contribution by an agent of teaching or providing a demonstration.
definition: Setzt einen Akteur in Beziehung zu einer Ressource, zu der ein Akteur beiträgt, indem er unterrichtet oder etwas demonstriert. @de
definition: يربط بين وكيل ومصدر يتضمن إسهام وكيل بالتدريس أو تقديم عرض توضيحي. @ar
definition: 将一个行为者与包括教学或提供演示的一个行为者的贡献的一种资源关联起来。 @zh-hans

is host of
lexical alias: hostOf.en
status: Published
type: Property
label: er vært for @da
label: házigazdája a következőnek: @hu
label: is gastgever van @nl
label: ist Gastgeberin/Gastgeber von @de
label: juontajana aineistossa @fi
label: sunucusudur @tr
label: هو مُضيف لـ @ar
label: 是……的主持人 @zh-hans
sub property of: is performer of
inverse of: has host
definition: Bir temsilciyi, sıklıkla yayınlanan ve diğer sanatçıları içeren bir programa liderlik eden sanatçı olan temsilcinin katkısını içeren bir kaynakla ilişkilendirir. @tr
definition: Hozzákapcsol egy ágenst egy forráshoz, amely magában foglalja egy ágens közreműködését egy program, gyakran sugárzott műsor, vezetésében, amelyen más előadók vesznek részt. @hu
definition: Liittää toimijan aineistoon, jonka tekemiseen toimija, joka on esittäjä, osallistuu (useimmiten lähetettyyn) ohjelmaan, johon osallistuu muita esiintyjiä. @fi
definition: Relaterer en udøver, der bidrager til en ressource ved at lede et program, ofte transmitteret, der inkluderer andre gæster, optrædende etc. til en ressource @da
definition: Relates an agent to a resource that includes a contribution by an agent who is a performer of leading a program, often broadcast, that includes other performers.
definition: Setzt einen Akteur in Beziehung zu einer Ressource, zu der ein Akteur beiträgt, indem er eine Veranstaltung (meist eine Sendung) leitet, an der auch andere Ausführende teilnehmen. @de
definition: يربط بين وكيل ومصدر يتضمن إسهام وكيل في إدارة برنامج، غالبًا مُذاع، ويستضيف ضيوفا وفنانين ووكلاء آخرين. @ar
definition: 将一个行为者与包括作为一个表演者通过主导节目（经常是广播节目）并包括其他表演者的一个行为者的贡献的一种资源关联起来。 @zh-hans

is moderator of
lexical alias: moderatorOf.en
status: Published
type: Property
label: er ordstyrer i @da
label: is moderator van @nl
label: ist Moderatorin/Moderator von @de
label: moderatörüdür @tr
label: moderoijana aineistossa @fi
label: moderátora a következőnek: @hu
label: هو رئيس جلسة لـ @ar
label: 是……的谈话类节目主持人 @zh-hans
sub property of: is performer of
inverse of: has moderator
definition: Bir temsilciyi, genellikle tartışma ile ilgili alanlardaki uzmanların katılımıyla konuların tartışıldığı, sıklıkla yayınlanan bir programa liderlik eden bir temsilcinin katkısını içeren bir kaynakla ilişkilendirir. @tr
definition: Hozzákapcsol egy ágenst egy forráshoz, amely magában foglalja egy ágens közreműködését egy program, gyakran sugárzott műsor, vezetésében, amelyen témákat vitatnak meg, rendszerint a beszélgetés témájában jártas szakértők részvételével. @hu
definition: Liittää toimijan aineistoon jonka tekemiseen hän osallistuu juontamalla (useimmiten lähetettyä) ohjelmaa, jossa keskustellaan eri aiheista tavallisesti keskusteluun liittyvien aiheiden asiantuntijoiden kanssa. @fi
definition: Relaterer en udøver, der bidrager til en ressource ved at lede et program, ofte transmitteret, hvor emner diskuteres, normalt med deltagelse af fagfolk indenfor felter, der er relateret til diskussionen, til en ressource. @da
definition: Relates an agent to a resource that includes a contribution by an agent of leading a program, often broadcast, where topics are discussed, usually with participation of experts in fields related to the discussion.
definition: Setzt einen Akteur in Beziehung zu einer Ressource, zu der ein Akteur beiträgt, indem er eine Veranstaltung (meist eine Sendung) leitet, in der Themen üblicherweise mit Expertinnen/Experten diskutiert werden. @de
definition: يربط بين وكيل ومصدر يتضمن إسهام وكيل في إدارة برنامج، غالبًا مُذاع، حيث تتم مناقشة موضوعات، عادةً بمشاركة خبراء في المجالات المتعلقة بموضوع النقاش. @ar
definition: 将一个行为者与包括主导节目（经常是广播节目，其中讨论话题，通常有讨论相关领域专家参与）的一个行为者的贡献的一种资源关联起来。 @zh-hans

is puppeteer of
lexical alias: puppeteerOf.en
status: Published
type: Property
label: bábjátékosa a következőnek: @hu
label: er dukkefører i @da
label: is poppenspeler van @nl
label: ist Puppenspielerin/Puppenspieler von @de
label: kuklacısıdır @tr
label: nukettajana aineistossa @fi
label: هو محرك عرائس لـ @ar
label: 是……的木偶表演者 @zh-hans
sub property of: is performer of
inverse of: has puppeteer
definition: Bir temsilciyi, hareketli bir görüntü yapımında veya müzikal ya da dramatik bir sunumda veya eğlencede kuklaları manipüle eden, kontrol eden veya yöneten bir temsilcinin katkısını içeren bir kaynakla ilişkilendirir. @tr
definition: Hozzákapcsol egy ágenst egy forráshoz, amely magában foglalja egy ágens közreműködését bábok vagy marionettfigurák manipulálásában, vezérlésében vagy irányításában egy mozgókép-produkcióban, zenei vagy drámai bemutatóban vagy szórakoztató műsorban. @hu
definition: Liittää toimijan aineistoon, jonka tekemiseen hän osallistuu käsittelemällä, kontrolloimalla tai ohjaamalla nukkeja tai marionetteja elokuvatuotannossa tai musiikki- tai näytelmäesityksessä. @fi
definition: Relaterer en udøver der bidrager til en ressource ved at manipulere, kontrollere, eller føre dukker eller marionetter i en levende billedproduktion eller en musikalsk eller dramatisk præsentation eller underholdning til en ressource @da
definition: Relates an agent to a resource that includes a contribution by an agent of manipulating, controlling, or directing puppets or marionettes in a moving image production or a musical or dramatic presentation or entertainment
definition: Setzt einen Akteur in Beziehung zu einer Ressource, zu der ein Akteur beiträgt, indem er Puppen oder Marionetten in einer Bewegtbildproduktion oder einer musikalischen oder dramatischen Darbietung oder Aufführung bewegt, kontrolliert oder lenkt. @de
definition: يربط بين وكيل ومصدر يتضمن إسهام وكيل في اللعب بالعرائس أو الدمى المتحركة أو التحكم فيها، أو توجيهها في إنتاج لصور متحركة أو في عرض موسيقي أو درامي أو ترفيهي. @ar
definition: 将一个行为者与包括在动态图像制作或者音乐或戏剧呈现或娱乐中操纵、控制、指引木偶的一个行为者的贡献的一种资源关联起来。 @zh-hans

is panelist of
lexical alias: panelistOf.en
status: Published
type: Property
label: er paneldeltager i @da
label: is panellid van @nl
label: ist Diskussionsteilnehmerin/Diskussionsteilnehmer von @de
label: panelistidir @tr
label: panelistina aineistossa @fi
label: vitafórumtagja a következőnek: @hu
label: هو مشارك في برنامج لـ @ar
label: 是……的访谈嘉宾 @zh-hans
sub property of: is performer of
inverse of: has panelist
definition: Bir temsilciyi, genellikle tartışma ile ilgili alanlarda uzmanların katılımıyla konuların tartışıldığı, sıklıkla yayınlanan bir programa katılan temsilcinin katkısını içeren bir kaynakla ilişkilendirir. @tr
definition: Hozzákapcsol egy ágenst egy forráshoz, amely magában foglalja egy ágens közreműködését egy programban, gyakran sugárzott műsorban, való részvételével, amelyen témákat vitatnak meg, rendszerint a beszélgetés témájában jártas szakértők részvételével. @hu
definition: Liittää toimijan aineistoon, jonka tekemiseen hän osallistuu panelistina (useimmiten lähetetyssä) ohjelmassa, jossa keskustellaan eri aiheista tavallisesti keskusteluun liittyvien aiheiden asiantuntijoiden kanssa. @fi
definition: Relaterer en udøver der bidrager til en ressource ved at deltage i et program, ofte transmitteret, hvor emner diskuteres, normat med deltagelse af fagfolk indenfor felter, der er relateret til diskussionen til en ressource. @da
definition: Relates an agent to a resource that includes a contribution by an agent of participating in a program, often broadcast, where topics are discussed, usually with participation of experts in fields related to the discussion.
definition: Setzt einen Akteur in Beziehung zu einer Ressource, zu der ein Akteur beiträgt, indem er an einer Veranstaltung (meist in einer Sendung) teilnimmt, in der Themen üblicherweise mit Expertinnen/Experten diskutiert werden. @de
definition: يربط بين وكيل ومصدر يتضمن إسهام وكيل بالمشاركة في برنامج، غالبًا مُذاع، حيث تتم مناقشة موضوعات، عادةً بمشاركة خبراء في المجالات المتعلقة بموضوع النقاش. @ar
definition: 将一个行为者与包括参与节目（经常是广播节目，其中讨论话题，通常有讨论相关领域专家参与）一个行为者的贡献的一种资源关联起来。 @zh-hans

is instrumentalist of
lexical alias: instrumentalistOf.en
status: Published
type: Property
label: enstrümantalistidir @tr
label: er musiker i @da
label: instrumentalistina aineistossa @fi
label: is instrumentalst van @nl
label: ist Instrumentalmusikerin/Instrumentalmusiker von @de
label: zenésze a következőnek: @hu
label: هو عَازِف لـ @ar
label: 是……的乐器演奏者 @zh-hans
sub property of: is performer of
inverse of: has instrumentalist
definition: Bir temsilciyi, müzik aleti çalan temsilcinin katkısını içeren bir kaynakla ilişkilendirir. @tr
definition: Hozzákapcsol egy ágenst egy forráshoz, amely magában foglalja egy hangszeren játszó ágens közreműködését. @hu
definition: Liittää toimijan aineistoon jonka tekemiseen hän osallistuu soittamalla soitinta. @fi
definition: Relaterer en udøver der bidrager til en ressource ved at spille et musikinstrument til en ressource @da
definition: Relates an agent to a resource that includes a contribution by an agent of playing a musical instrument.
definition: Setzt einen Akteur in Beziehung zu einer Ressource, zu der ein Akteur beiträgt, indem er ein Musikinstrument spielt. @de
definition: يربط بين وكيل ومصدر يتضمن إسهام وكيل بالعزف على آلة موسيقية. @ar
definition: 将一个行为者与包括演奏乐器的一个行为者的贡献的一种资源关联起来。 @zh-hans

is commentator of
lexical alias: commentatorOf.en
status: Published
type: Property
label: er kommentator i @da
label: is commentator van @nl
label: ist Kommentatorin/Kommentator von @de
label: kommentaattorina aineistossa @fi
label: kommentátora a következőnek: @hu
label: yorumcusudur @tr
label: هو مُعلِق لـ @ar
label: 是……的解说员 @zh-hans
sub property of: is performer of
inverse of: has commentator
definition: Bir kayıt, film veya diğer görsel-işitsel ortamdaki konu hakkında yorum, analiz veya tartışma sağlayarak bir kaynağa katkıda bulunan bir sanatçıyı bir kaynakla ilişkilendirir. @tr
definition: Hozzákapcsol egy előadót, aki hozzájárul egy forráshoz azzal, hogy a forrás témáihoz értelmezést, elemzést nyújt vagy megvitatja azt egy felvételen, filmen vagy más audiovizuális médiumon. @hu
definition: Liittää toimijan aineistoon, jonka tekemiseen hän osallistuu tulkitsemalla tai analysoimalla äänitteen, elokuvan tai muun audiovisuaalisen aineiston aihetta tai keskustelemalla siitä. @fi
definition: Relaterer en udøver der bidrager til en ressource ved at give en fortolkning, analyse, eller diskussion af det emne, der behandles i en optagelse, film eller andet audiovisuelt medium til en ressource. @da
definition: Relates a performer who contributes to a resource by providing interpretation, analysis, or a discussion of the subject matter on a recording, film, or other audiovisual medium to a resource.
definition: Setzt eine Ausführende/einen Ausführenden in Beziehung zu einer Ressource, indem sie/er zu einer Ressource beiträgt, indem sie/er in einer Aufnahme, in einem Film oder in einem anderen audiovisuellen Medium eine Interpretation, eine Analyse oder eine Diskussion des Themas präsentiert. @de
definition: يربط بين مصدر ومؤدِ يُساهم بأحد المصادر من خلال تقديم تفسير للموضوع، أو تحليله، أو مناقشته على تسجيل أو على فيلم، أو على أي وسيط سمعي بصري آخر. @ar
definition: 将一个通过提供关于录像、电影或其他视听媒介中的主要内容之解释、分析或讨论的而对一种资源有贡献的一个表演者与一种资源关联起来。 @zh-hans

is voice actor of
lexical alias: voiceActorOf.en
status: Published
type: Property
label: Seslendirme sanatçısıdır @tr
label: er dubber i @da
label: is stemacteur van @nl
label: ist Sprecherin/Sprecher einer Rolle von @de
label: szinkronszínésze a következőnek: @hu
label: ääninäyttelijänä aineistossa @fi
label: هو مُمثل صوتي لـ @ar
label: 是……的声音演员 @zh-hans
sub property of: is actor of
inverse of: has voice actor
definition: Bir temsilciyi, radyo ve ses yapımlarındaki karakterler ve hareketli görüntü kaynaklarındaki animasyon karakterlerini seslendirmenin yanı sıra radyo ve televizyon reklamlarındaki seslendirmeler, dublajlı ifadeler vb. konusunda ses veren bir temsilcinin katkısını içeren bir kaynakla ilişkilendirir. @tr
definition: Hozzákapcsol egy ágenst egy forráshoz, amely magában foglalja egy ágens közreműködését azzal, hogy rádió- és audió-produkciók szereplőinek, mozgóképforrások animált karaktereinek adja hangját, valamint rádiós és televíziós reklámokban, szinkronizált forrásokban stb. hangátvitelt szolgáltat. @hu
definition: Liittää toimijan aineistoon, jonka tekemiseen hän osallistuu antamalla äänen hahmoille radio- ja äänituotannoissa ja animoiduille hahmoille elokuva-aineistoissa sekä esiintymällä radio- ja TV-mainoksissa, dubatuissa aineistoissa tms. @fi
definition: Relaterer en skuespiller, der har bidraget til en ressource ved at lægge stemme til figurer i radio- og audioproduktioner og til animerede figurer i levende billed-ressourcer, og ved at indtale voice-overs i radio- og tv-reklamer, eftersynkroniserede ressourcer etc. til en ressource. @da
definition: Relates an agent to a resource that includes a contribution by an agent of providing the voice for characters in radio and audio productions and for animated characters in moving image resources, as well as voice-overs in radio and television commercials, dubbed resources, etc.
definition: Setzt einen Akteur in Beziehung zu einer Ressource, zu der ein Akteur beiträgt, indem er seine Stimme Charakteren in Hörfunk- und Audioproduktionen und animierten Charakteren in Bewegtbildwerken leiht und Begleitkommentare in Hörfunk- oder Fernsehwerbung, untertitelten Expressionen und so weiter zur Verfügung stellt. @de
definition: يربط بين وكيل ومصدر يتضمن إسهام وكيل بالتمثيل الصوتي لشخصيات في الإنتاج الإذاعي والسمعي وللشخصيات الكرتونية في أعمال الصور المتحركة، إضافة إلى التعليق الصوتي في إعلانات الإذاعة والتليفزيون، والتعبيرات المدبلجة...إلخ. @ar
definition: 将一个行为者与包括为在广播和音频制作中的角色和为动态图像作品中的动画角色提供人声以及为广播和电视广告提供画外音、配音等的一个行为者的贡献的一种资源关联起来。 @zh-hans

is narrator of
lexical alias: narratorOf.en
status: Published
type: Property
label: anlatıcısıdır @tr
label: er fortæller i @da
label: is verteller van @nl
label: ist Erzählerin/Erzähler von @de
label: kertojana aineistossa @fi
label: narrátora a következőnek: @hu
label: هو راوٍ لـ @ar
label: 是……的旁白者 @zh-hans
sub property of: is performer of
inverse of: has narrator
definition: Bir temsilciyi, bir eylemin, oluşumun veya başka bir olayın yüksek sesle okunması veya bir açıklama yapılmasına yönelik bir temsilcinin katkısını içeren bir kaynakla ilişkilendirir. @tr
definition: Hozzákapcsol egy ágenst egy forráshoz, amely magában foglalja egy ágens közreműködését egy cselekményről, eseményről, események menetéről stb. szóló beszámoló hangos felolvasásában. @hu
definition: Liittää henkilön aineistoon, jonka tekemiseen hän osallistuu lukemalla ääneen tai kertomalla toiminnasta, tapahtumasta, tapahtumien kulusta tms. @fi
definition: Relaciona un agent amb un recurs que inclou una contribució d’un agent llegint en veu alta o explicant una acció, una situació o qualsevol altre esdeveniment. @ca
definition: Relaterer en udøver der bidrager til en ressource ved at læse højt eller berette om en handling, en hændelse, et begivenhedsforløb, etc. til en ressource. @da
definition: Relates an agent to a resource that includes a contribution by an agent of reading aloud or giving an account of an act, occurrence, or other event.
definition: Setzt einen Akteur in Beziehung zu einer Ressource, zu der ein Akteur beiträgt, indem er vorliest oder eine Handlung, ein Geschehnis oder ein anderes Ereignis schildert. @de
definition: يربط بين وكيل ومصدر يتضمن إسهام وكيل بالقراءة بصوت مرتفع أو بسرد فصل من مسرحية، واقعة، أو حدث آخر. @ar
definition: 将一个行为者与包括有朗读或描述行为、事情或其他事件的行为者的贡献的一种资源关联起来。 @zh-hans

is storyteller of
lexical alias: storytellerOf.en
status: Published
type: Property
label: Hikaye anlatıcısı @tr
label: er historiefortæller i @da
label: is verhalenverteller van @nl
label: ist Geschichtenerzählerin/Geschichtenerzähler von @de
label: tarinankertojana aineistossa @fi
label: történetmesélője a következőnek: @hu
label: هو راوي قصص لـ @ar
label: 是……的说书人 @zh-hans
sub property of: is performer of
inverse of: has storyteller
definition: Bir temsilciyi, dramatik veya teatral yorumla bir hikayeyi aktaran bir sanatçı olan bir temsilcinin katkısını içeren bir kaynakla ilişkilendirir. @tr
definition: Hozzákapcsol egy ágenst egy forráshoz, amely magában foglalja egy ágens közreműködését egy történet dramatizált vagy színházi interpretációjában. @hu
definition: Liittää toimijan aineistoon, jonka tekemiseen hän osallistuu esittäjänä tekijän alkuperäisen tarinan draamallisella tai teatraalisella tulkinnalla. @fi
definition: Relaterer en udøver der bidrager til en ressource ved at give en ophavspersons oprindelige historie med dramatisk eller teatralsk fortolkning til en ressource. @da
definition: Relates an agent to a resource that includes a contribution by an agent who is a performer of relaying a story with dramatic or theatrical interpretation.
definition: Setzt einen Akteur in Beziehung zu einer Ressource, zu der ein Akteur beiträgt, indem er eine Geschichte mit dramatischer oder theatralischer Interpretation wiedergibt. @de
definition: يربط بين وكيل ومصدر يتضمن إسهام وكيل يقوم بنقل قصة أصلية ووصفها بصورة درامية أو مسرحية. @ar
definition: 将一个行为者与包括有作为表演者用戏剧化解释转达故事的一个行为者的贡献的一种资源关联起来。 @zh-hans

is speaker of
lexical alias: speakerOf.en
status: Published
type: Property
label: Konuşmacısı @tr
label: er taler i @da
label: is spreker van @nl
label: ist Rednerin/Redner von @de
label: puhujana aineistossa @fi
label: élőszavas előadója a következőnek: @hu
label: هو متحدث لـ @ar
label: 是……的演说者 @zh-hans
sub property of: is performer of
inverse of: has speaker
definition: Bir temsilciyi, ders, konuşma vb. gibi kelimeleri söyleyen temsilcinin katkısını içerildiği bir kaynakla ilişkilendirir. @tr
definition: Hozzákapcsol egy ágenst egy forráshoz, amely magában foglalja egy ágens élőszóbeli közreműködését, például előadásként, beszédként stb. @hu
definition: Liittää toimijan aineistoon, jonka tekemiseen hän osallistuu puhumalla, kuten luennoimalla tai pitämällä puheen tms. @fi
definition: Relaterer en udøver der bidrager til en ressource ved at fremføre ord, fx en forelæsning, tale, etc. til en ressource @da
definition: Relates an agent to a resource that includes a contribution by an agent of speaking words, such as a lecture, speech, etc.
definition: Setzt einen Akteur in Beziehung zu einer Ressource, zu der ein Akteur beiträgt, indem er Worte, wie zum Beispiel einen Vortrag, eine Rede oder ähnliches, spricht. @de
definition: يربط بين وكيل ومصدر يتضمن إسهام وكيل بالتحدث بكلمات، كما في محاضرة، خطبة، إلخ. @ar
definition: 将一个行为者与包括有诸如讲座和演讲之类讲话的一个行为者的贡献的一种资源关联起来。 @zh-hans

is singer of
lexical alias: singerOf.en
status: Published
type: Property
label: er sanger i @da
label: is zanger van @nl
label: ist Sängerin/Sänger von @de
label: laulajana ainestossa @fi
label: énekese a következőnek: @hu
label: Şarkıcısı @tr
label: هو مغنِ لـ @ar
label: 是……的演唱者 @zh-hans
sub property of: is performer of
inverse of: has singer
definition: Bir temsilciyi, müzik üretmek için enstrüman eşliğinde veya eşliksiz bir ses sanatçısı olan bir temsilcinin katkısını içeren bir kaynakla ilişkilendirir. @tr
definition: Hozzákapcsol egy ágenst egy forráshoz, amely magában foglalja egy ágens közreműködését zenei produktum hanggal történő előadásában hangszeres kísérettel vagy anélkül. @hu
definition: Liittää toimijan aineistoon, jonka tekemiseen hän osallistuu esiintymällä lauluäänellä (soitinsäestyksellä tai ilman) tuottaakseen musiikkia. @fi
definition: Relaterer en udøver der bidrager til en ressource ved at bruge sin stemme, med eller uden instrumentalledsagelse, til at skabe musik til en ressource. @da
definition: Relates an agent to a resource that includes a contribution by an agent who is a performer of voice, with or without instrumental accompaniment, to produce music.
definition: Setzt einen Akteur in Beziehung zu einer Ressource, zu der ein Akteur beiträgt, indem er durch seine Singstimme, mit oder ohne instrumentale Begleitung, Musik erzeugt. @de
definition: يربط بين وكيل ومصدر يتضمن إسهام وكيل يقوم بأداء صوتي، بمصاحبة أو دون مصاحبة آلة موسيقية، لإنتاج أغنية. @ar
definition: 将一个行为者与包括作为人声表演者（不管是否有乐器伴奏）产生音乐的一个行为者的贡献的一种资源关联起来。 @zh-hans

is medium of
lexical alias: mediumOf.en
status: Published
type: Property
label: er medie i @da
label: is medium van @nl
label: ist Channel von @de
label: medyumudur @tr
label: meediona aineistossa @fi
label: médiuma a következőnek: @hu
label: هو وسيط روحاني لـ @ar
label: 是……的通灵者 @zh-hans
sub property of: is other agent associated with resource of (Deprecated)
inverse of: has medium
definition: Bir temsilciyi, dünyevi dünya ile ruhlar dünyası arasında bir iletişim kanalı olarak kabul edilen bir kaynakla ilişkilendirir. @tr
definition: Hozzákapcsol egy ágenst, akit a földi világ és a szellemek világa közötti kommunikációs csatornának tartanak. @hu
definition: Liittää aineistoon toimijan, jota pidetään kanavana henkimaailman ja maallisen maailman välillä. @fi
definition: Relaterer en agent der siges at være en kanal for kommunikation mellem den jordiske verden og en åndevereden, til en ressource. @da
definition: Relates an agent held to be a channel of communication between the earthly world and a world of spirits to a resource.
definition: Setzt einen Akteur in Beziehung zu einer Ressource, bei der der der Akteur für sich in Anspruch nimmt, als Kommunikationskanal zwischen der irdischen Welt und einer Geisterwelt zu dienen. @de
definition: يربط بين وكيل يعمل بوصفه قناة اتصال بين العالم الأرضي وعالم الأرواح وأحد المصادر. @ar
definition: 将一个被认为是现实世界和精神世界之间通讯渠道的一个行为者与一种资源关联起来。 @zh-hans

is film producer of
lexical alias: filmProducerOf.en
status: Published
type: Property
label: elokuvatuottajana aineistossa @fi
label: er filmproducer af @da
label: film yapımcısıdır @tr
label: filmproducere a következőnek: @hu
label: is filmproducent van @nl
label: ist Filmproduzentin/Filmproduzent von @de
label: هو منتج الفيلم لـ @ar
label: 是……的电影制作人 @zh-hans
sub property of: is producer of
inverse of: has film producer
definition: Bir temsilciyi, bir film yapımının ticari yönlerinin çoğu için sorumluluğun bir temsilciye ait olduğu bir kaynakla ilişkilendirir. @tr
definition: Hozzákapcsol egy ágenst egy forráshoz, amelyhez hozzátartozik egy ágens felelőssége egy filmprodukció legtöbb üzleti vonatkozásáért. @hu
definition: Liittää toimijan aineistoon, jossa toimija vastaa suurimmasta osasta elokuvan liiketoimintaa. @fi
definition: Relaterer en producer, der er ansvarlig for størstedelen af de forretningsmæssige aspekter ved en film til en ressource. @da
definition: Relates an agent to a resource that involves a responsibility of an agent for most of the business aspects of the production of a film.
definition: Setzt einen Akteur in Beziehung zu einer Ressource, bei der ein Akteur für die meisten geschäftlichen Aspekte bei der Produktion eines Films verantwortlich ist. @de
definition: يربط بين وكيل ومصدر ينطوي على مسؤولية وكيل عن معظم الجوانب التجارية لإنتاج فيلم. @ar
definition: 将一个行为者与涉及电影制作的大部分商业运作的一个行为者的责任的一种资源关联起来。 @zh-hans

is radio producer of
lexical alias: radioProducerOf.en
status: Published
type: Property
label: er radioproducer af @da
label: is radioproducent van @nl
label: ist Hörfunkproduzentin/Hörfunkproduzent von @de
label: radiotuottajana aineistossa @fi
label: radyo yapımcısıdır @tr
label: rádióproducere a következőnek: @hu
label: هو منتج إذاعي لـ @ar
label: 是……的广播制作人 @zh-hans
sub property of: is producer of
inverse of: has radio producer
definition: Bir temsilciyi, bir radyo programının yapımının ticari yönlerinin çoğu için sorumluluğun bir temsilciye ait olduğu bir kaynakla ilişkilendirir. @tr
definition: Hozzákapcsol egy ágenst egy forráshoz, amelyhez hozzátartozik egy ágens felelőssége egy rádióműsor legtöbb üzleti vonatkozásáért. @hu
definition: Liittää toimijan aineistoon, jossa toimija vastaa suurimmasta osasta radio-ohjelman liiketoimintaa. @fi
definition: Relaterer en producer der er ansvarlig for størstedelen af de forretningsmæssige aspekter ved et radioprogram, til en ressource. @da
definition: Relates an agent to a resource that involves a responsibility of an agent for most of the business aspects of the production of a radio program.
definition: Setzt einen Akteur in Beziehung zu einer Ressource, bei der ein Akteur für die meisten geschäftlichen Aspekte einer Hörfunksendung verantwortlich ist. @de
definition: يربط بين وكيل ومصدر ينطوي على مسؤولية وكيل عن معظم الجوانب التجارية لإنتاج برنامج إذاعي. @ar
definition: 将一个行为者与涉及广播节目制作的大部分商业运作的一个行为者的责任的一种资源关联起来。 @zh-hans

is television producer of
lexical alias: televisionProducerOf.en
status: Published
type: Property
label: Televizyon yapımcısı @tr
label: er tv-producer af @da
label: is televisieproducent van @nl
label: ist Fernsehproduzentin/Fernsehproduzent von @de
label: televisiotuottajana aineistossa @fi
label: televízió-producere a következőnek: @hu
label: هو منتج تليفزيوني لـ @ar
label: 是……的电视制作人 @zh-hans
sub property of: is producer of
inverse of: has television producer
definition: Bir temsilciyi, bir televizyon programının yapımının ticari yönlerinin çoğu için sorumluluğun bir temsilciye ait olduğu bir kaynakla ilişkilendirir. @tr
definition: Hozzákapcsol egy ágenst egy forráshoz, amelyhez hozzátartozik az ágens felelőssége egy televízióműsor üzleti vonatkozásainak a zöméért. @hu
definition: Liittää toimijan aineistoon, jossa toimija vastaa suurimmasta osasta televisio-ohjelman liiketoimintaa. @fi
definition: Relaterer en producer der er ansvarlig for størstedelen af de forretningsmæssige aspekter ved et tv-program, til en ressource. @da
definition: Relates an agent to a resource that involves a responsibility of an agent for most of the business aspects of the production of a television program.
definition: Setzt einen Akteur in Beziehung zu einer Ressource, bei der ein Akteur für die meisten geschäftlichen Aspekte einer Fernsehsendung verantwortlich ist. @de
definition: يربط بين وكيل ومصدر ينطوي على مسؤولية وكيل عن معظم الجوانب التجارية لإنتاج برنامج تليفزيوني. @ar
definition: 将一个行为者与涉及电视节目制作的大部分商业运作的一个行为者的责任的一种资源关联起来。 @zh-hans

has alternate identity
lexical alias: alternateIdentity.en
status: Published
type: Property
label: alternatif kimlik ile ilişkilidir @tr
label: alternatív identitása: @hu
label: har alternativ identitet @da
label: hat andere Identität @de
label: heeft alternatieve identiteit @nl
label: vaihtoehtoinen identiteetti @fi
label: له هوية بديلة @ar
label: 有交替身份 @zh-hans
definition: Bir temsilciyi, bir temsilci tarafından kullanılan bir takma ad veya başka bir unvan ile ilişkilendirir. @tr
definition: Hozzákapcsol egy ágenst egy nomenhez, amely egy álnév vagy más, egy ágens által használt megnevezés. @hu
definition: Liittää toimijan nomeniin, joka on pseudonyymi tai toimijan käyttämä muu nimitys. @fi
definition: Relaterer en pseudonym eller anden identitet antaget af en person til en agent. @da
definition: Relates an agent to a nomen that is a pseudonym or other appellation used by an agent.
definition: Setzt einen Akteur in Beziehung zu einem Nomen, bei dem es sich um ein Pseudonym oder eine andere, von einem Akteur verwendete, Bezeichnung handelt. @de
definition: يربط بين وكيل وتسمية قد تكون اسما مستعارا أو أي تسمية أخرى يستخدمها وكيل. @ar
definition: 将一个行为者与作为一个行为者所使用的一个化名或其他称谓的命名关联起来。 @zh-hans

has real identity
lexical alias: realIdentity.en
status: Published
type: Property
label: gerçek kimlik ile ilişkilidir @tr
label: har virkelig identitet @da
label: hat wirkliche Identität @de
label: heeft echte identiteit @nl
label: todellinen identiteetti @fi
label: valódi identitása a következő: @hu
label: له هوية حقيقية @ar
label: 有真实身份 @zh-hans
definition: Alternatif bir kimlik üstlenmiş gerçek bir temsilciyi bir temsilciyle ilişkilendirir. @tr
definition: Hozzákapcsol egy valódi ágenst, aki felveszi egy ágens alternatív identitását. @hu
definition: Liittää todellisen toimijan oletettuun vaihtoehtoiseen identiteettiin. @fi
definition: Relaciona un agent amb un nomen que és una apel·lació real d’un agent que usa un altre nomen. @ca
definition: Relaterer en virkelig agent der antager en alternativ identitet til en agent. @da
definition: Relates an agent to a nomen that is a real appellation of an agent who uses another nomen.
definition: Setzt einen realen Akteur, der eine andere Identität annimmt, in Beziehung zu einem Akteur. @de
definition: يربط وكيل حقيقي يدّعي هوية بديلة لوكيل @ar
definition: 将一个行为者与作为使用另一个命名的一个行为者的一个真实称谓的一个命名关联起来。 @zh-hans

has respondent
lexical alias: respondent.en
status: Published
type: Property
label: har respondent @da
label: hat Respondentin/Respondent @de
label: heeft respondent @nl
label: respondentti @fi
label: tez yazarı ile ilişkilidir @tr
label: válaszadója a következő: @hu
label: له مُستَجِيب @ar
label: 有答辩人 @zh-hans
sub property of: has creator
inverse of: is respondent of
definition: Bir kaynağı, danışmanlar tarafından ortaya konan akademik bir tartışmada bir tezi savunan veya karşı çıkan bir mezun adayı olan temsilci ilişkilendirir. @tr
definition: Egy forrást hozzákapcsol egy ágenshez, aki az elnök által előterjesztett értekezést megvédi vagy opponálja egy tudományos vitában. @hu
definition: Liittää aineiston toimijaan, joka on oppiarvoa tavoitteleva kandidaatti, joka puolustaa tai opponoi preeseksen akateemisessa väitöstilaisuudessa esittelemää väitöskirjaa. @fi
definition: Relaterer en ressource til en kandidat til en akademisk grad, der forsvarer eller opponerer mod en tese, der er fremsat af præses i et akademisk afhandlingsforsvar. @da
definition: Relates a resource to an agent who is a candidate for a degree who defends or opposes a thesis provided by the praeses in an academic disputation.
definition: Setzt eine Ressource in Beziehung zu einer Kandidatin/einem Kandidaten für einen akademischen Grad, die/der eine These, die vom Praeses in einer akademischen Disputation aufgestellt wird, verteidigt oder ablehnt. @de
definition: يربط مصدر بوكيل باحث للحصول على درجة علمية يدافع عن أو يعارض أطروحة مقدمة من رؤساء جلسة علمية في مناظرة أكاديمية. @ar
definition: 将一种资源与作为学位候选人对在学位论文答辩中评审人提供的一篇论文提出支持或反对的一个行为者关联起来。 @zh-hans

has undifferentiated name indicator
lexical alias: undifferentiatedNameIndicator.en
status: Published
type: Property
label: ayırt edilemeyen ad göstergesi ile ilişkilidir @tr
label: har ikke entydig navneindikator @da
label: hat Indikator für nicht individualisierte Namen @de
label: heeft niet-onderscheiden naam indicatie @nl
label: nem differenciált névjelzője a következő: @hu
label: yksilöimättömän nimen ilmaus aineistolle @fi
label: له مؤشر لاسم غير مميز @ar
label: 有未区分名称标识符 @zh-hans
definition: Bir adı, bir adın iki veya daha fazla varlık arasında ayrım yapmak için yetersiz olduğunu gösteren bir sınıflandırmayla ilişkilendirir. @tr
definition: Hozzákapcsol egy nevet egy kategorizáláshoz, jelezve, hogy a név nem alkalmas két vagy több entitás megkülönböztetésére. @hu
definition: Liittää aineiston kategorisointiin, jolla ilmaistaan sen riittämättömyys kahden tai useamman entiteetin erottamiseen toisistaan. @fi
definition: Relaterer en ressource til en kategorisering, der angiver, at de registrerede kerneelementer er utilstrækkelige til at skelne mellem to eller flere agenter med det samme navn. @da
definition: Relates a name to a categorization indicating that a name is insufficient to differentiate between two or more entities.
definition: Setzt einen Namen in Beziehung zu einer Kategorisierung die angibt, dass ein Name nicht ausreicht, um zwischen zwei oder mehreren Entitäten zu unterscheiden. @de
definition: يربط بين اسم وفئة تشير إلى اسم غير كافِ للتمييز بين كيانين أو أكثر. @ar
definition: 将一个名称与表明一个名称不足以区分两个或更多实体的一个类别关联起来。 @zh-hans

has category of agent
lexical alias: categoryOfAgent.en
status: Published
type: Property
label: har type af agent @da
label: hat Kategorie eines Akteurs @de
label: heeft categorie van actor @nl
label: temsilcinin kategorisi ile ilişkilidir @tr
label: toimijan kategoria @fi
label: ágens kategóriája a következő: @hu
label: له فئة لوكيل @ar
label: 有行为者的类别 @zh-hans
alternative label: temsilcinin türü @tr
alternative label: toimijan tyyppi @fi
alternative label: type of agent
alternative label: ágenstípus @hu
alternative label: نوع الوكيل @ar
alternative label: 行为者的类型 @zh-hans
definition: Bir temsilciyi, temsilcinin ait olduğu bir tür ilişkilendirir. @tr
definition: Hozzákapcsol egy ágenst ahhoz a típushoz, amelyhez az ágens tartozik. @hu
definition: Liittää toimijan tyyppiin tai jaotteluun, johon toimija kuuluu. @fi
definition: Relaterer en ressource til en kategorisering eller almindelig beskrivelse på en type af agent. @da
definition: Relates an agent to a type to which an agent belongs.
definition: Setzt einen Akteur in Beziehung zu einer Art, zu der ein Akteur gehört. @de
definition: يربط بين وكيل والنوع الذي ينتمي إليه وكيل. @ar
definition: 将一个行为者与一个行为者所属于的一个类型关联起来。 @zh-hans

has carrier type
lexical alias: carrierType.en
status: Published
type: Property
label: aineiston tallennetyyppi @fi
label: har bærertype @da
label: hat Datenträgertyp @de
label: heeft type drager @nl
label: hordozótípusa a következő: @hu
label: taşıyıcı türü ile ilişkilidir @tr
label: له نوع الحامل @ar
label: 有载体类型 @zh-hans
definition: Bir kaynağı, bir kaynağın içeriğini görüntülemek, oynatmak, çalıştırmak veya başka bir şekilde erişmek için gereken aracı cihaz türüyle kombinasyon halinde depolama ortamının biçimini ve bir taşıyıcının yerini yansıtan bir sınıflandırmayla ilişkilendirir. @tr
definition: Hozzákapcsol egy forrást egy kategorizáláshoz, amely tükrözi a tároló médium formátumát és a hordozó burkolatát a közvetítőkészülék azon típusával kombináltan, amely egy forrás tartalmának megtekintéséhez, lejátszásához, futtatásához, stb. szükséges. @hu
definition: Liittää aineiston kategorisointiin, joka ilmaisee säilytysvälineen ja tallenteen koteloinnin formaatin yhdessä aineiston sisällön katsomiseen, toistamiseen, suorittamiseen tai muuhun toimintaan tarvittavan välittävän laitteen tyypin kanssa. @fi
definition: Relaterer en manifestation til en kategorisering der specifikt afspejler lagringsmediet og dets udstyr i kombination med den type af afspilningsudstyr, som kræves for at se, spille, fremvise eller på anden måde give adgang til en manifestations indhold. @da
definition: Relates a resource to a categorization reflecting the format of the storage medium and housing of a carrier in combination with the type of intermediation device required to view, play, run, or otherwise access the content of a resource.
definition: Setzt eine Ressource in Beziehung zu einer Kategorisierung, die das Format des Speichermediums und das Gehäuse eines Datenträgers widerspiegelt, in Kombination mit der Art des Hilfsmittels, das benötigt wird, um den Inhalt einer Ressource anzuschauen, abzuspielen oder laufen zu lassen und so weiter. @de
definition: يربط بين مصدر وفئة تعكس شكل وسيط التخزين ومكان الحامل المصاحب لنوع الجهاز الوسيط المطلوب لعرض، لتشغيل، أو لمعالجة أو للوصول إلى محتوى مصدر. @ar
definition: 将一种资源与反映存储媒介格式和载体装置并结合资源内容的浏览、播放、运行或其他存取方式等所需中间设备的类型的分类关联起来。 @zh-hans

has content type
lexical alias: contentType.en
status: Published
type: Property
label: aineiston sisältötyyppi @fi
label: har indholdstype @da
label: hat Inhaltstyp @de
label: heeft type content @nl
label: tartalomtípusa a következő: @hu
label: İçerik türü ile ilişkilidir @tr
label: له نوع محتوى @ar
label: 有内容类型 @zh-hans
definition: Bir kaynağı, bir içeriğin ifade edildiği temel iletişim biçimini ve bunun algılanmasının amaçlandığı bir insan duyusunu yansıtan bir sınıflandırmayla ilişkilendirir. @tr
definition: Hozzákapcsol egy forrást egy kategorizáláshoz, amely tükrözi a kommunikáció azon alapvető formáját, melyen a tartalom kifejezésre kerül, és amelyet emberi érzékszerven keresztüli érzékelésére szántak. @hu
definition: Liittää aineiston viestintämuotoon, jolla aineiston sisältö on ilmaistu sekä aistiin, jolla se on tarkoitus vastaanottaa. @fi
definition: Relaterer en ressource til en kategorisering, der afspejler den grundlæggende kommunikationsform, hvorigennem indholden ressourcekes, og den menneskelige sans, hvorigennem det er meningen, at det skal opfattes. @da
definition: Relates a resource to a categorization reflecting a fundamental form of communication in which a content is expressed and a human sense through which it is intended to be perceived.
definition: Setzt eine Ressource in Beziehung zu einer Kategorisierung, die zum einen die grundlegende Form der Kommunikation widerspiegelt, in der der Inhalt ausgedrückt wird, und zum andern die menschliche Wahrnehmung wiedergibt, durch die diese wahrgenommen werden soll. @de
definition: يربط بين مصدر وفئة تعكس الشكل الأساسي للتواصل الذي يتم فيه التعبير عن المحتوى والحس الإنساني الذي من المفترض أن يُنظر إليها من خلاله. @ar
definition: 将一种资源与反映一个内容被表达所用通讯的基本形式和设计被感知的人类感觉的分类关联起来。 @zh-hans
scope note: A tartalomtípus a térbeli dimenziók számát és a mozgás jelenlétét vagy hiányát is tükrözi, amelyben kép vagy képek alakjában kifejezett tartalmat kívánnak érzékeltetni. @hu
scope note: Content type also reflects the number of spatial dimensions and the presence or absence of movement in which content expressed in the form of an image or images is intended to be perceived.
scope note: Für Inhalt, der in Form eines Bilds oder mehrerer Bilder ausgedrückt wird, spiegelt der Inhaltstyp auch die Anzahl räumlicher Dimensionen wider, in denen der Inhalt wahrgenommen werden soll, sowie die Wahrnehmung von vorhandener oder nicht vorhandener Bewegung. @de
scope note: Hvad angår indhold, der udtrykkes i form af et eller flere billeder, afspejler indholdstype desuden antallet af rumlige dimensioner, som indholdet skal opfattes i, samt opfattelsen af tilstedeværelse eller fravær af bevægelse. @da
scope note: Sisältötyyppi kuvaa myös mahdollista kuvasisällön hahmottamiseen vaikuttavaa moniulotteisuutta ja liikettä. @fi
scope note: Type content geeft ook het aantal ruimtelijke dimensies weer en de aanwezigheid of afwezigheid van beweging waarmee content uitgedrukt in de vorm van een beeld of beelden geacht wordt waargenomen. @nl
scope note: İçerik türü, ayrıca bir veya birden fazla görüntü biçiminde ifade edilen içeriğin algılanması amacıyla tasarlandığı mekânsal boyut sayısını ve hareketin varlığını veya yokluğunu yansıtır. @tr
scope note: يعكس نوع المحتوى أيضًا عدد الأبعاد المكانية ووجود أو عدم وجود الحركة التي يُقصد من خلالها إدراك المحتوى المعبر عنه في شكل صورة أو صور. @ar
scope note: 对于被设计以一种或多种被感知图像形式表达的内容，内容类型还反映空间维度数以及感知运动是否存在。 @zh-hans

has media type
lexical alias: mediaType.en
status: Published
type: Property
label: aineiston mediatyyppi @fi
label: har medietype @da
label: hat Medientyp @de
label: heeft type medium @nl
label: médiatípusa a következő: @hu
label: ortam türü ile ilişkilidir @tr
label: له نوع الوسيط @ar
label: 有媒介类型 @zh-hans
definition: Bir kaynağı, bir kaynağın içeriğini görüntülemek, oynatmak, çalıştırmak veya başka bir şekilde erişmek için gereken aracı aygıtın genel türünü yansıtan bir sınıflandırmayla ilişkilendirir. @tr
definition: Hozzákapcsol egy forrást egy kategorizáláshoz, amely tükrözi a közvetítőkészülék általános típusát, amely egy forrás tartalmának megtekintéséhez, lejátszásához, futtatásához, stb. szükséges. @hu
definition: Kategorisointi, joka ilmaisee aineiston sisällön katsomiseen, toistamiseen, suorittamiseen tai muuhun toimintaan tarvittavan välittävän laitteen yleistä tyyppiä. @fi
definition: Relaterer en ressource til en kategorisering der generelt afspejler typen af formidlingsudstyr/afspiller, der kræves for at tilgå en ressources indhold. @da
definition: Relates a resource to a categorization reflecting the general type of intermediation device required to view, play, run, or otherwise access the content of a resource.
definition: Setzt eine Ressource in Beziehung zu einer Kategorisierung, welche die allgemeine Art des Hilfsmittels widerspiegelt, das erforderlich ist, um den Inhalt einer Ressource anzuschauen, abzuspielen oder laufen zu lassen und so weiter. @de
definition: يربط بين مصدر وفئة تعكس النوع العام للجهاز الوسيط المطلوب لعرض، أو لتشغيل، أو لمعالجة أو للوصول إلى محتوى مصدر. @ar
definition: 将一种资源与反映资源内容的浏览、播放、运行或其他存取方式等所需中间设备的一般类型的分类关联起来。 @zh-hans

has mode of issuance
lexical alias: modeOfIssuance.en
status: Published
type: Property
label: aineiston julkaisutapa @fi
label: har udgivelsesform @da
label: hat Erscheinungsweise @de
label: heeft wijze van uitvaardiging @nl
label: kibocsájtás módja a következő: @hu
label: yayın biçimi ile ilişkilidir @tr
label: له أسلوب للإصدار @ar
label: 有发行方式 @zh-hans
definition: Bir kaynağı, kaynağın bir veya daha fazla parça halinde yayınlanıp yayınlanmadığı, güncellenme biçimi ve kaynağın amaçlanan sona erdilimesini yansıtan bir sınıflandırmayla ilişkilendirir. @tr
definition: Hozzákapcsol egy forrást egy kategorizáláshoz, amely tükrözi hogy egy forrást egy vagy több részben adtak ki, a frissítés módját, és a tervezett megszüntetést. @hu
definition: Liittää aineiston kategorisointiin, joka kertoo, ilmestyykö se yhdessä vai useassa osassa. @fi
definition: Relaciona un recurs amb una categorització que reflecteix si un recurs s’emet en una o més unitats. @ca
definition: Relaterer en ressource til en kategorisering, der afspejler, hvorvidt en ressource er udgivet i en eller flere dele, hvordan den opdateres, og hvorvidt dens ophør er forudbestemt eller ej. @da
definition: Relates a resource to a categorization that reflects whether a resource is issued in one or more units.
definition: Setzt eine Ressource in Beziehung zu einer Kategorisierung die widerspiegelt, ob eine Ressource in einem Teil oder mehreren Teilen erscheint, wie sie aktualisiert wird und wie sie enden soll. @de
definition: يربط بين مصدر وفئة تعكس ما إذا كان المصدر قد صدر في جزء واحد أو عدة أجزاء، طريقه تحديثه، وتوقيفه عن قصد. @ar
definition: 将一种资源与反映资源以一个还是以多个单元发行的分类关联起来。 @zh-hans

has identifier for resource
has subproperty: has publisher number for notated music
has subproperty: has plate number for notated music
has subproperty: has fingerprint
lexical alias: identifierForResource.en
status: Published
type: Property
label: aineiston tunniste @fi
label: forrás azonosítója a következő: @hu
label: har identifikator for ressourcen @da
label: hat Identifikator für eine Ressource @de
label: heeft identificatie voor resource @nl
label: kaynağın tanımlayıcısı ile ilişkilidir @tr
label: له معرف لمصدر @ar
label: 有资源的标识符 @zh-hans
sub property of: has identifier for entity
inverse of: is identifier for resource of
definition: Bir kaynağı, bir kaynağı tanımlamak için kullanılan, genellikle doğal dil ve sosyal adlandırma kurallarından bağımsız olarak, bir kod, sayı veya başka bir diziyi içeren bir kaynak unvanıyla ilişkilendirir. @tr
definition: Hozzákapcsol egy forrást egy forrás megnevezéséhez, amely egy kód, egy szám, vagy más típusú karakterlánc, amely általában független a természetes nyelvektől és a társadalmi névkonvencióktól, és egyetlen forrás azonosítására használják. @hu
definition: Liittää aineiston aineiston nimitykseen, joka koostuu koodista, luvusta tai muusta tavallisesti luonnollisesta kielestä ja yleisistä nimeämiskäytännöistä riippumattomasta merkkijonosta, jota käytetään aineiston identifiointiin. @fi
definition: Relaciona un recurs amb un nomen que és una apel·lació de recurs que consisteix en un codi, número o qualsevol altra cadena, normalment independent del llenguatge natural i de les convencions lingüístiques socials, usada per identificar un recurs. @ca
definition: Relaterer en ressource til en ressourcebenævnelse, der består af en kode, et nummer, eller anden streng, normalt uafhængig af naturligt sprog og sociale navngivningskonventioner, der tjener til at skelne denne ressource fra andre ressourcer. @da
definition: Relates a resource to a nomen that is an appellation of resource that consists of a code, number, or other string, usually independent of natural language and social naming conventions, used to identify a resource.
definition: Setzt eine Ressource in Beziehung zu einer Bezeichnung für eine Ressource, die aus einem Code, einer Nummer oder einer anderen Zeichenkette besteht, der/die normalerweise nicht in natürlicher Sprache und unabhängig von den sozialen Benennungskonventionen ist und zur Identifizierung einer Ressource verwendet wird. @de
definition: يربط بين مصدر وتسمية لمصدر يتكون من رمز، رقم، أو سلسلة تمثيلات أخرى، عادة ما تكون مستقلة عن اللغة الطبيعية وعن التسميات المتعارف عليها اجتماعيًا، المستخدمة في تحديد هوية مصدر. @ar
definition: 将一种资源与由代码、数字或其他串组成、通常独立于自然语言和社会命名惯例、用于标识一种资源、作为一种的称谓的一个命名关联起来。 @zh-hans
scope note: A kódolt karakterlánc általában független a természetes nyelvektől és társadalmi névkonvencióktól. @hu
scope note: Den kodede streng er normalt uafhængig af naturligt sprog og sociale navnekonventioner. @da
scope note: Die kodierte Zeichenkette ist normalerweise nicht in natürlicher Sprache und unabhängig von den sozialen Benennungskonventionen. @de
scope note: Kodlanmış dizi genellikle doğal dilden ve sosyal adlandırma kurallarından bağımsızdır. @tr
scope note: Koodattu merkkijono on yleensä luonnollisesta kielestä ja sosiaalisista nimeämisen käytännöistä riippumaton. @fi
scope note: The coded string is usually independent of natural language and social naming conventions.
scope note: عادة ما تكون سلسلة التمثيلات المرمزة مستقلة عن اللغة الطبيعية وعن التسميات المتعارف عليها اجتماعيًا. @ar
scope note: 编码串通常独立于自然语言和社会命名惯例。 @zh-hans

has identifier for agent
lexical alias: identifierForAgent.en
status: Published
type: Property
label: har identifikator for agent @da
label: hat Identifikator für einen Akteur @de
label: heeft identificatie voor actor @nl
label: temsilcinin tanımlayıcısı ile ilişkilidir @tr
label: toimijan tunniste @fi
label: ágens azonosítója a következő: @hu
label: له معرف لوكيل @ar
label: 有行为者的标识符 @zh-hans
sub property of: has identifier for entity
inverse of: is identifier for agent of
definition: Bir temsilciyi, bir temsilciyi tanımlamak için kullanılan, genellikle doğal dilden ve sosyal adlandırma kurallarından bağımsız olarak, bir kod, sayı veya başka bir dizgeden oluşan bir temsilci unvanıyla ilişkilendirir. @tr
definition: Hozzákapcsol egy ágenst egy ágens megnevezéséhez, amely egy kód, szám, vagy más típusú karakterláncból áll, amely általában független a természetes nyelvektől és a társadalmi névkonvencióktól, és egyetlen ágens azonosítására használják. @hu
definition: Liittää toimijan nimitykseen, joka koostuu koodista, numerosta tai muusta merkkijonosta ja joka yleensä on luonnollisesta kielestä ja kielen sosiaalisista konventioista riippumaton toimijan tunnistamiskeino. @fi
definition: Relaciona un agent amb un nomen que és una apel·lació d’agent que consisteix en un codi, número o qualsevol altra cadena, normalment independent del llenguatge natural i de les convencions lingüístiques socials, usada per identificar un agent. @ca
definition: Relaterer en ressource til en tegnrække, der er entydigt knyttet til en agent eller til en erstatning for en agent, fx en autoritetsregistrering @da
definition: Relates an agent to a nomen that is an appellation of agent that consists of a code, number, or other string, usually independent of natural language and social naming conventions, used to identify an agent.
definition: Setzt einen Akteur in Beziehung zu einer Bezeichnung für einen Akteur, die aus einem Code, einer Nummer oder einer anderen Zeichenkette besteht, der/die normalerweise nicht in natürlicher Sprache und unabhängig von den sozialen Benennungskonventionen ist und zur Identifizierung eines Akteurs verwendet wird. @de
definition: يربط بين وكيل وتسمية لوكيل يتكون من رمز، رقم، أو سلسلة تمثيلات أخرى، عادة ما تكون مستقلة عن اللغة الطبيعية وعن التسميات المتعارف عليها اجتماعيًا، المستخدمة في تحديد هوية وكيل. @ar
definition: 将一个行为者与一个作为由代码、数字、或其他串构成、通常独立于自然语言和社会命名惯例、用以标识一个行为者的一个行为者称谓的命名关联起来。 @zh-hans

has other distinguishing characteristic of resource (Deprecated)
lexical alias: otherDistinguishingCharacteristicOfResource.en
status: Deprecated
type: Property
label: har andet særligt kendetegn ved ressourcen @da
definition: Relaterer en ressource til et kendetegn, bortset fra form af ressource, dato af ressource, sted af ressource, indholdstype, eller sprog, der tjener til at skelne én ressource fra en anden ressource med samme titel eller fra et navn på en anden agent. @da
definition: Relates a resource to a characteristic, other than form, date, or place of origin, that serves to differentiate a resource from another resource with the same preferred title of resource. (Deprecated)

has resource-specific carrier characteristic of early printed resource (Deprecated)
lexical alias: itemSpecificCarrierCharacteristicOfEarlyPrintedResource.en
status: Deprecated
type: Property
sub property of: has modification of resource
definition: Relates a resource to a characteristic that applies to the carrier or carriers of the specific early printed resource being described and is assumed not to apply to other resources exemplifying the same resource. includes rubrication, illumination, and other hand colouring, manuscript additions, and binding. (Deprecated)

has modification of resource
has subproperty: has resource-specific carrier characteristic of early printed resource (Deprecated)
lexical alias: modificationOfResource.en
status: Published
type: Property
label: forrás módosítása a következő: @hu
label: har note om ressourcespecifikke indholdskarakteristika @da
label: hat Variante einer Ressource @de
label: heeft aanpassing van resource @nl
label: kaynağın düzenlenmesi ile ilişkilidir @tr
label: muunnos aineistosta @fi
label: له تعديل لمصدر @ar
label: 有资源的修改 @zh-hans
definition: Bir kaynağı, bir kaynağa özgü olan ve aynı kaynağı örnekleyen diğer kaynaklara uygulanmadığı varsayılan bir düzenlemeyle ilişkilendirir. @tr
definition: Hozzákapcsol egy forrást egy forrásra jellemző módosításhoz, amely feltételezhetően nem vonatkozik más, ugyanazt a forrást példázó forrásokra. @hu
definition: Liittää aineiston sille ominaiseen muunnokseen, jonka ei oleteta sisältyvän muihin samaa aineistoa edustaviin aineistoihin. @fi
definition: Relaterer en ressource til en note om oplysninger om ekstra karakteristika, der er specifikke for en beskreven ressource og der antages ikke at være gyldige for andre ressourcer der eksemplificerere den samme ressource. @da
definition: Relates a resource to a modification that is specific to a resource and is assumed not to apply to other resources exemplifying the same resource.
definition: Setzt eine Ressource in Beziehung zu einer Variante, die spezifisch für eine Ressource ist und von der angenommen wird, dass sie nicht auf andere Ressourcen zutrifft, die dieselbe Ressource verkörpern. @de
definition: يربط بين مصدر وتعديل مخصص لمصدر ومن المفترض أنه لا ينطبق على المصادر الأخرى التي تمثل المصدر نفسه. @ar
definition: 将一种资源与作为一种资源特有并被认为不适用于例证同一资源之其他资源的一个修改关联起来。 @zh-hans

has preferred citation
lexical alias: preferredCitation.en
status: Published
type: Property
label: előnyben részesített hivatkozása a következő: @hu
label: ensisijainen viittausmuoto aineistolle @fi
label: har foretrukken referenceform @da
label: hat bevorzugte Zitierweise @de
label: heeft voorkeurscitatie @nl
label: tercih edilen atıf ile ilişkilidir @tr
label: له استشهاد مُفضل @ar
label: 有首选引文 @zh-hans
definition: Bir kaynağı, yaratıcısı, yayıncısı, sorumlusu, dizinleme veya özetleme hizmeti veya diğer temsilci tarafından tercih edilen biçimde bir kaynak için bir atıfla ilişkilendirir. @tr
definition: Hozzákapcsol egy forrást egy forrásra utaló hivatkozáshoz olyan formában, amelyet egy létrehozó, kiadó, gyűjteményvezető, indexelő vagy referáló szolgáltatás vagy egyéb ágens előnyben részesít. @hu
definition: Liittää aineiston viittausmuotoon, jonka teoksen tekijä, kustantaja, aineiston säilyttäjä, kuvailija, tiivistelmän tekijä tai muu toimija on valinnut aineistosta ensisijaisesti käytettäväksi. @fi
definition: Relaterer en ressource til en reference til en ressource i den form, der foretrækkes af et ophav, en udgiver, en forvalter eller virksomheder der udarbejder referater og abstracts etc. @da
definition: Relates a resource to a citation for a resource in the form preferred by a creator, publisher, custodian, indexing or abstracting service, or other agent.
definition: Setzt eine Ressource in Beziehung zu einer Zitierweise für eine Ressource, die von einer geistigen Schöpferin/einem geistigen Schöpfer, einem Verlag, einer Verwahrerin/einem Verwahrer, einem Indexierungs- oder Abstract-Service und so weiter bevorzugt wird. @de
definition: يربط بين مصدر واستشهاد لمصدر في الشكل المفضل للمنشئ، الناشر، الجهة المودعة، خدمة التكشيف والاستخلاص، أو وكيل آخر. @ar
definition: 将一种资源与以创作者、出版者、保管者、索引或文摘机构或其他行为者首选形式的一种资源的引文关联起来。 @zh-hans

has category of resource
lexical alias: categoryOfResource.en
status: Published
type: Property
label: aineiston kategoria @fi
label: forrás kategóriája a következő: @hu
label: har ressources art eller form @da
label: hat Kategorie einer Ressource @de
label: heeft categorie van resource @nl
label: kaynağın kategorisi ile ilişkilidir @tr
label: له فئة لمصدر @ar
label: 有资源的类别 @zh-hans
sub property of: has category of entity
alternative label: aineiston muoto @fi
alternative label: forrás formája a következő: @hu
alternative label: har form af ressource @da
alternative label: has form of resource
alternative label: hat Form einer Ressource @de
alternative label: kaynak biçimi ile ilişkilidir @tr
alternative label: له شكل لمصدر @ar
alternative label: 有资源的形式 @zh-hans
definition: Bir kaynağı, kaynağın ait olduğu bir türle ilişkilendirir. @tr
definition: Hozzákapcsol egy forrást ahhoz a típushoz, amelyhez a forrás tartozik. @hu
definition: Liittää aineiston aineistolajiin, johon aineisto kuuluu. @fi
definition: Relaterer en ressource til en art, form eller genre, som en ressource tilhører. @da
definition: Relates a resource to a type to which a resource belongs.
definition: Setzt eine Ressource in Beziehung zu einer Art, zu der eine Ressource gehört. @de
definition: يربط بين مصدر ونوع ينتمي إليه مصدر. @ar
definition: 将一种资源与一种资源所属于的一个类型关联起来。 @zh-hans

has regional encoding
lexical alias: regionalEncoding.en
status: Published
type: Property
label: aineiston aluekoodi @fi
label: bölgesel kodlama ile ilişkilidir @tr
label: har regional kodning @da
label: hat Regionalcode @de
label: heeft regiocodering @nl
label: regionális kódolása a következő: @hu
label: له كود منطقة @ar
label: 有地区编码 @zh-hans
sub property of: has digital file characteristic
definition: Bir kaynağı, bir video diskin veya video oyunu taşıyıcısının kodlandığı, dünyanın bir veya daha fazla bölgesi için bir atama ile ilişkilendirir; bu, oynatmanın kodu çözülecek şekilde yapılandırılmış bir aygıtla sınırlı olduğunu gösterir. @tr
definition: Hozzákapcsol egy forrást egy a világ egy vagy több régiójára vonatkozó jelöléshez, amelyre egy videólemezt vagy egy videójáték-hordozót kódoltak, jelezve hogy a visszajátszás annak dekódolására konfigurált készülékre korlátozódik. @hu
definition: Liittää aineiston yhteen tai useampaan nimettyyn alueeseen, joille video tai videopelitallenne on koodattu niin, että se on toistettavissa vain sen koodin avaamiseen konfiguroiduilla laitteilla. @fi
definition: Relaterer en ressource til en kode, der identificerer den region i verden, som en videodisc er kodet til, og som forhindrer, at videodiscen bliver spillet på en afspiller solgt i en anden region. @da
definition: Relates a resource to a designation for one or more regions of the world for which a videodisc or video game carrier is encoded, indicating that playback is restricted to a device configured to decode it.
definition: Setzt eine Ressource in Beziehung zu einer Bezeichnung, die die Region(en) der Welt angibt, für die eine Videodisk oder ein Videospiel-Datenträger kodiert ist, und der verhindert, dass die Disk von einem Wiedergabegerät, das in einer anderen Region verkauft wurde, abgespielt werden kann. @de
definition: يربط بين مصدر وتسمية لواحدة أو أكثر من مناطق العالم التي تم تشفير حامل الفيديو أو ألعاب الفيديو، يشير إلى أن عملية التشغيل مقصورة على الأجهزة المكودة بكود المنطقة فقط. @ar
definition: 将一种资源与视盘或视频游戏载体被编码后表示对设置解码回放的设备限制的世界上一个或多个地区的标识关联起来。 @zh-hans

has degree granting institution
lexical alias: degreeGrantingInstitution.en
status: Published
type: Property
label: har tildelende institution @da
label: hat grad-verleihende Institution @de
label: heeft graadverlenende instantie @nl
label: oppiarvon myöntävä instituutio @fi
label: tez onaylayan kurum ile ilişkilidir @tr
label: tudományos fokozatot adó intézménye a következő: @hu
label: له مؤسسة مانحة لدرجة @ar
label: 有学位授予机构 @zh-hans
sub property of: has other agent associated with resource (Deprecated)
inverse of: is degree granting institution of
definition: Bir kaynağı, akademik bir dereceyle ilişkili bir tez veya bitirme tezi olan bir kaynağı onaylayan bir temsilci ile ilişkilendirir. @tr
definition: Hozzákapcsol egy forrást egy ágenshez, aki jóváhagy egy forrást, amely egy tudományos fokozat elnyeréséért benyújtott szakdolgozat vagy disszertáció. @hu
definition: Liitää opinnäyte- tai väitöskirja-aineiston akateemisen oppiarvon myöntävään toimijaan. @fi
definition: Relaterer en ressource til en korporation der tildeler en akademisk grad. @da
definition: Relates a resource to an agent who approves a resource that is a thesis or dissertation associated with an academic degree.
definition: Setzt eine Ressource in Beziehung zu einem Akteur, der eine Hochschulschrift genehmigt, die mit einem akademischen Grad in Verbindung steht. @de
definition: يربط مصدر بوكيل يُصادق على مصدر هو أطروحة للحصول على درجة أكاديمية. @ar
definition: 将一种资源与批准和一个学位相关的一种学位论文的一个行为者关联起来。 @zh-hans

has host institution
lexical alias: hostInstitution.en
status: Published
type: Property
label: ev sahibi kurum ile ilişkilidir @tr
label: har værtsinstitution @da
label: hat gastgebende Institution @de
label: heeft hostorganisatie @nl
label: isäntäorganisaatio @fi
label: rendező intézménye a következő: @hu
label: له مؤسسة مُضِيفة @ar
label: 有承办机构 @zh-hans
sub property of: has other agent associated with resource (Deprecated)
inverse of: is host institution of
definition: Bir kaynağı, bir kaynağa yol açan bir konferansa, sergiye veya başka bir etkinliğe ev sahipliği yapan, ancak içerik için bir temsilcinin çok az sorumluluğu olan veya hiç sorumluluğu olmayan bir temsilci ile ilişkilendirir. @tr
definition: Hozzákapcsol egy forrást egy forrás létrejöttében szerepet játszó konferenciát, kiállítást vagy más eseményt rendező ágenshez, a tartalomért felelős ágens iránti felelőssége azonban nincs vagy csekély. @hu
definition: Liittää aineiston toimijaan, joka isännöi konferenssin, näyttelyn tai muun tapahtuman, mutta jonka sisällöstä toimijalla on vähän tai ei lainkaan vastuuta. @fi
definition: Relaterer en ressource til en korporation der afholder en event, udstilling, konference, etc., der fører til en ressource, som korporationen har ringe eller intet ansvar for indholdet af. @da
definition: Relates a resource to an agent who hosts a conference, exhibition, or other event that gives rise to a resource, but has little or no responsibility of an agent for the content.
definition: Setzt eine Ressource in Beziehung zu einem Akteur, der eine Konferenz, eine Ausstellung oder eine andere Veranstaltung ausrichtet, die eine Ressource zur Folge hat, der aber für den Inhalt wenig oder gar keine Verantwortung trägt. @de
definition: يربط مصدر بوكيل يستضيف مؤتمرًا، معرضًا، أو حدثًا آخر يؤدي إلى مصدر، ولكن لديه مسؤولية محدودة عن وكيل أو غير مسؤول مطلقًا عن المحتوى. @ar
definition: 将一种资源与承办产生一种资源的会议、展览或其他活动但对其内容没有或很少责任的一个行为者关联起来。 @zh-hans

has production company
lexical alias: productionCompany.en
status: Published
type: Property
label: aineiston tuotantoyhtiö @fi
label: har produktionsselskab @da
label: hat Produktionsfirma @de
label: heeft productiebedrijf @nl
label: produkciós cége a következő: @hu
label: yapım şirketi ile ilişkilidir @tr
label: له شركة إنتاج @ar
label: 有制作公司 @zh-hans
sub property of: has other agent associated with resource (Deprecated)
inverse of: is production company of
definition: Bir kaynağı, sahne, ekran, ses kaydı, televizyon, web yayını vb. için bir prodüksiyonun finansal, teknik ve organizasyonel yönlerini yönetmekten sorumlu olan bir temsilci ile ilişkilendirir. @tr
definition: Hozzákapcsol egy forrást egy ágenshez, amely felelős egy színpadi, film-, televíziós produkció, hangfelvétel, webes közvetítés, stb. pénzügyi, technikai és szervezeti vonatkozásának irányításáért. @hu
definition: Liittää teoksen toimijaan, joka on vastuussa näyttämö-, elokuva-, äänite-, televisio-, suoratoistolähetys- tms. tuotannon taloudellisesta, teknisestä ja organisatorisesta johtamisesta. @fi
definition: Relaterer en ressource til en korporation, der er ansvarlig for økonomisk, teknisk og organisatorisk ledelse af en produktion beregnet til scene, lærred, lydoptagelse, tv, webcast etc. @da
definition: Relates a resource to an agent who is responsible for managing the financial, technical, and organizational aspects of a production for stage, screen, sound recording, television, webcast, etc.
definition: Setzt eine Ressource in Beziehung zu einem Akteur, der für das finanzielle, technische und organisatorische Management einer Produktion für die Bühne, den Bildschirm, die Tonaufnahme, das Fernsehen, für einen Webcast und so weiter verantwortlich ist. @de
definition: يربط مصدر بوكيل مسؤول عن إدارة الجوانب المالية، التقنية، والتنظيمية في الإنتاج للمسرح، للسينما، للتسجيل الصوتي، للتليفزيون، للبث عبر الإنترنت، إلخ. @ar
definition: 将一种资源与负责舞台、播放、录音、网络直播等制作的资金、技术和组织方面管理的一个行为者关联起来。 @zh-hans

has country associated with agent
lexical alias: countryAssociatedWithAgent.en
status: Published
type: Property
label: az ágenshez kapcsolódó ország a következő: @hu
label: har land knyttet til agent @da
label: hat Land, das mit einem Akteur in Verbindung steht @de
label: heeft land geassocieerd met actor @nl
label: temsilciyle bağlantılı olan ülke ile ilişkilidir @tr
label: toimijaan liittyvä maa aineistossa @fi
label: له بلد مرتبط بوكيل @ar
label: 有和行为者有关的国家 @zh-hans
inverse of: is country associated with agent of
definition: Bir kaynağı, bir temsilcinin tanımlandığı bir ülkeyle ilişkilendirir. @tr
definition: Hozzákapcsol egy forrást egy országhoz, amellyel egy ágenst azonosítanak. @hu
definition: Liittää aineston maahan, johon toimija yhdistetään. @fi
definition: Relaciona un agent amb un lloc que és un país amb el qual un agent s’identifica. @ca
definition: Relaterer en ressource til et land som en agent forbindes med. @da
definition: Relates an agent to a place that is a country with which an agent is identified.
definition: Setzt eine Ressource in Beziehung zu einem Land, mit dem einem Akteur identifiziert wird. @de
definition: يربط بين مصدر وبلد يُستدل به على وكيل. @ar
definition: 将一个行为者与作为一个国家并被用来标识一个行为者的一个地点关联起来。 @zh-hans

has location of headquarters (Deprecated)
lexical alias: locationOfHeadquarters.en
status: Deprecated
type: Property
sub property of: has place associated with agent (Deprecated)
definition: Relates a resource to a country, state, province, etc., or local place in which an organization has its headquarters. (Deprecated)

has court governed
lexical alias: courtGoverned.en
status: Published
type: Property
label: Irányított bírósága a következő: @hu
label: har retsinstans underlagt @da
label: hat durch Verfahrensvorschriften geregeltes Gericht @de
label: heeft hof geregeerd @nl
label: mahkeme tarafından yönetilen ile ilişkilidir @tr
label: sääntöjen ohjaama tuomioistuin @fi
label: له محكمة خاضعة @ar
label: 有受管辖的法院 @zh-hans
sub property of: has other agent associated with resource (Deprecated)
inverse of: is court governed of
definition: Bir kaynağı, resmi niteliğine bakılmaksızın, mahkeme kuralları tarafından yönetilen bir mahkeme ile ilişkilendirir. @tr
definition: Hozzákapcsol egy forrást egy bírósági szabályzatok által irányított bírósághoz, függetlenül a forrás hivatalos természetétől. @hu
definition: Liittää aineiston sääntöjen ohjaamaan tuomioistuimeen riippumatta säännön virallisesta luonteesta. @fi
definition: Relaciona un recurs amb un agent que és un tribunal regit per regles de procediment, independentment de la seva naturalesa oficial. @ca
definition: Relaterer en ressource til en retsinstans, der er underlagt retsregler, uanset hvad deres officielle art er. @da
definition: Relates a resource to an agent that is a court governed by court rules, regardless of their official nature.
definition: Setzt eine Ressource in Beziehung zu einem Gericht, das durch gerichtliche Verfahrensvorschriften geregelt wird, unabhängig von deren förmlicher Rechtsnatur. @de
definition: يربط بين مصدر ومحكمة تخضع لقواعد محكمة، بغض النظر عن طبيعتها الرسمية. @ar
definition: 将一种资源与作为通过法院规则（不管其正式性质）受管辖的一个法院的一个行为者关联起来。 @zh-hans

has collector
lexical alias: collector.en
status: Published
type: Property
label: har samler @da
label: hat Sammlerin/Sammler @de
label: heeft verzamelaar @nl
label: kokoelman muodostaja @fi
label: koleksiyon oluşturucu ile ilişkilidir @tr
label: kollektora a következő: @hu
label: له جامع @ar
label: 有收藏者 @zh-hans
sub property of: has creator
inverse of: is collector of
definition: Bir kaynağı, diğer kaynaklar olan kaynakları seçerek ve düzenleyerek bir koleksiyon kaynağı oluşturmaktan sorumlu olan bir temsilci ile ilişkilendirir. @tr
definition: Hozzákapcsol egy forrást egy kurátorhoz, amely különböző forrásokból származó, gyűjteményként rendezett, leírt és katalogizált forrásokat fog össze. @hu
definition: Liittää aineiston toimijaan, joka vastaa uuden teoksen, kuten bibliografian tai hakemiston luomisesta valitsemalla, järjestämällä, koostamalla ja toimittamalla dataa, informaatiota tms. @fi
definition: Relaciona un recurs amb un agent que és responsable de la creació d’un recurs de col·lecció de recursos de recursos que són altres recursos mitjançant la selecció i arranjament. @ca
definition: Relaterer en ressource til en samler der sammenfører ressourcer fra forskellige kilder, som så bliver arrangeret, beskrevet og katalogiseret som en samling. @da
definition: Relates a resource to an agent who is responsible for creating a collection resource by selecting and arranging resources that are other resources.
definition: Setzt eine Ressource in Beziehung zu einer Kuratorin/einem Kurator, der Ressourcen aus unterschiedlichen Quellen zusammenträgt, die dann als Sammlung geordnet, beschrieben oder katalogisiert werden. @de
definition: يربط بين مصدر وأَمِين معرض يقوم بجمع مصادر من مصادر مختلفة رُتبت، وُوصفت، وفُهرست كمجموعة. @ar
definition: 将一种资源与通过选择和整理作为其他资源的资源而对创建一种收藏资源负责的一个行为者关联起来。 @zh-hans

has collection registrar
lexical alias: collectionRegistrar.en
status: Published
type: Property
label: gyűjtemény-nyilvántartója a következő: @hu
label: har samlingsregistrator @da
label: hat Registrarin/Registrar @de
label: heeft collectieregistrator @nl
label: kokoelman luetteloija @fi
label: koleksiyon kayıt görevlisi ile ilişkilidir @tr
label: له مسجل مجموعة @ar
label: 有收藏登记者 @zh-hans
sub property of: has compiler
inverse of: is collection registrar of
definition: Bir kaynağı, analitik rehber bilgisi oluşturmaktan sorumlu olan bir temsilci ile ilişkilendirir. @tr
definition: Hozzákapcsol egy forrást egy kurátorhoz, amely felsorol vagy leltárba vesz egy aggregáló forrásba, mint források gyűjteményébe. @hu
definition: Liittää aineiston toimijaan, jossa toimija vastaa metatietoteoksen luomisesta. @fi
definition: Relaciona un recurs amb un agent que és responsable de la creació d’un instrument de descripció analític. @ca
definition: Relaterer en ressource til en samler der lister eller opstiller ressourcerne i et samlingsRessource, som fx en samling af ressourcer. @da
definition: Relates a resource to an agent who is responsible for creating an analytic finding aid.
definition: Setzt eine Ressource in Beziehung zu einer Kuratorin/einem Kurator, die/der Ressourcen in einer aggregierten Ressource verzeichnet oder inventarisiert, wie zum Beispiel eine Sammlung von Ressourcen. @de
definition: يربط بين مصدر وأَمِين معرض يقوم بتسجيل مصادر أو جردها لمجموعة مجمعة من المصادر @ar
definition: 将一种资源与负责创建一种分析查询工具的一个行为者关联起来。 @zh-hans

has depositor
lexical alias: depositor.en
status: Published
type: Property
label: aineiston tallettaja @fi
label: har depositor @da
label: hat Leihgeberin/Leihgeber @de
label: heeft bruikleengever @nl
label: letétbe helyezője a következő: @hu
label: mevduatçı ile ilişkilidir @tr
label: له مُودِع @ar
label: 有托存者 @zh-hans
sub property of: has current owner
inverse of: is depositor of
definition: Bir kaynağı, kaynağın mevcut sahibi olan ve sahipliğini devretmeden kaynağı başka bir temsilcinin gözetimine bırakan bir temsilci ile ilişkilendirir. @tr
definition: Hozzákapcsol egy forrást egy ágenshez, amely a forrás jelenlegi tulajdonosa, és amely egy másik ágens megőrzésébe letétként helyezi el a forrást anélkül, hogy a tulajdonjogot átruházná. @hu
definition: Liittää aineiston toimijaan, joka on aineiston nykyinen omistaja ja luovuttanut aineiston toisen toimijan haltuun siirtämättä omistajuutta @fi
definition: Relaterer en ressource til en nuværende ejer af en ressource deponeret i forvaring hos en anden agent, men beholder det oprindelige ejerskab. @da
definition: Relates a resource to an agent who is a current owner of a resource who deposits the resource into the custody of another agent without transferring ownership.
definition: Setzt eine Ressource in Beziehung zu einer gegenwärtigen Eigentümerin/einem gegenwärtigen Eigentümer (Akteur) einer Ressource, die/der die Ressource in die Obhut eines anderen Akteurs gibt, ohne das Eigentumsrecht zu übertragen. @de
definition: يربط مصدر بوكيل هو المالك الحالي لمصدر قام بإيداع مصدر تحت وصاية وكيل آخر دون نقل ملكيتها. @ar
definition: 将一种资源与作为资源当前拥有者并将资源委托给另一个行为者保管但未转让所有权的一个行为者关联起来。 @zh-hans

has copyright date
lexical alias: copyrightDate.en
status: Published
type: Property
label: aineiston tekijänoikeusvuosi @fi
label: copyright időpontja a következő: @hu
label: har copyrightår @da
label: hat Copyright-Datum @de
label: heeft copyrightdatum @nl
label: telif hakkı tarihi ile ilişkilidir @tr
label: له تاريخ حقوق الطبع والنشر @ar
label: 有版权日期 @zh-hans
inverse of: is copyright date of
definition: Bir kaynağı, telif hakkı veya benzer bir sistem kapsamında koruma talebiyle bağlantılı bir zaman aralığıyla ilişkilendirir. @tr
definition: Hozzákapcsol egy forrást egy időtartamhoz, amely egy copyright vagy hasonló rendszer alatti védelmi igényhez kapcsolódik. @hu
definition: Liittää aineiston ajanjaksoon, joka liittyy copyright-säädösten tai vastaavien säädösten alaiseen copyright-suojaukseen. @fi
definition: Relaterer en ressource til et år knyttet til et krav om beskyttelse i henhold til ophavsret eller et lignende system. @da
definition: Relates a resource to a timespan associated with a claim of protection under copyright or a similar regime.
definition: Setzt eine Ressource in Beziehung zu einem Zeitraum, der mit einem Schutzanspruch nach dem Urheberrecht oder einem ähnlichen Regelwerk in Verbindung steht. @de
definition: يربط بين مصدر وفترة زمنية مرتبطة بفترة حماية حقوق الطبع والنشر أو أي نظام حماية آخر. @ar
definition: 将一种资源与和根据版权或类似管理制度的保护声明有关的一个时间段关联起来。 @zh-hans

has date of distribution
lexical alias: dateOfDistribution.en
status: Published
type: Property
label: aineiston jakeluaika @fi
label: dağıtım tarihi ile ilişkilidir @tr
label: har distributionsår @da
label: hat Vertriebsdatum @de
label: heeft datum van distributie @nl
label: terjesztés időpontja a következő: @hu
label: له تاريخ توزيع @ar
label: 有发行日期 @zh-hans
sub property of: has related timespan of resource
inverse of: is date of distribution of
definition: Bir kaynağı, yayınlanan bir kaynağın dağıtıldığı bir zaman aralığıyla ilişkilendirir. @tr
definition: Hozzákapcsol egy forrást egy időtartamhoz, amely alatt egy kiadott forrást terjesztenek. @hu
definition: Liittää aineiston julkaistun aineiston jakeluun liittyvään ajanjaksoon. @fi
definition: Relaterer en ressource til et år eller dato knyttet til distributionen af en ressource i publiceret form. @da
definition: Relates a resource to a timespan during which a published resource is distributed.
definition: Setzt eine Ressource in Beziehung zu einem Zeitraum, in dem eine veröffentlichte Ressource vertrieben wird. @de
definition: يربط بين مصدر وفترة زمنية يتم خلالها توزيع مصدر منشور. @ar
definition: 将一种资源与一种出版资源被发行的时间段关联起来。 @zh-hans

has date of production
lexical alias: dateOfProduction.en
status: Published
type: Property
label: aineiston tuotantoaika @fi
label: har produktionsår @da
label: heeft datum van productie @nl
label: ist Entstehungsdatum @de
label: létrehozás időpontja a következő: @hu
label: üretim tarihi ile ilişkilidir @tr
label: له تاريخ إنتاج @ar
label: 有制作日期 @zh-hans
sub property of: has related timespan of resource
inverse of: is date of production of
definition: Bir kaynağı, yayınlanmamış bir kaynağın tescil edildiği, imal edildiği, yapılandırıldığı veya başka bir şekilde üretildiği bir zaman aralığıyla ilişkilendirir. @tr
definition: Hozzákapcsol egy forrást egy időtartamhoz, amely alatt egy nem kiadatlan forrást írnak, készítenek, szerkesztenek vagy egyéb módon előállítanak. @hu
definition: Liittää aineiston julkaisemattoman aineiston kaivertamiseen, valmistamiseen, kokoamiseen tai muuhan tuottamiseen liittyvään ajanjaksoon. @fi
definition: Relaterer en ressource til et år eller dato knyttet til indgravering, fremstilling, konstruktion etc. af en ressource i upubliceret form. @da
definition: Relates a resource to a timespan during which an unpublished resource is inscribed, fabricated, constructed, or otherwise produced.
definition: Setzt eine Ressource in Beziehung zu einem Zeitraum, in dem eine unveröffentlichte Ressource beschriftet, erschaffen, konstruiert oder anderweitig produziert wird. @de
definition: يربط بين مصدر وفترة زمنية يتم خلالها تدوين مصدر غير منشور، أو تأليفه، أو تجميعه، أو إنتاجه بطريقة أخرى. @ar
definition: 将一种资源与一种非出版资源被镌刻、制造、构建或其他方式制作的时间段关联起来。 @zh-hans

has date of manufacture
lexical alias: dateOfManufacture.en
status: Published
type: Property
label: aineiston valmistusaika @fi
label: gyártás időpontja a következő: @hu
label: har fremstillingsår @da
label: heeft datum van vervaardiging @nl
label: imalat tarihi ile ilişkilidir @tr
label: ist Herstellungsdatum @de
label: له تاريخ تصنيع @ar
label: 有生产日期 @zh-hans
sub property of: has related timespan of resource
inverse of: is date of manufacture of
definition: Bir kaynağı, yayınlanan bir kaynağın basıldığı, çoğaltıldığı, yayınlandığı veya başka bir şekilde imal edildiği bir zaman aralığıyla ilişkilendirir. @tr
definition: Hozzákapcsol egy forrást egy időtartamhoz, amely alatt egy kiadott forrást nyomtattak, sokszorosítottak, öntöttek vagy egyéb módon gyártotak. @hu
definition: Liittää aineiston julkaistun aineiston painamiseen, monistamiseen, kirjasinten valamiseen tai muuhun valmistamiseen liittyvään ajanjaksoon. @fi
definition: Relaterer en ressource til et år eller dato knyttet til trykning, duplikering, støbning etc. af en ressource i publiceret form. @da
definition: Relates a resource to a timespan during which a published resource is printed, duplicated, cast, or otherwise manufactured.
definition: Setzt eine Ressource in Beziehung zu einem Zeitraum, in dem eine veröffentlichte Ressource gedruckt, vervielfältigt, gegossen oder anderweitig hergestellt wird. @de
definition: يربط بين مصدر وفترة زمنية يتم خلالها طباعة مصدر منشور، أو نسخه، أو صياغته، أو إنتاجه بطريقة أخرى. @ar
definition: 将一种资源与一种出版资源被印刷、复制、铸造或其他方式生产的一个时间段关联起来。 @zh-hans

has date of publication
lexical alias: dateOfPublication.en
status: Published
type: Property
label: aineiston julkaisuaika @fi
label: har udgivelsesår @da
label: hat Erscheinungsdatum @de
label: heeft datum van publicatie @nl
label: kiadás időpontja a következő: @hu
label: yayın tarihi ile ilişkilidir @tr
label: له تاريخ نشر @ar
label: 有出版日期 @zh-hans
sub property of: has related timespan of resource
inverse of: is date of publication of
definition: Bir kaynağı, yayınlanan bir kaynağın yayınlandığı, piyasaya sürüldüğü veya çıkarıldığı bir zaman aralığıyla ilişkilendirir. @tr
definition: Hozzákapcsol egy forrást egy időtartamhoz, amely alatt egy kiadott forrást kiadnak, kibocsájtanak vagy megjelentetnek. @hu
definition: Liittää aineiston aineiston kustantamiseen, julkaisemiseen tai ilmestymiseen liittyvään ajanajaksoon. @fi
definition: Relaterer en ressource til et år eller dato knyttet til publicering, offentliggørelse eller udgivelse af en ressource. @da
definition: Relates a resource to a timespan during which a published resource is published, released, or issued.
definition: Setzt eine Ressource in Beziehung zu einem Zeitraum, in dem eine veröffentlichte Ressource veröffentlicht, freigeschaltet oder herausgegeben wird. @de
definition: يربط بين مصدر وفترة زمنية يتم خلالها نشر مصدر منشور، أو إطلاقه، أو إصداره. @ar
definition: 将一种资源与一种出版资源被出版、发布、发行的时间段关联起来。 @zh-hans

has date of capture
lexical alias: dateOfCapture.en
status: Published
type: Property
label: aineiston tallennusajankohta @fi
label: felvétel időpontja a következő: @hu
label: har optagelsestidspunkt/indspilningstidspunkt @da
label: heeft datum van vastleggen @nl
label: ist Aufzeichnungsdatum @de
label: kayıt tarihi ile ilişkilidir @tr
label: له تاريخ التقاط @ar
label: 有摄录日期 @zh-hans
inverse of: is date of capture of
definition: Bir kaynağı, bir kaynağın içeriğinin kaydedilmesi, filme alınması vb. ile bağlantılı bir zaman aralığıyla ilişkilendirir. @tr
definition: Hozzákapcsol egy forrást egy időtartamhoz, amely egy forrás tartalmának rögzítéséhez, filmezéséhez, stb. kapcsolódik. @hu
definition: Liittää aineiston ajanjaksoon, joka liittyy aineiston sisällön äänitykseen, filmaukseen tms. @fi
definition: Relaterer en ressource til et år eller dato, der er knyttet til en indspilning, filmoptagelse, etc., af en ressources indhold. @da
definition: Relates a resource to a timespan associated with recording, filming, etc., the content of a resource.
definition: Setzt eine Ressource in Beziehung zu einem Zeitraum, der mit der Aufnahme, dem Filmen und so weiter des Inhalts einer Ressource in Verbindung steht. @de
definition: يربط بين مصدر وفترة زمنية مرتبطة بتسجيل، تصوير، الخ.، محتوى مصدر. @ar
definition: 将一种资源与和一种资源的内容的录制、摄制等有关的一个时间段关联起来。 @zh-hans

has date of usage
lexical alias: dateOfUsage.en
status: Published
type: Property
label: aineiston käyttöajankohta @fi
label: har anvendelsesperiode @da
label: használat időpontja a következő: @hu
label: hat Verwendungsdatum @de
label: heeft datum van gebruik @nl
label: kullanım tarihi ile ilişkilidir @tr
label: له تاريخ استخدام @ar
label: 有利用日期 @zh-hans
inverse of: is date of usage of
definition: Bir ismi, bir varlığın ünvanının kullanımıyla bağlantılı bir tarih veya tarih aralığıyla ilişkilendirir. @tr
definition: Hozzákapcsol egy noment egy dátumhoz vagy dátumtartományhoz, amely egy entitás megnevezésének a használatához kapcsolódik. @hu
definition: Relaciona un nomen amb un interval de temps que és una data o un rang de dates que s’associa amb l’ús d’un nomen. @ca
definition: Relaterer et navn til et år eller dato eller række af år eller datoer datoer knyttet til brugen af det navn, der er valgt som det foretrukne navn for en agent. @da
definition: Relates a nomen to a timespan that is a date or range of dates that is associated with the use of a nomen.
definition: Setzt ein Nomen in Beziehung zu einem Datum oder einem Datumsbereich, das/der mit der Verwendung von einer Bezeichnung für eine Entität in Verbindung steht. @de
definition: iittää nomenin ajanjaksoon, joka on entiteetin nimityksen käyttöön liittyvä ajankohta tai aikaväli. @fi
definition: يربط بين تسمية وتاريخ أو نطاق تواريخ مرتبطة باستخدام اسم كيان. @ar
definition: 将一个命名与作为和一个命名的使用有关的一个日期或者日期范围的一个时间段关联起来。 @zh-hans

has period of activity of agent
lexical alias: periodOfActivityOfAgent.en
status: Published
type: Property
label: har aktivitetsperiode for agent @da
label: hat Wirkungszeitraum eines Akteurs @de
label: heeft periode van activiteit van actor @nl
label: temsilcinin faaliyet dönemi ile ilişkilidir @tr
label: toimijan toiminta-aika @fi
label: ágens működési területe a következő: @hu
label: له فترة نشاط لوكيل @ar
label: 有行为者的活跃时期 @zh-hans
sub property of: has date associated with agent (Deprecated)
inverse of: is period of activity of agent of
definition: Bir temsilciyi, birincil çalışma alanında aktif olduğu bir dönemi gösteren bir tarih veya tarih aralığıyla ilişkilendirir. @tr
definition: Hozzákapcsol egy ágenst egy dátumhoz vagy dátumtartományhoz, amely arra az időszakra utal, amely alatt egy ágens aktív fő működési területén. @hu
definition: Liittää henkilön ajanjaksoon, jonka aikana henkilö on ollut aktiivinen ensisijaisella toiminta-alallaan. @fi
definition: Relaciona un agent amb un interval de temps durant el qual un agent és actiu en el seu camp pimari o esforç. @ca
definition: Relaterer en ressource til en periode, hvori en agent var aktiv i sit primære virkefelt. @da
definition: Relates an agent to a timespan during which an agent is active in their primary field of endeavor.
definition: Setzt einen Akteur in Beziehung zu einem Datum oder einer Reihen von Daten, die auf einen Zeitraum hinweisen, in dem ein Akteur in seinem primären Tätigkeitsfeld aktiv ist. @de
definition: يربط بين وكيلً وتاريخ أو نطاق تواريخ تُشير إلى فترة كان الوكيل نشطًا في مجال عمله الأساسي. @ar
definition: 将一个行为者与一个行为者在其主要努力领域中活跃的时间段关联起来。 @zh-hans

has parallel designation of named revision of edition
lexical alias: parallelDesignationOfNamedRevisionOfEdition.en
status: Published
type: Property
label: aineiston nimetyn uudistetun painoksen rinnakkainen määrite @fi
label: har parallel betegnelse for en navngivet revision af en udgave @da
label: hat parallele Ausgabebezeichnung einer näher erläuterten Überarbeitung @de
label: heeft parallelle aanduiding van benoemde herziening van editie @nl
label: kiadás nevesített átdolgozásának párhuzamos jelölése a következő: @hu
label: paralel adlandırılmış basım revizyonu tanımlayıcısı ile ilişkilidir @tr
label: له تسمية موازية لمراجعة مسماة لطبعة @ar
label: 有版本的命名修订的并列标识 @zh-hans
definition: Bir kaynağı, bir baskı öğesinin adlandırılmış bir gözden geçirmede kaydedilenden farklı bir dildeki veya alfabedeki bir baskının adlandırılmış bir gözden geçirmenin tanımıyla ilişkilendirir. @tr
definition: Hozzákapcsol egy forrást egy kiadás nevesített átdolgozásának jelöléséhez egy olyan nyelven vagy írásrendszerben, amely eltér a kiadás elemben jelölt nevesített átdolgozástól. @hu
definition: Nimetyn uudistetun painoksen määrite toisella kielellä ja/tai kirjoitusjärjestelmällä. @fi
definition: Relaciona un recurs amb una designació d’una revisió mencionada d’una edició en qualsevol altra llengua o escriptura. @ca
definition: Relaterer en ressource til en betegnelse for en navngivet revision af en udgave på et andet sprog og/eller i et andet alfabet end det som er anvendt ved angivelsen af den navngivne revision. @da
definition: Relates a resource to a designation of a named revision of an edition in another language or script.
definition: Setzt eine Ressource in Beziehung zu einer Ausgabebezeichnung einer näher erläuterten Überarbeitung in einer oder Schrift, die von der bereits erfassten Ausgabezeichnung einer näher erläuterten Überarbeitung abweicht. @de
definition: يربط بين مصدر وتسمية لمراجعة مسماة لطبعة بلغة أو نص مختلف عن تلك المُسجلة داخل تسمية مراجعة مسماه لعنصر طابعه. @ar
definition: 将一种资源与一个版本的命名修订的用另一种语言或文字的标识关联起来。 @zh-hans

has parallel designation of edition
lexical alias: parallelDesignationOfEdition.en
status: Published
type: Property
label: aineiston painoksen rinnakkainen määrite @fi
label: har parallel udgavebetegnelse @da
label: hat parallele Ausgabebezeichnung @de
label: heeft parallelle aanduiding van editie @nl
label: kiadás párhuzamos jelölése a következő: @hu
label: paralel basım tanımlayıcısı ile ilişkilidir @tr
label: له تسمية موازية لطبعة @ar
label: 有版本的并列标识 @zh-hans
definition: Bir kaynağı, bir baskı öğesinde kaydedilenden farklı bir dil veya alfabedeki bir baskı tanımıyla ilişkilendirir. @tr
definition: Hozzákapcsol egy forrást egy kiadás jelöléséhez egy olyan nyelven vagy írásrendszerben, amely eltér a kiadás elemben jelölttől. @hu
definition: Liittää aineiston painoksen määritteeseen toisella kielellä ja/tai kirjoitusjärjestelmällä. @fi
definition: Relaciona un recurs amb una designació d’edició mencionada d’una edició en qualsevol altra llengua o escriptura. @ca
definition: Relaterer en ressource til en betegnelse for en udgave på et andet sprog og/eller i et andet alfabet end det som er anvendt ved angivelsen af udgavebetegnelsen. @da
definition: Relates a resource to a designation of edition in another language or script.
definition: Setzt eine Ressource in Beziehung zu einer Ausgabebezeichnung in einer Sprache oder Schrift, die von der bereits erfassten Ausgabezeichnung abweicht. @de
definition: يربط بين مصدر وتسميه لطبعة بلغة أو نص مختلف عن تلك المُسجلة داخل تسمية لعنصر طابعه. @ar
definition: 将一种资源与用另一种语言或文字的一个版本标识关联起来。 @zh-hans

has number of conference
lexical alias: numberOfConference.en
status: Published
type: Property
label: har nummer på konference etc. @da
label: hat Zählung einer Konferenz @de
label: heeft nummer van conferentie @nl
label: konferans numarası hakkında not ile ilişkilidir @tr
label: konferencia sorszáma a következő: @hu
label: konferenssin numero aineistolle @fi
label: له رقم مؤتمر @ar
label: 有会议的届次 @zh-hans
definition: Bir kaynağı, bir dizi konferans vb. içindeki bir konferans vb. sıralamasının bir tanımıyla ilişkilendirir. @tr
definition: Hozzákapcsol egy forrást egy konferencia, stb. sorrendjének jelöléséhez, konferenciák, stb. sorozatán belül. @hu
definition: Liittää aineiston konferenssin, näyttelyn tai muun nimetyn ja kokontuneen tapahtuman järjestyslukuun. @fi
definition: Relaciona un agent amb una designació de la seqüència d’un congrés, una exposició o qualsevol altre esdeveniment formalment esmentat i convocat que dona origen a un recurs. @ca
definition: Relaterer en ressource til en sekvensbetegnelse etc. i en række af konferencer etc. @da
definition: Relates an agent to a designation of the sequencing of a conference, exhibition, or other formally named and convened event that gives rise to a resource.
definition: Setzt eine Ressource in Beziehung zu einer Bezeichnung für ein Zählfolge einer Konferenz und so weiter innerhalb einer Reihe von Konferenzen und so weiter. @de
definition: يربط بين مصدر وتحديد تتابع مؤتمر، إلخ.، ضمن سلسلة من المؤتمرات، إلخ. @ar
definition: 将一个行为者与产生作品的会议、展览或其他正式命名并举办的活动的序列的标识关联起来。 @zh-hans

has numbering of part
lexical alias: numberingOfPart.en
status: Published
type: Property
label: aineiston osan numerointi @fi
label: bölümün numaralandırılması ile ilişkilidir @tr
label: har nummerering af del @da
label: hat Zählung eines Teils @de
label: heeft nummering van deel @nl
label: részszámozása a következő: @hu
label: له ترقيم لجزء @ar
label: 有部分的编号 @zh-hans
definition: Bir kaynağı, bir bütün kaynak içindeki bir parça kaynağın sırasını belirtmek için kullanılan sayılar veya alfabetik karakterler ya da bir tarih veya başka bir zaman aralığı biçimindeki bir tanım ile ilişkilendirir. @tr
definition: Hozzákapcsol egy forrást egy szám vagy alfabetikus karakter, vagy dátum vagy egyéb időtartam formájában lévő jelöléshez, amely számozási rendszerként jelzi a teljes forráson belül a részek sorrendiségét. @hu
definition: Liittää aineiston numero- tai kirjainmuotoiseen määritteeseen tai ajankohtaan, jota käytetään määrittämään aineiston osan paikka aineiston kokonaisuudessa. @fi
definition: Relaciona un recurs amb una designació que s’assigna a un recurs per identificar la seva posició en una seqüència de parts individuals d’un recurs més gran. @ca
definition: Relaterer en ressource til en sekvensbetegnelse for en del eller flere dele i et større Ressource. @da
definition: Relates a resource to a designation that is assigned to a resource to identify its position in a sequence of individual parts of a larger resource.
definition: Setzt eine Ressource in Beziehung zu einer Bezeichnung in Form von Nummern oder Buchstaben oder zu einem Datum oder einem anderen Zeitraum, die/das/der verwendet wird, um die Abfolge eines Teils einer Ressource innerhalb der gesamten Ressource anzugeben. @de
definition: يربط بين مصدر وتسمية في شكل أرقام أو حروف هجائية، أو تاريخ أو أي فترة زمنية أخرى، مستخدمة لتشير إلى تسلسل جزء من مصدر ضمن مصدر كامل. @ar
definition: 将一种资源与被分配给一种资源以标识其在一种更大的资源的个别部分的序列中的位置的一个标识关联起来。 @zh-hans
scope note: A számozás állhat számokból, betűkből és bármely egyéb karakterből, vagy ezek kombinációjából, kísérő feliratból és/vagy kronológiai jelölésből vagy ezek nélkül. @hu
scope note: Darunter fallen Ziffern, Buchstaben, beliebige andere Zeichen oder Kombinationen davon (mit oder ohne begleitende Beschriftung) und/oder chronologische Bezeichnungen. @de
scope note: Numaralandırma bir rakamdan, bir harften, başka bir karakterden veya bunlara eşlik eden bir başlıkla veya başlıksız kombinasyonundan ve/veya kronolojik bir tanımlamadan oluşabilir. @tr
scope note: Numbering may consist of a numeral, a letter, any other character, or the combination of these with or without an accompanying caption, and/or a chronological designation.
scope note: Numerointi voi koostua numerosta, kirjaimesta, mistä tahansa muusta merkistä tai näiden yhdistelmästä. Siihen voi kuulua, mutta välttämättä ei kuulu, liittyvä seloste ai kronologinen tunniste. @fi
scope note: Nummerering af del kan omfatte et tal, et bogstav, ethvert andet tegn eller en kombination af disse med eller uden tilhørende tekst og/eller en kronologisk betegnelse @da
scope note: قد يتكون الترقيم من رقم، أو حرف، أو أي تمثيلات أخرى تُستخدم بشكل منفصل أو مُجمع، وقد يُصاحبها أو لا يُصاحبها تعليقًا، و/أو تسمية زمنية. @ar
scope note: 编号可以由数字、字母、任何其他字符、或其组合组成并且可以有或没有伴随的说明文字和/或年代标识 @zh-hans

has numbering within sequence
lexical alias: numberingWithinSequence.en
status: Published
type: Property
label: har nummerering indenfor serie @da
label: hat Zählung innerhalb einer Reihe @de
label: heeft nummering binnen volgorde @nl
label: sarjan sisäinen numerointi aineistolle @fi
label: sorozaton belüli számozása a következő: @hu
label: sıra içinde numaralandırma ile ilişkilidir @tr
label: له ترقيم ضمن تسلسل @ar
label: 有序列内的编号 @zh-hans
inverse of: is numbering within sequence of
definition: Bir kaynağı, bir serideki bir parçanın veya parçaların sıralanmasının belirlenmesiyle ilişkilendirir. @tr
definition: Hozzákapcsol egy forrást rész vagy részek sorozaton belüli számozásának jelöléséhez. @hu
definition: Liittää aineiston määritelmään, joka identifioi sen sijainnin sarjan osan tai osien jaksossa. @fi
definition: Relaciona un recurs amb un nomen que és una designació que s’assigna a un recurs per identificar la seva posició en una seqüència de parts individuals d’un recurs més gran o parts o números d’un recurs més gran. @ca
definition: Relaterer en ressource til en sekvensbetegnelse for en del eller flere dele i en serie. @da
definition: Relates a resource to a nomen that is a designation that is assigned to a resource to identify its position in a sequence of individual parts of a larger resource or parts or issues of a larger resource.
definition: Setzt eine Ressource in Beziehung zu einer Bezeichnung einer Sequenzierung eines Teils oder mehrerer Teile innerhalb einer Reihe. @de
definition: يربط بين مصدر وتسمية لتسلسل خاصة بجزء أو عدة أجزاء ضمن سلسلة. @ar
definition: 将一种资源与作为被分配给一种资源以标识其在一种更大的资源或者更大的资源的部分或期的个别部分的序列中的位置的一个标识的一个命名关联起来。 @zh-hans
scope note: A számozás jelenthet dátumokat vagy egyéb időtartamokat, és alfanumerikus vagy egyéb karaktereket is, továbbá kísérő feliratot. @hu
scope note: Darunter fallen Daten oder andere Zeiträume, alphanumerische oder andere Zeichen und ein Begleittext. @de
scope note: Numaralandırma, tarihleri ​​veya diğer zaman aralıklarını, alfasayısal veya diğer karakterleri veberaberindeki bir başlığı içerebilir. @tr
scope note: Numbering may include dates or other timespans, alphanumeric or other characters, and an accompanying caption.
scope note: Numerointi voi sisältää päivämääriä tai muita ajanjaksoja, aakkosnumeerisia tai muita merkkejä sekä selosteen. @fi
scope note: Nummerering omfatter et tal, et bogstav, ethvert andet tegn eller en kombination af disse med eller uden tilhørende tekst og/eller en kronologisk betegnelse. @da
scope note: قد يتضمن الترقيم تواريخ أو أي فترات زمنية أخرى، أو تمثيلات هجائية رقمية أو تمثيلات أخرى، ويتضمن أيضًا تعليق مصاحب. @ar
scope note: 编号可以包括日期或其他时间段、字母数字或其他字符、以及伴随的说明文字 @zh-hans

has numbering within subseries (Deprecated
lexical alias: numberingWithinSubseries.en
status: Deprecated
type: Property
label: har nummerering indenfor underserie @da
definition: Relaterer en ressource til en sekvensbetegnelse for en del eller flere dele i en underserie. @da
definition: Relates a resource to a designation of a sequencing of a part or parts within a subseries. (Deprecated)
scope note: Numbering may consist of a numeral, a letter, any other character, or the combination of these with or without an accompanying caption and/or a chronological designation. (Deprecated)
scope note: Nummerering omfatter et tal, et bogstav, ethvert andet tegn eller en kombination af disse med eller uden tilhørende tekst og/eller en kronologisk betegnelse. @da

has electronic reproduction
lexical alias: electronicReproduction.en
status: Published
type: Property
label: aineiston digitoitu jäljenne @fi
label: elektronik yeniden üretim ile ilişkilidir @tr
label: elektronikus másolata a következő: @hu
label: har elektronisk reproduktion @da
label: hat elektronische Reproduktion @de
label: heeft elektronische reproductie @nl
label: له إنتاج إلكتروني @ar
label: 有电子复制品 @zh-hans
sub property of: is reproduced as
inverse of: is electronic reproduction of
definition: Bir kaynağı, analog biçimdeki bir kaynağın aktarımının sonucu olan dijital biçimdeki bir kaynakla ilişkilendirir. @tr
definition: Hozzákapcsol egy forrást egy digitális formátumban lévő forráshoz, amely egy forrás analóg formátumból történő átviteléből ered. @hu
definition: Liittää aineiston digitaalisessa muodossa olevaan aineistoon, joka analogisen aineiston muunnoksen tulos. @fi
definition: Relaterer en ressource til en ressource i et digitalt format der er resultatet of en overførsel af en ressource i et analogt format. @da
definition: Relates a resource to a resource in a digital format that is a result of a transfer of a resource in an analog format.
definition: Setzt eine Ressource in Beziehung zu einer Ressource in einem digitalen Format, die ein Ergebnis einer Übertragung einer Ressource in ein analoges Format ist. @de
definition: يربط بين مصدر ومصدر في صيغة رقمية ناتج عن تحويله في شكل تناظري. @ar
definition: 将一种资源与从一种模拟格式的资源转储为一种数字格式而形成的资源关联起来。 @zh-hans

has film director
lexical alias: filmDirector.en
status: Published
type: Property
label: elokuvaohjaaja aineistossa @fi
label: film yönetmeni ile ilişkilidir @tr
label: filminstruktør @da
label: filmrendezője a következő: @hu
label: hat Filmregisseurin/Filmregisseur @de
label: heeft filmregisseur @nl
label: له مخرج فيلم @ar
label: 有电影导演 @zh-hans
sub property of: has director
inverse of: is film director of
definition: Bir kaynağı, filme alınmış bir performansın genel yönetimi ve denetiminden sorumlu bir yönetmen olan bir temsilci ile ilişkilendirir. @tr
definition: Hozzákapcsol egy forrást egy ágenshez, amely felelős egy filmre vett előadás általános menedzseléséért és felügyeletéért. @hu
definition: Liittää aineiston toimijaan, joka ohjaajana vastaa elokuvatun esityksen yleisestä johtamisesta ja valvonnasta. @fi
definition: Relaterer en ressource til en instruktør, der er ansvarlig for ledelse og tilsyn med en filmoptagelse. @da
definition: Relates a resource to an agent who is a director who is responsible for the general management and supervision of a filmed performance.
definition: Setzt eine Ressource in Beziehung zu einer Regisseurin/einem Regisseur, die/der für das allgemeine Management und die Leitung einer verfilmten Darbietung verantwortlich ist. @de
definition: يربط مصدر بوكيل يعمل بصفته مخرجًا مسؤولًا عن الإدارة العامة والإشراف على أداء الفيلم. @ar
definition: 将一种资源与作为一个导演并负责拍摄表演的总体管理和监督的一个行为者关联起来。 @zh-hans

has radio director
lexical alias: radioDirector.en
status: Published
type: Property
label: har radioinstruktør @da
label: hat Hörfunkregisseurin/Hörfunkregisseur @de
label: heeft radioregisseur @nl
label: radio-ohjaaja aineistossa @fi
label: radyo yönetmeni ile ilişkilidir @tr
label: rádiós rendezője a következő: @hu
label: له مخرج إذاعي @ar
label: 有广播导演 @zh-hans
sub property of: has director
inverse of: is radio director of
definition: Bir kaynağı, bir radyo programının genel yönetimi ve denetiminden sorumlu bir yönetmen olan bir temsilci ile ilişkilendirir. @tr
definition: Hozzákapcsol egy forrást egy ágenshez, amely felelős egy rádióműsor általános menedzseléséért és felügyeletéért. @hu
definition: Liittää aineiston toimijaan, joka ohjaajana vastaa radio-ohjelman yleisestä johtamisesta ja valvonnasta. @fi
definition: Relaterer en ressource til en instruktør, der er ansvarlig for ledelse af og tilsyn med et radioprogram. @da
definition: Relates a resource to an agent who is a director who is responsible for the general management and supervision of a radio program.
definition: Setzt eine Ressource in Beziehung zu einer Regisseurin/einem Regisseur (Akteur), die/der für das allgemeine Management und die Leitung einer Hörfunksendung verantwortlich ist. @de
definition: يربط مصدر بوكيل يعمل بصفته مخرجًا مسؤولًا عن الإدارة العامة والإشراف على برنامج إذاعي. @ar
definition: 将一种资源与作为一个导演并负责广播节目的总体管理和监督的一个行为者关联起来。 @zh-hans

has television director
lexical alias: televisionDirector.en
status: Published
type: Property
label: har tv-instruktør @da
label: hat Fernsehregisseurin/Fernsehregisseur @de
label: heeft televisieregisseur @nl
label: televisio-ohjaaja aineistossa @fi
label: televizyon yönetmeni ile ilişkilidir @tr
label: televíziós rendezője a következő: @hu
label: له مخرج تلفزيوني @ar
label: 有电视导演 @zh-hans
sub property of: has director
inverse of: is television director of
definition: Bir kaynağı, bir televizyon programının genel yönetimi ve denetiminden sorumlu bir yönetmen olan bir temsilci ile ilişkilendirir. @tr
definition: Hozzákapcsol egy forrást egy ágenshez, amely felelős egy televízióműsor általános menedzseléséért és felügyeletéért. @hu
definition: Liittää aineiston toimijaan, joka ohjaajana vastaa televisio-ohjelman yleisestä johtamisesta ja valvonnasta. @fi
definition: Relaterer en ressource til en instruktør, der er ansvarlig for ledelse af og tilsyn med et tv-program. @da
definition: Relates a resource to an agent who is a director who is responsible for the general management and supervision of a television program.
definition: Setzt eine Ressource in Beziehung zu einer Regisseurin/einem Regisseur, die/der für das allgemeine Management und die Leitung einer Fernsehsendung verantwortlich ist. @de
definition: يربط مصدر بوكيل يعمل بصفته مخرجًا مسؤولًا عن الإدارة العامة والإشراف على برنامج تليفزيوني. @ar
definition: 将一种资源与作为一个导演并负责电视节目的总体管理和监督的一个行为者关联起来。 @zh-hans

has parallel name of distributor
lexical alias: parallelNameOfDistributor.en
status: Published
type: Property
label: aineiston jakelijan rinnakkainen nimi @fi
label: har parallelt distributørnavn @da
label: hat parallelen Vertriebsnamen @de
label: heeft parallelle naam van distributeur @nl
label: paralel dağıtımcı adı ile ilişkilidir @tr
label: terjesztő párhuzamos neve a következő: @hu
label: له اسم موازي للموزع @ar
label: 有发行者的并列名称 @zh-hans
definition: Bir kaynağı, dağıtımcı öğesinin adında kaydedilenden farklı bir dildeki veya alfabedeki bir dağıtımcı adıyla ilişkilendirir. @tr
definition: Hozzákapcsol egy forrást egy terjesztő nevéhez egy olyan nyelven vagy írásrendszerben, amely eltér a terjesztő neve elemben jelölttől. @hu
definition: Liittää aineiston jakelijan nimeen, joka on jakelijan nimi toisella kielellä tai kirjoitusjärjestelmällä, ja joka eroaa jakelija-elementtiin tallennetusta nimestä. @fi
definition: Relaterer en ressource til et distributørnavn på et andet sprog og/eller i et andet alfabet end det som er anvendt ved angivelsen af distributørnavnet. @da
definition: Relates a resource to a name of distributor in a language or script that differs from that recorded in a name of distributor element.
definition: Setzt eine Ressource in Beziehung zu einem Vertriebsnamen in einer Sprache oder Schrift, die von dem bereits erfassten Vertriebsnamen abweicht. @de
definition: يربط بين مصدر واسم موزع بلغة أو نص مختلف عن تلك المُسجل بإسم عنصر موزع. @ar
definition: 将一种资源与用不同于记录在发行者名称元素中之语言或文字的发行者的名称关联起来。 @zh-hans

is dramatized as
lexical alias: dramatizedAs.en
status: Published
type: Property
label: dramatisoitu aineisto @fi
label: dramatizált feldolgozása a következőként: @hu
label: er dramatiseret som @da
label: is gedramatiseerd als @nl
label: ist Bühnenbearbeitung als @de
label: olarak dramatize edilmiştir @tr
label: هو معدل دراميًا كـ @ar
label: 被戏剧化为 @zh-hans
sub property of: is adapted as
inverse of: is dramatization of
definition: Bir kaynağı, başka bir kaynaktan uyarlanan dramatik bir kaynakla ilişkilendirir. @tr
definition: Hozzákapcsol egy forrást egy drámai forráshoz, amelyet egy másik forrásból adaptáltak. @hu
definition: Liittää aineiston toisesta aineistosta sovitettuun aineistoon. @fi
definition: Relaterer en ressource til en dramatisk ressource bearbejdet ud fra en oprindelig ressource. @da
definition: Relates a resource to a dramatic resource adapted from another resource.
definition: Setzt eine Ressource in Beziehung zu einer Theaterressource, die auf einer anderen Ressource basiert. @de
definition: يربط بين مصدر ومصدر درامي مقتبس من مصدر آخر. @ar
definition: 将一种资源与改编自另一种资源的一种戏剧资源关联起来。 @zh-hans

has field of activity of agent
lexical alias: fieldOfActivityOfAgent.en
status: Published
type: Property
label: har agents virkefelt @da
label: hat Betätigungsfeld eines Akteurs @de
label: heeft veld van activiteit van actor @nl
label: temsilcinin faaliyet alanı ile ilişkilidir @tr
label: toimijan toiminta-ala @fi
label: ágens tevékenységi köre a következő: @hu
label: له مجال نشاط لوكيل @ar
label: 有行为者的活动领域 @zh-hans
definition: Bir temsilciyi, bir temsilcinin dahil olduğu bir uğraş alanı, uzmanlık alanı, yeterlilik, sorumluluk, yetki alanı vb. ile ilişkilendirir. @tr
definition: Hozzákapcsol egy ágenst egy tevékenységhez, szakterülethez, illetékességi, felelősségi, joghatósági, stb. területhez, amely iránt az ágens elkötelezett. @hu
definition: Liittää toimijan toimijan pyrkimykseen, asiantuntemukseen, kompetenssiin, vastuuseen, toimivaltaan tms @fi
definition: Relaciona un agent amb un camp d’esforç, àrea de competència o responsabilitat en la qual un agent es compromet. @ca
definition: Relaterer en ressource til det område inden for hvilket en agent er eller var engageret. @da
definition: Relates an agent to a field of endeavor, area of competence, or responsibility in which an agent is engaged.
definition: Setzt einen Akteur in Beziehung zu einem Tätigkeitsfeld, einem Wissensgebiet, einem Kompetenzbereich, einer Verantwortlichkeitsangabe, einer Zuständigkeit und so weiter, in dem/der ein Akteur aktiv ist. @de
definition: يربط بين وكيل ومجال عمل، مجال خبرة، اختصاص، مسؤولية، سلطة إلخ.، الذي يمارسه الوكيل @ar
definition: 将一个行为者与一个行为者的努力领域、能力范围或担负责任关联起来。 @zh-hans

has award
lexical alias: award.en
status: Published
type: Property
label: har udmærkelse @da
label: hat Auszeichnung @de
label: heeft prijs @nl
label: kitüntetése a következő: @hu
label: palkinto aineistolle @fi
label: ödül ile ilişkilidir @tr
label: له منحة @ar
label: 有奖项 @zh-hans
definition: Bir kaynağı, bir kaynağın içeriği için bir ödül veya ödül veren kuruluş tarafından verilen mükemmelliğin veya diğer değerlerin resmi olarak tanınmasıyla ilişkilendirir. @tr
definition: Hozzákapcsol egy forrást a kiválóság vagy más érdem hivatalos elismeréséhez, amelyet egy kitüntetés- vagy díjosztó testület ad egy forrás tartalmáért. @hu
definition: Liittää aineiston tunnustuksen tai palkinnon myöntävän tahon antamaan laadukkuuden tai muiden ansioiden muodolliseen tunnustukseen aineiston sisällöstä. @fi
definition: Relaterer en ressource til en formel anerkendelse af fortræffelig kvalitet etc., givet af en pristildelende institution for indholdet af en ressource. @da
definition: Relates a resource to a formal recognition of excellence or other merit given by an award- or prize-granting body, for the content of a resource.
definition: Setzt eine Ressource in Beziehung zu einer formalen Anerkennung von herausragenden Fähigkeiten oder Leistungen, die durch eine auszeichnende oder Preis vergebende Körperschaft für den Inhalt einer Ressource verliehen wird. @de
definition: يربط بين مصدر وإقرار رسمي بإمتياز أو أي استحقاق آخر يُمنح بواسطة هيئة مانحة للمكافأت -الجوائز-، لمحتوى أحد المصادر. @ar
definition: 将一种资源与颁奖或奖金发放机构对资源的优秀性等给予的正式认可关联起来。 @zh-hans

has donor
lexical alias: donor.en
status: Published
type: Property
label: adományozója a következő: @hu
label: aineiston lahjoittaja @fi
label: bağışçı ile ilişkilidir @tr
label: har donor @da
label: hat Stifterin/Stifter @de
label: heeft schenker @nl
label: له متبرع @ar
label: 有捐赠者 @zh-hans
sub property of: has former owner
inverse of: is donor of
definition: Bir kaynağı, kaynağı başka bir sahibe bağışlamış olan kaynağın eski sahibiyle ilişkilendirir. @tr
definition: Hozzákapcsol egy forrást egy forrás korábbi tulajdonosához, amely a forrást egy másik tulajdonosnak adományozta. @hu
definition: Liittää aineiston aiempaan omistajaan, joka on lahjoittanut aineiston toiselle omistajalle. @fi
definition: Relaciona un recurs amb un agent que és un antic propietari d’un recurs que dona el recurs a un altre propietari. @ca
definition: Relaterer en ressource til en tidligere ejer af en ressource, der har doneret denne ressource til en anden ejer. @da
definition: Relates a resource to an agent who is a former owner of a resource who donates the resource to another owner.
definition: Setzt eine Ressource in Beziehung zu einer früheren Eigentümerin/einem früheren Eigentümer einer Ressource, die/der die Ressource einer anderen Eigentümerin/einem anderen Eigentümer überlässt. @de
definition: يربط بين مصدر ومالك سابق لمصدر قام بالتبرع بهذا المصدر إلى مالك آخر. @ar
definition: 将一种资源与作为先前拥有者将资源捐赠给另一个拥有者的一个行为者关联起来。 @zh-hans

has seller
lexical alias: seller.en
status: Published
type: Property
label: aineiston myyjä @fi
label: har sælger @da
label: hat Verkäuferin/Verkäufer @de
label: heeft verkoper @nl
label: satıcı ile ilişkilidir @tr
label: értékesítője a következő: @hu
label: له بائع @ar
label: 有出售者 @zh-hans
sub property of: has former owner
inverse of: is seller of
definition: Bir kaynağı, kaynağı başka bir sahibe satan kaynağın eski sahibiyle ilişkilendirir. @tr
definition: Hozzákapcsol egy forrást egy forrás korábbi tulajdonosához, amely a forrást egy másik tulajdonosnak értékesítette. @hu
definition: Liittää aineiston aiempaan omistajaan, joka on myynyt aineiston toiselle omistajalle. @fi
definition: Relaciona un recurs amb un agent que és un antic propietari d’un recurs que ven lítem a un altre propietari. @ca
definition: Relaterer en ressource til en tidligere ejer af en ressource, der har solgt denne ressource til en anden ejer. @da
definition: Relates a resource to an agent who is a former owner of a resource who sells the item to another owner.
definition: Setzt eine Ressource in Beziehung zu einer früheren Eigentümerin/einem früheren Eigentümer einer Ressource, die/der die Ressource einer anderen Eigentümerin/einem anderen Eigentümer verkauft hat. @de
definition: يربط بين مصدر ومالك سابق لمصدر قام ببيع هذا المصدر إلى مالك آخر. @ar
definition: 将一种资源与作为先前拥有者将资源出售给另一个拥有者的一个行为者关联起来。 @zh-hans

has file type
lexical alias: fileType.en
status: Published
type: Property
label: aineiston tiedostotyyppi @fi
label: dosya türü ile ilişkilidir @tr
label: fájltípusa a következő: @hu
label: har filtype @da
label: hat Dateityp @de
label: heeft bestandstype @nl
label: له نوع الملف @ar
label: 有文件类型 @zh-hans
sub property of: has digital file characteristic
definition: Bir kaynağı, bir bilgisayar dosyasında kodlanmış genel bir veri içeriği türüyle ilişkilendirir. @tr
definition: Hozzákapcsol egy forrást egy számítógépes fájlban kódolt adattartalom általános típusához. @hu
definition: Liittää aineiston tiedostoon koodatun datasisällön yleiseen tyyppiin @fi
definition: Relaterer en ressource til en betegnelse for type af dataindhold, der er kodet i en computerfil. @da
definition: Relates a resource to a general type of data content encoded in a computer file.
definition: Setzt eine Ressource in Beziehung zu den Details zu einer allgemeinen Art von Dateninhalt, der in einer Datei kodiert ist. @de
definition: يربط بين مصدر ونوع عام لمحتوى بيانات تم تشفيرها في ملف كمبيوتر. @ar
definition: 将一种资源与计算机文件中编码的数据内容的一般类型关联起来。 @zh-hans

has affiliation (Deprecated)
lexical alias: affiliation.en
status: Deprecated
type: Property
label: har tilhørsforhold @da
definition: Relaterer en ressource til en gruppe, som en agent er eller har været tilknyttet via beskæftigelse, medlemskab, kulturel identitet etc. @da
definition: Relates a resource to a group with which an agent is affiliated or is affiliated through employment, membership, cultural identity, etc. (Deprecation)

has enacting government
lexical alias: enactingGovernment.en
status: Published
type: Property
label: Normerlassende Gebietskörperschaft @de
label: har vedtagende jurisdiktion @da
label: heeft vaststellende jurisdictie @nl
label: säätävä hallintoelin @fi
label: té govern promulgador @ca
label: törvényalkotási joghatósága a következő: @hu
label: yasa çıkaran hükümet ile ilişkilidir @tr
label: له سلطة سن القوانين @ar
label: 有颁布政府 @zh-hans
sub property of: has creator
inverse of: is enacting government of
definition: Bir kaynağı yasa, yönetmelik, anayasa, mahkeme kararı veya diğer mevzuat olan bir kaynağı yürürlüğe koyan bir hükümet olan bir temsilci ile ilişkilendirir. @tr
definition: Hozzákapcsol egy forrást egy igazgatási szerv ágenshez, amely kiad egy forrást, ami egy törvény, rendelet, alkotmány, törvényszéki szabályzat vagy egyéb jogszabály. @hu
definition: Liittää aineiston lainsäädännöllistä aineistoa kuten lakeja, perustuslakia, tuomioistuimen sääntöjä tai muuta lainsäädäntöä säätävään hallinnolliseen toimijaan. @fi
definition: Relaciona un recurs amb un agent que és un govern que promulga un recurs que és una llei, un reglament, una constitució, una regla de funcionament d’un tribunal o qualsevol altra legislació. @ca
definition: Relaterer en ressource til en jurisdiktion, der har vedtaget en lov, forordning, forfatning, retsplejeregel etc. @da
definition: Relates a resource to an agent who is a government enacting a resource that is a law, regulation, constitution, court rule, or other legislation.
definition: Setzt eine Ressource in Beziehung zu einer Regierung, die eine Ressource erlässt, bei dem es sich um ein Gesetz, eine Verordnung, eine Verfassung, eine Rechtsverordnung oder eine andere Gesetzgebung handelt. @de
definition: يربط مصدر بوكيل يُمثل حكومة تسن مصدرًا هو قانون، أو لائحة، أو دستور، أو حكم قضائي، أو تشريع آخر. @ar
definition: 将一种资源与作为一个政府颁布作为法律、法规、宪法、法院规则或其他立法的一种资源的一个行为者关联起来。 @zh-hans

has place governed
lexical alias: placeGoverned.en
status: Published
type: Property
label: har jurisdiktion underlagt @da
label: hat geregelte Gebietskörperschaft @de
label: heeft geregeerde jurisdictie @nl
label: joghatósága a következő: @hu
label: säätävä hallintoelin @fi
label: té com a lloc regit @ca
label: yönetilen yargı alanı ile ilişkilidir @tr
label: له اختصاص قضائي @ar
label: 有所管理的辖区 @zh-hans
sub property of: has related place of agent
inverse of: is place governed by
alternative label: has jurisdiction governed
alternative label: té jurisdicció regida @ca
definition: Hozzákapcsol egy joghatóság helyet egy igazgatási szerv ágenshez, amely egy másik igazgatási szerv által hozott törvény, rendelet stb. hatálya alá tartozik. @hu
definition: Liittää paikan julkishallinnolliseen toimijaan, jota toisen julkishallinnollisen yhteisön säätämät lait, asetukset tms. ohjaavat. @fi
definition: Relaciona un agent amb un lloc que és regit per un agent que és un govern. @ca
definition: Relaterer en ressource til en jurisdiktion, der har vedtaget en lov, forordning, forfatning, retsplejeregel etc. @da
definition: Relates an agent to a place that is governed by an agent who is a government.
definition: Setzt eine Gebietskörperschaft in Beziehung zu einem Akteur, bei dem es sich um die Regierung einer Gebietskörperschaft handelt, die durch ein Gesetz, eine Verordnung und so weiter geregelt wird, das/die von einer anderen Regierung erlassen wurde. @de
definition: Yargı yetkisi olan bir yeri, başka bir hükümet tarafından çıkarılan bir yasa, yönetmelik vb. ile yönetilen bir yargı yetkisinin hükümeti olan bir temsilci ile ilişkilendirir. @tr
definition: يربط مكانًا يُمثل ولاية قضائية لوكيل يُمثل حكومة تخضع لسُلطة نطاق جغرافي يحكمه قانون أو لائحة تنظيمية، إلخ.، سنتها حكومة أخرى. @ar
definition: 将一个行为者与作为根据另一个政府所颁布的法律、法规等管理的一个辖区的一个地点关联起来。 @zh-hans

has language of agent
lexical alias: languageOfAgent.en
status: Published
type: Property
label: har agents sprog @da
label: hat Sprache eines Akteurs @de
label: heeft taal van actor @nl
label: temsilcinin dili ile ilişkilidir @tr
label: toimijan käyttämä kieli @fi
label: ágens nyelve a következő: @hu
label: له لغة لوكيل @ar
label: 有行为者的语言 @zh-hans
definition: Bir kaynağı, bir temsilcinin iletişimlerinde, yayın için yazarken, yayın yaparken vb. kullandığı bir dille ilişkilendirir. @tr
definition: Hozzákapcsol egy forrást egy ágens kiadás, műsorszórás közbeni kommunikációja során használt nyelvhez. @hu
definition: Liittää aineiston kieleen, jota toimija käyttää viestinnässään kirjallisissa julkaisuissa, radiolähetyksessä yms. @fi
definition: Relaciona un agent amb una llengua que es usada per un agent en les seves comunicacions. @ca
definition: Relaterer en ressource til et sprog en agent anvender til at skrive til publicering, udsendelse etc. @da
definition: Relates an agent to a language that is used by an agent in its communications.
definition: Setzt eine Ressource in Beziehung zu einer Sprache, die ein Akteur bei seiner Kommunikation verwendet, wenn er für eine Veröffentlichung, einen Hörfunkbeitrag und so weiter schreibt. @de
definition: يربط بين مصدر ولغة يستخدمها وكيل في اتصالاته، عند الكتابة للنشر، للبث الإذاعي، إلخ. @ar
definition: 将一个行为者与一个行为者在交流中所用的语言关联起来。 @zh-hans

has language of resource
lexical alias: languageOfResource.en
status: Published
type: Property
label: aineiston kieli @fi
label: forrás nyelve a következő: @hu
label: har indholdets sprog @da
label: hat Sprache einer Ressource @de
label: heeft taal van resource @nl
label: kaynağın dili ile ilişkilidir @tr
label: له لغة لمصدر @ar
label: 有资源的语言 @zh-hans
definition: Bir kaynağı, bir kaynağın içeriği için kullanılan bir dille ilişkilendirir. @tr
definition: Hozzákapcsol egy forrást egy nyelvhez, amelyet a forrás tartalmához használnak. @hu
definition: Liittää aineiston aineiston sisällössä käytettyyn kieleen. @fi
definition: Relaterer en ressource til et sprog, der anvendes til at udtrykke en ressources indhold. @da
definition: Relates a resource to a language used for the content of a resource.
definition: Setzt eine Ressource in Beziehung zu einer Sprache, die für den Inhalt einer Ressource verwendet wird. @de
definition: يربط بين مصدر ولغة مُستخدمة لمحتوى مصدر. @ar
definition: 将一种资源与一种资源的内容所用的语言关联起来。 @zh-hans

is facsimile part of
lexical alias: facsimilePartOf.en
status: Published
type: Property
label: er faksimile indeholdt i @da
label: hasonmásrésze a következőnek: @hu
label: is facsimile deel van @nl
label: ist Faksimile als Teil von @de
label: näköispainos sisältyy aineistoon @fi
label: tıpkıbasım bileşenidir @tr
label: هو جزء طبق الأصل لـ @ar
label: 是……的摹真品部分 @zh-hans
sub property of: is part of resource
inverse of: has facsimile part
definition: Bir kaynağı; bir parçanın, içeriğinde kaynak bulunan ilgili bir kaynağı birebir yeniden üreten ayrık bileşen olduğu daha büyük bir kaynak ile ilişkilendirir. @tr
definition: Hozzákapcsol egy forrást egy nagyobb forráshoz, amelynek része egy olyan elkülöníthető alkotóelem, amely pontos másolata a forrásban megtestesülő kapcsolódó forrásnak. @hu
definition: Liittää aineiston laajempaan aineistoon, jonka osana on erillinen, liittyvän aineiston tarkasti kopioiva aineisto. @fi
definition: Relaterer en ressource til en større ressource, hvoraf en del udgør en separat del, der er en nøjagtig reproduktion af en anden ressource, der omfatter den samme ressource. @da
definition: Relates a resource to a larger resource of which a part is a discrete component that exactly reproduces a related resource embodying a resource.
definition: Setzt eine Ressource in Beziehung zu einer größeren Ressource, von der ein Teil ein einzelnen Bestandteil ist, der eine in Beziehung stehende Ressource, die eine Ressource verkörpert, exakt reproduziert. @de
definition: يربط بين مصدر ومصدر أكبر بحيث يُشكل جزء منه عنصرًا منفصلًا يقوم باستنساخ مصدر يجسد المصادر ذات الصلة بشكل حرفي. @ar
definition: 将一种资源与有独立组成部分精确复制具体化一种资源的一种关联资源的一种更大的资源关联起来。 @zh-hans

is part of resource
has subproperty: is facsimile part of
has subproperty: is subseries of
has subproperty: is issue of
has subproperty: is inserted in
has subproperty: is special issue of
has subproperty: is subcollection of
lexical alias: partOfResource.en
status: Published
type: Property
label: aineiston osa @fi
label: er indeholdt i @da
label: is deel van resource @nl
label: ist Teil von Ressource @de
label: kaynağın bir bileşenidir @tr
label: része a következő forrásnak: @hu
label: هو جزء من المصدر @ar
label: 是资源的部分 @zh-hans
sub property of: has whole-part resource relationship with (Deprecated)
inverse of: has part resource
alternative label: a következő forrás tartalmazza: @hu
alternative label: er indholdt i ressource @da
alternative label: is contained in resource
alternative label: ist enthalten in (Ressource) @de
alternative label: kaynağın bileşenidir @tr
alternative label: sisältyy aineistoon @fi
alternative label: هو متضمن في مصدر @ar
alternative label: 被包含在资源中 @zh-hans
definition: .Liittää aineiston aineistoon, johon itsenäisenä osana sisältyy toinen aineisto @fi
definition: Bir kaynağı, ayrık olarak başka kaynak içeren bir kaynak ile ilişkilendirir. @tr
definition: Hozzákapcsol egy forrást egy forráshoz, amelynek elkülöníthető alkotóelemként része egy másik forrás. @hu
definition: Relaterer en ressource til en større ressource, som ressourcen udgør en separat del af. @da
definition: Relates a resource to a resource that has another resource as a discrete component.
definition: Setzt eine Ressource in Beziehung zu einer Ressource, die eine andere Ressource als einzelnen Bestandteil enthält. @de
definition: يربط بين مصدر ومصدر له مصدر آخر كعنصر منفصل. @ar
definition: 将一种资源与有另一种资源作为独立组成部分的一种资源关联起来。 @zh-hans

has sequel
lexical alias: sequel.en
status: Published
type: Property
label: aineiston jatko-osa @fi
label: er efterfølger @da
label: folytatása a következő: @hu
label: hat Sequel @de
label: heeft sequel @nl
label: sonraki ile ilişkilidir @tr
label: له تَتِمّة @ar
label: 有续篇 @zh-hans
sub property of: is succeeded by
inverse of: is sequel to (Deprecated)
alternative label: aineiston esiosa @fi
alternative label: előzménye a következőnek: @hu
alternative label: er forløber til @da
alternative label: is prequel to
alternative label: ist Prequel zu @de
alternative label: öncesidir @tr
alternative label: له بادئه لـ @ar
alternative label: 是……的前篇 @zh-hans
definition: Bir kaynağı, başka kaynağın anlatımını zaman içinde ileri yönde genişleten bir kaynakla ilişkilendirir. @tr
definition: Hozzákapcsol egy forrást egy forráshoz, amely időben előre terjeszti ki egy másik forrás narratíváját. @hu
definition: Liitää aineiston aineistoon, joka laajentaa toisen aineiston kerrontaa ajassa eteenpäin. @fi
definition: Relaterer en ressource til en senere ressource, der fortsætter en tidligere ressources fortælling. @da
definition: Relates a resource to a resource that extends the narrative of another resource forwards in time.
definition: Setzt eine Ressource in Beziehung zu einer Ressource, die den Erzählstrang einer anderen Ressource zeitlich vorwärts erweitert. @de
definition: يربط بين مصدر ومصدر يوسع السرد لمصدر آخر يسبقه زمنيًا. @ar
definition: 将一种资源与把另一种资源的叙述在时间上往前延伸的一种资源 @zh-hans

is replaced in part by
lexical alias: replacedInPartBy.en
status: Published
type: Property
label: er delvis erstattet af @da
label: ile kısmen değiştirilmiştir @tr
label: is gedeeltelijk vervangen door @nl
label: ist teilweise ersetzt durch @de
label: osittain korvattu aineistolla @fi
label: részben helyettesíti a következő: @hu
label: هو مستبدَل جزئيًا @ar
label: 被……部分替代 @zh-hans
sub property of: is succeeded by
inverse of: is replacement in part of
definition: Bir kaynağı, içeriği kısmen başka bir kaynağın içeriğinin değiştiren ve onu geçersiz kılan bir kaynak ile ilişkilendirir. @tr
definition: Hozzákapcsol egy forrást egy forráshoz, amelynek tartalma részben túlhaladja és elavulttá teszi egy másik forrás tartalmát. @hu
definition: Liittää aineiston aineistoon, jonka sisältö osittain korvaa ja tekee vanhentuneeksi toisen aineiston. @fi
definition: Relaterer en ressource til en senere ressource, der er delvist anvendt i stedet for et tidligere udtryk, normalt fordi den senere ressource indeholder opdateret eller ny information, der betyder, at den tidligere ressource er forældet. @da
definition: Relates a resource to a resource whose content partially supersedes and renders obsolete the content of another resource.
definition: Setzt eine Ressource in Beziehung zu einer Ressource, dessen Inhalt den Inhalt einer anderen Ressource teilweise ersetzt und obsolet macht. @de
definition: يربط بين مصدر ومصدر يحل محتواه جزئيا محل مصدر آخر ويجعل محتواه متقادمًا. @ar
definition: 将一种资源与其内容部分地替代并废止另一种资源之内容的一种资源关联起来。 @zh-hans
scope note: Bu ilişki genel olarak tek parçalı birimler, çok parçalı monograflar ve birleştirici kaynaklar için geçerlidir. @tr
scope note: Denne relation anvendes generelt til enkeltstående monografier, flerbindsværker og integrerende ressourcer. @da
scope note: Diese Beziehung gilt allgemein für einteilige Einheiten, mehrteilige Monographien und integrierende Ressourcen. @de
scope note: Ez a kapcsolat általában egyrészes egységekre, többrészes monográfiákra és integráló forrásokra alkalmazható. @hu
scope note: Koskee yleensä yksiosaisia yksiköitä, moniosaisia monografioita ja päivittyviä aineistoja. @fi
scope note: This relationship applies generally to single-part units, multipart monographs, and integrating resources.
scope note: تنطبق هذه العلاقة بشكل عام على وحدات من جزء واحد، مونوجرافيا متعددة الأجزاء، ومصادر متكاملة. @ar
scope note: 这个关系一般适用于单部分单元、多部分单行出版物和集成性资源。 @zh-hans

is replaced by
lexical alias: replacedBy.en
status: Published
type: Property
label: er erstattet af @da
label: helyettesíti a következő: @hu
label: ile değiştirilmiştir @tr
label: is vervangen door @nl
label: ist ersetzt durch @de
label: korvattu aineistolla @fi
label: هو مستبدَل بـ @ar
label: 被……替代 @zh-hans
sub property of: is succeeded by
inverse of: is replacement of
definition: Bir kaynağı, içeriği başka kaynağın içeriğinin değiştiren ve onu geçersiz kılan bir kaynak ile ilişkilendirir. @tr
definition: Hozzákapcsol egy forrást egy forráshoz, amelynek tartalma túlhaladja és elavulttá teszi egy másik forrás tartalmát. @hu
definition: Liittää aineiston aineistoon, jonka sisältö korvaa ja tekee vanhentuneeksi toisen aineiston. @fi
definition: Relaterer en ressource til en senere ressource, der er anvendt delvist i stedet for en tidligere ressource, normalt fordi den senere ressource indeholder opdateret eller ny information, der betyder, at den tidligere ressource er forældet. @da
definition: Relates a resource to a resource whose content supersedes and renders obsolete the content of another resource.
definition: Setzt eine Ressource in Beziehung zu einer Ressource, deren Inhalt den Inhalt einer anderen Ressource ersetzt und obsolet macht. @de
definition: يربط بين مصدر ومصدر يحل محتواه محل محتوى مصدر آخر ويجعله متقادمًا. @ar
definition: 将一种资源与其内容替代并废止另一种资源之内容的一种资源关联起来。 @zh-hans
scope note: Bu ilişki genel olarak tek parçalı birimler, çok parçalı monograflar ve birleştirici kaynaklar için geçerlidir. @tr
scope note: Den her relation bruges generelt til enkeltstående monografier, flerbindsværker og integrerende ressourcer. @da
scope note: Diese Beziehung gilt allgemein für einteilige Einheiten, mehrteilige Monographien und integrierende Ressourcen. @de
scope note: Ez a kapcsolat általában egyrészes egységekre, többrészes monográfiákra és integráló forrásokra alkalmazható. @hu
scope note: Koskee yleensä yksiosaisia yksiköitä, moniosaisia monografioita ja päivittyviä aineistoja. @fi
scope note: This relationship applies generally to single-part units, multipart monographs, and integrating resources.
scope note: تنطبق هذه العلاقة بشكل عام على وحدات من جزء واحد، مونوجرافيا متعددة الأجزاء، ومصادر متكاملة. @ar
scope note: 这个关系一般适用于单部分单元、多部分单行出版物和集成性资源。 @zh-hans

has artistic or technical credit (Deprecated)
lexical alias: artisticAndOrTechnicalCredit.en
status: Deprecated
type: Property
definition: Relates a resource to a listing of agents, families, or corporate bodies making contributions to the artistic and/or technical production of a resource. (Deprecated)

is adapted in verse as
lexical alias: adaptedInVerseAs.en
status: Published
type: Property
label: aineiston runomukaelma @fi
label: bearbejdet i versform som @da
label: is bewerkt in versvorm als @nl
label: ist bearbeitet als Gedicht @de
label: manzum olarak uyaralnmıştır @tr
label: verses feldolgozása a következőként: @hu
label: هو مقتبَس شعريًا كـ @ar
label: 被改编成韵文作为 @zh-hans
sub property of: is adapted as
inverse of: is verse adaptation of
definition: Bir kaynağı, başka kaynaktan uyarlanan manzum biçimdeki bir edebi kompozisyon ile ilişkilendirir. @tr
definition: Hozzákapcsol egy forrást egy másik forrásból adaptált verses formájú irodalmi alkotáshoz. @hu
definition: Liittää aineiston runomuodossa olevaan aineistoon, joka on sovitettu toisesta aineistosta. @fi
definition: Relaterer en ressource til en litterær komposition i versform, bearbejdet ud fra en oprindelig ressource. @da
definition: Relates a resource to a literary composition in verse form adapted from another resource.
definition: Setzt eine Ressource in Beziehung zu einer literarischen Dichtung in Versform, die auf einer anderen Ressource basiert. @de
definition: يربط بين مصدر وتركيب أدبي في شكل شعر مُقتبس من مصدر آخر. @ar
definition: 将一种资源与被改编自另一种资源的一种文学韵文写作关联起来。 @zh-hans

has place of conference
lexical alias: placeOfConference.en
status: Published
type: Property
label: har sted for konference etc. @da
label: hat Ort einer Konferenz @de
label: heeft plaats van conferentie @nl
label: konferans yeri ile ilişkilidir @tr
label: konferenciahelyszíne a következő: @hu
label: konferenssin paikka @fi
label: له مكان مؤتمر @ar
label: 有会议的地点 @zh-hans
sub property of: has related place of agent
inverse of: is place of conference of
definition: Bir kaynağı, konferans, kongre, toplantı, sergi, fuar, festival vb. düzenlenen yerel bir konum ile ilişkilendirir. @tr
definition: Hozzákapcsol egy forrást egy lokális helyhez, ahol konferenciát, kongresszust, találkozót, kiállítást, vásárt, fesztivált, stb. tartanak. @hu
definition: Liittää aineiston paikkaan, jossa konferenssi, kongressi, kokous, nättely, messut, festivaalit yms. järjestettiin. @fi
definition: Relaciona un recurs amb un lloc on té lloc una conferència, exposició o qualsevol altre esdeveniment formalment esmentat i convocat que dona lloc a un recurs. @ca
definition: Relaterer en korporation til et sted, hvor en konference, en kongres, et møde, en udstilling, en messe, en festival etc. blev afholdt. @da
definition: Relates a resource to a place where a conference, exhibition, or other formally named and convened event that gives rise to a resource is held.
definition: Setzt eine Ressource in Beziehung zu einem lokalen Ort, an dem eine Konferenz, ein Kongress, eine Ausstellung, eine Messe, ein Festival und so weiter stattgefunden hat. @de
definition: يربط بين مصدر ومكان محلي عُقد فيه مؤتمر، اجتماع، جلسة، معرض، مهرجان، إلخ. @ar
definition: 将一种资源与产生一种资源的一次会议、展览或其他正式命名并举办的活动的地点关联起来。 @zh-hans

has parallel name of manufacturer
lexical alias: parallelNameOfManufacturer.en
status: Published
type: Property
label: gyártó párhuzamos neve a következő: @hu
label: har parallelt producentnavn @da
label: hat parallelen Herstellername @de
label: heeft parallelle naam van vervaardiger @nl
label: paralel üretici adı ile ilişkilidir @tr
label: valmistajan rinnakkainen nimi aineistolle @fi
label: له اسم موازي للمُصّنع @ar
label: 有生产者的并列名称 @zh-hans
definition: Bir kaynağı, üretici adı ögesine kaydedilenden farklı bir dildeki veya komut dosyasındaki üretici adı ile ilişkilendirir. @tr
definition: Hozzákapcsol egy forrást egy gyártó nevéhez egy olyan nyelven vagy írásrendszerben, amely eltér a gyártó neve elemben jelölttől. @hu
definition: Liittää aineiston nimeen, joka on valmistajan nimi toisella kielellä ja/tai kirjoitusjärjestelmällä. @fi
definition: Relaterer en ressource til et producentnavn på et andet sprog og/eller i et andet alfabet end det som er anvendt ved angivelsen af producentnavnet. @da
definition: Relates a resource to a name of manufacturer in a language or script that differs from that recorded in a name of manufacturer element.
definition: Setzt eine Ressource in Beziehung zu einem Herstellernamen in einer Sprache oder Schrift, die von dem bereits erfassten Herstellernamen abweicht. @de
definition: يربط بين مصدر واسم مُصّنع بلغة أو نص مختلف عن تلك المُسجل بإسم عنصر مُصّنع. @ar
definition: 将一种资源与用不同于记录在生产者名称元素中之语言或文字的生产者的名称关联起来。 @zh-hans

has coordinates of cartographic content
has subproperty: has longitude and latitude
has subproperty: has right ascension and declination
has subproperty: has strings of coordinate pairs
lexical alias: coordinatesOfCartographicContent.en
status: Published
type: Property
label: har koordinater for kartografisk indhold @da
label: hat Koordinaten von kartografischem Inhalt @de
label: heeft coördinaten van cartografische content @nl
label: kartografik içeriğin koordinatları ile ilişkilidir @tr
label: kartografikus tartalomhoz tartozó koordináták a következők: @hu
label: kartografisen sisällön koordinaatit aineistolle @fi
label: له إحداثيات لمحتوى خرائطي @ar
label: 有地图内容的坐标 @zh-hans
inverse of: is coordinates of cartographic content of
definition: Bir kaynağı, bir kaynağın kartografik içeriğinin kapsamındaki bir yeri belirlemeye yönelik matematiksel sistem ile ilişkilendirir. @tr
definition: Hozzákapcsol egy forrást egy matematikai rendszerhez, amely egy forrás kartográfiai tartalma által lefedett hely azonosítására szolgál. @hu
definition: Liittää aineiston matemaattiseen järjestelmään, jolla identifioidaan aineiston kartografisen sisällön kattama paikka. @fi
definition: Relaciona un recurs amb un lloc que és l’àrea d'abast d’un recurs cartogràfic que es descriu usant un sistema matemàtic per identificar els seus límits o localització. @ca
definition: Relaterer en ressource til et matematisk system til identificering af det område, der dækkes af en ressources kartografiske indhold. @da
definition: Relates a resource to a place that is the area of coverage of a cartographic resource that is described using a mathematical system to identify its boundaries or location.
definition: Setzt eine Ressource in Beziehung zu einem mathematischen System zur Identifizierung eines Gebiets, das durch den kartografischen Inhalt einer Ressource abgedeckt wird. @de
definition: يربط بين مصدر ونظام رياضي يقوم بتحديد مكان مُغطى بواسطة محتوى رسم خرائطي لمصدر. @ar
definition: 将一种资源与作为一种地图资源的覆盖范围、并被使用一个数学体系描述以标识其边界或位置的一个地点关联起来。 @zh-hans

is adapted as motion picture
lexical alias: adaptedAsMotionPicture.en
status: Published
type: Property
label: aineiston elokuvaversio @fi
label: er bearbejdet som film @da
label: is bewerkt als speelfilm @nl
label: ist bearbeitet als Film @de
label: mozgóképként való feldolgozása a következő: @hu
label: sinema filmi olarak uyarlanmıştır @tr
label: هو مقتبَس كفيلم سينمائي @ar
label: 被改编成电影 @zh-hans
sub property of: is adapted as
inverse of: is motion picture adaptation of
definition: Bir kaynağı, başka kaynağa dayalı bir sinema filmi ile ilişkilendirir. @tr
definition: Hozzákapcsol egy forrást egy mozgóképhez, amely egy másik forráson alapul. @hu
definition: Liittää aineiston toiseen aineistoon perustuvaan liikkuvan kuvan käsikirjoitukseen. @fi
definition: Relaterer en ressource til en film baseret på en oprindelig ressource. @da
definition: Relates a resource to a motion picture that is based on another resource.
definition: Setzt eine Ressource in Beziehung zu einem Film, der auf einer anderen Ressource basiert. @de
definition: يربط بين مصدر وفيلم سينمائي اعتمد على مصدر آخر. @ar
definition: 将一种资源与基于另一种资源的一种电影关联起来。 @zh-hans

is dubbed version of
lexical alias: dubbedVersionOf.en
status: Published
type: Property
label: aineiston dubattu versio @fi
label: dublajlı sürümüdür @tr
label: er synkroniseret version af @da
label: is nagesynchroniseerde versie van @nl
label: ist Synchronfassung von @de
label: szinkronizált verziója a következőnek: @hu
label: هي نسخة مدبلجة من @ar
label: 是……的配音版 @zh-hans
sub property of: is translation of
inverse of: has dubbed version
definition: Bir kaynağı, konuşma dili başka kaynaktaki dilden farklı bir dile çevrilen film kaynağı ile ilişkilendirir. @tr
definition: Hozzákapcsol egy forrást egy mozgóképforráshoz, amelyben a beszélt dialógus az eredeti forrás nyelvétől eltérő nyelvre van fordítva. @hu
definition: Liittää aineiston elokuva-aineistoon, jossa alkuperäisteoksen puhuttu dialogi on käännetty toiselle kielelle. @fi
definition: Relaciona un recurs amb un recurs d’imatge en moviment el diàleg parlat de la qual es tradueix a una llengua diferent d’un altre recurs. @ca
definition: Relaterer et udtryk til en ressource af et levende billedværk, hvori den talte dialog er blevet oversat til et andet sprog end det, der er anvendt i den originale ressource. @da
definition: Relates a resource to a moving image resource whose spoken dialogue is translated into a language different from another resource.
definition: Setzt eine Ressource in Beziehung zu einer Bewegtbildressource, in der die Dialoge in eine Sprache übersetzt wurden, die sich von der der Originalressource unterscheidet. @de
definition: يربط بين مصدر ومصدر لصورة متحركة يتم فيه ترجمة حوار منطوق إلى لغة مختلفة عن لغة المصدر الأصلي. @ar
definition: 将一种资源与其口语对话被翻译成和另一种资源不同语言的一种动态图像资源关联起来。 @zh-hans

has dubbed version
lexical alias: dubbedVersion.en
status: Published
type: Property
label: dubatun version perusta @fi
label: dublajlı sürüm ile ilişkilidir @tr
label: er synkroniseret version @da
label: heeft nagesynchroniseerde versie @nl
label: ist Synchronfassung @de
label: szinkronizált verziója a következő: @hu
label: له نسخة مدبلجة @ar
label: 有配音版 @zh-hans
sub property of: is translated as
inverse of: is dubbed version of
definition: Bir kaynağı, başka kaynaktaki konuşma diyaloğunu farklı dile çeviren bir film kaynağı ile ilişkilendirir. @tr
definition: Hozzákapcsol egy forrást egy mozgóképforráshoz, amely az eredeti forrás beszélt dialógusát egy másik nyelvre fordítja. @hu
definition: Liittää aineiston elokuvateoksen aineistoon, jossa alkuperäisteoksen puhuttu dialogi on käännetty toiselle kielelle. @fi
definition: Relaciona un recurs amb un recurs d’imatge en moviment que tradueix el diàleg parlat d’un altre recurs en una llengua diferent. @ca
definition: Relaterer en ressource til en ressource af et levende billedværk, der oversætter den originale ressources talte dialog til et andet sprog. @da
definition: Relates a resource to a moving image resource that translates spoken dialogue of another resource into a different language.
definition: Setzt eine Ressource in Beziehung zu einer Bewegtbildressource, die die Dialoge der Originalressource in eine andere Sprache übersetzt. @de
definition: يربط بين مصدر ومصدر لصورة متحركة يتم فيه ترجمة حوار منطوق لمصدر أصلي إلى لغة مختلفة. @ar
definition: 将一种资源与把另一种资源的口语对话翻译成另一种不同语言的一种动态图像资源关联起来。 @zh-hans

has cadenza
lexical alias: cadenza.en
status: Published
type: Property
label: er kadence @da
label: hat Kadenz @de
label: heeft cadens @nl
label: kadans ile ilişkilidir @tr
label: kadenciája a következő: @hu
label: kadenssiaineisto @fi
label: له كادنزا @ar
label: 有华彩 @zh-hans
sub property of: is augmented by
inverse of: is cadenza composed for
definition: Bir kaynağı, bir soliste ait süs notaları olan bir müzik kaynağına aynı veya farklı besteci tarafından eklenen konçerto gibi bir müzik kaynağı ile ilişkilendirir. @tr
definition: Hozzákapcsol egy forrást egy zenei forráshoz, amely egy szólista számára alkotott díszítő szakaszból áll, amelyet egy versenyműhöz hasonló zenei forráshoz ad hozzá ugyanaz vagy egy másik zeneszerző. @hu
definition: Liittää aineiston musiikkiaineistoon, joka koostuu solistille tarkoitetusta koristeellisesta osasta ja on lisätty saman tai eri säveltäjän musiikkiteokseen, kuten konserttoon. @fi
definition: Relaciona un recurs amb un recurs que és un recurs musical que és un passatge ornamental per a un solista afegit a un recurs musical, com ara un concert, del mateix compositor o d’un compositor diferent. @ca
definition: Relaterer en ressource til en musikressource, der består af en nedskreven improvisation for solist, som er føjet til en musikressource såsom en koncert, enten af den samme eller af en anden komponist. @da
definition: Relates a resource to a resource that is a musical resource that is an ornamental passage for a soloist added to a musical resource, such as a concerto, by the same or a different composer.
definition: Setzt eine Ressource in Beziehung zu einer Musikressource, die aus einer ausgeschmückten Passage für eine Solistin/einen Solisten besteht, die einer Musikressource, wie zum Beispiel einem Konzert, entweder von derselben/demselben oder einer/einem anderen Komponistin/Komponisten hinzugefügt wird. @de
definition: يربط بين مصدر ومصدر موسيقي يُمثل فقرة مصاحبة لعازف منفرد تُضاف إلى مصدر موسيقي مثل، كونشيرتو، للملحن نفسة أو لملحن مختلف. @ar
definition: 将一种资源与由同一个或不同的作曲家附加在诸如协奏曲等一种音乐资源中独奏（唱）表演的装饰性乐段作为一种音乐资源的一种资源关联起来。 @zh-hans

is variations based on
lexical alias: variationsBasedOn.en
status: Published
type: Property
label: er variationer baseret på @da
label: is variatie gebaseerd op @nl
label: ist Variationen basierend auf @de
label: muunnelma aineistosta @fi
label: változatok a következő alapján: @hu
label: şuna dayalı alternatifler @tr
label: هي تنويعات تعتمد على @ar
label: 是基于……的变奏曲 @zh-hans
sub property of: has source
inverse of: is modified by variation as
definition: Bir kaynağı, ardışık modifikasyonlarla bir veya daha fazla kez tekrar edilen ayrık bir tema oluşturmak üzere melodik, tematik veya harmonik materyalin alındığı bir müzik kaynağı ile ilişkilendirir. @tr
definition: Hozzákapcsol egy forrást egy zenei forráshoz, amelyből dallami, tematikus vagy harmonikus anyagot emelnek ki egy különálló téma megalkotása céljából, amely egyszer vagy többször ismétlődik egymás utáni módosulásokkal. @hu
definition: Liittää aineiston musiikkiaineistoon, josta melodinen, temaattinen tai harmoninen aines on otettu erillisen, toistettavan ja muunneltavan teeman muodostamiseksi. @fi
definition: Relaterer en ressource til en musikressource, hvorfra der er taget melodisk, tematisk eller harmonisk materiale til dannelse af et bestemt tema, som gentages en eller flere gange med efterfølgende ændringer. @da
definition: Relates a resource to a musical resource from which melodic, thematic, or harmonic material is taken to form a discrete theme, which is repeated one or more times with subsequent modifications.
definition: Setzt eine Ressource in Beziehung zu einer Musikressource, aus der melodisches, thematisches oder harmonisches Material entnommen wird, um ein einzelnes Thema zu bilden, das ein- oder mehrmals mit nachfolgenden Modifikationen wiederholt wird. @de
definition: يربط بين مصدر ومصدر موسيقي تؤخذ منه المواد اللحنية أو الموضوعية أو التناغمية لتشكل مقطوعة متميزة، تتكرر مرة واحدة أو أكثر مع تعديلات لاحقة. @ar
definition: 将一种资源与其旋律、主题或和声材料被用来形成一个独立的主题、而这个主题又经过后续变化而反复一次或多次的一种音乐资源关联起来。 @zh-hans

is modified by variation as
lexical alias: modifiedByVariationAs.en
status: Published
type: Property
label: er ændret ved variation til @da
label: is aangepast door variatie als @nl
label: ist durch Variation modifiziert als @de
label: olarak varyasyonla değiştirilmiştir @tr
label: variaatioaineisto @fi
label: változatként módosította a következő: @hu
label: هو معدل بتنويع كـ @ar
label: 被修改为变奏曲作为 @zh-hans
sub property of: has derivative
inverse of: is variations based on
definition: Bir kaynağı, ardışık modifikasyonlarla bir veya daha fazla kez tekrar edilen ayrık bir tema oluşturmak üzere başka kaynaktan alınan melodik, tematik veya harmonik materyal içeren bir müzik kaynağı ile ilişkilendirir. @tr
definition: Hozzákapcsol egy forrást egy zenei forráshoz, amelyben egy másik forrásformából átvett dallami, tematikus vagy harmonikus anyag egy különálló témát képez, amely egyszer vagy többször ismétlődik egymás utáni módosulásokkal. @hu
definition: Liittää aineiston musiikkiaineistoon, jossa toisesta aineistosta otettu melodinen, temaattinen tai harmoninen aines muodostaa erillisen teeman, jota toistetaan muunnellen yhden tai useamman kerran. @fi
definition: Relaterer en ressource til en musikressource, hvori melodisk, tematisk eller harmonisk materiale taget fra det oprindelige værk danner et bestemt tema, der gentages en eller flere gange med efterfølgende ændringer. @da
definition: Relates a resource to a musical resource in which melodic, thematic, or harmonic material taken from another resource forms a discrete theme, which is repeated one or more times with subsequent modifications.
definition: Setzt eine Ressource in Beziehung zu einer Musikressource, in dem melodisches, thematisches oder harmonisches Material aus einer anderen Ressource ein einzelnes Thema bildet, das ein- oder mehrmals mit nachfolgenden Modifikationen wiederholt wird. @de
definition: يربط بين مصدر ومصدر موسيقي تكون فيه المواد اللحنية أو المواضعية أو التناغمية مأخوذة من مصدر آخر لتشكل مقطوعة متميزة، تتكرر مرة واحدة أو أكثر مع تعديلات لاحقة. @ar
definition: 将一种资源与其旋律、主题或和声材料被取自另一种资源以形成一个不同的主题、而这个主题又经过后续变化而反复一次或多次的一种音乐资源关联起来。 @zh-hans

is cadenza composed for
lexical alias: cadenzaComposedFor.en
status: Published
type: Property
label: er kadence komponeret til @da
label: is cadens gecomponeerd voor @nl
label: ist Kadenz komponiert für @de
label: için bestelenmiş kadanstır @tr
label: kadencia a következőhöz komponálva: @hu
label: kadenssi aineistoon @fi
label: هو كادنزا مؤلَفة لـ @ar
label: 是为……作曲的华彩段 @zh-hans
sub property of: is augmentation of
inverse of: has cadenza
definition: Bir kaynağı, bir soliste ait süs notaları olan bir müzik kaynağına aynı veya farklı besteci tarafından eklenen konçerto gibi bir müzik kaynağı ile ilişkilendirir. @tr
definition: Hozzákapcsol egy forrást egy versenyműhöz hasonló zenei forráshoz, amelyhez egy szólistának szánt díszítő szakaszt alkotott ugyanaz vagy egy másik zeneszerző. @hu
definition: Liittää aineiston musiikkiaineistoon, joka koostuu solistille tarkoitetusta koristeellisesta osasta ja on lisätty saman tai eri säveltäjän musiikkiaineistoon. @fi
definition: Relaterer en ressource til en musikressource, såsom en koncert, hvortil der er komponeret en nedskreven improvisation for solist, enten af den samme eller af en anden komponist. @da
definition: Relates a resource to a musical resource, such as a concerto, to which is added a musical resource that is an ornamental passage for a soloist by the same or a different composer.
definition: Setzt eine Ressource in Beziehung zu einer Musikressource, zum Beispiel einem Konzert, dem eine Musikressource, das aus einer ausgeschmückten Passage für eine Solistin/einen Solisten besteht, entweder von derselben/demselben oder einer/einem anderen Komponistin/Komponisten hinzugefügt wird. @de
definition: يربط بين مصدر ومصدر موسيقي مثل كونشيرتو يضاف إلي مصدر موسيقي يمثل فقرة مصاحبة لعازف منفرد للملحن نفسه أو لملحن مختلف. @ar
definition: 将一种资源与由同一个或不同的作曲家附加的独奏（唱）表演的装饰性乐段的一种音乐资源于其中的诸如协奏曲等的一种音乐资源关联起来。 @zh-hans

is libretto for
lexical alias: librettoFor.en
status: Published
type: Property
label: er libretto til @da
label: is libretto voor @nl
label: ist Libretto für @de
label: librettoaineisto @fi
label: librettosudur @tr
label: librettó a következőhöz: @hu
label: نص أوبرالي لـ @ar
label: 是……的台本 @zh-hans
sub property of: is complemented by
inverse of: has libretto
definition: Bir kaynağı, metinsel kaynakla tamamlanan, opera, bale ya da başka bir kaynak için müzikal sahne veya oratoryo gibi müzikal veya koreografik bir kaynak olan kaynak ile ilişkilendirir. @tr
definition: Hozzákapcsol egy forrást egy olyan zenei vagy koreografikus forráshoz, mint egy opera, ballett, vagy egyéb zenés színpadi forrás, vagy egy oratórium, amelyet egy szöveges forrás egészít ki. @hu
definition: Liittää aineiston tekstiaineistolla täydennettyyn musiikkiin tai koreografiaan, kuten oopperaan, balettiin tai muuhun näyttämöteokseen tai oratorioon. @fi
definition: Relaterer en ressource til en musikressource, såsom en opera eller et andet musikalsk sceneværk, eller et oratorium, der anvender den relaterede ressources tekst. @da
definition: Relates a resource to a resource that is a musical or choreographic resource such as an opera, a ballet, or other resource for the musical stage, or an oratorio, that is complemented by a textual resource.
definition: Setzt eine Ressource in Beziehung zu einer Musikressource oder einer choreographischen Ressource, wie zum Beispiel einer Oper, einem Ballett oder einer anderen Musikressource für die Bühne oder einem Oratorium, die/das durch eine textliche Ressource vervollständigt wird. @de
definition: يربط بين مصدر ومصدر موسيقي أو راقص مثل الأوبرا، الباليه، أو مصدر آخر للمسرح الموسيقي، أو موسيقى دينية يكملها مصدر نصي. @ar
definition: 将一种资源与被一种文字资源补充的诸如歌剧、芭蕾或其他舞台音乐作品或清唱剧之类的作为一种音乐或编舞资源的一种资源关联起来。 @zh-hans

has incidental music
lexical alias: incidentalMusic.en
status: Published
type: Property
label: er skuespilsmusik @da
label: fon müziği ile ilişkilidir @tr
label: hat Bühnenmusik @de
label: heeft toneelmuziek @nl
label: kísérőzenéje: @hu
label: näytelmämusiikkiaineisto @fi
label: له موسيقى تصويرية @ar
label: 有配乐 @zh-hans
sub property of: has music
inverse of: is incidental music for
definition: Bir kaynağı, tiyatro olan bir kaynağı veya repliklerle sahnelenen başka bir kaynağı tamamlayan bir müzikal kaynak ile ilişkilendirir. @tr
definition: Hozzákapcsol egy forrást egy zenei forráshoz, amely kísérőzenét szolgáltat egy színdarabhoz vagy a színpad másik beszélt forrásához. @hu
definition: Liittää aineiston musiikkiaineistoon, joka toimii näytelmän tai muun puhutun näyttämöesityksen näytelmämusiikkina. @fi
definition: Relaciona un recurs amb un recurs que és un recurs musical que complementa un recurs que és una obra de teatre o qualsevol altra obra escènica que es realitza com a paraula parlada. @ca
definition: Relaterer en ressource til en musikressource, der indeholder tilhørende musik til et skuespil eller anden ressource for et talt sceneværk. @da
definition: Relates a resource to a resource that is a musical resource that complements a resource that is a play or other work for the stage that is realized as spoken word.
definition: Setzt eine Ressource in Beziehung zu einer Musikressource, die ein Drama oder eine andere, gesprochene Bühnenressource ergänzt. @de
definition: يربط بين مصدر ومصدر موسيقي يكمل مصدرًا يمثل مسرحية أو مصدر آخر للمسرح يتحول إلى كلمة منطوقة. @ar
definition: 将一种资源与补充作为戏剧或其他舞台会话作品之资源的作为一种音乐资源的一种资源关联起来。 @zh-hans

has variant name of agent
lexical alias: variantNameOfAgent.en
status: Published
type: Property
label: har variantnavn for agent @da
label: hat abweichenden Namen eines Akteurs @de
label: heeft variant naam van actor @nl
label: temsilcinin alternatif ismi ile ilişkilidir @tr
label: toimijan varianttinimi @fi
label: ágens névváltozata a következő: @hu
label: له اسم مختلف لوكيل @ar
label: 有行为者的变异名称 @zh-hans
sub property of: has name of agent
inverse of: is variant name of agent of
definition: Bir temsilciyi, belirli bir uygulamada veya bağlamda tercih için seçilmeyen temsilcinin ismiyle ilişkilendirir. @tr
definition: Hozzákapcsol egy ágenst egy ágensnévhez, amelyet egy adott alkalmazásban vagy összefüggésben nem részesítenek előnyben. @hu
definition: Liittää toimijan nimeen, jota jota ei ole valittu ensisijaiseksi tietyssä sovelluksessa tai kontekstissa. @fi
definition: Relaterer en ressource til et navn eller en navneform, hvorunder en ressource er kendt, og som adskiller sig fra det navn eller den navneform, der er valgt som det foretrukne navn. @da
definition: Relates an agent to a name of agent that is not selected for preference in a specific application or context.
definition: Setzt einen Akteur in Beziehung zu einem Name eines Akteurs, der in einer bestimmten Anwendung oder in einem bestimmten Kontext nicht als Vorzugsform bestimmt wird. @de
definition: يربط وبين كيل واسم وكيل لم يتم اختياره كاسم مختلف مفضل ضمن تطبيق محدد أو سياق محدد. @ar
definition: 将一个行为者在一个特定的应用或语境中未被首选的一个行为者的名称关联起来。 @zh-hans

is remade as
lexical alias: remadeAs.en
status: Published
type: Property
label: aineiston uusintaproduktio @fi
label: er genindspillet som @da
label: is opnieuw gemaakt als @nl
label: ist Remake als @de
label: olarak yeniden yapılmıştır @tr
label: újrafeldolgozása a következőként: @hu
label: هو إعادة كـ @ar
label: 被重新制作为 @zh-hans
sub property of: has derivative
inverse of: is remake of
definition: Bir kaynağı, daha önceki bir kaynağa dayanan bir sinema filmi, radyo programı, televizyon programı veya video ile ilişkilendirir. @tr
definition: Hozzákapcsol egy forrást egy korábbi forráson alapuló mozgóképhez, rádióműsorhoz, televízióműsorhoz, vagy videóhoz. @hu
definition: Liittää aineiston elokuvaan, radio-ohjelmaan, televisio-ohjelmaan tai videoon, joka perustuu aiempaan aineistoon. @fi
definition: Relaterer en ressource til en ressource af en film, et radio- eller tv-program eller en video baseret på en tidligere ressource. @da
definition: Relates a resource to a motion picture, radio program, television program, or video based on an earlier resource.
definition: Setzt eine Ressource in Beziehung zu einem Film, einer Hörfunksendung, einer Fernsehsendung oder einem Video, der/die/das auf einer früheren Ressource basiert. @de
definition: يربط بين مصدر وفيلم سينمائي، برنامج إذاعي، برنامج تليفزيوني، أو فيديو يعتمد على مصدر سابق. @ar
definition: 将一种资源与基于一种先前资源的一种新电影、广播节目、电视节目或视频的一种资源关联起来。 @zh-hans

is set to music as
lexical alias: setToMusicAs.en
status: Published
type: Property
label: er sat i musik som @da
label: is op muziek gezet als @nl
label: ist vertont als @de
label: tekstiin perustuva musiikkiaineisto @fi
label: zenei átiratként való feldolgozása a következő: @hu
label: şu olarak müzik biçiminde ayarlanmış: @tr
label: هو إعداد موسيقي كـ @ar
label: 配乐为 @zh-hans
sub property of: has derivative
inverse of: is musical setting of
definition: Bir kaynağı, oratoryo dışında, başka kaynağın metnini kullanan belirgin nitelik taşımayan bir müzikal kaynak ile ilişkilendirir. @tr
definition: Ei-näytelmällisen musiikkiaineiston (muun kuin oratorion) ekspressio, jonka teksti on peräisin toisesta aineistosta. @fi
definition: Hozzákapcsol egy forrást egy nem-drámai zenei forráshoz, amely nem oratórium, és amely egy másik forrás szövegét használja. @hu
definition: Relaterer en ressource til en ressource af et ikke-dramatisk musikværk, bortset fra et oratorium, der anvender en oprindelig ressources tekst. @da
definition: Relates a resource to a non-dramatic musical resource, other than an oratorio, that uses a text of another resource.
definition: Setzt eine Ressource in Beziehung zu einer nicht dramatischen Musikressource, bei der es sich nicht um ein Oratorium handelt, die den Text einer anderen Ressource verwendet. @de
definition: يربط بين مصدر ومصدر موسيقي غير درامي، بخلاف الموسيقى الدينية، التي تستخدم نص مصدر آخر @ar
definition: 将一种资源与不同于清唱剧、使用另一种资源的文本的一种非戏剧音乐资源关联起来。 @zh-hans

has note on issue, part, or iteration used as basis for identification of resource
lexical alias: noteOnIssuePartOrIterationUsedAsBasisForIdentificationOfResource.en
status: Published
type: Property
label: forrás azonosítója alapjaként használt számról, részről vagy iterációról szóló megjegyzése a következő: @hu
label: har note om nummer, del eller iteration, anvendt som grundlag for identifikation af ressource @da
label: hat Anmerkung zur Ausgabe, zum Teil oder zur Iteration, die/der als Grundlage für die Identifizierung einer Manifestation verwendet wird @de
label: heeft noot bij aflevering, deel of iteratie gebruikt als basis voor identificatie van resource @nl
label: huomautus numerosta, osasta tai iteraatiosta aineiston identifioinnin perustana. @fi
label: kaynağın tanımlanmasında temel alınan sayı, bölüm veya yineleme hakkında not ile ilişkilidir @tr
label: له تبصرة عن عدد، جزء، أو إعادة إصدار يُستخدم كأساس لتحديد مصدر. @ar
label: 有关于用作资源标识之基础的期、部分、或更新后整体的附注 @zh-hans
sub property of: has note on resource
definition: Bir kaynağı, bir kaynağın tanımlanması için temel olarak kullanılan ve çok parçalı bir monografın veya dizinin sayısını veya parçasını ya da bir entegre kaynağın yinelemesini tanımlayan kaynak notu ile ilişkilendirir. @tr
definition: Hozzákapcsol egy forrást egy forrásra tett megjegyzéshez, amely azonosítja egy többrészes monográfia vagy sorozat részét vagy számát, vagy egy a forrás azonosításához alapul szolgáló integráló forrás iterációját. @hu
definition: Liittää aineiston huomautukseen moniosaisen monografian tai sarja-aineiston numerosta tai osasta tai päivittyvän aineiston iteraatiosta, jota käytetään aineiston identifioinnin perustana. @fi
definition: Relaterer en ressource til en note, der identificerer et nummer eller en del af et flerbindsværk eller et periodikum, eller en iteration af en integrerende ressource, der er brugt som grundlag for identifikation af en ressource. @da
definition: Relates a resource to a note on resource that identifies an issue or part of a multipart monograph or serial, or an iteration of an integrating resource that has been used as a basis for the identification of a resource.
definition: Setzt eine Ressource in Beziehung zu einer Anmerkung zur Ressource, die eine Ausgabe oder einen Teil einer mehrteiligen Monografie oder einer fortlaufenden Ressource oder eine Iteration einer integrierenden Ressource identifiziert, die/der als Grundlage für die Identifizierung einer Ressource verwendet wird. @de
definition: يربط بين مصدر وتبصرة عن مصدر يُحدد عدد أو جزء من دراسات متعددة الأجزاء أو سلسلة، أو جزء من مصدر متكامل تم استخدامه كأساس لتحديد مصدر. @ar
definition: 将一种资源与标识作为资源标识基础的多部分单行出版物或连续出版物的期或部分或者集成性资源的更新后整体的一个关于资源的附注关联起来。 @zh-hans

has note on changes in content characteristics
lexical alias: noteOnChangesInContentCharacteristics.en
status: Published
type: Property
label: har note om ændringer i bærerkarakteristika @da
label: hat Anmerkung zu Änderungen von Inhaltseigenschaften @de
label: heeft noot bij veranderingen in karakteristieken van content @nl
label: huomautus muutoksista sisällön ominaisuuksissa @fi
label: içerik özelliklerindeki değişiklikler hakkında not ile ilişkilidir @tr
label: tartalmi jellemzők változásairól szóló megjegyzése a következő: @hu
label: له تبصرة على تغييرات في سمات المحتوى @ar
label: 有关于内容特征变化的附注 @zh-hans
sub property of: has note on resource
definition: Bir kaynağı, artzamanlı kaynağa ait yinelemelerin, parçaların veya sayıların içerik özelliklerindeki varyasyonlar hakkında bilgi sağlayan kaynak notu ile ilişkilendirir. @tr
definition: Hozzákapcsol egy forrást egy forrásra tett megjegyzéshez, amely információt nyújt egy diakronikus forrás részeinek, számainak, vagy iterációinak tartalmi jellemzőiben történt változásokról. @hu
definition: Liittää aineiston aineistoa koskevaan huomaukseen, jossa annetaan tietoja vaihteluista diakronisen aineiston osien, numeroiden tai iteraatioiden isällön ominaisuuksissa. @fi
definition: Relaterer en ressource til en note om ændringer i bærerens karakteristika, der optræder i efterfølgende numre eller dele af en ressource, der er udgivet i successive dele, eller mellem iterationer af en integrerende ressource. @da
definition: Relates a resource to a note on resource that provides information on variations in the content characteristics of parts, issues, or iterations of a diachronic resource.
definition: Setzt eine Ressource in Beziehung zu einer Anmerkung zur Ressource, die Informationen über Veränderungen in den Inhaltseigenschaften von Teilen, Ausgaben oder Iterationen einer diachronen Ressource enthält. @de
definition: يربط بين مصدر وتبصرة عن مصدر يُعطي معلومات عن التغيرات في سمات المحتوى الذي يوجد على الأجزاء، أو الأعداد، أو إعادة الإصدار الخاص بمصدر مستمر. @ar
definition: 将一种资源与提供关于一种历时资源的部分、期、或更新后整体的内容特征之变化的信息的一个关于资源的附注关联起来。 @zh-hans

has note on changes in carrier characteristics
lexical alias: noteOnChangesInCarrierCharacteristics.en
status: Published
type: Property
label: a hordozó ismérvváltozásairól szóló megjegyzése a következő: @hu
label: har note om ændringer i bærerkarakteristika @da
label: hat Anmerkung zu Änderungen von Datenträgereigenschaften @de
label: heeft noot bij veranderingen in karakteristieken van dragers @nl
label: huomautus muutoksista tallenteen ominaisuuksissa @fi
label: taşıyıcı özelliklerindeki değişiklikler hakkında not ile ilişkilidir @tr
label: له تبصرة عن التغييرات في سمات الحامل @ar
label: 有关于载体特征变化的附注 @zh-hans
sub property of: has note on resource
definition: Bir kaynağı, artzamanlı kaynağa ait yinelemelerin, parçaların veya sayıların taşıyıcı özelliklerindeki varyasyonlar hakkında bilgi sağlayan kaynak notu ile ilişkilendirir. @tr
definition: Hozzákapcsol egy forrást egy a hordozójellemzők változásairól szóló, forrásra tett megjegyzéshez, amely egymást követő részekben kiadott forrás rákövetkező számaiban vagy részeiben fordulnak elő, vagy egy integráló forrás iterációi között. @hu
definition: Liittää aineiston lisätietoon vaihteluista diakronisen ainieston osien, numeroiden tai iteraatioiden ominaisuuksissa. @fi
definition: Relaterer en ressource til en note om ændringer i bærerens karakteristika, der optræder i efterfølgende numre eller dele af en ressource, der er udgivet i successive dele, eller mellem iterationer af en integrerende ressource. @da
definition: Relates a resource to a note on resource that provides information on variations in the carrier characteristics that are found on resources of parts, issues, or iterations of a diachronic resource.
definition: Setzt eine Ressource in Beziehung zu einer Anmerkung zur Ressource, die Informationen zu Veränderungen in den Datenträgereigenschaften enthält, die bei Ressourcen von Teilen, Ausgaben oder Iterationen einer diachronen Ressource vorkommen. @de
definition: يربط بين مصدر وتبصرة عن مصدر يوفر معلومات عن التغيرات في سمات الحامل التي توجد على مصادر الأجزاء، الأعداد، أو إعادة الإصدار الخاص بمصدر تعاقبي. @ar
definition: 将一种资源与提供关于一种历时资源的部分、期、或更新后整体上发现的载体之变化的信息的一个关于资源的附注关联起来。 @zh-hans

has note on distribution statement
lexical alias: noteOnDistributionStatement.en
status: Published
type: Property
label: dağıtım bildirimi hakkında not ile ilişkilidir @tr
label: har note til distriubutionsbeskrivelse @da
label: hat Anmerkung zur Vertriebsangabe @de
label: heeft noot bij distributievermelding @nl
label: huomautus aineiston jakelumerkinnöstä @fi
label: terjesztési közlésről szóló megjegyzése a következő: @hu
label: له تبصرة عن بيان التوزيع @ar
label: 有关于发行说明的附注 @zh-hans
sub property of: has note on resource
definition: Bir kaynağı, kaynağın dağıtımı hakkında bilgi sağlayan kaynak notu ile ilişkilendirir. @tr
definition: Hozzákapcsol egy forrást egy forrásra tett megjegyzéshez, amely információt nyújt egy forrás terjesztéséről. @hu
definition: Liittää aineiston huomautukseen, joka sisältää tietoja aineiston jakelusta. @fi
definition: Relaterer en ressource til en note, der angiver detaljer om distributionssted, distributør eller distributionsår, eller oplysninger om ændringer i distributionssted, distributør eller distributørnavn. @da
definition: Relates a resource to a note on resource that provides information on the distribution of a resource.
definition: Setzt eine Ressource in Beziehung zu einer Anmerkung zur Ressource, die Informationen über den Vertrieb einer Ressource enthält. @de
definition: يربط بين مصدر وتبصرة عن مصدر يوفر معلومات عن توزيع مصدر. @ar
definition: 将一种资源与提供关于资源发行信息的关于资源的附注关联起来。 @zh-hans

has note on manufacture statement
lexical alias: noteOnManufactureStatement.en
status: Published
type: Property
label: gyártási közlésről szóló megjegyzése a következő: @hu
label: har note til produktionsbeskrivelse - publicerede ressourcer @da
label: hat Anmerkung zur Herstellungsangabe @de
label: heeft noot bij vervaardigingsvermelding @nl
label: huomautus aineiston valmistusmerkinnöstä @fi
label: üretim bildirimi hakkında not ile ilişkilidir @tr
label: له تبصرة عن بيان التصينع @ar
label: 有关于生产说明的附注 @zh-hans
sub property of: has note on resource
definition: Bir kaynağı, kaynağın imalatı hakkında bilgi sağlayan kaynak notu ile ilişkilendirir. @tr
definition: Hozzákapcsol egy forrást egy forrásra tett megjegyzéshez, amely információt nyújt egy forrás gyártásáról. @hu
definition: Liittää aineiston huomautukseen, joka sisältää tietoja aineiston valmistuksesta. @fi
definition: Relaterer en ressource til en note, der giver detaljer om fremstillingssted, producent eller fremstillingsår, eller om ændringer i fremstillingssted, producent eller producentnavn. @da
definition: Relates a resource to a note on resource that provides information on the manufacture of a resource.
definition: Setzt eine Ressource in Beziehung zu einer Anmerkung zur Ressource, die Informationen über die Herstellung einer Ressource enthält. @de
definition: يربط بين مصدر وتبصرة عن مصدر يوفر معلومات عن صانع مصدر. @ar
definition: 将一种资源与提供关于资源生产信息的关于资源的附注关联起来。 @zh-hans

has note on production statement
lexical alias: noteOnProductionStatement.en
status: Published
type: Property
label: előállítási közlésről szóló megjegyzése a következő: @hu
label: har note til produktionsbeskrivelse - upublicerede ressourcer @da
label: hat Anmerkung zur Entstehungsangabe @de
label: heeft noot bij productievermelding @nl
label: huomautus aineiston tuotantomerkinnöstä @fi
label: yapım bildirimi hakkında not ile ilişkilidir @tr
label: له تبصرة عن بيان الإنتاج @ar
label: 有关于制作说明的附注 @zh-hans
sub property of: has note on resource
definition: Bir kaynağı, kaynağın üretimi hakkında bilgi sağlayan kaynak notu ile ilişkilendirir. @tr
definition: Hozzákapcsol egy forrást egy forrásra tett megjegyzéshez, amely információt nyújt egy forrás előállításáróll. @hu
definition: Liittää aineiston lisätietoon aineiston tuotannosta. @fi
definition: Relaterer en ressource til en note, der giver detaljer om produktionssted, producer eller produktionsår, eller om ændringer i produktionssted, producer eller producernavn. @da
definition: Relates a resource to a note on resource that provides information on the production of a resource.
definition: Setzt eine Ressource in Beziehung zu einer Anmerkung zur Ressource, die Informationen über die Entstehung einer Ressource enthält. @de
definition: يربط بين مصدر وتبصرة عن مصدر يوفر معلومات عن إنتاج مصدر. @ar
definition: 将一种资源与提供关于资源制作信息的关于资源的附注关联起来。 @zh-hans

has note on publication statement
lexical alias: noteOnPublicationStatement.en
status: Published
type: Property
label: har note til publiceringsbeskrivelse @da
label: hat Anmerkung zur Veröffentlichungsangabe @de
label: heeft noot bij publicatievermelding @nl
label: huomautus aineiston julkaisumerkinnöstä @fi
label: megjelenési közlésről szóló megjegyzése a következő: @hu
label: yayınlama bildirimi hakkında not ile ilişkilidir @tr
label: له تبصرة عن بيان النشر @ar
label: 有关于出版说明的附注 @zh-hans
sub property of: has note on resource
definition: Bir kaynağı, kaynağın yayınlanmasına hakkında bilgi sağlayan kaynak notu ile ilişkilendirir. @tr
definition: Hozzákapcsol egy forrást egy forrásra tett megjegyzéshez, amely információt nyújt egy forrás megjelenéséről. @hu
definition: Liittää aineiston lisätietoon aineiston julkaisemisesta. @fi
definition: Relaterer en ressource til en note, der giver detaljer om publiceringssted, udgiver eller publiceringsår eller oplysninger om ændringer i publiceringssted, udgiver eller udgivernavn, eller om ophør af publicering. @da
definition: Relates a resource to a note on resource that provides information on the publication of a resource.
definition: Setzt eine Ressource in Beziehung zu einer Anmerkung zur Ressource, die Informationen über die Veröffentlichung einer Ressource enthält. @de
definition: يربط بين مصدر وتبصرة عن مصدر يوفر معلومات عن نشر مصدر. @ar
definition: 将一种资源与提供关于资源出版信息的关于资源的附注关联起来。 @zh-hans

has note on frequency (Deprecated)
lexical alias: noteOnFrequency.en
status: Deprecated
type: Property
label: har note om frekvens @da
sub property of: has note on resource
definition: Relaterer en ressource til en note, der giver detaljer om dækningsperioden, om udgivelsesfrekvensen for numre eller dele af et periodikum eller opdateringsfrekvensen for en integrerende ressource eller ændringer i frekvens. @da
definition: Relates a resource to a note providing details on the currency of the contents, on the frequency of release of issues or parts of a serial or the frequency of updates to an integrating resource, or on changes in frequency. (Deprecated)

has note on statement of responsibility
lexical alias: noteOnStatementOfResponsibility.en
status: Published
type: Property
label: felelősségi közlésről szóló megjegyzése a következő: @hu
label: har note til ophavsangivelse @da
label: hat Anmerkung zur Verantwortlichkeitsangabe @de
label: heeft noot bij verantwoordelijkheidsvermelding @nl
label: huomautus aineiston vastuullisuusmerkinnöstä @fi
label: sorumluluk bildirimi hakkında not ile ilişkilidir @tr
label: له تبصرة عن بيان المسئولية @ar
label: 有关于责任说明的附注 @zh-hans
sub property of: has note on resource
definition: Bir kaynağı, bir kaynaktan sorumlu olan temsilci ve işlevleri hakkında bilgi sağlayan kaynak notu ile ilişkilendirir. @tr
definition: Hozzákapcsol egy forrást egy forrásra tett megjegyzéshez, amely információt nyújt egy forrásért felelős ágensről és funkciójáról. @hu
definition: Liittää aineiston lisätietoon aineistossa vastuussa olevasta toimijasta ja tämän roolista. @fi
definition: Relaterer en ressource til en note, der giver oplysninger om en agent, der ikke er nævnt i ophavsangivelsen, men som er tillagt ansvaret for det intellektuelle eller kunstneriske indhold af værket, om variantformer af navne, der optræder i ressourcen, om ændringer i ophavsangivelser eller om andre detaljer der knytter sig til ophavsangivelsen. @da
definition: Relates a resource to note on resource that provides information on an agent, and their function, who is responsible for a resource.
definition: Setzt eine Ressource in Beziehung zu einer Anmerkung zur Ressource, die Informationen über einen Akteur und dessen Funktion enthält, der für eine Ressource verantwortlich ist. @de
definition: يربط بين مصدر وتبصرة عن مصدر يوفر معلومات عن وكيل، ووظيفته، ومن مسؤول عن المصدر. @ar
definition: 将一种资源与提供关于对资源负责的行为者及其职能的信息的关于资源的附注关联起来。 @zh-hans

has note on series statement
lexical alias: noteOnSeriesStatement.en
status: Published
type: Property
label: har note til seriebeskrivelse @da
label: hat Anmerkung zur Gesamttitelangabe @de
label: heeft noot bij reeksvermelding @nl
label: huomautus aineiston sarjamerkinnöstä @fi
label: seri bildirimi hakkında not ile ilişkilidir @tr
label: sorozati közlésről szóló megjegyzése a következő: @hu
label: له تبصرة عن بيان السلسلة @ar
label: 有关于丛编说明的附注 @zh-hans
sub property of: has note on resource
definition: Bir kaynağı, kaynağın ilişkili olduğu bir dizi hakkında bilgi sağlayan kaynak notu ile ilişkilendirir. @tr
definition: Hozzákapcsol egy forrást egy forrásra tett megjegyzéshez, amely információt nyújt a forráshoz kapcsolódó sorozatról. @hu
definition: Liittää aineiston lisätietoon aineistoon liittyvästä sarjasta. @fi
definition: Relaterer en ressource til en note, der giver oplysninger om kompleks seriebetegnelse eller ukorrekt nummerering i serien, om ændringer i seriebeskrivelse eller om andre oplysninger relateret til seriebeskrivelsen. @da
definition: Relates a resource to a note on resource that provides information on a series with which a resource is associated.
definition: Setzt eine Ressource in Beziehung zu einer Anmerkung zur Ressource, die Informationen über eine Reihe enthält, mit der eine Ressource in Verbindung steht. @de
definition: يربط بين مصدر وتبصرة عن مصدر يوفر معلومات عن السلسلة التي يرتبط بها المصدر. @ar
definition: 将一种资源与提供关于和资源有关的丛编的信息的一个关于资源的附注关联起来。 @zh-hans

has note on copyright date
lexical alias: noteOnCopyrightDate.en
status: Published
type: Property
label: a copyright időpontról szóló megjegyzése a következő: @hu
label: har note om copyrightår @da
label: hat Anmerkung zum Copyright-Datum @de
label: heeft noot bij copyrightdatum @nl
label: huomautus aineiston copyright-vuodesta @fi
label: telif tarihi hakkında not ile ilişkilidir @tr
label: له تبصرة عن تاريخ حق النشر @ar
label: 有关于版权日期的附注 @zh-hans
sub property of: has note on resource
definition: Bir kaynağı, telif hakkı tarihi hakkında bilgi sağlayan kaynak notu ile ilişkilendirir. @tr
definition: Hozzákapcsol egy forrást egy forrásra tett megjegyzéshez, amely információt nyújt a copyright időpontjáról. @hu
definition: Liittää aineiston lisätietoon copyright-vuodesta. @fi
definition: Relaterer en ressource til en note, der giver oplysninger om copyrightår, der ikke er registreret som en del af copyrightangivelsen. @da
definition: Relates a resource to a note on resource that provides information on a copyright date.
definition: Setzt eine Ressource in Beziehung zu einer Anmerkung zur Ressource, die Informationen über ein Copyright-Datum enthält. @de
definition: يربط بين مصدر وتبصرة عن مصدر يوفر معلومات عن تاريخ حق النشر. @ar
definition: 将一种资源与提供关于版权日期信息的一个关于资源的附注关联起来。 @zh-hans

has note on dimensions of resource
lexical alias: noteOnDimensionsOfResource.en
status: Published
type: Property
label: a forrás méretéről szóló megjegyzése a következő: @hu
label: har note om ressources størrelse @da
label: hat Anmerkung zu Maßen eines Exemplars @de
label: heeft noot bij afmetingen van resource @nl
label: huomautus aineiston koosta @fi
label: kaynağın boyutları hakkında not ile ilişkilidir @tr
label: له تبصرة عن أبعاد المصدر @ar
label: 有关于资源尺寸的附注 @zh-hans
sub property of: has note on resource
definition: Bir kaynağı, kaynağın boyutları hakkında bilgi sağlayan kaynak notu ile ilişkilendirir. @tr
definition: Hozzákapcsol egy forrást egy forrásra tett megjegyzéshez, amely információt nyújt egy forrás méretérőll. @hu
definition: Liittää aineiston lisätietoon aineiston koosta. @fi
definition: Relaterer en ressource til en note, der giver oplysninger om en ressources størrelse, der ikke er registreret som en del af størrelsesangivelsen. @da
definition: Relates a resource to a note on resource that provides information on the dimensions of a resource.
definition: Setzt eine Ressource in Beziehung zu einer Anmerkung zur Ressource, die Informationen über die Maße einer Ressource enthält. @de
definition: يربط بين مصدر وتبصرة عن مصدر توفر معلومات عن أبعاد مصدر. @ar
definition: 将一种资源与提供关于资源尺寸信息的一个关于资源的附注关联起来。 @zh-hans

has note on extent of resource
lexical alias: noteOnExtentOfResource.en
status: Published
type: Property
label: a forrás terjedelméről szóló megjegyzése a következő: @hu
label: har note om omfang af ressource @da
label: hat Anmerkung zum Umfang eines Exemplars @de
label: heeft noot bij omvang van resource @nl
label: huomautus aineiston laajuudesta @fi
label: kaynağın kapsamı hakkında not ile ilişkilidir @tr
label: له تبصرة عن عدد صفحات المصدر @ar
label: 有关于资源数量的附注 @zh-hans
sub property of: has note on resource
definition: Bir kaynağı, kaynağın kapsamı hakkında bilgi sağlayan kaynak notu ile ilişkilendirir. @tr
definition: Hozzákapcsol egy forrást egy forrásra tett megjegyzéshez, amely információt nyújt egy forrás terjedelméről. @hu
definition: Liittää aineiston lisätietoon aineiston laajuudesta. @fi
definition: Relaterer en ressource til en note, der giver oplysninger om en ressources omfang, der ikke er registreret som en del af omfangsangivelsen. @da
definition: Relates a resource to a note on resource that provides information on the extent of a resource.
definition: Setzt eine Ressource in Beziehung zu einer Anmerkung zur Ressource, die Informationen über den Umfang einer Ressource enthält. @de
definition: يربط بين مصدر وتبصرة عن مصدر يوفر معلومات عن عدد صفحات المصدر @ar
definition: 将一种资源与提供关于资源数量信息的一个关于资源的附注关联起来。 @zh-hans

has note on numbering of sequence
lexical alias: noteOnNumberingOfSequence.en
status: Published
type: Property
label: har note om periodikanummerering @da
label: hat Anmerkung zur Zählung einer fortlaufenden Ressource @de
label: heeft noot bij nummering van volgorde @nl
label: huomautus aineiston numerointijaksosta @fi
label: sorrendiség számozásáról szóló megjegyzése a következő: @hu
label: sıranın numaralandırılması hakkında not ile ilişkilidir @tr
label: له تبصرة عن ترقيم التسلسل @ar
label: 有关于序列编号的附注 @zh-hans
sub property of: has note on resource
definition: Bir kaynağı, kaynağın yinelemelerinin veya münferit parçalar sırasını belirtmek için kullanılan belirleyici aralığı hakkında bilgi sağlayan not ile ilişkilendirir. @tr
definition: Hozzákapcsol egy forrást egy megjegyzéshez, amely információt nyújt egy forrás egyes részeinek vagy iterációinak sorrendjét mutató jelöléstartományról. @hu
definition: Liittää aineiston lisätietoon määritteiden jonosta. Määritteiden jonoa käytetään ilmaisemaan aineiston yksittäisten osien tai iteraatioiden peräkkäisyyttä. @fi
definition: Relaterer en ressource til en note, der giver oplysninger om nummereringen af første og/eller sidste nummer eller del, om kompleks eller uregelmæssig nummerering (inkl. nummereringsfejl), om den periode, der dækkes af et bind, et nummer, en del etc., eller om andre oplysninger relateret til nummerering af periodika. @da
definition: Relates a resource to a note providing information on the range of designators that is used to indicate a sequence of the individual parts or iterations of a resource.
definition: Setzt eine Ressource in Beziehung zu einer Anmerkung, die Informationen zur Reihenfolge der einzelnen Ausgaben einer fortlaufenden Ressource enthält. @de
definition: يربط بين مصدر وتبصرة توفر معلومات عن مجموعة من الترقيمات المستخدمة لتحديد تسلسل أجزاء أو تكرارات فردية لمصدر. @ar
definition: 将一种资源与提供关于用于表示一种资源的个别部分或更新后整体的序列的标识范围的信息的附注关联起来。 @zh-hans

has note on title
lexical alias: noteOnTitle.en
status: Published
type: Property
label: a címről szóló megjegyzése a következő: @hu
label: başlık hakkında not ile ilişkilidir @tr
label: har note om titel @da
label: hat Anmerkung zum Titel @de
label: heeft noot bij titel @nl
label: huomautus aineiston nimekkeestä @fi
label: له تبصرة عن عنوان @ar
label: 有关于题名的附注 @zh-hans
sub property of: has note on resource
definition: Bir kaynağı, başlıklarda görünen yanlışlıklar, başlıklardaki karmaşık değişiklikler hakkında veya başlıkla ilgili diğer bilgileri sağlayan kaynak notu ile ilişkilendirir. @tr
definition: Hozzákapcsol egy forrást egy megjegyzéshez, amely információt nyújt a forrásról, amelyből a címet vették, az időpontról, amikor a címet megnézték, a címek változatairól, a pontatlanságokról, törlésekről stb. vagy más, a címmel kapcsolatos információkról. @hu
definition: Liittää aineiston lisätietoon nimekkeiden epätarkkuuksista, nimekkeiden vaihteluista tai muuta nimekkeeseen liittyvää tietoa. @fi
definition: Relaterer en ressource til en note, der giver oplysninger om titlens kilde, den dato, hvor titlen blev set, titelvariationer, unøjagtigheder, sletninger etc. eller om andre oplysninger relateret til en titel. @da
definition: Relates a resource to a note on resource that provides information on inaccuracies appearing in titles, complex changes in titles, or on other information relating to a title.
definition: Setzt eine Ressource in Beziehung zu einer Anmerkung zur Ressource, die Informationen über Ungenauigkeiten in Titeln, unübersichtliche Änderungen in Titeln oder andere Informationen, die sich auf den Titel beziehen, enthält. @de
definition: يربط بين مصدر وتبصرة عن مصدر يوفر معلومات عن الأخطاء التي تظهر في العناوين، أو التغيرات المعقدة في العناوين، أو أي معلومات أخرى متعلقة بعنوان. @ar
definition: 将一种资源与提供关于题名出现不准确性、题名复杂变化或其他与题名相关信息的关于资源的附注关联起来。 @zh-hans

has note on edition statement
lexical alias: noteOnEditionStatement.en
status: Published
type: Property
label: a kiadási közlésről szóló megjegyzése a következő: @hu
label: basım bildirimi hakkında not ile ilişkilidir @tr
label: har note til udgavebeskrivelse @da
label: hat Anmerkung zum Ausgabevermerk @de
label: heeft noot bij editievermelding @nl
label: huomautus aineiston painosmerkinnöstä @fi
label: له تبصرة عن بيان الطبعة @ar
label: 有关于版本的附注 @zh-hans
sub property of: has note on resource
definition: Bir kaynağı, kaynağın basımı hakkında bilgi sağlayan kaynak notu ile ilişkilendirir. @tr
definition: Hozzákapcsol egy forrást egy forrásra tett megjegyzéshez, amely információt nyújt egy forrás kiadásáról. @hu
definition: Liitää aineiston lisätietoon painosmerkinnöstä. @fi
definition: Relaterer en ressource til en note, der giver oplysninger om kilden til en udgavebeskrivelse, om udgavebeskrivelse relateret til numre, dele etc., om ændringer i udgavebeskrivelse eller om andre oplysninger relateret til en udgavebeskrivelse. @da
definition: Relates a resource to a note on resource that provides information on an edition of a resource.
definition: Setzt eine Ressource in Beziehung zu einer Anmerkung zur Ressource, die Informationen über eine Ausgabe einer Ressource enthält. @de
definition: يربط بين مصدر وتبصرة عن مصدر يوفر معلومات عن الطبعة الخاصة بمصدر. @ar
definition: 将一种资源与提供关于资源版本信息的关于资源的附注关联起来。 @zh-hans

is adapted as novel
lexical alias: adaptedAsNovel.en
status: Published
type: Property
label: er bearbjdet til roman @da
label: is bewerkt als roman @nl
label: ist bearbeitet als Roman @de
label: regényként való feldolgozása a következő: @hu
label: romaanimukaelma-aineisto @fi
label: roman olarak uyarlanmıştır @tr
label: هو مقتبس كرواية @ar
label: 被改编为小说 @zh-hans
sub property of: is adapted as
inverse of: is novelization of
definition: Bir kaynağı, başka kaynaktan uyarlanan roman ile ilişkilendirir. @tr
definition: Hozzákapcsol egy forrást egy regényhez, amelyet egy másik forrásból dolgoztak át. @hu
definition: Liittää aineiston toisesta aineistosta sovitettuun romaaniin. @fi
definition: Relaterer en ressource til en roman bearbejdet ud fra en oprindelig ressource. @da
definition: Relates a resource to a novel adapted from another resource.
definition: Setzt eine Ressource in Beziehung zu einem Roman, der auf einer anderen Ressource basiert. @de
definition: يربط بين مصدر ورواية مقتبسة من مصدر آخر. @ar
definition: 将一种资源与改编自另一种资源的一种小说关联起来。 @zh-hans

has publisher number for notated music
lexical alias: publisherNumberForNotatedMusic.en
status: Published
type: Property
label: har udgivers editionsnummer for noteret musik @da
label: hat Noten-Bestellnummer @de
label: heeft uitgeversnummer voor bladmuziek @nl
label: kiadói műjegyzékszáma a következő: @hu
label: kustantajan nuottiaineistolle antama numero @fi
label: notaya alınmış müzik için yayıncı numarası ile ilişkilidir @tr
label: له رقم ناشر لموسيقى مدونة. @ar
label: 有乐谱的出版者编号 @zh-hans
sub property of: has identifier for resource
inverse of: is publisher number for notated music of
definition: Bir kaynağı, bir yayıncı tarafından müzik notası haline getirilmiş kaynağına verilen bir numaralandırma belirteciyle ilişkilendirir. @tr
definition: Hozzákapcsol egy forrást egy kiadó által egy zenei lejegyzésnek adott számozásjelöléshez. @hu
definition: Liittää aineiston musiikin kustantajan nuottiaineistolle antamaan tunnisteeseen. @fi
definition: Relaciona un recurs amb un nomen que és un identificador de recurs diferent d’un número de planxa per a música notada, assignat per un editor a un recurs de música notada. @ca
definition: Relaterer en ressource til en nummereringsbetegnelse givet til en noteret musikressource af en udgiver. @da
definition: Relates a resource to a nomen that is an identifier for resource other than a plate number for notated music, assigned by a publisher to a notated music resource.
definition: Setzt eine Ressource in Beziehung zu einer Bezeichnung einer Zählung, die einer notierten Musikressource vom Verlag zugewiesen wird. @de
definition: يربط بين مصدر وترقيم محدد خصصه ناشر لمصدر موسيقى مدونة. @ar
definition: 将一种资源与作为出版者给一种乐谱资源分配的除乐谱版号以外的一种资源的标识符的一个命名关联起来。 @zh-hans
scope note: A kiadói műjegyzékszám néha magába foglal kezdőbetűket, rövidítéseket vagy a kiadót megnevező szavakat. @hu
scope note: A publisher number for notated music sometimes includes initials, abbreviations, or words identifying the publisher.
scope note: Editionsnummer for noteret musik indeholder sommetider initialer, forkortelser eller ord der identificerer udgiveren. @da
scope note: Eine Noten-Bestellnummer enthält manchmal Initialen, Abkürzungen oder Wörter, die den Verlag identifizieren. @de
scope note: Kustantajan nuottiaineistolle antama numero, joka voi sisältää kustantajaa identifioivia sanoja, lyhenteitä tai kirjaimia. @fi
scope note: Notalı müziğin yayımcı numarası kimi zaman baş harfleri, kısaltmaları veya yayımcıyı tanımlanan sözcükleri içerir. @tr
scope note: يتضمن رقم الناشر لموسيقى مدونة أحيانًا استهلاليات، إختصارات، أو كلمات التى تُعرّف بالناشر. @ar
scope note: 乐谱的出版者编号有时候包括标识出版社的首字母缩写、缩略语或单词。 @zh-hans

has plate number for notated music
lexical alias: plateNumberForNotatedMusic.en
status: Published
type: Property
label: har pladenummer for noteret musik @da
label: hat Druckplattennummer für Noten @de
label: heeft plaatnummer voor bladmuziek @nl
label: notaya alınmış müziğin plaka numarası ile ilişkilidir @tr
label: nuottiaineiston laattanumero @fi
label: zenei műjegyzéki lemezszáma a következő: @hu
label: له رقم لوحة لمدونة موسيقية @ar
label: 有乐谱版号 @zh-hans
sub property of: has identifier for resource
inverse of: is plate number for notated music of
definition: Bir kaynağı, bir yayıncı tarafından müzik notası haline getirilmiş kaynağına verilen bir numaralandırma belirteciyle ilişkilendirir. @tr
definition: Hozzákapcsol egy forrást egy kiadó által egy zenei lejegyzésnek adott számozásjelöléshez. @hu
definition: Liittää aineiston kustantajan nuottikirjoitukselle antamaan laattanumeroon. @fi
definition: Relaciona un recurs amb un nomen que és un identificador de recurs diferent d’un número d’editor de música notada, assignat per un editor a un recurs de música notada per indicar la planxa d’impressió usada en el procés d’impressió. @ca
definition: Relaterer en ressource til en noteret musikressource af en udgiver. @da
definition: Relates a resource to a nomen that is an identifier for resource other than a publisher number for notated music, assigned by a publisher to a notated music resource to indicate the printing plate used in the printing process.
definition: Setzt eine Ressource in Beziehung zu einer Bezeichnung einer Zählung, die einer notierten Musikressource vom Verlag zugewiesen wird. @de
definition: يربط بين مصدر وترقيم محدد خصصه ناشر لمصدر موسيقى مدونة. @ar
definition: 将一种资源与作为出版者给一种资源分配以表示印刷过程中所用印版的除乐谱出版者编号以外的一种资源的标识符的一个命名关联起来。 @zh-hans
scope note: A plate number for notated music sometimes includes initials, abbreviations, or words identifying the publisher. It is sometimes followed by a number corresponding to the number of pages or plates or a number corresponding to an individual page or plate.
scope note: A zenei műjegyzéki lemezszám néha magába foglal kezdőbetűket, rövidítéseket vagy a kiadót megnevező szavakat. Időnként egy az oldalak vagy a lemezek számának, vagy egyedi oldalnak vagy lemeznek megfelelő szám követi. @hu
scope note: Eine Druckplattennummer für Noten enthält manchmal Initialen, Abkürzungen oder Wörter, die den Verlag identifizieren. Ihr folgt manchmal eine Zahl, die der Zahl der Seiten oder Platten entspricht oder eine Zahl, die einer einzelnen Seite oder Platte entspricht. @de
scope note: Notaları yazılan müziğin plak numarası kimi zaman baş harfleri, kısaltmaları veya yayımcıyı tanımlanan sözcükleri içerir. Bazen ardına sayfa veya plak sayısına karşılık gelen bir numara ya da münferit sayfa veya plağa karşılık gelen bir numara gelir. @tr
scope note: Nuottiaineiston laattanumero sisältää joskus kustantajaa identifioivia alkukirjaimia, lyhenteitä tai sanoja. Numeron perässä voi olla vastaavien sivujen tai laattojen numerot tai yksittäisten sivujen ja laattojen numerot. @fi
scope note: Pladenummer for noteret musik indeholder sommetider initialer, forkortelser eller ord der identificerer udgiveren og følges sommetider af et nummer der tilsvarer antallet af sider eller plader. @da
scope note: يتضمن رقم لوحة لموسيقى مدونة أحيانًا استهلاليات، إختصارات، أو كلمات التى تُعرّف بالناشر.يُتبع أحيانًا برقم يشير إلى رقم الصفحات أو اللوحات أو رقم يشير إلى صفحة أو لوحة واحدة. @ar
scope note: 乐谱的版号有时候包括标识出版社的首字母缩写、缩略语或单词。乐谱的版号有时候后接对应于页数或版数的一个数字或者对应于一个个别页或版的一个数字。 @zh-hans

has conductor
has subproperty: has choral conductor
has subproperty: has instrumental conductor
lexical alias: conductor.en
status: Published
type: Property
label: har dirigent @da
label: hat Dirigentin/Dirigent @de
label: heeft dirigent @nl
label: johtaja aineistossa @fi
label: karmestere a következő: @hu
label: orkestra şefi ile ilişkilidir @tr
label: له قائد @ar
label: 有指挥 @zh-hans
sub property of: has performer
inverse of: is conductor of
definition: Bir kaynağı, müzikal veya dramatik gösterimde performans sergileyen bir gruba liderlik ederek müzikal kaynağa katkıda bulunan bir sanatçı olan temsilci ile ilişkilendirir. @tr
definition: Hozzákapcsol egy forrást egy előadó ágenshez, amely hozzájárul egy zenei forráshoz azzal, hogy előadói csoportot vezet egy zenei vagy drámai stb. bemutatóban. @hu
definition: Liittää aineiston toimijaan, joka on osallisena musiikkiaineistoon johtamalla esiintyjäryhmää musiikki- tai näytelmäesityksessä. @fi
definition: Relaterer en ressource til en performer, der har bidraget til en musikressource af ved at lede en udøvende gruppe i en musikalsk eller dramatisk præsentation etc. @da
definition: Relates a resource to an agent who is a performer who contributes to a musical resource by leading a performing group in a musical or dramatic presentation.
definition: Setzt eine Ressource in Beziehung zu einer Ausführenden/einem Ausführenden, die/der zu einer Musikressource beiträgt, indem sie/er ein aufführendes Ensemble in einer musikalischen oder dramatischen Darbietung leitet. @de
definition: يربط مصدر بوكيل يُمثل مؤدِ يُساهم في مصدر موسيقي من خلال قيادة فرقة عزف في عرض موسيقي أو درامي. @ar
definition: 将一种资源与作为一个表演者对一种音乐资源有领导音乐或戏剧呈现中表演团体的贡献的一个行为者关联起来。 @zh-hans

has actor
has subproperty: has voice actor
lexical alias: actor.en
status: Published
type: Property
label: aktör ile ilişkilidir @tr
label: har skuespiller @da
label: hat Schauspielerin/Schauspieler @de
label: heeft acteur @nl
label: näyttelijä aineistossa @fi
label: színésze a következő: @hu
label: له ممثل @ar
label: 有演员 @zh-hans
sub property of: has performer
inverse of: is actor of
definition: Bir kaynağı, müzikal veya dramatik gösterimde oyuncu veya kast olarak kaynağa katkıda bulunan bir sanatçı olan temsilci ile ilişkilendirir. @tr
definition: Hozzákapcsol egy forrást egy előadó ágenshez, amely hozzájárul egy forráshoz azzal, hogy szereposztás tagjaként vagy előadóként működik közre egy zenei, drámai stb. bemutatóban. @hu
definition: Liittää aineiston henkilöön, joka on aineistossa osallisena esiintyjänä näyttelemällä tai soittamalla musiikki- tai näytelmäesityksessä. @fi
definition: Relaterer en ressource til en performer, der har bidraget til en ressource ved at fungere som rolleindehaver eller aktør i en musikalsk eller dramatisk præsentation etc. @da
definition: Relates a resource to an agent who is a performer who contributes to a resource by acting as a cast member or player in a musical or dramatic presentation.
definition: Setzt eine Ressource in Beziehung zu einer Ausführenden/einem Ausführenden, die/der zu einer Ressource als Ensemble-Mitglied oder Darstellerin/Darsteller in einer musikalischen oder dramatischen Darbietung und so weiter beiträgt. @de
definition: يربط مصدر بوكيل يُمثل مؤدِ يُساهم في مصدر من خلال عمله كعضو فريق تمثيل أو كعازف في عرض موسيقي أو درامي. @ar
definition: 将一种资源与作为一个表演者通过在音乐或戏剧呈现中扮演角色或演奏（演唱）对一种资源有贡献的一个行为者关联起来。 @zh-hans

has onscreen presenter
see also: has onscreen participant
lexical alias: onscreenPresenter.en
status: Published
type: Property
label: ekran sunucusu ile ilişkilidir @tr
label: esittelijä aineistossa @fi
label: har programvært @da
label: hat On-Screen-Präsentatorin/On-Screen-Präsentator @de
label: heeft presentator op beeld @nl
label: képernyőn megjelenő előadó a következő: @hu
label: له مُقدم برامج على الشاشة @ar
label: 有屏幕主持人 @zh-hans
sub property of: has performer
inverse of: is onscreen presenter of
definition: Bir kaynağı, bağlamsal veya arka plan bilgisi sağlamak için ekranda görünerek kaynağa katkıda bulunan sunucu ile ilişkilendirir. Ekran sunucusu, kurgu olmayan hareketli görüntü materyallerinde veya kurgu olan hareketli görüntülerin tanıtımlarında görünebilir. @tr
definition: Hozzákapcsol egy forrást egy előadóhoz, aki képernyőn jelenik meg és szövegösszefüggésre vonatkozó vagy háttérinformációt szolgáltat, hozzájárulva ezzel egy forráshoz. Egy képernyőn megjelenő előadó tényszerű mozgókép-anyagokban vagy fikciós mozgóképanyagok bevezetőiben látható. @hu
definition: Liittää aineiston esiintyjään, joka on aineistossa osallisena esiintymällä televisiossa tai elokuvassa taustatiedon antajana. Voi esiintyä dokumentaarisissa elokuvissa tai fiktioelokuvien johdannoissa. @fi
definition: Relaciona un recurs amb un agent que és un intèrpret que contribueix a un recurs apareixent en pantalla per proporcionar informació contextual o dels antecedents. @ca
definition: Relaterer en ressource til en performer, der har bidraget til en ressource ved at vise sig på skærmen for at give kontekstuel eller baggrundsinformation. @da
definition: Relates a resource to an agent who is a performer who contributes to a resource by appearing on screen to provide contextual or background information.
definition: Setzt eine Ressource in Beziehung zu einer Ausführenden/einem Ausführenden, die/der zu einer Ressource beiträgt, indem sie/er auf dem Bildschirm erscheint, um Kontext- und Hintergrundinformationen zu liefern. @de
definition: يربط بين مصدر ومؤدٍ يُساهم في مصدر من خلال الظهور على الشاشة لتقديم معلومات تتعلق بالسياق أو الخلفية.قد يظهر مقدم عرض على الشاشة في مواد الصور المتحركة غير الخيالية أو أثناء تقديم مواد لصور متحركة خيالية. @ar
definition: 将一种资源与作为一个表演者通过出现在屏幕上提供语境或背景信息对一种资源有贡献的一个行为者关联起来。 @zh-hans
scope note: A tényszerű mozgókép-anyagokban vagy fikciós mozgókép-anyagok bevezetőiben való megjelenés is bele tartozik. Képernyőn nem előadói szerepben való megjelenés nem tartozik bele. @hu
scope note: Appearance in nonfiction moving image materials or in introductions to fiction moving image materials is included. Appearance on screen in a non-performing role is excluded.
scope note: Darunter fallen Auftritte in nicht-fiktionalen Bewegtbildmaterialien oder in Einführungen zu fiktionalen Bewegtbildmaterialien. Darunter fallen keine Bildschirmauftritte in einer passiven Rolle. @de
scope note: Koskee dokumentaarisessa elokuvassa tai fiktiivisen elokuvan johdannossa esiintymistä. @fi
scope note: Kurgusal olmayan hareketli görüntü materyallerinde veya kurgu hareketli görüntü materyallerine girişlerinde yer alma dahildir. Performans göstermeyen bir rolde ekranda yer alma hariçtir. @tr
scope note: Optræden i levende billedmaterialer af faktuel karakter eller i introduktioner til levende billedmaterialer af fiktiv karakter er omfattet. Optræden på skærmen i en ikke-fremførende rolle er ikke omfattet. @da
scope note: يتم تضمين الظهور في مواد الصور المتحركة غير الخيالية أو أثناء تقديم مواد لصور متحركة خيالية.يُستبعد من ذلك الظهور على الشاشة في دور غير مؤدِ. @ar
scope note: 包括在非虚构动态图像资料中或者在虚构动态图像资料的介绍中的出现。不包括在屏幕中作为非表演角色的出现。 @zh-hans

has dancer
lexical alias: dancer.en
status: Published
type: Property
label: dansçı ile ilişkilidir @tr
label: har danser @da
label: hat Tänzerin/Tänzer @de
label: heeft danser @nl
label: tanssija aineistossa @fi
label: táncosa a következő: @hu
label: له راقص @ar
label: 有舞蹈者 @zh-hans
sub property of: has performer
inverse of: is dancer of
definition: Bir kaynağı, müzikal veya dramatik gösterimde dans ederek müzikal kaynağa katkıda bulunan bir sanatçı olan temsilci ile ilişkilendirir. @tr
definition: Hozzákapcsol egy forrást egy előadó ágenshez, aki hozzájárul egy forráshoz azzal, hogy egy zenei, drámai stb. bemutatóban táncol. @hu
definition: Liittää aineiston toimijaan, joka on aineistossa osallisena esiintyjänä tanssimalla musiikki-, näytelmä-tms. esityksessä. @fi
definition: Relaterer en ressource til en performer, der har bidraget til en ressource ved at danse i en musikalsk eller dramatisk præsentation etc. @da
definition: Relates a resource to an agent who is a performer who contributes to a resource by dancing in a musical or dramatic presentation.
definition: Setzt eine Ressource in Beziehung zu einer Ausführenden/einem Ausführenden, die/der zu einer Ressource beiträgt, indem sie/er in einer musikalischen, dramatischen oder ähnlichen Darbietung tanzt. @de
definition: يربط مصدر بوكيل يُمثل مؤدِ يُساهم في مصدر من خلال الرقص في عرض موسيقي أو درامي. @ar
definition: 将一种资源作为一个表演者通过在音乐或戏剧呈现中舞蹈对一种资源有贡献的一个行为者关联起来。 @zh-hans

has instructor
lexical alias: instructor.en
status: Published
type: Property
label: har lærer @da
sub property of: has performer
inverse of: is instructor of
definition: Relaterer en ressource til en optrædende, der har bidraget til en ressource ved at give instruktion eller en demonstration. @da
definition: Relates a resource to an agent who is a performer who contributes to a resource by teaching or providing a demonstration.

has host
lexical alias: host.en
status: Published
type: Property
label: har vært @da
label: heeft gastgever @nl
label: házigazdája a következő: @hu
label: ist Gastgeberin/Gastgeber @de
label: juontaja aineistossa @fi
label: sunucu ile ilişkilidir @tr
label: له مُضِيف @ar
label: 有主持人 @zh-hans
sub property of: has performer
inverse of: is host of
definition: Bir kaynağı, başka sanatçıları içeren bir programa, sıklıkla radyo ve televizyon yayınına liderlik ederek kaynağa katkıda bulunan bir sanatçı olan temsilci ile ilişkilendirir. @tr
definition: Hozzákapcsol egy forrást egy előadó ágenshez, amely hozzájárul egy forráshoz egy program, gyakran sugárzott műsor, vezetésével, amelyben más vendégek, előadók stb. is közreműködnek. @hu
definition: Liittää aineiston toimijaan, joka on on osallisena (useimmiten lähetettyyn) ohjelmaan, johon osallistuu muita esiintyjiä. @fi
definition: Relaterer en ressource til en performer, der har bidraget til en ressource ved at lede et program, ofte transmitteret, der omfatter andre gæster, optrædende etc. @da
definition: Relates a resource to an agent who is a performer who contributes to a resource by leading a program, often broadcast, that includes other performers.
definition: Setzt eine Ressource in Beziehung zu einer Ausführenden/einem Ausführenden, die/der zu einer Ressource beiträgt, indem sie/er eine Veranstaltung (meist eine Sendung) leitet, an der auch andere Ausführende teilnehmen. @de
definition: يربط مصدر بوكيل يُمثل مؤدِ يُساهم في مصدر من خلال إدارة برنامج، غالبًا مُذاع، ويستضيف ضيوفًا وفنانين ووكلاءآخرين. @ar
definition: 将一种资源与作为一个表演者通过主导节目（经常是广播节目）并包括其他表演者而对一种资源有贡献的一个行为者关联起来。 @zh-hans

has moderator
lexical alias: moderator.en
status: Published
type: Property
label: har ordstyrer @da
label: hat Moderatorin/Moderator @de
label: heeft moderator @nl
label: moderatör ile ilişkilidir @tr
label: moderoija aineistossa @fi
label: moderátora a következő: @hu
label: له رئيس جلسة @ar
label: 有谈话类节目主持人 @zh-hans
sub property of: has performer
inverse of: is moderator of
definition: Bir kaynağı, genellikle tartışma konusu ile ilgili alanlarda uzman olan kişilerin katılımıyla konuların tartışıldığı, sıklıkla radyo ve televizyonda yayınlanan bir programa katılarak, kaynağa katkıda bulunan sunucu ile ilişkilendirir. @tr
definition: Hozzákapcsol egy forrást egy előadóhoz, aki hozzájárul egy forráshoz egy program, gyakran sugárzott műsor, vezetésével, ahol témákat vitatnak meg, rendszerint a beszélgetés témájában jártas szakértők részvételével. @hu
definition: Liittää aineiston esittäjään, joka on aineistossa osallisena juontamalla (usein lähetettyä) ohjelmaa, jossa keskustellaan eri aiheista, tavallisesti keskusteluun liittyvien aiheiden asiantuntijoiden kanssa. @fi
definition: Relaciona un recurs amb un agent que és un intèrpret que contribueix a un recurs liderant un programa, sovint emès, on es discuteixen temes, habitualment amb la participació d’experts en els camps relacionats amb la discussió. @ca
definition: Relaterer en ressource til en optrædende, der har bidraget til en ressource ved at lede et program, ofte transmitteret, hvor emner diskuteres, normalt med deltagelse af fagfolk inden for felter, der er relateret til diskussionen. @da
definition: Relates a resource to an agent who is a performer who contributes to a resource by leading a program, often broadcast, where topics are discussed, usually with participation of experts in fields related to the discussion.
definition: Setzt eine Ressource in Beziehung zu einer Ausführenden/einem Ausführenden, die/der zu einer Ressource beiträgt, indem sie/er eine Veranstaltung (meist eine Sendung) leitet, in der Themen üblicherweise mit Expertinnen/Experten diskutiert werden. @de
definition: يربط بين مصدر ومؤدِ يُساهم في مصدر من خلال إدارة برنامج، غالبًا مُذاع، حيث تتم مناقشة موضوعات، عادةً بمشاركة خبراء في المجالات المتعلقة بموضوع النقاش. @ar
definition: 将一种资源与作为一个表演者通过主导节目（经常是广播节目，其中讨论话题，通常有讨论相关领域专家参与）对一种资源有贡献的一个行为者关联起来。 @zh-hans

has puppeteer
lexical alias: puppeteer.en
status: Published
type: Property
label: bábjátékosa a következő: @hu
label: har dukkefører @da
label: hat Puppenspielerin/Puppenspieler @de
label: heeft poppenspeler @nl
label: kuklacı ile ilişkilidir @tr
label: nukettaja aineistossa @fi
label: له محرك عرائس @ar
label: 有木偶表演者 @zh-hans
sub property of: has performer
inverse of: is puppeteer of
definition: Bir kaynağı, hareketli görüntü üretiminde ya da müzikal veya dramayla ilgili gösterimde ya da eğlence programında değiştirerek, kontrol ederek veya kukla gibi oynatarak, kaynağa katkıda bulunan sanatçı ile ilişkilendirir. @tr
definition: Hozzákapcsol egy forrást egy olyan előadóhoz, aki hozzájárul egy forráshoz azzal, hogy egy mozgókép-produkcióban, zenei vagy drámai bemutatóban vagy szórakoztató műsorban bábokat vagy marionettfigurákat manipulál, vezérel vagy kezel. @hu
definition: Liittää aineiston esittäjään, joka on aineistoon osalllisena käsittelemällä, kontrolloimalla tai ohjaamalla nukkeja tai marionetteja elokuvatuotannossa tai musiikki- tai näytelmäesityksessä. @fi
definition: Relaciona un recurs amb un agent que és un intèrpret que contribueix a un recurs manipulant, controlant o dirigint titelles o marionetes en una producció d’imatge en moviment o en una representació o un espectacle musical o dramàtic. @ca
definition: Relaterer en ressource til en optrædende, der har bidraget til en ressource ved at manipulere, kontrollere eller styre dukker eller marionetter i en levende billedproduktion eller en musikalsk eller dramatisk præsentation eller i underholdning. @da
definition: Relates a resource to an agent who is a performer who contributes to a resource by manipulating, controlling, or directing puppets or marionettes in a moving image production or a musical or dramatic presentation or entertainment.
definition: Setzt eine Ressource in Beziehung zu einer Ausführenden/einem Ausführenden, die/der zu einer Ressource beiträgt, indem sie/er Puppen oder Marionetten in einer Bewegtbildproduktion oder einer musikalischen oder dramatischen Darbietung oder Aufführung bewegt, kontrolliert oder lenkt. @de
definition: يربط بين مصدر ومؤدِ يُساهم في مصدر من خلال اللعب بالعرائس أو الدمى المتحركة أو التحكم فيها، أو توجيهها في إنتاج لصور متحركة أو في عرض موسيقي أو درامي أو ترفيهي. @ar
definition: 将一种资源与作为一个表演者通过在动态图像制作或者音乐或戏剧呈现或娱乐中操纵、控制、指引木偶对一种资源有贡献的一个行为者关联起来。 @zh-hans

has panelist
lexical alias: panelist.en
status: Published
type: Property
label: har paneldeltager @da
label: hat Diskussionsteilnehmerin/Diskussionsteilnehmer @de
label: heeft panellid @nl
label: panelist ile ilişkilidir @tr
label: panelisti aineistossa @fi
label: vitafórumtagja a következő: @hu
label: له مشارك في برنامج @ar
label: 有访谈嘉宾 @zh-hans
sub property of: has performer
inverse of: is panelist of
definition: Bir kaynağı, genellikle tartışma konusu ile ilgili alanlarda uzman olan kişilerin katılımıyla konuların tartışıldığı, sıklıkla radyo ve televizyonda yayınlanan bir programa katılarak, kaynağa katkı sunan sunucu ile ilişkilendirir. @tr
definition: Hozzákapcsol egy forrást egy előadóhoz, aki egy programban való részvételével hozzájárul egy forráshoz, amely többnyire olyan sugárzott műsor, ahol témákat vitatnak meg, rendszerint a beszélgetés témájában jártas szakértők részvételével. @hu
definition: Liittää aineiston esiintyjään, joka joka osallistuu aineiston tekemiseen osallistumalla ohjelmaan (usein lähetettyyn), jossa keskustellaan eri aiheista tavallisesti keskusteluun liittyvien aiheiden asiantuntijoiden kanssa. @fi
definition: Relaciona un recurs amb un agent que és un intèrpret que contribueix a un recurs participant en un programa, sovint emès, on es discuteixen temes, habitualment amb la participació d’experts en els camps relacionats amb la discussió. @ca
definition: Relaterer en ressource til en optrædende, der har bidraget til en ressource ved at deltage i et program, ofte transmitteret, hvor emner diskuteres, normalt med deltagelse af fagfolk inden for felter relateret til diskussionen. @da
definition: Relates a resource to an agent who is a performer who contributes to a resource by participating in a program, often broadcast, where topics are discussed, usually with participation of experts in fields related to the discussion.
definition: Setzt eine Ressource in Beziehung zu einer Ausführenden/einem Ausführenden, die/der zu einer Ressource beiträgt, indem sie/er an einer Veranstaltung (meist einer Sendung) teilnimmt, in der Themen üblicherweise mit Expertinnen/Experten diskutiert werden. @de
definition: يربط بين مصدر ومؤدِ يُساهم في مصدر من خلال المشاركة في برنامج، غالبًا مُذاع، حيث تتم مناقشة موضوعات، عادةً بمشاركة خبراء في المجالات المتعلقة بموضوع النقاش. @ar
definition: 将一种资源与作为一个表演者通过参与节目（经常是广播节目，其中讨论话题，通常有讨论相关领域专家参与）对一种资源有贡献的一个行为者关联起来。 @zh-hans

has instrumentalist
lexical alias: instrumentalist.en
status: Published
type: Property
label: enstrüman sanatçısı ile ilişkilidir @tr
label: har musiker @da
label: hat Instrumentalmusikerin/Instrumentalmusiker @de
label: heeft instrumentalist @nl
label: instrumentalisti aineistossa @fi
label: zenésze a következő: @hu
label: له عَازِف @ar
label: 有乐器演奏者 @zh-hans
sub property of: has performer
inverse of: is instrumentalist of
definition: Bir kaynağı, müzik enstrümanı çalarak kaynağa katkıda bulunan sanatçı ile ilişkilendirir. @tr
definition: Hozzákapcsol egy forrást egy olyan előadóhoz, aki hangszeren játszik és ezzel hozzájárul egy forráshoz. @hu
definition: Liittää aineiston esittäjään, joka osallistuu aineistoon soittamalla soitinta. @fi
definition: Relaciona un recurs amb un agent que és un intèrpret que contribueix a un recurs tocant un instrument musical. @ca
definition: Relaterer en ressource til en optrædende, der har bidraget til en ressource ved at spille et musikinstrument. @da
definition: Relates a resource to an agent who is a performer who contributes to a resource by playing a musical instrument.
definition: Setzt eine Ressource in Beziehung zu einer Ausführenden/einem Ausführenden, die/der zu einer Ressource beiträgt, indem sie/er ein Musikinstrument spielt. @de
definition: يربط بين مصدر ومؤدِ يُساهم في مصدر من خلال العزف على آلة موسيقية. @ar
definition: 将一种资源与作为一个表演者通过演奏乐器对一种资源有贡献的一个行为者关联起来。 @zh-hans

has commentator
lexical alias: commentator.en
status: Published
type: Property
label: har kommentator @da
label: hat Kommentatorin/Kommentator @de
label: heeft commentator @nl
label: kommentaattorina aineistossa @fi
label: kommentátora a következő: @hu
label: yorumcu ile ilişkilidir @tr
label: له مُعلِق @ar
label: 有解说员 @zh-hans
sub property of: has performer
inverse of: is commentator of
definition: Bir kaynağı, bir kayıt, film veya başka görsel-işitsel ortamda konuya dair yorum, analiz ya da konu hakkında tartışma yaparak kaynağa katkıda bulunan sanatçı ile ilişkilendirir. @tr
definition: Hozzákapcsol egy forrást egy előadóhoz, aki hozzájárul egy forráshoz azzal, hogy a forrás témáihoz értelmezést, elemzést nyújt vagy megvitatja azt egy felvételen, filmen vagy más audiovizuális médiumon. @hu
definition: Liittää toimijan aineistoon, jonka tekemiseen hän osallistuu tulkitsemalla tai analysoimalla äänitteen, elokuvan tai muun audiovisuaalisen aineiston aihetta tai keskustelemalla siitä. @fi
definition: Relaterer en ressource til en optrædende, der har bidraget til en ressource ved at forestå en fortolkning, analyse eller diskussion af det emne, der behandles i en optagelse, film eller andet audiovisuelt medium. @da
definition: Relates a resource to a performer who contributes to a resource by providing interpretation, analysis, or a discussion of the subject matter on a recording, film, or other audiovisual medium.
definition: Setzt eine Ressource in Beziehung zu einer Ausführenden/einem Ausführenden, die/der zu einer Ressource beiträgt, indem sie/er in einer Aufnahme, in einem Film oder in einem anderen audiovisuellen Medium eine Interpretation, eine Analyse oder eine Diskussion des Themas präsentiert. @de
definition: يربط بين مصدر ومؤدِ يُساهم بأحد المصادر من خلال تقديم تفسير للموضوع، أو تحليله، أو مناقشته على تسجيل أو على فيلم، أو على أي وسيط سمعي بصري آخر. @ar
definition: 将一种资源与通过提供关于录像、电影或其他视听媒介中的主要内容之解释、分析或讨论而对一种资源有贡献的一个表演者关联起来。 @zh-hans

has voice actor
lexical alias: voiceActor.en
status: Published
type: Property
label: har dubber @da
label: hat Sprecherin/Sprecher einer Rolle @de
label: heeft stemacteur @nl
label: seslendirme sanatçısı ile ilişkilidir @tr
label: szinkronszínésze a következő: @hu
label: ääninäyttelijänä aineistossa @fi
label: له مُمثل صوتي @ar
label: 有声音演员 @zh-hans
sub property of: has actor
inverse of: is voice actor of
definition: Bir kaynağı, radyo ve ses yapımlarındaki karakterler ve hareketli görüntü kaynaklarındaki animasyon karakterler için ses sağlayarak ve ayrıca radyo ve televizyon reklamlarında, dublajlı kaynaklarda vb. seslendirmeler yaparak bir kaynağa katkıda bulunan bir sanatçı ile ilişkilendirir. @tr
definition: Hozzákapcsol egy forrást egy előadóhoz, aki hozzájárul egy forráshoz azzal, hogy rádió- és audió-produkciók szereplőinek, mozgóképforrások animált karaktereinek adja hangját, valamint rádiós és televíziós reklámokban, szinkronizált forrásokban stb. hangalámondást szolgáltat. @hu
definition: Liittää toimijan aineistoon, jonka tekemiseen hän osallistuu antamalla äänen hahmoille radio- ja äänituotannoissa ja animoiduille hahmoille elokuva-aineistoissa sekä esiintymällä radio- ja TV-mainoksissa, dubatuissa aineistoissa tms. @fi
definition: Relaciona un recurs amb un agent que és un actor que contribueix a un recurs prestant la seva veu als personatges de les produccions radiofòniques i d’àudio i als personatges animats de les obres d’imatge en moviment, així com les veus en off dels anuncis publicitaris de ràdio i televisió, en les expressions doblades, etc. @ca
definition: Relaterer en ressource til en skuespiller, der har bidraget til en ressource ved at lægge stemme til figurer i radio- og audioproduktioner og til animerede figurer i levende billedværker, og ved at indtale tv-reklamer, synkroniserede ressourcer etc. @da
definition: Relates a resource to an agent who is an actor who contributes to a resource by providing the voice for characters in radio and audio productions and for animated characters in moving image resources, as well as by providing voice-overs in radio and television commercials, dubbed resources, etc.
definition: Setzt eine Ressource in Beziehung zu einer Schauspielerin/einem Schauspieler, die/der zu einer Ressource beiträgt, indem sie/er ihre/seine Stimme Charakteren in Hörfunk- und Audioproduktionen und animierten Charakteren in Bewegtbildressourcen leiht, sowie Stimmen in Hörfunk- und Fernsehwerbung, synchronisierten Ressourcen und so weiter spricht. @de
definition: يربط بين مصدر ومؤدِ يُساهم بأحد المصادر من خلال التمثيل الصوتي لشخصيات في الإنتاج الإذاعي والسمعي، وللشخصيات الكرتونية في أعمال الصور المتحركة، إضافة إلى التعليق الصوتي في إعلانات الإذاعة والتليفزيون، والتعبيرات المدبلجة، إلخ. @ar
definition: 将一种资源与作为演员通过为在广播和音频制作中的角色和为动态图像资源中的动画角色提供人声以及为广播和电视广告、混声资源等提供画外音而对一种资源有贡献的一个行为者关联起来。 @zh-hans

has narrator
lexical alias: narrator.en
status: Published
type: Property
label: anlatıcı ile ilişkilidir @tr
label: har fortæller/indlæser @da
label: hat Erzählerin/Erzähler @de
label: heeft verteller @nl
label: kertojana aineistossa @fi
label: narrátora a következő: @hu
label: له راوِ @ar
label: 有旁白者 @zh-hans
sub property of: has performer
inverse of: is narrator of
definition: Bir kaynağı, bir eylemi, oluşumu veya başka bir etkinliği anlatarak veya yüksek sesle okuyarak kaynağa katkıda bulunan bir sanatçı olan temsilci ile ilişkilendirir. @tr
definition: Hozzákapcsol egy forrást egy előadó ágenshez, amely hozzájárul egy forráshoz egy cselekményről, történésről vagy más eseményről szóló beszámoló hangos felolvasásával. @hu
definition: Liittää henkilön aineistoon, jonka tekemiseen hän osallistuu lukemalla ääneen tai kertomalla toiminnasta, tapahtumasta, tapahtumien kulusta tms. @fi
definition: Relaterer en ressource til en optrædende, der har bidraget til en ressource ved at læse højt eller berette om en handling, en hændelse, et begivenhedsforløb etc. @da
definition: Relates a resource to an agent who is a performer who contributes to a resource by reading aloud or giving an account of an act, occurrence, or other event.
definition: Setzt eine Ressource in Beziehung zu einer Ausführenden/einem Ausführenden, die/der zu einer Ressource beiträgt, indem sie/er vorliest oder eine Handlung, ein Geschehnis oder ein anderes Ereignis schildert. @de
definition: يربط مصدر بوكيل مؤدِ يُساهم بأحد المصادر من خلال القراءة بصوت مرتفع أو بسرد فصل من مسرحية، أو واقعة، أو حدث آخر. @ar
definition: 将一种资源与作为一个表演者通过朗读或描述行为、事情或其他事件而对一种资源有贡献的一个行为者关联起来。 @zh-hans

has storyteller
lexical alias: storyteller.en
status: Published
type: Property
label: har kunstnerisk fortæller @da
label: hat Geschichtenerzählerin/Geschichtenerzähler @de
label: heeft verhalenverteller @nl
label: hikaye anlatıcısı ile ilişkilidir @tr
label: tarinankertojana aineistossa @fi
label: történetmesélője a következő: @hu
label: له راوي قصص @ar
label: 有说书人 @zh-hans
sub property of: has performer
inverse of: is storyteller of
definition: Bir kaynağı, bir hikayeyi dramatik veya teatral bir yorumla aktararak bir kaynağa katkıda bulunan bir sanatçı olan temsilci ile ilişkilendirir. @tr
definition: Hozzákapcsol egy forrást egy előadó ágenshez, amely hozzájárul egy forráshoz azzal, hogy egy alkotó eredeti történetét drámai vagy színházi értelmezéssel tolmácsolja. @hu
definition: Liittää toimijan aineistoon, jonka tekemiseen hän osallistuu esittäjänä tekijän alkuperäisen tarinan draamallisella tai teatraalisella tulkinnalla. @fi
definition: Relaterer en ressource til en optrædende, der har bidraget til en ressource ved at gengive en ophavspersons oprindelige historie med dramatisk eller teatralsk fortolkning. @da
definition: Relates a resource to an agent who is a performer who contributes to a resource by relaying a story with dramatic or theatrical interpretation.
definition: Setzt eine Ressource in Beziehung zu einer Ausführenden/einem Ausführenden, die/der zu einer Ressource beiträgt, indem sie/er eine Geschichte mit dramatischer oder theatralischer Interpretation wiedergibt. @de
definition: يربط مصدر بوكيل مؤدِ يُساهم بأحد المصادر من خلال نقل قصة أصلية ووصفها بصورة درامية أو مسرحية. @ar
definition: 将一种资源与作为一个表演者通过用戏剧化解释转达故事而对一种资源有贡献的一个行为者关联起来。 @zh-hans

has speaker
lexical alias: speaker.en
status: Published
type: Property
label: har taler @da
label: hat Rednerin/Redner @de
label: heeft spreker @nl
label: konuşmacı ile ilişkilidir @tr
label: puhujana aineistossa @fi
label: élőszavas előadója a következő: @hu
label: له مُتحدث @ar
label: 有演说者 @zh-hans
sub property of: has performer
inverse of: is speaker of
definition: Bir kaynağı, sözler söyleyerek bir kaynağa katkıda bulunan bir sanatçı olan temsilci ile ilişkilendirir. @tr
definition: Hozzákapcsol egy forrást egy előadó ágenshez, aki egy forráshoz élőszóval járul hozzá. @hu
definition: Liittää toimijan aineistoon, jonka tekemiseen hän osallistuu puhumalla, kuten luennoimalla tai pitämällä puheen tms. @fi
definition: Relaterer en ressource til en optrædende, der har bidraget til en ressource ved at fremføre ord, såsom en forelæsning, tale etc. @da
definition: Relates a resource to an agent who is a performer who contributes to a resource by speaking words.
definition: Setzt eine Ressource in Beziehung zu einer Ausführenden/einem Ausführenden, die/der zu einer Ressource beiträgt, indem sie/er ein Musikinstrument spielt. @de
definition: يربط مصدر بوكيل مؤدِ يُساهم بأحد المصادر من خلال التحدث بكلمات. @ar
definition: 将一种资源与作为一个表演者通过讲话而对一种资源有贡献的一个行为者关联起来。 @zh-hans

has singer
lexical alias: singer.en
status: Published
type: Property
label: har sanger @da
label: hat Sängerin/Sänger @de
label: heeft zanger @nl
label: laulajana ainestossa @fi
label: énekese a következő: @hu
label: şarkıcı ile ilişkilidir @tr
label: له مغنِ @ar
label: 有演唱者 @zh-hans
sub property of: has performer
inverse of: is singer of
definition: Bir kaynağı, müzik üretmek için enstrüman eşliğinde veya eşliksiz olarak sesini kullanarak bir kaynağa katkıda bulunan bir sanatçı olan temsilci ile ilişkilendirir. @tr
definition: Hozzákapcsol egy forrást egy előadó ágenshez, aki hozzájárul egy forráshoz azzal, hogy a hangját használja zene előállítására hangszeres kísérettel vagy anélkül. @hu
definition: Liittää toimijan aineistoon, jonka tekemiseen hän osallistuu esiintymällä lauluäänellä (soitinsäestyksellä tai ilman) tuottaakseen musiikkia. @fi
definition: Relaterer en ressource til en optrædende, der har bidraget til en ressource ved at bruge sin stemme, med eller uden instrumentalledsagelse, til at skabe musik. @da
definition: Relates a resource to an agent who is a performer who contributes to a resource by using their voice, with or without instrumental accompaniment, to produce music.
definition: Setzt eine Ressource in Beziehung zu einer Ausführenden/einem Ausführenden, die/der zu einer Ressource beiträgt, indem sie/er durch ihre/seine Singstimme, mit oder ohne instrumentale Begleitung, Musik erzeugt. @de
definition: يربط مصدر بوكيل مؤدِ يُساهم بأحد المصادر من خلال أداء صوتي، بمصاحبة أو دون مصاحبة آلة موسيقية، لإنتاج أغنية. @ar
definition: 将一种资源与作为一个表演者通过用其人声（不管是否有乐器伴奏）产生音乐而对一种资源有贡献的一个行为者关联起来。 @zh-hans
scope note: En sangers optræden kan omfatte egentlige ord, men gør det ikke nødvendigvis. @da

has medium
lexical alias: medium.en
status: Published
type: Property
label: har medie @da
label: hat Channel @de
label: heeft medium @nl
label: medyum ile ilişkilidir @tr
label: meediona aineistossa @fi
label: médiuma a következő: @hu
label: له وسيط روحاني @ar
label: 有通灵者 @zh-hans
sub property of: has other agent associated with resource (Deprecated)
inverse of: is medium of
definition: Bir kaynağı, ruhlar dünyasıyla iletişimde olduğunu iddia eden bir temsilci ile ilişkilendirir. @tr
definition: Hozzákapcsol egy forrást egy ágenshez, akit a szellemek világával folytatott kommunikáció csatornájának tartanak. @hu
definition: Liittää aineistoon toimijan, jota pidetään kanavana henkimaailman ja maallisen maailman välillä. @fi
definition: Relaterer en ressource til en agent der siges at være en kanal for kommunikation mellem den jordiske verden og en åndevereden. @da
definition: Relates a resource to an agent who claims to be a channel of communication with a world of spirits.
definition: Setzt eine Ressource in Beziehung zu einem Akteur, der sich für einen Kommunikationskanal zwischen der irdischen Welt und einer Geisterwelt hält. @de
definition: يربط مصدر بوكيل يدعي أنه قناة اتصال مع عالم الأرواح. @ar
definition: 将一种资源与声称是和精神世界之间通讯渠道的一个行为者关联起来。 @zh-hans

has other agent associated with a resource (Deprecated)
has subproperty: is audio engineer of
has subproperty: is DJ of
has subproperty: is dubbing director of
has subproperty: is music programmer of
has subproperty: has casting director
lexical alias: otherAgentAssociatedWithAResource.en
status: Deprecated
type: Property
definition: Relates a resource to a person, family, or corporate body other than a creator, custodian, owner, producer, publisher, distributor or manufacturer associated with a manifestation. (Deprecated)
scope note: Book designers, platemakers, etc., agents, etc., to whom correspondence is addressed, agents, etc., honoured by a festschrift, directors, cinematographers, sponsoring bodies, production companies, institutions, etc., hosting an exhibition or event, etc., curators, binders, restorationists, etc., are included.. (Deprecated)

has applied material
has subproperty: has emulsion on microfilm and microfiche
lexical alias: appliedMaterial.en
status: Published
type: Property
label: aineiston päällimateriaali @fi
label: alkalmazott anyaga a következő: @hu
label: har anvendt materiale @da
label: hat aufgebrachtes Material @de
label: heeft bevestigd materiaal @nl
label: uygulanan malzeme ile ilişkilidir @tr
label: له مادة مُستخدمة @ar
label: 有施加材料 @zh-hans
sub property of: has material
definition: Bir kaynağı, bir kaynağın temel malzemesine uygulanan fiziksel veya kimyasal bir maddeyle ilişkilendirir. @tr
definition: Hozzákapcsol egy forrást egy fizikai vagy kémiai anyaghoz, amelyet egy forrás alapanyagaként alkalmaznak. @hu
definition: Liittää aineiston fysikaaliseen tai kemialliseen aineeseen, jota on laitettu aineiston pohjamateriaalin päälle. @fi
definition: Relaterer en ressource til fysisk eller kemisk stof, der er påført en ressources basismateriale. @da
definition: Relates a resource to a physical or chemical substance applied to a base material of a resource.
definition: Setzt eine Ressource in Beziehung zu einer physischen oder chemischen Substanz, die auf ein Trägermaterial einer Ressource aufgebracht wird. @de
definition: يربط بين مصدر ومادة فيزيائية أو كيميائية مستخدمة كمادة أساسية لمصدر. @ar
definition: 将一种资源与施加于一种资源基底材料上的物理或化学物质关联起来。 @zh-hans

has place of distribution
has subproperty: has parallel place of distribution
lexical alias: placeOfDistribution.en
status: Published
type: Property
label: aineiston jakelupaikka @fi
label: dağıtım yeri ile ilişkilidir @tr
label: har distributionssted @da
label: hat Vertriebsort @de
label: heeft plaats van distributie @nl
label: terjesztés helye a következő: @hu
label: له مكان توزيع @ar
label: 有发行地点 @zh-hans
sub property of: has related place of resource
inverse of: is place of distribution of
definition: Bir kaynağı, yayımlanmış bir kaynağın dağıtımıyla bağlantılı bir yerle ilişkilendirir. @tr
definition: Hozzákapcsol egy forrást egy helyhez, amely egy publikált forrás terjesztéséhez kapcsolódik. @hu
definition: Liittää aineiston paikkaan, joka liittyy julkaistun aineiston jakeluun. @fi
definition: Relaterer en ressource til et sted forbundet med distributionen af en ressource i publiceret form. @da
definition: Relates a resource to a place associated with the distribution of a published resource.
definition: Setzt eine Ressource in Beziehung zu einem Geografikum, das mit dem Vertrieb einer veröffentlichten Ressource in Verbindung steht. @de
definition: يربط بين مصدر ومكان مرتبط بتوزيع مصدر منشور. @ar
definition: 将一种资源与和一种出版资源的发行有关的一个地点关联起来。 @zh-hans

has place of production
has subproperty: has parallel place of production
lexical alias: placeOfProduction.en
status: Published
type: Property
label: aineiston tuotantopaikka @fi
label: előállítás helye a következő: @hu
label: har produktionssted - upublicerede ressourcer @da
label: hat Entstehungsort @de
label: heeft plaats van productie @nl
label: yapım yeri ile ilişkilidir @tr
label: له مكان إنتاج @ar
label: 有制作地点 @zh-hans
sub property of: has related place of resource
inverse of: is place of production of
definition: Bir kaynağı, yayınlanmamış bir kaynağın yazımı, üretimi, yapımı veya diğer üretim yöntemleriyle bağlantılı bir yerle ilişkilendirir. @tr
definition: Hozzákapcsol egy forrást egy helyhez, amely egy kiadatlan forrás írásához, összeállításához, készítéséhez vagy más módú előállításához kapcsolódik. @hu
definition: Liittää aineiston paikkaan, joka liittyy julkaisemattoman aineiston aivertamiseen, valmistamiseen, kokoamiseen tai muuhun tuotantotapaan. @fi
definition: Relaterer en ressource til et sted forbundet med indgravering, fremstilling, konstruktion etc. af en ressource i upubliceret form. @da
definition: Relates a resource to a place that is associated with the inscription, fabrication, construction, or other method of production of an unpublished resource.
definition: Setzt eine Ressource in Beziehung zu einem Geografikum, das mit der Beschriftung, der Fabrikation, der Konstruktion oder einer anderen Entstehungsmethode einer unveröffentlichten Ressource in Verbindung steht. @de
definition: يربط بين مصدر ومكان مرتبط بتسجيل، أو تصنيع، أو إنشاء، أو مرتبط بأي طريقة أخرى بإنتاج مصدر غير منشور. @ar
definition: 将一种资源与一种非出版资源的镌刻、制造、构建或其他制作方法有关的一个地点关联起来。 @zh-hans

has place of manufacture
has subproperty: has parallel place of manufacture
lexical alias: placeOfManufacture.en
status: Published
type: Property
label: aineiston valmistuspaikka @fi
label: gyártási helye a következő: @hu
label: har produktionssted - publicerede ressourcer @da
label: hat Herstellungsort @de
label: heeft plaats van vervaardiging @nl
label: üretim yeri ile ilişkilidir @tr
label: له مكان تصنيع @ar
label: 有生产地点 @zh-hans
sub property of: has related place of resource
inverse of: is place of manufacture of
definition: Bir kaynağı, yayınlanmış bir kaynağın basımı, çoğaltılması, yayınlanması veya diğer üretim yöntemleriyle ilişkili bir yerle ilişkilendirir. @tr
definition: Hozzákapcsol egy forrást egy helyhez, amely egy kiadott forrás nyomtatásához, sokszorosításához, öntéséhez vagy más módú gyártásához kapcsolódik. @hu
definition: Liittää aineiston paikkaan, aikaan, joka liittyy julkaistun aineiston painamiseen, monistamiseen, kirjasinten valamiseen tai muuhun valmistustapaan. @fi
definition: Relaterer en ressource til sted forbundet med trykning, duplikering, støbning etc. af en ressource i publiceret form. @da
definition: Relates a resource to a place that is associated with the printing, duplicating, casting, or other method of manufacturing of a published resource.
definition: Setzt eine Ressource in Beziehung zu einem Geografikum, das mit dem Druck, der Vervielfältigung, dem Guss oder einer anderen Herstellungsmethode einer veröffentlichten Ressource in Verbindung steht. @de
definition: يربط بين مصدر ومكان مرتبط بطبع، نسخ، طَرَح، أو مرتبط بأي طريقة أخرى بتصنيع مصدر منشور. @ar
definition: 将一种资源与一种出版资源的印刷、复制、铸造或其他生产方式有关的一个地点关联起来。 @zh-hans

has place of publication
has subproperty: has parallel place of publication
lexical alias: placeOfPublication.en
status: Published
type: Property
label: aineiston julkaisupaikka @fi
label: har publiceringssted @da
label: hat Erscheinungsort @de
label: heeft plaats van publicatie @nl
label: kiadási helye a következő: @hu
label: yayın yeri ile ilişkilidir @tr
label: له مكان نشر @ar
label: 有出版地点 @zh-hans
sub property of: has related place of resource
inverse of: is place of publication of
definition: Bir kaynağı, yayınlanmış bir kaynağın, yayımlanması, piyasaya sürülmesi veya çıkarılması ile bağlantılı bir yerle ilişkilendirir. @tr
definition: Hozzákapcsol egy forrást egy helyhez, amely egy forrás kiadásához, kibocsájtásához vagy megjelentetéséhez kapcsolódik. @hu
definition: Liittää aineiston paikkaan, joka liittyy julkaistun aineiston kustantamiseen, julkaisemiseen tai ilmestymiseen. @fi
definition: Relaciona un recurs amb un lloc que s’associa amb la publicació, la posada en circulació o l’emissió d’un recurs publicat. @ca
definition: Relaterer en ressource til et sted forbundet med publicering, offentliggørelse eller udgivelse af en ressource. @da
definition: Relates a resource to a place that is associated with the publication, release, or issuing of a published resource.
definition: Setzt eine Ressource in Beziehung zu einem Geografikum, das mit der Veröffentlichung, dem Release oder der Herausgabe einer veröffentlichten Ressource in Verbindung steht. @de
definition: يربط بين مصدر ومكان مرتبط بنشر، تحرير، أو إصدار مصدر منشور. @ar
definition: 将一种资源与一种出版资源的出版、发布或发行有关的一个地点关联起来。 @zh-hans

has parallel place of distribution
lexical alias: parallelPlaceOfDistribution.en
status: Published
type: Property
label: aineiston rinnakkainen jakelupaikka @fi
label: har parallelt distributionssted @da
label: hat parallelen Vertriebsort @de
label: heeft parallelle plaats van distributie @nl
label: paralel dağıtım yeri ile ilişkilidir @tr
label: párhuzamos terjesztési helye a következő: @hu
label: له مكان توزيع موازي @ar
label: 有并列发行地点 @zh-hans
sub property of: has place of distribution
definition: Bir kaynağı, bir dağıtım yeri öğesinde kaydedilenden farklı bir dildeki veya yazıdaki bir dağıtım yeri ile ilişkilendirir.. @tr
definition: Hozzákapcsol egy forrást egy terjesztő helyéhez egy olyan nyelven vagy írásrendszerben, amely eltér a terjesztési hely elemben jelölttől. @hu
definition: Liittää aineiston jakelupaikkaan toisella kielellä ja/tai kirjoitusjärjestelmällä. @fi
definition: Relaterer en ressource til et distributionssted på et andet sprog og/eller i et andet alfabet end det som er anvendt ved angivelsen af distributionsstedet. @da
definition: Relates a resource to a place of distribution in a language or script that differs from that recorded in a place of distribution element.
definition: Setzt eine Ressource in Beziehung zu einem Vertriebsort in einer Sprache oder Schrift, die von dem bereits erfassten Vertriebsort abweicht. @de
definition: يربط بين مصدر ومكان توزيع بلغة أو نص مختلف عن ذلك المُسجل داخل مكان عنصر توزيع. @ar
definition: 将一种资源与用不同于记录在发行地点元素中之语言或文字的发行地点关联起来。 @zh-hans

has parallel place of manufacture
lexical alias: parallelPlaceOfManufacture.en
status: Published
type: Property
label: aineiston rinnakkainen valmistuspaikka @fi
label: har parallelt produktionssted - publicerede ressourcer @da
label: hat parallelen Herstellungsort @de
label: heeft parallelle plaats van vervaardiging @nl
label: paralel üretim yeri ile ilişkilidir @tr
label: párhuzamos gyártási helye a következő: @hu
label: له مكان تصنيع موازي @ar
label: 有并列生产地点 @zh-hans
sub property of: has place of manufacture
definition: Bir kaynağı, imalat yeri öğesinde kaydedilenden farklı bir dilde veya metinde, bir imalat yeri ile ilişkilendirir. @tr
definition: Hozzákapcsol egy forrást egy gyártási helyhez egy olyan nyelven vagy írásrendszerben, amely eltér a gyártási hely elemben jelölttől. @hu
definition: Liittää aineiston valmistuspaikkaan toisella kielellä ja/tai kirjoitusjärjestelmällä. @fi
definition: Relaterer en ressource til et fremstillingssted på et andet sprog og/eller i et andet alfabet end det som er anvendt ved angivelsen af fremstillingsstedet. @da
definition: Relates a resource to a place of manufacture in a language or script that differs from that recorded in a place of manufacture element.
definition: Setzt eine Ressource in Beziehung zu einem Herstellungsort in einer Sprache oder Schrift, die von dem bereits erfassten Herstellungsort abweicht. @de
definition: يربط بين مصدر ومكان تصنيع بلغة أو نص مختلف عن ذلك المُسجل داخل مكان عنصر توزيع. @ar
definition: 将一种资源与用不同于记录在生产地点元素中之语言或文字的生产地点关联起来。 @zh-hans

has parallel place of production
lexical alias: parallelPlaceOfProduction.en
status: Published
type: Property
label: aineiston rinnakkainen tuotantopaikka @fi
label: har parallelt produktionssted - upublicerede ressourcer @da
label: hat parallelen Entstehungsort @de
label: heeft parallelle plaats van productie @nl
label: paralel yapım yeri ile ilişkilidir @tr
label: párhuzamos előállítási helye a következő: @hu
label: له مكان إنتاج موازي @ar
label: 有并列制作地点 @zh-hans
sub property of: has place of production
definition: Bir kaynağı, yapım yeri unsurunda kaydedilenden farklı bir dilde veya metinde, bir üretim yeri ile ilişkilendirir. @tr
definition: Hozzákapcsol egy forrást egy előállítási helyhez egy olyan nyelven vagy írásrendszerben, amely eltér az előállítás helye elemben jelölttől. @hu
definition: Liittää aineiston tuotantopaikkaan toisella kielellä ja/tai kirjoitusjärjestelmällä. @fi
definition: Relaterer en ressource til et produktionssted på et andet sprog og/eller i et andet alfabet end det som er anvendt ved angivelsen af produktionsstedet. @da
definition: Relates a resource to a place of production in a language or script that differs from that recorded in a place of production element.
definition: Setzt eine Ressource in Beziehung zu einem Entstehungsort in einer Sprache oder Schrift, die von dem bereits erfassten Entstehungsort abweicht. @de
definition: يربط بين مصدر ومكان إنتاج بلغة أو نص مختلف عن ذلك المُسجل داخل مكان عنصر إنتاج. @ar
definition: 将一种资源与用不同于记录在制作地点元素中之语言或文字的制作地点关联起来。 @zh-hans

has parallel place of publication
lexical alias: parallelPlaceOfPublication.en
status: Published
type: Property
label: aineiston rinnakkainen kustannuspaikka @fi
label: har parallelt publiceringssted @da
label: hat parallelen Erscheinungsort @de
label: heeft parallelle plaats van publicatie @nl
label: paralel yayın yeri ile ilişkilidir @tr
label: párhuzamos kiadási helye a következő: @hu
label: له مكان نشر موازي @ar
label: 有并列出版地点 @zh-hans
sub property of: has place of publication
definition: Bir kaynağı, yayın yeri öğesinde kaydedilenden farklı bir dilde veya metinde, bir yayın yeri ile ilişkilendirir. @tr
definition: Hozzákapcsol egy forrást egy kiadási helyhez egy olyan nyelven vagy írásrendszerben, amely eltér a kiadás helye elemben jelölttől. @hu
definition: Liittää aineiston kustannuspaikkaan toisella kielellä ja/tai kirjoitusjärjestelmällä. @fi
definition: Relaterer en ressource til et publiceringssted på et andet sprog og/eller i et andet alfabet end det som er anvendt ved angivelsen af publiceringsstedet. @da
definition: Relates a resource to a place of publication in a language or script that differs from that recorded in a place of publication element.
definition: Setzt eine Ressource in Beziehung zu einem Erscheinungsort in einer Sprache oder Schrift, die von dem bereits erfassten Erscheinungsort abweicht. @de
definition: يربط بين مصدر ومكان نشر بلغة أو نص مختلف عن ذلك المُسجل داخل مكان عنصر نشر. @ar
definition: 将一种资源与用不同于记录在出版地点元素中之语言或文字的出版地点关联起来。 @zh-hans

is reprint of
lexical alias: reprintOf.en
status: Published
type: Property
label: er genoptryk af @da
label: is herdruk van @nl
label: ist Nachdruck von @de
label: reprintje a következőnek: @hu
label: uusintapainos aineistosta @fi
label: yeniden basımıdır @tr
label: هو إعادة طبع لـ @ar
label: 是……的重印 @zh-hans
sub property of: is reproduction of
inverse of: is reprinted as
definition: Bir kaynağı, tanımlanan basılı bir kaynakla ve aynı kaynağın yeniden yayımlanmış hali olan bir kaynakla ilişkilendirir. @tr
definition: Hozzákapcsol egy forrást egy olyan forráshoz, amely nyomtatott forrásként újrakiadása a leírt forrásnak. @hu
definition: Liittää aineiston kuvailtavana olevasta painetusta aineistosta otettuun uusintapainokseen. @fi
definition: Relaterer en ressource til en trykt ressource, der er anvendt som grundlag for en genudgivelse af en ressource. @da
definition: Relates a resource to a resource that reissues the same resource as a printed resource being described.
definition: Setzt eine Ressource in Beziehung zu einer Ressource, die dieselbe Ressource wie die beschriebene, gedruckte Ressource neu heraus gibt. @de
definition: يربط بين مصدر ومصدر يُعيد إصدار نفس المصدر مثل مصدر مطبوع يتم وصفه. @ar
definition: 将一种资源与重新发行和所描述印刷资源相同资源的一种资源关联起来。 @zh-hans

has film producer
lexical alias: filmProducer.en
status: Published
type: Property
label: elokuvatuottaja aineistossa @fi
label: film yapımcısı ile ilişkilidir @tr
label: filmproducere következő: @hu
label: har filmproducer @da
label: hat Filmproduzentin/Filmproduzenten @de
label: heeft filmproducent @nl
label: له مُنتِج فيلم @ar
label: 有电影制作者 @zh-hans
sub property of: has producer
inverse of: is film producer of
definition: Bir kaynağı, bir filmin yapımının ticari yönlerinin çoğundan sorumlu olan bir yapımcı olan bir temsilci ile ilişkilendirir. @tr
definition: Hozzákapcsol egy forrást egy producer ágenshez, aki felelős egy filmprodukció üzleti vonatkozásainak a zöméért. @hu
definition: Liittää aineiston toimijaan, joka on vastuussa suurimmasta osasta elokuvan liiketoimintaa. @fi
definition: Relaciona un recurs amb un agent que és un productor que és responsable de la majoria dels aspectes comercials de la producció d’una pel·lícula. @ca
definition: Relaterer en ressource til en producer, der er ansvarlig for størstedelen af de forretningsmæssige aspekter ved en film. @da
definition: Relates a resource to an agent who is a producer who is responsible for most of the business aspects of the production of a film.
definition: Setzt eine Ressource in Beziehung zu einer Produzentin/einem Produzenten, die/der für die meisten geschäftlichen Aspekte bei der Produktion eines Films verantwortlich ist. @de
definition: يربط مصدر بوكيل يكون مُنتِجًا مسؤولًا عن معظم الجوانب التجارية لإنتاج فيلم. @ar
definition: 将一种资源与作为制作者并负责电影制作的大部分商业运作的一个行为者关联起来。 @zh-hans

has radio producer
lexical alias: radioProducer.en
status: Published
type: Property
label: har radioproducer @da
label: hat Hörfunkproduzentin/Hörfunkproduzenten @de
label: heeft radioproducent @nl
label: radiotuottajana aineistossa @fi
label: radyo yapımcısı ile ilişkilidir @tr
label: rádiós producere a következő: @hu
label: له مُنتِج إذاعي @ar
label: 有广播制作者 @zh-hans
sub property of: has producer
inverse of: is radio producer of
definition: Bir kaynağı, bir radyo programının ticari yönlerinin çoğundan sorumlu yapımcı olan temsilci ile ilişkilendirir. @tr
definition: Hozzákapcsol egy forrást egy producer ágenshez, aki felelős egy rádióműsor üzleti vonatkozásainak a zöméért. @hu
definition: Liittää aineiston toimijaan, joka on vastuussa suurimmasta osasta radio-ohjelman liiketoimintaa. @fi
definition: Relaterer en ressource til en producer, der er ansvarlig for størstedelen af de forretningsmæssige aspekter ved et radioprogram. @da
definition: Relates a resource to an agent who is a producer who is responsible for most of the business aspects of a radio program.
definition: Setzt eine Ressource in Beziehung zu einer Produzentin/einem Produzenten, die/der für die meisten geschäftlichen Aspekte einer Hörfunksendung verantwortlich ist. @de
definition: يربط مصدر بوكيل يكون مُنتِجًا مسؤولًا عن معظم الجوانب التجارية لإنتاج برنامج إذاعي. @ar
definition: 将一种资源与作为制作者并负责广播节目的大部分商业运作的一个行为者关联起来。 @zh-hans

has television producer
lexical alias: televisionProducer.en
status: Published
type: Property
label: har tv-producer @da
label: hat Fernsehproduzentin/Fernsehproduzenten @de
label: heeft televisieproducent @nl
label: televisiotuottajana aineistossa @fi
label: televizyon yapımcısı ile ilişkilidir @tr
label: televíziós producere a következő: @hu
label: له مُنتِج تلفزيوني @ar
label: 有电视制作者 @zh-hans
sub property of: has producer
inverse of: is television producer of
definition: Bir kaynağı, bir televizyon programının ticari yönlerinin çoğundan sorumlu yapımcı olan temsilci ile ilişkilendirir. @tr
definition: Hozzákapcsol egy forrást egy producer ágenshez, aki felelős egy televízióműsor üzleti vonatkozásainak a zöméért. @hu
definition: Liittää aineiston toimijaan, joka on vastuussa suurimmasta osasta televisio-ohjelman liiketoimintaa. @fi
definition: Relaterer en ressource til en producer, der er ansvarlig for størstedelen af de forretningsmæssige aspekter ved et tv-program. @da
definition: Relates a resource to an agent who is a producer who is responsible for most of the business aspects of a television program.
definition: Setzt eine Ressource in Beziehung zu einer Produzentin/einem Produzenten, die/der für die meisten geschäftlichen Aspekte einer Fernsehsendung verantwortlich ist. @de
definition: يربط مصدر بوكيل يكون مُنتِجًا مسؤولًا عن معظم الجوانب التجارية لإنتاج برنامج تليفزيوني. @ar
definition: 将一种资源与作为制作者并负责电视节目的大部分商业运作的一个行为者关联起来。 @zh-hans

has parallel name of producer
lexical alias: parallelNameOfProducer.en
status: Published
type: Property
label: aineiston tuottajan rinnakkainen nimi @fi
label: har parallelt producentnavn @da
label: hat parallelen Erzeugernamen @de
label: heeft parallelle naam van producent @nl
label: paralel yapımcı adı ile ilişkilidir @tr
label: párhuzamos előállítói neve a következő: @hu
label: له اسم مُنتِج موازي @ar
label: 有制作者的并列名称 @zh-hans
definition: Bir kaynağı, bir yapımcının adıyla ilişkilendirir. @tr
definition: Hozzákapcsol egy forrást egy előállítói névhez egy olyan nyelven vagy írásrendszerben, amely eltér az előállító neve elemben jelölttől. @hu
definition: Liittää aineiston tuottajan nimeen kielellä tai kirjoitusjärjestelmällä, joka eroaa kustantaja-elementtiin tallennetusta nimestä. @fi
definition: Relaterer en ressource til et producernavn på et andet sprog og/eller i et andet alfabet end det som er anvendt ved angivelsen af producernavnet @da
definition: Relates a resource to a name of producer in a language or script that differs from that recorded in a name of producer element.
definition: Setzt eine Ressource in Beziehung zu einem Erzeugernamen in einer Sprache oder Schrift, die von dem bereits erfassten Erzeugernamen abweicht. @de
definition: يربط بين مصدر وإسم مُنتِج بلغة أو نص مختلف عن ذلك المُسجل بإسم عنصر مُنتِج. @ar
definition: 将一种资源与用不同于记录在制作者名称元素中之语言或文字的制作者的名称关联起来。 @zh-hans

has parallel name of publisher
lexical alias: parallelNameOfPublisher.en
status: Published
type: Property
label: aineiston kustantajan rinnakkainen nimi @fi
label: har parallelt udgivernavn @da
label: hat parallelen Verlagsnamen @de
label: heeft parallelle naam van uitgever @nl
label: paralel yayıncı adı ile ilişkilidir @tr
label: párhuzamos kiadói neve a következő: @hu
label: له اسم ناشر موازي @ar
label: 有出版者的并列名称 @zh-hans
definition: Bir kaynağı, üreticinin adı öğesinde kaydedilenden farklı bir dilde veya metinde üreticinin adıyla ilişkilendirir. @tr
definition: Hozzákapcsol egy forrást egy kiadó nevéhez egy olyan nyelven vagy írásrendszerben, amely eltér a kiadó neve elemben jelölttől. @hu
definition: Liittää aineiston kustantajan nimeen kielellä tai kirjoitusjärjestelmällä, joka eroaa kustantaja-elementtiin tallennetusta nimestä. @fi
definition: Relaterer en ressource til et udgivernavn på et andet sprog og/eller i et andet alfabet end det som er anvendt ved angivelsen af udgivernavnet. @da
definition: Relates a resource to a name of publisher name in a language or script that differs from that recorded in a name of publisher element.
definition: Setzt eine Ressource in Beziehung zu einem Verlagsnamen in einer Sprache oder Schrift, die von dem bereits erfassten Verlagsnamen abweicht. @de
definition: يربط بين مصدر وإسم ناشر بلغة أو نص مختلف عن ذلك المُسجل بإسم عنصر ناشر. @ar
definition: 将一种资源与用不同于记录在出版者名称元素中之语言或文字的出版者的名称关联起来。 @zh-hans

is adapted as radio program
lexical alias: adaptedAsRadioProgram.en
status: Published
type: Property
label: er bearbejdet til radioprogram (udtryk) @da
label: is bewerkt als radioprogramma @nl
label: ist bearbeitet als Hörfunksendung @de
label: radiosovitus aineistosta @fi
label: radyo programı olarak uyarlanmıştır @tr
label: rádióműsorként való feldolgozása a következő: @hu
label: هو مقتبَس كبرنامج إذاعي @ar
label: 被改编为广播节目 @zh-hans
sub property of: is adapted as
inverse of: is radio adaptation of
definition: Bir kaynağı farklı bir kaynaktan uyarlanan radyo programıyla ilişkilendirir. @tr
definition: Hozzákapcsol egy forrást egy rádióműsorhoz, amely egy másik forráson alapul. @hu
definition: Liittää aineiston radio-ohjelmaan, joka perustuu toiseen aineistoon. @fi
definition: Relaterer en ressource til et radioprogram baseret på et oprindeligt udtryk. @da
definition: Relates a resource to a radio program based on another resource.
definition: Setzt eine Ressource in Beziehung zu einer Hörfunksendung, die auf einer anderen Ressource basiert. @de
definition: يربط بين مصدر وبرنامج إذاعي اعتمد على مصدر آخر. @ar
definition: 将一种资源与基于另一种资源的一种广播节目关联起来。 @zh-hans

has academic degree
lexical alias: academicDegree.en
status: Published
type: Property
label: akademik derece ile ilişkilidir @tr
label: akateeminen oppiarvo @fi
label: har akademisk grad @da
label: hat akademischen Grad @de
label: heeft academische graad @nl
label: tudományos fokozata a következő: @hu
label: له درجة أكاديمية @ar
label: 有学位 @zh-hans
definition: Bir kaynağı, akademik yeterliliğin kanıtı olarak verilen bir dereceyle ilişkilendirir. @tr
definition: Hozzákapcsol egy forrást egy ranghoz, amelyet tudományos jártasság garanciájaként adományoznak. @hu
definition: Liittää aineiston akateemisen pätevyyden takeeksi myönnettyyn arvoon. @fi
definition: Relaterer en ressource til en rang, der tildeles som garanti for akademisk færdighed. @da
definition: Relates a resource to a rank conferred as a guarantee of academic proficiency.
definition: Setzt eine Ressource in Beziehung zu einem Rang, der als Bestätigung für wissenschaftliche Leistungen verliehen wird. @de
definition: يربط بين مصدر ورتبة تُمنح كضمان للكفاءة الأكاديمية. @ar
definition: 将一种资源与作为学术能力担保的一种等级关联起来。 @zh-hans

has custodial history of resource
lexical alias: custodialHistoryOfResource.en
status: Published
type: Property
label: aineiston omistushistoria @fi
label: forrás őrzési története a következő: @hu
label: hat Besitzhistorie einer Ressource @de
label: heeft bewaargeschiedenis van resource @nl
label: kaynak koruma geçmişi ile ilişkilidir @tr
label: proveniens @da
label: له تاريخ وصاية لمصدر @ar
label: 有资源的保管历史 @zh-hans
definition: Bir kaynağı, temsilci, yer ve zaman aralığı da dahil olmak üzere, bir kaynağın önceki sahipliğine veya gözetimine ilişkin bir kayıtla ilişkilendirir. @tr
definition: Hozzákapcsol egy forrást a forrás korábbi tulajdoni vagy letéti őrzési feljegyzéséhez, amely tartalmaz ágenst, helyet és időtartamot. @hu
definition: Liittää aineiston tietoihin sen omistus- tai säilytyshistoriasta, mukaanlukien tiedot toimijoista, paikoista ja ajanjaksoista. @fi
definition: Relaterer en ressource til en optegnelse over tidligere ejerskab eller opbevaring af en ressource. @da
definition: Relates a resource to a record of previous ownership or custodianship of a resource, including agent, place, and timespan.
definition: Setzt eine Ressource in Beziehung zu einem Bericht über frühere Eigentümerinnen/Eigentümer oder Verwahrerinnen/Verwahrer einer Ressource, einschließlich eines Akteurs, eines Geografikums und eines Zeitraums. @de
definition: يربط بين مصدر وسجل ملكية سابقة أو بوصاية على مصدر، يتضمن وكيلًا، مكانا، وفترة زمنية. @ar
definition: 将一种资源与一种资源的先前拥有或保管的记录（包括行为者、地点和时间段）关联起来。 @zh-hans

is abstracted in
lexical alias: abstractedIn.en
status: Published
type: Property
label: abstraktit aineistosta @fi
label: er sammenfattet i @da
label: is geabstraheerd in @nl
label: ist Abstract in @de
label: referálva a következőben: @hu
label: özetlenmiştir @tr
label: هو مُستخلص في @ar
label: 被摘要于 @zh-hans
sub property of: has derivative
inverse of: is abstracts for
definition: Bir kaynağı, başka bir kaynağın içeriğini özetleyen bir kaynakla ilişkilendirir. @tr
definition: Hozzákapcsol egy forrást egy forráshoz, amely egy másik forrás tartalmait absztrahálja. @hu
definition: Liittää aineiston aineistoon, joka on tiivistelmä toisen aineiston sisällöstä. @fi
definition: Relaterer en ressource til en ressource, der er en abstracts- og indekseringsservice, der sammenfatter en oprindelig kildes indehold. @da
definition: Relates a resource to a resource that abstracts the contents of another resource.
definition: Setzt eine Ressource in Beziehung zu einer Ressource, die den Inhalt einer anderen Ressource zusammenfasst. @de
definition: يربط بين مصدر ومصدر يستخلص محتويات مصدر آخر. @ar
definition: 将一种资源与为另一种资源的内容编制摘要的一种资源关联起来。 @zh-hans

is indexed in (Deprecated)
lexical alias: indexedIn.en
status: Deprecated
type: Property
label: er indekseret i @da
label: indeksointi @fi
label: indexelve a következőben: @hu
label: is geïndexeerd in @nl
label: ist indexiert in @de
label: هو مُكَشَّف في @ar
sub property of: has derivative
inverse of: is indexing for (Deprecated)
definition: Hozzákapcsol egy forrást egy forráshoz, amely egy referáló és indexelő szolgáltatás, amely egy másik forrás tartalmát indexeli. @hu
definition: Liittää aineiston aineistoon, joka on tiivistelmä- ja indeksointipalvelu, joka sisältää toisen aineiston sisällön abstraktit. @fi
definition: Relaterer en ressource til en ressource, der er en abstracts- og indekseringsservice, der indekserer en oprindelig kildes indhold. @da
definition: Relates a resource to a resource that is an abstracting and indexing service that indexes the contents of another resource. (Deprecated)
definition: Setzt eine Ressource in Beziehung zu einer Ressource, bei der es sich um einen Abstract- und Indexierungsdienst handelt, die die Inhalte einer ursprünglichen Expression indexiert. @de
definition: يربط بين مصدر ومصدر يمثل خدمة استخلاص وتكشيف تُفهرس محتويات مصدر آخَر. @ar

has preservation facsimile
lexical alias: preservationFacsimile.en
status: Published
type: Property
label: aineiston säilytyskopio @fi
label: har bevaringsfaksimile @da
label: hat Bestandserhaltungsfaksimile @de
label: heeft conservatiefacsimile @nl
label: koruma kopyası ile ilişkilidir @tr
label: megőrzési hasonmása a következő: @hu
label: له نسخة طبق الأصل محفوظة @ar
label: 有保存摹真品 @zh-hans
sub property of: has facsimile
inverse of: is preservation facsimile of
definition: Bir kaynağı, asitsiz kalıcı veya arşiv kağıdı gibi koruma kalitesinde medya üzerinde tam bir çoğaltmadan oluşan bir kaynakla ilişkilendirir. @tr
definition: Hozzákapcsol egy forrást egy forráshoz, amely pontos újraalkotás olyan megőrzés-minőségű médiumon, mint például a savmentes tartós vagy archiváló papír. @hu
definition: Liittää aineiston aineistoon, joka on sen täsmällinen jäljennös. Jäljennöksen valmistuksessa on käytetty säilytyskelpoista materiaalia, esim. arkistopaperia. @fi
definition: Relaterer en ressource til en resssource, der består af en nøjagtig reproduktion på et medium af bevaringskvalitet, såsom syrefrit permanent- eller arkivpapir. @da
definition: Relates a resource to a resource that consists of an exact reproduction on preservation-quality media, such as acid-free permanent or archival paper.
definition: Setzt eine Ressource in Beziehung zu einer Ressource, die aus einer exakten Reproduktion auf bestandserhaltenden Medien, wie zum Beispiel säurefreiem Papier oder Archivpapier, besteht. @de
definition: يربط بين مصدر ومصدر يتكون من استنساخ كامل على وسيط حفظ عالي الجودة، مثل الأوراق الدائمة الخالية من الأحماض أو أوراق المحفوظات الأرشيفية. @ar
definition: 将一种资源与由在诸如脱酸的永久用纸或档案纸等具有保存品质的媒介上的精确复制品组成的资源关联起来。 @zh-hans

is adapted as choreography
lexical alias: adaptedAsChoreography.en
status: Published
type: Property
label: er bearbejdet til koreografi @da
label: is bewerkt als choreografie @nl
label: ist bearbeitet als Choreografie @de
label: koreografi olarak uyarlanmıştır @tr
label: koreografiasovitus aineistosta @fi
label: koreográfiaként való feldolgozása a következő: @hu
label: هو مقتبَس كفن تصميم الرقصات @ar
label: 被改编为编舞 @zh-hans
sub property of: has derivative
inverse of: is choreographic adaptation of
definition: Bir kaynağı, farklı bir kaynaktan uyarlanan koreografi ile ilişkilendirir. @tr
definition: Hozzákapcsol egy forrást egy koreografikus forráshoz, amely egy másik forráson alapul. @hu
definition: Liittää aineiston koreografiseen aineistoon, joka perustuu toiseen aineistoon. @fi
definition: Relaterer en ressource til en ressource, der består af bevægelse baseret på en oprindelig ressource. @da
definition: Relates a resource to a choreographic resource based on another resource.
definition: Setzt eine Ressource in Beziehung zu einer choreografischen Ressource, die auf einer anderen Ressource basiert. @de
definition: يربط بين مصدر ومصدر راقص اعتمد على مصدر آخر. @ar
definition: 将一种资源与基于另一种资源的一种编舞资源关联起来。 @zh-hans

has errata
lexical alias: errata.en
status: Published
type: Property
label: aineiston painovirheluettelo @fi
label: düzeltme ile ilişkilidir @tr
label: er errata @da
label: hat Errata @de
label: heeft errata @nl
label: hibajegyzéke a következő: @hu
label: له تصويبات @ar
label: 有勘误 @zh-hans
sub property of: is augmented by
inverse of: is errata to
definition: Bir kaynağı, baskın bir kaynağın yayınlanmasından sonra keşfedilen hataları düzeltmeleriyle birlikte oluşan bir kaynakla ilişkilendirir. @tr
definition: Hozzákapcsol egy forrást egy forráshoz, amely egy domináns forrás megjelentetése után felfedezett hibákból és azok javításaiból áll. @hu
definition: Liittää aineiston aineistoon, joka koostuu julkaisemisen jälkeen löytyneistä virheistä ja niiden korjauksista. @fi
definition: Relaterer en ressource til en ressource, der består af rettelser af fejl, som er blevet opdaget efter publicering af hovedressourcen, med deres rettelser. @da
definition: Relates a resource to a resource that consists of errors discovered after the publication of a predominant resource, with their corrections.
definition: Setzt eine Ressource in Beziehung zu einer Ressource, die aus Fehlern und deren Korrekturen besteht, die nach der Veröffentlichung der Hauptressource entdeckt wurden. @de
definition: يربط بين مصدر ومصدر يتكون من أخطاء تم اكتشافها بعد نشر مصدر شائع، مع تصويباتها. @ar
definition: 将一种资源与一个主要资源出版后被发现的错误及其更正组成的一种资源关联起来。 @zh-hans

has illustrations
lexical alias: illustrations.en
status: Published
type: Property
label: aineiston kuvitus @fi
label: er illustrationer @da
label: hat Illustrationen @de
label: heeft illustraties @nl
label: illusztrációja a következő: @hu
label: resimleme ile ilişkilidir @tr
label: له إيضاحيات @ar
label: 有插图 @zh-hans
sub property of: is augmented by
inverse of: is illustrations for
definition: Bir kaynağı, artırılmış bir kaynağı açıklamak veya düzenlemek için tasarlanmış görsel içerikten oluşan bir kaynakla ilişkilendirir. @tr
definition: Hozzákapcsol egy forrást egy olyan képi tartalomból álló forráshoz, amelyet egy bővített forrás magyarázatára vagy díszítésére terveztek. @hu
definition: Liittää aineiston laajennettua aineistoa selittävästä tai koristavasta kuvamateriaalista koostuvaan aineistoon. @fi
definition: Relaterer en ressource til en ressource, der består af billedindhold, som er skabt til at forklare eller udsmykke den berigede ressource. @da
definition: Relates a resource to a resource that consists of pictorial content designed to explain or decorate an augmented resource.
definition: Setzt eine Ressource in Beziehung zu einer Ressource, die durch Bildinhalte ergänzt wird, die eine erweiterte Ressource erklären oder ausschmücken sollen. @de
definition: يربط بين مصدر ومصدر يتكون من محتوى تصويري مصمم لشرح أو تزيين مصدر مُعَزَّز. @ar
definition: 将一种资源与由被设计用来解释或装饰一种被附增的资源的图画内容组成的一种资源关联起来。 @zh-hans

has insert
lexical alias: insert.en
status: Published
type: Property
label: aineiston liite @fi
label: beillesztése a következő: @hu
label: ek parça ile ilişkilidir @tr
label: er indlæg @da
label: hat Beilage @de
label: heeft ingevoegde bijlage @nl
label: له جزء مُضاف @ar
label: 有插页 @zh-hans
sub property of: has part resource
inverse of: is inserted in
definition: Bir kaynağı, başka bir kaynağın ayrı bir parçası olan bir kaynakla ilişkilendirir. @tr
definition: Hozzákapcsol egy forrást egy forráshoz, amely egy másik forrás külön kiadott része. @hu
definition: Liittää aineiston aineistoon, joka on, erillinen osa toista aineistoa. @fi
definition: Relaterer en ressource til en ressource, der består af separat udgivet materiale, der ikke er en integreret del af den større manifestation, som den er indlagt i. @da
definition: Relates a resource to a resource that is a separate part of another resource.
definition: Setzt eine Ressource in Beziehung zu einer Ressource, die ein eigenständiger Bestandteil einer anderen Ressource ist. @de
definition: يربط بين مصدر ومصدر يُعد جزء منفصل من مصدر آخَر. @ar
definition: 将一种资源与作为另一种资源之独立部分的一种资源关联起来。 @zh-hans

is adapted as motion picture screenplay
lexical alias: adaptedAsMotionPictureScreenplay.en
status: Published
type: Property
label: er bearbejdet som film @da
label: is bewerkt als speelfilmscenario @nl
label: ist bearbeitet als Filmdrehbuch @de
label: mozgóképforgatókönyvként való feldolgozása a következő: @hu
label: sinema filmi senaryosu olarak uyarlanmıştır @tr
label: sovitettu elokuvakäsikirjoitukseksi (aineisto) @fi
label: هو مقتبَس كسيناريو فيلم سينمائي @ar
label: 被改编为电影剧本 @zh-hans
sub property of: is adapted as screenplay
inverse of: is motion picture screenplay based on
definition: Bir kaynağı, başka bir kaynak temel alınarak sinema filmi senaryosundan oluşan bir kaynakla ilişkilendirir. @tr
definition: Hozzákapcsol egy forrást egy forráshoz, amely egy másik forráson alapuló mozgókép forgatókönyvéből áll. @hu
definition: Liittää aineiston aineistoon, joka on toiseen aineistoon perustuva elokuvan käsikirjoitus. @fi
definition: Relaterer en ressource til en ressource, der består af en drejebog til en film, baseret på en oprindelig ressource. @da
definition: Relates a resource to a resource that consists of a screenplay for a motion picture, based on another resource.
definition: Setzt eine Ressource in Beziehung zu einer Ressource, die aus dem Drehbuch für einen Film besteht und auf einer anderen Ressource basiert. @de
definition: يربط بين مصدر ومصدر يتكون من سيناريو لفيلم سينمائي، اعتمد على مصدر آخَر. @ar
definition: 将一种资源与由基于另一种资源的一种动态图像作品的剧本组成的一种资源关联起来。 @zh-hans

is adapted as screenplay
has subproperty: is adapted as motion picture screenplay
has subproperty: is adapted as television screenplay
has subproperty: is adapted as video screenplay
lexical alias: adaptedAsScreenplay.en
status: Published
type: Property
label: er bearbejdet som drejebog @da
label: forgatókönyvként való feldolgozása a következő: @hu
label: is bewerkt als scenario @nl
label: ist bearbeitet als Drehbuch @de
label: senaryo olarak uyarlanmıştır @tr
label: sovitettu käsikirjoitukseksi (aineisto) @fi
label: هو مقتبَس كسيناريو @ar
label: 被改编为影视剧本 @zh-hans
sub property of: is adapted as
inverse of: is screenplay based on
definition: Bir kaynağı, başka bir kaynaktan uyarlanan sinema filmi, televizyon programı veya video senaryosundan oluşan bir kaynakla ilişkilendirir. @tr
definition: Hozzákapcsol egy forrást egy forráshoz, amely egy másik forráson alapuló mozgókép, televízióműsor vagy videó forgatókönyvéből áll. @hu
definition: Liittää aineiston aineistoon, joka on toiseen aineistoon perustuva elokuvan, televisio-ohjelman tai videon käsikirjoitus. @fi
definition: Relaterer en ressource til en ressource, der består af et manuskript til en film, et tv-program eller en video, baseret på en oprindelig ressource. @da
definition: Relates a resource to a resource that consists of a screenplay for a motion picture, television program, or video, based on another resource.
definition: Setzt eine Ressource in Beziehung zu einer Ressource, die aus einem Drehbuch für einen Film, eine Fernsehsendung oder ein Video besteht, das/die auf einer anderen Ressource basiert. @de
definition: يربط بين مصدر ومصدر يتكون من سيناريو فيلم سينمائي، برنامج تليفزيوني، أو فيديو، اعتمد على مصدر آخَر. @ar
definition: 将一种资源与由基于资源的一种电影、电视节目或视频的剧本组成的一种资源关联起来。 @zh-hans

is adapted as television screenplay
lexical alias: adaptedAsTelevisionScreenplay.en
status: Published
type: Property
label: er bearbejdet til tv-manuskript @da
label: is bewerkt als televisiescenario @nl
label: ist bearbeitet als Fernsehdrehbuch @de
label: sovitettu televisiokäsikirjoitukseksi (aineisto) @fi
label: televizyon senaryosu olarak uyarlanmıştır @tr
label: tévésforgatókönyvként való feldolgozása a következő: @hu
label: هو مقتبَس كسيناريو تلفزيون @ar
label: 被改编为电视剧本 @zh-hans
sub property of: is adapted as screenplay
inverse of: is television screenplay based on
definition: Bir kaynağı, başka bir kaynaktan uyarlanan televizyon programı senaryosundan oluşan bir kaynakla ilişkilendirir. @tr
definition: Hozzákapcsol egy forrást egy forráshoz, amely egy másik forráson alapuló televízióműsor forgatókönyvéből áll. @hu
definition: Liittää aineiston aineistoon, joka on toiseen aineistoon perustuva televisio-ohjelman käsikirjoitus. @fi
definition: Relaterer en ressource til en ressource, der består af et manuskript til et tv-program, baseret på en oprindelig ressource. @da
definition: Relates a resource to a resource that consists of a screenplay for a television program, based on another resource.
definition: Setzt eine Ressource in Beziehung zu einer Ressource, die aus dem Drehbuch für eine Fernsehsendung besteht und auf einer anderen Ressource basiert. @de
definition: يربط بين مصدر ومصدر يتكون من سيناريو فيلم سينمائي لبرنامج تليفزيوني، اعتمد على مصدر آخَر. @ar
definition: 将一种资源与由基于另一种资源的一种电视节目的剧本组成的一种资源关联起来。 @zh-hans

is adapted as video screenplay
lexical alias: adaptedAsVideoScreenplay.en
status: Published
type: Property
label: er bearbejdet til videomanuskript @da
label: is bewerkt als videoscenario @nl
label: ist bearbeitet als Videodrehbuch @de
label: sovitettu videokäsikirjoitukseksi (aineisto) @fi
label: video senaryosu olarak uyarlanmıştır @tr
label: videóforgatókönyv-feldolgozása a következő: @hu
label: هو مقتبَس كسيناريو فيديو @ar
label: 被改编为视频剧本 @zh-hans
sub property of: is adapted as screenplay
inverse of: is video screenplay based on
definition: Bir kaynağı, başka bir kaynaktan uyarlanan video senaryosundan oluşan bir kaynakla ilişkilendirir. @tr
definition: Hozzákapcsol egy forrást egy forráshoz, amely egy másik forráson alapuló videó forgatókönyvéből áll. @hu
definition: Liittää aineiston aineistoon, joka on toiseen aineistoon perustuva videon käsikirjoitus. @fi
definition: Relaterer en ressource til en ressource, der består af et manuskript til en video, baseret på en oprindelig ressource. @da
definition: Relates a resource to a resource that consists of a screenplay for a video, based on another resource.
definition: Setzt eine Ressource in Beziehung zu einer Ressource, die aus dem Drehbuch für ein Video besteht und auf einer anderen Ressource basiert. @de
definition: يربط بين مصدر ومصدر يتكون من سيناريو فيلم سينمائي لفيديو، اعتمد على مصدر آخَر. @ar
definition: 将一种资源与由基于另一种资源的一种视频的剧本组成的一种资源关联起来。 @zh-hans

is adapted as radio script
lexical alias: adaptedAsRadioScript.en
status: Published
type: Property
label: er bearbejdet til radiomanuskript @da
label: is bewerkt als radioscript @nl
label: ist bearbeitet als Hörfunkskript @de
label: radyo metni olarak uyarlanmıştır @tr
label: rádiósszövegkönyvként való feldolgozása a következő: @hu
label: sovitettu radiokäsikirjoitukseksi (aineisto) @fi
label: هو مقتبَس كنص إذاعي @ar
label: 被改编为广播文稿 @zh-hans
sub property of: is adapted as
inverse of: is radio script based on
definition: Bir kaynağı, başka bir kaynaktan uyarlanan bir radyo programı senaryosundan oluşan bir kaynakla ilişkilendirir. @tr
definition: Hozzákapcsol egy forrást egy forráshoz, amely egy másik forráson alapuló rádióműsor forgatókönyvéből áll. @hu
definition: Liittää aineiston aineistoon, joka on toiseen aineistoon perustuva radio-ohjelman käsikirjoitus. @fi
definition: Relaterer en ressource til en ressource, der består af et manuskript til et radioprogram, baseret på en oprindelig ressource. @da
definition: Relates a resource to a resource that consists of a script for a radio program, based on another resource.
definition: Setzt eine Ressource in Beziehung zu einer Ressource, die aus einem Skript für eine Hörfunksendung besteht und auf einer anderen Ressource basiert. @de
definition: يربط بين مصدر ومصدر يتكون من نص لبرنامج إذاعي، اعتمد على مصدر آخَر. @ar
definition: 将一种资源与由基于另一种资源的一种广播节目的文稿组成的一种资源关联起来。 @zh-hans

is freely translated as
lexical alias: freelyTranslatedAs.en
status: Published
type: Property
label: er frit oversat til @da
label: is vrij vertaald als @nl
label: ist frei übersetzt als @de
label: olarak serbestçe çevrilmiştir @tr
label: szabadon fordítva a következőként: @hu
label: vapaamuotoinen käännös aineistosta @fi
label: هو مترجم بتصرف كـ @ar
label: 被自由翻译为 @zh-hans
sub property of: has derivative
inverse of: is free translation of
definition: Bir kaynağı, başka bir kaynağın hem uyarlaması hem de başka bir dile çevirisi olan bir kaynakla ilişkilendirir. @tr
definition: Hozzákapcsol egy forrást egy forráshoz, amely egy másik forrás adaptációja és egy másik nyelvre való fordítása egyszerre. @hu
definition: Liittää aineiston aineistoon, joka on sekä lähteenä olevan aineiston mukaelma että käännös toiselle kielelle. @fi
definition: Relaterer en ressource til en ressource, der frit oversætter teksten til et andet sprog, og som bevarer originalens ånd, men ikke dens sproglige detaljer. @da
definition: Relates a resource to a resource that is both an adaptation and a translation into another language of another resource.
definition: Setzt eine Ressource in Beziehung zu einer Ressource, die sowohl eine Bearbeitung als auch eine Übersetzung einer anderen Ressource in eine andere Sprache ist. @de
definition: يربط بين مصدر ومصدر يعد اقتباسًا وترجمة إلى لغة أخرى لمصدر آخَر. @ar
definition: 将一种资源与作为另一种资源的另一种语言改编和翻译同时进行而成的一种资源关联起来。 @zh-hans

is description of
has subproperty: is analysis of
has subproperty: is evaluation of
has subproperty: is review of
has subproperty: is summary of
has subproperty: is critique of
has subproperty: is commentary on
has subproperty: is finding aid of
has subproperty: is metadata description of entity
lexical alias: descriptionOf.en
status: Published
type: Property
label: aineiston kuvaus @fi
label: er beskrivelse af @da
label: is beschrijving van @nl
label: ist Beschreibung von @de
label: leírása a következőnek: @hu
label: tanımıdır @tr
label: هو وصف لـ @ar
label: 是……的描述 @zh-hans
sub property of: has subject
inverse of: is described by
definition: Bir kaynağı, bir kaynak tarafından tanımlanan bir varlıkla ilişkilendirir. @tr
definition: Hozzákapcsol egy forrást egy entitáshoz, amelyet a forrás leír. @hu
definition: Liittää aineiston entiteettiin, jota aineisto kuvaa. @fi
definition: Relaterer en ressource til en ressource, der beskrives af en beskrivende entitet. @da
definition: Relates a resource to an entity that is described by a resource.
definition: Setzt eine Ressource in Beziehung zu einer Entität, die von einer Ressource beschrieben wird. @de
definition: يربط بين مصدر وكيان موصوف بواسطة مصدر. @ar
definition: 将一种资源与被一种资源描述的一个实体关联起来。 @zh-hans

has equivalent
has subproperty: is also issued as
has subproperty: has mirror site
has subproperty: is reproduced as
has subproperty: is reproduction of
lexical alias: equivalent.en
status: Published
type: Property
label: egyenértékű a következő: @hu
label: eşdeğer ile ilişkilidir @tr
label: har ækvivalent @da
label: hat Äquivalent @de
label: heeft equivalent @nl
label: vastaava aineisto @fi
label: له مُتَكَافِئ @ar
label: 有等同 @zh-hans
sub property of: has equivalent resource relationship with (Deprecated)
definition: Bir kaynağı, kaynakla aynı içeriği taşıyan bir kaynakla ilişkilendirir. @tr
definition: Hozzákapcsol egy forrást egy forráshoz, amely forrásként ugyanazt a tartalmat hordozza. @hu
definition: Liittää aineiston aineistoon, jonka sisältö on sama kuin aineistossa. @fi
definition: Relaterer en ressource til en ressource, der omfatter det samme indhold som en anden ressouce. @da
definition: Relates a resource to a resource that carries the same content as a resource.
definition: Setzt eine Ressource in Beziehung zu einer Ressource, die den gleichen Inhalt wie die andere Ressource hat. @de
definition: يربط بين مصدر ومصدر يحمل نفس المحتوى كمصدر. @ar
definition: 将一种资源与和一种资源承载同样内容的一种资源关联起来。 @zh-hans

is subseries of
lexical alias: subseriesOf.en
status: Published
type: Property
label: aineiston alasarja @fi
label: alsorozata a következőnek: @hu
label: alt sersidir @tr
label: er underserie af @da
label: is onderreeks van @nl
label: ist Unterreihe von @de
label: هو سلسلة فرعية لـ @ar
label: 是……的分丛编 @zh-hans
sub property of: is part of resource
inverse of: has subseries
definition: Bir kaynağı, başka bir ardışık toplama kaynağının yayın politikasına, kapsamına ve biçimine ilham veren ardışık toplama kaynağı olan bir kaynakla ilişkilendirir. @tr
definition: Hozzákapcsol egy forrást egy folyamatos aggregáló forráshoz, amely hatással van egy másik folyamatos aggregáló forrás szerkesztési elveire, tárgykörére és stílusára. @hu
definition: Liittää aineiston peräkkäisesti ilmestyvään aggregoivaan aineistoon, josta toinen peräkkäinen aggregoiva aineisto saa vaikutteita toimitukselliseen käytäntöön, laajuuteen ja tyyliin. @fi
definition: Relaterer en ressource til en ressource, i hvilket en del optræder regelmæssigt; titlen på den større ressource optræder på alle numre eller dele af underserien. @da
definition: Relates a resource to a resource that is a successive aggregating resource that inspires the editorial policy, scope, and style of another successive aggregating resource.
definition: Setzt eine Ressource in Beziehung zu einer sukzessiven, aggregierenden Ressource, die die redaktionelle Vorgehensweise, den Geltungsbereich und den Stil einer anderen sukzessiven, aggregierenden Ressource beeinflusst. @de
definition: يربط بين مصدر ومصدر تجميعي متتالي يلهِم السياسة التحريرية، المجال، والأسلوب لمصدر تجميعي مُتتالي آخَر. @ar
definition: 将一种资源与作为一种相继合集性资源并且启发另一种相继合集性资源的编辑政策、编辑范围和编辑风格的一种资源关联起来。 @zh-hans

is issue of
lexical alias: issueOf.en
status: Published
type: Property
label: er del af serie @da
label: is aflevering van @nl
label: ist Ausgabe von @de
label: numero @fi
label: sayısıdır @tr
label: száma a következőnek: @hu
label: هو إصدارة لـ @ar
label: 是……的期 @zh-hans
sub property of: is part of resource
inverse of: has issue
alternative label: a következő sorozat része: @hu
alternative label: er i serie @da
alternative label: is in series
alternative label: kuuluu sarjaan @fi
alternative label: هو في سلسلة @ar
alternative label: 在丛编中 @zh-hans
definition: Bir kaynağı, durağan bir kaynağın yayın politikasına, kapsamına ve biçimine ilham veren ardışık toplama kaynağı olan bir kaynakla ilişkilendirir. @tr
definition: Hozzákapcsol egy forrást egy folyamatos aggregáló forráshoz, amely hatással van egy statikus forrás szerkesztési elveire, tárgykörére és stílusára. @hu
definition: Liittää aineiston staattiseen aggregoivaan aineistoon, josta toinen peräkkäinen staattinen aineisto saa vaikutteita toimitukselliseen käytäntöön, laajuuteen ja tyyliin. @fi
definition: Relaterer en ressource til en ressource, i hvilket en del er blevet udgivet; en titel på en større ressource optræder på delen. @da
definition: Relates a resource to a resource that is a successive aggregating resource that inspires the editorial policy, scope, and style of a static resource.
definition: Setzt eine Ressource in Beziehung zu einer sukzessiven, aggregierenden Ressource, die die redaktionelle Vorgehensweise, den Geltungsbereich und den Stil einer statischen Ressource beeinflusst. @de
definition: يربط بين مصدر ومصدر تجميعي متتالي يلهِم السياسة التحريرية، المجال، والأسلوب لمصدر ثابت. @ar
definition: 将一种资源与作为一种相继合集性资源并且启发一种静态资源的编辑政策、编辑范围和编辑风格的一种资源关联起来。 @zh-hans

is inserted in
lexical alias: insertedIn.en
status: Published
type: Property
label: beillesztve a következőbe: @hu
label: eklenmiştir @tr
label: er indlagt i @da
label: is ingevoegd in @nl
label: ist beigelegt in @de
label: liitteenä aineistossa @fi
label: هو مُدرَج في @ar
label: 被插入于 @zh-hans
sub property of: is part of resource
inverse of: has insert
definition: Bir kaynağı, içine yayının ayrılmaz bir parçası olmayan materyalin eklendiği bir kaynakla ilişkilendirir. @tr
definition: Hozzákapcsol egy forrást egy forráshoz, amelybe olyan anyagot illesztettek be, amely nem szerves része a kiadványnak. @hu
definition: Liittää aineiston aineistoon, joka sisältää materiaalia erillisenä liitteenä. @fi
definition: Relaterer en ressource til en ressource, hvori der er indlagt materiale, der ikke er en integreret del af publikationen. @da
definition: Relates a resource to a resource into which material is inserted that is not an integral part of the publication.
definition: Setzt eine Ressource in Beziehung zu einer Ressource, in die Material eingefügt wird, das nicht integraler Bestandteil der Veröffentlichung ist. @de
definition: يربط بين مصدر ومصدر تم إدراج مادة فيه وهي لا تُمثل جزءًا أساسيًا من المنشور. @ar
definition: 将一种资源与在其中插入不属于出版物完整部分的资料的一种资源关联起来。 @zh-hans

is also issued as
lexical alias: alsoIssuedAs.en
status: Published
type: Property
label: aineiston muu julkaisumuoto @fi
label: er også udgivet som @da
label: is ook uitgevaardigd als @nl
label: ist auch erschienen als @de
label: olarak da piyasaya çıkarılmaktadır @tr
label: szintén kiadva a következőként: @hu
label: هو صدر أيضًا كـ @ar
label: 也被发行为 @zh-hans
sub property of: has equivalent
definition: Bir kaynağı, kaynağın aynı içeriğini farklı bir biçimde sunan bir kaynakla ilişkilendirir. @tr
definition: Hozzákapcsol egy forrást egy forráshoz, amely egy forrás ugyanazon tartalmát hordozza eltérő formátumban. @hu
definition: Liittää aineiston samansisältöiseen aineistoon, joka on eri julkaisumuodossa. @fi
definition: Relaterer en ressource til en ressource, der omfatter det samme indehold af en ressource i et andet format. @da
definition: Relates a resource to a resource that carries the same content of a resource in a different format.
definition: Setzt eine Ressource in Beziehung zu einer Ressource, die denselben Inhalt einer Ressource in einem anderen Format enthält. @de
definition: يربط بين مصدر ومصدر يحمل نفس المحتوى لمصدر في شكل مختلف. @ar
definition: 将一种资源与用不同格式承载和一种资源同样内容的一种资源关联起来。 @zh-hans

is accompanied by
has subproperty: is bound with
has subproperty: is on carrier unit with
lexical alias: accompaniedBy.en
status: Published
type: Property
label: aineiston mukana ilmestynyt @fi
label: er ledsaget af @da
label: eşliğindedir @tr
label: is begeleid door @nl
label: ist begleitet von einem @de
label: kíséri a következő: @hu
label: هو مُرفق بـ @ar
label: 被……伴随 @zh-hans
sub property of: has accompanying resource relationship with (Deprecated)
definition: Bir kaynağı, farklı bir kaynak parçası ile aynı kaynağın bir parçası olan kaynakla ilişkilendirir. @tr
definition: Hozzákapcsol egy forrást egy forráshoz, amelyet egy kapcsolódó forrással együtt adtak ki, a tartalmához való bármely kapcsolódás nélkül. @hu
definition: Liittää aineiston aineistoon, joka on ilmestynyt yhdessä toisen aineiston kanssa, mutta ei liity siihen sisällöllisesti. @fi
definition: Relaciona un recurs amb un recurs que és una part del mateix recurs com un altre recurs de part. @ca
definition: Relaterer en ressource til en ressource udgivet sammen med en anden ressource uden nogen relation til dens indhold. @da
definition: Relates a resource to a resource that is a part of the same resource as another part resource.
definition: Setzt eine Ressource in Beziehung zu einer Ressource, die mit einer in Beziehung stehenden Ressource erscheint, ohne eine Beziehung zu deren Inhalt zu haben. @de
definition: يربط بين مصدر ومصدر صَدر مع مصدر ذي صلة، بدون أي علاقة بمحتواه. @ar
definition: 将一种资源与作为另一种部分资源的同一种资源之一部分的一种资源关联起来。 @zh-hans

has mirror site
lexical alias: mirrorSite.en
status: Published
type: Property
label: ayna site ile ilişkilidir @tr
label: er spejlside @da
label: hat Mirror-Site @de
label: heeft mirror site @nl
label: peilisivusto @fi
label: tükörszájtja a következő: @hu
label: له موقع بديل @ar
label: 有镜像站点 @zh-hans
sub property of: has equivalent
definition: Bir kaynağı, orijinal sitenin içeriğinde ağ trafiğini azaltmak veya ulaşılabiliriğini yükseltmek için kullanılan bir web sitesinin tam kopyası olan bir kaynak ile ilişkilendirir. @tr
definition: Hozzákapcsol egy forrást egy forráshoz, amely pontos másolata egy weboldalnak, amelyet a hálózati forgalom csökkentésére vagy az eredeti szájt elérésének a javítására használnak. @hu
definition: Liittää aineiston aineistoon, joka on verkkosivuston tarkka kopio ja jota käytetään parantamaan alkuperäisen sivuston saavutettavuutta vähentämällä verkkoliikenteen kuormitusta. @fi
definition: Relaterer en ressource til en ressource, der er en nøjagtig kopi af en hjemmeside, som er anvendt til at reducere netværkstrafik eller forbedre tilgængeligheden af originalsidens indhold. @da
definition: Relates a resource to a resource that is an exact copy of a website, used to reduce network traffic or improve the availability of the content of the original site.
definition: Setzt eine Ressource in Beziehung zu einer Ressource, die eine exakte Kopie einer Website ist und verwendet wird, um den Datenverkehr in einem Netzwerk zu reduzieren oder die Verfügbarkeit des Inhalts der Originalseite zu verbessern. @de
definition: يربط بين مصدر ومصدر يُعد نسخة طبق الأصل من موقع إلكتروني، مستخدم لتقليل الدخول على الشبكة أو لتحسين الإتاحة لمحتوى الموقع الأصلي. @ar
definition: 将一种资源与作为一个网站精确复本、用于减少网络流量或提高原站点内容获取能力的资源关联起来。 @zh-hans

is complemented by
has subproperty: is libretto for
has subproperty: is screenplay for
has subproperty: has screenplay
has subproperty: has radio script
has subproperty: has libretto
has subproperty: is script for radio program
has subproperty: has music
has subproperty: is music for
has subproperty: has choreography
has subproperty: is choreography for
has subproperty: has text resource
has subproperty: is text for resource
has subproperty: has spoken word resource
has subproperty: has sounds
has subproperty: is spoken word for resource
has subproperty: is sounds for
lexical alias: complementedBy.en
status: Published
type: Property
label: er komplementeret af @da
label: ile tamamlanmıştır @tr
label: is gecomplementeerd door @nl
label: ist vervollständigt durch @de
label: kiegészíti, kiegészítése a következő: @hu
label: taydentävä aineisto @fi
label: هو مُكَمَّل بـ @ar
label: 被……补充 @zh-hans
sub property of: has accompanying resource relationship with (Deprecated)
definition: Bir kaynağı, her iki kaynak da baskın olarak kabul edilmeksizin ilgili bir kaynakla eşleştirilmiş bir kaynakla ilişkilendirir. @tr
definition: Hozzákapcsol egy forrást egy másik forrással párosított forráshoz, anélkül, hogy bármelyiket dominánsnak kellene tekinteni. @hu
definition: Liittää aineiston teokseen, joka on yhdistetty siihen liittyvään teokseen ilman, että kumpaakaan teosta pidetään ensisijaisena. @fi
definition: Relaterer en ressource til en ressource, der er parret med en anden ressource, uden at én af ressourcerne betragtes som værende vigtigst. @da
definition: Relates a resource to a resource paired with a related resource without either resource being considered to be predominant.
definition: Setzt eine Ressource in Beziehung zu einer Ressource, die mit einer in Beziehung stehenden Ressource zusammengebracht wird, ohne dass eine der beiden als Hauptressource angesehen wird. @de
definition: يربط بين مصدر ومصدر مقترن بمصدر ذي صلة دون اعتبار أحدهما هو المصدر السائد. @ar
definition: 将一种资源与和一种相关资源配对而两者都不被认为占主导地位的一种资源关联起来。 @zh-hans

is separated into
lexical alias: separatedInto.en
status: Published
type: Property
label: aineistosta jakautunut @fi
label: ayrılmıştır @tr
label: elválasztva a következőbe: @hu
label: er delvis fortsat i @da
label: is afgesplitst in @nl
label: ist teilweise fortgesetzt von @de
label: هو مُنقَسِم إلى @ar
label: 被分出而成 @zh-hans
sub property of: is succeeded by
inverse of: is separated from
definition: Bir kaynağı, sürmekte olan başka bir artzamanlı kaynağın kısmi içeriğini sürdüren artzamanlı bir kaynak olan kaynakla ilişkilendirir. @tr
definition: Hozzákapcsol egy forrást egy diakronikus forráshoz, amely egy másik folytatódó diakronikus forrás részleges tartalmát folytatja. @hu
definition: Liittää aineiston aineistoon, oka on diakroninen aineisto, joka jatkaa toisen diakronisen jatkuvan aineiston sisältöä osittain. @fi
definition: Relaterer en ressource til en ressource, hvoraf en del af indholdet er udskilt fra en tidligere ressource, så en ny ressource er dannet. @da
definition: Relates a resource to a resource that is a diachronic resource that continues the partial content of another diachronic resource that is continuing.
definition: Setzt eine Ressource in Beziehung zu einer diachronen Ressource, die teilweise den Inhalt einer anderen fortlaufenden diachronen Ressource fortführt. @de
definition: يربط بين مصدر ومصدر ممتد زمنيًا يُكْمل المحتوى الجزئي لمصدر آخر ممتد زمنيًا ومستمر. @ar
definition: 将一种资源与作为一种历时资源、继承另一种继续出版的历时资源的部分内容的一种资源关联起来。 @zh-hans
scope note: Bu öğe, genel olarak ardışık bir kaynak için geçerlidir. @tr
scope note: Denne relation anvendes generelt for periodika. @da
scope note: Ez az elem általában a folyamatos forrásokra vonatkozik. @hu
scope note: Im Allgemeinen trifft dieses Element auf eine sukzessive Ressource zu. @de
scope note: This element applies in general to a successive resource.
scope note: Tämä elementti soveltuu yleensä peräkkäisesti ilmestyvään aineistoon. @fi
scope note: ينطبق هذا العنصر بشكل عام على مصدر متتالي. @ar
scope note: 该元素一般适用于一种相继资源。 @zh-hans

has digital transfer
lexical alias: digitalTransfer.en
status: Published
type: Property
label: digitális átvitele a következő: @hu
label: dijital aktarım ile ilişkilidir @tr
label: har digital overførsel @da
label: hat digitale Übertragung @de
label: heeft digitale kopie @nl
label: konvertoinnin tulos (aineisto) @fi
label: له تحويل رقمي @ar
label: 有数字转储 @zh-hans
sub property of: is reproduced as
inverse of: is digital transfer of
definition: Bir kaynağı, başka bir dijital formattaki bir kaynağın aktarılmasından kaynaklanan dijital formattaki kaynakla ilişkilendirir @tr
definition: Hozzákapcsol egy forrást egy digitális formátumú forráshoz, amely egy másik digitális formátumú forrás átviteléből származik. @hu
definition: Liittää aineiston digitaalisessa muodossa olevaan aineistoon, joka on tulos toisessa digitaalisessa muodossa olevan aineiston muunnoksesta. @fi
definition: Relaterer en ressource til en ressource i et digitalt format, der er resultatet af en overførsel af en ressource i et andet digitalt format. @da
definition: Relates a resource to a resource in a digital format that results from a transfer of a resource in another digital format.
definition: Setzt eine Ressource in Beziehung zu einer Ressource in einem digitalen Format, die durch die Übertragung einer Ressource in ein anderes digitales Format entsteht. @de
definition: يربط بين مصدر ومصدر فى صيغة رقمية نتج عن تحويل مصدر إلى شكل رقمي آخَر. @ar
definition: 将一种资源与从另一种数字格式的资源转储为一种数字格式而形成的资源关联起来。 @zh-hans

is screenplay for
has subproperty: is screenplay for motion picture
has subproperty: is screenplay for television program
has subproperty: is screenplay for video
lexical alias: screenplayFor.en
status: Published
type: Property
label: er drejebog til @da
label: forgatókönyv a következőhöz: @hu
label: is scenario voor @nl
label: ist Drehbuch für @de
label: käsikirjoitusaineisto @fi
label: senaryosu @tr
label: هو سيناريو لـ @ar
label: 是……的影视剧剧本 @zh-hans
sub property of: is complemented by
inverse of: has screenplay
definition: Bir kaynağı, senaryo kullanan ve metinsel bir kaynakla tamamlanan bir kaynakla ilişkilendirir. @tr
definition: Hozzákapcsol egy forrást egy forgatókönyvet használó forráshoz, amelyet egy szöveges forrás egészít ki. @hu
definition: Liittää aineiston aineistoon, joka käyttää käsikirjoitusta ja jota on täydennetty tekstiaineistolla. @fi
definition: Relaterer en ressource til en ressource, såsom en film, et skuespil, et tv-program eller en video, der anvender en ressources tekst som manuskript. @da
definition: Relates a resource to a resource that uses a screenplay and that is complemented by a textual resource.
definition: Setzt eine Ressource in Beziehung zu einer Ressource, die ein Drehbuch verwendet und durch eine textliche Ressource vervollständigt wird. @de
definition: يربط بين مصدر ومصدر يستخدم سيناريو ويكمله مصدر نصي. @ar
definition: 将一种资源与使用一种影视剧剧本并被一种文字资源补充的一种资源关联起来。 @zh-hans

is incidental music for
lexical alias: incidentalMusicFor.en
status: Published
type: Property
label: er skuespilsmusik til @da
label: fon müziğidir @tr
label: is toneelmuziek voor @nl
label: ist Bühnenmusik für @de
label: kísérőzene a következőhöz: @hu
label: näytelmämusiikkiaineisto @fi
label: هو موسيقى تصويرية لـ @ar
label: 是……的配乐 @zh-hans
sub property of: is music for
inverse of: has incidental music
definition: Bir kaynağı, sözlü olarak gerçekleştirilen ve müzikal kaynakla tamamlanan bir oyun veya sahne için kullanılan başka bir kaynakla ilişkilendirir. @tr
definition: Hozzákapcsol egy forrást egy színdarabhoz vagy más beszélt színpadi forráshoz, amelyet egy zenei forrás egészít ki. @hu
definition: Liittää aineiston näytelmään tai muuhun näyttämöesitykseen, joka on toteutettu @fi
definition: Relaterer en ressource til en ressource, såsom et skuespil eller et andet talt sceneværk, der anvender en ressource til et musikværk som tilhørende musik. @da
definition: Relates a resource to a resource that is a play or other resource for the stage that is realized as spoken word and that is complemented by a musical resource.
definition: Setzt eine Ressource in Beziehung zu einer Ressource, bei der es sich um ein Drama oder eine andere, gesprochene Bühnenressource handelt, die durch eine Musikressource vervollständigt wird. @de
definition: يربط بين مصدر ومصدر مسرحي أو مصدر آخر للمسرح الذي يتحقق على أنه كلمة منطوقة ويكمله مصدر موسيقي. @ar
definition: 将一种资源与作为被一种音乐作品补充的通过口语实现的戏剧或其他舞台资源的一种资源关联起来。 @zh-hans

has abstract
lexical alias: abstract.en
status: Published
type: Property
label: aineiston abstrakti @fi
label: er sammenfattet som @da
label: is geabstraheerd als @nl
label: ist Abstract als @de
label: referátuma a következő: @hu
label: té resum @ca
label: özet ile ilişkilidir @tr
label: هو مستخلص كـ @ar
label: 有摘要 @zh-hans
sub property of: has summary
inverse of: is abstract of
alternative label: abstraktin perustana oleva aineisto @fi
alternative label: is abstracted as
alternative label: olarak özetlenir @tr
alternative label: és resumit com @ca
alternative label: 被摘要为 @zh-hans
definition: Bir kaynağı, bir kaynağın tarafsız bir özeti olan bir kaynakla ilişkilendirir. @tr
definition: Hozzákapcsol egy forrást egy forráshoz, amely egy másik forrást rövid, objektív módon lerövidít. @hu
definition: Liittää aineiston aineistoon, joka on objektiivinen tiivistelmä aineistosta. @fi
definition: Relaciona un recurs amb un recurs que és un sumari objectiu d’un recurs. @ca
definition: Relaterer en ressource til en ressource, der forkorter en oprindelig ressource på en kortfattet, objektiv måde. @da
definition: Relates a resource to a resource that is an objective summary of a resource.
definition: Setzt eine Ressource in Beziehung zu einer Ressource, die eine andere Ressource auf eine kurze, sachliche Art verkürzt. @de
definition: يربط بين مصدر ومصدر يختصر مصدرًا آخر بطريقة موجزة موضوعية. @ar
definition: 将一种资源与作为一种资源之客观提要的一种资源关联起来。 @zh-hans

is augmented by
has subproperty: has cadenza
has subproperty: has errata
has subproperty: has illustrations
has subproperty: has addenda
has subproperty: has appendix
has subproperty: has guide
has subproperty: has supplement
lexical alias: augmentedBy.en
status: Published
type: Property
label: bővíti a következő: @hu
label: er beriget med @da
label: ile arttırılmıştır @tr
label: is aangevuld door @nl
label: ist erweitert durch @de
label: laajennettu aineistolla @fi
label: هو مُعَزَّز بـ @ar
label: 被……附增 @zh-hans
sub property of: has accompanying resource relationship with (Deprecated)
inverse of: is augmentation of
definition: Bir kaynağı, baskın bir kaynağın içeriğine eklenen kaynakla ilişkilendirir. @tr
definition: Hozzákapcsol egy forrást egy forráshoz, amely egy domináns forrás tartalmát gyarapítja. @hu
definition: Liittää aineiston aineistoon, joka täydentää vallitsevan aineiston sisältöä. @fi
definition: Relaterer en ressource til en ressource, der føjer noget til en hovedressources indhold. @da
definition: Relates a resource to a resource that adds to the content of a predominant resource.
definition: Setzt eine Ressource in Beziehung zu einer Ressource, die den Inhalt einer Hauptressource ergänzt. @de
definition: يربط بين مصدر ومصدر يُضاف إلى محتوى مصدر سائد. @ar
definition: 将一种资源与增加到一种主要资源之内容中去的一种资源关联起来。 @zh-hans

has summary
has subproperty: has abstract
lexical alias: summary.en
status: Published
type: Property
label: er opsummeret som @da
label: is samengevat als @nl
label: ist zusammenfasst als @de
label: tiivistelmän sisältävä aineisto @fi
label: té sumari @ca
label: összefoglalva a következőként: @hu
label: özet ile ilişkilidir @tr
label: هو مُلَخّص كـ @ar
label: 有提要 @zh-hans
sub property of: is described by
inverse of: is summary of
alternative label: is summarized as
alternative label: olarak özetlenmiştir @tr
alternative label: tiivistelmä aineistosta @fi
alternative label: és sumaritzat com @ca
alternative label: 被提要为 @zh-hans
definition: Bir kaynağı, kaynağın kısa bir açıklaması olan kaynakla ilişkilendirir. @tr
definition: Hozzákapcsol egy forrást egy forráshoz, amely egy másik forrás tartalmának rövid összegzéséből áll. @hu
definition: Liittää aineiston aineistoon, joka on lyhyt kuvaus sen sisällöstä. @fi
definition: Relaciona un recurs amb un recurs que és una descripció breu d’un recurs. @ca
definition: Relaterer en ressource til en ressource, der består af en kortfattet gengivelse af en oprindelig ressources indhold. @da
definition: Relates a resource to a resource that is a brief description of a resource.
definition: Setzt eine Ressource in Beziehung zu einer Ressource, die aus einer kurzen Wiederholung des Inhalts einer anderen Ressource besteht. @de
definition: يربط بين مصدر ومصدر يتكون من تلخيص موجز لمحتوى مصدر آخَر. @ar
definition: 将一种资源与作为一种资源简要描述的一种资源关联起来。 @zh-hans

has catalogue
lexical alias: catalogue.en
status: Published
type: Property
label: er katalog @da
label: hat Katalog @de
label: heeft catalogus @nl
label: katalog ile ilişkilidir @tr
label: katalógusa a következő: @hu
label: kokoelmaluettelo @fi
label: له فِهرِس @ar
label: 有目录 @zh-hans
sub property of: has finding aid
inverse of: is catalogue of
definition: Bir kaynağı, bir koleksiyon kaynağı tarafından sahip olunan kaynaklar için bir üstveri seti olan kaynakla ilişkilendirir. @tr
definition: Hozzákapcsol egy forrást egy forráshoz, amely szisztematikusan elrendezett források teljes felsorolásából áll. @hu
definition: Liittää aineiston aineistoon, joka on kokoelma-aineistoon kuuluvan aineiston metatietokokonaisuus. @fi
definition: Relaciona un recurs amb un recurs que és un conjunt de descripció de metadades per als recursos que s’apleguen en un recurs de col·lecció de recursos. @ca
definition: Relaterer en ressource til en ressource, der består af en komplet fortegnelse over ressourcer, der er arrangeret systematisk. @da
definition: Relates a resource to a resource that is a metadata description set for the resources that are held by a collection resource.
definition: Setzt eine Ressource in Beziehung zu einer Ressource, die aus einer vollständigen Aufzählung von Ressourcen besteht, die systematisch angeordnet sind. @de
definition: يربط بين مصدر ومصدر يتكون من حصر كامل لمصادر مرتبة بشكل منهجي. @ar
definition: 将一种资源与作为一种收藏资源所收入的各种资源的元数据描述集合的一种资源关联起来。 @zh-hans

has special issue
lexical alias: specialIssue.en
status: Published
type: Property
label: er særnummer @da
label: erikoisnumero (aineisto) @fi
label: hat Sonderausgabe @de
label: heeft themanummer @nl
label: különszáma a következő: @hu
label: özel sayı ile ilişkilidir @tr
label: له إصدار خاص @ar
label: 有特刊 @zh-hans
sub property of: has part resource
inverse of: is special issue of
definition: Bir kaynağı, belirli bir konuya yönelik bir sayı olan bir kaynakla ilişkilendirir. @tr
definition: Hozzákapcsol egy forrást egy forráshoz, amely egy adott témának szentelt szám. @hu
definition: Liittää aineiston aineistoon, joka on tietylle aiheelle omistettu numero. @fi
definition: Relaterer en ressource til en ressource, der består af et enkelt nummer eller et tillæg til et periodikum eller en avis, helliget et bestemt emne og med eller uden nummerering. @da
definition: Relates a resource to a resource that is an issue that is devoted to a specific topic.
definition: Setzt eine Ressource in Beziehung zu einer Ausgabe, die einem bestimmten Thema gewidmet ist. @de
definition: يربط بين مصدر ومصدر عبارة عن عدد مخصص لموضوع محدد. @ar
definition: 将一种资源与作为完全关于一个特定话题的一期的一种资源关联起来。 @zh-hans

has concordance
lexical alias: concordance.en
status: Published
type: Property
label: aineiston konkordanssihakemisto @fi
label: er konkordans @da
label: hat Konkordanz @de
label: heeft concordantie @nl
label: konkordanciája a következő: @hu
label: konkordans ile ilişkilidir @tr
label: له كشاف نصوص @ar
label: 有词语索引 @zh-hans
sub property of: aineistoon liittyvä aineisto
inverse of: is concordance for
definition: Bir kaynağı, metinsel kaynakta geçen bütün veya seçilmiş kelimelerin dizini olan bir kaynakla ilişkilendirir. @tr
definition: Hozzákapcsol egy forrást egy forráshoz, amely egy szöveges forrás összes szavának vagy válogatott szavak mutatójából áll. @hu
definition: Liittää aineiston aineistoon, joka on kaikkien tai valikoitujen tekstiaineiston toteutuksessa esiintyvien sanojen hakemisto. @fi
definition: Relaciona un recurs amb un recurs que és una guia sistemàtica de totes les paraules o d’una selecció de les paraules que apareixen en un recurs textual. @ca
definition: Relaterer en ressource til en ressource, der består af et indeks over alle ordene i en hovedressource. @da
definition: Relates a resource to a resource that is a systematic guide of all or selected words that occur in a textual resource.
definition: Setzt eine Ressource in Beziehung zu einer Ressource, die aus einem Index aller oder ausgewählter Wörter besteht, die in einer textlichen Ressource vorkommen. @de
definition: يربط بين مصدر ومصدر يتكون من كشاف لكل الكلمات أو لكلمات محددة والتي تظهر في مصدر نصي. @ar
definition: 将一种资源与作为一种文字资源中出现的所有或所选词语的系统指南的一种资源关联起来。 @zh-hans

has addenda
lexical alias: addenda.en
status: Published
type: Property
label: ek ile ilişkilidir @tr
label: er tillæg @da
label: hat Ergänzung @de
label: heeft toevoegingen @nl
label: lisäykset aineistossa @fi
label: pótlása a következő: @hu
label: له إضافات @ar
label: 有补遗 @zh-hans
sub property of: is augmented by
inverse of: is addenda to
definition: Bir kaynağı, ilgili kaynağın bütünlüğü için gerekli olan kısa içerikten oluşan kaynakla ilişkilendirir. @tr
definition: Hozzákapcsol egy forrást egy rövid tartalomból álló forráshoz, amely nélkülözhetetlen egy kapcsolódó forrás teljességéhez. @hu
definition: Liittää aineiston aineistoon, joka koostuu suppeasta sisällöstä, joka on olennainen siihen liittyvän aineiston kokonaisuudelle. @fi
definition: Relaterer en ressource til en ressource, der består af kortfattet indhold, som er væsentligt for fuldstændigheden af en anden ressource. @da
definition: Relates a resource to a resource that consists of brief content that is essential for the completeness of a related resource.
definition: Setzt eine Ressource in Beziehung zu einer Ressource, die aus kurzem Inhalt besteht, der für die Vollständigkeit einer in Beziehung stehenden Ressource notwendig ist. @de
definition: يربط بين مصدر ومصدر يتكون من محتوى موجز يُعَد ضروريًا لاستكمال مصدر ذي صلة. @ar
definition: 将一种资源与由简要内容组成并对一种相关资源的完整性必不可少的一种资源关联起来。 @zh-hans

is adapted as libretto
lexical alias: adaptedAsLibretto.en
status: Published
type: Property
label: er bearbejdet til libretto @da
label: is bewerkt als libretto @nl
label: ist bearbeitet als Libretto @de
label: libretto olarak uyarlanmıştır @tr
label: librettóként való feldolgozása a következő: @hu
label: sovitettu libretoksi (aineisto) @fi
label: هو مقتبس كنص أوبرالي @ar
label: 被改编为台本 @zh-hans
sub property of: has derivative
inverse of: is libretto based on
definition: Bir kaynağı opera, bale veya müzik sahnesi için başka bir kaynak ya da oratoryo gibi müzikal veya koreografik bir kaynakla ilişkilendirir @tr
definition: Hozzákapcsol egy forrást egy olyan zenei vagy koreografikus forráshoz, mint egy opera, vagy egyéb zenés színpadi forrás, vagy egy oratórium. @hu
definition: Liittää aineiston musiikkiaineistoon tai koreografiseen aineistoon kuten oopperaan, balettiin tai muuhun musiikilliseen näyttämöteokseen tai oratorioon. @fi
definition: Relaterer en ressource til en ressource, der består af tekst til en opera eller en anden ressource for den musikalske scene eller et oratorium baseret på en oprindelig ressource. @da
definition: Relates a resource to a musical or choreographic resource such as an opera, a ballet, or other resource for the musical stage, or an oratorio
definition: Setzt eine Ressource in Beziehung zu einer Musikressource oder choreografischen Ressource, wie zum Beispiel einer Oper, einem Ballett oder einer anderen Musikressource für die Bühne, oder zu einem Oratorium. @de
definition: يربط بين مصدر ومصدر موسيقي أو راقص مثل الأوبرا، الباليه، أو مصدر آخر للمسرح الموسيقي، أو موسيقى دينية. @ar
definition: 将一种资源与诸如歌剧、芭蕾或其他舞台音乐资源或清唱剧的一种音乐或编舞资源关联起来。 @zh-hans

is reviewed by
lexical alias: reviewedBy.en
status: Published
type: Property
label: arvosteltu aineisto @fi
label: er anmeldt i @da
label: is gerecenseerd in @nl
label: ist rezensiert in @de
label: szemlézve a következőben: @hu
label: tarafından incelenmiştir @tr
label: és revisat per @ca
label: تمت مراجعته في @ar
label: 被……评论 @zh-hans
sub property of: is evaluated by
inverse of: is review of
alternative label: arvioitu aineisto @fi
alternative label: is reviewed in
alternative label: içinde incelenmiştir @tr
alternative label: és revisat en @ca
alternative label: 被评论于 @zh-hans
definition: Bir kaynağı, bir kaynağın kısa bir değerlendirmesi olan kaynakla ilişkilendirir. @tr
definition: Hozzákapcsol egy forrást egy forráshoz, amely egy forrás rövid értékelése. @hu
definition: Liittää aineiston aineistosta tehtyyn tiiviiseen arviointiin. @fi
definition: Relaciona un recurs amb un recurs que és una avaluació breu d’un recurs. @ca
definition: Relaterer en ressource til en ressource, der indeholder en kort kritik af en beskreven ressource. @da
definition: Relates a resource to a resource that is a brief evaluation of a resource.
definition: Setzt eine Ressource in Beziehung zu einer Ressource, bei der es sich um eine kurze Untersuchung einer Ressource handelt. @de
definition: يربط بين مصدر ومصدر يحتوي على تقييم موجز لمصدر. @ar
definition: 将一种资源与作为一种资源之简要评价的一种资源关联起来。 @zh-hans

is critiqued by
lexical alias: critiquedBy.en
status: Published
type: Property
label: aineiston arvostelu @fi
label: bírálva a következőben: @hu
label: er kritiseret i @da
label: is bekritiseerd in @nl
label: ist Kritik in @de
label: tarafından eleştirilmiştir @tr
label: és criticat per @ca
label: هو مُنتقد في @ar
label: 被……批评 @zh-hans
sub property of: is evaluated by
inverse of: is critique of
alternative label: arvosteltu aineisto @fi
alternative label: is critiqued in
alternative label: içinde eleştirilmiştir @tr
alternative label: és criticat en @ca
alternative label: 被批评于 @zh-hans
definition: Bir kaynağı, bir kaynağın değerlendirmesi olan bir kaynakla ilişkilendirir. @tr
definition: Hozzákapcsol egy forrást egy forráshoz, amely egy forrás kritikai értékelése. @hu
definition: Liittää aineiston aineistosta tehtyyn kriittiseen arviointiin. @fi
definition: Relaciona un recurs amb un recurs que és una avaluació crítica d’un recurs. @ca
definition: Relaterer en ressource til en ressource, der indeholder en kritisk vurdering af en beskreven ressource. @da
definition: Relates a resource to a resource that is a critical evaluation of a resource.
definition: Setzt eine Ressource in Beziehung zu einer Ressource, bei der es sich um eine kritische Untersuchung einer Ressource handelt. @de
definition: يربط بين مصدر ومصدر يحتوي على تقييم نقدي لمصدر. @ar
definition: 将一种资源与作为一种资源之批评性评价的一种资源关联起来。 @zh-hans

is commentary in
lexical alias: commentaryIn.en
status: Published
type: Property
label: er kommentar i @da
label: is commentaar in @nl
label: ist kommentiert in @de
label: kommentaari aineistosta @fi
label: kommentálva a következőben: @hu
label: yorumdur @tr
label: هو مُعلق عليه في @ar
label: 是……中的评注 @zh-hans
sub property of: is described by
inverse of: is commentary on
definition: Bir kaynağı, kaynakla ilgili açıklayıcı veya eleştirel notlar seti olan bir kaynakla ilişkilendirir @tr
definition: Hozzákapcsol egy forrást egy forráshoz, amely egy forrás magyarázó vagy kritikai jegyzeteinek a halmaza. @hu
definition: Liittää aineiston aineistoon, joka on selittävä tai kriittinen huomautus aineistosta. @fi
definition: Relaterer en ressource til en ressource, der indeholder et sæt af forklarende eller kritiske noter om en beskreven ressource. @da
definition: Relates a resource to a resource that is a set of explanatory or critical notes on a resource
definition: Setzt eine Ressource in Beziehung zu einer Ressource, bei der es sich um eine Reihe von erläuternden oder kritischen Anmerkungen zu einer Ressource handelt. @de
definition: يربط بين مصدر ومصدر يحتوي على مجموعة من الملاحظات الشارحة أو الناقدة لمصدر. @ar
definition: 将一种资源与作为关于一种资源的解释性或评论性附注之集合的一种资源关联起来。 @zh-hans

is imitated as
has subproperty: is parodied as
lexical alias: imitatedAs.en
status: Published
type: Property
label: er efterlignet som @da
label: is geïmiteerd in @nl
label: ist imitiert als @de
label: jäljitelmä aineistosta @fi
label: olarak taklit edilmiştir @tr
label: utánozva a következőként: @hu
label: هو محاكاة كـ @ar
label: 被模仿成为 @zh-hans
sub property of: has derivative
inverse of: is imitation of
definition: Bir kaynağı, başka bir kaynağın biçimini veya içeriğini kopyalayan kaynakla ilişkilendirir. @tr
definition: Hozzákapcsol egy forrást egy forráshoz, amely egy másik forrás stílusát vagy tartalmát másolja. @hu
definition: Liittää aineiston aineistoon, joka kopioi toisen aineiston tyyliä tai sisältöä. @fi
definition: Relaterer en ressource til en ressource, der kopierer en oprindelig ressources stil eller indhold. @da
definition: Relates a resource to a resource that copies the style or content of another resource.
definition: Setzt eine Ressource in Beziehung zu einer Ressource, die den Stil oder Inhalt einer anderen Ressource kopiert. @de
definition: يربط بين مصدر ومصدر ينسخ نمط أو محتوى مصدر آخَر. @ar
definition: 将一种资源与复制另一种资源的风格和内容的一种资源关联起来。 @zh-hans

is described by
has subproperty: has summary
has subproperty: is commentary in
has subproperty: is analysed in
has subproperty: is described with metadata by
lexical alias: describedBy.en
status: Published
type: Property
label: aineistoa kuvaava @fi
label: er beskrevet i @da
label: is beschreven in @nl
label: ist beschrieben in @de
label: leírása ebben: @hu
label: tarafından tanımlanmıştır @tr
label: és descrit per @ca
label: هو موصوف في @ar
label: 被……描述 @zh-hans
sub property of: is subject of
inverse of: is description of
alternative label: is described in
alternative label: içinde tanımlanmıştır @tr
alternative label: kuvattu @fi
alternative label: és descrit en @ca
alternative label: 被描述于 @zh-hans
definition: Bir varlığı, varlığın tanımı olan bir kaynakla ilişkilendirir. @tr
definition: Hozzákapcsol egy entitást egy forráshoz, amely egy entitást ír le. @hu
definition: Liitttää aineiston aineistoon, joka on kuvaus entiteetistä. @fi
definition: Relaciona una entitat amb un recurs que és una descripció d’una entitat. @ca
definition: Relaterer en ressource til en ressource, der beskriver en beskreven entitet. @da
definition: Relates an entity to a resource that is a description of an entity.
definition: Setzt eine Entität in Beziehung zu einer Ressource, die eine Entität beschreibt. @de
definition: يربط كيانًا بمصدر يصف كيان. @ar
definition: 将一个实体与作为一个实体之描述的一种资源关联起来。 @zh-hans

is expanded as
lexical alias: expandedAs.en
status: Published
type: Property
label: er udvidet til @da
label: is uitgebreid als @nl
label: ist erweitert als @de
label: kibővítve a következőként: @hu
label: laajennelma @fi
label: olarak genişletilmiştir @tr
label: هو مُوَسّع كـ @ar
label: 被扩充为 @zh-hans
sub property of: has derivative
inverse of: is expanded version of
definition: Bir kaynağı, başka bir kaynağın içeriğini genişleten kaynakla ilişkilendirir. @tr
definition: Hozzákapcsol egy forrást egy forráshoz, amely egy másik forrás tartalmát tágítja. @hu
definition: Liittää aineiston aineistoon, joka laajentaa toisen aineiston sisältöä. @fi
definition: Relaterer en ressource til en ressource, der uddyber en oprindelig ressources indhold. @da
definition: Relates a resource to a resource that enlarges upon the content of another resource.
definition: Setzt eine Ressource in Beziehung zu einer Ressource, die den Inhalt einer anderen Ressource erweitert. @de
definition: يربط بين مصدر ومصدر يتوسع في محتوى مصدر آخَر. @ar
definition: 将一种资源与在另一种资源上扩充的一种资源关联起来。 @zh-hans

has facsimile
has subproperty: has preservation facsimile
lexical alias: facsimile.en
status: Published
type: Property
label: har faksimile @da
label: hasonmása a következő: @hu
label: heeft facsimile @nl
label: ist Faksimile @de
label: näköispainos aineistosta @fi
label: tıpkıbasım ile ilişkilidir @tr
label: له نسخة طبق الأصل. @ar
label: 有摹真品 @zh-hans
sub property of: is reproduced as
inverse of: is facsimile of
definition: Bir kaynağı, bir kaynağı bünyesinde barındıran ilgili bir kaynağı birebir yeniden üreten bir kaynakla ilişkilendirir. @tr
definition: Hozzákapcsol egy forrást egy forráshoz, amely pontos másolata egy forrásban megtestesülő kapcsolódó forrásnak. @hu
definition: Liittää aineiston aineistoon, joka on toisen, liittyvän aineiston tarkka jäljennös. @fi
definition: Relaterer en ressource til en ressource, der er en nøjagtig reproduktion af en anden ressource. @da
definition: Relates a resource to a resource that exactly reproduces a related resource embodying a resource.
definition: Setzt eine Ressource in Beziehung zu einer Ressource, die eine in Beziehung stehende Ressource, die eine Ressource verkörpert, exakt reproduziert. @de
definition: يربط بين مصدر ومصدر يستنسخ بشكل تام مصدر ذو صلة يُجسد مصدر. @ar
definition: 将一种资源与精确复制具体化一种资源的一种关联资源的一种资源关联起来。 @zh-hans

is evaluated by
has subproperty: is reviewed by
has subproperty: is critiqued by
lexical alias: evaluatedBy.en
status: Published
type: Property
label: arviointi aineistosta @fi
label: er evalueret i @da
label: is beoordeeld in @nl
label: ist evaluiert in @de
label: tarafından değerlendirilmiştir @tr
label: értékelve a következőben: @hu
label: és avaluat per @ca
label: هو مُقيم فى @ar
label: 被……评价 @zh-hans
sub property of: is subject of
inverse of: is evaluation of
alternative label: arvioitu aineisto @fi
alternative label: is evaluated in
alternative label: içinde değerlendirilmiştir @tr
alternative label: és avaluat en @ca
alternative label: 被评价于 @zh-hans
definition: Bir kaynağı, bir kaynağın incelemesi veya değerlendirmesi olan bir kaynakla ilişkilendirir. @tr
definition: Hozzákapcsol egy forrást egy forráshoz, amely egy forrást vizsgál és ítél meg. @hu
definition: Liittää aineiston aineistoon, joka on tutkiva arviointi tai arvostelu aineistosta. @fi
definition: Relaciona un recurs amb un recurs que és un examen o un judici d’un recurs. @ca
definition: Relaterer en ressource til en ressource, der undersøger eller bedømmer en beskreven ressource. @da
definition: Relates a resource to a resource that is an examination or judgement of a resource.
definition: Setzt eine Ressource in Beziehung zu einer Ressource, die eine Ressource untersucht oder beurteilt. @de
definition: يربط بين مصدر ومصدر يختبر أو يحكم على مصدر. @ar
definition: 将一种资源与作为一种资源之检查和判断的一种资源关联起来。 @zh-hans

is analysed in
lexical alias: analysedIn.en
status: Published
type: Property
label: analysoitu aineisto @fi
label: elemezve a következőben: @hu
label: er analyseret i @da
label: is geanalyseerd in @nl
label: ist analysiert in @de
label: içinde analiz edilmiştir @tr
label: هو مُحَلَّل في @ar
label: 被分析于 @zh-hans
sub property of: is described by
inverse of: is analysis of
definition: Bir kaynağı başka bir kaynağın yapısını ve bileşimini anlatan bir kaynakla ilişkilendirir. @tr
definition: Hozzákapcsol egy forrást egy forráshoz, amely egy másik forrást vizsgál, hogy leírhassa annak alkotóelemeit és azok viszonyait. @hu
definition: Liitttää aineiston aineistoon, joka kuvaa toisen aineiston rakennetta. @fi
definition: Relaterer en ressource til en ressource, der undersøger en oprindelig ressource for at identificere dets dele og deres relationer. @da
definition: Relates a resource to a resource that describes the structure and composition of another resource.
definition: Setzt eine Ressource in Beziehung zu einer Ressource, die den Aufbau und die Zusammensetzung einer anderen Ressource beschreibt. @de
definition: يربط بين مصدر ومصدر يصف بنية وتكوين مصدر آخر. @ar
definition: 将一种资源与描述另一种资源的结构和创作的一种资源关联起来。 @zh-hans

has prequel
lexical alias: prequel.en
status: Published
type: Property
label: aineiston esiosa @fi
label: előzménye a következő: @hu
label: er forløber @da
label: hat Prequel @de
label: heeft prequel @nl
label: önceki ile ilişkilidir @tr
label: له بادئه @ar
label: 有前篇 @zh-hans
sub property of: is preceded by
inverse of: is prequel to (Deprecated)
alternative label: aineiston jatko-osa @fi
alternative label: devamı niteliğindedir @tr
alternative label: er efterfølger til @da
alternative label: folytatással rendelkezik @hu
alternative label: is sequel to
alternative label: ist Sequel zu @de
alternative label: هو تَتِمّة لـ @ar
alternative label: 是……的续篇 @zh-hans
definition: Bir kaynağı, başka bir kaynağın anlatımını zamanda geriye doğru götürerek genişleten bir kaynakla ilişkilendirir. @tr
definition: Hozzákapcsol egy forrást egy forráshoz, amely időben visszafelé terjeszti ki egy másik forrás narratíváját. @hu
definition: Liittää aineiston aineistoon, joka laajentaa toisenaineiston kerrontaa ajassa taaksepäin. @fi
definition: Relaterer en ressource til en ressource, der udvider en tidligere ressources fortælling bagud i tiden. @da
definition: Relates a resource to a resource that extends the narrative of another resource backwards in time.
definition: Setzt eine Ressource in Beziehung zu einer Ressource, die den Erzählstrang einer anderen Ressource zeitlich rückwärts erweitert. @de
definition: يربط بين مصدر ومصدر يوسع السرد لمصدر آخر يسبقه زمنيًا. @ar
definition: 将一种资源与把另一种资源的叙述在时间上往回延伸的一种资源关联起来。 @zh-hans

has appendix
lexical alias: appendix.en
status: Published
type: Property
label: aineiston lite @fi
label: ek ile ilişkilidir @tr
label: er bilag @da
label: függeléke a következő: @hu
label: hat Anhang @de
label: heeft appendix @nl
label: له مُلحَق @ar
label: 有附录 @zh-hans
sub property of: is augmented by
inverse of: is appendix to
definition: Bir kaynağı, içeriği ilgili bir kaynağı artıran bir kaynakla ilişkilendirir. @tr
definition: Hozzákapcsol egy forrást egy forráshoz, amelynek a tartalma kibővít egy kapcsolódó forrást. @hu
definition: Liittää aineiston aineistoon, jonka sisältö täydentää toista, liittyvää aineistoa. @fi
definition: Relaterer en ressource til en ressource, der udgør en berigende del af en anden ressource. @da
definition: Relates a resource to a resource whose content augments a related resource.
definition: Setzt eine Ressource in Beziehung zu einer Ressource, deren Inhalt eine in Beziehung stehende Ressource erweitert. @de
definition: يربط بين مصدر ومصدر يزيد محتواه من مصدر ذي صلة. @ar
definition: 将一种资源与其内容附增一种相关资源的一种资源达关联起来。 @zh-hans

has guide
lexical alias: guide.en
status: Published
type: Property
label: er vejledning @da
label: hat Orientierungshilfe @de
label: heeft gids @nl
label: kalauza a következő: @hu
label: opas aineistoon @fi
label: rehber ile ilişkilidir @tr
label: له دليل إرشادي @ar
label: 有指南 @zh-hans
sub property of: is augmented by
inverse of: is guide to
definition: Bir kaynağı, notlar, eğitim ve öğrenim yardımcıları, alıştırmalar, problemler, sorular ve cevaplar, eğitmen veya öğrenci materyalleri vb. kullanarak bir kullanıcıya ana kaynağın kullanımı boyunca rehberlik eden kaynakla ilişkilendirir. @tr
definition: Hozzákapcsol egy forrást egy forráshoz, amely a használót végigvezeti egy domináns forrás használatán jegyzetek, tanulási és tanulmányi segédletek, gyakorlatok, problémák, kérdések és válaszok, oktatói vagy diákanyagok stb. felhasználásával. @hu
definition: Liittää aineiston aineistoon,joka opastaa käyttäjää aineiston käytössä muistiinpanojen, opiskelumateriaalien, harjoitusten, tehtävien, kysymysten ja vastausten tai muiden opettajan tai opiskelijan aineistojen avulla. @fi
definition: Relater en ressource til en ressource, der hjælper en bruger med at anvende en dominerende ressource vha. noter, lære- og studiehjælpemidler, øvelser, problemstillinger, spørgsmål og svar, lærer- og elevmaterialer etc. @da
definition: Relates a resource to a resource that guides a user through the use of a predominant resource, using notes, learning and study aids, exercises, problems, questions and answers, instructor or student materials, etc.
definition: Setzt eine Ressource in Beziehung zu einer Ressource, die Benutzende durch die Verwendung von Anmerkungen, Lern- und Studienhilfen, Übungen, Problemstellungen, Fragen und Antwort oder anderen Lehr- oder Schülermaterialien durch die Nutzung einer Hauptressource führt. @de
definition: يربط بين مصدر ومصدر يُرشد المستخدم من خلال استخدام مصدر سائد، باستخدام الملاحظات، ووسائل التعلم والدراسة، والتمارين، والمسائل، والأسئلة والأجوبة، ومواد المعلم أو الطلاب، إلخ. @ar
definition: 将一种资源与用注释、学习和研究工具、练习、提问、问题与答案、教师或学生参考资料等对使用者使用主要资源提供指导的一种资源关联起来。 @zh-hans

is abridgement of
lexical alias: abridgementOf.en
status: Published
type: Property
label: er forkortelse af @da
label: is inkorting van @nl
label: ist Kurzfassung von @de
label: lyhennelmä aineistosta @fi
label: rövidítése a következőnek: @hu
label: özetlenmiş halidir @tr
label: هو اختصار لـ @ar
label: 是……的缩编 @zh-hans
sub property of: has source
inverse of: is abridged as
definition: Bir kaynağı, genel anlamı veya tanıtım şeklini değiştirmeden ilgili kaynak olarak kısaltılmış bir kaynakla ilişkilendirir. @tr
definition: Hozzákapcsol egy forrást egy forráshoz, amelyet kapcsolódó forrássá tömörítettek, azaz lerövidítettek anélkül, hogy általános jelentését vagy prezentációját megváltoztatták volna. @hu
definition: Liitää aineiston aineistoon, jota on lyhennetty toiseksi, liittyväksi aineistoksi muuttamatta yleistä merkitystä tai esitystapaa. @fi
definition: Relaciona un recurs amb un recurs que és escurçat com un recurs relacionat sense canviar el significat general o la forma de presentació. @ca
definition: Relaterer en ressource til en ressource, der er blevet forkortet, dvs. afkortet, uden at der er ændret på en oprindelig ressources overordnede betydning eller præsentationsmåde. @da
definition: Relates a resource to a resource that is shortened as a related resource without changing the general meaning or manner of presentation.
definition: Setzt eine Ressource in Beziehung zu einer in Beziehung stehenden Ressource, die gekürzt wurde, ohne die allgemeine Bedeutung oder Art der Darstellung der ursprünglichen Ressource zu verändern. @de
definition: يربط بين مصدر ومصدر تم اختصاره كمصدر ذي صلة دون تغيير المعنى العام أو طريقة العرض. @ar
definition: 将一种资源与被缩短为一种相关资源而不改变其总体意义或呈现方式的一种资源关联起来。 @zh-hans

is abstract of
lexical alias: abstractOf.en
status: Published
type: Property
label: abstrakti aineistosta @fi
label: er sammenfatning af @da
label: is abstract van @nl
label: ist Abstract von @de
label: referátuma a következőnek: @hu
label: özetidir @tr
label: هو مُستخلص لـ @ar
label: 是……的摘要 @zh-hans
sub property of: is summary of
inverse of: has abstract
definition: Bir kaynağı, tarafsız bir biçimde özetlenmiş olan kaynakla ilişkilendirir. @tr
definition: Hozzákapcsol egy forrást egy forráshoz, amelyet rövid, objektív módon lerövidítettek. @hu
definition: Liittää aineiston aineistoon, josta on tehty yhteenveto objektiivisella tavalla. @fi
definition: Relaciona un recurs amb un recurs que se sumaritza de manera objectiva. @ca
definition: Relaterer en ressource til en ressource, der er sammenfattet, dvs. forkortet på en kortfattet, objektiv måde. @da
definition: Relates a resource to a resource that is summarized in an objective manner.
definition: Setzt eine Ressource in Beziehung zu einer Ressource, die auf eine kurze, sachliche Art gekürzt ist. @de
definition: يربط بين مصدر ومصدر يتم اختصاره بطريقة موجزة موضوعية. @ar
definition: 将一种资源与被客观提要的一种资源关联起来。 @zh-hans

is dramatization of
lexical alias: dramatizationOf.en
status: Published
type: Property
label: dramatisointi aineistosta @fi
label: dramatize edilmesidir @tr
label: dramatizált feldolgozása a következőnek: @hu
label: er dramatisering som @da
label: is dramatisering van @nl
label: ist Bühnenbearbeitung von @de
label: هو اقتباس مسرحي لـ @ar
label: 是……的戏剧化 @zh-hans
sub property of: is adaptation of
inverse of: is dramatized as
definition: Bir kaynağı, dramaya uyarlanmış bir kaynakla ilişkilendirir. @tr
definition: Hozzákapcsol egy forrást egy forráshoz, amelyet drámaként adaptáltak. @hu
definition: Liittää aineiston aineistoon, joka on sovitettu näytelmäksi. @fi
definition: Relaterer en ressource til en ressource, der er blevet bearbejdet som drama. @da
definition: Relates a resource to a resource that is adapted as a drama.
definition: Setzt eine Ressource in Beziehung zu einer Ressource, die als Theaterstück bearbeitet ist. @de
definition: يربط بين مصدر ومصدر تم تحويره كمسرحية. @ar
definition: 将一种资源与被改编为戏剧的一种资源关联起来。 @zh-hans

is verse adaptation of
lexical alias: verseAdaptationOf.en
status: Published
type: Property
label: er versbearbejdelse som @da
label: is bewerking in versvorm van @nl
label: ist Gedichtbearbeitung von @de
label: nazım uyarlamasıdır. @tr
label: runomukaelma aineistosta @fi
label: verses feldolgozása a következőnek: @hu
label: هو اقتباس شعري لـ @ar
label: 是……的韵文改编 @zh-hans
sub property of: is adaptation of
inverse of: is adapted in verse as
definition: Bir kaynağı, nazım biçiminde edebi eser olarak uyarlanmış bir kaynakla ilişkilendirir. @tr
definition: Hozzákapcsol egy forrást egy forráshoz, amelyet verses formájú irodalmi alkotásként adaptáltak. @hu
definition: Liittää aineiston aineistoon, joka on sovitettu runomuotoiseksi kirjalliseksi tuotokseksi. @fi
definition: Relaterer en ressource til en ressource, der er blevet bearbejdet som litterær komposition i versform. @da
definition: Relates a resource to a resource that is adapted as a literary composition in verse form.
definition: Setzt eine Ressource in Beziehung zu einer Ressource, die als literarische Dichtung in Versform bearbeitet ist. @de
definition: يربط بين مصدر ومصدر تم تحويره كتكوين أدبي في شكل شعر. @ar
definition: 将一种资源与被改编为韵文形式文学写作的一种资源关联起来。 @zh-hans

is motion picture adaptation of
lexical alias: motionPictureAdaptationOf.en
status: Published
type: Property
label: elokuvaversio aineistosta @fi
label: er filmatisering af @da
label: is speelfilmbewerking van @nl
label: ist Filmbearbeitung von @de
label: mozgóképes feldolgozása a következőnek: @hu
label: sinema filmi uyarlamasıdır @tr
label: هو اقتباس فيلم سينمائي لـ @ar
label: 是……的电影改编 @zh-hans
sub property of: is adaptation of
inverse of: is adapted as motion picture
definition: Bir kaynağı, sinema filmine uyarlanmış bir kaynakla ilişkilendirir. @tr
definition: Hozzákapcsol egy forrást egy forráshoz, amelyet mozgóképként adaptáltak. @hu
definition: Liittää aineiston elokuvaksi sovitettuun aineistoon. @fi
definition: Relaterer en ressource til en ressource, der er blevet bearbejdet som film. @da
definition: Relates a resource to a resource that is adapted as a motion picture.
definition: Setzt eine Ressource in Beziehung zu einer Ressource, die als Film bearbeitet ist. @de
definition: يربط بين مصدر ومصدر تم تحويره كفيلم سينمائي @ar
definition: 将一种资源与被改编为电影的一种资源关联起来。 @zh-hans

is novelization of
lexical alias: novelizationOf.en
status: Published
type: Property
label: er omskrivning til roman af @da
label: is romanbewerking van @nl
label: ist Romanbearbeitung von @de
label: regényfeldolgozása a következőnek: @hu
label: romaanimukaelma aineistosta @fi
label: romanlaştırılmasıdır @tr
label: هو روائية لـ @ar
label: 是……的小说化 @zh-hans
sub property of: is adaptation of
inverse of: is adapted as novel
definition: Bir kaynağı, roman olarak uyarlanmış bir kaynakla ilişkilendirir. @tr
definition: Hozzákapcsol egy forrást egy forráshoz, amelyet regényként adaptáltak. @hu
definition: Liittää aineiston romaaniksi sovitettuun aineistoon. @fi
definition: Relaterer en ressource til en ressource, der er blevet bearbejdet som roman. @da
definition: Relates a resource to a resource that is adapted as a novel.
definition: Setzt eine Ressource in Beziehung zu einer Ressource, die als Roman bearbeitet ist. @de
definition: يربط بين مصدر ومصدر تم تحويره كرواية. @ar
definition: 将一种资源与被改编为小说的一种资源关联起来。 @zh-hans

is radio adaptation of
lexical alias: radioAdaptationOf.en
status: Published
type: Property
label: er radiobearbejdelse af @da
label: is radiobewerking van @nl
label: ist Hörfunkbearbeitung von @de
label: radiosovitus aineistosta @fi
label: radyo uyarlamasıdır @tr
label: rádiós feldolgozása a következőnek: @hu
label: هو اقتباس إذاعي لـ @ar
label: 是……的广播改编 @zh-hans
sub property of: is adaptation of
inverse of: is adapted as radio program
definition: Bir kaynağı, radyo programı olarak uyarlanmış bir kaynakla ilişkilendirir. @tr
definition: Hozzákapcsol egy forrást egy forráshoz, amelyet rádióműsorként adaptáltak. @hu
definition: Liittää aineiston radio-ohjelmaksi sovitettuun aineistoon. @fi
definition: Relaterer en ressource til en ressource, der er blevet bearbejdet til et radioprogram. @da
definition: Relates a resource to a resource that is adapted as a radio program.
definition: Setzt eine Ressource in Beziehung zu einer Ressource, die als Hörfunksendung bearbeitet ist. @de
definition: يربط بين مصدر ومصدر تم تحويره كبرنامج إذاعي. @ar
definition: 将一种资源与被改编为广播节目的一种资源关联起来。 @zh-hans

is television adaptation of
lexical alias: televisionAdaptationOf.en
status: Published
type: Property
label: er tv-bearbejdelse af @da
label: is televisiebewerking van @nl
label: ist Fernsehbearbeitung von @de
label: televisiosovitus aineistosta @fi
label: televizyon uyarlamasıdır @tr
label: televíziós feldolgozása a következőnek: @hu
label: هو اقتباس تلفزيوني لـ @ar
label: 是……的电视改编 @zh-hans
sub property of: is adaptation of
inverse of: is adapted as television program
definition: Bir kaynağı, televizyon programı olarak uyarlanmış bir kaynakla ilişkilendirir. @tr
definition: Hozzákapcsol egy forrást egy forráshoz, amelyet televízióműsorként adaptáltak. @hu
definition: Liittää aineiston televisio-ohjelmaksi sovitettuun aineistoon. @fi
definition: Relaterer en ressource til en ressource, der er blevet bearbejdet til et tv-program. @da
definition: Relates a resource to a resource that is adapted as a television program.
definition: Setzt eine Ressource in Beziehung zu einer Ressource, die als Fernsehsendung bearbeitet ist. @de
definition: يربط بين مصدر ومصدر تم تحويره كبرنامج تليفزيوني. @ar
definition: 将一种资源与被改编为电视节目的一种资源关联起来。 @zh-hans

is screenplay based on
has subproperty: is motion picture screenplay based on
has subproperty: is television screenplay based on
has subproperty: is video screenplay based on
lexical alias: screenplayBasedOn.en
status: Published
type: Property
label: er drejebog baseret på @da
label: forgatókönyv a következőből: @hu
label: is scenario gebaseerd op @nl
label: ist Drehbuch basierend auf @de
label: näytelmäsovitus aineistosta @fi
label: senaryo şuna dayanmaktadır @tr
label: هو سيناريو معتمد على @ar
label: 是基于……的影视剧剧本 @zh-hans
sub property of: is adaptation of
inverse of: is adapted as screenplay
definition: Bir kaynağı, sinema filmi, televizyon programı, ya da video senaryosu olarak uyarlanmış bir kaynakla ilişkilendirir. @tr
definition: Hozzákapcsol egy forrást egy forráshoz, amelyet egy mozgókép, tévéműsor vagy videó forgatókönyveként adaptáltak. @hu
definition: Liittää aineiston aineistoon, joka on sovitettu elokuvan, televisio-ohjelman tai videon käsikirjoitukseksi. @fi
definition: Relaterer en ressource til en ressource, der er blevet bearbejdet til drejebog til en film, et tv-program eller en video. @da
definition: Relates a resource to a resource that is adapted as a screenplay for a motion picture, television program, or video.
definition: Setzt eine Ressource in Beziehung zu einer Ressource, die als Drehbuch für einen Film, eine Fernsehsendung oder ein Video bearbeitet ist. @de
definition: يربط بين مصدر ومصدر تم تحويره كسيناريو لفيلم سينمائي، أو برنامج تليفزيوني، أو فيديو. @ar
definition: 将一种资源与被改编为电影、电视节目或视频剧本的一种资源关联起来。 @zh-hans

is motion picture screenplay based on
lexical alias: motionPictureScreenplayBasedOn.en
status: Published
type: Property
label: dayalı sinema filmi senaryosudur @tr
label: elokuvakäsikirjoituksen perustana oleva aineisto @fi
label: er filmmanuskript baseret på @da
label: is speelfilmscenario gebaseerd op @nl
label: ist Filmdrehbuch basierend auf @de
label: mozgókép-forgatókönyv a következő alapján: @hu
label: هو سيناريو فيلم سينمائي معتمد على @ar
label: 是基于……的电影剧本 @zh-hans
sub property of: is screenplay based on
inverse of: is adapted as motion picture screenplay
definition: Bir kaynağı, bir sinema filmi için senaryo olarak uyarlanmış bir kaynakla ilişkilendirir. @tr
definition: Hozzákapcsol egy forrást egy műhöz, amelyet egy mozgókép forgatókönyveként adaptáltak. @hu
definition: Liittää aineiston elokuvan käsikirjoitukseksi sovitettuun aineistoon. @fi
definition: Relaterer en ressource til en ressource, der er blevet bearbejdet til manuskript til en film. @da
definition: Relates a resource to a resource that is adapted as a screenplay for a motion picture.
definition: Setzt eine Ressource in Beziehung zu einer Ressource, die als Drehbuch für einen Film bearbeitet ist. @de
definition: يربط بين مصدر ومصدر تم تحويره كسيناريو لفيلم سينمائي. @ar
definition: 将一种资源与被改编为电影剧本的一种资源关联起来。 @zh-hans

is television screenplay based on
lexical alias: televisionScreenplayBasedOn.en
status: Published
type: Property
label: er tv-manuskript baseret på @da
label: is televisiescenario gebaseerd op @nl
label: ist Fernsehdrehbuch basierend auf @de
label: televisiokäsikirjoituksen perustana oleva aineisto @fi
label: televíziós forgatókönyv a következőből: @hu
label: uyarlanan televizyon senaryosudur @tr
label: هو سيناريو تليفزيوني معتمد على @ar
label: 是基于……的电视剧本 @zh-hans
sub property of: is screenplay based on
inverse of: is adapted as television screenplay
definition: Bir kaynağı, bir televizyon programı için senaryo olarak uyarlanmış bir kaynakla ilişkilendirir. @tr
definition: Hozzákapcsol egy forrást egy forráshoz, amelyet egy televízióműsor forgatókönyveként adaptáltak. @hu
definition: Liittää aineiston televiso-ohjelman käsikirjoitukseksi sovitettuun aineistoon. @fi
definition: Relaterer en ressource til en ressource, der er blevet bearbejdet til manuskript til et tv-program. @da
definition: Relates a resource to a resource that is adapted as a screenplay for a television program.
definition: Setzt eine Ressource in Beziehung zu einer Ressource, die als Drehbuch für eine Fernsehsendung bearbeitet ist. @de
definition: يربط بين مصدر ومصدر تم تحويره كسيناريو لبرنامج تليفزيوني. @ar
definition: 将一种资源与被改编为电视节目剧本的一种资源关联起来。 @zh-hans

is video screenplay based on
lexical alias: videoScreenplayBasedOn.en
status: Published
type: Property
label: dayalı olan video senaryosudur @tr
label: er videobearbejdelse baseret på @da
label: is videoscenario gebaseerd op @nl
label: ist Videodrehbuch basierend auf @de
label: videokäsikirjoituksen perustana oleva aineisto @fi
label: videóforgatókönyv a következőből: @hu
label: هو سيناريو فيديو معتمد على @ar
label: 是基于……的视频剧本 @zh-hans
sub property of: is screenplay based on
inverse of: is adapted as video screenplay
definition: Bir kaynağı, bir video için senaryo olarak uyarlanmış bir kaynakla ilişkilendirir. @tr
definition: Hozzákapcsol egy forrást egy forráshoz, amelyet egy videó forgatókönyveként adaptáltak. @hu
definition: Liittää aineiston videokäsikirjoituksen käsikirjoitukseksi sovitettuun aineistoon. @fi
definition: Relaterer en ressource til en ressource, der er blevet bearbejdet som manuskript til en video. @da
definition: Relates a resource to a resource that is adapted as a screenplay for a video.
definition: Setzt eine Ressource in Beziehung zu einer Ressource, die als Drehbuch für ein Video bearbeitet ist. @de
definition: يربط بين مصدر ومصدر تم تحويره كسيناريو لفيديو. @ar
definition: 将一种资源与被改编为视频剧本的一种资源关联起来。 @zh-hans

is radio script based on
lexical alias: radioScriptBasedOn.en
status: Published
type: Property
label: dayalı radyo metnidir @tr
label: er radiomanuskript baseret på @da
label: is radioscript gebaseerd op @nl
label: ist Hörfunkskript basierend auf @de
label: radiokäsikirjoituksen perustana oleva aineisto @fi
label: rádiós szövegkönyv a következőből: @hu
label: هو نص إذاعي معتمد على @ar
label: 是基于……的广播文稿 @zh-hans
sub property of: is adaptation of
inverse of: is adapted as radio script
definition: Bir kaynağı, bir radyo programı için metin olarak uyarlanmış bir kaynakla ilişkilendirir. @tr
definition: Hozzákapcsol egy forrást egy forráshoz, amelyet egy rádióműsor forgatókönyveként adaptáltak. @hu
definition: Liittää aineiston radio-ohjelman käsikirjoitukseksi sovitettuun aineistoon. @fi
definition: Relaterer en ressource til en ressource, der er blevet bearbejdet som manuskript til et radioprogram. @da
definition: Relates a resource to a resource that is adapted as a script for a radio program.
definition: Setzt eine Ressource in Beziehung zu einer Ressource, die als Skript für eine Hörfunksendung bearbeitet ist. @de
definition: يربط بين مصدر ومصدر تم تحويره كنص لبرنامج إذاعي. @ar
definition: 将一种资源与被改编为广播节目文稿的一种资源关联起来。 @zh-hans

is video adaptation of
lexical alias: videoAdaptationOf.en
status: Published
type: Property
label: er videobearbejdelse af @da
label: is videobewerking van @nl
label: ist Videobearbeitung von @de
label: video uyarlaması @tr
label: videosovitus aineistosta @fi
label: videófeldolgozása a következőnek: @hu
label: هو اقتباس فيديوي لـ @ar
label: 是……的视频改编 @zh-hans
sub property of: is adaptation of
inverse of: is adapted as video
definition: Bir kaynağı, video için uyarlanan bir kaynakla ilişkilendirir. @tr
definition: Hozzákapcsol egy forrást egy forráshoz, amelyet videóként adaptáltak. @hu
definition: Liittää aineiston videolle sovitettuun aineistoon. @fi
definition: Relaterer en ressource til en ressource, der er blevet bearbejdet til video. @da
definition: Relates a resource to a resource that is adapted for video.
definition: Setzt eine Ressource in Beziehung zu einer Ressource, die als Video bearbeitet ist. @de
definition: يربط بين مصدر ومصدر تم تحويره لفيديو. @ar
definition: 将一种资源与被改编用于视频的一种资源关联起来。 @zh-hans

is bound with
lexical alias: boundWith.en
status: Published
type: Property
label: egybekötve a következővel: @hu
label: er indbundet sammen med @da
label: ile bağlanmıştır @tr
label: is gebonden met @nl
label: ist eingebunden mit @de
label: yhteensidottu (aineisto) @fi
label: مجلد مع @ar
label: 与……合订 @zh-hans
sub property of: is accompanied by
definition: Bir kaynağı, bir koleksiyon içeriği oluşturmak üzere bir kaynakla fiziksel olarak birleşen bir kaynakla ilişkilendirir. @tr
definition: Hozzákapcsol egy forrást egy forráshoz, amelyet fizikailag hozzákapcsolnak vagy egyesítenek egy forrással. @hu
definition: Liittää aineiston aineistoon, josta on muodostettu kokoelma-aineisto toisen aineiston kanssa sitomalla aineistot fyysisesti yhteen. @fi
definition: Relaciona un recurs amb un recurs que es combina físicament o que s’uneix amb un recurs per formar un recurs de col·lecció de recursos. @ca
definition: Relaterer en ressource til en ressource, der er indbundet i den samme indbinding som den ressource, der beskrives. @da
definition: Relates a resource to a resource that is physically combined with a resource to form a collection resource.
definition: Setzt eine Ressource in Beziehung zu einer Ressource, die physisch mit einer Ressource verbunden ist. @de
definition: يربط بين مصدر ومصدر مدمج أو مرتبط مادياً بمصدر. @ar
definition: 将一种资源与和一种资源在物理上结合起来形成一种收藏资源的一种资源关联起来。 @zh-hans
scope note: Cada recurs originalment exemplifica un recurs que és un full o volum. @ca
scope note: Each resource originally exemplifies a resource that is a sheet or volume.
scope note: Her kaynak, başlangıçta bir sayfa veya cilt olan bir kaynağı örnekler. @tr
scope note: Kumpikin aineisto ilmentää alunperin aineistoa, joka on arkki tai numero @fi
scope note: 每种资源起初都例证作为一张或一卷的一种资源。 @zh-hans

is digest of
lexical alias: digestOf.en
status: Published
type: Property
label: er sammendrag af @da
label: is digest van @nl
label: ist Digest von @de
label: mukautettu lyhennelmä aineistosta @fi
label: tömörítvénye a következőnek: @hu
label: özetidir @tr
label: هو موجز لـ @ar
label: 是……的文摘 @zh-hans
sub property of: has source
inverse of: is digested as
definition: Bir kaynağı, ilgili bir kaynağın sistematik ve kapsamlı bir şekilde derlendiği bir kaynakla ilişkilendirir. @tr
definition: Hozzákapcsol egy forrást egy forráshoz, amely egy kapcsolódó forrás módszeres és átfogó tömörítése. @hu
definition: Liittää aineiston aineistoon, joka on systemaattisesti, kokonaisuudessaan ja mukaillen tiivistetty toisesta, liittvästä aineistosta. @fi
definition: Relaterer en ressource til en ressource, der er et sammendrag, dvs. der er systematisk og gennemgribende komprimeret. @da
definition: Relates a resource to a resource that is a systematic and comprehensive condensing of a related resource.
definition: Setzt eine Ressource in Beziehung zu einer Ressource, die eine systematische und umfassende Verdichtung einer in Beziehung stehenden Ressource darstellt. @de
definition: يربط بين مصدر ومصدر يعد تكثيفًا منهجيًا وشاملًا لمصدر ذي صلة. @ar
definition: 将一种资源与作为一种相关资源的系统而全面压缩的一种资源关联起来。 @zh-hans

is analysis of
lexical alias: analysisOf.en
status: Published
type: Property
label: analizidir @tr
label: analyysi aineistosta @fi
label: elemzése a következőnek: @hu
label: er analyse af @da
label: is analyse van @nl
label: ist Analyse von @de
label: هو تحليل لـ @ar
label: 是……的分析 @zh-hans
sub property of: is description of
inverse of: is analysed in
definition: Bir kaynağı, yapısının bir kaynak tarafından tanımlandığı bir kaynakla ilişkilendirir. @tr
definition: Hozzákapcsol egy forrást egy forráshoz, amelynek alkotóelemeit leírja egy forrás. @hu
definition: Liittää aineiston aineistoon, jonka rakenne on kuvattu toisessa aineistossa. @fi
definition: Relaterer en ressource til en ressource, der er blevet undersøgt for at identificere dets bestanddele og deres relationer. @da
definition: Relates a resource to a resource whose structure is described by a resource.
definition: Setzt eine Ressource in Beziehung zu einer Ressource, deren Struktur von einer Ressource beschrieben wird. @de
definition: يربط بين مصدر ومصدر تم وصف بنيته بواسطة مصدر. @ar
definition: 将一种资源与其结构被一种资源描述的一种资源关联起来。 @zh-hans

has issue
lexical alias: issue.en
status: Published
type: Property
label: aineiston numero @fi
label: er serieindholder af @da
label: hat Ausgabe @de
label: heeft aflevering @nl
label: sayı ile ilişkilidir @tr
label: száma a következő: @hu
label: له إصدارة @ar
label: 有期 @zh-hans
sub property of: has part resource
inverse of: is issue of
alternative label: er seriecontainer af @da
alternative label: is series container of
alternative label: ist Reihe enthält @de
alternative label: sarjan osa @fi
alternative label: serisi kapsayıcısıdır @tr
alternative label: sorozatbefoglalója a következőnek: @hu
alternative label: هي حاوية سلسلة لـ @ar
alternative label: 是……的丛编整体 @zh-hans
definition: Bir kaynağı, ardışık toplama kaynağın genel yayın politikası, kapsamı ve biçiminden esinlenen durağan bir kaynak olan bir kaynakla ilişkilendirir. @tr
definition: Hozzákapcsol egy forrást egy statikus forráshoz, amelyre egy folyamatos aggregáló forrás szerkesztési elve, tárgyköre és stílusa volt hatással. @hu
definition: Liittää aineiston aineistoon, joka on staattinen aineisto, johon on vaikuttanut peräkkäin ilmestyvän aggregoivan teoksen yleinen toimituslinja, toiminta-ala ja tyyli. @fi
definition: Relaterer en ressource til en ressource, der er blevet udgivet som del af en serie. @da
definition: Relates a resource to a resource that is a static resource that is inspired by the overall editorial policy, scope, and style of a successive aggregating resource.
definition: Setzt eine Ressource in Beziehung zu einer Ressource, die an die allgemeine redaktionelle Vorgehensweise, den Geltungsbereich und den Stil einer sukzessiven, aggregierenden Ressource angelehnt ist. @de
definition: يربط بين مصدر ومصدر ثابت مستوحى من السياسة التحريرية الشاملة، والمجال، والأسلوب لمصدر تجميعي متتالي. @ar
definition: 将一种资源与作为一种静态资源并受一种相继合集性资源的编辑政策、编辑范围和编辑风格启发的一种资源关联起来。 @zh-hans

is adaptation of
has subproperty: is dramatization of
has subproperty: is verse adaptation of
has subproperty: is motion picture adaptation of
has subproperty: is novelization of
has subproperty: is radio adaptation of
has subproperty: is television adaptation of
has subproperty: is screenplay based on
has subproperty: is radio script based on
has subproperty: is video adaptation of
has subproperty: is musical theatre adaptation of
has subproperty: is opera adaptation of
has subproperty: is graphic novelization of
has subproperty: is video game adaptation of
lexical alias: adaptationOf.en
status: Published
type: Property
label: er bearbejdelse af @da
label: feldolgozása a következőnek: @hu
label: is bewerking van @nl
label: ist Bearbeitung von @de
label: mukaelma aineistosta @fi
label: uyarlamasıdır @tr
label: هو اقتباس لـ @ar
label: 是……的改编 @zh-hans
sub property of: has source
inverse of: is adapted as
definition: Bir kaynağı, orijinal olarak tasarlandığından farklı bir amaç, kullanım veya ortam için değiştirilmiş bir kaynakla ilişkilendirir. @tr
definition: Hozzákapcsol egy forrást egy forráshoz, amelyet olyan célra, használatra vagy médiumra módosítottak, amely eltér az eredetileg tervezettől @hu
definition: Liittää aineiston aineistoon, jota on muokattu jotain muuta kuin alkuperäistä tarkoitusta, käyttöä tai esitysmuotoa varten. @fi
definition: Relaterer en ressource til en ressource, der er blevet ændret til et andet formål, en anden brug eller et andet medium end det, det oprindeligt var beregnet til. @da
definition: Relates a resource to a resource that is modified for a purpose, use, or medium other than that for which it was originally intended.
definition: Setzt eine Ressource in Beziehung zu einer Ressource, die für einen anderen Zweck, eine andere Nutzung oder ein anderes Medium, als den/die/das, wofür sie ursprünglich konzipiert wurde, bearbeitet ist. @de
definition: يربط بين مصدر ومصدر تم تعديله لغرض، استخدام، أو وسيط بخلاف ذلك الغرض الذي كان مخصصًا له في الأصل. @ar
definition: 将一种资源与以不同于起初意图的目的、使用或媒介被修改的一种资源关联起来。 @zh-hans
scope note: Bu ilişki, şekil değişiklikleri veya tamamen aynı biçimde yeniden yazılan kaynaklar için geçerlidir. @tr
scope note: Diese Beziehung bezieht sich auf Änderungen der Form oder auf Ressourcen, die in derselben Form vollständig neu geschrieben sind. @de
scope note: Ez a kapcsolat érvényes a formai változásokra, vagy az ugyanabban a formában teljesen újraírt forrásokra. @hu
scope note: Gælder for ændringer i form eller for ressourcer, der er omskrevet fuldstændigt i samme form. @da
scope note: This relationship applies to changes in form or to resources completely rewritten in the same form.
scope note: Tämä suhde koskee muutoksia aineiston muodossa tai samassa muodossa kokonaan uudelleenkirjoitettuja aineistoja. @fi
scope note: تنتطبق هذه العلاقة على التغييرات في الشكل أو في المصادر المعاد كتابتها بالكامل بنفس الشكل. @ar
scope note: 这个关系适用于形式上的变化或者适用于以同样形式完全重写的资源。 @zh-hans

is arrangement of
lexical alias: arrangementOf.en
status: Published
type: Property
label: düzenlemesidir @tr
label: elrendezése a következőnek: @hu
label: er arrangement af @da
label: is arrangement van @nl
label: ist Arrangement von @de
label: sovituksen perusta (aineisto) @fi
label: هو تنسيق لـ @ar
label: 是……的改编 @zh-hans
sub property of: has source
inverse of: is arranged as
definition: Bir kaynağı, başka bir kaynaktan farklı yeni bir kaynak oluşturmak için performans ortamı değiştirilen kaynakla ilişkilendirir. @tr
definition: Hozzákapcsol egy forrást egy forráshoz, amelyet olyan előadásmédiumra szánt zenei kompozícióként írtak át, amely különbözik a forrásnak eredetileg szánt médiumtól. @hu
definition: Liittää aineiston aineistoon, jonka esityskokoonpanoa on muutettu ja näin luotu uusi, erilainen aineisto. @fi
definition: Relaciona un recurs amb un recurs el repartiment d’execució del qual es modifica per crear un nou recurs que és diferent d’un altre recurs. @ca
definition: Relaterer en ressource til en musikressource, der er blevet omskrevet til en anden besætning end den, ressourcen oprindeligt var beregnet til. @da
definition: Relates a resource to a resource whose medium of performance is modified to create a new resource that is different from another resource.
definition: Setzt eine Ressource in Beziehung zu einer Ressource, die als musikalische Komposition für eine bestimmte Besetzung umgeschrieben wird, die sich von der Originalbesetzung, für die eine Ressource konzipiert ist, unterscheidet. @de
definition: يربط بين مصدر ومصدر تم إعادة كتابته كلحن موسيقي لوسيط أداء يختلف عن الوسيط الذي كان المصدر مقررا له أصلاً. @ar
definition: 将一种资源与其表演媒介被修改而创建与另一种资源不同的新资源的一种资源关联起来。 @zh-hans

is free translation of
lexical alias: freeTranslationOf.en
status: Published
type: Property
label: er fri oversættelse af @da
label: is vrije vertaling van @nl
label: ist freie Übersetzung von @de
label: serbest çevirisidir @tr
label: szabad fordítása a következőnek: @hu
label: vapaa käännös aineistosta @fi
label: هو ترجمة بتصرف لـ @ar
label: 是……的自由翻译 @zh-hans
sub property of: has source
inverse of: is freely translated as
definition: Bir kaynağı, başka bir dile uyarlanmış ve çevrilmiş bir kaynakla ilişkilendirir. @tr
definition: Hozzákapcsol egy forrást egy forráshoz, amelyet adaptáltak és másik nyelvre fordítottak. @hu
definition: Liittää aineiston aineistoon, jonka kieltä on muokattu ja näin luotu uusi alkuperäisestä eroava aineisto. @fi
definition: Relaterer en ressource til en ressource, der er frit oversat, og som bevarer originalens ånd, men ikke dens sproglige detaljer. @da
definition: Relates a resource to a resource that is adapted and translated into another language.
definition: Setzt eine Ressource in Beziehung zu einer Ressource, die bearbeitet und in eine andere Sprache übersetzt ist. @de
definition: يربط بين مصدر ومصدر تم تحويره وترجمته إلى لغة أخرى. @ar
definition: 将一种资源与被改编并被翻译成另一种语言的一种资源关联起来。 @zh-hans

is translation of
has subproperty: is dubbed version of
lexical alias: translationOf.en
status: Published
type: Property
label: er oversættelse af @da
label: fordítása a következőnek: @hu
label: is vertaling van @nl
label: ist Übersetzung von @de
label: käännös aineistosta @fi
label: tercümesidir @tr
label: هو ترجمة لـ @ar
label: 是……的翻译 @zh-hans
sub property of: has source
inverse of: is translated as
definition: Bir kaynağı, başka bir kaynaktan farklı yeni bir kaynak oluşturmak için dili düzenlenen kaynakla ilişkilendirir. @tr
definition: Hozzákapcsol egy forrást egy forráshoz, amelyet lefordítottak, azaz a nyelvben kifejezett szöveg különbözik egy eredeti forrás nyelvétől. @hu
definition: Liittää aineiston toiseen kieleen sovitettuun ja käännettyyn aineistoon. @fi
definition: Relaciona un recurs amb un recurs la llengua del qual es modifica per crear un nou recurs que és diferent d’un altre recurs. @ca
definition: Relaterer en ressource til en ressource, der er blevet oversat, dvs. teksten er udtrykt i et andet sprog end det, der er anvendt i den originale ressource. @da
definition: Relates a resource to a resource whose language is modified to create a new resource that is different from another resource.
definition: Setzt eine Ressource in Beziehung zu einer Ressource, die übersetzt wurde. Das heißt, dass der Text in einer Sprache ausgedrückt wird, die sich von der der Originalressource unterscheidet. @de
definition: يربط بين مصدر ومصدر تم ترجمته، مثل النص المعبر عنه بلغة مختلفة عن لغة مصدر أصلي. @ar
definition: 将一种资源与其语言被修改而创建不同于另一种资源的一种资源关联起来。 @zh-hans

is revised as
lexical alias: revisedAs.en
status: Published
type: Property
label: aineiston uudistettu versio @fi
label: er revideret som @da
label: is herzien als @nl
label: ist überarbeitet als @de
label: olarak gözden geçirilmiştir @tr
label: átdolgozása a következőként: @hu
label: هو مُنَقّح كـ @ar
label: 被修订为 @zh-hans
sub property of: has derivative
inverse of: is revision of
definition: Bir kaynağı, başka bir kaynağın güncellemesi, düzeltmesi veya genişletilmesi olan bir kaynakla ilişkilendirir. @tr
definition: Hozzákapcsol egy forrást egy forráshoz, amelyet frissítettek, korrigáltak vagy bővítettek. @hu
definition: Liittää aineiston aineistoon, joka on toisen aineiston päivtetty, korjattu tai laajennettu versio. @fi
definition: Relaciona un recurs amb un recurs que és una actualització, correcció o ampliació d’un altre recurs. @ca
definition: Relaterer en ressource til en ressource, der er blevet opdateret, korrigeret eller udvidet. @da
definition: Relates a resource to a resource that is an update, correction, or expansion of another resource.
definition: Setzt eine Ressource in Beziehung zu einer Ressource, die aktualisiert, korrigiert oder erweitert ist. @de
definition: يربط بين مصدر ومصدر تم تحديثه، تصحيحه أو توسيعه. @ar
definition: 将一种资源与作为另一种资源之更新、更正或扩充的一种资源关联起来。 @zh-hans

is parodied as
lexical alias: parodiedAs.en
status: Published
type: Property
label: er parodieret som @da
label: is geparodieerd als @nl
label: ist parodiert als @de
label: olarak parodileştirilmiştir @tr
label: parodia aineistosta @fi
label: parodizálva a következőként: @hu
label: هو محاكاة ساخرة كـ @ar
label: 被戏仿为 @zh-hans
sub property of: is imitated as
inverse of: is parody of
definition: Bir kaynağı, komedi etkisi için başka bir kaynağın biçimini veya içeriğini taklit eden kaynakla ilişkilendirir. @tr
definition: Hozzákapcsol egy forrást egy forráshoz, amely egy másik forrás stílusát vagy tartalmát utánozza a komikus hatás kedvéért. @hu
definition: Liittää aineiston aineistoon, joka imitoi toisen aineiston sisältöä tai tyyliä koomisen vaikutelman luomiseksi. @fi
definition: Relaterer en ressource til en ressource, der efterligner en oprindelig ressources stil eller indhold for at opnå en komisk effekt. @da
definition: Relates a resource to a resource that imitates the style or content of another resource for comic effect.
definition: Setzt eine Ressource in Beziehung zu einer Ressource, die den Stil oder Inhalt einer anderen Ressource imitiert, um einen lustigen Effekt zu erzielen. @de
definition: يربط بين مصدر ومصدر يقلد أسلوب أو محتوى مصدر آخَر ليُحدث تأثيرًا هزليًا. @ar
definition: 将一种资源与带喜剧效果模仿另一种资源的风格和内容的一种资源关联起来。 @zh-hans

is absorbed by
lexical alias: absorbedBy.en
status: Published
type: Property
label: er indlemmet af @da
label: is opgenomen door @nl
label: ist aufgegangen in @de
label: magába olvasztja a következő: @hu
label: sulautunut aineistoon @fi
label: tarafından kapsanmıştır @tr
label: هو مستوعَب عن طريق @ar
label: 被……吸收 @zh-hans
sub property of: is succeeded by
inverse of: is absorption of
definition: Bir kaynağı, içeriği başka bir kaynağın içeriğini barındıran bir kaynakla ilişkilendirir. @tr
definition: Hozzákapcsol egy forrást egy forráshoz, amelynek tartalma egy másik forrás tartalmát magába olvasztja. @hu
definition: Liittää aineiston aineistoon, jonka sisältöön lukeutuu toisen aineiston sisältö. @fi
definition: Relaterer en ressource til en ressource, der inkorporerer en anden ressource. @da
definition: Relates a resource to a resource whose content incorporates the content of another resource.
definition: Setzt eine Ressource in Beziehung zu einer Ressource, deren Inhalt den Inhalt einer anderen Ressource umfasst. @de
definition: يربط بين مصدر ومصدر يشتمل محتواه على محتوى مصدر آخَر. @ar
definition: 将一种资源与其内容纳入另一种资源之内容的一种资源关联起来。 @zh-hans

is absorbed in part by
lexical alias: absorbedInPartBy.en
status: Published
type: Property
label: er delvis indlemmet af @da
label: is gedeeltelijk opgenomen door @nl
label: ist teilweise aufgegangen in @de
label: osittain sulautunut aineistoon @fi
label: részben magába olvasztva @hu
label: tarafından kısmen kapsanmıştır @tr
label: هو مستوعب جزئيا عن طريق @ar
label: 被……部分吸收 @zh-hans
sub property of: is succeeded by
inverse of: is absorption in part of
definition: Bir kaynağı, içeriği başka bir kaynağın kısmi içeriğini barındıran bir kaynakla ilişkilendirir. @tr
definition: Hozzákapcsol egy forrást egy forráshoz, amelynek tartalma egy másik forrás tartalmának egy részét magába olvasztja. @hu
definition: Liittä aineiston aineistoon, jonka sisältöön lukeutuu toisen aineiston osittainen sisältö. @fi
definition: Relaterer en ressource til en ressource, der delvis inkorporerer en anden ressources indhold. @da
definition: Relates a resource to a resource whose content incorporates the partial content of another resource.
definition: Setzt eine Ressource in Beziehung zu einer Ressource, deren Inhalt teilweise den Inhalt einer anderen Ressource umfasst. @de
definition: يربط بين مصدر ومصدر يتضمن محتواه المحتوى الجزئي لمصدر آخر. @ar
definition: 将一种资源与其内容纳入另一种资源之部分内容的一种资源关联起来。 @zh-hans

has part resource
has subproperty: has insert
has subproperty: has special issue
has subproperty: has issue
has subproperty: has facsimile part
has subproperty: has subseries
has subproperty: has subcollection
lexical alias: partResource.en
status: Published
type: Property
label: aineiston osa @fi
label: er indeholder af @da
label: hat Teilressource @de
label: heeft deel-resource @nl
label: kaynak bileşeni ile ilişkilidir @tr
label: részforrása a következő: @hu
label: له جزء مصدر @ar
label: 有部分资源 @zh-hans
sub property of: has whole-part resource relationship with (Deprecated)
inverse of: is part of resource
alternative label: befoglalója a következő forrásnak: @hu
alternative label: er container af ressource @da
alternative label: is container of resource
alternative label: ist enthält eine Ressource @de
alternative label: sisältää aineiston @fi
alternative label: هو حاوية لمصدر @ar
alternative label: 是资源的整体 @zh-hans
definition: Bir kaynağı, başka bir kaynağın ayrık bir parçası olan kaynakla ilişkilendirir. @tr
definition: Hozzákapcsol egy forrást egy forráshoz, amely egy másik forrás elkülöníthető alkotóeleme. @hu
definition: Liittää aineiston aineistoon, joka on toisen aineiston erillinen osa. @fi
definition: Relaterer en ressource til en ressource, der udgør en separat del af en større ressource. @da
definition: Relates a resource to a resource that is a discrete component of another resource.
definition: Setzt eine Ressource in Beziehung zu einer Ressource, die ein einzelner Bestandteil einer anderen Ressource ist. @de
definition: يربط بين مصدر ومصدر عبارة عن مكون منفصل من مصدر آخر. @ar
definition: 将一种资源与作为另一种资源之独立部分的一种资源关联起来。 @zh-hans

has derivative
has subproperty: is modified by variation as
has subproperty: is remade as
has subproperty: is set to music as
has subproperty: is abstracted in
has subproperty: is indexed in (Deprecated)
has subproperty: is adapted as choreography
has subproperty: is freely translated as
has subproperty: is adapted as libretto
has subproperty: is imitated as
has subproperty: is expanded as
has subproperty: is revised as
has subproperty: is adapted as
has subproperty: is paraphrased as
has subproperty: is arranged as
has subproperty: is abridged as
has subproperty: is digested as
has subproperty: is translated as
has subproperty: is adapted as oratorio
has subproperty: is inspiration for
lexical alias: derivative.en
status: Published
type: Property
label: er afledning @da
label: hat Ableitung @de
label: heeft afgeleide @nl
label: johdannaisaineisto @fi
label: származéka a következő: @hu
label: türev ile ilişkilidir @tr
label: له اشتقاق @ar
label: 有衍生 @zh-hans
sub property of: has derivative resource relationship with (Deprecated)
inverse of: has source
definition: Bir kaynağı, başka bir kaynağın değiştirilmiş hali ile olan başka bir kaynakla ilişkilendirir. @tr
definition: Hozzákapcsol egy forrást egy forráshoz, amely egy másik forrás módosítása. @hu
definition: Liittää aineiston aineistoon, joka on johdettu toisesta aineistosta. @fi
definition: Relaterer en ressource til en ressource, der er en ændring af en oprindelig ressource. @da
definition: Relates a resource to a resource that is a modification of another resource.
definition: Setzt eine Ressource in Beziehung zu einer Ressource, die eine Variante einer anderen Ressource darstellt. @de
definition: يربط بين مصدر ومصدر يعد تعديلًا لمصدر آخر. @ar
definition: 将一种资源与作为另一种资源之修改的一种资源关联起来。 @zh-hans

is errata to
lexical alias: errataTo.en
status: Published
type: Property
label: aineiston painovirheluettelo @fi
label: düzeltmesidir @tr
label: er errata til @da
label: hibajegyzékkel ellátott @hu
label: is errata bij @nl
label: ist Errata zu @de
label: هو تصويبات لـ @ar
label: 是……的勘误 @zh-hans
sub property of: is augmentation of
inverse of: has errata
definition: Bir kaynağı, yayınlandıktan sonra tespit edilen baskın bir kaynaktaki hataları ve düzeltmeleriyle artırılmış başka bir kaynakla ilişkilendirir. @tr
definition: Hozzákapcsol egy forrást egy forráshoz, amelyet egy domináns forrásban bővítettek a megjelenés után felfedezett hibák listájával, valamint azok javításaival. @hu
definition: Liittää aineiston aineistoon, jota on laajennettu teoksen julkaisemisen jälkeen löytyneiden virheiden luettelolla ja niiden korjauksilla. @fi
definition: Relaterer en ressource til en ressource, der er beriget med en liste over rettelser af fejl, som er blevet opdaget efter publicering af hovedværket. @da
definition: Relates a resource to a resource that is augmented by a list of errors in a predominant resource, discovered after publication, with their corrections.
definition: Setzt eine Ressource in Beziehung zu einer Ressource, die durch eine Liste von Fehlern, die nach Veröffentlichung der Hauptressource entdeckt wurden, und deren Korrekturen erweitert wird. @de
definition: يربط بين مصدر ومصدر مزيَّد بقائمة أخطاء في مصدر سائد، تم اكتشافها بعد النشر، مع تصويباتها. @ar
definition: 将一种资源与被一种主要资源出版后发现的错误及其更正列表附增的一种资源关联起来。 @zh-hans

is guide to
lexical alias: guideTo.en
status: Published
type: Property
label: er vejledning til @da
label: is gids bij @nl
label: ist Orientierungshilfe für @de
label: kalauzzal ellátott @hu
label: opas aineistoon @fi
label: rehberdir @tr
label: هو دليل إرشادي لـ @ar
label: 是……的指南 @zh-hans
sub property of: is augmentation of
inverse of: has guide
definition: Bir kaynağı, kullanıcısına yardımcı olmak adına notlar, öğrenmeye ve çalışmaya yardımcı materyaller, alıştırmalar, problemler, sorular, cevaplar, eğitmen veya öğrenci materyalleri vb. gibi artırılmış içeriğe sahip başka bir kaynakla ilişkilendirir. @tr
definition: Hozzákapcsol egy forrást egy forráshoz, amelyet bővítenek egy másik forrással, amelynek tartalma, mint például jegyzetek, tanulási és tanulmányi segédletek, gyakorlatok, problémák, kérdések és válaszok, oktatói és diákanyagok stb., egy domináns forrás használóját segíti. @hu
definition: Liittää aineiston aineistoa laajentavaan aineistoon, joka koostuu pääaineiston käyttäjää auttavasta aineistosta kuten muistiinpanoista, opiskelumateriaaleista, harjoituksista, tehtävistä, kysymyksistä ja vastauksista tai muista opettajan tai opiskelijan aineistoista. @fi
definition: Relaterer en ressource til en ressource, der er beriget af en anden ressource, der består af materiale, som kan hjælpe brugeren af hovedværket, såsom noter, lære- og studiehjælpemidler, øvelser, problemstillinger, spørgsmål og svar, lærer- eller elevmaterialer etc @da
definition: Relates a resource to a resource that is augmented by a related resource that consists of material, such as notes, learning and study aids, exercises, problems, questions and answers, instructor or student materials, etc., to help a user of a predominant resource.
definition: Setzt eine Ressource in Beziehung zu einer Ressource, die durch eine in Beziehung stehende Ressource erweitert ist, die zum Beispiel Anmerkungen, Lern- und Studienhilfen, Übungen, Problemstellungen, Fragen und Antworten, Lehr- oder Schülermaterialien und so weiter enthält, und Benutzende bei der Verwendung einer Hauptressource unterstützt. @de
definition: يربط بين مصدر ومصدر تم تعزيزه من خلال مصدر ذي صلة يتكون من مواد، مثل الملاحظات، ووسائل التعلم والدراسة، والتمارين، والمسائل، والأسئلة والأجوبة، ومواد المعلم أو الطلاب، إلخ، لمساعدة مستخدم مصدر سائد. @ar
definition: 将一种资源与作为被由注释、学习和研究工具、练习、提问、问题与答案、教师或学生参考资料等组成对使用者使用主要资源提供指导的一种相关资源附增的一种资源关联起来。 @zh-hans

is appendix to
lexical alias: appendixTo.en
status: Published
type: Property
label: ekidir @tr
label: er bilag til @da
label: függelékkel ellátott @hu
label: is appendix bij @nl
label: ist Anhang zu @de
label: liite aineistoon @fi
label: 是……的附录 @zh-hans
sub property of: is augmentation of
inverse of: has appendix
definition: Bir kaynağı, içeriği ilgili bir kaynağın içeriğiyle artırılmış bir kaynakla ilişkilendirir. @tr
definition: Hozzákapcsol egy forrást egy forráshoz, amelynek tartalmát egy kapcsolódó forrás tartalmával bővítenek. @hu
definition: Liittää aineiston aineistoon, jonka sisältöä on laajennettu siihen liittyvän aineiston sisällöllä. @fi
definition: Relaterer en ressource til en ressource, der er beriget med inhold af en anden ressource. @da
definition: Relates a resource to a resource whose content is augmented with content from a related resource.
definition: Setzt eine Ressource in Beziehung zu einer Ressource, deren Inhalt durch Inhalt einer in Beziehung stehenden Ressource erweitert wird. @de
definition: يربط بين مصدر ومصدر زُيِد محتواه بمحتوى من مصدر ذي صلة. @ar
definition: 将一种资源与用一种相关资源的内容附增其内容的一种资源关联起来。 @zh-hans

is illustrations for
lexical alias: illustrationsFor.en
status: Published
type: Property
label: aineiston kuvitus @fi
label: er illustrationer til @da
label: illusztrációk a következőhöz: @hu
label: is illustraties voor @nl
label: resimlemedir @tr
label: sind Illustrationen für @de
label: هي إيضاحيات لــ @ar
label: 是……的插图 @zh-hans
sub property of: is augmentation of
inverse of: has illustrations
definition: Bir kaynağı, onu açıklamak veya görsellik kazandırmak için kullanılan resim içeriğiyle artırılan bir kaynağa bağlar. @tr
definition: Hozzákapcsol egy forrást egy forráshoz, amelyet képi tartalommal bővítenek, amelyet annak magyarázatára vagy díszítésére terveztek. @hu
definition: Liittää aineiston aineistoon, jota on laajennettu sitä selittämään tai koristamaan suunnitellulla kuvasisällöllä. @fi
definition: Relaterer en ressource til en ressource, der er beriget med billedindhold, som er skabt til at forklare eller udsmykke den. @da
definition: Relates a resource to a resource that is augmented by pictorial content designed to explain or decorate it.
definition: Setzt eine Ressource in Beziehung zu einer Ressource, die durch Bildinhalte ergänzt wird, die die Ressource erklären oder ausschmücken sollen. @de
definition: يربط بين مصدر ومصدر زُيِد بمحتوى تصويري مصمم لشرحه أو تزيينه. @ar
definition: 将一种资源与由被设计用来解释或装饰它的图画内容附增的一种资源关联起来。 @zh-hans

is evaluation of
lexical alias: evaluationOf.en
status: Published
type: Property
label: arviointi aineistosta @fi
label: değerlendirmesidir @tr
label: er evaluering af @da
label: is beschouwing van @nl
label: ist Evaluierung von @de
label: értékelése a következőnek: @hu
label: هو تقييم لـ @ar
label: 是……的评价 @zh-hans
sub property of: is description of
inverse of: is evaluated by
definition: Bir kaynağı incelenen veya değerlendirilen başka bir kaynakla ilişkilendirir. @tr
definition: Hozzákapcsol egy forrást egy forráshoz, amelyet elemeznek és megítélnek. @hu
definition: Liittää aineiston tutkittuun tai arvioituun aineistoon. @fi
definition: Relaterer en ressource til en ressource, der er undersøgt eller vurderet. @da
definition: Relates a resource to a resource that is examined or judged.
definition: Setzt eine Ressource in Beziehung zu einer Ressource, die geprüft oder beurteilt wird. @de
definition: يربط بين مصدر ومصدر تم فحصه أو الحكم عليه. @ar
definition: 将一种资源与被检查或评判的一种资源关联起来。 @zh-hans

is on carrier unit with
has subproperty: is on disc with
has subproperty: is filmed with
lexical alias: onCarrierUnitWith.en
status: Published
type: Property
label: együtt kiadva a következővel: @hu
label: er udgivet sammen med @da
label: ile aynı taşıyıcı ünitede yer alır @tr
label: is uitgevaardigd met @nl
label: ist erschienen mit @de
label: tallenteella myös (aineisto) @fi
label: és en una unitat de suport físic amb @ca
label: هو صادر مع @ar
label: 和……一起在载体单元上 @zh-hans
sub property of: is accompanied by
alternative label: ile aynı taşıyıcı birimde yer alır @tr
alternative label: ilmestynyt yhdessä (aineisto) @fi
alternative label: is issued with
alternative label: 与……一起发行 @zh-hans
definition: Bir kaynağı, aynı taşıyıcı birimin parçası olan başka bir kaynağın parçası ile ilişkilendirir. @tr
definition: Hozzákapcsol egy forrást egy forráshoz, amelyet ugyanazon a hordozón adnak ki, mint az éppen leírt forrást. @hu
definition: Liittää aineiston ainestoon, joka on ilmestynyt samalla tallenteella kuin toinen osa-aineisto. @fi
definition: Relaterer en ressource til en ressource, der er udgivet på den samme bærer som den ressource, der beskrives. @da
definition: Relates a resource to a resource that is a part of the same carrier unit as another part resource.
definition: Setzt eine Ressource in Beziehung zu einer Ressource, die auf demselben Datenträger erscheint, wie die Ressource, die beschrieben wird. @de
definition: يربط بين مصدر ومصدر صادر على الوسيط نفسه مثل المصدر الذي يتم وصفه. @ar
definition: 将一种资源与作为和另一种部分资源一起在同一个载体单元上的一个部分的一种资源关联起来。 @zh-hans

is on disc with
lexical alias: onDiscWith.en
status: Published
type: Property
label: azonos lemezen a következővel: @hu
label: er på disc med @da
label: ile aynı disk üzerinde yer alır @tr
label: is op disk met @nl
label: ist auf Disk mit @de
label: levyllä myös (aineisto) @fi
label: هو على قرص مع @ar
label: 与……合盘 @zh-hans
sub property of: is on carrier unit with
definition: Bir kaynağı, kaynakla aynı diskte bulunan bir diğer kaynakla ilişkilendirir. @tr
definition: Hozzákapcsol egy forrást egy forráshoz, amely ugyanazon a lemezen található, mint a forrás. @hu
definition: Liittää aineiston samalle levylle tallennettuun toiseen aineistoon. @fi
definition: Relaterer en ressource til en ressource, der er udgivet på den samme disc som en ressource, der beskrives. @da
definition: Relates a resource to a resource that is contained on the same disc as a resource.
definition: Setzt eine Ressource in Beziehung zu einer Ressource, die auf derselben Disk enthalten ist, wie eine Ressource. @de
definition: يربط بين مصدر ومصدر موجود على القرص نفسه كمصدر @ar
definition: 将一种资源与和一种资源一起包含在同一片盘中的一种资源关联起来。 @zh-hans

is filmed with
lexical alias: filmedWith.en
status: Published
type: Property
label: azonos filmen a következővel: @hu
label: er filmet med @da
label: filmillä myös (aineisto) @fi
label: ile birlikte çekilmiştir @tr
label: is gefilmd met @nl
label: ist verfilmt mit @de
label: هو مصور مع @ar
label: 与……合拍 @zh-hans
sub property of: is on carrier unit with
definition: Bir kaynağı, kaynakla aynı mikroformda bulunan bir kaynakla ilişkilendirir. @tr
definition: Hozzákapcsol egy forrást egy forráshoz, amely ugyanazon a mikroformátumú hordozón található, mint a forrás. @hu
definition: Liittää aineiston samalle mikrofilmille tallennettuun toiseen aineistoon. @fi
definition: Relaterer en ressource til en ressource, der er udgivet på den samme mikroform som en ressource, der beskrives. @da
definition: Relates a resource to a resource that is contained on the same microform as a resource.
definition: Setzt eine Ressource in Beziehung zu einer Ressource, die auf derselben Mikroform enthalten ist, wie eine Ressource. @de
definition: يربط بين مصدر ومصدر موجود على الميكروفورم نفسه كمصدر. @ar
definition: 将一种资源与和一种资源一起包含在同一件缩微品中的一种资源关联起来。 @zh-hans

is supplement to
lexical alias: supplementTo.en
status: Published
type: Property
label: ektir @tr
label: er supplement til @da
label: is supplement op @nl
label: ist Supplement zu @de
label: suplementti aineistoon @fi
label: szuplementuma a következőnek: @hu
label: هو إضَافَة لـ @ar
label: 是……的补编 @zh-hans
sub property of: is augmentation of
inverse of: has supplement
definition: Bir kaynağı, bir artırılmış kaynak tarafından başka bir şekilde tamamlanmış veya güncellenmekte olan bir kaynakla ilişkilendirir. @tr
definition: Hozzákapcsol egy forrást egy forráshoz, amelyet egy bővítő mű frissít vagy más módon kiegészít. @hu
definition: Liittää aineiston aineistoon, jota laajentava aineisto päivittää tai muutoin täydentää. @fi
definition: Relaterer en ressource til en ressource, der er opdateret eller på anden måde komplementeret af den berigende ressource. @da
definition: Relates a resource to a resource that is updated or otherwise complemented by an augmenting resource.
definition: Setzt eine Ressource in Beziehung zu einer Ressource, die durch eine erweiternde Ressource aktualisiert oder in anderer Weise vervollständigt wird. @de
definition: يربط بين مصدر ومصدر تم تحديثه أو استكماله بطريقة أخرى بمصدر مُزيَّد. @ar
definition: 将一种资源与被一种附增资源更新或补充的一种资源关联起来。 @zh-hans

is adapted as
has subproperty: is dramatized as
has subproperty: is adapted in verse as
has subproperty: is adapted as motion picture
has subproperty: is adapted as novel
has subproperty: is adapted as radio program
has subproperty: is adapted as screenplay
has subproperty: is adapted as radio script
has subproperty: is adapted as television program
has subproperty: is adapted as video
has subproperty: is adapted as musical theatre
has subproperty: is adapted as opera
has subproperty: is adapted as graphic novel
has subproperty: is adapted as video game
lexical alias: adaptedAs.en
status: Published
type: Property
label: er bearbejdet som @da
label: feldolgozása a következőként: @hu
label: is bewerkt als @nl
label: ist bearbeitet als @de
label: olarak uyarlanmıştır @tr
label: sovitettu (aineisto) @fi
label: هو مُقتبس كـ @ar
label: 被改编为 @zh-hans
sub property of: has derivative
inverse of: is adaptation of
definition: Bir kaynağı, başlangıçta amaçlanandan farklı bir amaç, kullanım veya ortam için uyarlayan başka bir kaynakla ilişkilendirir. @tr
definition: Hozzákapcsol egy forrást egy forráshoz, amely egy másik forrást olyan célra, használatra vagy médiumra módosít, amely más, mint amit eredetileg terveztek. @hu
definition: Liittää aineiston aineistoon, joka muokkaa toista aineistoa muuta kuin aineistolle alun perin suunniteltua tarkoitusta, käyttöä tai esitysmuotoa varten. @fi
definition: Relaterer en ressource til en ressource, der modificerer en oprindelig ressource til et andet formål, en anden brug eller et andet medium end det, det oprindeligt var beregnet til. @da
definition: Relates a resource to a resource that modifies another resource for a purpose, use, or medium other than that for which it was originally intended.
definition: Setzt eine Ressource in Beziehung zu einer Ressource, die eine andere Ressource für einen anderen Zweck, eine andere Nutzung oder ein anderes Medium bearbeitet als den/die/das, wofür sie ursprünglich konzipiert war. @de
definition: يربط بين مصدر ومصدر يقوم بتعديل مصدر آخر لغرض، أو استخدام، أو وسيط بخلاف ذلك الغرض الذي كان مخصصًا له في الأصل. @ar
definition: 将一种资源与以不同于起初意图的目的、使用或媒介修改另一资源的一种资源关联起来。 @zh-hans
scope note: Bu ilişki, şekil değişiklikleri veya tamamen aynı biçimde yeniden yazılan kaynaklar için geçerlidir. @tr
scope note: Denne relation gælder for ændringer i form eller for ressourcer, der er omskrevet fuldstændigt i samme form. @da
scope note: Diese Beziehung bezieht sich auf Änderungen der Form oder auf Ressourcen, die in derselben Form vollständig neu geschrieben sind. @de
scope note: Ez a kapcsolat érvényes a formai változásokra, vagy az ugyanabban a formában teljesen újraírt forrásokra. @hu
scope note: Koskee muodon muutoksia tai aineiston kattavaa uudelleenkirjoittamista samassa muodossa. @fi
scope note: This relationship applies to changes in form or to resources completely rewritten in the same form.
scope note: تنتطبق هذه العلاقة على التغييرات في الشكل أو في المصادر المعاد كتابتها بالكامل بنفس الشكل. @ar
scope note: 这个关系适用于形式上的变化或者适用于以同样形式完全重写的资源。 @zh-hans

is preceded by
has subproperty: has prequel
has subproperty: is split from
has subproperty: is separated from
has subproperty: is replacement in part of
has subproperty: is replacement of
has subproperty: is merger of
has subproperty: is absorption of
has subproperty: is absorption in part of
has subproperty: is continuation of
has subproperty: is sequel to (Deprecated)
lexical alias: precededBy.en
status: Published
type: Property
label: edeltävä aineisto @fi
label: er forudgået af @da
label: is voorafgegaan door @nl
label: ist vorangegangen ist @de
label: megelőzi a következő: @hu
label: takip eder @tr
label: هو مسبوق بـ @ar
label: 被……作为先前 @zh-hans
sub property of: has sequential resource relationship with (Deprecated)
inverse of: is succeeded by
definition: Bir kaynağı, kronolojik kapsamı başka bir kaynaktan önce olan bir kaynakla ilişkilendirir. @tr
definition: Hozzákapcsol egy forrást egy forráshoz, amely kronológiai narratívában megelőz egy rákövetkező forrást. @hu
definition: Liittää aineiston aineistoon, jonka ajallinen kattavuus on aineiston ajallista kattavuutta varhaisempi. @fi
definition: Relaterer en ressource til en ressource, der går forud for den efterfølgende ressource, fx på et tidligere tidspunkt eller før noget i en fortælling. @da
definition: Relates a resource to a resource whose chronological coverage is before that of another resource.
definition: Setzt eine Ressource in Beziehung zu einer Ressource, deren zeitliches Geschehen vor dem einer anderen Ressource liegt. @de
definition: يربط بين مصدر ومصدر تكون تغطيته الزمنية قبل التغطية الخاصة بمصدر آخر. @ar
definition: 将一种资源与在时间覆盖面上在另一种资源之前的一种资源关联起来。 @zh-hans

has finding aid
has subproperty: has catalogue
has subproperty: has hierarchic finding aid
lexical alias: findingAid.en
status: Published
type: Property
label: er hjælpeverktøj @da
label: hat Findmittel @de
label: heeft vind-hulpmiddel @nl
label: keresési segédlete a következő: @hu
label: luettelo (aineisto) @fi
label: rehber bilgi ile ilişkilidir @tr
label: له معينات البحث @ar
label: 有查询工具 @zh-hans
sub property of: is described with metadata by
inverse of: is finding aid of
definition: Bir kaynağı, bir koleksiyon kaynağı hakkında üstveri seti olan bir başka bir kaynakla ilişkilendirir. @tr
definition: Hozzákapcsol egy forrást egy forráshoz, amely útmutatóval látja el egy levéltári gyűjtemény szervezetét, elrendezését és tartalmát. @hu
definition: Liittää aineiston aineistoon joka on kokoelma-aineiston metatietokokonaisuus. @fi
definition: Relaciona un recurs amb un recurs que és un conjunt de descripció de metadades d’un recurs de col·lecció de recursos. @ca
definition: Relaterer en ressource til en ressource, der giver en vejledning til organiseringen, ordningen og indholdet af en arkivsamling. @da
definition: Relates a resource to a resource that is a metadata description set for a collection resource.
definition: Setzt eine Ressource in Beziehung zu einer Ressource, die eine Orientierungshilfe zum Aufbau, zur Anordnung und zu den Inhalten einer Archivsammlung enthält. @de
definition: يربط بين مصدر ومصدر يوفر دليلًا لتنظيم، ترتيب واحتواء مجموعة أرشيفية. @ar
definition: 将一种资源与作为一种收藏资源之元数据描述集合的一种资源关联起来。 @zh-hans

has index
lexical alias: index.en
status: Published
type: Property
label: er indeks @da
label: hakemisto (aineisto) @fi
label: hat Index @de
label: heeft index @nl
label: indeks ile ilişkilidir @tr
label: tárgymutatója a következő: @hu
label: له كشاف @ar
label: 有索引 @zh-hans
sub property of: aineistoon liittyvä aineisto
inverse of: is index for
definition: Bir kaynağı, metinsel kaynak olan bir kaynağın içerik dizini olan bir kaynağa bağlar. @tr
definition: Hozzákapcsol egy forrást egy forráshoz, amely egy szisztematikus és betűrendes kalauz egy másik forrás tartalmához. @hu
definition: Liittää aineiston aineistoon, joka on systemaattinen opas tekstiaineiston sisältöön. @fi
definition: Relaciona un recurs amb un recurs que és una guia sistemàtica del contingut d’un recurs que és un recurs textual. @ca
definition: Relaterer en ressource til en ressource, der indeholder en systematisk, alfabetiseret oversigt over indholdet i hovedværket, normalt kædet sammen med sidenumre eller andre henvisningskoder. @da
definition: Relates a resource to a resource that is a systematic guide to the content of a resource that is a textual resource.
definition: Setzt eine Ressource in Beziehung zu einer Ressource, die eine systematische, alphabetische Orientierungshilfe zum Inhalte einer anderen Ressource bietet. @de
definition: يربط بين مصدر ومصدر يوفر دليلًا منهجيًا،هجائيًا لمحتويات مصدر آخر. @ar
definition: 将一种资源与作为一种文字资源的一种资源之内容的系统性指引的一种资源关联起来。 @zh-hans

has screenplay
has subproperty: has motion picture screenplay
has subproperty: has television screenplay
has subproperty: has video screenplay
lexical alias: screenplay.en
status: Published
type: Property
label: er manuskript @da
label: forgatókönyve a következő: @hu
label: hat Drehbuch @de
label: heeft scenario @nl
label: käsikirjoitus (aineisto) @fi
label: senaryo ile ilişkilidir @tr
label: له سيناريو @ar
label: 有影视剧剧本 @zh-hans
sub property of: is complemented by
inverse of: is screenplay for
definition: Bir kaynağı, senaryo kullanan bir kaynağı tamamlayan ve metin olarak gerçekleştirilen bir kaynakla ilişkilendirir. @tr
definition: Hozzákapcsol egy forrást egy forráshoz, amely szövegként valósul meg és kiegészít egy forgatókönyvet használó forrást. @hu
definition: Liittää aineiston aineistoon, joka käyttää käsikirjoitusta ja jota on täydennetty tekstiteoksella. @fi
definition: Relaciona un recurs amb un recurs que és un recurs textual que complementa un recurs que usa un guió. @ca
definition: Relaterer en ressource til en ressource, der indeholder teksten til en film, et tv-program eller en video. @da
definition: Relates a resource to a resource that is a textual resource that complements a resource that uses a screenplay.
definition: Setzt eine Ressource in Beziehung zu einer textlichen Ressource, die eine Ressource ergänzt, die ein Drehbuch verwendet. @de
definition: يربط بين مصدر ومصدر يتحقق كنص يكمل مصدر يستخدم سيناريو. @ar
definition: 将一种资源与作为一种文字资源并补充使用一种影视剧剧本的一种资源的一种资源关联起来。 @zh-hans

has motion picture screenplay
lexical alias: motionPictureScreenplay.en
status: Published
type: Property
label: elokuvakäsikirjoitus (aineisto) @fi
label: er filmmanuskript @da
label: hat Filmdrehbuch @de
label: heeft speelfilmscenario @nl
label: mozgókép-forgatókönyve a következő: @hu
label: sinema filmi senaryosu ile ilişkilidir @tr
label: له سيناريو فيلم سينمائي @ar
label: 有电影剧本 @zh-hans
sub property of: has screenplay
inverse of: is screenplay for motion picture
definition: Bir kaynağı, sinema filmi olan bir kaynağı tamamlayan metinsel bir kaynakla ilişkilendirir. @tr
definition: Hozzákapcsol egy forrást egy szöveges forráshoz, amely kiegészít egy forrást, ami egy mozgókép. @hu
definition: Liittää aineiston elokuva-aineistoon, joka käyttää käsikirjoitusta ja jota on täydennetty tekstiteoksella. @fi
definition: Relaterer en ressource til en ressource, der indeholder teksten til en film. @da
definition: Relates a resource to a resource that is textual resource that complements a resource that is a motion picture.
definition: Setzt eine Ressource in Beziehung zu einer textlichen Ressource, die eine Filmressource ergänzt. @de
definition: يربط بين مصدر ومصدر نصي يكمل مصدر يمثل فيلم سينمائي. @ar
definition: 将一种资源与作为一种文字资源并补充使用一种电影剧本的一种资源的一种资源关联起来。 @zh-hans

is musical setting of
lexical alias: musicalSettingOf.en
status: Published
type: Property
label: er musiksætning af @da
label: is muziek gezet op @nl
label: ist Vertonung von @de
label: musiikkiteoksen teksti (aineisto) @fi
label: müzikal düzenlemesidir @tr
label: zenei átirata a következőnek: @hu
label: هو إعداد موسيقي لـ @ar
label: 是……的配乐 @zh-hans
sub property of: has source
inverse of: is set to music as
definition: Bir kaynağı, oratoryodan başka, dramatik olmayan bir müzik kaynağı için metin sağlayan başka bir kaynakla ilişkilendirir. @tr
definition: Hozzákapcsol egy forrást egy forráshoz, amely szöveggel lát el egy nem oratórium nem-drámai zenei forrást. @hu
definition: Liittää aineiston aineistoon, joka on ei-näytelmällisen musiikkiteoksen (muun kuin oratorion) teksti. @fi
definition: Relaterer en ressource til en ressource, der indeholder tekst til en ressource af et ikke-dramatisk musikværk, bortset fra et oratorium. @da
definition: Relates a resource to a resource that provides text for a non-dramatic musical resource, other than an oratorio.
definition: Setzt eine Ressource in Beziehung zu einer Ressource, die Text für eine nicht dramatische Musikressource (kein Oratorium) liefert. @de
definition: يربط بين مصدر ومصدر يقدم نصًا لعمل موسيقي غير درامي، بخلاف الموسيقى الدينية. @ar
definition: 将一种资源与为一种非戏剧音乐作品（清唱剧除外）提供文本的资源关联起来。 @zh-hans

has radio script
lexical alias: radioScript.en
status: Published
type: Property
label: er radiomanuskript @da
label: hat Hörfunkskript @de
label: heeft radioscript @nl
label: radio-ohjelman käsikirjoitus (aineisto) @fi
label: radyo metni ile ilişkilidir @tr
label: rádiószövegkönyve a következő: @hu
label: له نص إذاعي @ar
label: 有广播文稿 @zh-hans
sub property of: is complemented by
inverse of: is script for radio program
definition: Bir kaynağı, radyo programı olan bir eseri tamamlayan metinsel bir kaynakla ilişkilendirir. @tr
definition: Hozzákapcsol egy forrást egy szöveges forráshoz, amely kiegészít egy művet, ami egy rádióműsor. @hu
definition: Liittää aineiston radio-ohjelma-aineistoon, joka käyttää käsikirjoitusta ja jota on täydennetty tekstiteoksella. @fi
definition: Relaciona un recurs amb un recurs que és un recurs textual que complementa un recurs que és un programa radiofònic. @ca
definition: Relaterer en ressource til en ressource, der indeholder teksten til et radioprogram. @da
definition: Relates a resource to a resource that is textual resource that complements a resource that is a radio program.
definition: Setzt eine Ressource in Beziehung zu einer textlichen Ressource, die eine Hörfunksendung ergänzt. @de
definition: يربط بين مصدر ومصدر نصي يكمل عملًا يمثل برنامج إذاعي. @ar
definition: 将一种资源与补充作为一种广播节目的一种资源的作为一种文字资源的一种资源关联起来。 @zh-hans

has television screenplay
lexical alias: televisionScreenplay.en
status: Published
type: Property
label: er tv-manuskript @da
label: hat Fernsehdrehbuch @de
label: heeft televisiescenario @nl
label: televisio-ohjelman käsikirjoitus (aineisto) @fi
label: televizyon senaryosu ile ilişkilidir @tr
label: televíziós forgatókönyve a következő: @hu
label: له سيناريو تليفزيوني @ar
label: 有电视剧本 @zh-hans
sub property of: has screenplay
inverse of: is screenplay for television program
definition: Bir kaynağı, televizyon programı olan bir kaynağı tamamlayan metinsel kaynak olan bir kaynakla ilişkilendirir. @tr
definition: Hozzákapcsol egy forrást egy szöveges forráshoz, amely kiegészít egy forrást, ami egy televízióműsor. @hu
definition: Liittää aineiston televisio-ohjelma-aineistoon, joka käyttää käsikirjoitusta ja jota on täydennetty tekstiteoksella. @fi
definition: Relaterer en ressource til en ressource, der indeholder teksten til et tv-program. @da
definition: Relates a resource to a resource that is a textual resource that complements a resource that is a television program.
definition: Setzt eine Ressource in Beziehung zu einer textlichen Ressource, die eine Fernsehsendung ergänzt. @de
definition: يربط بين مصدر ومصدر نصي يكمل مصدرًا يمثل برنامج تليفزيوني. @ar
definition: 将一种资源与补充作为一种电视节目的一种资源的作为一种文字资源的一种资源关联起来。 @zh-hans

has video screenplay
lexical alias: videoScreenplay.en
status: Published
type: Property
label: er videomanuskript @da
label: hat Videodrehbuch @de
label: heeft videoscenario @nl
label: video senaryosu ile ilişkilidir @tr
label: videon käsikirjoitus (aineisto) @fi
label: videóforgatókönyve a következő: @hu
label: له سيناريو فيديو @ar
label: 有视频剧本 @zh-hans
sub property of: has screenplay
inverse of: is screenplay for video
definition: Bir kaynağı, video olan bir kaynağı tamamlayan metinsel kaynak olan bir kaynakla ilişkilendirir. @tr
definition: Hozzákapcsol egy forrást egy szöveges forráshoz, amely kiegészít egy forrást, ami egy videó. @hu
definition: Liittää aineiston videoaineistoon, joka käyttää käsikirjoitusta ja jota on täydennetty tekstiteoksella. @fi
definition: Relaterer en ressource til en ressource, der indeholder teksten til en video. @da
definition: Relates a resource to a resource that is a textual resource that complements a resource that is a video.
definition: Setzt eine Ressource in Beziehung zu einer textlichen Ressource, die ein Video ergänzt. @de
definition: يربط بين مصدر ومصدر نصي يكمل مصدرًا يمثل فيديو. @ar
definition: 将一种资源与补充作为一种视频的一种资源的作为一种文字资源的一种资源关联起来。 @zh-hans

has libretto
lexical alias: libretto.en
status: Published
type: Property
label: er libretto @da
label: hat Libretto @de
label: heeft libretto @nl
label: libretto (aineisto) @fi
label: libretto ile ilişkilidir @tr
label: librettója a következő: @hu
label: له نص أوبرالي @ar
label: 有台本 @zh-hans
sub property of: is complemented by
inverse of: is libretto for
definition: Bir kaynağı, bir opera veya müzik sahnesi için başka bir kaynak olan ya da bir oratoryo olan kaynağı tamamlayan ve metin olarak gerçekleştirilen bir kaynakla ilişkilendirir. @tr
definition: Hozzákapcsol egy forrást egy forráshoz, amely szövegként valósul meg és kiegészít egy forrást, ami egy opera, vagy egyéb zenés színpadi forrás, vagy egy oratórium. @hu
definition: Liittää aineiston tekstiaineistona toteutettuun aineistoon, jota täydentää musiikkiaineisto, koreografinen aineisto, baletti tai muu lavaesitysaineisto tai oratorio. @fi
definition: Relaciona un recurs amb un recurs que és un recurs textual que complementa un recurs que és una obra musical o coreogràfica com ara una òpera, un ballet o qualsevol altre recurs escènic musical o d’un oratori. @ca
definition: Relaterer en ressource til en ressource, der indeholder teksten til en opera eller en ressource til et andet musikalsk sceneværk, eller til et oratorium. @da
definition: Relates a resource to a resource that is a textual resource that complements a resource that is a musical or choreographic resource such as an opera, a ballet, or other resource for the musical stage, or an oratorio.
definition: Setzt eine Ressource in Beziehung zu einer textlichen Ressource, die eine Oper oder eine andere Ressource für die Bühne, oder ein Oratorium ergänzt. @de
definition: يربط بين مصدر ومصدر يتحقق كنص يكمل مصدر أوبرالي أو مصدر آخر للمسرح الموسيقي أو لموسيقى دينية. @ar
definition: 将一种资源与补充诸如歌剧、芭蕾或其他舞台音乐作品或清唱剧之类的作为一种音乐或编舞资源的一种资源的作为一种文字资源的一种资源关联起来。 @zh-hans

is reprinted as
lexical alias: reprintedAs.en
status: Published
type: Property
label: er genoptrykt som @da
label: is herdrukt als @nl
label: ist nachgedruckt als @de
label: olarak yeniden basılmıştır @tr
label: reprintje a következőként: @hu
label: uusintapainos aineistosta @fi
label: أعيد طباعته كـ @ar
label: 被重印为 @zh-hans
sub property of: is reproduced as
inverse of: is reprint of
definition: Bir kaynağı, tanımlanan basılı bir kaynakla ve aynı kaynağın yeniden yayımlanmış hali olan bir kaynakla ilişkilendirir. @tr
definition: Hozzákapcsol egy forrást egy olyan forráshoz, amely nyomtatott forrásként újrakiadása ugyanannak a forrásnak, amelyet éppen leírtak. @hu
definition: Liittää aineiston uusintajulkaisuun samasta aineistosta kuin kuvailtavana oleva painettu aineisto. @fi
definition: Relaterer en ressource til en ressource, der genudgiver den samme ressource som en trykt beskreven ressource. @da
definition: Relates a resource to a resource that reissues the same resource as a printed resource being described.
definition: Setzt eine Ressource in Beziehung zu einer Ressource, die dieselbe Ressource wie die beschriebene, gedruckte Ressource neu heraus gibt. @de
definition: يربط بين مصدر ومصدر يُعيد إصدار نفس المصدر كمصدر مطبوع يتم وصفه. @ar
definition: 将一种资源与重新发行与所描述印刷资源同样资源的一种资源关联起来。 @zh-hans

is reproduced as
has subproperty: has electronic reproduction
has subproperty: has digital transfer
has subproperty: has facsimile
has subproperty: is reprinted as
lexical alias: reproducedAs.en
status: Published
type: Property
label: er reproduceret som @da
label: is gereproduceerd als @nl
label: ist reproduziert als @de
label: jäljenne aineistosta @fi
label: olarak yeniden yapılmıştır @tr
label: reprodukciója a következőként: @hu
label: أعيد استنساخه كـ @ar
label: 被复制为 @zh-hans
sub property of: has equivalent
inverse of: is reproduction of
definition: Bir kaynağı, ilgili kaynağı üreten başka bir kaynak ile ilişkilendirir. @tr
definition: Hozzákapcsol egy forrást egy forráshoz, amely másolata egy kapcsolódó forrásnak. @hu
definition: Liittää aineiston aineistoon, joka on toisen aineiston jäljenne. @fi
definition: Relaterer en ressource til en ressource, der er en reproduktion af en anden ressource. @da
definition: Relates a resource to a resource that reproduces a related resource.
definition: Setzt eine Ressource in Beziehung zu einer Ressource, die eine in Beziehung stehende Ressource reproduziert. @de
definition: يربط بين مصدر ومصدر يستنسخ مصدر ذو صلة. @ar
definition: 将一种资源与复制一种相关资源的一种资源关联起来 @zh-hans

is paraphrased as
lexical alias: paraphrasedAs.en
status: Published
type: Property
label: er parafraseret som @da
label: is geparafraseerd als @nl
label: ist paraphrasiert als @de
label: olarak yeniden yorumlanmıştır @tr
label: parafraasi aineistosta @fi
label: parafrazeálja a következőként: @hu
label: معاد صياغته كـ @ar
label: 被演绎为 @zh-hans
sub property of: has derivative
inverse of: is paraphrase of
definition: Bir kaynağı, başka bir kaynağın içeriğini farklı bir biçimde yeniden ifade eden bir kaynakla ile ilişkilendirir. @tr
definition: Hozzákapcsol egy forrást egy forráshoz, amely újrafogalmazza egy másik forrás tartalmát eltérő formában. @hu
definition: Liittää aineiston aineistoon, joka toisintaa toisen aineiston sisällön eri muodossa. @fi
definition: Relaciona un recurs amb un recurs que replanteja un contingut d’un altre recurs en una forma diferent. @ca
definition: Relaterer en ressource til en ressource, der gentager en oprindelig ressource indhold i en anden form. @da
definition: Relates a resource to a resource that restates a content of another resource in a different form.
definition: Setzt eine Ressource in Beziehung zu einer Ressource, die einen Inhalt einer anderen Ressource in einer anderen Form neu darstellt. @de
definition: يربط بين مصدر ومصدر يعيد صياغة محتوى مصدر آخر في شكل مختلف. @ar
definition: 将一种资源与用不同形式重述另一种资源之内容的一种资源关联起来。 @zh-hans

is arranged as
lexical alias: arrangedAs.en
status: Published
type: Property
label: elrendezve a következőként: @hu
label: er arrangeret som @da
label: is gearrangeerd als @nl
label: ist arrangiert als @de
label: olarak düzenlenmişitir @tr
label: sovitus (aineisto) @fi
label: هي مُرتبة كـ @ar
label: 被改编为 @zh-hans
sub property of: has derivative
inverse of: is arrangement of
definition: Bir kaynağı, performans ortamı başka bir kaynağın değiştirilmesi olan bir kaynakla ilişkilendirir. @tr
definition: Hozzákapcsol egy forrást egy forráshoz, amely átír egy zenei kompozíciót olyan előadásmédiumra, amely különbözik a forrásnak eredetileg szánt médiumtól. @hu
definition: Liittää aineiston aineistoon, jonka esityskokoonpano on muunnelma toisesta aineistosta. @fi
definition: Relaciona un recurs amb un recurs el repartiment d’execució del qual és una modificació d’un altre recurs. @ca
definition: Relaterer en ressource til en musikressource, hvor den oprindelige ressource er blevet omskrevet til en anden besætning end den, ressource oprindeligt var beregnet for. @da
definition: Relates a resource to a resource whose medium of performance is a modification of another resource.
definition: Setzt eine Ressource in Beziehung zu einer Ressource, die als musikalische Komposition für eine bestimmte Besetzung umgeschrieben wird, die sich von der Originalbesetzung, für die eine Ressource konzipiert ist, unterscheidet. @de
definition: يربط بين مصدر ومصدر تم إعادة كتابته كلحن موسيقي لوسيط أداء يختلف عن الوسيط الذي كان المصدر مقررا له أصلاً. @ar
definition: 将一种资源与其表演媒介是另一种资源之修改的一种资源关联起来。 @zh-hans

is abridged as
lexical alias: abridgedAs.en
status: Published
type: Property
label: er forkortet til @da
label: is ingekort als @nl
label: ist gekürzt als @de
label: lyhennelmä (aineisto) @fi
label: olarak özetlenmiştir @tr
label: rövidítve a következőként: @hu
label: هو مختصر كـ @ar
label: 被缩编 @zh-hans
sub property of: has derivative
inverse of: is abridgement of
definition: Bir kaynağı, genel anlamını veya sunum şeklini değiştirmeden ilgili bir kaynağı kısaltan başka bir kaynakla ilişkilendirir. @tr
definition: Hozzákapcsol egy forrást egy forráshoz, amely egy kapcsolódó forrást tömörít, azaz lerövidít anélkül, hogy általános jelentését vagy előadásmódját megváltoztatná. @hu
definition: Liittää aineiston aineistoon, joka lyhentää toista aineistoa muuttamatta esityksen yleistä sisältöä tai tyyliä. @fi
definition: Relaterer en ressource til en ressource, der forkorter en oprindelig ressource uden at ændre den overordnede betydning eller præsentationsmåde. @da
definition: Relates a resource to a resource that shortens a related resource without changing the general meaning or manner of presentation.
definition: Setzt eine Ressource in Beziehung zu einer Ressource, die eine in Beziehung stehende Ressource ohne Änderung der allgemeinen Bedeutung oder Darstellungsweise kürzt. @de
definition: يربط بين مصدر ومصدر يختصر مصدرًا ذو صلة دون تغيير المعنى العام أو طريقة العرض. @ar
definition: 将一种资源与缩短一种相关资源而不改变其总体意义或呈现方式的一种资源关联起来。 @zh-hans

is split from
lexical alias: splitFrom.en
status: Published
type: Property
label: ayrılır @tr
label: er delvis fortættelse af @da
label: is gesplitst uit @nl
label: ist teilweise Fortsetzung von @de
label: jakautunut aineistosta @fi
label: kiválása a következőből: @hu
label: هو منشطر من @ar
label: 被从……分出 @zh-hans
sub property of: is preceded by
inverse of: is split into
definition: Bir kaynağı, kısmi içeriğini başka bir artzamanlı kaynak tarafından sürdürülen, tamamlanmış art zamanlı bir kaynak olan kaynakla ilişkilendirir. @tr
definition: Hozzákapcsol egy forrást egy befejezett diakronikus forráshoz, amelynek részleges tartalmát egy másik diakronikus forrás folytatja. @hu
definition: Liittää aineiston valmiiseen diakroniseen aineistoon, jonka osittaista sisältöä jatkaa toinen diakroninen aineisto. @fi
definition: Relaterer en ressource til en ressource, der er delt i to eller flere separate ressourcer med nye titler. @da
definition: Relates a resource to a resource that is a diachronic resource that is completed whose partial content is continued by another diachronic resource.
definition: Setzt eine Ressource in Beziehung zu einer abgeschlossenen diachronen Ressource, deren Inhalt teilweise durch eine andere diachrone Ressource fortgeführt wird. @de
definition: يربط بين مصدر ومصدر ممتد زمنيًا ومكتمل، ومحتواه الجزئي مستمر من خلال مصدر آخر ممتد زمنيًا. @ar
definition: 将一种资源与作为一种已完成的历时资源、其部分内容被另一种历时资源继承的一种资源关联起来。 @zh-hans
scope note: Bu öğe, genel olarak ardışık bir kaynak için geçerlidir. @tr
scope note: Denne relation anvendes generelt for periodika. @da
scope note: Ez az elem általában a folyamatos forrásokra vonatkozik. @hu
scope note: Im Allgemeinen trifft dieses Element auf eine sukzessive Ressource zu. @de
scope note: This element applies in general to a successive resource.
scope note: Tämä elementti soveltuu yleensä peräkkäisesti ilmestyvään aineistoon. @fi
scope note: ينطبق هذا العنصر بشكل عام على مصدر متتالي. @ar
scope note: 该元素一般适用于一种相继资源。 @zh-hans

is separated from
lexical alias: separatedFrom.en
status: Published
type: Property
label: -den ayrılmıştır @tr
label: elválasztva a következőből: @hu
label: er adskilt fra @da
label: eronnut aineistosta @fi
label: is afgesplitst van @nl
label: ist abgespalten von @de
label: هو منفصل عن @ar
label: 被从……分离出 @zh-hans
sub property of: is preceded by
inverse of: is separated into
definition: Bir kaynağı, kısmi içeriği başka bir artzamanlı kaynak tarafından sürdürülen, halen devam eden artzamanlı bir kaynak olan kaynakla ilişkilendirir. @tr
definition: Hozzákapcsol egy forrást egy folyamatos diakronikus forráshoz, amelynek részleges tartalmát egy másik diakronikus forrás folytatja. @hu
definition: Liittää aineiston diakroniseen aineistoon, jonka osittaista sisältöä jatkaa toinen aineisto. @fi
definition: Relaterer en ressource til en ressource, hvoraf en del af indholdet er udskilt, så der er dannet en ny ressource. @da
definition: Relates a resource to a resource that is a diachronic resource that is continuing whose partial content is continued by another diachronic resource.
definition: Setzt eine Ressource in Beziehung zu einer fortlaufenden diachronen Ressource, deren Inhalt teilweise durch eine andere diachrone Ressource fortgeführt wird. @de
definition: يربط بين مصدر ومصدر ممتد زمنيًا ومستمر، ومحتواه الجزئي مستمر من خلال مصدر آخر ممتد زمنيًا. @ar
definition: 将一种资源与作为一种现行历时资源、其部分内容被另一种历时资源继承的一种资源关联起来。 @zh-hans

is succeeded by
has subproperty: has sequel
has subproperty: is replaced in part by
has subproperty: is replaced by
has subproperty: is separated into
has subproperty: is absorbed by
has subproperty: is absorbed in part by
has subproperty: is continued by
has subproperty: is prequel to (Deprecated)
has subproperty: is split into
has subproperty: is merged to form
lexical alias: succeededBy.en
status: Published
type: Property
label: er efterfulft af @da
label: folytatja @hu
label: is gevolgd door @nl
label: ist gefolgt von @de
label: myöhempi aineisto @fi
label: tarafından bir işin yerine getirilmesi @tr
label: هو متبوع بـ @ar
label: 被……后继 @zh-hans
sub property of: has sequential resource relationship with (Deprecated)
inverse of: is preceded by
definition: Bir kaynağı, kronolojik kapsamı başka bir kaynaktan sonra olan bir kaynakla ilişkilendirir. @tr
definition: Hozzákapcsol egy forrást egy forráshoz, amely kronológiai narratívában követ egy másik forrást, azaz időben későbbi vagy azutáni. @hu
definition: Liittää aineiston aineistoon joka on toista aineistoa ajallisesti tai kerronnallisesti edellä. @fi
definition: Relaterer en ressource til en ressource, der følger efter en forudgående ressource, dvs. på et senere tidspunkt eller efter noget i en fortælling etc. @da
definition: Relates a resource to a resource whose chronological coverage is after that of another resource.
definition: Setzt eine Ressource in Beziehung zu einer Ressource, deren zeitliches Geschehen nach dem einer anderen Ressource liegt. @de
definition: يربط بين مصدرًا ومصدر تكون تغطيته الزمنية بعد التغطية الخاصة بمصدر آخر. @ar
definition: 将一种资源与其年代覆盖范围在另一种资源之后的一种资源关联起来。 @zh-hans

is digested as
lexical alias: digestedAs.en
status: Published
type: Property
label: er sammendraget som @da
label: is digest als @nl
label: ist Digest @de
label: kivonatolva a következőként: @hu
label: mukautettu lyhennelmä (aineisto) @fi
label: olarak özetlenmiştir @tr
label: هو موجز كـ @ar
label: 被编制文摘为 @zh-hans
sub property of: has derivative
inverse of: is digest of
definition: Bir kaynağı, ilgili bir kaynağı sistematik ve kapsamlı bir şekilde özetleyen bir kaynakla ilişkilendirir. @tr
definition: Hozzákapcsol egy forrást egy forráshoz, amely szabályszerűen és átfogóan tömörít egy kapcsolódó forrást. @hu
definition: Liittää aineiston aineistoon, joka systemaattisesti ja kokonaisuudessaan tiivistää toisen aineiston. @fi
definition: Relaterer en ressource til en ressource, der systematisk og gennemgribende komprimerer en oprindelig ressource. @da
definition: Relates a resource to a resource that systematically and comprehensively condenses a related resource.
definition: Setzt eine Ressource in Beziehung zu einer Ressource, die eine in Beziehung stehende Ressource systematisch und umfassend verdichtet. @de
definition: يربط بين مصدر ومصدر يكثف بشكل منهجي وشامل مصدرًا ذا صلة. @ar
definition: 将一种资源与系统而全面压缩一种相关资源的一种资源关联起来。 @zh-hans

is translated as
has subproperty: has dubbed version
lexical alias: translatedAs.en
status: Published
type: Property
label: er oversat til @da
label: fordítva a következőként: @hu
label: is vertaald als @nl
label: ist übersetzt als @de
label: käännösaineisto @fi
label: olarak tercüme edilir @tr
label: هي مترجمة كـ @ar
label: 被翻译为 @zh-hans
sub property of: has derivative
inverse of: is translation of
definition: Bir kaynağı, dili başka bir kaynağın düzenlenmesi olan bir kaynakla ilişkilendirir. @tr
definition: Hozzákapcsol egy forrást egy forráshoz, amely egy másik forrás szövegét egy másik nyelvre fordítja. @hu
definition: Liittää aineiston aineistoon, joka kääntää toisen aineiston tekstin. @fi
definition: Relaciona un recurs amb un recurs la llengua del qual és una modificació d’un altre recurs. @ca
definition: Relaterer en ressource til en ressource, der oversætter det oprindelige udtryks tekst til et andet sprog end det, der er anvendt i den originale ressource. @da
definition: Relates a resource to a resource whose language is a modification of another resource.
definition: Setzt eine Ressource in Beziehung zu einer Ressource, die die Texte einer anderen Ressource in eine andere Sprache übersetzt. @de
definition: يربط بين مصدر ومصدر يترجم نص مصدر آخر إلى لغة مختلفة. @ar
definition: 将一种资源与其语言为另一种资源的修改的一种资源关联起来。 @zh-hans

has supplement
lexical alias: supplement.en
status: Published
type: Property
label: ek ile ilişkilidir @tr
label: er supplement @da
label: hat Supplement @de
label: heeft supplement @nl
label: suplementti (aineisto) @fi
label: szuplementuma a következő: @hu
label: له إضَافَة @ar
label: 有补编 @zh-hans
sub property of: is augmented by
inverse of: is supplement to
definition: Bir kaynağı, güncelleyen veya başka şekilde tamamlayan baskın bir kaynakla ilişkilendirir. @tr
definition: Hozzákapcsol egy forrást egy forráshoz, amely egy domináns forrást frissít vagy más módon kiegészít. @hu
definition: Liittää aineiston aineistoon, joka päivittää tai muutoin täydentää vallitsevaa aineistoa. @fi
definition: Relaterer en ressource til en ressource, der opdaterer eller på anden måde komplementerer hovedressourcen. @da
definition: Relates a resource to a resource that updates or otherwise complements a predominant resource.
definition: Setzt eine Ressource in Beziehung zu einer Ressource, die eine Hauptressource aktualisiert oder auf andere Weise ergänzt. @de
definition: يربط بين مصدر ومصدر يقوم بتحديث مصدر سائد أو يكمله بطريقة أخرى. @ar
definition: 将一种资源与更新或补充一种主要资源的一种资源关联起来。 @zh-hans

is screenplay for motion picture
lexical alias: screenplayForMotionPicture.en
status: Published
type: Property
label: er manuskript til film @da
label: forgatókönyv mozgóképhez: @hu
label: is scenario voor speelfilm @nl
label: ist Drehbuch für Film @de
label: käsikirjoitus elokuvaan (aineisto) @fi
label: sinema filmi için senaryodur @tr
label: هو سيناريو لفيلم سينمائي @ar
label: 是电影的剧本 @zh-hans
sub property of: is screenplay for
inverse of: has motion picture screenplay
definition: Bir kaynağı, metinsel kaynakla tamamlanan bir sinema filmi olan bir kaynakla ilişkilendirir. @tr
definition: Hozzákapcsol egy forrást egy mozgókép-forráshoz, amelyet egy szöveges forrás egészít ki. @hu
definition: Liittää aineiston elokuva-aineistoon, jota on täydennetty tekstiaineistolla. @fi
definition: Relaterer en ressource til en ressource, der anvender teksten som drejebog til en film. @da
definition: Relates a resource to a resource that is a motion picture that is complemented by a textual resource.
definition: Setzt eine Ressource in Beziehung zu einer Filmressource, die durch eine textliche Ressource vervollständigt wird. @de
definition: يربط بين مصدر ومصدر عبارة عن فيلم سينمائي يكمله مصدر نصي. @ar
definition: 将一种资源与作为一种电影并被一种文字资源补充的一种资源关联起来。 @zh-hans

is screenplay for television program
lexical alias: screenplayForTelevisionProgram.en
status: Published
type: Property
label: er manuskript til tv-program @da
label: forgatókönyv televízióműsorhoz: @hu
label: is scenario voor televisieprogramma @nl
label: ist Drehbuch für Fernsehsendung @de
label: käsikirjoitus televisio-ohjelmaan (aineisto) @fi
label: televizyon programı için oluşturulmuş bir senaryodur @tr
label: هو سيناريو لبرنامج تليفزيوني @ar
label: 是电视节目的剧本 @zh-hans
sub property of: is screenplay for
inverse of: has television screenplay
definition: Bir kaynağı, metinsel kaynakla tamamlanan bir televizyon programı olan bir kaynakla ilişkilendirir. @tr
definition: Hozzákapcsol egy forrást egy televízióműsor-forráshoz, amelyet egy szöveges forrás egészít ki. @hu
definition: Liittää aineiston televisio-ohjelma-aineistoon, jota on täydennetty tekstiaineistolla. @fi
definition: Relaterer en ressource til en ressource, der anvender teksten som drejebog til et TV-program. @da
definition: Relates a resource to a resource that is a television program that is complemented by a textual resource.
definition: Setzt eine Ressource in Beziehung zu einer Fernsehsendung, die durch eine textliche Ressource vervollständigt wird. @de
definition: يربط بين مصدر ومصدر عبارة عن برنامج تليفزيوني يكمله مصدر نصي. @ar
definition: 将一种资源与作为一种电视节目并被一种文字资源补充的一种资源关联起来。 @zh-hans

is screenplay for video
lexical alias: screenplayForVideo.en
status: Published
type: Property
label: er bearbejdelse til video @da
label: forgatókönyv videóhoz: @hu
label: is scenario voor video @nl
label: ist Drehbuch für Video @de
label: käsikirjoitus videoon (aineisto) @fi
label: video için senaryodur @tr
label: هو سيناريو لفيديو @ar
label: 是视频的剧本 @zh-hans
sub property of: is screenplay for
inverse of: has video screenplay
definition: Bir kaynağı, metinsel kaynakla tamamlanan bir video olan bir kaynakla ilişkilendirir. @tr
definition: Hozzákapcsol egy forrást videóforráshoz, amelyet egy szöveges forrás egészít ki. @hu
definition: Liittää aineiston videoaineistoon, jota on täydennetty tekstiaineistolla. @fi
definition: Relaterer en ressource til en ressource, der anvender teksten som drejebog til en video. @da
definition: Relates a resource to a resource that is a video that is complemented by a textual resource.
definition: Setzt eine Ressource in Beziehung zu einer Videoressource, die durch ein textliches Werk ergänzt wird. @de
definition: يربط بين مصدر ومصدر عبارة عن فيديو يكمله مصدر نصي. @ar
definition: 将一种资源与作为一种视频并被一种文字资源补充的一种资源关联起来。 @zh-hans

is script for radio program
lexical alias: scriptForRadioProgram.en
status: Published
type: Property
label: er manuskript til radioprogram @da
label: is script voor radioprogramma @nl
label: ist Skript für Hörfunksendung @de
label: käsikirjoitus radio-ohjelmaan (aineisto) @fi
label: radyo programı için komut dosyasıdır @tr
label: szövegkönyv rádióműsorhoz: @hu
label: هو نص لبرنامج إذاعي @ar
label: 是广播节目的剧本 @zh-hans
sub property of: is complemented by
inverse of: has radio script
definition: Bir kaynağı, metinsel kaynakla tamamlanan ve bir radyo programı olan bir kaynakla ilişkilendirir. @tr
definition: Hozzákapcsol egy forrást egy rádióműsor-forráshoz, amelyet egy szöveges forrás egészít ki. @hu
definition: Liittää aineiston radio-ohjelma-aineistoon, jota on täydennetty tekstiaineistolla. @fi
definition: Relaterer en ressource til en ressource, der anvender kildeværkets tekst som manuskript til et radioprogram. @da
definition: Relates a resource to a resource that is a radio program that is complemented by a textual resource.
definition: Setzt eine Ressource in Beziehung zu einer Hörfunksendung, die durch eine textliche Ressource vervollständigt wird. @de
definition: يربط بين مصدر ومصدر عبارة عن برنامج إذاعي يكمله مصدر نصي. @ar
definition: 将一种资源与作为一种广播节目并被一种文字资源补充的一种资源关联起来。 @zh-hans

is addenda to
lexical alias: addendaTo.en
status: Published
type: Property
label: ektir @tr
label: er tillæg til @da
label: is toevoegingen bij @nl
label: ist Ergänzung zu @de
label: lisäykset aineistoon @fi
label: pótlással ellátott: @hu
label: هو إضافة لـ @ar
label: 是……的补遗 @zh-hans
sub property of: is augmentation of
inverse of: has addenda
definition: Bir kaynağı, içeriği ilgili bir kaynağın kısa içeriğiyle tamamlanmış bir kaynakla ilişkilendirir. @tr
definition: Hozzákapcsol egy forrást egy forráshoz, amelynek tartalmát egy kapcsolódó forrás rövid tartalmával teszik teljessé. @hu
definition: Liittää aineiston aineistoon, jonka sisältöä täydennetään suppealla sisällöllä siihen liittyvän aineiston sisällöstä. @fi
definition: Relaterer en ressource til en ressource, hvortil der er tilføjet kortfattet ekstra materiale fra en anden ressource. @da
definition: Relates a resource to a resource whose content is completed with brief content from a related resource.
definition: Setzt eine Ressource in Beziehung zu einer Ressource, deren Inhalt durch kurzen Inhalt einer in Beziehung stehenden Ressource vervollständigt wird. @de
definition: يربط بين مصدر ومصدر يكتمل محتواه بمحتوى موجز من مصدر ذي صلة. @ar
definition: 将一种资源与其内容加上一种相关资源的简要内容后就完整的一种资源关联起来。 @zh-hans

is digital transfer of
lexical alias: digitalTransferOf.en
status: Published
type: Property
label: digitális átvitele a következőnek: @hu
label: dijital aktarımıdır @tr
label: er digital overførsel af @da
label: is digitale kopie van @nl
label: ist digitale Übertragung von @de
label: konvertoitava aineisto @fi
label: هو تحويل رقمي لـ @ar
label: 是……的数字转储 @zh-hans
sub property of: is reproduction of
inverse of: has digital transfer
definition: Bir kaynağı, başka bir dijital formata aktarılan dijital formattaki bir kaynakla ilişkilendirir. @tr
definition: Hozzákapcsol egy forrást egy digitális formátumú forráshoz, amelyet egy másik digitális formátumra vittek át. @hu
definition: Liittää aineiston digitaalisessa muodossa olevaan aineistoon, joka muunnetaan toiseen digitaaliseen muotoon. @fi
definition: Relaterer en ressource til en ressource i et digitalt format, der er overført til et andet digitalt format. @da
definition: Relates a resource to a resource in a digital format that is transferred to another digital format.
definition: Setzt eine Ressource in Beziehung zu einer Ressource in einem digitalen Format, die in ein anderes digitales Format übertragen wird. @de
definition: يربط بين مصدر ومصدر في صيغة رقمية تم تحويله لشكل رقمي آخر. @ar
definition: 将一种资源与被转储为另一种数字格式的一种数字格式的一种资源关联起来。 @zh-hans

is review of
lexical alias: reviewOf.en
status: Published
type: Property
label: arvostelu aineistosta @fi
label: er anmeldelse af @da
label: incelemedir @tr
label: is recensie van @nl
label: ist Rezension von @de
label: szemlézi a következőt: @hu
label: هو مراجعة لـ @ar
label: 是……的评论 @zh-hans
sub property of: is description of
inverse of: is reviewed by
definition: Bir kaynağı, kısa bir değerlendirme için temel olarak kullanılan bir kaynakla ilişkilendirir. @tr
definition: Hozzákapcsol egy forrást egy forráshoz, amelyet egy rövid kiértékelés alapjaként használnak. @hu
definition: Liittää aineiston aineistoon, johon pohjautuu aineiston tiivis arviointi. @fi
definition: Relaterer en ressource til en ressource brugt som basis for en kort evaluering. @da
definition: Relates a resource to a resource used as a basis for a brief evaluation.
definition: Setzt eine Ressource in Beziehung zu einer Ressource, die als Grundlage für eine kurze Untersuchung verwendet wird. @de
definition: يربط بين مصدر ومصدر يُستخدم كأساس لتقييم موجز. @ar
definition: 将一种资源与被用作一种简要评价之基础的一种资源关联起来。 @zh-hans

is summary of
has subproperty: is abstract of
lexical alias: summaryOf.en
status: Published
type: Property
label: er resume af @da
label: is samenvatting van @nl
label: ist Zusammenfassung von @de
label: yhteenveto aineistosta @fi
label: összefoglalása a következőnek: @hu
label: özetidir @tr
label: هو مُلخص لـ @ar
label: 是……的提要 @zh-hans
sub property of: is description of
inverse of: has summary
definition: Bir kaynağı, bir kaynak tarafından kısaca açıklanan bir kaynakla ilişkilendirir. @tr
definition: Hozzákapcsol egy forrást egy forráshoz, amelyet tartalma rövid összegzésének az alapjaként használnak. @hu
definition: Liittää aineiston aineistoon, jonka sisältö esitellään aineistossa lyhyellä kuvauksella. @fi
definition: Relaterer en ressource til en ressource, der er anvendt som grundlag for en kortfattet sammenfatning af dens indhold. @da
definition: Relates a resource to a resource that is briefly described by a resource.
definition: Setzt eine Ressource in Beziehung zu einer Ressource, die als Grundlage für eine kurze Zusammenfassung ihres Inhalts verwendet wird. @de
definition: يربط بين مصدر ومصدر يُستخدم كأساس لخلاصة موجز لمحتواه. @ar
definition: 将一种资源与被一种资源简要描述的一种资源关联起来。 @zh-hans

is catalogue of
lexical alias: catalogueOf.en
status: Published
type: Property
label: er katalog over @da
label: is catalogus van @nl
label: ist Katalog von @de
label: kataloğudur @tr
label: katalógusa a következőnek: @hu
label: kokoelmaluettelo aineistoista @fi
label: هو فهرس لـ @ar
label: 是……的目录 @zh-hans
sub property of: is finding aid of
inverse of: has catalogue
definition: Bir kaynağı, sahip olduğu kaynaklar için bir üstveri setine sahip bir koleksiyon kaynağı olan bir kaynakla ile ilişkilendirir. @tr
definition: Hozzákapcsol egy forrást egy forráshoz, amelyet alapként használnak szisztematikusan elrendezett források teljes felsorolásához. @hu
definition: Liittää aineiston kokoelma-aineistoon, johon sisältyvistä aineistoista on metatietokokonaisuus. @fi
definition: Relaciona un recurs amb un recurs d’un recurs de col·lecció de recursos que té un conjunt de descripció de metadades per als recursos que aplega. @ca
definition: Relaterer en ressource til en ressource, der er anvendt som grundlag for en katalog, dvs. en komplet fortegnelse over eksemplarer, der er arrangeret systematisk. @da
definition: Relates a resource to a resource that is a collection resource that has a metadata description set for the resources that it holds.
definition: Setzt eine Ressource in Beziehung zu einer Ressource, die als Grundlage für eine vollständige Aufzählung von systematisch angeordneten Ressourcen verwendet wird. @de
definition: يربط بين مصدر ومصدر يُستخدم كأساس لحصر كامل للمصادر المرتبة بشكل منهجي. @ar
definition: 将一种资源与作为一种收藏资源并有所收入的各种资源的元数据描述集合的一种资源关联起来。 @zh-hans

is concordance for
lexical alias: concordanceFor.en
status: Published
type: Property
label: dizin eşleştirmesidir @tr
label: er konkordans til @da
label: is concordantie op @nl
label: ist Konkordanz zu @de
label: konkordanciával ellátott: @hu
label: konkordanssihakemisto aineistosta @fi
label: és concordança per @ca
label: هو كشاف نصوص لـ @ar
label: 是……的词语索引 @zh-hans
sub property of: aineistoon liittyvä aineisto
inverse of: has concordance
alternative label: is concordance to
alternative label: és concordança de @ca
definition: Bir kaynağı, seçilmiş veya tüm kelimelerin dizini olan bir metin kaynağı ile ilişkilendirir. @tr
definition: Hozzákapcsol egy forrást egy forráshoz, amelyet alapként használnak egy szöveges forrás összes szavának vagy válogatott szavak mutatójához. @hu
definition: Liittää aineiston tekstiaineistoon, joka koostuu kaikkien tai valikoitujen aineistossa esiintyvien sanojen hakemistosta. @fi
definition: Relaciona un recurs amb un recurs d’un recurs textual que és la base d’un índex de totes les paraules o de paraules seleccionades que apareixen. @ca
definition: Relaterer en ressource til en ressource, der er anvendt som grundlag for en konkordans, dvs. et indeks over alle ordene i hovedressourcen. @da
definition: Relates a resource to a resource of a textual resource that is the basis of an index of all or selected words that occur.
definition: Setzt eine Ressource in Beziehung zu einer Ressource, die als Grundlage für einen Index aller oder ausgewählter Wörter verwendet wird, die in einer textlichen Ressource vorkommen. @de
definition: يربط بين مصدر ومصدر يُستخدم كأساس لكشاف لكل الكلمات أو لكلمات محددة والتي تظهر في مصدر نصي. @ar
definition: 将一种资源与作为一种文字资源并且是所出现的所有或所选词语的索引之基础的一种资源关联起来。 @zh-hans

is critique of
lexical alias: critiqueOf.en
status: Published
type: Property
label: bírálata a következőnek: @hu
label: eleştirisidir @tr
label: er kritik af @da
label: is kritiek van @nl
label: ist Kritik von @de
label: kritiikki aineistosta @fi
label: هو نقد لـ @ar
label: 是……的批评 @zh-hans
sub property of: is description of
inverse of: is critiqued by
definition: Bir kaynağı, kritik bir değerlendirme için temel olarak kullanılan bir kaynakla ilişkilendirir. @tr
definition: Hozzákapcsol egy forrást egy forráshoz, amelyet egy kritikai kiértékelés alapjaként használnak. @hu
definition: Liittää aineiston aineistoon, johon kriittinen arviointi perustuu. @fi
definition: Relaterer en ressource til en ressource brugt som basis for en kritisk evaluering. @da
definition: Relates a resource to a resource used as a basis for a critical evaluation.
definition: Setzt eine Ressource in Beziehung zu einer Ressource, die als Grundlage für eine kritische Untersuchung verwendet wird. @de
definition: يربط بين مصدر ومصدر يُستخدم كأساس لتقييم نقدي. @ar
definition: 将一种资源与被用作一种批评性评价之基础的一种资源关联起来。 @zh-hans

is choreographic adaptation of
lexical alias: choreographicAdaptationOf.en
status: Published
type: Property
label: er koreografisk bearbejdelse af @da
label: is choreografische bewerking van @nl
label: ist choreografische Bearbeitung von @de
label: koreografik uyarlamasıdır @tr
label: koreografikus feldolgozása a következőnek: @hu
label: koreografinen sovitus aineistosta @fi
label: هو اقتباس راقص لـ @ar
label: 是……的编舞改编 @zh-hans
sub property of: has source
inverse of: is adapted as choreography
definition: Bir kaynağı, koreografik kaynak olarak uyarlanmış bir kaynakla ilişkilendirir. @tr
definition: Hozzákapcsol egy forrást egy forráshoz, amelyet koreografikus forrásként adaptáltak. @hu
definition: Liittää aineiston koreografiseksi aineistoksi sovitettuun aineistoon. @fi
definition: Relaterer en ressource til en ressource, der er blevet bearbejdet til en ressource, der består af bevægelse. @da
definition: Relates a resource to a resource that is adapted as a choreographic resource.
definition: Setzt eine Ressource in Beziehung zu einer Ressource, die als choreografische Ressource bearbeitet ist. @de
definition: يربط بين مصدر ومصدر تم تحويره كعمل راقص. @ar
definition: 将一种资源与被改编为一种编舞资源的一种资源关联起来。 @zh-hans

is expanded version of
lexical alias: expandedVersionOf.en
status: Published
type: Property
label: bővített változata a következőnek: @hu
label: er udvidet version af @da
label: genişletilmiş sürümüdür @tr
label: is uitgebreide versie van @nl
label: ist erweiterte Ausgabe von @de
label: laajennettu versio aineistosta @fi
label: هو إصدارة موسعة لـ @ar
label: 是……的扩充版 @zh-hans
sub property of: has source
inverse of: is expanded as
definition: Bir kaynağı, başka bir kaynağın içeriğini genişleten türev bir kaynağın temeli olarak kullanılan bir kaynakla ilişkilendirir. @tr
definition: Hozzákapcsol egy forrást egy forráshoz, amelyet alapként használnak egy másik forrás tartalmát tágító származékos forráshoz. @hu
definition: Liittää aineiston aineistoon, jota on käytetty toisen aineiston sisältöä laajentavan johdannaisaineiston perustana. @fi
definition: Relaterer en ressource til en ressource, der er anvendt som grundlag for en afledt ressource, der uddyber en oprindelig ressources indhold. @da
definition: Relates a resource to a resource used as a basis for a derivative resource that enlarges upon the content of another resource.
definition: Setzt eine Ressource in Beziehung zu einer Ressource, die als Grundlage für eine abgeleitete Ressource verwendet wird, die den Inhalt einer anderen Ressource näher erläutert. @de
definition: يربط بين مصدر ومصدر يُستخدم كأساس لمصدر مشتق يتوسع في محتوى مصدر آخَر. @ar
definition: 将一种资源与被用作在另一种资源之内容基础上扩充的一种衍生资源的基础的一种资源关联起来。 @zh-hans

is remake of
lexical alias: remakeOf.en
status: Published
type: Property
label: er genindspilning af @da
label: is remake van @nl
label: ist Remake von @de
label: uusintaproduktio aineistosta @fi
label: yeniden yapımıdır @tr
label: újraalkotása a következőnek: @hu
label: هو إعادة إنتاج لـ @ar
label: 是……的重新制作 @zh-hans
sub property of: has source
inverse of: is remade as
definition: Bir kaynağı, yeni bir sinema filmi, radyo programı, televizyon programı veya video için temel olarak kullanılan bir kaynakla ilişkilendirir. @tr
definition: Hozzákapcsol egy forrást egy forráshoz, amelyet alapként használnak egy új mozgóképhez, rádióműsorhoz, televízióműsorhoz vagy videóhoz. @hu
definition: Liittää aineiston aineistoon, jota on käytetty uuden elokuvan, televisio-ohjelman, radio-ohjelman tai videon perustana. @fi
definition: Relaterer en ressource til en ressource, der er anvendt som grundlag for en ny film, et nyt radioprogram, et nyt tv-program eller en ny video. @da
definition: Relates a resource to a resource used as a basis for a new motion picture, radio program, television program, or video.
definition: Setzt eine Ressource in Beziehung zu einer Ressource, die als Grundlage für einen neuen Film, eine neue Hörfunksendung, eine neue Fernsehsendung oder ein neues Video verwendet wird. @de
definition: يربط بين مصدر ومصدر يُستخدم كأساس لفيلم سينمائي جديد، أو برنامج إذاعي، أو برنامج تليفزيوني، أو فيديو. @ar
definition: 将一种资源与被用作一种新的电影、广播节目、电视节目或视频的基础的一种资源关联起来。 @zh-hans

is paraphrase of
lexical alias: paraphraseOf.en
status: Published
type: Property
label: er parafrase over @da
label: is parafrase van @nl
label: ist Paraphrase von @de
label: parafraasi (aineisto) @fi
label: parafrázisa a következőnek: @hu
label: yeniden yorumlanmasıdır @tr
label: هو إعادة صياغة لـ @ar
label: 是……的演绎 @zh-hans
sub property of: has source
inverse of: is paraphrased as
definition: Bir kaynağı, başka bir kaynağın içeriğinin farklı bir biçimde yeniden ifade edilmesi için temel olarak kullanılan bir kaynakla ilişkilendirir. @tr
definition: Hozzákapcsol egy forrást egy forráshoz, amelyet alapként használnak egy parafrázishoz, azaz egy forrásmű tartalmának újrafogalmazásához eltérő formában. @hu
definition: Liittää aineiston aineistoon, joka toisintaa toisen aineiston sisällön eri muodossa. @fi
definition: Relaterer en ressource til en ressource, der er anvendt som grundlag for en parafrase, dvs. en gentagelse af en oprindelig ressources indhold i en anden form. @da
definition: Relates a resource to a resource used as a basis for a restating of the content of another resource in a different form.
definition: Setzt eine Ressource in Beziehung zu einer Ressource, die als Grundlage für eine Neuformulierung des Inhalts einer anderen Ressource in einer anderen Form verwendet wird. @de
definition: يربط بين مصدر ومصدر يُستخدم كأساس لإعادة صياغة محتوى مصدر آخر في شكل مختلف. @ar
definition: 将一种资源与被用来作为以不同形式重述另一种资源之内容的基础的一种资源关联起来。 @zh-hans

is reproduction of
has subproperty: is reprint of
has subproperty: is digital transfer of
has subproperty: is facsimile of
has subproperty: is electronic reproduction of
lexical alias: reproductionOf.en
status: Published
type: Property
label: er reproduktion af @da
label: is reproductie van @nl
label: ist Reproduktion von @de
label: jäljenne aineistosta @fi
label: másolata a következőnek: @hu
label: yeniden yapımıdır @tr
label: هو إعادة إنتاج لـ @ar
label: 是……的复制品 @zh-hans
sub property of: has equivalent
inverse of: is reproduced as
definition: Bir kaynağı, yeniden üretim için temel olarak kullanılan bir kaynakla ilişkilendirir. @tr
definition: Hozzákapcsol egy forrást egy forráshoz, amelyet egy másolat alapjaként használnak. @hu
definition: Liittää aineiston jäljenteen perustana käytettyyn aineistoon. @fi
definition: Relaterer en ressource til en ressource, der er anvendt som grundlag for en reproduktion. @da
definition: Relates a resource to a resource that is used as a basis for a reproduction.
definition: Setzt eine Ressource in Beziehung zu einer Ressource, die als Grundlage für eine Reproduktion verwendet wird. @de
definition: يربط بين مصدر ومصدر يُستخدم كأساس لإعادة الإنتاج. @ar
definition: 将一种资源与被用作一种复制品之基础的一种资源关联起来。 @zh-hans

is commentary on
lexical alias: commentaryOn.en
status: Published
type: Property
label: er kommentar til @da
label: hakkında yorumdur @tr
label: is commentaar op @nl
label: ist Kommentar zu @de
label: kommentaari aineistosta @fi
label: kommentár a következőhöz: @hu
label: هو تعليق على @ar
label: 是关于……的评注 @zh-hans
sub property of: is description of
inverse of: is commentary in
definition: Bir kaynağı, bir dizi açıklayıcı veya eleştiri notlar seti için temel olarak kullanılan bir kaynakla ilişkilendirir. @tr
definition: Hozzákapcsol egy forrást egy forráshoz, amelyet magyarázó vagy kritikai jegyzetek halmazának alapjaként használnak. @hu
definition: Liittää aineiston selittävien tai kritisoivien huomautusten perustana käytettyyn aineistoon. @fi
definition: Relaterer en ressource til en ressource, der bruges som basis for et sæt af forklarende eller kritiske kommentarer. @da
definition: Relates a resource to a resource used as a basis for a set of explanatory or critical notes.
definition: Setzt eine Ressource in Beziehung zu einer Ressource, die als Grundlage für eine Reihe von erläuternden oder kritischen Anmerkungen verwendet wird. @de
definition: يربط بين مصدر ومصدر يُستخدم كأساس لمجموعة من الملاحظات التفسيرية أو النقدية. @ar
definition: 将一种资源与被用作一个解释性或评论性附注之集合的基础的一种资源关联起来。 @zh-hans

is preservation facsimile of
lexical alias: preservationFacsimileOf.en
status: Published
type: Property
label: aineiston säilytyskopio @fi
label: er bevaringsfaksimile af @da
label: is conservatiefacsimile van @nl
label: ist Bestandserhaltungsfaksimile von @de
label: koruma kopyasıdır @tr
label: megőrzési hasonmása a következőnek: @hu
label: هو نسخة طبق الأصل محفوظة لـ @ar
label: 是……的保存摹真品 @zh-hans
sub property of: is facsimile of
inverse of: has preservation facsimile
definition: Bir kaynağı, asitsiz kağıt veya arşiv kağıdı gibi koruma kalitesi medyasında tam çoğaltma için temel olarak kullanılan bir kaynakla ilişkilendirir. @tr
definition: Hozzákapcsol egy forrást egy olyan forráshoz, amelyet pontos másolat alapjaként használnak egy olyan megőrzés-minőségű közegen, mint például a savmentes tartós vagy archiváló papír. @hu
definition: Liittää aineiston täsmällisen jäljennöksen perustana olevaan aineistoon. Jäljennöksen valmistuksessa on käytetty arkistokelpoista materiaalia, esim. arkistopaperia. @fi
definition: Relaterer en ressource til en ressource, der er anvendt som grundlag for en nøjagtig reproduktion på et medium af bevaringskvalitet, såsom syrefrit permanent- eller arkivpapir. @da
definition: Relates a resource to a resource that is used as a basis for an exact reproduction on preservation-quality media, such as acid-free permanent or archival paper.
definition: Setzt eine Ressource in Beziehung zu einer Ressource, die als Grundlage für eine exakte Reproduktion auf bestandserhaltenden Medien, wie zum Beispiel säurefreiem Papier oder Archivpapier, verwendet wird. @de
definition: يربط بين مصدر ومصدر يُستخدم كأساس لإعادة إنتاج طبق الأصل على وسيط حفظ عالي الجودة، مثل الأوراق الدائمة الخالية من الأحماض أو أوراق المحفوظات الأرشيفية. @ar
definition: 将一种资源与被用作在诸如脱酸的永久用纸或档案纸等具有保存品质的媒介上的精确复制品之基础的一种资源关联起来。 @zh-hans

has facsimile part
lexical alias: facsimilePart.en
status: Published
type: Property
label: aineiston näköispainososa @fi
label: er faksimile der indeholder @da
label: hasonmás része a következő: @hu
label: hat enthaltenes Faksimile von @de
label: heeft facsimile deel @nl
label: tıpkıbasım parçası ile ilişkilidir @tr
label: له جزء طبق الأصل @ar
label: 有摹真品部分 @zh-hans
sub property of: has part resource
inverse of: is facsimile part of
definition: Bir kaynağı, daha büyük bir varlığın ayrık bileşeni olan tam bir yeniden üretim için temel olarak kullanılan bir kaynakla ilişkilendirir. @tr
definition: Hozzákapcsol egy forrást egy forráshoz, amelyet alapként használnak egy nagyobb entitás elkülöníthető alkotóelemének pontos másolatához. @hu
definition: Liittää aineiston täsmällisen jäljennöksen perustana olevaan aineistoon, joka on laajemman kokonaisuuden erillinen osa. @fi
definition: Relaterer en ressource til en ressource, der er anvendt som grundlag for en nøjagtig reproduktion, som udgør en separat del af en større entitet. @da
definition: Relates a resource to a resource used as a basis for an exact reproduction that is a discrete component of a larger entity.
definition: Setzt eine Ressource in Beziehung zu einer Ressource, die als Grundlage für eine exakte Reproduktion verwendet wird, die ein eigenständiger Bestandteil einer größeren Entität ist. @de
definition: يربط بين مصدر ومصدر يُستخدم كأساس لإعادة إنتاج طبق الأصل تكون مكونًا منفصلاً لكيان أكبر. @ar
definition: 将一种资源与被用作一种精确复制品之基础并是一种更大实体的独立组成部分的一种资源关联起来。 @zh-hans

is facsimile of
has subproperty: is preservation facsimile of
lexical alias: facsimileOf.en
status: Published
type: Property
label: aineiston näköispainos @fi
label: er faksimile af @da
label: hasonmása a következőnek: @hu
label: is facsimile van @nl
label: ist Faksimile @de
label: tıpkıbasımıdır @tr
label: هو نسخة طبق الأصل من @ar
label: 是……的摹真品 @zh-hans
sub property of: is reproduction of
inverse of: has facsimile
definition: Bir kaynağı, tam bir yeniden üretim için temel olarak kullanılan bir kaynakla ilişkilendirir. @tr
definition: Hozzákapcsol egy forrást egy forráshoz, amelyet egy pontos másolat alapjaként használnak. @hu
definition: Liittää aineiston täsmällisen jäljennöksen perustana olevaan aineistoon. @fi
definition: Relaterer en ressource til en ressource, der er anvendt som grundlag for en nøjagtig reproduktion. @da
definition: Relates a resource to a resource that is used as a basis for an exact reproduction.
definition: Setzt eine Ressource in Beziehung zu einer Ressource, die als Grundlage für eine exakte Reproduktion verwendet wird. @de
definition: يربط بين مصدر ومصدر يُستخدم كأساس لعملية الإستنساخ الدقيق. @ar
definition: 将一种资源与被用作一种精确复制品之基础的一种资源关联起来。 @zh-hans

is index for
lexical alias: indexFor.en
status: Published
type: Property
label: dizinidir @tr
label: er indeks til @da
label: hakemisto aineistosta @fi
label: is index bij @nl
label: ist Index zu @de
label: tárgymutatója a következőnek: @hu
label: és índex per @ca
label: هو كشاف لـ @ar
label: 是……的索引 @zh-hans
sub property of: aineistoon liittyvä aineisto
inverse of: has index
alternative label: hakemistoaineisto @fi
alternative label: is index to
alternative label: és index de @ca
definition: Bir kaynağı, içerik dizininin temeli olan bir metin kaynağı ile ilişkilendirir. @tr
definition: Hozzákapcsol egy forrást egy forráshoz, amelyet alapként használnak egy olyan forráshoz, ami a tartalmára vonatkozó szisztematikus és betűrendes kalauz. @hu
definition: Liittää aineiston sisällön hakemiston perustana olevaan tekstiaineistoon. @fi
definition: Relaciona un recurs amb un recurs d’un recurs textual que és la base d’un índex del contingut. @ca
definition: Relaterer en ressource til en ressource, der er anvendt som grundlag for et indeks, dvs. en systematisk, alfabetiseret oversigt over indholdet i hovedressourcen, normalt kædet sammen med sidenumre eller andre henvisningskoder. @da
definition: Relates a resource to a resource of a textual resource that is the basis of an index of the content.
definition: Setzt eine Ressource in Beziehung zu einer Ressource, die als Grundlage für eine Ressource verwendet wird, bei der es sich um eine systematische, alphabetische Orientierungshilfe zu deren Inhalt handelt. @de
definition: يربط بين مصدر ومصدر يُستخدم كأساس لمصدر يُمثل دليلًا منهجيًا، هجائيًا لمحتوياته @ar
definition: 将一种资源与作为一种文字资源并作为其内容的索引的基础的一种资源关联起来。 @zh-hans

is revision of
lexical alias: revisionOf.en
status: Published
type: Property
label: aineiston uudistettu versio @fi
label: er revision af @da
label: gözden geçirilmesidir. @tr
label: is herziening van @nl
label: ist Überarbeitung von @de
label: átdolgozása a következőnek: @hu
label: هو مُراجعة لـ @ar
label: 是……的修订 @zh-hans
sub property of: has source
inverse of: is revised as
definition: Bir kaynağı, yeni bir kaynak oluşturmak için güncellenen, düzeltilen veya genişletilen bir kaynakla ilişkilendirir. @tr
definition: Hozzákapcsol egy forrást egy forráshoz, amelyet egy frissített, korrigált vagy kiterjesztett verzió alapjaként használnak. @hu
definition: Liittää aineiston aineistoon, jota on päivitetty, korjattu tai laajennettu ja näin luotu uusi aineisto. @fi
definition: Relaciona un recurs amb un recurs que s’actualitza, es corregeix o s’amplia per crear un recurs nou. @ca
definition: Relaterer en ressource til en ressource, der er anvendt som grundlag for en opdateret, korrigeret eller udvidet version. @da
definition: Relates a resource to a resource that is updated, corrected, or expanded to create a new resource.
definition: Setzt eine Ressource in Beziehung zu einer Ressource, die als Grundlage für eine aktualisierte, korrigierte oder erweiterte Fassung verwendet wird. @de
definition: يربط بين مصدر ومصدر يُستخدم كأساس لنسخة مُحدثة، مُصححة، أو مُوسعة. @ar
definition: 将一种资源与被更新、更正或扩充以创建一种新的资源的一种资源关联起来。 @zh-hans

is libretto based on
lexical alias: librettoBasedOn.en
status: Published
type: Property
label: dayalı librettodur @tr
label: er libretto baseret på @da
label: is libretto gebaseerd op @nl
label: ist Libretto basierend auf @de
label: librettoaineisto @fi
label: librettó a következő alapján: @hu
label: هو نص أوبرالي معتمد على @ar
label: 是基于……的台本 @zh-hans
sub property of: has source
inverse of: is adapted as libretto
definition: Bir kaynağı, opera, bale, müzikal sahne için başka bir kaynak veya oratoryo gibi müzikal veya koreografik bir kaynak için metin sağlayan bir kaynakla ilişkilendirir. @tr
definition: Hozzákapcsol egy forrást egy olyan zenei vagy koreografikus forráshoz, mint egy opera, vagy egyéb zenés színpadi forrás, vagy egy oratórium. @hu
definition: Liittää aineiston musiikkiaineistoon tai koreografiseen aineistoon, kuten oopperaan, balettiin tai muuhun musiikilliseen näyttämöteokseen tai oratorioon. @fi
definition: Relaciona un recurs amb un recurs que proporciona text per a un recurs musical o coreogràfic com ara una òpera, un ballet o qualsevol altre recurs escènic musical o un oratori. @ca
definition: Relaterer en ressouce til en ressource, der er blevet bearbejdet til tekst til en opera eller en anden ressource af et musikalsk sceneværk, eller til et oratorium. @da
definition: Relates a resource to a resource that provides text for a musical or choreographic resource such as an opera, a ballet, or other resource for the musical stage, or an oratorio.
definition: Setzt eine Ressource in Beziehung zu einer Ressource, die Text für eine Musikressource oder choreografischen Ressource, wie zum Beispiel einer Oper, einem Ballett oder einer anderen Musikressource für die Bühne, oder zu einem Oratorium enthält. @de
definition: يربط بين مصدر ومصدر موسيقي، أو راقص مثل أوبرا، أو باليه، أو أي مصدر آخر للمسرح الموسيقي، أو موسيقى دينية. @ar
definition: 将一种资源与为诸如歌剧、芭蕾、或其他舞台音乐资源或清唱剧提供文本的一种资源关联起来。 @zh-hans

has source
has subproperty: is variations based on
has subproperty: is abridgement of
has subproperty: is digest of
has subproperty: is adaptation of
has subproperty: is arrangement of
has subproperty: is free translation of
has subproperty: is translation of
has subproperty: is musical setting of
has subproperty: is choreographic adaptation of
has subproperty: is expanded version of
has subproperty: is remake of
has subproperty: is paraphrase of
has subproperty: is revision of
has subproperty: is libretto based on
has subproperty: is abstracts for
has subproperty: is indexing for (Deprecated)
has subproperty: is imitation of
has subproperty: is oratorio adaptation of
has subproperty: is inspired by
lexical alias: hasSource.en
status: Published
type: Property
label: a következőn alapul: @hu
label: er baseret på @da
label: is gebaseerd op @nl
label: ist basiert auf @de
label: kaynak ile ilişkilidir @tr
label: perustana aineistolle @fi
label: té font @ca
label: هو معتمد على @ar
label: 有源 @zh-hans
sub property of: has derivative resource relationship with (Deprecated)
inverse of: has derivative
definition: Bir kaynağı, yeni bir kaynak oluşturmak için değiştirilen bir kaynakla ilişkilendirir. @tr
definition: Hozzákapcsol egy forrást egy forráshoz, amelyet egy származékos forrás alapjaként használnak. @hu
definition: Liittää aineiston aineistoon, jota on muokattu uuden aineiston luomiseksi. @fi
definition: Relaciona un recurs amb un recurs que es modifica per crear un nou recurs @ca
definition: Relaterer en ressource til en ressource, der er anvendt som kilde til en afledt ressource. @da
definition: Relates a resource to a resource that is modified to create a new resource
definition: Setzt eine Ressource in Beziehung zu einer Ressource, die als Ursprung einer abgeleiteten Ressource verwendet wird. @de
definition: يربط بين مصدر ومصدر يُستخدم كمصدر لمصدر مشتق. @ar
definition: 将一种资源与被修改以创建一种新资源的一种资源关联起来。 @zh-hans

is continued by
lexical alias: continuedBy.en
status: Published
type: Property
label: er fortsat af @da
label: folytatja a következő: @hu
label: ile devam ettirilmiştir @tr
label: is voortgezet door @nl
label: ist fortgesetzt durch @de
label: jatkettu aineisto @fi
label: هو مستمر عن طريق @ar
label: 被……继承 @zh-hans
sub property of: is succeeded by
inverse of: is continuation of
definition: Bir kaynağı, tamamlanmış başka bir artzamanlı kaynağın içeriğini sürdüren art zamanlı bir kaynak olan bir kaynakla ilişkilendirir. @tr
definition: Hozzákapcsol egy forrást egy diakronikus forráshoz, amely egy másik, befejezett diakronikus forrás tartalmát folytatja. @hu
definition: Liittää aineiston diakroniseen aineistoon, joka jatkaa toisen, valmiin diakronisen aineiston sisältöä. @fi
definition: Relaterer en ressource til en ressource, hvis indhold fortsætter en tidligere ressource med en ny titel. @da
definition: Relates a resource to a resource that is a diachronic resource that continues the content of another diachronic resource that is completed.
definition: Setzt eine Ressource in Beziehung zu einer diachronen Ressource, die den Inhalt einer anderen abgeschlossenen diachronen Ressource fortführt. @de
definition: يربط بين مصدر ومصدر ممتد زمنيًا ومستمر في محتوى مصدر آخر ممتد زمنيًا ومكتمل. @ar
definition: 将一种资源与作为一种历时资源并继承另一种已经完成了的历时资源的内容的一种资源关联起来。 @zh-hans
scope note: Bu öğe, genel olarak ardışık bir kaynak için geçerlidir. @tr
scope note: Denne relation anvendes generelt for periodika. @da
scope note: Ez az elem általában a folyamatos forrásokra vonatkozik. @hu
scope note: Im Allgemeinen trifft dieses Element auf eine sukzessive Ressource zu. @de
scope note: This element applies in general to a successive resource.
scope note: Tämä elementti soveltuu yleensä peräkkäisesti ilmestyvään aineistoon. @fi
scope note: ينطبق هذا العنصر بشكل عام على مصدر متتالي. @ar
scope note: 该元素一般适用于一种相继资源。 @zh-hans

is augmentation of
has subproperty: is cadenza composed for
has subproperty: is errata to
has subproperty: is guide to
has subproperty: is appendix to
has subproperty: is illustrations for
has subproperty: is supplement to
has subproperty: is addenda to
lexical alias: augmentationOf.en
status: Published
type: Property
label: arttırılmasıdır @tr
label: bővítése a következőnek: @hu
label: er berigelse af @da
label: is aanvulling van @nl
label: ist Erweiterung von @de
label: laajennus aineistoon @fi
label: هو إضافة لـ @ar
label: 是……的附增 @zh-hans
sub property of: has accompanying resource relationship with (Deprecated)
inverse of: is augmented by
definition: Bir kaynağı, içeriği ilgili bir kaynak tarafından eklenen bir kaynakla ilişkilendirir. @tr
definition: Hozzákapcsol egy forrást egy forráshoz, amelynek tartalmát egy kapcsolódó forrás adja hozzá. @hu
definition: Liittää aineiston aineistoon, jonka sisältöä siihen liittyvä aineisto täydentää. @fi
definition: Relaterer en ressource til en ressource, hvis indhold udbygges af en anden ressource. @da
definition: Relates a resource to a resource whose content is added to by a related resource.
definition: Setzt eine Ressource in Beziehung zu einer Ressource, deren Inhalt durch ein in Beziehung stehendes Werk ergänzt wird. @de
definition: يربط بين مصدر ومصدر تم إضافة محتواه بواسطة مصدر ذي صلة. @ar
definition: 将一种资源与其内容被一种相关资源增加的一种资源关联起来。 @zh-hans

is abstracts for
lexical alias: abstractsFor.en
status: Published
type: Property
label: abstraktin perustana oleva aineisto @fi
label: er sammenfatninger af @da
label: is abstracts voor @nl
label: ist Abstracts für @de
label: referátum a következőhöz: @hu
label: özetler @tr
label: هو مخلص لـ @ar
label: 是……的摘要 @zh-hans
sub property of: has source
inverse of: is abstracted in
definition: Bir kaynağı başka bir kaynak tarafından soyutlanmış bir kaynakla ilişkilendirir. @tr
definition: Hozzákapcsol egy forrást egy forráshoz, amelyet egy másik forrás absztrahált. @hu
definition: Liittää aineiston aineistoon, jonka toinen aineisto tiivistää. @fi
definition: Relaterer en ressource til en ressource, hvis indhold er blevet sammenfattet af en abstract- og indekseringsservice. @da
definition: Relates a resource to a resource that is abstracted by another resource.
definition: Setzt eine Ressource in Beziehung zu einer Ressource, die durch eine andere Ressource zusammengefasst wird. @de
definition: يربط مصدر بمصدر تم تلخيصه من مصدر آخر @ar
definition: 将一种资源与被另一种资源编制摘要的一种资源关联起来。 @zh-hans

is indexing for (Deprecated)
lexical alias: indexingFor.en
status: Deprecated
type: Property
label: er indeksering for @da
label: indeksointi @fi
label: index a következőhöz: @hu
label: is indexering voor @nl
label: ist Indexierung für @de
label: هو تكشيف لـ @ar
sub property of: has source
inverse of: is indexed in (Deprecated)
definition: Hozzákapcsol egy forrást egy forráshoz, amelynek tartalmait egy kapcsolódó forrás indexeli. @hu
definition: Liittää aineiston aineistoon, jonka sisältö on indeksoitu liittyvässä aineistossa. @fi
definition: Relaterer en ressource til en ressource, hvis indhold er blevet indekseret af en abstract- og indekseringsservice. @da
definition: Relates a resource to a resource whose contents have been indexed by a related resource. (Deprecated)
definition: Setzt eine Ressource in Beziehung zu einer Ressource, deren Inhalte durch eine in Beziehung stehende Ressource indexiert wurden. @de
definition: يربط بين مصدر ومصدر تم تكشيف محتوياته بواسطة مصدر ذي صلة. @ar

is prequel to (Deprecated)
lexical alias: prequelTo.en
status: Deprecated
type: Property
label: er forhistorie til @da
sub property of: is succeeded by
inverse of: has prequel
definition: Relaterer en ressource til en ressource, hvis fortælling udvides bagud i tid af en senere ressource. @da
definition: Relates a resource to a resource whose narrative is extended backwards in time by the later resource.. (Deprecated)

is imitation of
has subproperty: is parody of
lexical alias: imitationOf.en
status: Published
type: Property
label: er imitation af @da
label: is imitatie van @nl
label: ist Imitation von @de
label: jäljitelmän perustana oleva aineisto @fi
label: taklididir @tr
label: utánzása a következőnek: @hu
label: هو تقليد لـ @ar
label: 是……的模仿 @zh-hans
sub property of: has source
inverse of: is imitated as
definition: Bir kaynağı, biçimi veya içeriği türev bir kaynağa kopyalanan bir kaynakla ilişkilendirir. @tr
definition: Hozzákapcsol egy forrást egy forráshoz, amelynek stílusát vagy tartalmát egy származékos forrásban másolják. @hu
definition: Liittää aineiston aineistoon, jonka tyyliä tai sisältöä johdettu aineisto jäljittelee. @fi
definition: Relaterer en ressource til en ressource, hvis stil eller indhold er kopieret i en afledt ressource. @da
definition: Relates a resource to a resource whose style or content is copied in a derivative resource.
definition: Setzt eine Ressource in Beziehung zu einer Ressource, deren Stil oder Inhalt in einer abgeleiteten Ressource kopiert wird. @de
definition: يربط بين مصدر ومصدر يتم نسخ أسلوبه أو محتواه في مصدر مشتق. @ar
definition: 将一种资源与其风格和内容被复制于一种衍生资源的一种资源关联起来。 @zh-hans

is parody of
lexical alias: parodyOf.en
status: Published
type: Property
label: er parodi på @da
label: is parodie op @nl
label: ist Parodie von @de
label: parodian perustana oleva aineisto @fi
label: parodisidir @tr
label: paródiája a következőnek: @hu
label: هو محاكاة ساخرة لـ @ar
label: 是……的戏仿 @zh-hans
sub property of: is imitation of
inverse of: is parodied as
definition: Bir kaynağı, biçimi veya içeriği komik etki için taklit edilen bir kaynakla ilişkilendirir. @tr
definition: Egy forrást hozzákapcsol egy forráshoz, amelynek stílusát vagy tartalmát utánozzák a komikus hatás kedvéért. @hu
definition: Liittää aineiston aineistoon, jonka tyyliä tai sisältöä jäljitellään humoristisesti. @fi
definition: Relaterer en ressource til en ressource, hvis stil eller indhold efterlignes for at opnå en komisk effekt. @da
definition: Relates a resource to a resource whose style or content is imitated for comic effect.
definition: Setzt eine Ressource in Beziehung zu einer Ressource, deren Stil oder Inhalt für eine lustige Wirkung nachgeahmt wird. @de
definition: يربط بين مصدر ومصدر يتم تقليد أسلوبه أو محتواه ليُحدث تأثيرًا هزليًا. @ar
definition: 将一种资源与其风格和内容被模仿而达到戏剧效果的一种资源关联起来。 @zh-hans

aineistoon liittyvä aineisto
has subproperty: has concordance
has subproperty: has index
has subproperty: is concordance for
has subproperty: is index for
has subproperty: has binding of resource
has subproperty: is binding of resource of
has subproperty: has transformation
has subproperty: is transformation of
has subproperty: has holding
has subproperty: is holding of
has subproperty: is on resource with
lexical alias: relatedResourceOfResource.en
status: Published
type: Property
label: hat mit Ressource in Beziehung stehende Ressource @de
label: heeft gerelateerde resource van resource @nl
label: kapcsolódó forrása a következő forrásnak: @hu
label: له مصدر مرتبط بمصدر @ar
sub property of: has related entity of resource
alternative label: In Beziehung stehende Ressource @de
alternative label: kapcsolódó forrás: @hu
alternative label: liittyvä aineisto @fi
alternative label: recurs relacionat @ca
alternative label: related resource
alternative label: İlişkili kaynak @tr
alternative label: مصدر ذو صلة @ar
alternative label: 相关资源 @zh-hans
definition: Bir kaynağı, bir kaynakla ilişkilendirilmiş bir kaynakla ilişkilendirir. @tr
definition: Hozzákapcsol egy forrást egy forráshoz, amely egy forráshoz kapcsolódik. @hu
definition: Liittää aineiston siihen yhdistettyyn aineistoon @fi
definition: Relaciona un recurs amb un recurs que s’associa amb un recurs @ca
definition: Relates a resource to a resource that is associated with a resource.
definition: Setzt eine Ressource in Beziehung zu einer Ressource, die mit einer Ressource in Verbindung steht. @de
definition: يربط بين مصدر ومصدر مرتبط بمصدر. @ar
definition: 将一种资源与和一种资源有关的一种资源关联起来。 @zh-hans

has encoding format
lexical alias: encodingFormat.en
status: Published
type: Property
label: har kodningsformat @da
label: hat Kodierungsformat @de
label: heeft coderingsformaat @nl
label: kodlama formatı ile ilişkilidir @tr
label: koodausmuoto @fi
label: kódolási formátuma a következő: @hu
label: له نظام ترميز @ar
label: 有编码格式 @zh-hans
sub property of: has digital file characteristic
definition: Bir kaynağı, bir kaynağın dijital içeriğini kodlamak için kullanılan bir şema veya standartla ilişkilendirir. @tr
definition: Hozzákapcsol egy forrást egy sémához vagy szabványhoz, amelyet egy forrás digitális tartalmának a kódolására használnak. @hu
definition: Liittää aineiston sen digitaalisen sisällön koodaamiseen käytettyyn skeemaan rai standardiin. @fi
definition: Relaterer en ressource til et skema, standard etc., der anvendes til kodning af en ressources digitale indhold. @da
definition: Relates a resource to a schema or standard that is used to encode the digital content of a resource.
definition: Setzt eine Ressource in Beziehung zu einem Schema, einem Standard und so weiter, das/der zum Kodieren des digitalen Inhalts einer Ressource verwendet wird. @de
definition: يربط بين مصدر وخطة، أو معيار مستخدم في تشفير المحتوى الرقمي لمصدر. @ar
definition: 将一种资源与用于对一种资源的数字内容进行编码的一种方案或标准关联起来。 @zh-hans

has numeric designation of musical resource
has subproperty: has thematic index number
has subproperty: has serial number
has subproperty: has opus number
lexical alias: numericDesignationOfMusicalResource.en
status: Published
type: Property
label: har numerisk betegnelse for musikressource @da
label: hat numerische Bezeichnung einer Musikressource @de
label: heeft numerieke aanduiding van muziek-resource @nl
label: musiikkiaineiston numeromäärite @fi
label: müzikal kaynağın sayısal tanımlayıcısı ile ilişkilidir @tr
label: zenei forrás számjelzése a következő: @hu
label: لديه تسمية رقمية لمصدر موسيقي @ar
label: 有音乐资源的数字标识 @zh-hans
inverse of: is numeric designation of musical resource of
definition: Bir kaynağı, bir besteci, yayıncı veya müzikolog tarafından bir müzik kaynağına atanan seri numarası, beste numarası veya tematik dizin numarası ile ilişkilendirir. @tr
definition: Hozzákapcsol egy forrást egy sorozati számhoz, opusszámhoz vagy tematikus indexszámhoz, amelyet egy zeneszerző, egy kiadó vagy egy zenetudós rendel hozzá egy zenei forráshoz. @hu
definition: Liittää aineiston säveltäjän, julkaisijan tai musiikintutkijan antamaan järjestysnumeroon, opusnumeroon tai temaattisen teosluettelon numeroon. @fi
definition: Obra que és una obra musical que té un identificador d’obra que és un número d’ordre, un número d’opus o un número d’índex temàtic assignat a una obra musical per un compositor, un editor o un musicòleg. @ca
definition: Relaterer en ressource til et serienummer, opusnummer eller værkfortegnelsesnummer tildelt en musikressource af en komponist, en udgiver eller en musikforsker. @da
definition: Relates a resource to a nomen that is a serial number, opus number, or thematic index number assigned to a musical resource by a composer, publisher, or a musicologist.
definition: Setzt ein Werk in Beziehung zu einer laufenden Nummer, einer Opus-Nummer oder einer Werkverzeichnisnummer, die einem Musikwerk durch eine Komponistin/einen Komponisten, einen Verlag oder eine Musikwissenschaftlerin/einen Musikwissenschaftler zugewiesen wird. @de
definition: يربط بين مصدر ورقم مسلسل، رقم قطعة موسيقية، رقم كشاف موضوعى مخصص لمصدر موسيقى من جانب ملحن، ناشر، أو عالم موسيقى. @ar
definition: 将一种资源与作为作曲者、出版者或者音乐学家给一种音乐资源分配的序列号、作品号或主题索引号的一个命名关联起来。 @zh-hans
scope note: A numeric designation of a musical resource includes a caption such as e.g., no., op., BWV, and it may include a numeral, a letter, a word, any other character, or the combination of these.
scope note: Bir müzik kaynağının sayısal gösterimi, örn., no., op., BWV gibi bir başlık içerir ve bir rakam, bir harf, bir kelime, herhangi bir başka karakter veya bunların kombinasyonunu içerebilir. @tr
scope note: Darunter fallen einleitende Begriffe (zum Beispiel Nr., op., BWV) sowie gegebenenfalls Ziffern, Buchstaben, Wörter, beliebige andere Zeichen oder eine Kombination davon. @de
scope note: Egy zenei forrás számjelzése magában foglal feliratot is, mint például no., op., BWV, és állhat számokból, betűkből, szavakból és bármely egyéb karakterből, vagy ezek kombinációjából. @hu
scope note: En numerisk betegnelse for en musikressource inkluderer en indledning som fx no., op., BWV og den kan inkludere et nummer, et bogstav, et ord, eller et hvilket som helst andet tegn eller en kombination af disse. @da
scope note: Musiikkiaineiston numeromäärite sisältää selosteen, esimerkiksi no., op. tai BWV, ja se voi sisältää numeron, kirjaimen, sanan, minkä tahansa muun merkin tai näiden yhdistelmän. @fi
scope note: تتضمن التسمية الرقمية لمصدر موسيقي تعليقًا (على سبيل المثال، رقم، مرجع سابق، BWV) وقد يتضمن رقمًا، حرفًا، كلمة، أو أي رمزًا آخر أو مزيجًا من هذه العناصر. @ar
scope note: 音乐资源的数字标识包括诸如no.、op.、BWV之类的说明文字、并可以包括数字、字母、单词、任何其他字符、或者它们的组合。 @zh-hans

has subseries
lexical alias: subseries.en
status: Published
type: Property
label: aineiston alasarja @fi
label: alsorozata a következő: @hu
label: alt seri ile ilişkilidir @tr
label: er underserie @da
label: hat Unterreihe @de
label: heeft onderserie @nl
label: له سلسلة فرعية @ar
label: 有分丛编 @zh-hans
sub property of: has part resource
inverse of: is subseries of
definition: Bir kaynağı, başka bir ardışık toplama kaynağının genel yayın politikasından, kapsamından ve biçiminden ilham alan ardışık toplama kaynağı olan bir kaynakla ilişkilendirir. @tr
definition: Hozzákapcsol egy forrást egy folyamatos aggregáló forráshoz, amelyre egy másik folyamatos aggregáló forrás szerkesztési elve, tárgyköre és stílusa volt hatással. @hu
definition: Liittää aineiston peräkkäiseen aggregoivaan aineistoon, johon on vaikuttanut toisen peräkkäisen aggregoivan aineiston yleinen toimituksellinen käytäntö, laajuus ja tyyli. @fi
definition: Relaterer en ressource til en serie eller et flerbindsværk der konsekvent optræder i en større ressource; en titel på en større ressource optræder på alle udgaver eller dele af underserien. @da
definition: Relates a resource to a resource that is a successive aggregating resource that is inspired by the overall editorial policy, scope, and style of another successive aggregating resource.
definition: Setzt eine Ressource in Beziehung zu einer sukzessiven, aggregierenden Ressource, die an die allgemeine redaktionelle Vorgehensweise, den Geltungsbereich und den Stil einer anderen sukzessiven, aggregierenden Ressource angelehnt ist. @de
definition: يربط بين مصدر ومصدر تجميعي متتالي مستوحى من السياسة التحريرية الشاملة، والمجال، وأسلوب مصدر تجميعي متتالي آخر. @ar
definition: 将一种资源与作为一种相继合集性资源并且被另一种相继合集性资源的总体编辑政策、编辑范围和编辑风格启发的一种资源关联起来。 @zh-hans

is special issue of
lexical alias: specialIssueOf.en
status: Published
type: Property
label: aineiston erikoisnumero @fi
label: er særnummer af @da
label: is themanummer van @nl
label: ist Sonderausgabe von @de
label: különszáma a következőnek: @hu
label: özel konusu @tr
label: إصدار خاص لـ @ar
label: 是……的特刊 @zh-hans
sub property of: is part of resource
inverse of: has special issue
definition: Bir kaynağı, belirli bir konuya adanmış bir nüshası olan bir kaynakla ilişkilendirir. @tr
definition: Hozzákapcsol egy forrást egy forráshoz, amely egy speciális témának szentelt számmal rendelkezik. @hu
definition: Liittää aineiston aineistoon, jolla on tietylle aiheelle omistettu numero. @fi
definition: Relaterer en ressource til et periodikum eller avis, der indeholder et enkelt nummer eller et tillæg helliget et bestemt emne, med eller uden periodikanummerering, som fx. et jubilæumsnummer af en tidsskrift eller avis. @da
definition: Relates a resource to a resource that has an issue that is devoted to a specific topic.
definition: Setzt eine Ressource in Beziehung zu einer Ressource, die eine Ausgabe einem bestimmten Thema gewidmet hat. @de
definition: يربط بين مصدر ومصدر له عدد مخصص لموضوع محدد. @ar
definition: 将一种资源与有完全关于一个特定话题的一期的一种资源关联起来。 @zh-hans

has form of tactile notation
lexical alias: formOfTactileNotation.en
status: Published
type: Property
label: aineiston taktiilin merkkijärjestelmän tyyppi @fi
label: dokunsal notasyon biçimi ile ilişkilidir @tr
label: har taktil notationsform @da
label: hat Form der taktilen Notation @de
label: heeft vorm van tactiele notatie @nl
label: tapintható lejegyzési formája a következő: @hu
label: له شكل من أشكال التدوين عن طريق اللمس @ar
label: 有触摸标记的形式 @zh-hans
sub property of: has form of notation
definition: Bir kaynağı, bir kaynağın içeriğini dokunma yoluyla algılanabilecek bir biçimde ifade etmek için kullanılan bir dizi karakter veya sembolle ilişkilendirir. @tr
definition: Hozzákapcsol egy forrást karakterek vagy szimbólumok egy csoportjához, amelyet arra használnak, hogy egy forrás tartalmát érintés útján felfogató formában fejezze ki. @hu
definition: Liittää aineiston joukkoon merkkejä tai symboleja, joita käytetään aineiston sisällön ilmaisemiseen kosketeltavassa muodossa. @fi
definition: Relaterer en ressource til et sæt af tegn og/eller symboler, der anvendes til at udtrykke en ressources indhold på en måde, der kan opfattes ved berøring. @da
definition: Relates a resource to a set of characters or symbols used to express the content of a resource in a form that can be perceived through touch.
definition: Setzt eine Ressource in Beziehung zu einem Satz von Zeichen oder Symbolen der verwendet wird, um den Inhalt einer Ressource in einer Form auszudrücken, die über den Tastsinn wahrgenommen werden kann. @de
definition: يربط بين مصدر ومجموعة من أحرف أو رموز مُستخدمة للتعبير عن محتوى مصدر في شكل يمكن إدراكه من خلال اللمس. @ar
definition: 将一种资源与用于通过触摸感知的形式来表达一种资源的内容的字符或符号的集合关联起来。 @zh-hans

has form of notation
has subproperty: has form of tactile notation
has subproperty: has form of notated movement
has subproperty: has form of musical notation
has subproperty: has script
lexical alias: formOfNotation.en
status: Published
type: Property
label: aineiston merkkijärjestelmän tyyppi @fi
label: har notationsform @da
label: hat Form der Notation @de
label: heeft vorm van notatie @nl
label: lejegyzésformája a következő: @hu
label: notasyon biçimi ile ilişkilidir @tr
label: له شكل من أشكال التدوين @ar
label: 有标记的形式 @zh-hans
definition: Bir kaynağı, bir kaynağın içeriğini ifade etmek için kullanılan bir dizi karakter veya sembolle ilişkilendirir. @tr
definition: Hozzákapcsol egy forrást karakterek vagy szimbólumok egy csoportjához, amelyet arra használnak, hogy egy forrás tartalmát kifejezze. @hu
definition: Liittää aineiston joukkoon merkkejä tai symboleja, joita käytetään aineiston sisällön ilmaisemiseen. @fi
definition: Relaterer en ressource til et sæt af tegn og/eller symboler, der anvendes til at udtrykke en ressources indhold. @da
definition: Relates a resource to a set of characters or symbols used to express the content of a resource.
definition: Setzt eine Ressource in Beziehung zu einem Satz von Zeichen oder Symbolen der verwendet wird, um den Inhalt einer Ressource auszudrücken. @de
definition: يربط بين مصدر ومجموعة من الأحرف أو الرموز المستخدمة للتعبير عن محتوى مصدر. @ar
definition: 将一种资源与用于表达一种资源的内容的字符或符号的集合关联起来。 @zh-hans

has form of notated movement
lexical alias: formOfNotatedMovement.en
status: Published
type: Property
label: aineiston liikenotaation tyyppi @fi
label: har bevægelsesnotationsform @da
label: hat Form der Bewegungsnotation @de
label: heeft vorm van bewegingsnotatie @nl
label: mozgásírás formája a következő: @hu
label: notaya alınmış hareketin biçimi ile ilişkilidir @tr
label: شكل من أشكال الحركات المدونة @ar
label: 有动作谱的形式 @zh-hans
sub property of: has form of notation
definition: Bir kaynağı, bir kaynağın hareket içeriğini ifade etmek için kullanılan bir dizi karakter veya sembolle ilişkilendirir. @tr
definition: Hozzákapcsol egy forrást karakterek vagy szimbólumok egy csoportjához, amelyet arra használnak, hogy egy forrás mozgástartalmát kifejezze. @hu
definition: Liittää aineiston joukkoon merkkejä tai symboleja, joita käytetään aineiston liikesisällön ilmaisemiseen. @fi
definition: Relaterer en ressource til et sæt af tegn og/eller symboler, der anvendes til at udtrykke de bevægelser en ressource indeholder. @da
definition: Relates a resource to a set of characters or symbols used to express movement content of a resource.
definition: Setzt eine Ressource in Beziehung zu einem Satz von Zeichen oder Symbolen der verwendet wird, um den Bewegungsinhalt einer Ressource auszudrücken. @de
definition: يربط بين مصدر ومجموعة من الأحرف أو الرموز المستخدمة للتعبير عن محتوى حركي لمصدر. @ar
definition: 将一种资源与用于表达一种资源的动作内容的字符或符号的集合关联起来。 @zh-hans

has form of musical notation
lexical alias: formOfMusicalNotation.en
status: Published
type: Property
label: aineiston nuottikirjoituksen tyyppi @fi
label: har musikalsk notationsform @da
label: hat Form einer Musiknotation @de
label: heeft vorm van muzieknotatie @nl
label: müzikal notasyon biçimi ile ilişkilidir @tr
label: zenei lejegyzés formája a következő: @hu
label: له شكل من أشكال التدوين الموسيقي @ar
label: 有乐谱的形式 @zh-hans
sub property of: has form of notation
definition: Bir kaynağı, bir kaynağın müzikal içeriğini ifade etmek için kullanılan bir dizi karakter veya sembolle ilişkilendirir. @tr
definition: Hozzákapcsol egy forrást karakterek vagy szimbólumok egy csoportjához, amelyet arra használnak, hogy egy forrás zenei tartalmát kifejezze. @hu
definition: Liittää aineiston joukkoon merkkejä tai symboleja, joita käytetään aineiston musiikkisisällön ilmaisemiseen. @fi
definition: Relaterer en ressource til et sæt af tegn og/eller symboler, der anvendes til at udtrykke en ressources musikindhold. @da
definition: Relates a resource to a set of characters or symbols used to express musical content of a resource.
definition: Setzt eine Ressource in Beziehung zu einem Satz von Zeichen oder Symbolen der verwendet wird, um den musikalischen Inhalt einer Ressource auszudrücken. @de
definition: يربط بين مصدر ومجموعة من الأحرف أو الرموز المستخدمة للتعبير عن محتوى موسيقي لمصدر. @ar
definition: 将一种资源与用于表达一种资源的音乐内容的字符或符号的集合关联起来。 @zh-hans

has script
lexical alias: script.en
status: Published
type: Property
label: aineiston kirjoitusjärjestelmä @fi
label: har skrift @da
label: hat Schrift @de
label: heeft schrift @nl
label: yazı sistemi ile ilişkilidir @tr
label: írása a következő: @hu
label: له نص @ar
label: 有文字 @zh-hans
sub property of: has form of notation
definition: Bir kaynağı, bir kaynağın yazılı dil içeriğini ifade etmek için kullanılan bir dizi karakter veya sembolle ilişkilendirir. @tr
definition: Hozzákapcsol egy forrást karakterek vagy szimbólumok egy csoportjához, amelyet arra használnak, hogy egy forrás nyelvi tartalmát kifejezze. @hu
definition: Liittää aineiston joukkoon merkkejä tai symboleja, joita käytetään aineiston kirjoitetun kielellisen sisällön ilmaisemiseen. @fi
definition: Relaterer en ressource til et sæt af tegn og/eller symboler, der anvendes til at udtrykke det skrevne sprogindhold i en ressource. @da
definition: Relates a resource to a set of characters or symbols used to express written language content of a resource.
definition: Setzt eine Ressource in Beziehung zu einem Satz von Zeichen oder Symbolen der verwendet wird, um den geschriebenen Sprachinhalt einer Ressource auszudrücken. @de
definition: يربط بين مصدر ومجموعة من الأحرف أو الرموز المستخدمة للتعبير عن محتوى لغة مكتوبة لمصدر. @ar
definition: 将一种资源与用于表达一种资源的书写语言内容的字符或符号的集合关联起来。 @zh-hans

has digital representation of cartographic content
has subproperty: has cartographic data type
lexical alias: digitalRepresentationOfCartographicContent.en
status: Published
type: Property
label: har digital repræsentation af kartografisk indhold @da
label: hat digitale Darstellung von kartografischem Inhalt @de
label: heeft digitale representatie van cartografische content @nl
label: kartografik içeriğin dijital temsili ile ilişkilidir @tr
label: kartografisen sisällön digitaalinen esitysmuoto @fi
label: kartográfiai tartalom digitális ábrázolása a következő: @hu
label: له تمثيل رقمي للمحتوى الجغرافي @ar
label: 有地图内容的数字表现 @zh-hans
sub property of: has digital file characteristic
definition: Bir kaynağı, bir kartografik kaynaktaki jeo-uzamsal bilgilerin kodlanmasıyla ilgili bir dizi teknik ayrıntıyla ilişkilendirir. @tr
definition: Hozzákapcsol egy forrást technikai részletek egy halmazához, amely kapcsolódik a térinformatikai információk kódolásához egy kartográfiai forrásban. @hu
definition: Liittää aineiston aineiston maantieteellisen paikkatiedon koodaamisen tekniseen tietoon. @fi
definition: Relaterer en ressource til et sæt af tekniske detaljer relateret til kodning af geospatiale oplysningerer i en kartografisk ressource. @da
definition: Relates a resource to a set of technical details relating to an encoding of geospatial information in a cartographic resource.
definition: Setzt eine Ressource in Beziehung zu einem Satz von technischen Angaben, die sich auf die Kodierung von Geoinformationen in einer kartografischen Ressource beziehen. @de
definition: يربط بين مصدر ومجموعة تفاصيل فنية مرتبطة بمعلومات الترميز الجغرافي في مصدر خرائطي @ar
definition: 将一种资源与和一种地图资源中地理空间信息编码相关的技术细节的集合关联起来。 @zh-hans

has date associated with agent (Deprecated)
has subproperty: has period of activity of agent
has subproperty: has date of establishment
has subproperty: has date of termination
has subproperty: has date of conference
has subproperty: has date of death
has subproperty: has date of birth
lexical alias: dateAssociatedWithAgent.en
status: Deprecated
type: Property
label: har dato knyttet til agenten @da
sub property of: has related timespan of resource
inverse of: is date associated with agent of (Deprecated)
definition: Relaterer en ressource til en væsentlig datering forbundet med en agents historie, eller et dato som en agent ellers forbindes med. @da
definition: Relates a resource to a significant date associated with the history of an agent, or the date or range of dates on which a conference, etc., was held, or a date with which an agent is otherwise associated. (Deprecated)

has place associated with agent (Deprecated)
has subproperty: has location of headquarters (Deprecated)
lexical alias: placeAssociatedWithAgent.en
status: Deprecated
type: Property
label: har sted forbundet med agent @da
sub property of: has related place of agent
inverse of: is place associated with agent of (Deprecated)
definition: Relaterer en ressource til et væsentligt sted, der er forbundet med en agent, eller et sted hvor en agent bor eller har boet eller har en forbindelse til. @da
definition: Relates an agent to a significant location associated with an agent, or a place where an agent resides or has resided or has some connection. (Deprecated)

has video format
lexical alias: videoFormat.en
status: Published
type: Property
label: aineiston videoformaatti @fi
label: har videoformat @da
label: hat Videoformat @de
label: heeft videoformaat @nl
label: video formatı ile ilişkilidir @tr
label: videóformátuma a következő: @hu
label: له شكل فيديو @ar
label: 有视频格式 @zh-hans
sub property of: has video characteristic
definition: Bir kaynağı, bir kaynağın analog video içeriğini kodlamak için kullanılan bir şema veya standartla ilişkilendirir. @tr
definition: Hozzákapcsol egy forrást egy sémához vagy szabványhoz, amelyet egy forrás analóg videótartalmának a kódolására használnak. @hu
definition: Liittää aineiston standardiin tai skeemaan, jota on käytetty aineiston analogisen videon sisältöön. @fi
definition: Relaterer en ressource til en standard etc., der anvendes til kodning af en ressources analoge videoindhold. @da
definition: Relates a resource to a schema or standard that is used to encode the analog video content of a resource.
definition: Setzt eine Ressource in Beziehung zu einem Schema oder Standard, das/der zum Kodieren des analogen Videoinhalts einer Ressource verwendet wird. @de
definition: يربط بين مصدر وخطة أو معيار مستخدم في تشفير محتوى الفيديو التناظري لمصدر. @ar
definition: 将一种资源与用于对一种资源的模拟视频内容进行编码的一个方案或标准关联起来。 @zh-hans

has statement of responsibility relating to title proper
lexical alias: statementOfResponsibilityRelatingToTitleProper.en
status: Published
type: Property
label: başlığa ilişkin sorumluluk bildirimi ile ilişkilidir @tr
label: főcímhez kapcsolódó felelősségi közlése a következő: @hu
label: har ophavsangivelse relateret til hovedtitel @da
label: hat Verantwortlichkeitsangabe, die sich auf einen Haupttitel bezieht @de
label: heeft verantwoordelijkheidsvermelding gerelateerd aan hoofdtitel @nl
label: päänimekkeeseen liittyvä vastuullisuusmerkintö @fi
label: له بيان مسؤولية مرتبط بالعنوان نفسه @ar
label: 有与正题名相关的责任说明 @zh-hans
sub property of: has statement of responsibility
definition: Bir kaynağı, bir kaynağın fikri veya sanatsal içeriğinin oluşturulmasından sorumlu olan veya gerçekleşmesine katkıda bulunan temsilcilerin tanımlanması veya işlevi ile ilgili bir kaynağa uygun bir başlıkla bağlantılı olan bir bildirimle ilişkilendirir. @tr
definition: Hozzákapcsol egy forrást egy forrás főcíméhez kapcsolódó közléshez, amely egy forrás szellemi vagy művészi tartalmának létrehozásáért vagy a megvalósulásában való közreműködésért felelős ágensek azonosítására vagy funkciójára vonatkozik. @hu
definition: Liittää aineiston päänimekkeeseen liittyvään vastuullisuusmerkintöön, joka liittyy aineiston henkisen tai taiteellisen sisällön luomisesta vastaavien tai sen toteuttamiseen osallistuvien toimijoiden tunnistamiseen tai tehtävään. @fi
definition: Relaterer en ressource til en ophavsangivelse der knytter sig til en hovedtitel på en ressource, der relaterer sig til identificeringen eller funktionen af en hvilken som helst agent eller agenter, der er ansvarlige for at have skabt elle bidraget til realiseringen af det intellektuelle eller kunstneriske indhold af en ressource. @da
definition: Relates a resource to a statement associated with a title proper of a resource that relates to an identification or function of agents responsible for the creation of, or who contributes to a realization of, the intellectual or artistic content of a resource.
definition: Setzt eine Ressource in Beziehung zu einer Angabe, die mit einem Haupttitel in Verbindung steht und die sich auf die auf eine Identifizierung oder Funktion von Akteuren bezieht, die für die Schaffung des geistigen oder künstlerischen Inhalts einer Ressource verantwortlich sind oder zu dessen Realisierung beitragen. @de
definition: يربط بين مصدر وبيان مرتبط بالعنوان نفسه لمصدر يتعلق بتعريف أو وظيفة الوكلاء المسؤولين عن إنشاء المحتوى الفكري أو الفني لمصدر، أو الذين يساهمون في تحقيقه. @ar
definition: 将一种资源与 和资源的正题名有关并且和对创建资源的知识或艺术内容负责或对实现资源的知识或艺术内容作贡献的一个行为者的标识或职能相关的说明关联起来。 @zh-hans

has series statement
lexical alias: seriesStatement.en
status: Published
type: Property
label: aineiston sarjamerkintö @fi
label: har seriebeskrivelse @da
label: hat Gesamttitelangabe @de
label: heeft reeksvermelding @nl
label: seri bildirimi ile ilişkilidir @tr
label: sorozati közlése a következő: @hu
label: له بيان سلسلة @ar
label: 有丛编说明 @zh-hans
definition: Bir kaynağı, bir kaynakla ilişkili bir diziyi ve dizi içindeki bir kaynağın numaralandırmasını tanımlayan bir bildirim ile ilişkilendirir, @tr
definition: Hozzákapcsol egy forrást egy közléshez, amely azonosít egy forráshoz kapcsolódó sorozatot és a forrás sorozaton belüli számozását. @hu
definition: Liittää aineiston huomautukseen, joka sisältää tietoa aineistoon liittyvästä sarjasta. @fi
definition: Relaterer en ressource til oplysninger, der identificerer en serie, som en ressource er en del af, samt nummerering af en ressource i serien. @da
definition: Relates a resource to a statement that identifies a series that is associated with a resource and a numbering of a resource within the series,
definition: Setzt eine Ressource in Beziehung zu einer Angabe, die eine Reihe identifiziert, mit der eine Ressource in Verbindung steht und die eine Zählung einer Ressource innerhalb der Reihe aufweist. @de
definition: يربط بين مصدر وبيان يحدد سلسلة مرتبطة بمصدر وترقيم مصدر داخل سلسلة. @ar
definition: 将一种资源与标识和一种资源有关的一种丛编以及一种资源在丛编中的编号的一个说明关联起来。 @zh-hans
scope note: A series statement may also include information identifying one or more subseries to which the resource being described belongs. A series statement sometimes includes statements of responsibility relating to a series or subseries.
scope note: Bir dizi bildirimi, ayrıca tanımlanan kaynağın ait olduğu bir veya daha fazla alt diziyi tanımlayan bilgileri içerebilir. Bir dizi bildirimi bazen bir diziye veya alt diziye ilişkin sorumluluk bildirimlerini de içerir. @tr
scope note: Darunter können auch Informationen fallen, die eine Unterreihe oder mehrere Unterreihen identifizieren, zu der/denen die zu beschreibende Ressource gehört. Darunter können auch Verantwortlichkeitsangaben fallen, die sich auf eine Reihe oder Unterreihe beziehen. @de
scope note: Egy sorozati közlés magában foglalhat egy vagy több, a leírt forráshoz tartozó, alsorozatot azonosító információt. Időnként egy az oldalak vagy a lemezek számának, vagy egyedi oldalnak vagy lemeznek megfelelő szám követi. @hu
scope note: En seriebeskrivelse kan også indeholde oplysninger, der identificerer en eller flere underserier, som den beskrevne ressource er en del af. En seriebeskrivelse inkluderer sommetider en eller flere ophavsangivelser relaterede til serien eller underserien. @da
scope note: Sarjamerkintöön voi kuulua myös yhden tai useamman kuvailtavaan aineistoon sisältyvän alasarjan identifioiva tieto. Joskus sarjamerkintö sisältää sarjaan tai alasarjaan liittyviä vastuullisuusmerkintöjä. @fi
scope note: قد يتضمن بيان السلسلة أيضًا معلومات تُحدد سلسلة فرعية واحدة أو أكثر ينتمي إليها المصدر الموصوف.وفي بعض الأحيان يتضمن بيان السلسلة بيانات المسؤولية المتعلقة بسلسلة أو سلسلة فرعية. @ar
scope note: 丛编说明还可以包括标识被描述资源所属于的一个或多个分丛编。丛编说明有时候包括与丛编或分丛编有关的责任说明。 @zh-hans

has edition statement
lexical alias: editionStatement.en
status: Published
type: Property
label: aineiston painosmerkintö @fi
label: har udgavebeskrivelse @da
label: hat Ausgabevermerk @de
label: heeft editievermelding @nl
label: kiadásjelzése a következő: @hu
label: sürüm bildirimi ile ilişkilidir @tr
label: له بيان طبعة @ar
label: 有版本说明 @zh-hans
definition: Bir kaynağı, bir kaynağın ait olduğu bir basımı tanımlayan bir ifadeyle ilişkilendirir. @tr
definition: Hozzákapcsol egy forrást egy kiadást azonosító közléshez, amelyhez egy forrás tartozik. @hu
definition: Liittää aineiston merkintöön, joka identifioi aineiston painoksen. @fi
definition: Relaciona un recurs amb una menció que identifica una edició a la que pertany un recurs. @ca
definition: Relaterer en ressource til oplysninger, der identificerer den udgave, en ressource hører til. @da
definition: Relates a resource to a statement that identifies an edition to which a resource belongs.
definition: Setzt eine Ressource in Beziehung zu einer Angabe, die eine Ausgabe identifiziert, zu der eine Ressource gehört. @de
definition: يربط بين مصدر وبيان يحدد طبعة ينتمي إليها مصدر. @ar
definition: 将一种资源与标识一种资源属于其中的一个版本的说明关联起来。 @zh-hans

has distribution statement
lexical alias: distributionStatement.en
status: Published
type: Property
label: aineiston jakelumerkintö @fi
label: dağıtım bildirimi ile ilişkilidir @tr
label: har distributionsbeskrivelse @da
label: hat Vertriebsangabe @de
label: heeft distributievermelding @nl
label: terjesztési közlése a következő: @hu
label: له بيان توزيع @ar
label: 有发行说明 @zh-hans
definition: Bir kaynağı, yayınlanmış bir kaynağın dağıtım yerini, dağıtımcısını veya dağıtım tarihini tanımlayan bir bildirim ile ilişkilendirir. @tr
definition: Hozzákapcsol egy forrást egy közléshez, amely azonosítja egy kiadott forrás terjesztési helyét, terjesztőjét, terjesztési időpontját. @hu
definition: Liittää aineiston merkintöön, joka identifioi julkaistun aineiston jakelupaikan, jakelijan tai jakeluajan. @fi
definition: Relaterer en ressource til oplysninger, der identificerer distributionssted, distributør, eller et dato for distribution af en ressource i publiceret form. @da
definition: Relates a resource to a statement that identifies a place of distribution, a distributor, or a date of distribution of a published resource.
definition: Setzt eine Ressource in Beziehung zu einer Angabe, die einen Vertriebsort, einen Vertrieb oder ein Vertriebsdatum einer veröffentlichten Ressource identifiziert. @de
definition: يربط بين مصدر وبيان يحدد مكان توزيع، موزع، أو تاريخ توزيع خاص بمصدر منشور. @ar
definition: 将一种资源与标识一种出版资源的发行地、发行者或发行日期的一个说明关联起来。 @zh-hans

has manufacture statement
lexical alias: manufactureStatement.en
status: Published
type: Property
label: aineiston valmistusmerkintö @fi
label: gyártási közlése a következő: @hu
label: har produktionsbeskrivelse @da
label: hat Herstellungsangabe @de
label: heeft vervaardigingsvermelding @nl
label: üretim bildirimi ile ilişkilidir @tr
label: له بيان تصنيع @ar
label: 有生产说明 @zh-hans
definition: Bir kaynağı, yayınlanmış bir kaynağın üretim yerini, üreticisini veya üretim tarihini tanımlayan bir bildirim ile ilişkilendirir. @tr
definition: Hozzákapcsol egy forrást egy közléshez, amely azonosítja egy kiadott forrás gyártási helyét, gyártóját és a gyártás időpontját. @hu
definition: Liittää aineiston merkintöön, joka identifioi julkaistun aineiston valmistuspaikan, valmistajan tai valmistusajan. @fi
definition: Relaterer en ressource til oplysninger, der identificerer fremstillingssted, producent og fremstillingsår eller -dato for en ressource i publiceret form. @da
definition: Relates a resource to a statement that identifies a place of manufacture, a manufacturer, or a date of manufacture of a published resource.
definition: Setzt eine Ressource in Beziehung zu einer Angabe, die einen Herstellungsort, einen Hersteller oder ein Herstellungsdatum einer veröffentlichten Ressource identifiziert. @de
definition: يربط بين مصدر وبيان يحدد مكان تصنيع، مصنعون، أو تاريخ تصنيع خاص بمصدر منشور. @ar
definition: 将一种资源与标识一种出版资源的生产地、生产者或生产日期的一个说明关联起来。 @zh-hans
scope note: A gyártási közlések olyan közléseket tartalmaznak, amelyek egy kiadott forrás nyomtatására, sokszorosítására, öntésére, stb. vonatkoznak. @hu
scope note: A manufacture statement includes a statement about the printing, duplicating, casting, etc., of a published resource.
scope note: Bir üretim bildirimi, yayımlanmış bir kaynağın baskısı, çoğaltılması, dökümü vb. ile ilgili bir bildirim içerir. @tr
scope note: Darunter fallen Angaben, die sich auf den Druck, die Vervielfältigung, den Guss und so weiter einer veröffentlichten Ressource beziehen. @de
scope note: Produktionsbeskrivelse omfatter en beskrivelse af trykning, kopiering, støbning, etc. af en publiceret ressource. @da
scope note: Valmistusmerkintö sisältää julkaistun aineiston painamiseen, monistamiseen, kirjasinten valamiseen tms. liittyvän merkinnön. @fi
scope note: يشمل بيان التصنيع البيان المتعلق بالطباعة، النسخ، الطَرَح، إلخ. لمصدر منشور. @ar
scope note: 生产说明包括关于一种出版资源的印刷、复制、铸造等的一个说明。 @zh-hans

has production statement
lexical alias: productionStatement.en
status: Published
type: Property
label: aineiston tuotantomerkintö @fi
label: előállítási közlése a következő: @hu
label: har produktionsbeskrivelse @da
label: hat Entstehungsangabe @de
label: heeft productievermelding @nl
label: yapım bildirimi ile ilişkilidir @tr
label: له بيان إنتاج @ar
label: 有制作说明 @zh-hans
definition: Bir kaynağı, yayınlanmamış bir kaynağın üretim yerini, üreticisini veya üretim tarihini tanımlayan bir bildirim ile ilişkilendirir. @tr
definition: Hozzákapcsol egy forrást egy közléshez, amely azonosítja egy kiadatlan forrás előállítási helyét, előállítóját és az előállítás időpontját. @hu
definition: Liittää aineiston merkintöön, joka identifioi julkaisemattoman aineiston tuotantopaikan, tuottajan tai tuotantoajan. @fi
definition: Relaterer en ressource til oplysninger, der identificerer produktionssted, producent og fremstillingsdato for en ressource i publiceret form. @da
definition: Relates a resource to a statement that identifies a place of production, a producer, or a date of production of an unpublished resource.
definition: Setzt eine Ressource in Beziehung zu einer Angabe, die einen Entstehungsort, eine Produzentin/einen Produzenten oder ein Entstehungsdatum einer unveröffentlichten Ressource identifiziert. @de
definition: يربط بين مصدر وبيان يُحدد مكان إنتاج، منتج، أو تاريخ إنتاج خاص بمصدر غير منشور. @ar
definition: 将一种资源与标识一种非出版资源的制作地、制作者或制作日期的一个说明关联起来。 @zh-hans
scope note: A production statement includes a statement about the inscription, fabrication, construction, etc., of an unpublished resource.
scope note: Az előállítási közlések olyan közléseket tartalmaznak, amelyek egy kiadatlan forrás írására, összeállítására, készítésére stb. vonatkoznak. @hu
scope note: Bir üretim bildirimi, yayınlanmamış bir gösterimin yazımı, fabrikasyonu, yapımı vb. hakkında bir bildirimi içerir. @tr
scope note: Darunter fallen Angaben, die sich auf die Beschriftung, die Fabrikation und die Konstruktion und so weiter einer unveröffentlichten Ressource beziehen. @de
scope note: Produktionsbeskrivelse omfatter en beskrivelse af inskription, fremstilling, konstruktion etc. af en ressource i ikke publiceret form. @da
scope note: Tuotantomerkintö sisältää julkaisettoman aineiston kaivertamiseen, valmistamiseen, kokoamiseen tms. liittyvän merkinnön. @fi
scope note: يشمل بيان الإنتاج البيان المرتبط بالتسجيل، أو الصناعة، أو الإنشاء، إلخ. لمصدر غير منشور. @ar
scope note: 制作说明包括关于一种非出版资源的镌刻、制造、构建等的一个说明。 @zh-hans

has publication statement
lexical alias: publicationStatement.en
status: Published
type: Property
label: aineiston julkaisumerkintö @fi
label: har publiceringsbeskrivelse @da
label: hat Veröffentlichungsangabe @de
label: heeft publicatievermelding @nl
label: kiadási közlése a következő: @hu
label: yayın bildirimi ile ilişkilidir @tr
label: له بيان نشر @ar
label: 有出版说明 @zh-hans
definition: Bir kaynağı, yayınlanmış bir kaynağın yayın yerini, yayıncısını veya yayın tarihini tanımlayan bir bildirim ilişkilendirir. @tr
definition: Hozzákapcsol egy forrást egy közléshez, amely azonosítja egy kiadott forrás kiadásának helyét, kiadóját és a kiadás időpontját. @hu
definition: Liittää aineiston merkintöön, joka identifioi aineiston kustannuspaikan, kustantajan tai julkaisuajan. @fi
definition: Relaterer en ressource til oplysninger, der identificerer publiceringssted, udgiver og publiceringsdato for en publiceret ressource. @da
definition: Relates a resource to a statement that identifies a place of publication, a publisher, or a date of publication of a published resource.
definition: Setzt eine Ressource in Beziehung zu einer Angabe, die einen Erscheinungsort, einen Verlag oder ein Erscheinungsdatum einer veröffentlichten Ressource identifiziert. @de
definition: يربط بين مصدر وبيان يُحدد مكان نشر، ناشر، أو تاريخ نشر خاص بمصدر منشور. @ar
definition: 将一种资源与标识一种出版资源的出版地、出版者或出版日期的一个说明关联起来。 @zh-hans

has parallel statement of responsibility relating to named revision of edition
lexical alias: parallelStatementOfResponsibilityRelatingToNamedRevisionOfEdition.en
status: Published
type: Property
label: adlandırılmış basım revizyonu le ilgili paralel sorumluluk bildirimi ile ilişkilidir @tr
label: har parallel ophavsangivelse relateret til en navngivet revision af en udgave @da
label: hat parallele Verantwortlichkeitsangabe, die sich auf eine näher erläuterte Überarbeitung einer Ausgabe bezieht @de
label: heeft parallelle verantwoordelijkheidsvermelding gerelateerd aan benoemde herziening van editie @nl
label: kiadás nevesített átdolgozásához kötődő párhuzamos felelősségi közlése a következő: @hu
label: nimettyyn uudistettuun painokseen liittyvä rinnakkainen vastuullisuusmerkintö aineistossa @fi
label: له بيان موازي لمسؤولية متعلقة بالمراجعة المسماة لطبعة @ar
label: 有和版本的命名修订有关的并列责任说明 @zh-hans
definition: Bir kaynağı, bir baskı öğesinin adlandırılmış bir gözden geçirilmesi ile ilgili bir sorumluluk bildiriminde kaydedilenden farklı bir dilde veya alfabede bir baskının adlandırılmış bir revizyonuyla ilgili bir sorumluluk bildirimiyle ilişkilendirir. @tr
definition: Hozzákapcsol egy forrást egy kiadás nevesített átdolgozásához kapcsolódó felelősségi közléshez egy olyan nyelven vagy írásrendszerben, amely eltér a kiadás nevesített átdolgozása elemben jelölt felelősségi közléstől. @hu
definition: Liittää aineiston erikieliseen nimettyyn uudistettuun painokseen tai käsikirjoitukseen liittyvään vastuullisuusmerkintöön. @fi
definition: Relaterer en ressource til en ophavsangivelse på et andet sprog eller i et andet alfabet end det som er anvendt ved angivelsen af den navngivne revision af en udgave. @da
definition: Relates a resource to a statement of responsibility relating to a named revision of an edition in a language or script that differs from that recorded in a statement of responsibility relating to a named revision of an edition element.
definition: Setzt eine Ressource in Beziehung zu einer Verantwortlichkeitsangabe einer näher erläuterten Überarbeitung in einer Sprache oder Schrift, die von der bereits erfassten Verantwortlichkeitsangabe einer näher erläuterten Überarbeitung abweicht. @de
definition: يربط بين مصدر وبيان مسؤولية متعلق بمراجعة مسماة لطبعة بلغة أو نص مختلف عن تلك المُسجلة داخل بيان المسؤولية المرتبط بمراجعة مسماه لعنصر طابعه. @ar
definition: 将一种资源与和版本的命名修订有关的用不同于记录在和版本的命名修订有关的责任说明元素中另一种语言或文字的一个责任说明关联起来。 @zh-hans

has parallel statement of responsibility relating to series
lexical alias: parallelStatementOfResponsibilityRelatingToSeries.en
status: Published
type: Property
label: har parallel ophavsangivelse relateret til serie @da
label: hat parallele Verantwortlichkeitsangabe, die sich auf eine Reihe bezieht @de
label: heeft parallelle verantwoordelijkheidsvermelding gerelateerd aan reeks @nl
label: sarjan rinnakkainen vastuullisuusmerkintö aineistossa @fi
label: seri ile ilgili paralel sorumluluk bildirimi ile ilişkilidir @tr
label: sorozathoz kapcsolódó párhuzamos felelősségi közlése a következő: @hu
label: له بيان موزاي لمسؤولية مرتبطة بسلسلة @ar
label: 有和丛编有关的并列责任说明 @zh-hans
definition: Bir kaynağı, dizi öğesiyle ilgili bir sorumluluk bildiriminde kaydedilenden farklı bir dildeki veya alfabedeki diziyle ilgili bir sorumluluk bildirimiyle ilişkilendirir. @tr
definition: Hozzákapcsol egy forrást egy sorozathoz kapcsolódó felelősségi közléshez egy olyan nyelven vagy írásrendszerben, amely eltér a sorozat elemében jelölt felelősségi közléstől. @hu
definition: Liittää aineiston sarjan vastuullisuusmerkintöön toisella kielellä ja/tai kirjoitusjärjestelmällä. @fi
definition: Relaterer en ressource til en ophavsangivelse relateret til en serie på et andet sprog eller i et andet alfabet end det som er anvendt ved angivelsen af en ophavsangivelse til en serie. @da
definition: Relates a resource to a statement of responsibility relating to series in a language or script that differs from that recorded in a statement of responsibility relating to series element.
definition: Setzt eine Ressource in Beziehung zu einer Verantwortlichkeitsangabe einer Reihe in einer Sprache oder Schrift, die von der bereits erfassten Verantwortlichkeitsangabe einer Reihe abweicht. @de
definition: يربط بين مصدر وبيان مسؤولية متعلق بسلسلة بلغة أو نص مختلف عن تلك المُسجلة داخل بيان المسؤولية المرتبط بعنصر سلسلة. @ar
definition: 将一种资源与和丛编有关的用不同于记录在和丛编有关的责任说明元素中另一种语言或文字的一个责任说明关联起来。 @zh-hans

has parallel statement of responsibility relating to subseries (Deprecated)
lexical alias: parallelStatementOfResponsibilityRelatingToSubseries.en
status: Deprecated
type: Property
label: har parallel ophavsangivelse relateret til underserie @da
definition: Relaterer en ressource til en ophavsangivelse relateret til en underserie på et andet sprog og/eller i et andet alfabet end det som er anvendt ved angivelsen af en ophavsangivelse til en underserie. @da
definition: Relates a resource to a statement of responsibility relating to subseries in a language or script that differs from that recorded in a statement of responsibility relating to subseries element. (Deprecated)

has parallel statement of responsibility relating to edition
lexical alias: parallelStatementOfResponsibilityRelatingToEdition.en
status: Published
type: Property
label: basım ile ilgili paralel sorumluluk bildirimi ile ilişkilidir @tr
label: har parallel ophavsangivelse relateret til udgave @da
label: hat parallele Verantwortlichkeitsangabe, die sich auf eine Ausgabe bezieht @de
label: heeft parallelle verantwoordelijkheidsvermelding gerelateerd aan editie @nl
label: kiadáshoz kapcsolódó párhuzamos felelősségi közlése a következő: @hu
label: painoksen rinnakkainen vastuullisuusmerkintö aineistossa @fi
label: له بيان موازي لمسؤولية مرتبطة بطبعة @ar
label: 有和版本有关的并列责任说明 @zh-hans
definition: Bir kaynağı, bir basım öğesiyle ilgili bir sorumluluk bildiriminde kaydedilenden farklı bir dildeki veya alfabedeki bir basımla ilgili bir sorumluluk bildirimiyle ilişkilendirir. @tr
definition: Hozzákapcsol egy forrást egy kiadáshoz kapcsolódó felelősségi közléshez egy olyan nyelven vagy írásrendszerben, amely eltér a kiadás elemben jelölt felelősségi közléstől. @hu
definition: Liittää aineiston sen erikieliseen painokseen tai käsikirjoitukseen liittyvään vastuullisuusmerkintöön. @fi
definition: Relaterer en ressource til en ophavsangivelse på et andet sprog eller i et andet alfabet end det som er anvendt ved angivelsen af en ophavsangivelse til en underserie. @da
definition: Relates a resource to a statement of responsibility relating to an edition in a language or script that differs from that recorded in a statement of responsibility relating to an edition element.
definition: Setzt eine Ressource in Beziehung zu einer Verantwortlichkeitsangabe einer Ausgabe in einer Sprache oder Schrift, die von der bereits erfassten Verantwortlichkeitsangabe einer Ausgabe abweicht. @de
definition: يربط بين مصدر وبيان مسؤولية مرتبط بطبعة بلغة أو نص مختلف عن تلك المُسجلة داخل بيان المسؤولية المرتبط بعنصر طابعه. @ar
definition: 将一种资源与和版本有关的用不同于记录在和版本有关的责任说明元素中另一种语言或文字的一个责任说明关联起来。 @zh-hans

has parallel statement of responsibility relating to title proper
lexical alias: parallelStatementOfResponsibilityRelatingToTitleProper.en
status: Published
type: Property
label: esas başlık ile ilgili paralel sorumluluk bildirimi ile ilişkilidir @tr
label: főcímhez kapcsolódó párhuzamos felelősségi közlése a következő: @hu
label: har parallel ophavsangivelse relateret til hovedtitel @da
label: hat parallele Verantwortlichkeitsangabe, die sich auf einen Haupttitel bezieht @de
label: heeft parallelle verantwoordelijkheidsvermelding gerelateerd aan hoofdtitel @nl
label: päänimekkeen rinnakkainen vastuullisuusmerkintö aineistossa @fi
label: له بيان مسؤولية موازي مرتبط بالعنوان نفسه @ar
label: 有和正题名有关的并列责任说明 @zh-hans
sub property of: has statement of responsibility
definition: Bir kaynağı, başlık öğesiyle ilgili bir sorumluluk bildiriminde kaydedilenden farklı bir dil veya alfabedeki başlıkla ilgili bir sorumluluk bildirimi ile ilişkilendirir. @tr
definition: Hozzákapcsol egy forrást egy főcímhez kapcsolódó felelősségi közléshez egy olyan nyelven vagy írásrendszerben, amely eltér a főcím elemében jelölt felelősségi közléstől. @hu
definition: Liittää aineiston sen erikieliseen painoksen tai käsikirjoituksen päänimekkeeseen liittyvään vastuullisuusmerkintöön. @fi
definition: Relaterer en ressource til en ophavsangivelse på et andet sprog eller i et andet alfabet end det som er anvendt ved angivelsen af en ophavsangivelse til en hovedtitel. @da
definition: Relates a resource to a statement of responsibility relating to title proper in a language or script that differs from that recorded in a statement of responsibility relating to title proper element.
definition: Setzt eine Ressource in Beziehung zu einer Verantwortlichkeitsangabe eines Haupttitels in einer Sprache oder Schrift, die von der bereits erfassten Verantwortlichkeitsangabe eines Haupttitels abweicht. @de
definition: يربط بين مصدر وبيان مسؤولية متعلق بعنوان مُنَاسِب بلغة أو نص مختلف عن تلك المُسجلة داخل بيان المسؤولية المرتبط بعنصر العنوان نفسه. @ar
definition: 将一种资源与和正题名有关的用不同于记录在和正题名有关的责任说明元素中另一种语言或文字的一个责任说明关联起来。 @zh-hans

has statement of responsibility
has subproperty: has statement of responsibility relating to title proper
has subproperty: has parallel statement of responsibility relating to title proper
lexical alias: statementOfResponsibility.en
status: Published
type: Property
label: felelősségi közlése a következő: @hu
label: har ophavsangivelse @da
label: hat Verantwortlichkeitsangabe @de
label: heeft verantwoordelijkheidsvermelding @nl
label: sorumluluk bildirimi ile ilişkilidir @tr
label: vastuullisuusmerkintö aineistossa @fi
label: له بيان مسؤولية @ar
label: 有责任说明 @zh-hans
definition: Bir kaynağı, bir kaynağın fikri veya sanatsal içeriğinin oluşturulmasından sorumlu olan veya gerçekleşmesine katkıda bulunan herhangi bir temsilcinin tanımlanması veya işlevi ile ilgili bir bildirim ile ilişkilendirir. @tr
definition: Hozzákapcsol egy forrást egy közléshez, amely egy forrás szellemi vagy művészi tartalmának létrehozásáért vagy a megvalósulásában való közreműködésért felelős ágensek azonosítására vagy funkciójára vonatkozik. @hu
definition: Liittää aineiston merkintöön, joka liittyy aineiston henkisen tai taiteellisen sisällön luomisesta vastaavien tai sen toteuttamiseen osallistuvien toimijoiden tunnistamiseen tai tehtävään. @fi
definition: Relaciona un recurs amb una menció relativa a una identificació o funció de qualsevol agent responsable de la creació de, o que contribueix a una realització del contingut intel·lectual o artístic d’un recurs. @ca
definition: Relaterer en ressource til oplysninger relaterede til identificering eller funktion af alle agenter, der er ansvarlige for at have skabt eller bidraget til realiseringen af det intellektuelle eller kunstneriske indhold af en ressource. @da
definition: Relates a resource to a statement relating to an identification or function of any agents responsible for the creation of, or who contributes to a realization of, the intellectual or artistic content of a resource.
definition: Setzt eine Ressource in Beziehung zu einer Angabe, die mit der Identifizierung oder Funktion von Akteuren in Verbindung steht, die für die Schaffung des geistigen oder künstlerischen Inhalts einer Ressource verantwortlich sind oder zu dessen Realisierung beitragen. @de
definition: يربط بين مصدر وبيان متعلق بتحديد هوية أو وظيفة أي وكلاء مسؤولين عن إنشاء المحتوى الفكري أو الفني لمصدر، أو الذين يساهمون في تحقيقه. @ar
definition: 将一种资源与和对一种资源的知识或艺术内容之创建负责或者对一种资源的知识内容或艺术内容之实现有贡献的任何行为者的识别和职能有关的一个说明关联起来。 @zh-hans

has statement of responsibility relating to named revision of edition
lexical alias: statementOfResponsibilityRelatingToNamedRevisionOfEdition.en
status: Published
type: Property
label: basımın adlandırılmış revizyonunun sorumluluk bildirimi ile ilişkilidir @tr
label: har ophavsangivelse relateret til en navngivet revision af en udgave @da
label: hat Verantwortlichkeitsangabe, die sich auf eine näher erläuterte Überarbeitung einer Ausgabe bezieht @de
label: heeft verantwoordelijkheidsvermelding gerelateerd aan benoemde herziening van editie @nl
label: kiadás nevesített átdolgozásához kötődő felelősségi közlése a következő: @hu
label: nimetyn uudistetun painoksen vastuullisuusmerkintö @fi
label: له بيان مسؤولية مرتبط بمراجعة مسماة لطبعة @ar
label: 有和版本的命名修订有关的责任说明 @zh-hans
definition: Bir kaynağı, baskının adlandırılmış bir gözden geçirilmesinden sorumlu temsilcilerin tanımlanmasıyla ilgili bir bildirim ile ilişkilendirir. @tr
definition: Hozzákapcsol egy forrást egy közléshez, amely egy kiadás nevesített átdolgozásáért felelős ágensek azonosítására vonatkozik. @hu
definition: Liittää aineiston merkintöön, joka liittyy uudistetun painoksen henkisen tai taiteellisen sisällön luomisesta vastaavien tai sen toteuttamiseen osallistuvien toimijoiden tunnistamiseen. @fi
definition: Relaterer en ressource til oplysninger relateret til identificering af alle agenter, der er ansvarlige for en navngivet revision af en udgave. @da
definition: Relates a resource to a statement relating to an identification of agents responsible for a named revision of an edition.
definition: Setzt eine Ressource in Beziehung zu einer Angabe, die mit der Identifizierung von Akteuren in Verbindung steht, die für eine näher erläuterte Überarbeitung eines Ausgabe verantwortlich sind. @de
definition: يربط بين مصدر وبيان متعلق بتحديد هوية وكلاء مسؤولين عن مراجعة المسماة لطبعة. @ar
definition: 将一种资源与和负责版本的命名修订的行为者的一个标识有关的一个说明关联起来。 @zh-hans

has statement of responsibility relating to series
lexical alias: statementOfResponsibilityRelatingToSeries.en
status: Published
type: Property
label: har ophavsangivelse relateret til serie @da
label: hat Verantwortlichkeitsangabe, die sich auf eine Reihe bezieht @de
label: heeft verantwoordelijkheidsvermelding gerelateerd aan reeks @nl
label: sarjan vastuullisuusmerkintö aineistossa @fi
label: seriye ilişkin sorumluluk bildirimi ile ilişkilidir @tr
label: sorozathoz kapcsolódó felelősségi közlése a következő: @hu
label: له بيان مسؤولية مرتبط بسلسلة @ar
label: 有和丛编有关的责任说明 @zh-hans
definition: Bir kaynağı, bir diziden sorumlu temsilcilerin tanımlanması ile ilgili bir bildirim ile ilişkilendirir. @tr
definition: Hozzákapcsol egy forrást egy közléshez, amely egy sorozatért felelős ágensek azonosítására vonatkozik. @hu
definition: Liittää aineiston merkintöön, joka liittyy sarjasta vastaavien toimijoiden tunnistamiseen. @fi
definition: Relaterer en ressource til oplysninger relateret til identificering af agenter, der er ansvarlige for en serie. @da
definition: Relates a resource to a statement relating to an identification of agents responsible for a series.
definition: Setzt eine Ressource in Beziehung zu einer Angabe, die mit der Identifizierung von Akteuren in Verbindung steht, die für eine Reihe verantwortlich sind. @de
definition: يربط بين مصدر وبيان متعلق بتحديد هوية وكلاء مسؤولين عن سلسلة. @ar
definition: 将一种资源与和对一种丛编负责的行为者的一个标识有关的一个说明关联起来。 @zh-hans

has statement of responsibility relating to subseries (Deprecated)
lexical alias: statementOfResponsibilityRelatingToSubseries.en
status: Deprecated
type: Property
label: har ophavsangivelse relateret til underserie @da
definition: Relaterer en ressource til oplysninger relateret til identificering af en hvilken som helst agent eller agenter, der er ansvarlige for en underserie. @da
definition: Relates a resource to a statement relating to an identification of agents responsible for a subseries. (Deprecated)

has statement of responsibility relating to edition
lexical alias: statementOfResponsibilityRelatingToEdition.en
status: Published
type: Property
label: basıma ilişkin sorumluluk bildirimi ile ilişkilidir @tr
label: har ophavsangivelse relateret til udgave @da
label: hat Verantwortlichkeitsangabe, die sich auf eine Ausgabe bezieht @de
label: heeft verantwoordelijkheidsvermelding gerelateerd aan editie @nl
label: kiadáshoz kötődő felelősségi közlése a következő: @hu
label: painoksen vastuullisuusmerkintö aineistossa @fi
label: له بيان مسؤولية مرتبط بطبعة @ar
label: 有和版本有关的责任说明 @zh-hans
definition: Bir kaynağı, açıklanan bir basımdan sorumlu temsilcilerin tanımlanmasıyla ilgili bir bildirimle ilişkilendirir, ancak tüm basımlarla ilişkilendirmez. @tr
definition: Hozzákapcsol egy forrást egy közléshez, amely egy, de nem feltétlenül az összes, kiadás leírásáért felelős ágensek azonosítására vonatkozik. @hu
definition: Liittää aineiston merkintöön, joka liittyy kuvailtavana olevasta painoksesta, mutta ei kaikista painoksista, vastaavien toimijoiden tunnistamiseen. @fi
definition: Relaterer en ressource til oplysninger relateret til identificering af agenter, der er ansvarlige for en beskreven udgave men ikke alle udgaver. @da
definition: Relates a resource to a statement relating to an identification of agents responsible for an edition being described but not to all editions.
definition: Setzt eine Ressource in Beziehung zu einer Angabe, die mit der Identifizierung von Akteuren in Verbindung steht, die für eine beschriebene Ausgabe, aber nicht für alle Ausgaben, verantwortlich sind. @de
definition: يربط بين مصدر وبيان متعلق بتحديد هوية وكلاء مسؤولين عن طبعة تم وصفها ولكن ليس لجميع الطبعات. @ar
definition: 将一种资源与和对所描述的一个版本负责而非对所有版本负责的行为者的一个标识有关的一个说明关联起来。 @zh-hans

has emulsion on microfilm and microfiche
lexical alias: emulsionOnMicrofilmAndMicrofiche.en
status: Published
type: Property
label: emulziója mikrofilmen és mikrofilmlapon a következő: @hu
label: har emulsion på mikrofilm og mikrofiche @da
label: hat Emulsionsschicht auf Mikrofilm und Mikrofiche @de
label: heeft emulsie op microfilm en microfiche @nl
label: mikrofilm ve mikrofiş üzerinde emülsiyon ile ilişkilidir @tr
label: mikrofilmille ja mikrokortille emuloitu aineisto @fi
label: له طبقة حساسة على ميكروفيلم وميكروفيش @ar
label: 有缩微胶卷和缩微平片上的乳剂 @zh-hans
sub property of: has applied material
definition: Bir kaynağı, bir mikrofilm veya mikrofiş üzerinde kaplama olarak kullanılan ışığa duyarlı kimyasalların süspansiyonuyla ilişkilendirir. @tr
definition: Hozzákapcsol egy forrást fényérzékeny vegyszerek szuszpenziójához, amelyet bevonatként használnak mikrofilmen vagy mikrofilmlapon. @hu
definition: Liittää aineiston mikrofilmin tai mikrokortin valoherkkiä kemikaaleja sisältävään pinnoitteeseen. @fi
definition: Relaterer en ressource til en opslæmning af lysfølsomme kemikalier, der er anvendt som belægning på en mikrofilm eller mikrofiche. @da
definition: Relates a resource to a suspension of light-sensitive chemicals used as a coating on a microfilm or microfiche.
definition: Setzt eine Ressource in Beziehung zu einer Suspension aus lichtempfindlichen Chemikalien, die als Beschichtung eines Mikrofilms oder eines Mikrofiches verwendet wird. @de
definition: يربط بين مصدر ونظام تسجيل خاص بالمواد الكيميائية المستخدمة كغطاء على ميكروفيلم أو ميكروفيش. @ar
definition: 将一种资源与缩微胶卷或缩微平片表面感光化合物的悬浮涂层关联起来。 @zh-hans

has longitude and latitude
lexical alias: longitudeAndLatitude.en
status: Published
type: Property
label: enlem ve boylam ile ilişkilidir @tr
label: har længdegrad og breddegrad @da
label: heeft lengtegraad en breedtegraad @nl
label: hosszúsági és szélességi foka a következő: @hu
label: ist Längengrad und Breitengrad von @de
label: pituus- ja leveysasteet aineistossa @fi
label: له خط طول وخط عرض @ar
label: 有经度和纬度 @zh-hans
sub property of: has coordinates of cartographic content
inverse of: is longitude and latitude of
definition: Bir kaynağı, en batı ve en doğu sınırlarının boylamını ve en kuzey ve en güney sınırlarının enlemini kullanarak bir kaynağın kartografik içeriğinin kapsadığı alanı tanımlayan bir yerle ilişkilendirir. @tr
definition: Hozzákapcsol egy forrást egy helyhez, amely azonosít egy forrás kartográfiai tartalma által lefedett területet a legnyugatibb és legkeletibb határok hosszúságának és a legészakibb és legdélibb határok szélességének a használatával. @hu
definition: Liittää aineiston paikkaan, joka määrittää aineiston kartografisen sisällön kattaman alueen indentifioidaan käyttämällä läntisimmän ja itäisimmän rajan pituusastetta sekä pohjoisimman ja eteläisimmän rajan leveysastetta. @fi
definition: Relaciona un recurs amb un lloc que és l’àrea d'abast d’un recurs cartogràfic que s’identifica usant la longitud dels límits occidental i oriental i la latitud dels límits septentrional i meridional. @ca
definition: Relaterer en ressource til et system til identificering af det område, der dækkes af en ressources kartografiske indhold; anvender længdegrader for de vestligste og østligste grænser samt breddegrader for de nordligste og sydligste grænser. @da
definition: Relates a resource to a place that is the area of coverage of a cartographic resource that is identified using the longitude of the westernmost and easternmost boundaries and the latitude of the northernmost and southernmost boundaries.
definition: Setzt eine Ressource in Beziehung zu einem Gebiet, das den Abdeckungsbereich des kartografischen Inhalts einer Ressource anhand des Längengrads der westlichsten und östlichsten Grenze sowie des Breitengrads der nördlichsten und südlichsten Grenze identifiziert. @de
definition: يربط بين مصدر ومكان يحدد المنطقة التي يغطيها المحتوى الخرائطي لمصدر باستخدام خط الطول لأقصى الحدود الغربية والشرقية وخط العرض لأقصى الحدود الشمالية والجنوبية. @ar
definition: 将一种资源与作为一种地图资源的覆盖范围、用最西和最东边界的经度以及最北和最南边界的纬度标识的一个地点关联起来。 @zh-hans

has right ascension and declination
lexical alias: rightAscensionAndDeclination.en
status: Published
type: Property
label: har rektascension og deklination @da
label: hat Rektaszension und Deklination @de
label: heeft rechte klimming en declinatie @nl
label: rektaskensio ja deklinaatio aineistossa @fi
label: rektaszcenziója és deklinációja a következő: @hu
label: yükseliş ve sapma ile ilişkilidir @tr
label: له صعود مستقيم وانحراف @ar
label: 有赤经和赤纬 @zh-hans
sub property of: has coordinates of cartographic content
inverse of: is right ascension and declination of
definition: Bir kaynağı, doğru yükselme ve sapma açılarını kullanarak bir kaynağın kartografik içeriği tarafından kapsanan gökyüzündeki bir gök cisminin konumunu tanımlamaya yönelik bir sistemle ilişkilendirir. @tr
definition: Hozzákapcsol egy forrást egy rendszerhez, amelynek célja egy forrás kartográfiai tartalma által lefedett területen az égbolton egy égitest helyzetének meghatározása rektaszcenzióval és a deklináció szögeinek használatával. @hu
definition: Liittää aineiston järjestelmään, joka määrittää aineiston kartografiseen sisältöön kuuluvan taivaankappaleen sijainnin käyttämällä rektaskension ja deklinaation kulmamittoja. @fi
definition: Relaciona un recurs amb un lloc que és la localització d’un cos celeste que és l’àrea d'abast d’un recurs cartogràfic i s’identifica usant els angles d’ascensió recta i declinació. @ca
definition: Relaterer en ressource til et system til identificering af den placering af et himmellegeme på himlen, der dækkes af en ressources kartografiske indhold, ved anvendelse af vinklerne for rektascension og deklination. @da
definition: Relates a resource to a place that is the location of a celestial body that is the coverage of a cartographic resource and is identified using the angles of right ascension and declination.
definition: Setzt eine Ressource in Beziehung zu einem System zur Identifizierung der Position eines Himmelskörpers am Himmel, die vom kartografischen Inhalt einer Ressource, unter Verwendung der Winkel der Rektaszension und der Deklination, abgedeckt wird. @de
definition: يربط بين مصدر ونظام لتحديد موقع جسم سماوي في السماء مغطى بمحتوى خرائطي لمصدر ما باستخدام زوايا الصعود المستقيم والانحراف. @ar
definition: 将一种资源与作为一个天体的位置并作为一种地图资源的覆盖范围并用赤经和赤纬的角度标识的一个地点关联起来。 @zh-hans

has strings of coordinate pairs
lexical alias: stringsOfCoordinatePairs.en
status: Published
type: Property
label: har hjørnekoordinater @da
label: hat Reihen von Koordinatenpaaren @de
label: heeft tekenreeksen van coördinatenparen @nl
label: koordinaattiparit aineistossa @fi
label: koordinat çifti dizgesi ile ilişkilidir @tr
label: koordinátapár-láncai a következők: @hu
label: له خطوط إحداثيات مزدوجة @ar
label: 有坐标对串 @zh-hans
sub property of: has coordinates of cartographic content
inverse of: is strings of coordinate pairs of
definition: Bir kaynağı, bir çokgenin her köşesi için koordinatlar kullanarak bir kaynağın kartografik içeriği tarafından kapsanan kesin alanı tanımlamaya yönelik bir sistemle ilişkilendirir. @tr
definition: Hozzákapcsol egy forrást egy rendszerhez, amelynek célja, hogy azonosítson egy forrás kartográfiai tartalma által lefedett pontos területet, használva a poligon minden egyes töréspontjára vonatkozó koordinátát. @hu
definition: Liittää aineiston järjestelmään, joka täsmällisesti määrittää kartografisen aineiston kattaman alueen käyttämällä monikulmion jokaisen kärjen koordinaatteja. @fi
definition: Relaterer en ressource til et system til identificering af det præcise areal, der dækkes af en ressources kartografiske indhold; anvender koordinater for hvert af en polygons toppunkter. @da
definition: Relates a resource to a system for identifying the precise area covered by the cartographic content of a resource using coordinates for each vertex of a polygon.
definition: Setzt eine Ressource in Beziehung zu einem System zur Identifizierung des genauen Gebiets, das durch den kartografischen Inhalt einer Ressource abgedeckt wird, indem Koordinaten für jeden Eckpunkt eines Vielecks verwendet werden. @de
definition: يربط بين مصدر ونظام لتحديد المنطقة المعينة التي يغطيها المحتوى الخرائطي لمصدر ما باستخدام إحداثيات لكل قمة مضلع. @ar
definition: 将一种资源与使用一个多边形每个角的坐标标识一种资源的地图内容所覆盖的精确范围的一个系统关联起来。 @zh-hans

has system of organization
lexical alias: systemOfOrganization.en
status: Published
type: Property
label: Ordnungssystem @de
label: aineiston järjestämisperiaate @fi
label: har organiseringssystem @da
label: heeft systeem van organisatie @nl
label: organizasyon sistemi ile ilişkilidir @tr
label: szervezeti rendszere a következő: @hu
label: له نظام للترتيب @ar
label: 有组织体系 @zh-hans
definition: Bir kaynağı, bir arşiv kaynağındaki veya koleksiyondaki materyalleri bir düzenleme sistemiyle ilişkilendirir. @tr
definition: Hozzákapcsol egy forrást egy anyagok rendezésére szolgáló rendszerhez egy levéltári forrásban vagy gyűjteményben. @hu
definition: Liitää aineiston arkiston tai kokoelman järjestämisessä käytettyyn järjestelmään. @fi
definition: Relaterer en ressource til et system til organisering af materialer i en arkivressource eller samling. @da
definition: Relates a resource to a system of arranging materials in an archival resource or a collection.
definition: Setzt eine Ressource in Beziehung zu einem System, um Materialien in einer archivalischen Ressource oder einer Sammlung zu ordnen. @de
definition: يربط بين مصدر ونظام ترتيب المواد في مصدر أرشيفي أو مجموعة أرشيفية. @ar
definition: 将一种资源与一种档案资源或一种收藏中编排资料的一个体系关联起来。 @zh-hans

has broadcast standard
lexical alias: broadcastStandard.en
status: Published
type: Property
label: har transmissionsstandard @da
label: hat Sendestandard @de
label: heeft uitzendstandaard @nl
label: lähetysstandardi aineistossa @fi
label: műsorszórási szabványa a következő: @hu
label: yayın standardı ile ilişkilidir @tr
label: له معيار بث @ar
label: 有广播标准 @zh-hans
sub property of: has video characteristic
definition: Bir kaynağı, televizyon yayını için bir video kaynağını biçimlendirmek için kullanılan bir sistemle ilişkilendirir. @tr
definition: Hozzákapcsol egy forrást egy rendszerhez, amelyet egy videóforrás formátumaként használnak televíziós műsorszóráshoz. @hu
definition: Liittää aineiston järjestelmään, jonka mukaisesti videoaineisto muunnetaan televisiolähetystä varten. @fi
definition: Relaterer en ressource til et system, der anvendes til at formatere en videoressource til tv-transmission. @da
definition: Relates a resource to a system used to format a video resource for television broadcast.
definition: Setzt eine Ressource in Beziehung zu einem System, das zur Formatierung einer Videoressource für eine Fernsehsendung verwendet wird. @de
definition: يربط بين مصدر ونظام مستخدم لتهيئة مصدر فيديو للبث التلفزيوني. @ar
definition: 将一种资源与用于电视广播的一种视频资源的格式的一个体系关联起来。 @zh-hans

has digital file characteristic
has subproperty: has regional encoding
has subproperty: has file type
has subproperty: has encoding format
has subproperty: has digital representation of cartographic content
has subproperty: has resolution
has subproperty: has file size
has subproperty: has encoded bitrate
lexical alias: digitalFileCharacteristic.en
status: Published
type: Property
label: digitaalisen tiedoston ominaisuus aineistossa @fi
label: digitális fájl jellemzője a következő: @hu
label: dijital dosya özelliği ile ilişkilidir @tr
label: har digitale filkarakteristika @da
label: hat Eigenschaft einer digitalen Datei @de
label: heeft kenmerken digitale bestand @nl
label: له خاصية ملف رقمي @ar
label: 有数字文件特征 @zh-hans
definition: Bir kaynağı, bir kaynaktaki metin, görüntü, ses, video ve diğer veri türlerinin dijital olarak kodlanmasıyla ilgili teknik özellik ile ilişkilendirir. @tr
definition: Hozzákapcsol egy forrást egy műszaki specifikációhoz, amely egy forrásban a szöveg, kép, hang, videó és más adattípusok digitális kódolásához kapcsolódik. @hu
definition: Liittää aineiston aineiston sisältämän tekstin, kuvan, äänen, videon tai muun datan digitaaliseen koodauksen tekniseen määritykseen. @fi
definition: Relaterer en ressource til en teknisk specifikation relateret til den digitale kodning af tekst, billede, audio-, video- og andre datatyper i en ressource. @da
definition: Relates a resource to a technical specification relating to a digital encoding of text, image, audio, video, and other types of data in a resource.
definition: Setzt eine Ressource in Beziehung zu einer technischen Spezifikation, die sich auf die digitale Kodierung von Text, Bild, Audio, Video und anderen Datentypen in einer Ressource bezieht. @de
definition: يربط بين مصدر ومواصفات فنية متعلقة بتشفير رقمي لنص، صورة، صوت، فيديو، وأي نوع بيانات آخر في مصدر. @ar
definition: 将一种资源与和一种资源中的文本、图像、音频、视频或其他类型数据的数字编码有关的一个技术规格关联起来。 @zh-hans

has sound characteristic
has subproperty: has special playback characteristic
has subproperty: has track configuration
has subproperty: has groove characteristic
has subproperty: has type of recording
has subproperty: has configuration of playback channels
has subproperty: has tape configuration
has subproperty: has playing speed
has subproperty: has recording medium
lexical alias: soundCharacteristic.en
status: Published
type: Property
label: hangjellemzője a következő: @hu
label: har lydkarakteristika @da
label: hat Toneigenschaft @de
label: heeft kenmerken geluid @nl
label: ses özelliği ile ilişkilidir @tr
label: äänen ominaisuudet aineistossa @fi
label: له خاصية صوت @ar
label: 有声音特征 @zh-hans
definition: Bir kaynağı, bir kaynaktaki ses kodlanmasıyla ilgili teknik özellikler ile ilişkilendirir. @tr
definition: Hozzákapcsol egy forrást egy műszaki specifikációhoz, amely egy forrásban a hang kódolásához kapcsolódik. @hu
definition: Liittää aineiston aineiston sisältämän äänen koodaamisen tekniseen määritykseen. @fi
definition: Relaterer en ressource til en teknisk specifikation relateret til kodning af lyd i en ressource. @da
definition: Relates a resource to a technical specification relating to an encoding of sound in a resource.
definition: Setzt eine Ressource in Beziehung zu einer technischen Spezifikation, die sich auf die Kodierung des Tons in einer Ressource bezieht. @de
definition: يربط بين مصدر ومواصفات فنية متعلقة بتشفير صوت في مصدر. @ar
definition: 将一种资源与和一种资源中的声音的编码有关的一个技术规格关联起来。 @zh-hans

has video characteristic
has subproperty: has video format
has subproperty: has broadcast standard
lexical alias: videoCharacteristic.en
status: Published
type: Property
label: har videokarakteristika @da
label: hat Video-Eigenschaft @de
label: heeft kenmerken video @nl
label: video özelliği ile ilişkilidir @tr
label: videon ominaisuudet aineistossa @fi
label: videójellemzője a következő: @hu
label: له خاصية فيدبو @ar
label: 视频特征 @zh-hans
definition: Bir kaynağı, bir kaynaktaki video görüntülerinin kodlanmasıyla ilgili teknik özellikler ile ilişkilendirir. @tr
definition: Hozzákapcsol egy forrást egy műszaki specifikációhoz, amely egy forrásban a videóképek kódolásához kapcsolódik. @hu
definition: Liittää aineiston aineiston sisältämän videon koodauksen tekniseen määritykseen. @fi
definition: Relaterer en ressource til en teknisk specifikation relateret til kodning af videobilleder i en ressource. @da
definition: Relates a resource to a technical specification relating to an encoding of video images in a resource.
definition: Setzt eine Ressource in Beziehung zu einer technischen Spezifikation, die sich auf die Kodierung der Videobilder in einer Ressource bezieht. @de
definition: يربط بين مصدر ومواصفات فنية متعلقة بتشفير صور فيديو في مصدر. @ar
definition: 将一种资源与和一种资源中的视频的编码有关的一个技术规格关联起来。 @zh-hans

has projection characteristic of motion picture film
has subproperty: has presentation format
has subproperty: has projection speed
lexical alias: projectionCharacteristicOfMotionPictureFilm.en
status: Published
type: Property
label: elokuvafilmin projisointiominaisuudet aineistossa @fi
label: har projektionskarakteristika for film @da
label: hat Projektionseigenschaft von Filmen @de
label: heeft kenmerken van de projectie van speelfilm @nl
label: mozgókép vetítési jellemzője a következő: @hu
label: sinema filminin projeksiyon özelliği ile ilişkilidir @tr
label: له خاصية عرض لفيلم صور متحركة @ar
label: 有电影胶卷的投影特征 @zh-hans
definition: Bir kaynağı, bir sinema filminin projeksiyonu ile ilgili teknik özellikler ile ilişkilendirir. @tr
definition: Hozzákapcsol egy forrást egy műszaki specifikációhoz, amely egy filmen lévő mozgókép vetítéséhez kapcsolódik. @hu
definition: Liittää aineiston elokuvafilmin projisointia koskevaan tekniseen määritykseen. @fi
definition: Relaterer en ressource til en teknisk specifikation relateret til projektion af en film. @da
definition: Relates a resource to a technical specification relating to the projection of a motion picture film.
definition: Setzt eine Ressource in Beziehung zu einer technischen Spezifikation, die sich auf die Projektion eines Films bezieht. @de
definition: يربط بين مصدر ومواصفات فنية متعلقة بعرض فيلم صور متحركة. @ar
definition: 将一种资源与和一种电影胶卷的投影有关的技术规格关联起来。 @zh-hans

is adapted as television program
lexical alias: adaptedAsTelevisionProgram.en
status: Published
type: Property
label: er bearbejdet til tv-program @da
label: is bewerkt als televisieprogramma @nl
label: ist bearbeitet als Fernsehsendung @de
label: televisiosovitus aineistosta @fi
label: televizyon programı olarak uyarlanmıştır @tr
label: televízióműsorként való feldolgozása a következő: @hu
label: هو مقتبَس كبرنامج تليفزيوني @ar
label: 被改编为电视节目 @zh-hans
sub property of: is adapted as
inverse of: is television adaptation of
definition: Bir kaynağı, başka bir kaynağı temel alan bir televizyon programıyla ilişkilendirir. @tr
definition: Hozzákapcsol egy forrást egy televízióműsorhoz, amely egy másik forráson alapul. @hu
definition: Liittää aineiston toiseen aineistoon perustuvaan televisio-ohjelmaan. @fi
definition: Relaterer en ressource til et TV-program baseret på en oprindelig ressource. @da
definition: Relates a resource to a television program based on another resource.
definition: Setzt eine Ressource in Beziehung zu einer Fernsehsendung, die auf einer anderen Ressource basiert. @de
definition: يربط بين مصدر وبرنامج تلفزيوني اعتمد على مصدر آخر. @ar
definition: 将一种资源与基于另一种资源的一种电视节目关联起来。 @zh-hans

has variant title of resource
lexical alias: variantTitleOfResource.en
status: Published
type: Property
label: aineiston varianttinimeke @fi
label: forrás címváltozata a következő: @hu
label: har varianttitel for ressource @da
label: hat abweichenden Titel einer Ressource @de
label: heeft variant titel van resource @nl
label: kaynağın alternatif başlığı ile ilişkilidir @tr
label: له عنوان مختلف لمصدر @ar
label: 有资源的变异题名 @zh-hans
sub property of: has title of resource
inverse of: is variant title of resource of
definition: Bir kaynağı, belirli bir uygulama veya bağlamda tercih edilmek üzere seçilmemiş bir kaynak başlığıyla ilişkilendirir. @tr
definition: Hozzákapcsol egy forrást egy forrás címéhez, amelyet egy adott alkalmazásban vagy összefüggésben nem részesítenek előnyben. @hu
definition: Liittää aineiston aineiston nimekkeeseen, jota ei ole valittu ensisijaiseksi nimikkeeksi tietyssä sovelluksessa tai kontekstissa. @fi
definition: Relaterer en ressource til en titel, der er knyttet til en ressource, der afviger fra en titel, der er registreret som hovedtitel, parallel hovedtitel, andre titeloplysninger, andre parallel titeloplysninger, tidligere hovedtitel, senere hovedtitel, nøgletitel eller forkortet titel. @da
definition: Relates a resource to a title of resource that is not selected for preference in a specific application or context.
definition: Setzt eine Ressource in Beziehung zu einem Titel einer Ressource, der in einer bestimmten Anwendung oder in einem bestimmten Kontext nicht als Vorzugsform bestimmt wird. @de
definition: يربط بين مصدر وعنوان مصدر لم يتم اختياره كعنوان مختلف مفضل في تطبيق محدد أو سياق محدد. @ar
definition: 将一种资源与没有在一个特定的应用或语境中被首选的一个资源的题名关联起来。 @zh-hans

has hereditary title
lexical alias: hereditaryTitle.en
status: Published
type: Property
label: har arvelig titel @da
label: hat Erbtitel @de
label: heeft erfelijke titel @nl
label: peritty arvonimi @fi
label: soyluluk unvanı ile ilişkilidir @tr
label: örökletes titulusa a következő: @hu
label: له عنوان تقليدي @ar
label: 有世袭头衔 @zh-hans
definition: Bir temsilciyi, bir temsilciyle bağlantılı olan bir soyluluk unvanı vb. ile ilişkilendirir. @tr
definition: Hozzákapcsol egy ágenst egy ágenssel társított nemesi címhez, stb-hez. @hu
definition: Liittää toimijan häneen liittyvään aatelisnimeen tms. @fi
definition: Relaciona un agent amb una paraula o frase indicativa de reialesa, noblesa, etc., associada amb un agent. @ca
definition: Relaterer ressource til en adelstitel etc., knyttet til en agent. @da
definition: Relates an agent to a word or phrase indicative of royalty, nobility, etc., associated with an agent.
definition: Setzt einen Akteur in Beziehung zu einem Adelstitel und so weiter, der mit einem Akteur in Verbindung steht. @de
definition: يربط بين وكيل ولقب نبالة، إلخ.، مرتبط بوكيل. @ar
definition: 将一个行为者与和一个行为者有关的表示皇室、贵族等的一个词或短语关联起来。 @zh-hans

has later title proper (Deprecated)
lexical alias: laterTitleProper.en
status: Deprecated
type: Property
label: har senere hovedtitel @da
sub property of: has title
definition: Relaterer en ressource til en hovedtitel, der optræder på et senere nummer eller en senere del af et flerbindsværk eller et periodikum, og som afviger fra den titel, der fremgår af første eller tidligste nummer eller del.. @da
definition: Relates a resource to a title proper appearing on a later issue or part of a multipart monograph or serial that differs from that on the first or earliest issue or part. (Deprecated)

has earlier title proper (Deprecated)
lexical alias: earlierTitleProper.en
status: Deprecated
type: Property
label: har tidligere hovedtitel @da
sub property of: has title
definition: Relaterer en ressource til en hovedtitel, der forekommer på en tidligere iteration af en integrerende ressource, der afviger fra hovedtitlen på den aktuelle iteration. @da
definition: Relates a resource to a title proper appearing on an earlier iteration of an integrating resource that differs from that on a current iteration. (Deprecated)

has abbreviated title
lexical alias: abbreviatedTitle.en
status: Published
type: Property
label: aineiston lyhennetty nimeke @fi
label: har forkortet titel @da
label: hat Kurztitel @de
label: heeft afgekorte titel @nl
label: kısaltılmış başlık ile ilişkilidir @tr
label: rövidített címe a következő: @hu
label: له عنوان مُختصر @ar
label: 有缩略题名 @zh-hans
sub property of: has title
inverse of: is abbreviated title of
definition: Bir kaynağı, dizinleme veya tanımlama amacıyla kısaltılmış bir başlıkla ilişkilendirir. @tr
definition: Hozzákapcsol egy forrást egy címhez, amelyet indexelési vagy azonosítási célokból rövidítettek. @hu
definition: Liittää aineiston nimekkeeseen, joka on lyhennetty indeksointia tai tunnistamista varten. @fi
definition: Relaterer en ressource til en titel, der er forkortet mhp. indeksering eller identifikation. @da
definition: Relates a resource to a title that is abbreviated for purposes of indexing or identification.
definition: Setzt eine Ressource in Beziehung zu einem Titel, der zum Zwecke der Indexierung oder der Identifizierung gekürzt ist. @de
definition: يربط بين مصدر وعنوان تم اختصاره لأغراض التكشيف أو التحديد. @ar
definition: 将一种资源与为索引或标识的目的而被缩略的一个题名关联起来。 @zh-hans

has place of residence
lexical alias: placeOfResidence.en
status: Published
type: Property
label: asuinpaikka @fi
label: har opholdssted etc. @da
label: hat Wohnort @de
label: heeft plaats van verblijf @nl
label: ikamet yeri ile ilişkilidir @tr
label: lakóhelye a következő: @hu
label: له مكان إقامة @ar
label: 有居住地 @zh-hans
sub property of: has related place of agent
inverse of: is place of residence of
definition: Bir temsilciyi, bir temsilcinin şu an veya önceden ikamet ettiği bir kasaba, şehir, il, eyalet veya ülke veya doğum yeri, ölüm yeri veya ikamet yeri dışında bir temsilci ile baplantılı olan başka bir önemli yer ile ilişkilendirir. @tr
definition: Hozzákapcsol egy ágenst egy településhez, régióhoz, államhoz vagy országhoz, amely az ágens jelenlegi vagy volt lakhelye, vagy az ágenshez kapcsolódó egyéb fontos helyhez, amely nem születési vagy halálozási hely, illetve lakhely. @hu
definition: Liittää toimijan kaupunkiin, maakuntaan, osavaltioon tai maahan, jossa hän asuu tai on asunut, tai muuhun häneen liittyvään merkittävään paikkaan kuin syntymä-, kuolin- tai asuinpaikka. @fi
definition: Relaciona un agent amb un lloc on un agent resideix o ha residit. @ca
definition: Relaterer en ressource til en landsby, by, region, stat og/eller land, hvor en agent bor eller har boet, eller andet væsentligt sted forbundet med agenten, bortset fra fødested, dødssted eller bopæl. @da
definition: Relates an agent to a place where an agent resides or has resided.
definition: Setzt einen Akteur in Beziehung zu einem Ort, einer Stadt, einem Bundesland, einem Staat oder einem Land, in dem er wohnt oder gewohnt hat, oder zu einem anderen bedeutenden Ort, der mit einem Akteur in Verbindung steht, außer dem Geburts-, Sterbe- oder Wohnort. @de
definition: يربط بين وكيل وبلدة، مدينة، مُقاطعة، ولاية، أو بلد يقيم فيها الوكيل أو أقام فيها بالفعل، أو أي مكان هام آخر مرتبط بوكيل بخلاف مكان الميلاد أو مكان الوفاة، أو الإقامة. @ar
definition: 将一个行为者与一个行为者居住或居住过的地点关联起来。 @zh-hans
scope note: A hely, ahol egy ágens dolgozott vagy tanult, szintén idetartozik. @hu
scope note: A place where an agent has worked or studied is included.
scope note: Bir temsilcinin çalıştığı veya öğrenim gördüğü yer dahildir. @tr
scope note: Darunter fällt ein Geografikum, in dem ein Akteur gearbeitet oder studiert hat. @de
scope note: Koskee paikkaa, jossa toimija on työskennellyt tai opiskellut. @fi
scope note: Sted, hvor en agent har arbejdet eller studeret er omfattet. @da
scope note: يشمل ذلك مكان عمل فيه وكيل أو درس فيه. @ar
scope note: 包括一个行为者工作过或学习过的一个地点。 @zh-hans

is adapted as video
lexical alias: adaptedAsVideo.en
status: Published
type: Property
label: er bearbejdet til video @da
label: is bewerkt als video @nl
label: ist bearbeitet als Video @de
label: video olarak uyarlanmıştır @tr
label: videosovitus (aineisto) @fi
label: videóként való feldolgozása a következő: @hu
label: هو مقتبَس كفيديو @ar
label: 被改编为视频 @zh-hans
sub property of: is adapted as
inverse of: is video adaptation of
definition: Bir kaynağı başka bir kaynağı temel alan bir video ile ilişkilendirir @tr
definition: Hozzákapcsol egy forrást egy videóhoz, amely egy másik forráson alapul. @hu
definition: Liittää aineiston videoon, joka perustuu toiseen aineistoon. @fi
definition: Relaterer en ressource til en video baseret på en oprindelig ressource. @da
definition: Relates a resource to a video based on another resource.
definition: Setzt eine Ressource in Beziehung zu einem Video, das auf einer anderen Ressource basiert. @de
definition: يربط بين مصدرً وفيديو مبني على مصدر آخر. @ar
definition: 将一种资源与基于另一种资源的一种视频关联起来。 @zh-hans

has prominent member of agent
lexical alias: prominentMemberOfFamily.en
status: Published
type: Property
label: har fremtrædende medlem af agent @da
label: hat bedeutendes Akteurmitglied @de
label: heeft prominent lid van actor @nl
label: temsilcinin seçkin üyesi ile ilişkilidir @tr
label: yhteistoimijan tunnettu jäsen @fi
label: ágens kiemelkedő tagja a következő: @hu
label: له عضو بارز لوكيل @ar
label: 有行为者的著名成员 @zh-hans
inverse of: is prominent member of agent of
definition: Bir temsilciyi, temsilcinin üyesi olduğu tanınmış bir birey ile ilişkilendirir. @tr
definition: Hozzákapcsol egy ágenst egy jól ismert egyénhez, aki egy ágens tagja. @hu
definition: Liittää yhteistoimijan tunnettuun henkilöön, joka on toimijan jäsen. @fi
definition: Relaciona un agent amb un agent que és un individu ben conegut que és un membre d’un agent. @ca
definition: Relaterer en ressource til et velkendt individ, der er medlem af en agent. @da
definition: Relates an agent to an agent who is a well-known individual who is a member of an agent.
definition: Setzt einen Akteur in Beziehung zu einem bekannten Individuum, das Mitglied eines Akteurs ist. @de
definition: يربط بين وكيل وفرد مشهور هو عضوًا لوكيل @ar
definition: 将一个行为者与作为名人也作为一个行为者成员的一个行为者关联起来。 @zh-hans

has term of rank or honour or office
lexical alias: termOfRankOrHonourOrOffice.en
status: Published
type: Property
label: har agents titel @da
label: hat Rang-, Ehren- oder Amtsbezeichnung @de
label: heeft term van rang, eer of ambt @nl
label: henkilön arvonimi tai asema @fi
label: rangot, hódolatot vagy hivatalt kifejező szava a következő: @hu
label: rütbe, onur veya makam ile ilişkilidir @tr
label: té com a terme de rang o de distinció o de càrrec @ca
label: له لقب رتبة، شرف، أو منصب @ar
label: 有等级或荣誉或职位的头衔 @zh-hans
alternative label: has term of rank, honour, or office
alternative label: té com a terme de rang, distinció o càrrec @ca
definition: Bir temsilciyi, kraliyet, soyluluk veya dini rütbe veya makama işaret eden bir kelime veya ifadeyle, dini mesleğe sahip bir temsilciye ilişkin bir hitap terimiyle veya rütbe, onur veya makama işaret eden başka bir terimle ilişkilendirir. @tr
definition: Hozzákapcsol egy ágenst egy királyi, nemesi, egyházi rangot vagy hivatalt jelentő szóhoz vagy kifejezéshez, vagy az ágensnek szóló vallási megszólítási formához, vagy egyéb rangot, hódolatot vagy hivatalt kifejező szóhoz. @hu
definition: Liittää henkilön sanaan tai ilmaukseen, joka osoittaa kuninkaallista tai aatelisarvoa, kirkollista virkaa tai asemaa tai uskonnolliseen tehtävään liittyvää puhuttelua. @fi
definition: Relaciona un agent amb una paraula o frase indicativa de reialesa, de noblesa, de rang, de distinció o de càrrec, o terme de tractament d’una persona de vocació religiosa. @ca
definition: Relaterer en ressource til et ord eller frase, der angiver kongelighed, adelskab, gejstlig rang eller embede, eller en tiltaleform for en agent med religiøst hverv. @da
definition: Relates an agent to a word or phrase indicative of royalty, nobility, rank, honour, or office, or a term of address for an agent of religious vocation.
definition: Setzt einen Akteur in Beziehung zu einem Wort oder einer Phrase, das/die auf die Zugehörigkeit zu einem Fürstentum, zum Adel, auf einen kirchlichen Rang oder ein kirchliches Amt hinweist, zu einer Anrede für einen Akteur mit religiöser Berufung oder zu einem anderen Begriff, der auf einen Rang, eine Ehre oder ein Amt hinweist. @de
definition: يربط بين وكيل وكلمة أو عبارة تُشير إلى رتبة، منصب ملكي، أو نبيل، أو منصب كنسيَّ، وهو لقب لوكيل له مهنة دينية، أو لقب آخر يدل على رتبة، شرف، أو منصب @ar
definition: 将一个行为者与表示皇室、贵族、教会级别或职位、或者一个宗教职业行为者的称谓的一个单词或短语、或者其他等级或荣誉或职位的头衔关联起来。 @zh-hans
scope note: A term of rank, honour, or office, includes initials or abbreviations representing an academic degree, or membership in an organization.
scope note: Un terme de rang, de distinció o de càrrec, inclou inicials o abreviacions que representen un grau acadèmic o la pertinença a una organització. @ca

has designation of named revision of edition
lexical alias: designationOfNamedRevisionOfEdition.en
status: Published
type: Property
label: adlandırılmış basım revizyonu ile ilişkilidir @tr
label: har betegnelse for en navngivet revision af en udgave @da
label: hat Ausgabebezeichnung einer näher erläuterten Überarbeitung @de
label: heeft aanduiding van een benoemde herziening van editie @nl
label: kiadás nevesített átdolgozásának jelölése a következő: @hu
label: uudistetun painoksen määrite aineistossa @fi
label: له تسمية لمراجعة مسماة لطبعة @ar
label: 有版本的命名修订的标识 @zh-hans
definition: Bir kaynağı bir kelime, karakter veya kelime ya da karakter grubuyla ilişkilendirerek adlandırılmış bir basımın ayrıntılı bir gözden geçirmeyle tanımlar. . @tr
definition: Hozzákapcsol egy forrást egy szóhoz, karakterhez, vagy szavak vagy karakterek egy csoportjához, amely azonosítja egy nevesített kiadás egy adott átdolgozását. @hu
definition: Liittää aineiston sanaan, merkkiin tai sanojen tai merkkien joukkoon, jotka identifioivat aineiston tietyn uudistetun painoksen. @fi
definition: Relaterer en ressource til et ord, tegn eller en gruppe af ord og/eller tegn, der identificerer en bestemt revision af en navngiven udgave. @da
definition: Relates a resource to a word, character or group of words or characters, identifying a particular revision of a named edition.
definition: Setzt eine Ressource in Beziehung zu einem Wort, einem Zeichen oder einer Gruppe von Wörtern oder Zeichen, das/die eine bestimmte Überarbeitung einer näher erläuterten Ausgabe identifiziert. @de
definition: يربط بين مصدر وكلمة، أو حرف، أو مجموعة من الكلمات، أو تمثيلات، تحدد مراجعة محددة لطبعة مسماة. @ar
definition: 将一种资源与标识一个命名版本的特定修订的词、字符或者词或字符的组合关联起来。 @zh-hans

has designation of edition
lexical alias: designationOfEdition.en
status: Published
type: Property
label: basım ile ilişkilidir @tr
label: har udgavebetegnelse @da
label: hat Ausgabebezeichnung @de
label: heeft aanduiding van editie @nl
label: kiadásjelölése a következő: @hu
label: painosmäärite aineistossa @fi
label: له تسمية لطبعة @ar
label: 有版本标识 @zh-hans
definition: Bir kaynağı bir kelime, karakter veya kelime ya da karakter grubuyla ilişkilendirerek kaynağın ait olduğu basımı tanımlar. @tr
definition: Hozzákapcsol egy forrást egy szóhoz, karakterhez, vagy szavak vagy karakterek egy csoportjához, amely azonosít egy kiadást, amelyhez egy forrás tartozik. @hu
definition: Liittää aineiston sanaan, merkkiin tai ryhmään sanoja ja/tai merkkejä, jotka identifioivat aineiston painoksen. @fi
definition: Relaterer en ressource til et ord, tegn eller en gruppe af ord og/eller tegn, der identificerer en udgave som en ressource tilhører. @da
definition: Relates a resource to a word, character or group of words or characters, identifying an edition to which a resource belongs.
definition: Setzt eine Ressource in Beziehung zu einem Wort, einem Zeichen oder einer Gruppe von Wörtern oder Zeichen, das/die die Ausgabe identifiziert, zu der eine Ressource gehört. @de
definition: يربط بين مصدر وكلمة، حرف، أو مجموعة من الكلمات أو تمثيلات، تحدد طبعة ينتمي لها مصدر. @ar
definition: 将一种资源与标识一种资源所属于的一个版本的词、字符或者词或字符的组合关联起来。 @zh-hans

has name of place
has subproperty: has preferred name of place
has subproperty: has variant name of place
lexical alias: nameOfPlace.en
status: Published
type: Property
label: har navn på et sted @da
label: hat Namen eines Geografikums @de
label: heeft naam van plaats @nl
label: helyneve a következő: @hu
label: paikan nimi @fi
label: yerin adı ile ilişkilidir @tr
label: له اسم مكان @ar
label: 有地点的名称 @zh-hans
sub property of: has name of entity
inverse of: is name of place of
definition: Bir yeri, doğal dilde ve ortak söylemde kullanılan ifadelerde yer alan bir yer adlandırmasıyla ilişkilendirir. @tr
definition: Hozzákapcsol egy helyet egy hely természetes nyelvi megnevezéséhez és a közbeszéd során használt megfogalmazásához. @hu
definition: Liittää paikan luonnollisen kielen ja sanamuodon mukaiseen, yleisessä diskurssissa käytettyyn paikan nimitykseen. @fi
definition: Relaciona un lloc amb un nomen que és una apel·lació de lloc en llenguatge i frases naturals usada en el discurs comú. @ca
definition: Relaterer en ressource til et ord, tegn eller gruppe af ord og/eller tegn, som et sted er kendt under. @da
definition: Relates a place to a nomen that is an appellation of place in natural language and phrasing used in common discourse.
definition: Setzt ein Geografikum in Beziehung zu einer Bezeichnung für ein Geografikum in natürlicher Sprache und Ausdrucksweise, die beim normalen Sprechen und Schreiben verwendet wird. @de
definition: يربط مكان بتسمية مكان فىي اللغة الطبيعية وفي العبارات المستخدمة في الخطاب العام. @ar
definition: 将一个地点与作为用自然语言和普通话语措词表达的一个地点之称谓的一个命名关联起来。 @zh-hans

has title of resource
has subproperty: has variant title of resource
has subproperty: has title of series
has subproperty: has preferred title of resource
lexical alias: titleOfResource.en
status: Published
type: Property
label: aineiston nimeke @fi
label: forrás címe a következő: @hu
label: har ressourcetitel @da
label: hat Titel einer Ressource @de
label: heeft titel van resource @nl
label: kaynak başlığı ile ilişkilidir @tr
label: له عنوان لمصدر @ar
label: 有资源的题名 @zh-hans
sub property of: has title
definition: Bir kaynağı, doğal dilde ve ortak söylemde kullanılan ifadelerdeki bir kaynak unvanıyla ilişkilendirir. @tr
definition: Hozzákapcsol egy forrást egy forrás természetes nyelvi megnevezéséhez és a közbeszéd során használt megfogalmazásához. @hu
definition: Liittää aineiston luonnollisen kielen ja sanamuodon mukaiseen, yleisessä diskurssissa käytettyyn aineiston nimitykseen. @fi
definition: Relaciona un recurs amb un nomen que és una apel·lació de recurs en llenguatge i frases naturals usada en el discurs comú. @ca
definition: Relaterer en ressource til en ressourcebenævnelse på naturligt sprog og med naturlige formuleringer, brugt i fælles diskurs. @da
definition: Relates a resource to a nomen that is an appellation of resource in natural language and phrasing used in common discourse.
definition: Setzt eine Ressource in Beziehung zu einer Bezeichnung für eine Ressource in natürlicher Sprache und Ausdrucksweise, die beim normalen Sprechen und Schreiben verwendet wird. @de
definition: يربط مكان بتسمية مصدر فىي اللغة الطبيعية وفي العبارات المستخدمة في الخطاب العام. @ar
definition: 将一种资源与作为用自然语言和普通话语措词表达的资源的称谓的一个命名关联起来。 @zh-hans

has name of agent
has subproperty: has variant name of agent
has subproperty: has preferred name of agent
lexical alias: nameOfAgent.en
status: Published
type: Property
label: har agents navn @da
label: hat Namen eines Akteurs @de
label: heeft naam van actor @nl
label: temsilcinin adı ile ilişkilidir @tr
label: toimijan nimi @fi
label: ágens neve a következő: @hu
label: له اسم وكيل @ar
label: 有行为者的名称 @zh-hans
sub property of: has appellation of entity
inverse of: is name of agent of
definition: Bir temsilciyi, doğal dildeki bir temsilci ünvanıyla ve ortak söylemde kullanılan ifadelerle ilişkilendirir. @tr
definition: Hozzákapcsol egy ágenst egy ágens természetes nyelvi megnevezéséhez és a közbeszéd során használt megfogalmazásához. @hu
definition: Liittää toimijan luonnollisen kielen ja sanamuodon mukaiseen, yleisessä diskurssissa käytettyyn toimijan nimitykseen. @fi
definition: Relaciona un agent amb un nomen que és una apel·lació d’agent en llenguatge i frases naturals usada en el discurs comú. @ca
definition: Relaterer en ressource til et ord, tegn eller gruppe af ord og/eller tegn, som en agent er kendt under. @da
definition: Relates an agent to a nomen that is an appellation of agent in natural language and phrasing used in common discourse.
definition: Setzt einen Akteur in Beziehung zu einer Bezeichnung für einen Akteur in natürlicher Sprache und Ausdrucksweise, die beim normalen Sprechen und Schreiben verwendet wird. @de
definition: يربط بين وكيل وتسمية وكيل فىي اللغة الطبيعية وفي العبارات المستخدمة في الخطاب العام. @ar
definition: 将一个行为者与作为用自然语言和普通话语措词表达的行为者的称谓的一个命名关联起来。 @zh-hans

has title
has subproperty: has later title proper (Deprecated)
has subproperty: has earlier title proper (Deprecated)
has subproperty: has abbreviated title
has subproperty: has title of resource
has subproperty: has other title information
has subproperty: has parallel other title information
has subproperty: has title proper
has subproperty: has parallel title proper
lexical alias: title.en
status: Published
type: Property
label: başlık ile ilişkilidir @tr
label: címe a következő: @hu
label: har titel @da
label: hat Titel @de
label: heeft titel @nl
label: nimeke @fi
label: له عنوان @ar
label: 有题名 @zh-hans
sub property of: has appellation of entity
definition: Bir varlığı, ortak söylemde kullanılan ifade ve doğal dildeki bir unvanla ilişkilendirir. @tr
definition: Hozzákapcsol egy entitást egy természetes nyelvi megnevezéshez és a közbeszéd során használt megfogalmazáshoz. @hu
definition: Liittää entiteetin luonnollisen kielen ja sanamuodon mukaiseen, yleisessä diskurssissa käytettyyn nimitykseen. @fi
definition: Relaciona una entitat amb un nomen que és una apel·lació en llenguatge i frases naturals usada en el discurs comú. @ca
definition: Relaterer en ressource til et ord, tegn, eller gruppe af ord og/eller tegn, som en ressource, eller en ressource som er indeholdt i denne, er kendt under.. @da
definition: Relates an entity to a nomen that is an appellation in natural language and phrasing used in common discourse.
definition: Setzt eine Entität in Beziehung zu einer Bezeichnung in natürlicher Sprache und Ausdrucksweise, die beim normalen Sprechen und Schreiben verwendet wird. @de
definition: يربط بين كيان وإسم فىي لغة طبيعية وفي العبارات المستخدمة في الخطاب العام. @ar
definition: 将一个实体与作为用自然语言和普通话语措词表达的一个命名关联起来。 @zh-hans

has other designation associated with agent (Deprecated)
lexical alias: otherDesignationAssociatedWithAgent.en
status: Deprecated
type: Property
label: har anden forklarende tilføjelse til agent @da
definition: Relaterer en ressource til et ord, frase eller forkortelse, der forklarer en agents art eller juridiske status, eller en tilføjelse, der tjener til at skelne agenten fra andre agenter etc., eller en term andet end titel der er knyttet til agentens navn. @da
definition: Relates a resource to a word, phrase, or abbreviation indicating incorporation or legal status of an agent, or any term serving to differentiate a an agent from other agents, etc., or a term other than a title that is associated with an agent’s name. (Deprecated)

has writer of added lyrics (Deprecated)
see also: has lyricist
lexical alias: writerOfAddedLyrics.en
status: Deprecated
type: Property
label: har forfatter af tilføjede sangtekster @da
sub property of: has writer of added text (Deprecated)
inverse of: is writer of added lyrics of (Deprecated)
definition: Relaterer en ressource til en forfatter af ord, der er tilføjet en musikressource. @da
definition: Relates a resource to a writer of words added to a musical resource. (Deprecated)
scope note: Forfattelse af sangtekster i samarbejde med en komponist for at skabe en originalressource er ikke omfattet. @da
scope note: Writing of lyrics in collaboration with a composer to form an original resource is excluded.. (Deprecated)

has summarization of content
lexical alias: summarizationOfContent.en
status: Published
type: Property
label: har opsummering af indhold @da
label: hat Zusammenfassung eines Inhalts @de
label: heeft samenvatting van content @nl
label: içeriğin özetlenmesi ile ilişkilidir @tr
label: sisällön yhteenveto aineistossa @fi
label: tartalom összefoglalása a következő: @hu
label: له تلخيص محتوى @ar
label: 有内容的概述 @zh-hans
definition: Bir kaynağı, bir kaynağın içeriğinin özü, özeti, sinopsisi veya kaynak içeriğinin başka bir açıklaması ile ilişkilendirir. @tr
definition: Hozzákapcsol egy forrást egy forrás tartalmának a referátumához, összefoglalásához, szinopszisához, vagy egyéb leírásához. @hu
definition: Liittää aineiston tiivistelmään, yhteenvetoon, synopsikseen tai muuhun aineiston sisällön kuvaukseen. @fi
definition: Relaterer en ressource til et abstrakt, et resumé, en synopsis etc. af en ressources indhold. @da
definition: Relates a resource to an abstract, summary, synopsis, or other description of the content of a resource.
definition: Setzt eine Ressource in Beziehung zu einem Abstract, einer Zusammenfassung, einer Synopse oder einer anderen Beschreibung des Inhalts einer Ressource. @de
definition: يربط بين مصدر ومستخلص، ملخص، موجز، أو وصف آخر لمحتوى أحد المصادر. @ar
definition: 将一种资源与一种资源的内容的摘要、概要、大纲或其他描述关联起来。 @zh-hans

has appellee
lexical alias: appellee.en
status: Published
type: Property
label: fellebezési alperese a következő: @hu
label: har indstævnet @da
label: hat Berufungsbeklagte/Berufungsbeklagten/Revisionsbeklagte/Revisionsbeklagten @de
label: heeft gedaagde @nl
label: muutoksenhakijan vastapuoli aineistossa @fi
label: temyiz edilen ile ilişkilidir @tr
label: له مُستأنف ضده @ar
label: 有被上诉者 @zh-hans
sub property of: has other agent associated with resource (Deprecated)
inverse of: is appellee of
definition: Bir kaynağı, bir üst mahkemenin yasal kaynağında kayıtlı bir alt mahkemenin kararına karşı temyize giden bir temsilci ile ilişkilendirir. @tr
definition: Hozzákapcsol egy forrást egy ágenshez, aki ellen fellebbezést nyújtanak be egy magasabb fokú bíróság jogi forrásában rögzített alacsonyabb fokú bírósági döntéssel kapcsolatban. @hu
definition: Liittää aineiston toimijaan, johon kohdistuu hakemus, jolla haetaan muutosta alemman oikeusasteen päätökseen. @fi
definition: Relaterer en ressource mod hvilken en indsigelse er gjort gennem en underrets beslutning, der er registreret i en juridisk ressource fra en højere retsinstans. @da
definition: Relates a resource to an agent against whom an appeal is taken on a decision of a lower court recorded in a legal resource of a higher court.
definition: Setzt eine Ressource in Beziehung zu einem Akteur, gegen den Rechtsmittel (Berufung/Revision) gegen ein Gerichtsurteil einer unteren Instanz, das in einer juristischen Ressource einer höheren Instanz erfasst ist, eingelegt werden. @de
definition: يربط مصدر بوكيل مستأنف ضده بحكم صادر عن محكمة أدنى مسجل في مصدر قانوني لمحكمة أعلى. @ar
definition: 将一种资源与在上级法院的一种法律资源中记录下级法院起诉该行为者之决定的一个行为者关联起来。 @zh-hans

has other agent associated with resource (Deprecated)
has subproperty: has degree granting institution
has subproperty: has host institution
has subproperty: has production company
has subproperty: has court governed
has subproperty: has medium
has subproperty: has appellee
has subproperty: has dedicator
has subproperty: has curator (Deprecated)
has subproperty: has honouree
has subproperty: has illuminator
has subproperty: has producer
has subproperty: has director
has subproperty: has restorationist
has subproperty: has sponsoring agent of resource
has subproperty: has director of photography
has subproperty: has dedicatee
has subproperty: has addressee
has subproperty: has appellant
has subproperty: has binder
has subproperty: has plaintiff
has subproperty: has inscriber
has subproperty: has judge
has subproperty: has defendant
has subproperty: has annotator
has subproperty: has autographer
has subproperty: has issuing agent
has subproperty: has granting institution or faculty (Deprecated)
has subproperty: has degree committee member
has subproperty: has participant in treaty
has subproperty: has researcher
has subproperty: has organizer
has subproperty: has editorial director
has subproperty: has founder agent of resource
lexical alias: otherAgentAssociatedWithResource.en
status: Deprecated
type: Property
label: har anden agent knyttet til ressource @da
inverse of: is other agent associated with resource of (Deprecated)
definition: Relaterer en ressource til en agent forskellig fra skaber, forvalter, ejer, producer, udgiver eller distributør knyttet til en ressource. @da
definition: Relates a resource to an agent other than a creator, custodian, owner, producer, publisher, distributor, or manufacturer associated with a resource. (Deprecated)

has dedicator
lexical alias: dedicator.en
status: Published
type: Property
label: dedikálója a következő: @hu
label: har tilegner @da
label: hat Widmende/Widmenden @de
label: heeft opdrager @nl
label: ithaf eden ile ilişkilidir @tr
label: omistuksen tekijä aineistossa @fi
label: له مُهدي كتاب @ar
label: 有题献者 @zh-hans
sub property of: has other agent associated with resource (Deprecated)
inverse of: is dedicator of
definition: Bir kaynağı, ilgili bir temsilcinin ilhamı veya desteğinin bir teşekkürü olarak bir eseri atfeden bir temsilci ilişkilendirir. @tr
definition: Hozzákapcsol egy forrást egy ágenshez, amely köszönetképpen megjelöl egy forrást egy kapcsolódó ágens inspirációjáért, támogatásáért cserébe. @hu
definition: Liittää aineiston toimijaan, joka omistaa aineiston liittyvälle toimijalle kiitoksena inspiraatiosta tai tuesta. @fi
definition: Relaterer en ressource til en agent, som har tilegnet en ressource. @da
definition: Relates a resource to an agent who assigns a resource as an acknowledgement of the inspiration or support of a related agent.
definition: Setzt eine Ressource in Beziehung zu einem Akteur, der eine Ressource als Zeichen der Anerkennung oder Unterstützung einem in Beziehung stehenden Akteur widmet. @de
definition: يربط مصدر بوكيل خصص مصدر كإقرار بإلهام أو دعم وكيل ذو صلة. @ar
definition: 将一种资源与指定一种资源作为一个相关行为者的启发或支持之感谢的一个行为者关联起来。 @zh-hans

has curator (Deprecated)
lexical alias: curator.en
status: Deprecated
type: Property
label: har kurator @da
label: hat Kuratorin/Kurator @de
label: heeft curator @nl
label: kuraattori @fi
label: kurátora a következő: @hu
label: له أمين معرض @ar
sub property of: has other agent associated with resource (Deprecated)
inverse of: is curator of (Deprecated)
definition: Hozzákapcsol egy forrást egy ágenshez, amely kigondolja, aggregálja vagy megszervezi egy forrás kiállítássá vagy gyűjteménnyé szervezését. @hu
definition: Liittää aineiston siitä näyttelyn tai kokoelman suunnittelevaan, kokoavaan tai järjestävään toimijaan. @fi
definition: Relaterer en ressource til en agent der har udtænkt, samlet og/eller arrangeret en udstilling, samling eller en anden ressource. @da
definition: Relates a resource to an agent who conceives, aggregates, or organizes an exhibition or collection of a resource. (Deprecated)
definition: Setzt eine Ressource in Beziehung zu einem Akteur, der eine Ausstellung oder Sammlung einer Ressource konzipiert, zusammenstellt oder organisiert. @de
definition: يربط مصدر بوكيل يبتكر، أو يجمع، أو ينظم معرضًا أو مجموعة من المصادر. @ar

has surveyor
lexical alias: surveyor.en
status: Published
type: Property
label: földmérője a következő: @hu
label: har landmåler @da
label: hat Landvermesserin/Landvermesser @de
label: heeft landmeter @nl
label: maanmittari aineistossa @fi
label: topograf ile ilişkilidir @tr
label: له مسّاح @ar
label: 有测绘者 @zh-hans
sub property of: has contributor (Deprecated)
inverse of: is surveyor of
definition: Bir kaynağı, bir coğrafi alan için ölçümler veya boyutsal ilişkiler sağlayan, kartografyaya katkıda bulunan bir temsilci olan bir temsilci ile ilişkilendirir. @tr
definition: Hozzákapcsol egy forrást egy kartográfia közreműködő ágenséhez, amely egy földrajzi területről méréseket vagy dimenziós összefüggéseket szolgáltat. @hu
definition: Liittää aineiston toimijaan, joka myötävaikuttaa kartantekijänä maantieteellisen alueen mittojen tai mittasuhteiden tuottamisessa. @fi
definition: Relaterer en ressource til en agent, der har bidraget til en kartografisk ressource ved at tilvejebringe opmålinger eller målestoksforhold til det geografiske område, der er repræsenteret. @da
definition: Relates a resource to an agent who is a contributor agent of cartography who provides measurements or dimensional relationships for a geographic area.
definition: Setzt eine Ressource in Beziehung zu einer Beiträgerin/einem Beiträger einer Kartografie (Akteur), die/der Messwerte oder Abmessungsverhältnisse für den dargestellten geografischen Bereich zur Verfügung stellt. @de
definition: يربط مصدر بوكيل مُساهم في رسم الخرائط ويُوفر القياسات أوالعلاقات بين الأبعاد لمنطقة جغرافية. @ar
definition: 将一种资源与作为地图绘制的贡献者行为者并为一个地理区域提供测量或尺寸关系的一个行为者关联起来。 @zh-hans

has animator
see also: has artist
lexical alias: animator.en
status: Published
type: Property
label: aineiston animaattori @fi
label: animatör ile ilişkilidir @tr
label: animátora a következő: @hu
label: har animator @da
label: hat Trickfilmzeichnerin/Trickfilmzeichner @de
label: heeft animator @nl
label: له فنان رسوم متحركة @ar
label: 有动画师 @zh-hans
sub property of: has contributor (Deprecated)
inverse of: is animator of
definition: Bir kaynağı, cansız nesnelere veya çizimlere görünür hareket vererek bir kaynağa katkıda bulunan bir temsilci ile ilişkilendirir. @tr
definition: Hozzákapcsol egy forrást egy ágenshez, amely élettelen tárgyak vagy rajzok látszólagos mozgatásával járul hozzá a forráshoz. @hu
definition: Liittää aineiston toimijaan, joka on aineistossa osallisena tuottamalla näennäistä liikettä elottomiin esineisiin tai piirroksiin. @fi
definition: Relaterer en ressource til en agent, der har bidraget til en ressource af et levende billedværk eller et computerprogram ved at give en illusion af bevægelse til livløse genstande eller tegninger. @da
definition: Relates a resource to an agent who contributes to a resource by giving apparent movement to inanimate objects or drawings.
definition: Setzt eine Ressource in Beziehung zu einem Akteur, der zu einer Ressource beiträgt, indem er unbelebte Objekte oder Zeichnungen in scheinbare Bewegung versetzt. @de
definition: يربط مصدر بوكيل يُساهم في مصدر من خلال إعطاء حركة واضحة للأجسام غير الحية أو الرسومات . @ar
definition: 将一种资源与通过给予无生命对象或绘画以貌似运动而对一种资源有贡献的一个行为者关联起来。 @zh-hans
scope note: Animasyonlu çizimlerin oluşturulması hariçtir @tr
scope note: Az animált rajzok megalkotása nem tartozik ide. @hu
scope note: Creation of the drawings that are animated is excluded.
scope note: Darunter fällt nicht die Schaffung der Zeichnungen, die animiert werden. @de
scope note: Ei koske animaatiopiirrosten tekijää. @fi
scope note: Skabelse af tegninger, der er animeret, er ikke omfattet. @da
scope note: يُستبعد إنشاء الرسومات المتحركة. @ar
scope note: 不包括动画图的创作。 @zh-hans

has arranger of music
see also: has composer
lexical alias: arrangerOfMusic.en
status: Published
type: Property
label: aineiston sovittaja @fi
label: har musikarrangør @da
label: hat Arrangeurin/Arrangeur @de
label: heeft arrangeur van muziek @nl
label: müzik aranjörü ile ilişkilidir @tr
label: zenei hangszerelője a következő: @hu
label: له موزع موسيقى @ar
label: 有音乐改编者 @zh-hans
sub property of: has contributor (Deprecated)
inverse of: is arranger of music of
definition: Bir kaynağı, kaynağın orijinal olarak amaçlandığından farklı bir performans ortamı için bir kompozisyonu yeniden yazarak bir kaynağa katkıda bulunan bir temsilci ile ilişkilendirir. @tr
definition: Hozzákapcsol egy forrást egy ágenshez, amely hozzájárul egy forráshoz egy zenei kompozíció olyan előadásmédiumra átírásával, amely különbözik a forrásnak eredetileg szánt médiumtól. @hu
definition: Liittää aineiston toimijaan, joka on aineistossa osallisena muokkaamalla sävellyksen alkuperäisteoksesta poikkeavalle esityskokoonpanolle. @fi
definition: Relaterer en ressource til en agent, der har bidraget til en musikressource ved at omskrive kompositionen til en anden besætning end den, ressourcen oprindeligt var beregnet til. @da
definition: Relates a resource to an agent who contributes to a resource by rewriting a composition for a medium of performance different from that for which a resource was originally intended.
definition: Setzt eine Ressource in Beziehung zu einem Akteur, der zu einer Ressource beiträgt, indem er eine Komposition für eine bestimmte Besetzung umschreibt, die sich von der Originalbesetzung, für die eine Ressource konzipiert ist, unterscheidet. @de
definition: يربط مصدر بوكيل يُساهم في مصدر من خلال إعادة كتابة لحن موسيقي لوسيط أداء يختلف عن الوسيط الذي كان المصدر مقررا له أصلاً. @ar
definition: 将一种资源与通过改写音乐作曲用于不同于其最初意图的一个表演媒介而对一种资源有贡献的一个行为者关联起来。 @zh-hans
scope note: A forrás módosítása egyező előadásmédiumra, stb., amikor alapvetően változatlanul megtartja az eredeti kompozíció zenei lényegét, is idetartozik. Nem tartoznak ide az egy új zenei forrás létrehozását eredményező lényegi változtatások. @hu
scope note: Bidrag omfatter ændring af en ressource for den samme besætning etc., der i alt væsentligt bevarer den originale kompositions musikalske substans uændret, og omfatter ikke væsentlige ændringer der resulterer i skabelsen af en ny musikressource. @da
scope note: Darunter fallen auch Varianten einer Ressource für die gleiche Besetzung und so weiter, solange die musikalische Substanz der Originalkomposition im Wesentlichen unverändert bleibt. Darunter fallen keine substantiellen Veränderungen, die zur Schaffung einer neuen Musikressource führen. @de
scope note: Modification of the resource for the same medium of performance, etc., keeping the musical substance of the original composition essentially unchanged, is included. Substantial modification that results in the creation of a new musical resource is excluded.
scope note: Orijinal bestenin müzikal özünü değiştirmeden, kaynağın aynı icra ortamı vb. için değiştirilmesi dahildir. Yeni bir müzikal kaynağın yaratılmasıyla sonuçlanan önemli değişiklikler hariç tutulmuştur. @tr
scope note: Sovittaja voi myös muokata aineistoa samalle esityskokoonpanolle tms. säilyttäen alkuperäisen sävellyksen musiikillisen sisällön olennaisilta osin muuttumattomana. Tähän ei sisälly laaja muokkaaminen, joka johtaa uuden musiikkiaineiston luomiseen. @fi
scope note: يتضمن تعديل المصدر لنفس وسيط أداء، إلخ.، مع الإبقاء على اللحن الأصلي دون تغيير جوهري.يُستبعد التعديل الجوهري الذي ينتج عنه إنشاء مصدر موسيقي جديد. @ar
scope note: 包括保留原作曲基本内容为同一个表演媒体等所作的资源的修改。不包括导致创作一种新的资源的大幅度修改。 @zh-hans

has writer of added text (Deprecated)
has subproperty: has writer of added lyrics (Deprecated)
lexical alias: writerOfAddedText.en
status: Deprecated
type: Property
label: har forfatter af tilføjet tekst @da
sub property of: has writer of supplementary textual content (Deprecated)
inverse of: is writer of added text of (Deprecated)
definition: Relaterer en ressource til en agent, der har bidraget til en ressource af et fortrinsvist ikke-tekstmæssigt værk ved at tilvejebringe tekst til den ikke-tekstmæssige ressource, fx ved at skrive billedtekster til fotos, beskrivelser af kort. @da
definition: Relates a resource to an agent who contributes to a primarily non-textual resource by providing text, such as writing captions for photographs or descriptions of maps. (Deprecated)

has draftsman
lexical alias: draftsman.en
status: Published
type: Property
label: aineiston piirtäjä @fi
label: har teknisk tegner @da
label: hat Technische Zeichnerin/Technischen Zeichner @de
label: heeft technisch tekenaar @nl
label: műszaki rajzolója a következő: @hu
label: teknik ressam ile ilişkilidir @tr
label: له رسام هندسي @ar
label: 有绘图者 @zh-hans
sub property of: has contributor (Deprecated)
inverse of: is draftsman of
definition: Bir kaynağı, binalar, gemiler, uçaklar, makineler, nesneler veya diğer yapılar için ayrıntılı planlar veya çizimler yaparak bir mimar, mucit veya başka bir temsilci tarafından bir kaynağa katkıda bulunan bir temsilci ile ilişkilendirir. @tr
definition: Hozzákapcsol egy forrást egy ágenshez, amely hozzájárul egy építész, feltaláló vagy egyéb ágens által létrehozott forráshoz azzal, hogy elkészíti épületek, hajók, repülőgépek, gépek, objektumok vagy egyéb konstrukciók részletes terveit vagy rajzait. @hu
definition: Liittää aineiston toimijaan, joka osallistuu arkkitehdin, suunnittelijan tai muun toimijan aineistoon tuottamalla tarkkoja suunnitelmia tai piirroksia rakennuksista, laivoista, lentokoneista, laitteista, esineistä tai muista luomuksista. @fi
definition: Relaterer en ressource til en agent, der har bidraget til en ressource af et værk af en arkitekt, opfinder etc. ved at lave detaljerede planer eller tegninger til bygninger, skibe, luftfartøjer, maskiner, genstande etc. @da
definition: Relates a resource to an agent who contributes to a resource by an architect, inventor, or other agent by making detailed plans or drawings for buildings, ships, aircraft, machines, objects, or other constructions.
definition: Setzt eine Ressource in Beziehung zu einem Akteur, der zu einer Expression einer Architektin/eines Architekten, einer Erfinderin/eines Erfinders oder eines anderen Akteurs beiträgt, indem er detaillierte Pläne oder Zeichnungen für Gebäude, Schiffe, Flugzeuge, Maschinen, Objekte oder andere Konstruktionen anfertigt. @de
definition: يربط مصدر بوكيل يُساهم في مصدر بواسطة مهندس معماري أو مخترع أو وكيل آخر من خلال وضع خطط أو رسومات مُفصلة للمباني، السفن، الطائرات، الآلات أو الأشياء أو غيرها من الإنشاءات. @ar
definition: 将一种资源与通过由建筑师、发明者或其他行为者为建筑物、船舶、飞行器、机器、物体或其他结构制作详细平面图或绘制草图而对一种资源有贡献的一个行为者关联起来。 @zh-hans

has transcriber
see also: has arranger of music
lexical alias: transcriber.en
status: Published
type: Property
label: aineiston transkriboija @fi
label: har nedskriver @da
label: hat Transkribiererin/Transkribierer @de
label: heeft transcribeerder @nl
label: yazıya aktaran ile ilişkilidir @tr
label: átírója a következő: @hu
label: له ناسخ @ar
label: 有转写者 @zh-hans
sub property of: has contributor (Deprecated)
inverse of: is transcriber of
definition: Bir kaynağı, yazılı olmayan veya not edilmemiş içeriği yazarak veya not ederek ya da bir notasyon sisteminden diğerine değiştirerek bir kaynağa katkıda bulunan bir temsilci ile ilişkilendirir. @tr
definition: Hozzákapcsol egy forrást egy ágenshez, amely korábban le nem írt vagy le nem jegyzett tartalom leírásával vagy lejegyzésével, vagy egyik jelölési rendszerről a másikra történő átvitelével járul hozzá egy forráshoz. @hu
definition: Liittää aineiston toimijaan, joka osallistuu aineiston tekemiseen kirjoittamalla muistiin tai nuotintamalla kirjoittattoman tai nuotintamattoman sisällön tai muuttamalla sen merkintäjärjestelmästä toiseen. @fi
definition: Relaterer en ressource til en agent, der har bidraget til en ressource af et værk ved at nedskrive eller notere uskrevet eller ikke-noteret indhold, eller ved at ændre det fra et notationssystem til et andet. @da
definition: Relates a resource to an agent who contributes to a resource by writing down or notating unwritten or unnotated content, or by changing it from one system of notation to another.
definition: Setzt eine Ressource in Beziehung zu einem Akteur, der zu einer Ressource beiträgt, indem er ungeschriebenen und nicht notierten Inhalt niederschreibt oder ihn von einem Notationssystem in ein anderes überträgt. @de
definition: يربط مصدر بوكيل يُساهم في مصدر بواسطة كتابة أو تدوين محتوى لم تسبق كتابته أو تدوينه، أو عن طريق تغييره من نظام تدوين إلى آخر. @ar
definition: 将一种资源与通过写下或记谱之前未写下或未记谱的内容或者将其从一种记谱体系改成另一种记谱体系而对一种资源有贡献的一个行为者关联起来。 @zh-hans
scope note: Afskrift af en musikressource for et andet instrument, eller optrædende gruppe, er ikke omfattet. @da
scope note: Bir müzik kaynağının farklı bir enstrüman veya performans grubu için transkripsiyonu hariçtir. @tr
scope note: Darunter fällt keine Transkription einer Musikressource für ein anderes Instrument oder ein anderes aufführendes Ensemble. @de
scope note: Egy zenei forrás átirata egy másik hangszerre vagy előadói csoportra nem tartozik ide. @hu
scope note: Transcription of a musical resource for a different instrument or performing group is excluded.
scope note: Tähän ei kuulu musiikkiteoksen transkribointi eri soittimelle tai esitysryhmälle. @fi
scope note: يُستبعد اِستِنساخ مصدر موسيقي لآلة أو مجموعة أداء مختلفة. @ar
scope note: 不包括为不同乐器或表演组合所作的音乐资源的改写。 @zh-hans

has musical director
lexical alias: musicalDirector.en
status: Published
type: Property
label: har orkesterleder @da
label: hat Musikalische Leiterin/Musikalischen Leiter @de
label: heeft muzikaal director @nl
label: musiikillinen johtaja aineistossa @fi
label: müzik yönetmeni ile ilişkilidir @tr
label: zenei rendezője a következő: @hu
label: له مُخرج موسيقي @ar
label: 有音乐总监 @zh-hans
sub property of: has contributor (Deprecated)
inverse of: is musical director of
definition: Bir kaynağı, hareketli bir görüntü yapımı veya müzikal ya da dramatik bir sunum veya eğlence için bestecilerin, ses editörlerinin ve ses birleştiricilerin faaliyetlerini koordine ederek bir kaynağa katkıda bulunan bir temsilci ile ilişkilendirir. @tr
definition: Hozzákapcsol egy forrást egy ágenshez, amely hozzájárul egy forráshoz azzal, hogy mozgókép-produkcióban, zenei, vagy drámai előadásban, vagy szórakoztató műsorban összehangolja zeneszerzők, hangszerkesztők és hangkeverők cselekedeteit. @hu
definition: Liittää aineiston toimijaan, joka on aineistossa osallisena koordinoimalla säveltäjien, äänileikkaajien ja äänimiksaajien toimintaa elokuvatuotannossa tai musiikki- tai näytelmäesityksessä. @fi
definition: Relaterer en ressource til en agent, der har bidraget til een ressource ved at koordinere komponistens, tonemesterens og lydmixernes aktiviteter ved en levende billedproduktion eller en musikalsk eller dramatisk præsentation eller i underholdning. @da
definition: Relates a resource to an agent who contributes to a resource by coordinating the activities of composers, sound editors, and sound mixers for a moving image production or for a musical or dramatic presentation or entertainment.
definition: Setzt eine Ressource in Beziehung zu einem Akteur, der zu einer Ressource beiträgt, indem er die Arbeit der Komponistin/des Komponisten, der Tonbearbeiterin/des Tonbearbeiters und der Tonmeisterin/des Tonmeisters für eine Bewegtbildproduktion oder eine musikalische oder dramatische Darbietung oder Aufführung koordiniert. @de
definition: يربط مصدر بوكيل يُساهم في مصدر من خلال تنسيق أنشطة ملحني؛ ومحرري؛ و مازجي الصوت لإنتاج فيلم؛ أو لعرض موسيقي أو درامي أو ترفيهي. @ar
definition: 将一种资源与通过为动态图像制作或者为音乐或戏剧呈现或娱乐协调作曲者、音响编辑、音响师活动而对一种资源有贡献的一个行为者关联起来。 @zh-hans

has costume designer
lexical alias: costumeDesigner.en
status: Published
type: Property
label: har kostumedesigner @da
label: hat Kostümbildnerin/Kostümbildner @de
label: heeft kostuumontwerper @nl
label: jelmeztervezője a következő: @hu
label: kostüm tasarımcısı ile ilişkilidir @tr
label: puvustaja aineistossa @fi
label: له مصمم أزياء @ar
label: 有服装设计者 @zh-hans
sub property of: has contributor (Deprecated)
inverse of: is costume designer of
definition: Bir kaynağı, hareketli bir görüntü yapımı veya müzikal ya da dramatik bir sunum veya eğlence için kostüm tasarlayarak bir kaynağa katkıda bulunan bir temsilci ile ilişkilendirir. @tr
definition: Hozzákapcsol egy forrást egy ágenshez, amely mozgókép-produkciók, zenei vagy drámai előadások vagy szórakoztató műsorok számára jelmezek tervezésével járul hozzá egy forráshoz. @hu
definition: Liittää aineiston toimijaan, joka on aineistossa osallisena suunnittelemalla elokuvatuotannon tai musiikki- tai näytelmäesityksen puvustuksen. @fi
definition: Relaterer en ressource til en agent, der har bidraget til en ressource ved at designe kostumer til en levende billedproduktion eller til en musikalsk eller dramatisk præsentation eller til underholdning. @da
definition: Relates a resource to an agent who contributes to a resource by designing costumes for a moving image production or for a musical or dramatic presentation or entertainment.
definition: Setzt eine Ressource in Beziehung zu einem Akteur, der zu einer Ressource beiträgt, indem er die Kostüme für eine Bewegtbildproduktion oder für eine musikalische oder dramatische Darbietung oder Aufführung entwirft. @de
definition: يربط مصدر بوكيل يُساهم في مصدر من خلال تصميم أزياء لإنتاج فيلم؛ أو لعرض موسيقي أو درامي أو ترفيهي. @ar
definition: 将一种资源与通过为动态图像制作或者为音乐或戏剧呈现或娱乐设计服装而对一种资源有贡献的一个行为者关联起来。 @zh-hans

has translator
lexical alias: translator.en
status: Published
type: Property
label: aineiston kääntäjä @fi
label: fordítója a következő: @hu
label: har oversætter @da
label: hat Übersetzerin/Übersetzer @de
label: heeft vertaler @nl
label: çevirmen ile ilişkilidir @tr
label: له مُترجم @ar
label: 有译者 @zh-hans
sub property of: has contributor (Deprecated)
inverse of: is translator of
definition: Bir kaynağı, bir kaynağın dilsel içeriğini önceki kaynaklarınkinden farklı bir dilde ifade ederek kaynağa katkıda bulunan bir temsilci ile ilişkilendirir. @tr
definition: Hozzákapcsol egy forrást egy ágenshez, amely a forrás nyelvi tartalmának a korábbi forrásoktól eltérő nyelven történő kifejezésével járul hozzá a forráshoz. @hu
definition: Liittää aineiston toimijaan, joka on aineistossa osallisena ilmaisemalla teoksen kielellisen sisällön toisella kielellä. @fi
definition: Relaterer en ressource til en agent, der har bidraget til en ressource ved at udtrykke en ressources sproglige indhold på et andet sprog end det, der er anvendt i tidligere udtryk af en oprindelige ressource. @da
definition: Relates a resource to an agent who contributes to a resource by expressing linguistic content of a resource in a language different from that of previous resources.
definition: Setzt eine Ressource in Beziehung zu einem Akteur, der zu einer Ressource beiträgt, indem er sprachlichen Inhalt einer Ressource in einer Sprache ausdrückt, die sich von früheren Ressourcen unterscheidet. @de
definition: يربط مصدر بوكيل يُساهم في مصدر من خلال التعبير عن المحتوى اللغوي لمصدر بلغة مختلفة عن تلك الموجودة في المصادر السابقة. @ar
definition: 将一种资源与通过用不同于先前资源的语言的另一种语言来表达一种资源的语言内容而对一种资源有贡献的一个行为者关联起来。 @zh-hans
scope note: Aynı dilin farklı zaman dilimlerindeki biçimleri arasındaki dilsel içeriğin çevirisi de dahildir. @tr
scope note: Darunter fallen Übersetzungen sprachlichen Inhalts zwischen Formen derselben Sprache aus verschiedenen Zeitperioden. @de
scope note: Kääntäjä voi myös kääntää kielisisältöä saman kielen eri aikakausien kielimuotojen välillä. @fi
scope note: Oversættelse af sprogligt indhold mellem former af det samme sprog fra forskellige tidsperioder er omfattet. @da
scope note: Translation of linguistic content between forms of the same language from different time periods is included.
scope note: Ugyanannak a nyelvnek a különböző időszakokból származó formái közötti nyelvi tartalom fordítása is ide tartozik. @hu
scope note: يتضمن ترجمة المحتوى اللغوي بين أشكال اللغة نفسها خلال فترات زمنية مختلفة. @ar
scope note: 包括语言内容在同一种语言的不同时期的形式之间的翻译。 @zh-hans

has art director
lexical alias: artDirector.en
status: Published
type: Property
label: har kunstnerisk leder @da
label: hat Art Director @de
label: heeft artdirector @nl
label: lavastaja @fi
label: művészeti vezetője a következő: @hu
label: sanat yönetmeni ile ilişkilidir @tr
label: له مخرج فني @ar
label: 有艺术总监 @zh-hans
sub property of: has contributor (Deprecated)
inverse of: is art director of
definition: Bir kaynağı, hareketli görüntü yapımları için set inşa eden sanatçıları ve zanaatkârları denetleyerek bir kaynağa katkıda bulunan bir temsilci ile ilişkilendirir. @tr
definition: Hozzákapcsol egy forrást egy ágenshez, amely hozzájárul egy forráshoz azzal, hogy művészeket és mesterembereket irányít és felügyel, akik mozgókép-produkciókhoz díszleteket építenek. @hu
definition: Liittää aineiston toimijaan, joka on aineistossa osallisena valvomalla taiteilijoita ja käsityöläisiä, jotka rakentavat lavasteita elokuvatuotantoihin. @fi
definition: Relaterer en ressource til en agent, der har bidraget til en ressource ved at føre tilsyn med de kunstnere og håndværkere, der har bygget kulisserne til levende billedproduktioner. @da
definition: Relates a resource to an agent who contributes to a resource by overseeing artists and craftspeople who build sets for moving image productions.
definition: Setzt eine Ressource in Beziehung zu einem Akteur, der zu einer Ressource beiträgt, indem er Künstlerinnen/Künstler und Kunsthandwerkerinnen/Kunsthandwerker betreut, die Sets für Bewegtbildproduktionen aufbauen. @de
definition: يربط مصدر بوكيل يُساهم في مصدر من خلال الإشراف على الفنيين والحرفيين الذين يبنون مواقع لإنتاج الأفلام. @ar
definition: 将一种资源与通过监督为动态图像制作建造布景的艺术家和艺人而对一种资源有贡献的一个行为者关联起来。 @zh-hans

has performer
has subproperty: has conductor
has subproperty: has actor
has subproperty: has onscreen presenter
has subproperty: has dancer
has subproperty: has instructor
has subproperty: has host
has subproperty: has moderator
has subproperty: has puppeteer
has subproperty: has panelist
has subproperty: has instrumentalist
has subproperty: has commentator
has subproperty: has narrator
has subproperty: has storyteller
has subproperty: has speaker
has subproperty: has singer
has subproperty: has instructor (Deprecated)
lexical alias: performer.en
status: Published
type: Property
label: aineiston esittäjä @fi
label: előadója a következő: @hu
label: har performer @da
label: hat Ausführende/Ausführenden @de
label: heeft uitvoerder @nl
label: sanatçı ile ilişkilidir @tr
label: له مؤدٍ @ar
label: 有表演者 @zh-hans
sub property of: has contributor (Deprecated)
inverse of: is performer of
definition: Bir kaynağı, genellikle müzikal veya dramatik bir performansta müzik yaparak, oyunculuk yaparak, dans ederek, konuşarak veya başka bir rolle kaynağa katkıda bulunan bir temsilciyle ilişkilendirir. @tr
definition: Hozzákapcsol egy forrást egy ágenshez, amely zene, színjátszás, tánc, élőbeszéd stb. előadásával árul hozzá a forráshoz, többnyire zenei vagy drámai bemutatóban. @hu
definition: Liittää aineiston tanssijana, näyttelijänä, puhujana tai muissa rooleissa osallistuvaan toimijaan, usein musiikillisessa tai draamallisessa esityksessä. @fi
definition: Relaterer en ressource til en agent, der har bidraget til en ressource ved at opføre musik, spille skuespil, danse, tale etc., ofte i en musikalsk eller dramatisk præsentation etc. @da
definition: Relates a resource to an agent who contributes to a resource by performing music, acting, dancing, speaking, and other roles, often in a musical or dramatic presentation.
definition: Setzt eine Ressource in Beziehung zu einem Akteur, der zu einer Ressource beiträgt, indem er, oftmals in einer musikalischen oder dramatischen Darbietung, Musik aufführt, schauspielt, tanzt, spricht oder eine andere Rolle übernimmt. @de
definition: يربط مصدر بوكيل يُساهم في مصدر من خلال أداء موسيقى، تمثيل، رقص، حوار، وغيرها من الأدوار التي غالبًا تكون في عرض موسيقي أو درامي. @ar
definition: 将一种资源与通过表演音乐、扮演、舞蹈、说话和其他角色（经常是在音乐或戏剧呈现中）而对一种资源有贡献的一个行为者关联起来。 @zh-hans

has court reporter
lexical alias: courtReporter.en
status: Published
type: Property
label: aineiston kirjuri oikeudenkäyntiasiakirjoissa @fi
label: bírósági jegyzőkönyvvezetője a következő: @hu
label: har retsstenograf @da
label: hat Gerichtsstenografin/Gerichtsstenograf @de
label: heeft rechtbankverslaggever @nl
label: yazman ile ilişkilidir @tr
label: له كاتب محكمة @ar
label: 有法院书记官 @zh-hans
sub property of: has contributor (Deprecated)
inverse of: is court reporter of
definition: Bir kaynağı, bir mahkemenin kararlarını yayınlanmak üzere hazırlayarak bir kaynağa katkıda bulunan bir temsilci ile ilişkilendirir. @tr
definition: Hozzákapcsol egy forrást egy ágenshez, amely hozzájárul egy forráshoz azzal, hogy egy bíróság ítéleteit készíti elő közlésre. @hu
definition: Liittää aineiston toimijaan, joka on aineistossa osalllisena valmistelemalla tuomioistuimen lausunnon julkaistavaksi. @fi
definition: Relaterer en ressource til en agent, der har bidraget til en ressource ved at klargøre en domstols afgørelser til publicering. @da
definition: Relates a resource to an agent who contributes to a resource by preparing a court's opinions for publication.
definition: Setzt eine Ressource in Beziehung zu einem Akteur, der zu einer Ressource beiträgt, indem er eine Urteilsbegründung zur Veröffentlichung vorbereitet. @de
definition: يربط مصدر بوكيل يُساهم في مصدر من خلال إعداد رأي محكمة للنشر. @ar
definition: 将一种资源与通过准备用于公布的法院意见而对一种资源有贡献的一个行为者关联起来。 @zh-hans

has writer of preface (Deprecated)
lexical alias: writerOfPreface.en
status: Deprecated
type: Property
label: har forfatter til forord @da
sub property of: has writer of supplementary textual content (Deprecated)
inverse of: is writer of introduction of (Deprecated)
definition: Relaterer en ressource til en agent, der har bidraget til en ressource ved at tilvejebringe et forord til en original ressource. @da
definition: Relates a resource to an agent who contributes to a resource by providing a preface to an original resource. (Deprecated)

has writer of added commentary (Deprecated)
lexical alias: writerOfAddedCommentary.en
status: Deprecated
type: Property
label: har forfatter til tilføjet kommentar @da
sub property of: has writer of supplementary textual content (Deprecated)
inverse of: is writer of added commentary of (Deprecated)
definition: Relaterer en ressource til en agent, der har bidraget til en ressource ved at tilvejebringe en fortolkning eller kritik af en original ressource. @da
definition: Relates a resource to an agent who contributes to a resource by providing an interpretation or critical explanation of an original resource. (Deprecated)

has writer of introduction (Deprecated)
lexical alias: writerOfIntroduction.en
status: Deprecated
type: Property
label: har forfatter til introduktion @da
sub property of: has writer of supplementary textual content (Deprecated)
inverse of: is writer of afterword of (Deprecated)
definition: Relaterer en ressource til en agent, der har bidraget til en ressource ved at tilvejebringe en introduktion til en original ressource. @da
definition: Relates a resource to an agent who contributes to a resource by providing an introduction to an original resource. (Deprecated)

has writer of supplementary textual content (Deprecated)
has subproperty: has writer of added text (Deprecated)
has subproperty: has writer of preface (Deprecated)
has subproperty: has writer of added commentary (Deprecated)
has subproperty: has writer of introduction (Deprecated)
has subproperty: has writer of afterword (Deprecated)
has subproperty: has writer of postface (Deprecated)
lexical alias: writerOfSupplementaryTextualContent.en
status: Deprecated
type: Property
label: har forfatter til supplerende tekstindhold @da
sub property of: has contributor (Deprecated)
inverse of: is writer of supplementary content of (Deprecated)
definition: Relaterer en ressource til en agent, der har bidraget til en ressource ved at tilvejebringe supplerende tekstindhold, fx en indledning eller et forord til en original ressource. @da
definition: Relates a resource to an agent who contributes to a resource by providing supplementary textual content (e.g., an appendix, an introduction, a preface) to an original resource. (Deprecated)

has editor (Deprecated
see also: has author
lexical alias: editor.en
status: Deprecated
type: Property
label: har redaktør @da
label: leikkaaja @fi
sub property of: has contributor (Deprecated)
inverse of: is editor of
definition: Liittää aineiston toimijaan, joka osallistuu aineiston tekemiseen sisältöä tarkistamalla tai selventämällä tai valitsemalla ja kokoamalla toisen tekijän tai tekijöiden aineistoja tai niiden osia. @fi
definition: Relaterer en ressource til en agent, der har bidraget til en ressource ved at revidere eller præcisere indholdet, eller ved at udvælge og sammensætte ressourcer eller dele af ressourcer, af en eller flere ophavspersoner. @da
definition: Relates a resource to an agent who contributes to a resource by revising or clarifying the content, or by selecting and putting together resources, or parts of resources, by one or more creators. (Deprecated)
scope note: Addition of an introduction, notes, or other critical matter, or preparing a resource for production, publication, or distribution is included. Major revision, adaptation, etc., that substantially changes the nature and content of the original resource, resulting in a new resource, is excluded. (Deprecated)
scope note: Johdannon, huomautusten tai muun olennaisen sisällön lisääminen, samoin aineiston vamistelu tuotantoa, julkaisua tai jakelua varten. Ei koske uuteen aineistoon johtavia merkittäviä korjauksia, mukautuksia jne, jotka merkittävästi muuttavat alkuperäisen aineiston luonnetta tai sisältöä. @fi

has abridger
see also: has author
lexical alias: abridger.en
status: Published
type: Property
label: aineiston lyhentäjä @fi
label: har forkorter @da
label: hat Kürzende/Kürzenden @de
label: heeft inkorter @nl
label: rövidítője a következő: @hu
label: özetleyen ile ilişkilidir @tr
label: له مُلَخِص @ar
label: 有缩编者 @zh-hans
sub property of: has contributor (Deprecated)
inverse of: is abridger of
definition: Bir kaynağı, genel anlamını veya sunum şeklini değiştirmeden ilgili bir kaynağı kısaltarak bir kaynağa katkıda bulunan bir temsilci ile ilişkilendirir. @tr
definition: Hozzákapcsol egy forrást egy ágenshez, amely egy kapcsolódó forrás lerövidítésével hozzájárul egy forráshoz úgy, hogy a prezentáció általános jelentése vagy módja nem változik. @hu
definition: Liittää aineiston toimijaan, joka on aineistossa osallisena lyhentämällä siihen liittyvää aineistoa muuttamatta esityksen yleistä sisältöä tai tyyliä. @fi
definition: Relaciona un recurs amb un agent que contribueix a un recurs escurçant un recurs d’un recurs relacionat sense canviar el significat general o la forma de presentació. @ca
definition: Relaterer en ressource til en agent, der har bidraget til en ressource ved at forkorte eller komprimere en originalressource, men som i alt væsentligt har ladt originalens karakter og indhold uændret. @da
definition: Relates a resource to an agent who contributes to a resource by shortening a resource of a related resource without changing the general meaning or manner of presentation.
definition: Setzt eine Ressource in Beziehung zu einem Akteur, der zu einer Ressource beiträgt, indem er eine in Beziehung stehende Ressource kürzt, ohne die allgemeine Bedeutung oder Art der Darstellung zu ändern. @de
definition: يربط مصدر بوكيل يُساهم في مصدر من خلال تلخيص مصدر ذو صلة دون تغيير المعنى العام أو طريقة العرض. @ar
definition: 将一种资源与通过缩短一种相关资源的一种资源而不改变其总体意义或呈现方式而对一种资源有贡献的一个行为者关联起来。 @zh-hans
scope note: Darunter fallen keine substantiellen Veränderungen, die zur Schaffung einer neuen Ressource führen. @de
scope note: Ei koske oleellista muokkausta, joka johtaa uuden aineiston luomiseen. @fi
scope note: Nem tartoznak ide az egy új forrás létrehozását eredményező lényegi változtatások. @hu
scope note: Substantial modification that results in the creation of a new resource is excluded.
scope note: Væsentlige ændringer, der resulterer i skabelsen af en ny ressource, er ikke omfattet. @da
scope note: Yeni bir kaynağın oluşturulmasıyla sonuçlanan önemli değişiklikler hariç tutulur. @tr
scope note: يُستبعد التعديل الجوهري الذي ينتج عنه إنشاء مصدر جديد. @ar
scope note: 不包括导致一种新资源创作的实质性修改。 @zh-hans

has recording engineer
lexical alias: recordingEngineer.en
status: Published
type: Property
label: aineiston äänittäjä @fi
label: hangmérnöke a következő: @hu
label: har indspilningstekniker @da
label: hat Aufnahmetechnikerin/Aufnahmetechniker @de
label: heeft opnametechnicus @nl
label: kayıt mühendisi ile ilişkilidir @tr
label: له مهندس تسجيل @ar
label: 有录制工程师 @zh-hans
sub property of: has contributor (Deprecated)
inverse of: is recording engineer of
definition: Bir kaynağı, bir ses veya video kayıt oturumunun teknik yönlerini denetleyerek bir kaynağa katkıda bulunan bir temsilci ile ilişkilendirir. @tr
definition: Hozzákapcsol egy forrást egy ágenshez, amely hozzájárul egy forráshoz azzal, hogy felügyeli egy hangok vagy videó rögzítését szolgáló munkamenet műszaki aspektusait. @hu
definition: Liittää aineiston toimijaan, joka on aineistossa osallisena valvomalla äänityksen teknistä toteutusta. @fi
definition: Relaterer en ressource til en lydtekniker, der har bidraget til en ressource ved at føre tilsyn med de tekniske aspekter af en lyd- eller videooptagelse. @da
definition: Relates a resource to an agent who contributes to a resource by supervising the technical aspects of a sound or video recording session.
definition: Setzt eine Ressource in Beziehung zu einem Akteur, der zu einer Ressource beiträgt, indem er die technischen Aspekte einer Ton- oder Videoaufnahme überwacht. @de
definition: يربط مصدر بوكيل يُساهم في مصدر من خلال الإشراف على الجوانب الفنية لمحتوى صوتي لجلسة تسجيل. @ar
definition: 将一种资源与作为一个音频工程师通过监督一个录制过程中的技术方面而对一种资源有贡献的一个行为者关联起来。 @zh-hans

has contributor agent of still image
has subproperty: has letterer
lexical alias: contributorAgentOfStillImage.en
status: Published
type: Property
label: durağan görüntüye katkıda bulunan temsilci ile ilişkilidir @tr
label: har illustrator @da
label: hat Illustratorin/Illustrator @de
label: heeft bijdrager-actor van stilstaand beeld @nl
label: stillkuvaan osallinen toimija aineistossa @fi
label: állókép közreműködő ágense a következő: @hu
label: له وكيل مساهم في صور ثابتة @ar
label: 有静态图像的贡献者行为者 @zh-hans
sub property of: has contributor (Deprecated)
inverse of: is contributor agent of still image of
definition: Bir kaynağı, bir topluluk tarafından somutlaştırılan bir durağan görüntü kaynağı oluşturan topluluğa katkıda bulunan bir temsilci ile ilişkilendirir. @tr
definition: Hozzákapcsol egy forrást egy ágenshez, amely aggregátum közreműködőjeként olyan állóképforrást hoz létre, amely egy aggregátumban testesül meg. @hu
definition: Liittää aineiston toimijaan, joka joka on luonut aggregaattiin sisältyvän stillkuva-aineiston. @fi
definition: Relaterer en ressource til en agent, der har bidraget til en ressource ved at supplere hovedindholdet med tegninger, diagrammer, fotos etc. @da
definition: Relates a resource to an agent who is a contributor to aggregate who creates a still image resource that is embodied by an aggregate.
definition: Setzt eine Ressource in Beziehung zu einer Beiträgerin/einem Beiträger zu einem Aggregat, die/der eine unbewegte Bildressource erstellt, die durch ein Aggregat verkörpert wird. @de
definition: يربط مصدر بوكيل مُساهم في عمل تجميعي بإنشاء مصدر صور ثابتة يتجسد في تجميعية. @ar
definition: 将一种资源与作为合集的一个贡献者并创建被一种合集具体化的一种静态图像资源的一个行为者关联起来。 @zh-hans
scope note: Skabelse af primært kunstnerisk indhold er ikke omfattet. @da

has recordist
lexical alias: recordist.en
status: Published
type: Property
label: aineiston taltioija @fi
label: har tonemester @da
label: hat Tonmeisterin/Tonmeister @de
label: heeft opnamemaker @nl
label: kayıt teknisyeni ile ilişkilidir @tr
label: rögzítője a következő: @hu
label: له فني تسجيل @ar
label: 有录制者 @zh-hans
sub property of: has contributor (Deprecated)
inverse of: is recordist of
definition: Bir kaynağı, bir kayıt oturumu sırasında ses veya görüntü kaydetmek için bir kayıt cihazı kullanarak bir kaynağa katkıda bulunan bir temsilci ile ilişkilendirir. @tr
definition: Hozzákapcsol egy forrást egy ágenshez, amely hozzájárul egy forráshoz azzal, hogy felvevőkészülék használatával hangokat vagy videót rögzít egy felvételi munkamenet alatt. @hu
definition: Liittää aineiston toimijaan, joka on aineistossa osallisena käyttämällä tallennuslaitetta äänen tai videon taltioimiseen tallennustilanteessa. @fi
definition: Relaterer en ressource til en agent, der har bidraget til en ressource ved at anvende et optageudstyr til lyd og/eller video under en optagelse, inkl. feltoptagelser af naturlige lyde, folkloristiske begivenheder, musik etc. @da
definition: Relates a resource to an agent who contributes to a resource by using a recording device to capture sound or video during a recording session.
definition: Setzt eine Ressource in Beziehung zu einem Akteur, der zu einer Ressource beiträgt, indem er mit einem Aufnahmegerät Ton oder Video aufnimmt. @de
definition: يربط مصدر بوكيل يُساهم في مصدر من خلال استخدام جهاز تسجيل لالتقاط صوت أو فيديو أثناء جلسة تسجيل. @ar
definition: 将一种资源与通过采用录制设备在录制期间摄录声音或视频而对一种资源有贡献的一个行为者关联起来。 @zh-hans

has contributor (Deprecated)
has subproperty: has surveyor
has subproperty: has animator
has subproperty: has arranger of music
has subproperty: has draftsman
has subproperty: has transcriber
has subproperty: has musical director
has subproperty: has costume designer
has subproperty: has translator
has subproperty: has art director
has subproperty: has performer
has subproperty: has court reporter
has subproperty: has writer of supplementary textual content (Deprecated)
has subproperty: has editor (Deprecated
has subproperty: has abridger
has subproperty: has recording engineer
has subproperty: has contributor agent of still image
has subproperty: has recordist
has subproperty: has stage director
has subproperty: has presenter
has subproperty: has editor of moving image resource
has subproperty: has production designer
has subproperty: has minute taker
has subproperty: has visual effects provider
has subproperty: has special effects provider
has subproperty: has writer of foreword (Deprecated)
has subproperty: has sound designer
has subproperty: has lighting designer
has subproperty: has onscreen participant
has subproperty: has software developer
has subproperty: has colourist
has subproperty: has makeup artist
has subproperty: has censor
has subproperty: has audio engineer
has subproperty: has music programmer
has subproperty: has dubbing director
has subproperty: has DJ
lexical alias: contributor.en
status: Deprecated
type: Property
label: har bidragyder @da
inverse of: is contributor of (Deprecated)
definition: Relaterer en ressource til en agent, der bidrager til en ressource. @da
definition: Relates a resource to an agent who contributes to a resource. (Deprecated)
scope note: Bidragydere omfatter bl.a. redaktører, oversættere, musikarrangører, performere. @da
scope note: Contributors include editors, translators, arrangers of music, performers, etc.. (Deprecated)

has stage director
lexical alias: stageDirector.en
status: Published
type: Property
label: har sceneinstruktør @da
label: hat Bühnenregisseurin/Bühnenregisseur @de
label: heeft toneelregisseur @nl
label: näyttämöohjaaja aineistossa @fi
label: sahne yönetmeni ile ilişkilidir @tr
label: színpadi rendezője a következő: @hu
label: له مدير مسرح @ar
label: 有舞台导演 @zh-hans
sub property of: has contributor (Deprecated)
inverse of: is stage director of
definition: Bir kaynağı, bir performansın genel yönetimi ve denetimi yoluyla bir sahne kaynağına katkıda bulunan bir temsilci ile ilişkilendirir. @tr
definition: Hozzákapcsol egy forrást egy ágenshez, amely hozzájárul egy színpadi forráshoz azzal, hogy egy előadás általános menedzselését és felügyeletét végzi. @hu
definition: Liittää aineiston toimijaan, joka on aineistossa osallisena johtamalla ja valvomalla näyttämöesitystä. @fi
definition: Relaterer en ressource til en agent, der har bidraget til en ressource af et sceneværk gennem den generelle ledelse af og tilsyn med en forestilling. @da
definition: Relates a resource to an agent who contributes to a stage resource through the general management and supervision of a performance.
definition: Setzt eine Ressource in Beziehung zu einem Akteur, der zu einer Bühnenressource durch die allgemeine Betreuung und Leitung einer Darbietung beiträgt. @de
definition: يربط مصدر بوكيل يُساهم في مصدر مسرحي من خلال الإدارة العامة للأداء مسرحي والإشراف عليه. @ar
definition: 将一种资源与通过对表演总体管理和监督而对一种舞台资源有贡献的一个行为者关联起来。 @zh-hans

has current owner
has subproperty: has depositor
lexical alias: currentOwner.en
status: Published
type: Property
label: aineiston nykyinen omistaja @fi
label: har nuværende ejer @da
label: hat gegenwärtige Eigentümerin/gegenwärtigen Eigentümer @de
label: heeft huidige eigenaar @nl
label: jelenlegi tulajdonosa a következő: @hu
label: mevcut sahip ile ilişkilidir @tr
label: له مالك حالي @ar
label: 有当前拥有者 @zh-hans
sub property of: has owner
inverse of: is current owner of
definition: Bir kaynağı, o anda bir kaynağın yasal mülkiyetine sahip olan bir temsilci ile ilişkilendirir. @tr
definition: Hozzákapcsol egy forrást egy ágenshez, amelynek jelenleg jogszerű tulajdonában van egy forrás. @hu
definition: Liittää aineiston toimijaan, jolla on aineiston tämänhetkinen laillinen omistus. @fi
definition: Relaterer en ressource til en agent, der p.t. er i lovlig besiddelse af en ressource. @da
definition: Relates a resource to an agent currently having legal possession of a resource.
definition: Setzt eine Ressource in Beziehung zu einem Akteur, der derzeit im rechtmäßigen Besitz einer Ressource ist. @de
definition: يربط مصدر بوكيل يمتلك حاليًا ملكية قانونية لمصدر. @ar
definition: 将一资源与拥有对一种资源当前法定所有权的一个行为者关联起来。 @zh-hans

has former owner
has subproperty: has donor
has subproperty: has seller
lexical alias: formerOwner.en
status: Published
type: Property
label: aineiston aiempi omistaja @fi
label: eski sahip ile ilişkilidir @tr
label: har tidligere ejer @da
label: hat frühere Eigentümerin/früheren Eigentümer @de
label: heeft voormalige eigenaar @nl
label: korábbi tulajdonosa a következő: @hu
label: له مالك سابق @ar
label: 有先前拥有者 @zh-hans
sub property of: has owner
inverse of: is former owner of
definition: Bir kaynağı, daha önce bir kaynağın yasal mülkiyetine sahip olan bir temsilci ile ilişkilendirir. @tr
definition: Hozzákapcsol egy forrást egy ágenshez, amelynek korábban jogszerű tulajdonában volt egy forrás. @hu
definition: Liittää aineiston toimijaan, jolla on aiemmin ollut aineiston laillinen omistus. @fi
definition: Relaterer en ressource til en agent, der tidligere har været i lovlig besiddelse af en ressource. @da
definition: Relates a resource to an agent formerly having legal possession of a resource.
definition: Setzt eine Ressource in Beziehung zu einem Akteur, der früher im rechtmäßigen Besitz einer Ressource war. @de
definition: يربط مصدر بوكيل كان يمتلك سابقًا ملكية قانونية لمصدر. @ar
definition: 将一种资源与拥有对一种资源先前法定所有权的一个行为者关联起来。 @zh-hans

has custodian
lexical alias: custodian.en
status: Published
type: Property
label: aineiston säilyttäjä @fi
label: har forvalter @da
label: hat Verwahrerin/Verwahrer @de
label: heeft curatele @nl
label: koruyucu ile ilişkilidir @tr
label: letétkezelője a következő: @hu
label: له وَصِيّ @ar
label: 有保管者 @zh-hans
inverse of: is custodian of
definition: Bir kaynağı, kaynağın yasal velayetine sahip bir temsilci ile ilişkilendirir. @tr
definition: Hozzákapcsol egy forrást egy ágenshez, amely egy forrás törvényes megőrzője. @hu
definition: Liittää aineiston toimijaan, joka on aineiston laillinen säilyttäjä. @fi
definition: Relaterer en ressource til en agent, der lovligt har en ressource i forvaring. @da
definition: Relates a resource to an agent having legal custody of a resource.
definition: Setzt eine Ressource in Beziehung zu einem Akteur, dem die rechtmäßige Verwahrung einer Ressource obliegt. @de
definition: يربط مصدر بوكيل يمتلك وصاية قانونية لمصدر @ar
definition: 将一种资源与对一种资源拥有合法保管权的一个行为者关联起来。 @zh-hans

has owner
has subproperty: has current owner
has subproperty: has former owner
lexical alias: owner.en
status: Published
type: Property
label: aineiston omistaja @fi
label: har ejer @da
label: hat Eigentümerin/Eigentümer @de
label: heeft eigenaar @nl
label: sahip ile ilişkilidir @tr
label: tulajdonosa a következő: @hu
label: له مالك @ar
label: 有拥有者 @zh-hans
inverse of: is owner of
definition: Bir kaynağı, bir kaynağın yasal mülkiyetine sahip bir temsilci ile ilişkilendirir. @tr
definition: Hozzákapcsol egy forrást egy ágenshez, amelynek jogszerű tulajdonában van egy forrás. @hu
definition: Liittää aineiston toimijaan, jolla on aineiston laillinen omistus. @fi
definition: Relaciona un recurs amb un agent que té la propietat legal actual o anterior d’un recurs. @ca
definition: Relaterer en ressource til en agent, der er i lovlig besiddelse af en ressource. @da
definition: Relates a resource to an agent who has current or former legal possession of a resource.
definition: Setzt eine Ressource in Beziehung zu einem Akteur, der im rechtmäßigen Besitz einer Ressource ist. @de
definition: يربط مصدر بوكيل له ملكية قانونية لمصدر. @ar
definition: 将一种资源与拥有对一种资源当前或先前法定所有权的一个行为者关联起来。 @zh-hans

has honouree
lexical alias: honouree.en
status: Published
type: Property
label: har festskriftmodtager @da
label: hat Gefeierte/Gefeierten @de
label: heeft geëerde @nl
label: kunnioitettu henkilö aineistossa @fi
label: méltatottja a következő: @hu
label: onurlandırılan kişi ile ilişkilidir @tr
label: له مكرَّم @ar
label: 有被纪念者 @zh-hans
sub property of: has other agent associated with resource (Deprecated)
inverse of: is honouree of
alternative label: has honoree
definition: Bir kaynağı, bir kaynak tarafından onurlandırılan bir temsilci ile ilişkilendirir. @tr
definition: Hozzákapcsol egy forrást egy ágenshez, amelyet a forrás méltat. @hu
definition: Liittää aineiston toimijaan, jolle aineistolla osoitetaan arvostusta ja kunnioitusta. @fi
definition: Relaterer en ressource til en agent, der hædres af en ressource. @da
definition: Relates a resource to an agent who is honoured by a resource.
definition: Setzt eine Ressource in Beziehung zu einem Akteur, der durch eine Ressource geehrt wird. @de
definition: يربط مصدر بوكيل مكرَّم من مصدر. @ar
definition: 将一种资源与被一种资源纪念的一个行为者关联起来。 @zh-hans

has broadcaster
lexical alias: broadcaster.en
status: Published
type: Property
label: har broadcaster @da
label: hat Sender @de
label: heeft uitzender @nl
label: lähetyksestä vastaava henkilö aineistossa @fi
label: műsorszolgáltatója a következő: @hu
label: yayıncı ile ilişkilidir @tr
label: له مُذيع @ar
label: 有广播者 @zh-hans
sub property of: has publisher
inverse of: is broadcaster of
definition: Bir kaynağı radyo, televizyon, web yayını veya diğer iletim ortamları aracılığıyla kaynağı bir kitleye yayınlamaktan sorumlu olan bir temsilci ile ilişkilendirir. @tr
definition: Hozzákapcsol egy forrást egy ágenshez, amely felelős egy forrás rádión, televízión, webközvetítésen, vagy egyéb adatátviteli médiumon keresztül közönséghez történő műsorszórásában. @hu
definition: Liittää aineiston toimijaan, joka vastaa radio-, televisio-, suoratoisto- tms. lähetyksen välittämisestä yleisölle. @fi
definition: Relaterer en ressource til en agent, der har været involveret i transmissionen af en ressource til et publikum via radio, tv, webcast etc. @da
definition: Relates a resource to an agent who is responsible for broadcasting a resource to an audience via radio, television, webcast, or other transmission media.
definition: Setzt eine Ressource in Beziehung zu einem Akteur, der für die Ausstrahlung einer Ressource über Hörfunk, Fernsehen oder Webcast oder andere Übertragungsmedien verantwortlich ist. @de
definition: يربط مصدر بوكيل مسؤول عن بث مصدر إلى جمهور عبر إذاعة، تلفزيون، إنترنت، أو وسائط نقل أخرى. @ar
definition: 将一种资源与负责通过广播、电视、网络直播或其他传输媒介向受众广播一种资源的一个行为者关联起来。 @zh-hans

has film distributor
lexical alias: filmDistributor.en
status: Published
type: Property
label: elokuvan jakelija aineistossa @fi
label: film dağıtımcısı ile ilişkilidir @tr
label: filmterjesztője a következő: @hu
label: har filmdistributør @da
label: hat Filmvertrieb @de
label: heeft filmdistributeur @nl
label: له موزع فيلم @ar
label: 有电影发行者 @zh-hans
sub property of: has distributor
inverse of: is film distributor of
definition: Bir kaynağı, hareketli görüntü kaynağını tiyatrolara veya diğer dağıtım kanallarına dağıtmaktan sorumlu olan bir temsilci ile ilişkilendirir. @tr
definition: Hozzákapcsol egy forrást egy ágenshez, amely felelős egy mozgóképforrás terjesztéséért filmszínházak vagy más disztribúciós csatornák számára. @hu
definition: Liittää aineiston toimijaan, joka on vastuussa elokuvan tms. aineiston jakamisesta elokuvateattereille tai muille jakelukanaville. @fi
definition: Relaterer en ressource til en agent, der har været involveret i distribueringen af en levende billed-ressource til biografer eller andre distributionskanaler. @da
definition: Relates a resource to an agent who is responsible for distributing a moving image resource to theatres or other distribution channels.
definition: Setzt eine Ressource in Beziehung zu einem Akteur, der für den Vertrieb einer Bewegtbildressource an Kinos oder andere Vertriebskanäle verantwortlich ist. @de
definition: يربط مصدر بوكيل مسؤول عن توزيع مصدر فيلم على قاعات العرض أو عبر قنوات أخرى. @ar
definition: 将一种资源与负责向剧院或其他发行渠道发行动态图像资源的一个行为者关联起来。 @zh-hans

has book designer
lexical alias: bookDesigner.en
status: Published
type: Property
label: aineiston graafinen suunnittelija @fi
label: har bogdesigner @da
label: hat Buchgestalterin/Buchgestalter @de
label: heeft boekontwerper @nl
label: kitap tasarımcısı ile ilişkilidir @tr
label: könyvtervezője a következő: @hu
label: له مُصمم كتاب @ar
label: 有图书设计者 @zh-hans
sub property of: has creator
inverse of: is book designer of
definition: Bir kaynağı, yazı ve çizim düzenlemesi, malzeme seçimi ve kullanılan süreç dahil olmak üzere bir kitabın tüm grafik tasarımından sorumlu olarak kaynak oluşturmaktan sorumlu olan bir temsilci ile ilişkilendirir. @tr
definition: Hozzákapcsol egy forrást egy ágenshez, amely felelős egy forrás gyártásáért oly módon, hogy felelős egy könyv teljes grafikai tervezéséért, beleértve a nyomdai betűtípus és az illusztrációk elrendezését, az anyagválasztást és az alkalmazott eljárást. @hu
definition: Liittää aineiston toimijaan, joka on vastuussa aineiston valmistamisesta vastaamalla kirjan graafisesta suunnittelusta, taitosta, materiaalien valinnasta ja käytettävistä valmistusmenetelmistä. @fi
definition: Relaciona un recurs amb un agent que és responsable de la creació d’un recurs amb la responsabilitat de tot el disseny gràfic d’un llibre, inclosa la composició tipogràfica i la il·lustració, la tria dels materials i el procés utilitzat. @ca
definition: Relaterer en ressource til en agent, der har været involveret i fremstillingen af en ressource ved at være ansvarlig for hele en bogs grafiske design, inkl. opsætning af tekst og illustrationer, materialevalg og anvendt proces. @da
definition: Relates a resource to an agent who is responsible for creating a resource by being responsible for the entire graphic design of a book, including arrangement of type and illustration, choice of materials, and process used.
definition: Setzt eine Ressource in Beziehung zu einem Akteur, der für die Herstellung einer Ressource verantwortlich ist, indem er für das gesamte grafische Design eines Buchs, einschließlich Schriftbild, Bildgestaltung, Materialwahl und angewandter Verfahren, verantwortlich ist. @de
definition: يربط مصدربوكيل مسؤول عن إنتاج مصدر بالتصميم الجرافيكي لكتاب بالكامل، ويشمل ذلك تنسيق الحروف، والإيضاحيات، واختيار المواد، والعمليات المستخدمة. @ar
definition: 将一种资源与通过负责图书的整体图形设计（包括字体和插图的编排、材料的选取和工艺流程的使用等）对资源创建负责的一个行为者关联起来。 @zh-hans

has engraver
lexical alias: engraver.en
status: Published
type: Property
label: aineiston kaivertaja @fi
label: gravür sanatçısı ile ilişkilidir @tr
label: har gravør @da
label: hat Stecherin/Stecher @de
label: heeft graveur @nl
label: vésnöke a következő: @hu
label: له نقّاش @ar
label: 有雕版者 @zh-hans
sub property of: has printmaker
inverse of: is engraver of
definition: Bir kaynağı, baskı için kullanılan ahşap veya metal plaka gibi bir yüzey üzerinde harfler, şekiller veya diğer işaretleri keserek bir kaynak oluşturmaktan sorumlu olan bir temsilci ile ilişkilendirir. @tr
definition: Hozzákapcsol egy forrást egy ágenshez, amely felelős egy forrás gyártásáért oly módon, hogy betűket, ábrákat vagy egyéb jeleket vés nyomtatáshoz használatos fa- vagy fémlemezhez hasonló felületre. @hu
definition: Liittää aineiston toimijaan, joka on vastuussa aineiston valmistamisesta kaivertamalla kirjaimia, kuvioita tai muita merkkejä painamisessa käytettävälle pinnalle, kuten puu- tai metallipinnalle. @fi
definition: Relaciona un recurs amb un agent que és responsable de la creació d’un recurs mitjançant la gravació de lletres, figures o altres marques sobre una superfície com ara una planxa de fusta o de metall usada en la impressió. @ca
definition: Relaterer en ressource til en agent, der har været involveret i fremstillingen af en ressource ved at udskære bogstaver, figurer etc. på en overflade såsom en træ- eller metalplade, der har været anvendt til trykning. @da
definition: Relates a resource to an agent who is responsible for creating a resource by cutting letters, figures, or other marks on a surface such as a wooden or metal plate used for printing.
definition: Setzt eine Ressource in Beziehung zu einem Akteur, der für die Herstellung einer Ressource verantwortlich ist, indem er Buchstaben, figürliche Darstellungen und so weiter in eine Oberfläche, wie zum Beispiel eine Holz- oder Metallplatte schneidet, die zum Drucken benutzt wird. @de
definition: يربط مصدر بوكيل مسؤول عن إنتاج مصدر بنقش حروف، أشكال، أو رموز أخرى على سطح مثل لوح خشبي أو معدني يستخدم للطباعة. @ar
definition: 将一种资源与通过在用于印刷的木版或金属版的表面上雕刻字母、图像或其他记号负责资源的创建的一个行为者关联起来。 @zh-hans

has braille embosser
lexical alias: brailleEmbosser.en
status: Published
type: Property
label: Braille-dombornyomója a következő: @hu
label: aineiston pistekirjoituksen tekijä @fi
label: braille kabartmacısı ile ilişkilidir @tr
label: har braillepræger @da
label: hat Brailleschriftprägerin/Brailleschriftpräger @de
label: heeft brailleerder @nl
label: له نقاش حروف بطريقة برايل @ar
label: 有布莱叶盲文点字制作者 @zh-hans
sub property of: has manufacturer
inverse of: is braille embosser of
definition: Bir kaynağı, bir kalem, özel kabartma yazıcı veya başka bir cihaz kullanarak braille hücrelerini kabartarak bir kaynak üretmekten sorumlu olan bir temsilci ile ilişkilendirir. @tr
definition: Hozzákapcsol egy forrást egy ágenshez, amely felelős egy forrás gyártásáért oly módon, hogy domborítja a Braille-cellákat íróvessző, speciális domborítónyomtató vagy más készülék használatával. @hu
definition: Liittää aineiston toimijaan, joka on vastuussa aineiston valmistamisesta tuottamalla pistekirjoitusmerkkejä piirtimen, erityistulostimen tai muun laitteen avulla. @fi
definition: Relaterer en ressource til en agent, der har været involveret i fremstillingen af en ressource ved at præge brailleceller vha. en stift, særlig prægeprinter eller andet apparatur. @da
definition: Relates a resource to an agent who is responsible for manufacturing a resource by embossing braille cells using a stylus, special embossing printer, or other device.
definition: Setzt eine Ressource in Beziehung zu einem Akteur, der für die Herstellung einer Ressource in Form von Braillezeichen verantwortlich ist, indem er einen Griffel, einen speziellen Brailledrucker oder ein anderes Gerät zum Prägen verwendet. @de
definition: يربط مصدر بوكيل مسؤول عن إنتاج مصدر عن طريق نقش حروف برايل باستخدام قلم أو طابعة خاصة للنقش أو أي أداة أخرى. @ar
definition: 将一种资源与涉及通过使用刻写针、专门的压纹机或其他设备压印布莱叶盲文而对一种资源的生产负责的一个行为者关联起来。 @zh-hans

has printmaker
has subproperty: has engraver
has subproperty: has lithographer
has subproperty: has etcher
has subproperty: has collotyper
lexical alias: printmaker.en
status: Published
type: Property
label: aineiston kuvalaatan valmistaja @fi
label: baskı sanatçısı ile ilişkilidir @tr
label: har grafiker @da
label: hat Druckgrafikerin/Druckgrafiker @de
label: heeft maker van platen @nl
label: nyomtatványkészítője a következő: @hu
label: له طبّاع @ar
label: 有印版制作者 @zh-hans
sub property of: has creator
inverse of: is printmaker of
definition: Bir kaynağı, kabartma, çukur baskı veya planografik baskı yüzeyi oluşturarak bir kaynak oluşturmaktan sorumlu olan bir temsilci ile ilişkilendirir. @tr
definition: Hozzákapcsol egy forrást egy ágenshez, amely felelős egy forrás gyártásáért oly módon, hogy egy domború, mélynyomásos (intaglio) vagy síknyomásos felületet készít. @hu
definition: Liittää aineiston toimijaan, joka osallistuu aineiston valmistamiseen valmistamalla kohokuvan, syväpainon tai laakapainon painopinnan. @fi
definition: Relaciona un recurs amb un agent que és responsable de la creació d’un recurs fent una superfície d’impressió en relleu, gravada en profunditat o planogràfica. @ca
definition: Relaterer en ressource til en agent, der har været involveret i fremstillingen af en ressource ved at lave en relief-, dybtryks- eller fladtryksoverflade. @da
definition: Relates a resource to an agent who is responsible for creating a resource by making a relief, intaglio, or planographic printing surface.
definition: Setzt eine Ressource in Beziehung zu einem Akteur, der für die Herstellung einer Ressource verantwortlich ist, indem er eine Hochdruck-, Tiefdruck- oder Flachdruckoberfläche erstellt. @de
definition: يربط مصدر بوكيل مسؤول عن إنتاج مصدر بعمل سطح طباعة بارزة، أو غائرة، أو مستوية. @ar
definition: 将一种资源与通过制作浮雕、凹版或平版印刷表面对一种资源的创建负责的一个行为者关联起来。 @zh-hans

has caster
lexical alias: caster.en
status: Published
type: Property
label: aineiston valaja @fi
label: dökümcü ile ilişkilidir @tr
label: har støber @da
label: hat Formgießerin/Formgießer @de
label: heeft gieter @nl
label: öntvénykészítője a következő: @hu
label: له عامل صب @ar
label: 有铸造者 @zh-hans
sub property of: has creator
inverse of: is caster of
definition: Bir kaynağı, sıvı veya erimiş bir maddeyi bir kalıba dökerek ve kalıbın şeklini alması için katılaşmaya bırakarak bir kaynak oluşturmaktan sorumlu olan bir temsilci ile ilişkilendirir. @tr
definition: Hozzákapcsol egy forrást egy ágenshez, amely felelős egy forrás gyártásáért oly módon, hogy folyékony vagy olvasztott anyagot önt egy öntőformába és hagyja, hogy az megszilárduljon és az öntőforma formáját felvegye. @hu
definition: Liittää aineiston toimijaan, joka on vastuussa aineiston valmistamisesta muovaamalla sulatettua tai nestemäistä ainetta muotin avulla. @fi
definition: Relaciona un recurs amb un agent que és resposable de la creació d’un recurs mitjançant l’abocament d’un líquid o una substància fosa en un motlle tot deixant que se solidifiqui perquè prengui la forma del motlle. @ca
definition: Relaterer en ressource til en agent, der har været involveret i fremstillingen af en ressourcer ved at hælde en væske eller et varmt, flydende stof i en form og lade det størkne, så det har taget facon efter formen. @da
definition: Relates a resource to an agent who is responsible for creating a resource by pouring a liquid or molten substance into a mold and leaving it to solidify to take the shape of the mold.
definition: Setzt eine Ressource in Beziehung zu einem Akteur, der für die Herstellung einer Ressource verantwortlich ist, indem er eine Flüssigkeit oder eine geschmolzenen Substanz in eine Form gießt, die in der Gießform verbleibt, bis sie ausgehärtet ist. @de
definition: يربط مصدر بوكيل مسؤول عن إنتاج مصدر بصب مادة سائلة أو مصهورة في قالب وتركها للتصلب لأخذ شكل القالب. @ar
definition: 将一种资源与通过将液体或融化的物质倒入模具中使其按模具固化成型而对一种资源的创建负责的一个行为者关联起来。 @zh-hans

has lithographer
lexical alias: lithographer.en
status: Published
type: Property
label: aineiston litografi @fi
label: har litograf @da
label: hat Lithografin/Lithograf @de
label: heeft lithograaf @nl
label: kőnyomatkészítője a következő: @hu
label: taş baskı sanatçısı ile ilişkilidir @tr
label: له طبّاع على الحجر @ar
label: 有平版制作者 @zh-hans
sub property of: has printmaker
inverse of: is lithographer of
definition: Bir kaynağı, taş baskı için bir taş veya plaka hazırlayarak bir kaynak oluşturmaktan sorumlu olan bir temsilci ile ilişkilendirir. @tr
definition: Hozzákapcsol egy forrást egy ágenshez, amely felelős egy forrás gyártásáért oly módon, hogy egy követ vagy lemezt készít elő litográfiai nyomtatáshoz, azaz kőnyomathoz. @hu
definition: Liittää aineiston toimijaan, joka on vastuussa aineiston valmistamisesta valmistamalla litografiassa käytetyn kivilaatan tai muun painolaatan. @fi
definition: Relaciona un recurs amb un agent que és responsable de la creació d’un recurs amb la preparació d’una pedra o una planxa per a la impressió litogràfica. @ca
definition: Relaterer en ressource til en agent, der har været involveret i fremstillingen af en ressource ved at forberede en sten eller plade til litografisk trykning. @da
definition: Relates a resource to an agent who is responsible for creating a resource by preparing a stone or plate for lithographic printing.
definition: Setzt eine Ressource in Beziehung zu einem Akteur, der für die Herstellung einer Ressource verantwortlich ist, indem er einen Stein oder eine Platte für lithografischen Druck vorbereitet. @de
definition: يربط مصدر بوكيل مسؤول عن إنتاج مصدر من خلال تجهيز حجر أو لوح للطباعة الحجرية. @ar
definition: 将一种资源与通过制作用于平版印刷的石头或平版而对一种资源的创建负责的一个行为者关联起来。 @zh-hans
scope note: A lithographer includes a graphic artist creating a design directly on the surface from which printing will be done.
scope note: A litográfus egy grafikusművész, aki közvetlenül azon a felületen készít tervet, amelyről a nyomtatás történik. @hu
scope note: Bir taş baskı sanatçısı, baskının yapılacağı yüzey üzerinde doğrudan bir tasarım yaratan bir grafik sanatçısı içerir. @tr
scope note: Darunter fallen Grafikerinnen/Grafiker, die ein Muster direkt auf der Oberfläche erstellen, von der aus gedruckt werden soll. @de
scope note: En litograf omfatter en grafiker, der har skabt et design direkte på overfladen, hvorfra trykning vil blive lavet. @da
scope note: Litografi tarkoittaa myös graafikkoa, joka tekee piirroksen suoraan painamiseen käytettävälle pinnalle. @fi
scope note: يتضمن مصطلح طبّاع على الحجر كذلك إلى فنان الجرافيك الذي ينشيء تصميما مباشرة على السطح الذي ستتم الطباعة منه. @ar
scope note: 平版制作者包括直接在用于印刷的表面进行设计创作的平面美术家 @zh-hans

has platemaker
lexical alias: platemaker.en
status: Published
type: Property
label: har plademager @da
label: hat Druckformherstellerin/Druckformhersteller @de
label: heeft platenmaker @nl
label: levhacı ile ilişkilidir @tr
label: nyomólemez-készítője a következő: @hu
label: painolaatan valmistaja @fi
label: له مُحضر سطح طباعي @ar
label: 有制版者 @zh-hans
sub property of: has related agent of resource
inverse of: is platemaker of
definition: Bir kaynağı, bir kaynaktaki basılı görüntülerin veya metnin oluşturulmasında kullanılan plakaların hazırlanmasından sorumlu olan bir temsilci ile ilişkilendirir. @tr
definition: Hozzákapcsol egy forrást egy ágenshez, amely felelős egy forrás gyártásáért oly módon, hogy nyomtatott képek vagy szövegek előállításánál használt lemezeket készít elő. @hu
definition: Liittää aineiston toimijaan, joka on vastuussa aineiston valmistamisesta valmistamalla painettujen kuvien tai tekstin valmistuksessa käytettäviä painolaattoja tai -levyjä. @fi
definition: Relaciona un recurs amb un agent que és responsable de la preparació de les planxes usades en l’elaboració d’imatges o de text imprès en un recurs. @ca
definition: Relaterer en ressource til en agent, der har været involveret i fremstillingen af en ressource ved at forberede plader, der anvendes til fremstilling af trykte billeder og/eller tekst. @da
definition: Relates a resource to an agent who is responsible for preparing plates used in the making of printed images or text in a resource.
definition: Setzt eine Ressource in Beziehung zu einem Akteur, der für die Herstellung einer Ressource verantwortlich ist, indem er Druckformen für die Produktion von gedruckten Bildern oder gedrucktem Text anfertigt. @de
definition: يربط مصدر بوكيل مسؤول عن إنتاج مصدر من خلال إعداد اللوحات المستخدمة في إنتاج الصور المطبوعة أو النص. @ar
definition: 将一种资源与负责准备用于在一种资源中制作印刷图像或文字的印版的一个行为者关联起来。 @zh-hans

has etcher
lexical alias: etcher.en
status: Published
type: Property
label: etsaaja @fi
label: har raderer @da
label: hat Radiererin/Radierer @de
label: heeft etser @nl
label: karckészítője a következő: @hu
label: oymacı ile ilişkilidir @tr
label: له حَفَّارُ بالزِنْكُوغْراف (الكليشيهات) @ar
label: 有蚀刻者 @zh-hans
sub property of: has printmaker
inverse of: is etcher of
definition: Bir kaynağı, metal, cam veya baskı için kullanılan başka bir yüzeyi asit veya başka bir aşındırıcı maddeye maruz bırakarak bir kaynak oluşturmaktan sorumlu olan bir temsilci ile ilişkilendirir. @tr
definition: Hozzákapcsol egy forrást egy ágenshez, amely felelős egy forrás gyártásáért oly módon, hogy nyomtatáshoz használt fém-, üveg- vagy valamilyen más felületet savnak vagy más maró anyagnak vet alá. @hu
definition: Liittää aineiston toimijaan, joka on vastuussa aineiston valmistamisesta etsaamalla metallia, lasia tai muuta pintaa hapon tai muun syövyttävän aineen avulla. @fi
definition: Relaciona un recurs amb un agent que és responsable de la creació d’un recurs sotmetent a l’àcid, o a qualsevol altra substància corrosiva, el metall, el vidre o qualsevol altra superfície usada en la impressió. @ca
definition: Relaterer en ressource til en agent, der har været involveret i fremstillingen af en ressource ved at udsætte metal, glas eller en anden overflade, der anvendes til trykning, for syre eller et andet ætsende stof. @da
definition: Relates a resource to an agent who is responsible for creating a resource by subjecting metal, glass, or some other surface used for printing, to acid or another corrosive substance.
definition: Setzt eine Ressource in Beziehung zu einem Akteur, der für die Herstellung einer Ressource verantwortlich ist, indem er Metall, Glas oder eine andere Oberfläche, die zum Drucken benutzt wird, mit Säure oder einer anderen ätzenden Substanz behandelt. @de
definition: يربط مصدر بوكيل مسؤول عن إنتاج مصدر من خلال غمر معدن أو زجاج أو أي سطح آخر يستخدم للطباعة، لحامض، أو في أي مادة أخرى كاوية. @ar
definition: 将一种资源与通过使用酸或其他腐蚀性物质施于用来印刷的金属、玻璃或其他表面上而对一种资源的创建负责的一个行为者关联起来。 @zh-hans

has collotyper
lexical alias: collotyper.en
status: Published
type: Property
label: fénynyomatkészítője a következő: @hu
label: har lystrykker @da
label: hat Lichtdruckerin/Lichtdrucker @de
label: heeft collotype-maker @nl
label: kolotip baskıcı ile ilişkilidir @tr
label: kunnioitettu henkilö aineistossa @fi
label: طبّاع صور فوتوغرافية @ar
label: 有珂罗版制作者 @zh-hans
sub property of: has printmaker
inverse of: is collotyper of
definition: Bir kaynağı, bir fotomekanik işlem kullanarak baskı yapmak için kullanılan, mürekkep alıcı ve mürekkep itici yüzeylere sahip sertleştirilmiş bir jelatin veya diğer kolloid filmi hazırlayarak bir kaynak oluşturmaktan sorumlu olan bir temsilci ile ilişkilendirir. @tr
definition: Hozzákapcsol egy forrást egy ágenshez, amely felelős egy forrás gyártásáért oly módon, hogy fotómechanikai eljárás alkalmazásával nyomtatványokat állít elő közvetlenül olyan zselatin vagy más kolloid megkeményedett filmjéből, amelynek tintafelvevő és tintataszító felülete van. @hu
definition: Liittää aineiston toimijaan, joka osallistuu aineiston luomiseen tekemällä vedoksia suoraan kovettuneelta gelatiinifilmiltä tai muulta materiaalilta, jossa on mustetta imeviä ja hylkiviä pintoja. @fi
definition: Relaciona un recurs amb un agent que és responsable de la creació d’un recurs mitjançant la preparació d’una pel·lícula endurida de gelatina o d’un altre col·loide que té superfícies que accepten o rebutgen la tinta i que s’usa per fer gravats usant un procés fotomecànic. @ca
definition: Relaterer en ressource til en agent, der har været involveret i fremstillingen af en ressource vha. en fotomekanisk proces, hvorved der er blevet lavet tryk direkte fra et hærdet gelatinelag eller andet kolloid, der har blækmodtagelige og blækafvisende overflader. @da
definition: Relates a resource to an agent who is responsible for creating a resource by preparing a hardened film of gelatin or other colloid that has ink-receptive and ink-repellent surfaces and that is used to make prints using a photomechanical process.
definition: Setzt eine Ressource in Beziehung zu einem Akteur, der für die Herstellung einer Ressource verantwortlich ist, indem er ein fotomechanisches Verfahren zur Herstellung von Abzügen direkt von einem gehärteten Film aus Gelatine oder einem anderen Kolloid verwendet, der druckerfarbenaufnehmende und -abweisende Oberflächen aufweist. @de
definition: يربط مصدر بوكيل مسؤول عن إنتاج مصدر من خلال استخدام عمليات ميكانيكية ضوئية لإنتاج المطبوعات مباشرة من فيلم صلد من الجيلاتين أو من غيره من المواد الغروية التي تحتوي على أسطح مستقبلة أو طاردة للحبر. @ar
definition: 将一种资源与通过利用一面吸墨而另一面不吸墨的明胶或其他硬胶片进行影印对一种资源的创建负责的一个行为者关联起来。 @zh-hans

has printer
lexical alias: printer.en
status: Published
type: Property
label: aineiston painaja @fi
label: har trykker @da
label: hat Druckerin/Drucker @de
label: heeft drukker @nl
label: matbaacı ile ilişkilidir @tr
label: nyomdásza a következő: @hu
label: له طابعة @ar
label: 有印刷者 @zh-hans
sub property of: has manufacturer
inverse of: is printer of
definition: Bir kaynağı, basılı metin, notalı müzik veya diğer içerik kaynaklarını yazı veya plakalardan üretmekten sorumlu olan bir temsilci ile ilişkilendirir. @tr
definition: Hozzákapcsol egy forrást egy ágenshez, amely felelős egy nyomtatott szöveg, kottázott zene vagy egyéb tartalom forrásának nyomdai szedésből vagy lemezekből történő gyártásáért. @hu
definition: Liittää aineiston toimijaan, joka on vastuussa painetun tekstin, nuottiaineiston tai muun aineiston valmistamiseen painolaatalta tai -levyltä. @fi
definition: Relaterer en ressource til en agent, der har været involveret i fremstillingen af en ressource af trykt tekst, noteret musik etc. fra skrift eller plader, såsom en bog, en avis, et magasin, en plakat, et partitur etc. @da
definition: Relates a resource to an agent who is responsible for manufacturing a resource of printed text, notated music, or other content from type or plates.
definition: Setzt eine Ressource in Beziehung zu einem Akteur, der für die Herstellung einer Ressource von gedrucktem Text, Noten oder anderem Inhalt durch Drucktypen oder Druckformen verantwortlich ist. @de
definition: يربط مصدر بوكيل مسؤول عن إنتاج مصدر لنص مطبوع، موسيقى مدونة أو محتوى من نوع أو من لوحات آخرى. @ar
definition: 将一种资源与负责生产用活字或平版印刷文字、乐谱或其他内容的一种资源的一个行为者关联起来。 @zh-hans

has presenter
lexical alias: presenter.en
status: Published
type: Property
label: bemutatja a következő: @hu
label: esittäjä aineistossa @fi
label: har presenter @da
label: hat Präsentatorin/Präsentator @de
label: heeft presenterende @nl
label: sunucu ile ilişkilidir @tr
label: له مُقدم @ar
label: 有出品人 @zh-hans
sub property of: has contributor (Deprecated)
inverse of: is presenter of
definition: Bir kaynağı, hareketli görüntü materyalleri için "X sunar" atıfında adı geçen ve muhtemelen yapım, finans veya dağıtımla bir şekilde bağlantılı olan bir temsilci ile ilişkilendirir. @tr
definition: Hozzákapcsol egy forrást egy mozgóképanyag „az X bemutatja:” stáblistaelemében említett ágenshez, amely valószínűleg valamilyen módon az előállításhoz, a finanszírozáshoz vagy a terjesztéshez kapcsolódik. @hu
definition: Liittää aineiston toimijaan, joka mainitaan alku- tai lopputekstien "X esittää:" -merkinnössä ja joka todennäköisesti liittyy liikkuvan kuvan teoksen aineiston tuotantoon, rahoitukseen tai jakeluun jollakin tavoin. @fi
definition: Relaterer en ressource til en agent, der er nævnt i en fortekst i levende billedmaterialer som ”X præsenterer”, og som sandsynligvis er knyttet til produktion, finansiering eller distribution på en eller anden måde. @da
definition: Relates a resource to an agent mentioned in an "X presents" credit for moving image materials and who is probably associated with production, finance, or distribution in some way.
definition: Setzt eine Ressource in Beziehung zu einem Akteur, der in einem "X präsentiert"-Vorspann für Bewegtbildmaterialien erwähnt wird und der wahrscheinlich mit der Produktion, Finanzierung oder dem Vertrieb in Verbindung steht. @de
definition: يربط مصدر بوكيل وارد ذكره في "أحد التقديمات" مسؤول عن نقل مواد صور متحركة وربما يكون مرتبطا بطريقة ما بالإنتاج أو التمويل أو التوزيع @ar
definition: 将一种资源与一种动态图像资源的摄制人员名单中以“某某 出品”（X presents）的方式被提及的且和制作、财务或发行等有某些联系的一个行为者关联起来。 @zh-hans

has degree supervisor
lexical alias: degreeSupervisor.en
status: Published
type: Property
label: har vejleder @da
label: hat Betreuerin/Betreuer einer Hochschulschrift @de
label: heeft graad-begeleider @nl
label: opinnäytteen ohjaaja aineistossa @fi
label: tez danışmanı ile ilişkilidir @tr
label: témavezetője a következő: @hu
label: مشرف على درجة أكاديمية @ar
label: 有学位导师 @zh-hans
sub property of: has creator
inverse of: is degree supervisor of
definition: Bir kaynağı, bir kaynak olarak sonuçlanan akademik bir derece için tez veya bitirme tezi araştırmasına danışmanlık yapmaktan veya denetlemekten sorumlu olan bir akademik danışmanla ilişkilendirir. @tr
definition: Hozzákapcsol egy forrást egy szakdolgozati vagy disszertációs kutatás tanácsadójához vagy felügyelőjéhez, aki egy tudományos fokozatot vagy értekezést ellenőriz. @hu
definition: Liittää aineiston toimijaan, joka vastaa akateemisen opinnäytteen tai väitöskirjan ohjaamisesta tai valvomisesta. @fi
definition: Relaciona un recurs amb un agent que és un supervisor acadèmic que és responsable d’assessorar o supervisar la recerca de tesis o dissertacions per a una titulació acadèmica que dona com a resultat un recurs. @ca
definition: Relaterer en ressource til en agent, der vejleder ved udarbejdelsen af afhandlingen til enten en akademisk grad eller et speciale. @da
definition: Relates a resource to an agent who is an academic supervisor who is responsible for advising or overseeing thesis or dissertation research for an academic degree that results in a resource.
definition: Setzt eine Ressource in Beziehung zu einer akademischen Betreuerin/einem akademischen Betreuer, die/der für die Beratung und Aufsicht von Forschungstätigkeiten im Rahmen einer Hochschulschrift verantwortlich ist, die zur Erlangung eines akademischen Grads und zu einer Ressource führen. @de
definition: يربط مصدر بمشرف أكاديمي مسؤول عن تقديم المشورة أو الإشراف على أطروحة ماجستير أو دكتوراه للحصول على درجة علمية تسفر عن مصدر. @ar
definition: 将一种资源与作为学术主管、负责对导致一种资源的学位论文提出建议或进行监督的一个行为者关联起来。 @zh-hans

has illuminator
lexical alias: illuminator.en
status: Published
type: Property
label: aineiston illuminoinnin tekijä @fi
label: har illuminator @da
label: hat Illuminatorin/Illuminator @de
label: heeft verluchter @nl
label: illuminátora a következő: @hu
label: tezhip sanatçısı ile ilişkilidir @tr
label: له مزخرِف @ar
label: 有彩饰者 @zh-hans
sub property of: has other agent associated with resource (Deprecated)
inverse of: is illuminator of
definition: Bir kaynağı, değerli metaller veya renkler kullanarak, genellikle ayrıntılı tasarımlar ve motiflerle süsleyen bir temsilci ile ilişkilendirir. @tr
definition: Hozzákapcsol egy forrást egy ágenshez, amely egy adott példányt nemesfémekkel vagy színekkel díszít, gyakran gondosan kidolgozott kivitelezéssel és motívumok használával. @hu
definition: Liittää aineiston toimijaan, joka koristelee tietyn aineiston, usein yksityiskohtaisin kuvioin tai motiivein, käyttäen jalometalleja tai värejä. @fi
definition: Relaterer en ressource til en agent, der tilfører udsmukning til en særlig ressource vha. ædelmetal eller farve, ofte med udsøgte mønstre og motiver. @da
definition: Relates a resource to an agent who decorates a specific resource using precious metals or colour, often with elaborate designs and motifs.
definition: Setzt eine Ressource in Beziehung zu einem Akteur, der eine bestimmte Ressource durch Edelmetalle oder Farben, häufig mit kunstvollen Mustern und Motiven, (aus-)gestaltet. @de
definition: يربط مصدر بوكيل يقوم بتزيين مصدر محدد باستخدام معادن ثمينة أو ألوان، غالبًا بتصاميم وزخارف منمقة. @ar
definition: 将一种资源与用贵重的金属或色彩（通常有精心的设计和图案）装饰一种特定资源的一个行为者关联起来。 @zh-hans

has editor of moving image resource
see also: is author of
lexical alias: editorOfMovingImageResource.en
status: Published
type: Property
label: hareketli görüntü kaynağının editörü ile ilişkilidir @tr
label: hat Filmeditorin/Filmeditor @de
label: heeft filmeditor van bewegend beeld-resource @nl
label: klipper @da
label: liikkuvan kuvan leikkaaja aineistossa @fi
label: mozgóképforrás szerkesztője a következő: @hu
label: له محرر مصدر صور متحركة @ar
label: 有动态图像资源的剪辑师 @zh-hans
sub property of: has contributor (Deprecated)
inverse of: is editor of moving image resource of
definition: Bir kaynağı, hem görsel hem de işitsel yönler dahil olmak üzere film, video veya diğer hareketli görüntü formatlarını bir araya getirmekten, düzenlemekten ve kırpmaktan sorumlu bir temsilci ile ilişkilendirir. @tr
definition: Hozzákapcsol egy forrást egy ágenshez, amely felelős film, videó vagy más mozgókép-formátum összeállításáért, elrendezéséért és vágásáért, beleértve mind a vizuális, mind az audió szempontokat. @hu
definition: Liittää aineiston toimijaan, joka vastaa elokuvan, videon tai muiden elokuvaformaattien kokoamisesta, järjestämisestä ja leikkauksesta sekä kuvan että äänen osalta. @fi
definition: Relaterer en ressource til en agent, der er ansvarlig for at have sammensat, arrangeret og klippet film, video eller andre levende billedformater, inkl. både visuelle og lydmæssige aspekter. @da
definition: Relates a resource to an agent who is responsible for assembling, arranging, and trimming film, video, or other moving image formats, including both visual and audio aspects.
definition: Setzt eine Ressource in Beziehung zu einem Akteur, der für das Zusammensetzen, Arrangieren und Nachschneiden von Film-, Video- oder anderen Bewegtbildformaten zuständig ist. Dies betrifft sowohl Video- als auch Audio-Eigenschaften. @de
definition: يربط مصدر بوكيل مسؤول عن تجميع أفلام، فيديو أو أشكال الصور المتحركة الأخرى وترتيبها وتشذيبها، بما في ذلك الجوانب المرئية والمسموعة. @ar
definition: 将一种资源与对影片、视频或其他动态图像格式（包括视频和音频方面）的汇编、编排和剪辑负责的一个行为者关联起来。 @zh-hans

has programmer
lexical alias: programmer.en
status: Published
type: Property
label: aineiston ohjelmoija @fi
label: har programmør @da
label: hat Programmiererin/Programmierer @de
label: heeft programmeur @nl
label: programcı ile ilişkilidir @tr
label: programozója a következő: @hu
label: له مُبرمج @ar
label: 有编程者 @zh-hans
sub property of: has creator
inverse of: is programmer of
definition: Bir kaynağı, bir bilgisayar programı oluşturmaktan sorumlu olan bir temsilci ile ilişkilendirir. @tr
definition: Hozzákapcsol egy forrást egy ágenshez, amely felelős egy számítógépes program megalkotásáért. @hu
definition: Liittää aineiston toimijaan, joka vastaa tietokoneohjelman luomisesta. @fi
definition: Relaterer en ressource til en agent, der er ansvarlig for at have skabt et computerprogram. @da
definition: Relates a resource to an agent who is responsible for creating a computer program.
definition: Setzt eine Ressource in Beziehung zu einem Akteur, der für die Schaffung eines Computerprogramms verantwortlich ist. @de
definition: يربط مصدر بوكيل مسؤول عن إنشاء برنامج كمبيوتر. @ar
definition: 将一种资源与负责创建一种计算机程序的一个行为者关联起来。 @zh-hans

has designer
lexical alias: designer.en
status: Published
type: Property
label: aineiston suunnittelija @fi
label: har designer @da
label: hat Designerin/Designer @de
label: heeft ontwerper @nl
label: tasarımcı ile ilişkilidir @tr
label: tervezője a következő: @hu
label: له مُصمم @ar
label: 有设计者 @zh-hans
sub property of: has creator
inverse of: is designer of
definition: Bir kaynağı, bir nesne için tasarım oluşturmaktan sorumlu olan bir temsilci ile ilişkilendirir. @tr
definition: Hozzákapcsol egy forrást egy ágenshez, amely felelős egy tárgy tervezetének a megalkotásáért. @hu
definition: Liittää aineiston toimijaan, joka vastaa esineen suunnittelusta. @fi
definition: Relaterer en ressource til en agent, der er ansvarlig for ideen bag designet for et objekt. @da
definition: Relates a resource to an agent who is responsible for creating a design for an object.
definition: Setzt eine Ressource in Beziehung zu einem Akteur, der für die Gestaltung des Designs eines Objekts verantwortlich ist. @de
definition: يربط مصدر بوكيل مسؤول عن إعداد تصميم لكائن ما. @ar
definition: 将一种资源与负责创建一个物体的设计的一个行为者关联起来。 @zh-hans

has cartographer
lexical alias: cartographer.en
status: Published
type: Property
label: aineiston kartografi @fi
label: har kartograf @da
label: hat Kartografin/Kartograf @de
label: heeft cartograaf @nl
label: kartograf ile ilişkilidir @tr
label: térképésze a következő: @hu
label: له رسام خرائط @ar
label: 有地图绘制者 @zh-hans
sub property of: has creator
inverse of: is cartographer of
definition: Bir kaynağı, kartografik bir kaynaktan sorumlu olan bir temsilci ile ilişkilendirir. @tr
definition: Hozzákapcsol egy forrást egy ágenshez, amely felelős egy kartográfiai forrás megalkotásáért. @hu
definition: Liittää aineiston toimijaan, joka vastaa kartografisesta aineistosta. @fi
definition: Relaterer en ressource til en agent, der er ansvarlig for at have skabt et kort, et atlas, en globus eller en anden kartografisk ressource. @da
definition: Relates a resource to an agent who is responsible for a cartographic resource.
definition: Setzt eine Ressource in Beziehung zu einem Akteur, der für eine kartografische Ressource verantwortlich ist. @de
definition: يربط مصدر بوكيل مسؤول عن مصدر خرائطي @ar
definition: 将一种资源与负责一种地图资源的一个行为者关联起来。 @zh-hans

has composer
lexical alias: composer.en
status: Published
type: Property
label: aineiston säveltäjä @fi
label: besteci ile ilişkilidir @tr
label: hat Komponistin/Komponist @de
label: heeft componist @nl
label: komponist @da
label: zeneszerzője a következő: @hu
label: له مُلحن @ar
label: 有作曲者 @zh-hans
sub property of: has creator
inverse of: is composer of
definition: Bir kaynağı, müzikal bir kaynak oluşturmaktan sorumlu olan bir temsilci ile ilişkilendirir. @tr
definition: Hozzákapcsol egy forrást egy ágenshez, amely felelős egy zenei forrás megalkotásáért. @hu
definition: Liitää aineiston toimijaan, joka vastaa musiikkiaineiston luomisesta. @fi
definition: Relaterer en ressource til en agent, der er ansvarlig for at have skabt en musikressource. @da
definition: Relates a resource to an agent who is responsible for creating a musical resource.
definition: Setzt eine Ressource in Beziehung zu einem Akteur, der für die Schaffung einer Musikressource verantwortlich ist. @de
definition: يربط مصدر بوكيل مسؤول عن إنشاء مصدر موسيقي. @ar
definition: 将一种资源与负责创建一种音乐资源的一个行为者关联起来。 @zh-hans
scope note: Adaptation of another musical resource to form a distinct alteration, paraphrasing a resource or creating a resource in the general style of another composer, or creating a resource that is based on the music of another composer, is included.
scope note: Başka bir müzik kaynağının belirgin bir değişiklik oluşturacak şeklde uyarlanması, bir kaynağın başka sözcüklerle ifade edilmesi veya başka bir bestecinin genel üslubunda bir kaynak oluşturulması veya başka bir bestecinin müziğine dayalı bir kaynak oluşturulması dahildir. @tr
scope note: Bearbejdninger af en anden musikressource for at danne en distinkt forandring ved at parafrasere en ressource eller skabe en ressource i en anden komponists typiske stil, eller skabe en ressource, der er baseret på en anden komponists musik, er omfattet. @da
scope note: Beletartozik egy másik zenei forrás adaptálása egy eltérő alterációs formára, egy forrás parafrazeálása, vagy egy forrás megalkotása egy másik zeneszerző általános stílusában, vagy egy olyan forrás megalkotása, amely egy másik zeneszerző zenéjén alapul. @hu
scope note: Darunter fallen Adaptionen anderer Musikressourcen, die sich deutlich vom Original unterscheiden, Paraphrasierungen von Ressourcen oder Schaffungen neuer Ressourcen im Stil einer anderen Komponistin/eines anderen Komponisten oder Schaffungen von Ressourcen, die auf der Musik einer anderen Komponistin/eines anderen Komponisten basieren. @de
scope note: Koskee toisen musiikkiaineiston muuttamista erillisen muunnoksen muodostamiseksi, mukailua, aineiston luomista toisen säveltäjän tyylillä taitai toisen säveltäjän musiikkiin perustuvan aineiston luomista. @fi
scope note: يتم تضمين تكييف مصدر موسيقي آخر لتشكيل تغيير مميز، أو إعادة صياغة مصدر أو إنشاء مصدر بالأسلوب العام لمؤلف موسيقي آخر، أو إنشاء مصدر يعتمد على موسيقى مُلحن آخر. @ar
scope note: 包括将另一种音乐资源改编以形成一种不同的变化形式、将一种资源演绎或用另一个作曲者的一般风格创建一种新的资源、或者基于另一个作曲者的音乐创建一种新的资源。 @zh-hans

has inventor
lexical alias: inventor.en
status: Published
type: Property
label: feltalálója a következő: @hu
label: har opfinder @da
label: hat Erfinderin/Erfinder @de
label: heeft uitvinder @nl
label: keksijä aineistossa @fi
label: mucit ile ilişkilidir @tr
label: له مخترع @ar
label: 有发明者 @zh-hans
sub property of: has creator
inverse of: is inventor of
definition: Bir kaynağı, yeni bir aygıt veya işlem oluşturmaktan sorumlu olan bir temsilci ile ilişkilendirir. @tr
definition: Hozzákapcsol egy forrást egy ágenshez, amely felelős egy új eszköz vagy eljárás létrehozásáért. @hu
definition: Liittää aineiston toimijaan, joka vastaa uuden laitteen tai prosessin luomisesta. @fi
definition: Relaterer en ressource til en agent, der er ansvarlig for at have skabt en ny anordning eller proces. @da
definition: Relates a resource to an agent who is responsible for creating a new device or process.
definition: Setzt eine Ressource in Beziehung zu einem Akteur, der für die Schaffung eines neuen Geräts oder Prozesses verantwortlich ist. @de
definition: يربط مصدر بوكيل مسؤول عن إنشاء جهاز جديد أو عملية جديدة. @ar
definition: 将一种资源与负责创建一种新装置或新过程的一个行为者关联起来。 @zh-hans

has compiler
see also: has editor (Deprecated
has subproperty: has collection registrar
lexical alias: compiler.en
status: Published
type: Property
label: aineiston kokoaja @fi
label: derleyen ile ilişkilidir @tr
label: har kompilator @da
label: hat Zusammenstellende/Zusammenstellenden @de
label: heeft samensteller @nl
label: összeállítója a következő: @hu
label: له جامع @ar
label: 有编纂者 @zh-hans
sub property of: has aggregator
inverse of: is compiler of
definition: Bir kaynağı, bir üstveri seti oluşturmaktan sorumlu olan bir temsilciyle ilişkilendirir. @tr
definition: Hozzákapcsol egy forrást egy ágenshez, amely adatok, információk stb. kiválasztása, elrendezése, aggregálása és szerkesztése révén felelős egy olyan új forrás létrehozásáért, mint például egy bibliográfia vagy adattár. @hu
definition: Liittää aineiston toimijaan, joka vastaa metatietokokonaisuuden luomisesta. @fi
definition: Relaciona un recurs amb un agent que és responsable de la creació d’un conjunt de descripció de metadades. @ca
definition: Relaterer en ressource til en agent, der er ansvarlig for at have skabt en ny ressource, fx en bibliografi eller en fortegnelse, ved at udvælge, arrangere, samle og redigere data, information etc. @da
definition: Relates a resource to an agent who is responsible for creating a metadata description set.
definition: Setzt eine Ressource in Beziehung zu einem Akteur, der durch Selektieren, Gliedern, Aggregieren und Editieren von Daten und Informationen und so weiter für die Schaffung einer neuen Ressource, zum Beispiel einer Bibliografie oder eines Verzeichnisses, verantwortlich ist. @de
definition: يربط مصدر بوكيل مسؤول عن إنشاء مصدر جديد مثل ببليوجرافية أو دليل عن طريق اختيار البيانات والمعلومات وترتيبها وتجميعها وتحريرها، إلخ. @ar
definition: 将一种资源与负责创建一个元数据描述集的一个行为者关联起来。 @zh-hans
scope note: A metadata description set includes a bibliography of resources, a directory of agents and places, and an analytic finding aid.
scope note: Bir üstveri seti, kaynakların bir bibliyografyasını, temsilciler ve yerler dizinini ve analitik rehber bilgi içerir. @tr
scope note: Darunter fallen keine Überarbeitungen oder Erläuterungen des Inhalts oder die Auswahl und das Zusammenstellung von Ressourcen oder Teilen von Ressourcen durch eine geistige Schöpferin/einen geistigen Schöpfer oder mehrere geistige Schöpferinnen/geistiger Schöpfer. @de
scope note: Metatietokokonaisuus sisältää aineistojen bibliografian, toimijoiden ja paikkojen hakemiston sekä luettelon. @fi
scope note: Nem tartozik bele sem a tartalom felülvizsgálata, sem az egy vagy több létrehozótól származó források vagy részforrások kiválasztása és összeállítása. @hu
scope note: Revisioner eller indholdspræciseringer, eller udvælgelse og sammensætning af værker og dele af ressourcer, af et eller flere ophav er ikke omfattet. @da
scope note: Un conjunt de descripció de metadades inclou una bibliografia de recursos, un directori d’agents i llocs i un instrument de descripció analític. @ca
scope note: يُستبعد مراجعة أو توضيح محتوى، أو اختيار وتجميع مصادر أو أجزاء من المصادر معًا، بواسطة واحد أو أكثر من المبدعين. @ar
scope note: 元数据描述集包括资源的书目、行为者和地点的名录、以及分析查询工具。 @zh-hans

has photographer
lexical alias: photographer.en
status: Published
type: Property
label: aineiston valokuvaaja @fi
label: fotoğrafçı ile ilişkilidir @tr
label: fényképésze a következő: @hu
label: har fotograf @da
label: hat Fotografin/Fotograf @de
label: heeft fotograaf @nl
label: له مصوِّر فوتوجرافي @ar
label: 有摄影者 @zh-hans
sub property of: has creator
inverse of: is photographer of
definition: Bir kaynağı, fotoğrafik bir kaynak oluşturmaktan sorumlu olan bir temsilci ile ilişkilendirir. @tr
definition: Hozzákapcsol egy forrást egy ágenshez, amely felelős egy fényképészeti forrás megalkotásáért. @hu
definition: Liittää aineiston toimijaan, joka vastaa valokuva-aineiston luomisesta. @fi
definition: Relaterer en ressource til en agent, der er ansvarlig for at have skabt en fotografisk ressource. @da
definition: Relates a resource to an agent who is responsible for creating a photographic resource.
definition: Setzt eine Ressource in Beziehung zu einem Akteur, der für die Schaffung eines fotografischen Werks verantwortlich ist. @de
definition: يربط مصدر بوكيل مسؤول عن إنشاء مصدر فوتوجرافي. @ar
definition: 将一种资源与负责创建一种摄影资源的一个行为者关联起来。 @zh-hans

has interviewer
lexical alias: interviewer.en
status: Published
type: Property
label: görüşmeci ile ilişkilidir @tr
label: haastattelija aineistossa @fi
label: har interviewer @da
label: hat Interviewerin/Interviewer @de
label: heeft interviewer @nl
label: interjúkészítője a következő: @hu
label: له مُحاور @ar
label: 有采访者 @zh-hans
sub property of: has creator
inverse of: is interviewer of
definition: Bir kaynağı, röportajcı, muhabir, anketör veya bilgi toplayan başka tür bir temsilci olarak hareket ederek kaynak oluşturmaktan sorumlu olan bir temsilci ile ilişkilendirir. @tr
definition: Hozzákapcsol egy forrást egy ágenshez, amely felelős egy forrás létrehozásáért oly módon, hogy interjúkészítőként, riporterként, közvélemény-kutatóként, vagy valamilyen más információgyűjtő ágensként cselekszik. @hu
definition: Liittää aineiston toimijaan, joka vastaa aineiston luomisesta toimimalla haastattelijana, toimittajana, mielipidetutkijana tai muunlaisena tiedonkerääjänä. @fi
definition: Relaterer en ressource til en agent, der er ansvarlig for at have skabt en ressource ved at optræde som interviewer, journalist, medarbejder ved et meningsmålingsinstitut eller en anden informationsindsamler. @da
definition: Relates a resource to an agent who is responsible for creating a resource by acting as an interviewer, reporter, pollster, or some other kind of agent who gathers information.
definition: Setzt eine Ressource in Beziehung zu einem Akteur, der für die Schaffung einer Ressource verantwortlich ist, indem er als Interviewerin/Interviewer, Reporterin/Reporter, Meinungsforscherin/Meinungsforscher oder anderer Akteur Informationen zusammenträgt. @de
definition: يربط مصدر بوكيل مسؤول عن إنشاء مصدر من خلال العمل كمحاور أو مراسل أو خبير استطلاعات رأي أو وكيل من نوع آخر يجمع المعلومات. @ar
definition: 将一种资源与通过担当采访者、记者、民意调查员或其他类型信息搜集行为者而对一种资源的创建负责的一个行为者关联起来。 @zh-hans

has artist
has subproperty: has sculptor
has subproperty: has calligrapher
has subproperty: has book artist
lexical alias: artist.en
status: Published
type: Property
label: har kunstner @da
label: hat Künstlerin/Künstler @de
label: heeft kunstenaar @nl
label: művésze a következő: @hu
label: sanatçı ile ilişkilidir @tr
label: taiteilija aineistossa @fi
label: له فنان @ar
label: 有美术家 @zh-hans
sub property of: has creator
inverse of: is artist of
definition: Bir kaynağı, özgün bir grafik tasarım, çizim, boyama vb. oluşturmaktan sorumlu olan bir temsilci ile ilişkilendirir. @tr
definition: Hozzákapcsol egy forrást egy ágenshez, amely felelős egy eredeti grafikai terv, rajz, festmény, stb. megalkotásáért. @hu
definition: Liittää aineiston toimijaan, joka vastaa alkuperäisen graafisen suunnittelun, piirroksen, maalauksen tms. luomisesta. @fi
definition: Relaterer en ressource til en agent, der er ansvarlig for at have skabt et værk ved at udtænke, og ofte udføre originalgrafik, en original tegning, et originalt maleri etc. @da
definition: Relates a resource to an agent who is responsible for creating an original graphic design, drawing, painting, etc.
definition: Setzt eine Ressource in Beziehung zu einem Akteur, der für die Schaffung einer originalen grafischen Gestaltung, einer Zeichnung, eines Gemäldes und so weiter verantwortlich ist. @de
definition: يربط مصدر بوكيل مسؤول عن إنشاء تصميم رسومي أصلي، رسم، تصوير زيتي...إلخ. @ar
definition: 将一种资源与负责完成原创图形设计、绘图、绘画等的一个行为者关联起来。 @zh-hans

has interviewee
lexical alias: interviewee.en
status: Published
type: Property
label: görüşülen ile ilişkilidir @tr
label: haastateltava aineistossa @fi
label: har interviewede @da
label: hat Interviewte/Interviewten @de
label: heeft geïnterviewde @nl
label: interjúalanya a következő: @hu
label: له مُستجوَب @ar
label: 有受访者 @zh-hans
sub property of: has creator
inverse of: is interviewee of
definition: Bir kaynağı, genellikle bir muhabir, anketör veya bilgi toplayan başka bir tür temsilci olan bir görüşmeciye yanıt vererek bir eser oluşturmaktan sorumlu olan bir temsilci ile ilişkilendirir. @tr
definition: Hozzákapcsol egy forrást egy ágenshez, amely felelős egy forrás létrehozásáért oly módon, hogy válaszol egy interjúkészítőnek, általában riporternek, közvélemény-kutatónak, vagy valamilyen más információgyűjtő ágensnek. @hu
definition: Liittää aineiston toimijaan, joka vastaa aineiston luomisesta vastaamalla haastattelijalle. Yleensä haastattelija on toimittaja, mielipidetutkija tai muunlainen tiedonkeruun tekijä. @fi
definition: Relaterer en ressource til en agent, der er ansvarlig for at have skabt en ressource ved at besvare spørgsmål fra en interviewer, normalt en journalist, medarbejder ved et meningsmålingsinstitut eller en anden informationsindsamler. @da
definition: Relates a resource to an agent who is responsible for creating a resource by responding to an interviewer, usually a reporter, pollster, or some other kind of agent who gathers information.
definition: Setzt eine Ressource in Beziehung zu einem Akteur, der für die Schaffung einer Ressource verantwortlich ist, indem er einer Interviewerin/einem Interviewer antwortet. Dabei handelt es sich normalerweise um eine Reporterin/einen Reporter, eine Meinungsforscherin/einen Meinungsforscher oder eine andere Akteurin/einen anderen Akteur, die/der Informationen zusammenträgt. @de
definition: يربط مصدر بوكيل مسؤول عن إنشاء مصدر من خلال الاستجابة لمحاور، وعادة ما يكون مراسلًا أو مستطلع رأي أو وكيل من نوع آخر يجمع معلومات. @ar
definition: 将一种资源与通过回答采访者（通常是记者、民意调查员或其他类型信息搜集行为者）而对一种资源的创建负责的一个行为者关联起来。 @zh-hans

has choreographer
lexical alias: choreographer.en
status: Published
type: Property
label: aineiston koreografi @fi
label: har koreograf @da
label: hat Choreografin/Choreograf @de
label: heeft choreograaf @nl
label: koreograf ile ilişkilidir @tr
label: koreográfusa a következő: @hu
label: له مصمم رقصات @ar
label: 有编舞者 @zh-hans
sub property of: has creator
inverse of: is choreographer of
definition: Bir kaynağı, koreografik bir kaynaktan sorumlu olan bir temsilci ile ilişkilendirir. @tr
definition: Hozzákapcsol egy forrást egy ágenshez, amely felelős egy koreográfiai forrás megalkotásáért. @hu
definition: Liittää aineiston toimijaan, joka vastaa koreografisesta aineistosta. @fi
definition: Relaciona un recurs amb un agent que és responsable de la creació d’una obra coreogràfica. @ca
definition: Relaterer en ressource til en agent, der er ansvarlig for at have skabt en ressource bestående af bevægelser. @da
definition: Relates a resource to an agent who is responsible for creating a choreographic resource.
definition: Setzt eine Ressource in Beziehung zu einem Akteur, der für eine choreografische Ressource verantwortlich ist. @de
definition: يربط مصدر بوكيل مسؤول عن مصدر لتصميم الرقصات. @ar
definition: 将一种资源与负责创建一种编舞资源的一个行为者关联起来。 @zh-hans

has author
has subproperty: has screenwriter
has subproperty: has lyricist
has subproperty: has librettist
has subproperty: has rapporteur
lexical alias: author.en
status: Published
type: Property
label: aineiston kirjoittaja @fi
label: har forfatter @da
label: hat Verfasserin/Verfasser @de
label: heeft auteur @nl
label: szerzője a következő: @hu
label: yazar ile ilişkilidir @tr
label: له مؤلف @ar
label: 有著者 @zh-hans
sub property of: has creator
inverse of: is author of
definition: Bir kaynağı, metinsel bir kaynaktan sorumlu olan bir temsilci ile ilişkilendirir. @tr
definition: Hozzákapcsol egy forrást egy ágenshez, amely felelős egy szöveges forrás megalkotásáért. @hu
definition: Liittää aineiston toimijaan, joka vastaa tekstiaineistosta. @fi
definition: Relaterer en ressource til en agent, der er ansvarlig for at have skabt en ressource, hvis indhold primært består af tekst, uanset hvilken medietype eller genre der er tale om. @da
definition: Relates a resource to an agent who is responsible for a textual resource.
definition: Setzt eine Ressource in Beziehung zu einem Akteur, der für eine textliche Ressource verantwortlich ist. @de
definition: يربط بين مصدرووكيل مسؤول عن مصدر نصي. @ar
definition: 将一种资源与负责一种文字资源的一个行为者关联起来。 @zh-hans

has architect
has subproperty: has landscape architect
lexical alias: architect.en
status: Published
type: Property
label: aineiston arkkitehti @fi
label: har arkitekt @da
label: hat Architektin/Architekt @de
label: heeft architect @nl
label: mimar ile ilişkilidir @tr
label: építésze a következő: @hu
label: له مهندس معماري @ar
label: 有建筑师 @zh-hans
sub property of: has creator
inverse of: is architect of
definition: Bir kaynağı, bir binanın veya diğer bir yapının tamamlandığında nasıl görüneceğini göstermeyi amaçlayan resimsel bir temsili de dahil olmak üzere mimari bir tasarımın oluşturulmasından sorumlu olan bir temsilci ile ilişkilendirir. @tr
definition: Hozzákapcsol egy forrást egy ágenshez, amely felelős egy építészeti tervért, beleértve egy képi ábrázolást, melynek célja bemutatni, hogy egy épület, vagy egyéb szerkezet, az elkészülte után hogyan fog kinézni. @hu
definition: Liittää aineiston toimijaan, joka vastaa arkkitehtonisen suunnitelman luomisesta, mukaan lukien kuvaesityksestä, jonka tarkoitus on näyttää, miltä rakennus tai muu rakennelma näyttää valmiina. @fi
definition: Relaterer en ressource til en agent, der er ansvarlig for at have skabt et arkitektonisk design, inkl. en billedrepræsentation, der er beregnet til at vise, hvordan en bygning etc. vil se ud, når den er færdig. @da
definition: Relates a resource to an agent who is responsible for an architectural design, including a pictorial representation intended to show how a building or other structure will look when completed.
definition: Setzt eine Ressource in Beziehung zu einem Akteur, der für einen architektonischen Entwurf verantwortlich ist, einschließlich einer bildlichen Darstellung, die zeigt, wie ein Gebäude oder eine andere Konstruktion nach der Fertigstellung aussehen soll. @de
definition: يربط مصدر بوكيل مسؤول عن تصميم معماري، ويشمل ذلك عمل تمثيل تصويري لبيان كيف سيبدو مبنى أو هيكل آخر عند اكتماله. @ar
definition: 将一种资源与负责建筑设计（包括用于展示建筑或其他结构完成之后外观效果的绘画作品）的一个行为者关联起来。 @zh-hans

has filmmaker
lexical alias: filmmaker.en
status: Published
type: Property
label: aineiston elokuvantekijä @fi
label: film üreticisi ile ilişkilidir @tr
label: filmkészítője a következő: @hu
label: har filmskaber @da
label: hat Filmemacherin/Filmemacher @de
label: heeft filmmaker @nl
label: له صانع أفلام @ar
label: 有制片人 @zh-hans
sub property of: has creator
inverse of: is filmmaker of
definition: Bir kaynağı, bağımsız veya kişisel bir film oluşturmaktan sorumlu olan bir temsilci ile ilişkilendirir. @tr
definition: Hozzákapcsol egy forrást egy ágenshez, amely felelős egy független- vagy egy magánfilm létrehozásáért. @hu
definition: Liittää aineiston toimijaan, joka vastaa itsenäisen tai henkilökohtaisen elokuvan luomisesta. @fi
definition: Relaterer en ressource til en agent, der er ansvarlig for at have skabt en uafhængig eller personlig film. @da
definition: Relates a resource to an agent who is responsible for creating an independent or personal film.
definition: Setzt eine Ressource in Beziehung zu einem Akteur, der für die Schaffung eines unabhängigen oder privaten Films verantwortlich ist. @de
definition: يربط مصدر بوكيل مسؤول عن إنشاء فيلم مستقل أو شخصي. @ar
definition: 将一种资源与负责创建一种独立或个人电影的一个行为者关联起来。 @zh-hans

has production designer
lexical alias: productionDesigner.en
status: Published
type: Property
label: aineiston lavastussuunnittelija @fi
label: har produktionsdesigner @da
label: hat Szenenbildnerin/Szenenbildner @de
label: heeft productieontwerper @nl
label: látványtervezője a következő: @hu
label: yapım tasarımcısı ile ilişkilidir @tr
label: له مصمم إنتاج @ar
label: 有制作设计者 @zh-hans
sub property of: has contributor (Deprecated)
inverse of: is production designer of
definition: Bir kaynağı, hareketli görüntü yapımının genel görsel görünümünü tasarlamaktan sorumlu olan bir temsilci ile ilişkilendirir. @tr
definition: Hozzákapcsol egy forrást egy ágenshez, amely felelős egy mozgókép-produkció átfogó vizuális megjelenítésének a tervezéséért. @hu
definition: Liittää aineiston toimijaan, joka vastaa elokuvatuotannon visuaalisen ilmeen suunnittelusta. @fi
definition: Relaterer en ressource til en agent, der er ansvarlig for at have designet en levende billedproduktions overordnede visuelle udseende. @da
definition: Relates a resource to an agent who is responsible for designing the overall visual appearance of a moving image production.
definition: Setzt eine Ressource in Beziehung zu einem Akteur, der für die Gestaltung des gesamten visuellen Erscheinungsbilds einer Bewegtbildproduktion verantwortlich ist. @de
definition: يربط مصدر بوكيل مسؤول عن تصميم المظهر المرئي العام لإنتاج فيلم. @ar
definition: 将一种资源与负责设计动态图像制作整体视觉效果的一个行为者关联起来。 @zh-hans

has distributor
has subproperty: has film distributor
lexical alias: distributor.en
status: Published
type: Property
label: aineiston jakelija @fi
label: dağıtımcı ile ilişkilidir @tr
label: har distributør @da
label: hat Vertrieb @de
label: heeft distributeur @nl
label: terjesztője a következő: @hu
label: له موزع @ar
label: 有发行者 @zh-hans
inverse of: is distributor of
definition: Bir kaynağı, yayınlanmış bir kaynağın dağıtımından sorumlu olan bir temsilci ile ilişkilendirir. @tr
definition: Hozzákapcsol egy forrást egy ágenshez, amely felelős egy publikált forrás megalkotásáért. @hu
definition: Liittää aineiston toimijaan, joka vastaa julkaistun aineiston jakelusta. @fi
definition: Relaterer en ressource til en agent, der er ansvarlig for distribution af en ressource. @da
definition: Relates a resource to an agent who is responsible for distributing a published resource.
definition: Setzt eine Ressource in Beziehung zu einem Akteur, der für den Vertrieb einer Ressource verantwortlich ist. @de
definition: يربط مصدر بوكيل مسؤول عن توزيع مصدر منشور. @ar
definition: 将一种资源与负责发行一种出版资源的一个行为者关联起来。 @zh-hans

has producer of unpublished resource
lexical alias: producerOfUnpublishedResource.en
status: Published
type: Property
label: har producer af en upubliceret ressource @da
label: hat Erzeugerin/Erzeuger einer unveröffentlichten Ressource @de
label: heeft producent van ongepubliceerde resource @nl
label: julkaisemattoman aineiston tuottaja @fi
label: kiadatlan forrás előállítója a következő: @hu
label: yayınlanmamış kaynağın yapımcısı ile ilişkilidir @tr
label: له منتج لمصدر غير منشور @ar
label: 有非出版资源的制作者 @zh-hans
inverse of: is producer of unpublished resource of
definition: Bir kaynağı, yayınlanmamış bir kaynağı yazmaktan, üretmekten, yapmaktan vb. sorumlu olan bir temsilci ile ilişkilendirir. @tr
definition: Hozzákapcsol egy forrást egy ágenshez, amely felelős egy kiadatlan forrás írásáért, összeállításáért, készítéséért, stb. @hu
definition: Liittää aineiston toimijaan, joka vastaa julkaisemattoman aineiston kaiverruksesta, valmistuksesta, kokoonpanosta tai muusta tuotantotavasta. @fi
definition: Relaciona un recurs amb un agent que és responsable de la inscripció, la fabricació, la construcció o un altre mètode de producció d’un recurs no publicat. @ca
definition: Relaterer en ressource til en agent, der er ansvarlig for indgravering, fremstilling, konstruktion etc. af en manifestation i upubliceret form. @da
definition: Relates a resource to an agent who is responsible for inscribing, fabricating, constructing, or other method of producing, an unpublished resource.
definition: Setzt eine Ressource in Beziehung zu einem Akteur, der für das Gravieren, Fabrizieren, Konstruieren und so weiter einer unveröffentlichten Ressource verantwortlich ist. @de
definition: يربط مصدر بوكيل مسؤول عن تسجيل، تصنيع، إنشاء، إلخ. مصدر غير منشور. @ar
definition: 将一种资源与负责一种非出版资源的镌刻、制造、构建或其他制作方法的一个行为者关联起来。 @zh-hans

has producer
has subproperty: has film producer
has subproperty: has radio producer
has subproperty: has television producer
has subproperty: has audio producer
lexical alias: producer.en
status: Published
type: Property
label: aineiston tuottaja @fi
label: előállítója a következő: @hu
label: har producer @da
label: hat Produzentin/Produzent @de
label: heeft producent @nl
label: yapımcı ile ilişkilidir @tr
label: له منتج @ar
label: 有制作者 @zh-hans
sub property of: has other agent associated with resource (Deprecated)
inverse of: is producer of
definition: Bir kaynağı, yayınlanmamış bir kaynağı yazmaktan, üretmekten, yapmaktan veya başka bir üretim yönteminden sorumlu olan bir temsilci ile ilişkilendirir. @tr
definition: Hozzákapcsol egy forrást egy ágenshez, amely felelős egy kiadatlan forrás írásáért, összeállításáért, készítéséért vagy egyéb módú előállításáért. @hu
definition: Liittää aineiston toimijaan, joka vastaa julkaisemattoman aineiston kaiverruksesta, valmistuksesta, kokoonpanosta tms. @fi
definition: Relaciona un recurs amb un agent que és responsable de la majoria dels aspectes comercials de la producció d’una pel·lícula, d’un enregistrament sonor, d’un programa de televisió, d’una emissió web, etc. @ca
definition: Relaterer en ressource til en agent, der er ansvarlig for størstedelen af de forretningsmæssige aspekter ved en produktion beregnet til lærred, lydoptagelse, tv, webcast etc. @da
definition: Relates a resource to an agent who is responsible for most of the business aspects of a production for screen, sound recording, television, webcast, etc.
definition: Setzt eine Ressource in Beziehung zu einem Akteur, der für das Gravieren, Fabrizieren, Konstruieren und so weiter einer unveröffentlichten Ressource verantwortlich ist. @de
definition: يربط مصدر بوكيل مسؤول عن تسجيل، تصنيع، إنشاء، أو بأي طريقة أخرى من طرق الإنتاج، مصدر غير منشور. @ar
definition: 将一种资源与负责银幕、录音、电视、网络直播等制作的大部分商业运作的一个行为者关联起来。 @zh-hans

has performer, narrator, and/or presenter (Deprecated)
lexical alias: performerNarratorAndOrPresenter.en
status: Deprecated
type: Property
definition: Relates a resource to an agent responsible for performing, narrating, and/or presenting a resource. (Deprecated)

has manufacturer
has subproperty: has braille embosser
has subproperty: has printer
lexical alias: manufacturer.en
status: Published
type: Property
label: aineiston valmistaja @fi
label: gyártója a következő: @hu
label: har producent @da
label: hat Hersteller @de
label: heeft vervaardiger @nl
label: üretici ile ilişkilidir @tr
label: له مُصَنِّع @ar
label: 有生产者 @zh-hans
sub property of: has appellation of entity
inverse of: is manufacturer of
definition: Bir kaynağı, yayınlanmış bir kaynağın basılmasından, çoğaltılmasından, dökümünden veya başka bir üretim yönteminden sorumlu olan bir temsilci ile ilişkilendirir. @tr
definition: Hozzákapcsol egy forrást egy ágenshez, amely felelős egy kiadott forrás nyomtatásáért, sokszorosításáért, öntéséért vagy egyéb módú gyártásáért. @hu
definition: Liittää aineiston toimijaan, joka vastaa julkaistun aineiston painamisesta, monistamisesta, kirjasinten valamisesta tai muusta valmistustavasta. @fi
definition: Relaterer en ressource til en agent, der er ansvarlig for trykning, duplikering, støbning etc. af en ressource i publiceret form. @da
definition: Relates a resource to an agent who is responsible for printing, duplicating, casting, or other method of manufacturing a published resource.
definition: Setzt eine Ressource in Beziehung zu einem Akteur, der für den Druck, die Vervielfältigung, den Guss oder eine andere Herstellungsmethode einer veröffentlichten Ressource verantwortlich ist. @de
definition: يربط مصدر بوكيل مسؤول عن طبع، نسخ، طَرَح، أو مرتبط بأي طريقة أخرى بتصنيع مصدر منشور. @ar
definition: 将一种资源与负责一种出版资源的印刷、复制、铸造或其他生产方法的一个行为者关联起来。 @zh-hans

has publisher
has subproperty: has broadcaster
lexical alias: publisher.en
status: Published
type: Property
label: aineiston kustantaja @fi
label: har udgiver @da
label: hat Verlag @de
label: heeft uitgever @nl
label: kiadója a következő: @hu
label: yayıncı ile ilişkilidir @tr
label: له ناشر @ar
label: 有出版者 @zh-hans
inverse of: is publisher of
definition: Bir kaynağı, yayınlanmış bir kaynağı yayınlamaktan, piyasaya sürmek veya çıkarmaktan sorumlu bir temsilci ile ilişkilendirir. @tr
definition: Hozzákapcsol egy forrást egy ágenshez, amely felelős egy kiadott forrás kiadásáért, kibocsájtásáért vagy megjelentetéséért. @hu
definition: Liittää aineiston toimijaan, joka vastaa julkaistun manifestaation kustantamisesta, julkaisemisesta tai ilmestymisestä. @fi
definition: Relaterer en ressource til en agent, der er ansvarlig for at publicere, offentliggøre eller udgive en ressource. @da
definition: Relates a resource to an agent who is responsible for publishing, releasing, or issuing a published resource.
definition: Setzt eine Ressource in Beziehung zu einem Akteur, der für das Veröffentlichen, die Freigabe oder die Herausgabe einer Ressource verantwortlich ist. @de
definition: يربط مصدر بوكيل مسؤول عن نشر، تحرير، أو إصدار مصدر منشور. @ar
definition: 将一种资源与负责出版、发布或发行一种出版资源的一个行为者关联起来。 @zh-hans

has minute taker
lexical alias: minuteTaker.en
status: Published
type: Property
label: har referent @da
label: hat Protokollantin/Protokollant @de
label: heeft notulist @nl
label: jegyzőkönyvvezetője a következő: @hu
label: pöytäkirjan laatija aineistossa @fi
label: zabıt katibi ile ilişkilidir @tr
label: له مدون لمحضر اجتماع @ar
label: 有会议记录者 @zh-hans
sub property of: has contributor (Deprecated)
inverse of: is minute taker of
definition: Bir kaynağı, bir toplantının tutanaklarını kaydetmekten sorumlu olan bir temsilci ile ilişkilendirir. @tr
definition: Hozzákapcsol egy forrást egy ágenshez, amely felelős egy értekezlet jegyzőkönyvének a rögzítéséért. @hu
definition: Liittää aineiston toimijaan, joka vastaa kokouksen pöytäkirjan laatimisesta. @fi
definition: Relaterer en ressource til en agent, der er ansvarlig for at have taget referat ved et møde. @da
definition: Relates a resource to an agent who is responsible for recording the minutes of a meeting.
definition: Setzt eine Ressource in Beziehung zu einem Akteur, der für das Aufzeichnen des Protokolls einer Sitzung verantwortlich ist. @de
definition: يربط مصدر بوكيل مسؤول عن تسجيل محاضر اجتماع. @ar
definition: 将一种资源与负责写会议记录的一个行为者关联起来。 @zh-hans

has creator
has subproperty: has respondent
has subproperty: has collector
has subproperty: has enacting government
has subproperty: has book designer
has subproperty: has printmaker
has subproperty: has caster
has subproperty: has degree supervisor
has subproperty: has programmer
has subproperty: has designer
has subproperty: has cartographer
has subproperty: has composer
has subproperty: has inventor
has subproperty: has photographer
has subproperty: has interviewer
has subproperty: has artist
has subproperty: has interviewee
has subproperty: has choreographer
has subproperty: has author
has subproperty: has architect
has subproperty: has filmmaker
has subproperty: has praeses
has subproperty: has consultant
has subproperty: has commissioning agent
has subproperty: has remix artist
has subproperty: has aggregator
lexical alias: creator.en
status: Published
type: Property
label: aineiston tekijä @fi
label: har ophav @da
label: hat geistige Schöpferin/geistigen Schöpfer @de
label: heeft maker @nl
label: létrehozója a következő: @hu
label: yaratıcı ile ilişkilidir @tr
label: له مُبدع @ar
label: 有创作者 @zh-hans
inverse of: is creator of
definition: Bir kaynağı, bir kaynaktan sorumlu olan bir temsilci ile ilişkilendirir. @tr
definition: Hozzákapcsol egy forrást egy ágenshez, amely felelős egy forrás megalkotásáért. @hu
definition: Liittää aineiston toimijaan, joka vastaa aineistosta. @fi
definition: Relaterer en ressource til en agent, der er ansvarlig for en ressources tilblivelse. @da
definition: Relates a resource to an agent who is responsible for a resource
definition: Setzt eine Ressource in Beziehung zu einem Akteur, der für eine Ressource verantwortlich ist. @de
definition: يربط مصدر بوكيل مسؤول عن مصدر. @ar
definition: 将一种资源与负责一种资源的一个行为者关联起来。 @zh-hans
scope note: Az alkotókhoz tartoznak azok az ágensek, amelyek közösen felelősek egy forrás létrehozásáért akár ugyanabban a közreműködői szerepben, mint például két író közötti együttműködés, akár eltérő közreműködői szerepben, mint például egy zeneszerző és egy szövegíró közötti együttműködés. @hu
scope note: Creators include agents who are jointly responsible for the creation of a resource either performing the same role, such as in a collaboration between two writers, or performing different roles, such as in a collaboration between a composer and a lyricist.
scope note: Darunter fallen Akteure, die für die Schaffung einer Ressource mitverantwortlich sind, wenn sie entweder dieselbe Rolle ausführen, wie bei einer Zusammenarbeit zwischen zwei Schriftstellerinnen/Schriftstellern, oder unterschiedliche Rollen ausführen, wie bei einer Zusammenarbeit zwischen einer Komponistin/einem Komponisten und einer Textdichterin/einem Textdichter. @de
scope note: Koskee toimijoita, jotka yhdessä vastaavat teoksen luomisesta joko toimimalla samassa roolissa kuin toinen toimija, kuten kahden kirjoittajan välisessä yhteistyössä, tai toimimalla eri rooleissa, kuten säveltäjän ja sanoittajan välisessä yhteistyössä. @fi
scope note: Ophav inkluderer agenter der har fælles ansvar for at have skabt en ressource, enten ved at udføre den samme rolle, som i et samarbejde mellem to forfattere, eller udføre forskellige roller, som i et samarbejde mellem fx en komponist og en sangskriver. @da
scope note: Yaratıcılar, bir kaynağın oluşturulmasından ortaklaşa sorumlu olan ajanları içerir; bu, iki yazarın iş birliğinde olduğu gibi aynı rolü üstlenmeleri ya da bir besteci ile bir söz yazarının iş birliğinde olduğu gibi farklı rolleri üstlenmeleri şeklinde olabilir. @tr
scope note: يشمل المبدعون وكلاء يكونون مسؤولين بشكل مشترك عن إنشاء مصدر إما عن طريق أداء نفس الدور الذي يؤديه وكيل آخر كما هو الحال في التعاون بين كاتبين، أو عن طريق أداء دور مختلف كما هو الحال في التعاون بين ملحن ومؤلف أغاني @ar
scope note: 创作者包括对资源的创建联合负责的行为者，他们或者行使同样的角色（例如两个写作者之间的合作）或者行使不同角色（例如作曲者和词作者之间的合作）。 @zh-hans

has director
has subproperty: has film director
has subproperty: has radio director
has subproperty: has television director
lexical alias: director.en
status: Published
type: Property
label: aineiston ohjaaja @fi
label: har instruktør @da
label: hat Regisseurin/Regisseur @de
label: heeft regisseur @nl
label: rendezője a következő: @hu
label: yönetmen ile ilişkilidir @tr
label: له مخرج @ar
label: 有导演 @zh-hans
sub property of: has other agent associated with resource (Deprecated)
inverse of: has director of photography
definition: Bir kaynağı, filme alınmış bir performansın, bir radyo veya televizyon programının vb. genel yönetimi ve denetiminden sorumlu olan bir temsilci ile ilişkilendirir. @tr
definition: Hozzákapcsol egy forrást egy ágenshez, amely felelős egy filmre vett előadás, egy rádió- vagy televízióműsor stb. általános irányításáért és felügyeletéért. @hu
definition: Liittää aineiston toimijaan, joka vastaa elokuvaesityksen, radio- tai televisio-ohjelman tms. yleisestä johtamisesta. @fi
definition: Relaterer en ressource til en agent, der er ansvarlig for ledelse af og tilsyn med en filmoptagelse, et radio- eller tv-program etc. @da
definition: Relates a resource to an agent who is responsible for the general management and supervision of a filmed performance, a radio or television program, etc.
definition: Setzt eine Ressource in Beziehung zu einem Akteur, der für das allgemeine Management und die Leitung einer verfilmten Darbietung, einer Hörfunk- oder Fernsehsendung und so weiter verantwortlich ist. @de
definition: يربط مصدر بوكيل مسؤولا عن الإدارة العامة والإشراف على أداء فيلم، برنامج إذاعي أو برنامج تلفزيوني، إلخ. @ar
definition: 将一种资源与负责电影表演、广播或电视节目等的全面管理和监督的一个行为者关联起来。 @zh-hans

has restorationist
lexical alias: restorationist.en
status: Published
type: Property
label: aineiston entisöijä @fi
label: har konservator @da
label: hat Restauratorin/Restaurator @de
label: heeft restaurator @nl
label: restaurátora a következő: @hu
label: restorasyon uzmanı ile ilişkilidir @tr
label: له أخصائي ترميم @ar
label: 有修复者 @zh-hans
sub property of: has other agent associated with resource (Deprecated)
inverse of: is restorationist of
definition: Bir kaynağı, orijinal durumuna mümkün olduğu kadar yakın bir duruma geri getirerek, bir kaynağın bozulmasını telafi etmeyi amaçlayan bir dizi teknik, editoryal ve fikri prosedürden sorumlu olan bir temsilci ile ilişkilendirir. @tr
definition: Hozzákapcsol egy forrást egy ágenshez, amely felelős technikai, szerkesztői és intellektuális eljárások összességéért, amelyek célja egy forrás romlásának ellensúlyozása, amivel azt az eredeti állapotához a lehető legközelebb képesek visszahozni. @hu
definition: Liittää aineiston toimijaan, joka vastaa teknisistä, toimituksellisista ja tiedollisista toimenpiteistä, joiden tarkoitus on palauttaa huonokuntoinen aineisto mahdollisimman lähelle sen alkuperäistä kuntoa. @fi
definition: Relaterer en ressource til en agent, der har bidraget til en ressource ved at restaurere og/eller kombinere tidligere ressourcer, som kan være beskadigede eller fragmenterede, til at skabe en ny ressource. @da
definition: Relates a resource to an agent who is responsible for the set of technical, editorial, and intellectual procedures aimed at compensating for the degradation of a resource by bringing it back to a state as close as possible to its original condition.
definition: Setzt eine Ressource in Beziehung zu einem Akteur, der für die technischen, redaktionellen und intellektuellen Verfahren verantwortlich ist, die darauf abzielen, die Zersetzung einer Ressource auszugleichen, indem sie in einen Zustand zurückversetzt wird, der ihrer ursprünglichen Beschaffenheit möglichst nahe kommt. @de
definition: يربط مصدر بوكيل مسؤولًا عن مجموعة اجراءات فنية، وتحريرية، وفكرية تهدف إلى تعويض مصدر عن التدهور الذي لحق به بإعادته إلى حالة أقرب ما يكون إلى حالته الأصلية. @ar
definition: 将一种资源与负责为弥补资源的损毁而担负一系列技术、编辑和智力操作、使之尽可能恢复到原始状态的一个行为者关联起来。 @zh-hans

has sponsoring agent of resource
lexical alias: sponsoringAgentOfResource.en
status: Published
type: Property
label: aineistoa sponsoroiva toimija @fi
label: forrás szponzoráló ágense a következő: @hu
label: har sponsorerende korporation @da
label: hat Trägerin/Träger einer Ressource (Akteur) @de
label: heeft sponsor van resource @nl
label: kaynağın sponsoru olan temsilci ile ilişkilidir @tr
label: له وكيل راعي لمصدر @ar
label: 有资源的赞助行为者 @zh-hans
sub property of: has other agent associated with resource (Deprecated)
inverse of: has sponsored resource of agent
definition: Bir kaynağı, bir kaynağın bazı yönlerine sponsor olan bir temsilci ile ilişkilendirir. @tr
definition: Hozzákapcsol egy forráshoz egy ágenshez, amely a forrást valamilyen tekintetben szponzorálja. @hu
definition: Liittää aineiston sitä sponsoroivaan toimijaan. @fi
definition: Relaterer en ressource til en agent, der har bidraget til en ressource via fx forskningsfinansiering, sponsorering af en event. @da
definition: Relates a resource to an agent who sponsors some aspect of a resource.
definition: Setzt eine Ressource in Beziehung zu einem Akteur, der einzelne Aspekte einer Ressource finanziell unterstützt. @de
definition: يربط مصدر بوكيل يرعى بعض جوانب مصدر ما. @ar
definition: 将一种资源与赞助一种资源某方面的一个行为者关联起来。 @zh-hans
scope note: Darunter fallen Forschungsförderungen und die finanzielle Unterstützung einer Veranstaltung, die die Grundlage einer Ressource bilden. @de
scope note: Includes funding research and sponsoring an event that is the basis of a resource.
scope note: Kattaa tutkimuksen rahoituksen ja teoksen perustana olevan tapahtuman sponsoroinnin. @fi
scope note: Magában foglalja kutatás finanszírozását és egy esemény szponzorálását, amely egy forrás alapját képezi. @hu
scope note: kaynağın sponsoru olan temsilci ile ilişkilidir @tr
scope note: يشمل ذلك تمويل البحوث ورعاية حدث يكون أساس لمصدر. @ar
scope note: 包括资助作为一种资源之基础的研究以及赞助作为一种资源之基础的一项活动。 @zh-hans

has director of photography
lexical alias: directorOfPhotography.en
status: Published
type: Property
label: aineiston kuvaaja @fi
label: er filmfotograf til @da
label: görüntü yönetmeni ile ilişkilidir @tr
label: hat Kamerafrau/Kameramann @de
label: heeft cameraregisseur @nl
label: operatőre a következő: @hu
label: له مدير تصوير @ar
label: 有摄影指导 @zh-hans
sub property of: has other agent associated with resource (Deprecated)
inverse of: is director of photography of
definition: Bir kaynağı, elektronik olarak veya film veya stok video üzerinde görüntü kaydeden ve genellikle aydınlatmayı seçip düzenleyen bir temsilci ile ilişkilendirir. @tr
definition: Hozzákapcsol egy forrást egy ágenshez, amely elektronikusan, filmen vagy videóállományon képeket rögzít, és gyakran kiválasztja és elrendezi a megvilágítást. @hu
definition: Liittää toimijan aineistoon, jossa hän vastaa kuvien tallentamisesta joko sähköisesti tai filmille tai videolle, usein myös valaistuksen valitsemisesta ja järjestämisestä. @fi
definition: Relaterer en ressource til en agent, der optager billeder, enten elektronisk eller på film eller video og ofte vælger og arrangerer lyssætning. @da
definition: Relates a resource to an agent who captures images, either electronically or on film or video stock, and often selects and arranges lighting.
definition: Setzt eine Ressource in Beziehung zu einem Akteur, der Bilder aufzeichnet, entweder elektronisch oder auf Film- oder Videomaterial, und häufig Belichtung auswählt und arrangiert. @de
definition: يربط بين مصد ووكيل يلتقط الصور، إما إلكترونيًا أو في فيلم أو فيديو، وغالبًا ما يكون مسئولا عن اختيار الإضاءة وتوزيعها. @ar
definition: 将一种资源与通过电子、胶片或视频存储方式摄录影像、且经常负责灯光的选择和布置的一个行为者关联起来。 @zh-hans
scope note: En filmfotograf kaldes også for cheffotograf. @da

has related agent of agent
has subproperty: has officer
has subproperty: is officer of
has subproperty: has colleague
has subproperty: has friend
has subproperty: has enrolled student
has subproperty: is student at
has subproperty: has fellow student
has subproperty: has student
has subproperty: has teacher
lexical alias: relatedAgentOfAgent.en
status: Published
type: Property
label: har relateret agent @da
label: hat mit Akteur in Beziehung stehenden Akteur @de
label: heeft gerelateerde actor van actor @nl
label: temsilcinin ilgili temsilcisi ile ilişkilidir @tr
label: toimijaan liittyvä toimija @fi
label: ágens kapcsolódó ágense a következő: @hu
label: له وكيل مرتبط بوكيل @ar
label: 有行为者的关联行为者 @zh-hans
sub property of: has related entity of agent
alternative label: In Beziehung stehender Akteur @de
alternative label: aineistoon liittyvä toimija @fi
alternative label: kapcsolódó ágens: @hu
alternative label: related agent
alternative label: İlişkili temsilci @tr
alternative label: وكيل ذو صلة @ar
alternative label: 关联行为者 @zh-hans
definition: Bir temsilciyi, bir temsilciyle bağlantılı olan bir temsilciyle ilişkilendirir. @tr
definition: Hozzákapcsol egy ágenst egy ágenshez kapcsolódó ágenshez. @hu
definition: Liittää toimijan toiseen toimijaan liittyvään toimijaan. @fi
definition: Relaterer en ressource til en agent, der er knyttet til en beskreven ressource. @da
definition: Relates an agent to an agent who is associated with an agent.
definition: Setzt einen Akteur in Beziehung zu einem Akteur, der mit einem Akteur in Verbindung steht. @de
definition: يربط بين وكيل ووكيل مرتبط بوكيل. @ar
definition: 将一个行为者与和一个行为者有关的一个行为者关联起来。 @zh-hans

has dedicatee
lexical alias: dedicatee.en
status: Published
type: Property
label: aineiston omistuksen kohde @fi
label: dedikáltja a következő: @hu
label: har tilegnet @da
label: hat Widmungsempfängerin/Widmungsempfänger @de
label: heeft opgedragene @nl
label: ithaf edilen ile ilişkilidir @tr
label: له مُهدَى إليه @ar
label: 有被题献者 @zh-hans
sub property of: has other agent associated with resource (Deprecated)
inverse of: is dedicatee of
definition: Bir kaynağı, kendisine kaynağın ithaf edildiği bir temsilci ile ilişkilendirir. @tr
definition: Hozzákapcsol egy forrást egy ágenshez, amelynek a forrást dedikálják. @hu
definition: Liittää aineiston toimijaan, jolle se on omistettu. @fi
definition: Relaterer en ressource til en agent, som en ressource er tilegnet. @da
definition: Relates a resource to an agent to whom a resource is dedicated.
definition: Setzt eine Ressource in Beziehung zu einem Akteur, dem eine Ressource gewidmet ist. @de
definition: يربط مصدر بوكيل أُهدي إليه مصدر. @ar
definition: 将一种资源与一种资源被题献的一个行为者关联起来。 @zh-hans

has addressee
lexical alias: addressee.en
status: Published
type: Property
label: aineiston vastaanottaja @fi
label: címzettje a következő: @hu
label: har adressat @da
label: hat Adressatin/Adressat @de
label: heeft geadresseerde @nl
label: muhatap ile ilişkilidir @tr
label: له مُرسل إليه @ar
label: 有接受者 @zh-hans
sub property of: has other agent associated with resource (Deprecated)
inverse of: is addressee of
definition: Bir kaynağı, kaynağın veya kaynağın bir kısmının muhatap olduğu bir temsilci ile ilişkilendirir. @tr
definition: Hozzákapcsol egy forrást egy ágenshez, amelynek egy forrást vagy egy forrás egy részét címeztek. @hu
definition: Liittää aineiston toimijaan, jolle aineisto tai osa aineistosta on osoitettu. @fi
definition: Relaciona un recurs amb un agent al qual s’adreça un recurs o una part d’un recurs. @ca
definition: Relaterer en ressource til en agent, som en ressource eller en del af en ressource er adresseret til. @da
definition: Relates a resource to an agent to whom a resource or a portion of a resource is addressed.
definition: Setzt eine Ressource in Beziehung zu einem Akteur, an den eine Ressource oder ein Teil einer Ressource adressiert ist. @de
definition: يربط مصدر بوكيل أُرسل إليه مصدر أو جزء من مصدر. @ar
definition: 将一种资源与一种资源或资源的一部分要被其接受的一个行为者关联起来。 @zh-hans

has appellant
lexical alias: appellant.en
status: Published
type: Property
label: fellebezője a következő: @hu
label: har appellerende @da
label: hat Berufungsklagende/Berufungsklagenden/Revisionsklagende/Revisionsklagenden @de
label: heeft aanklager in beroep @nl
label: muutoksenhakija aineistossa @fi
label: temyiz eden ile ilişkilidir @tr
label: له مُستأنف @ar
label: 有上诉者 @zh-hans
sub property of: has other agent associated with resource (Deprecated)
inverse of: is appellant of
definition: Bir kaynağı, bir üst mahkemenin yasal kaynağında kayıtlı bir alt mahkemenin kararını temyize götüren bir temsilci ile ilişkilendirir. @tr
definition: Hozzákapcsol egy forrást egy ágenshez, amely egy magasabb rendű bíróság jogi forrásában rögzített alacsonyabb rendű bíróság döntése ellen fellebbez. @hu
definition: Liittää aineiston toimijaan, joka hakee muutosta alemman oikeusasteen päätökseen. @fi
definition: Relaterer en ressource til en agent der gør indsigelse mod en underrets beslutning, der er registreret i et juridisk værk fra en højere retsinstans. @da
definition: Relates a resource to an agent who appeals a decision of a lower court recorded in a legal resource of a higher court.
definition: Setzt eine Ressource in Beziehung zu einem Akteur, der gegen ein Gerichtsurteil einer unteren Instanz, das in einer juristischen Ressource einer höheren Instanz erfasst ist, Rechtsmittel (Berufung/Revision) einlegt. @de
definition: يربط مصدر بوكيل يستأنف حكم صادر عن محكمة أدنى مسجل في مصدر قانوني لمحكمة أعلى. @ar
definition: 将一种资源与记录在上级法院的一种法律资源中起诉一个下级法院决定的一个行为者关联起来。 @zh-hans

has binder
lexical alias: binder.en
status: Published
type: Property
label: aineiston sitoja @fi
label: ciltleyici ile ilişkilidir @tr
label: har bogbinder @da
label: hat Buchbinderin/Buchbinder @de
label: heeft binder @nl
label: könyvkötője a következő: @hu
label: له مسؤول عن التجليد @ar
label: 有装订者 @zh-hans
sub property of: has other agent associated with resource (Deprecated)
inverse of: is binder of
definition: Bir kaynağı, bir kaynağı bağlayan bir temsilci ile ilişkilendirir. @tr
definition: Hozzákapcsol egy forrást egy ágenshez, amely beköt egy forrást. @hu
definition: Liittää aineiston sen sidonnan tekevään toimijaan. @fi
definition: Relaterer en ressource til en agent, der indbinder en ressource. @da
definition: Relates a resource to an agent who binds a resource.
definition: Setzt eine Ressource in Beziehung zu einem Akteur, der eine Ressource bindet. @de
definition: يربط مصدر بوكيل يقوم بتجليد مصدر. @ar
definition: 将一种资源与装订一种资源的一个行为者关联起来。 @zh-hans

has plaintiff
lexical alias: plaintiff.en
status: Published
type: Property
label: davacı ile ilişkilidir @tr
label: felperese a következő: @hu
label: har sagsøgende @da
label: hat Zivilklägerin/Zivilkläger @de
label: heeft aanklager @nl
label: henkilökantaja @fi
label: له مُدَّعي @ar
label: 有原告 @zh-hans
sub property of: has other agent associated with resource (Deprecated)
inverse of: is plaintiff of
definition: Bir kaynağı, bir hukuk davasına taşıyan bir temsilci ile ilişkilendirir. @tr
definition: Hozzákapcsol egy forrást egy ágenshez, amely polgárjogi eljárás keretében pert indít. @hu
definition: Liittää aineiston toimijaan, joka nostaa kanteen siviilioikeudenkäyntiin. @fi
definition: Relaterer een ressource til en agent, der anlægger en civil sag. @da
definition: Relates a resource to an agent who brings a suit in a civil proceeding.
definition: Setzt eine Ressource in Beziehung zu einem Akteur, der eine Klage in ein Zivilverfahren einbringt. @de
definition: يربط مصدر بوكيل يرفع دعوى في إجراءات مدنية. @ar
definition: 将一种资源与在民事诉讼中起诉的一个行为者关联起来。 @zh-hans

has inscriber
lexical alias: inscriber.en
status: Published
type: Property
label: armağan notu yazarı ile ilişkilidir @tr
label: beírója a következő: @hu
label: har dedikationsskriver @da
label: hat Beschrifterin/Beschrifter @de
label: heeft opdrachtschrijver @nl
label: omistuskirjoituksen kirjoittaja aineistossa @fi
label: له كاتب إهداء @ar
label: 有题写者 @zh-hans
sub property of: has other agent associated with resource (Deprecated)
inverse of: is inscriber of
definition: Bir kaynağı, bir kaynak üzerinde bir ithaf veya hediye bildirimi yazan bir temsilci ile ilişkilendirir. @tr
definition: Hozzákapcsol egy forrást egy ágenshez, amely elkötelezettségi vagy ajándékozási nyilatkozatot ír egy forrásra. @hu
definition: Liittää aineiston toimijaan, joka kirjoittaa siihen omistuskirjoituksen tai merkinnön lahjoituksesta. @fi
definition: Relaterer en ressource til en agent, der har skrevet en tilegnelses- eller gavekommentar på en ressource. @da
definition: Relates a resource to an agent who has written a statement of dedication or gift on a resource.
definition: Setzt eine Ressource in Beziehung zu einem Akteur, der eine Widmung oder einen Schenkungsvermerk in eine Ressource geschrieben hat. @de
definition: يربط مصدر بوكيل يكتب جملة إهداء على مصدر. @ar
definition: 将一种资源与在一种资源上书写题词或赠与文字的一个行为者关联起来。 @zh-hans

has judge
lexical alias: judge.en
status: Published
type: Property
label: bírója a következő: @hu
label: har dommer @da
label: hat Richterin/Richter @de
label: heeft rechter @nl
label: hâkim ile ilişkilidir @tr
label: tuomari @fi
label: له قاضي @ar
label: 有法官 @zh-hans
sub property of: has other agent associated with resource (Deprecated)
inverse of: is judge of
definition: Bir kaynağı mahkemede hukuki meseleleri dinleyen ve karara bağlayan bir temsilci ile ilişkilendirir. @tr
definition: Hozzákapcsol egy forrást egy ágenshez, amely jogi ügyekben tárgyalást vezet és ítélkezik a bíróságon. @hu
definition: Liittää aineiston toimijaan, joka kuulee ja päättää oikeusasioista tuomioistuimessa. @fi
definition: Relaterer en ressource til en agent, der hører og træffer beslutning om juridiske anliggender i retten. @da
definition: Relates a resource to an agent who hears and decides on legal matters in court.
definition: Setzt eine Ressource in Beziehung zu einem Akteur, der bei Gericht juristische Angelegenheiten anhört und darüber entscheidet. @de
definition: يربط مصدر بوكيل يسمع ويفصل في المسائل القانونية في محكمة. @ar
definition: 将一种资源与在法院中审理并决定法律事务的一个行为者关联起来。 @zh-hans

has defendant
has subproperty: has criminal defendant
has subproperty: has civil defendant
lexical alias: defendant.en
status: Published
type: Property
label: alperese a következő: @hu
label: davalı ile ilişkilidir @tr
label: har sagsøgt @da
label: hat Angeklagte/Angeklagten/Beklagte/Beklagten @de
label: heeft verweerder @nl
label: henkilövastaaja @fi
label: له مُدَّعَى عليه @ar
label: 有被告 @zh-hans
sub property of: has other agent associated with resource (Deprecated)
inverse of: is defendant of
definition: Bir kaynağı, ceza davasında suçlanan veya bir hukuk davasında dava edilen bir temsilci ile ilişkilendirir. @tr
definition: Hozzákapcsol egy forrást egy ágenshez, amelyet büntetőjogi eljárásban vádolnak, vagy polgári jogi eljárásban perelnek. @hu
definition: Liittää aineiston henkilöön, joka on syytteessä rikosoikeudenkäynnissä tai haastettuna siviilioikeudenkäynnissä. @fi
definition: Relaterer en ressource til en agent, der er anklaget i en straffesag eller sagsøgt i en civilsag. @da
definition: Relates a resource to an agent who is accused in a criminal proceeding or sued in a civil proceeding.
definition: Setzt eine Ressource in Beziehung zu einem Akteur, der in einem Strafverfahren angeklagt oder in einem Zivilverfahren verklagt ist. @de
definition: يربط مصدر بوكيل متهم في دعوى جنائية أو يحاكم في دعوى مدنية. @ar
definition: 将一种资源与在刑事或民事诉讼中被控告的一个行为者关联起来。 @zh-hans

has praeses
lexical alias: praeses.en
status: Published
type: Property
label: danışman ile ilişkilidir @tr
label: elnöke a következő: @hu
label: har præses @da
label: hat Praeses @de
label: heeft preses @nl
label: preeses @fi
label: له رئيس جلسة @ar
label: 有评审人 @zh-hans
sub property of: has creator
inverse of: is praeses of
definition: Bir kaynağı akademik bir tartışmanın fakülte moderatörü olan, normalde bir tez öneren ve ardından gelen tartışmaya katılan bir temsilci ile ilişkilendirir. @tr
definition: Hozzákapcsol egy forrást egy ágenshez, aki egy tudományos vita kari moderátora, aki szokásos módon előterjeszt egy értekezést és részt vesz az azt követő vitában. @hu
definition: Liittää aineiston toimijaan, joka on vastuussa väitöskirjan esittelystä väitöstilasuudessa tiedekunnan edustajana ja osallistuu keskusteluun väitöstilaisuuden puheenjohtajana. @fi
definition: Relaterer en ressource til en agent, der er fakultetsordstyrer for et akademisk afhandlingsforsvar, normalt ved at fremsætte en tese og deltage i det efterfølgende afhandlingsforsvar. @da
definition: Relates a resource to an agent who is a faculty moderator of an academic disputation, normally proposing a thesis and participating in the ensuing disputation.
definition: Setzt eine Ressource in Beziehung zu einem Akteur, der auf Fakultätsseite eine akademische Disputation moderiert, normalerweise eine These vorschlägt und an der sich daraus ergebenden Disputation teilnimmt. @de
definition: يربط مصدر بوكيل يعمل بصفته رئيس جلسة أعضاء هيئة التدريس في مناظرة أكاديمية، ويقترح عادة مبحثا ويشارك في المناظرة اللاحقة. @ar
definition: 将一种资源与作为学术辩论的主持教师（通常是提出一个论题并参与后续的辩论）的一个行为者关联起来。 @zh-hans

has annotator
lexical alias: annotator.en
status: Published
type: Property
label: har annotationsskriver @da
label: hat Annotierende/Annotierenden @de
label: heeft annotator @nl
label: jegyzetekkel ellátója a következő: @hu
label: lisähuomautusten kirjoittaja aineistossa @fi
label: yorumlayıcı ile ilişkilidir @tr
label: له مُعَلِّق @ar
label: 有手写批注者 @zh-hans
sub property of: has other agent associated with resource (Deprecated)
inverse of: is annotator of
definition: Bir kaynağı, bir kaynağa elle notlar ve diğer bilgiler ekleyen bir temsilci ile ilişkilendirir. @tr
definition: Hozzákapcsol egy forrást egy ágenshez, aki jegyzeteket és más, kézzel írott információt fűz a foráshoz. @hu
definition: Liittää aineiston toimijaan, joka kirjoittaa käsinkirjoitettuja huomautuksia ja muita selityksiä. @fi
definition: Relaterer en ressource til en agent, der laver manuskriptnotater på et eksemplar. @da
definition: Relates a resource to an agent who adds notes and other information to a resource by hand.
definition: Setzt eine Ressource in Beziehung zu einem Akteur, der handschriftlich Anmerkungen und andere Informationen in eine Ressource hinzufügt. @de
definition: يربط مصدر بوكيل يُضيف حواشي ومعلومات أخرى لمصدر يدويًا. @ar
definition: 将一种资源与在一种资源上手加批注和其他信息的一个行为者关联起来。 @zh-hans

has consultant
lexical alias: consultant.en
status: Published
type: Property
label: asiantuntija @fi
label: danışman ile ilişkilidir @tr
label: har rådgiver @da
label: hat Beraterin/Berater @de
label: heeft consultant @nl
label: tanácsadója a következő: @hu
label: له استشاري @ar
label: 有顾问 @zh-hans
sub property of: has creator
inverse of: is consultant of
definition: Bir kaynağı, bir kaynağın yaratıcısı olarak temsil edilen ilgili bir temsilci için danışma hizmetleri sağlayan ve genellikle tavsiyelerde bulunan bir temsilci ile ilişkilendirir. @tr
definition: Hozzákapcsol egy forrást egy ágenshez, amely tanácsadási szolgáltatásokat nyújt és gyakran javaslatokat ad a forrás létrehozójaként megjelenő ágensnek. @hu
definition: Liittää teoksen toimijaan, joka on vastuussa asiantuntijapalveluiden tarjoamisesta ja suositusten antamisesta teoksen tekijänä pidetylle henkilölle. @fi
definition: Relaterer en ressource til en agent, der yder rådgivning, og ofte kommer med anbefalinger, til en anden agent, der er repræsenteret som ophav til en ressource. @da
definition: Relates a resource to an agent who provides consultation services, and often makes recommendations, for a related agent who is represented as a creator of a resource.
definition: Setzt eine Ressource in Beziehung zu einem Akteur, der Beratungsdienste anbietet und häufig einem in Beziehung stehenden Akteur, der als geistiger Schöpfer einer Ressource repräsentiert wird, Empfehlungen macht. @de
definition: يربط مصدر بوكيل يُقدم خدمات استشارية، وغالبًا ما يقدم مقترحات، لوكيل ذي صلة يُقدم على أنه منشيء مصدر. @ar
definition: 将一种资源与向表现为资源创作者的一个相关行为者提供咨询服务并经常提供建议的一个行为者关联起来。 @zh-hans

has autographer
lexical alias: autographer.en
status: Published
type: Property
label: aláírója a következő: @hu
label: har autografskriver @da
label: hat Unterzeichnerin/Unterzeichner @de
label: heeft handtekeningzetter @nl
label: imza sahibi ile ilişkilidir @tr
label: nimikirjoituksen kirjoittaja aineistossa @fi
label: له موقِّع @ar
label: 有亲笔签名者 @zh-hans
sub property of: has other agent associated with resource (Deprecated)
inverse of: is autographer of
definition: Bir kaynağı, el yazması imzası bir kaynakta görünen bir temsilci ile ilişkilendirir. @tr
definition: Hozzákapcsol egy forrást egy ágenshez, akinek a kézírásos aláírása megjelenik a forráson. @hu
definition: Liittää aineiston toimijaan, jonka käsinkirjoitettu nimikirjoitus aineistossa on. @fi
definition: Relaterer en ressource til en agent, der laver manuskriptnotater på en ressource. @da
definition: Relates a resource to an agent whose manuscript signature appears on a resource.
definition: Setzt eine Ressource in Beziehung zu einem Akteur, dessen handschriftliche Unterschrift auf einer Ressource steht. @de
definition: يربط مصدر بوكيل يظهر توقيعه بخط اليد على مصدر. @ar
definition: 将一种资源与在一种资源上亲笔签名的个人关联起来。 @zh-hans

has issuing agent
lexical alias: issuingAgent.en
status: Published
type: Property
label: aineiston julkaisija @fi
label: har ansvarlig institution @da
label: hat herausgebenden Akteur @de
label: heeft uitvaardiger @nl
label: kibocsátó ágense a következő: @hu
label: piyasaya çıkaran temsilcisi ile ilişkilidir @tr
label: له وكيل جهة إصدار @ar
label: 有颁布行为者 @zh-hans
sub property of: has other agent associated with resource (Deprecated)
inverse of: is issuing agent of
definition: Bir kaynağı, kaynağı yayınlayan bir temsilci ile ilişkilendirir. @tr
definition: Hozzákapcsol egy forrást egy ágenshez, amely kibocsát egy forrást. @hu
definition: Liittää aineiston sen julkaisevaan toimijaan. @fi
definition: Relaterer en ressource til en agent, der har udgivet en ressource, såsom et officielt skrift fra agenten. @da
definition: Relates a resource to an agent who issues a resource.
definition: Setzt eine Ressource in Beziehung zu einem Akteur, der eine Ressource heraus gibt. @de
definition: يربط مصدر بوكيل يقوم بإصدار مصدر ما. @ar
definition: 将一种资源与颁布一种资源的一个行为者关联起来。 @zh-hans

has profession or occupation
lexical alias: professionOrOccupation.en
status: Published
type: Property
label: ammatti tai tehtävä @fi
label: har profession eller beskæftigelse @da
label: hat Beruf oder Tätigkeit @de
label: heeft beroep of bezigheid @nl
label: iş veya meslek ile ilişkilidir @tr
label: szakterülete vagy foglalkozása a következő: @hu
label: له مهنة أو وظيفة @ar
label: 有职业和工作 @zh-hans
definition: Bir temsilciyi, bir temsilcinin mesleği veya hobisi ile ilişkilendirir. @tr
definition: Hozzákapcsol egy ágenst egy ágens hivatásához vagy kiegészítő tevékenységéhez. @hu
definition: Liittää toimijan hänen ammattiinsa tai harrastukseensa. @fi
definition: Relaciona un agent amb una vocació o dedicació. @ca
definition: Relaterer en ressource til en agents erhverv eller bibeskæftigelse. @da
definition: Relates an agent to a vocation or avocation.
definition: Setzt einen Akteur in Beziehung zu seiner Berufung oder Nebenbeschäftigung. @de
definition: يربط بين وكيل ومهنة أو وظيفة وكيل @ar
definition: 将一个行为者与一个职业或爱好关联起来。 @zh-hans

is electronic reproduction of
lexical alias: electronicReproductionOf.en
status: Published
type: Property
label: digitoitu aineisto @fi
label: elektronik yeniden üretimidir @tr
label: elektronikus másolata a következőnek: @hu
label: er elektronisk reproduktion af @da
label: is elektronische reproductie van @nl
label: ist elektronische Reproduktion von @de
label: له إنتاج إلكتروني @ar
label: 是……的电子复制品 @zh-hans
sub property of: is reproduction of
inverse of: has electronic reproduction
definition: Bir kaynağı, dijital formata aktarılan analog formattaki bir kaynakla ilişkilendirir. @tr
definition: Hozzákapcsol egy forrást egy analóg formátumú forráshoz, amelyet digitális formátumra visznek át. @hu
definition: Liittää aineiston digitaalisessa muodossa olevaan aineistoon joka analogisen aineiston muunnoksen tulos. @fi
definition: Relaterer en ressource til en ressource i et analogt format, der er overført til et digitalt format. @da
definition: Relates a resource to a resource in an analog format that is transferred to a digital format.
definition: Setzt eine Ressource in Beziehung zu einer Ressource in einem analogen Format, die in ein digitales Format übertragen wird. @de
definition: يربط بين مصدر ومصدر في صيغة رقمية ناتج عن تحويله في شكل تناظري. @ar
definition: 将一种资源与被转储为一种数字格式的一种模拟格式的资源关联起来。 @zh-hans

has note on resource
has subproperty: has note on issue, part, or iteration used as basis for identification of resource
has subproperty: has note on changes in content characteristics
has subproperty: has note on changes in carrier characteristics
has subproperty: has note on distribution statement
has subproperty: has note on manufacture statement
has subproperty: has note on production statement
has subproperty: has note on publication statement
has subproperty: has note on frequency (Deprecated)
has subproperty: has note on statement of responsibility
has subproperty: has note on series statement
has subproperty: has note on copyright date
has subproperty: has note on dimensions of resource
has subproperty: has note on extent of resource
has subproperty: has note on numbering of sequence
has subproperty: has note on title
has subproperty: has note on edition statement
has subproperty: has note on identifier for resource
has subproperty: has note on capture
lexical alias: noteOnResource.en
status: Published
type: Property
label: har note til ressource @da
label: hat Anmerkung zur Ressource @de
label: heeft noot bij resource @nl
label: huomautus aineistosta @fi
label: kaynak hakkında not ile ilişkilidir @tr
label: megjegyzése a forrásról a következő: @hu
label: له تبصرة على المصدر @ar
label: 有关于资源的附注 @zh-hans
sub property of: has note on entity
definition: Bir kaynağı, bir kaynağın bir veya daha fazla niteliğinin geniş, yapılandırılmamış bir açıklamasıyla ilişkilendirir. @tr
definition: Hozzákapcsol egy forrást egy forrás egy vagy több ismérvének szabad szöveges, strukturálatlan leírásához. @hu
definition: Liittää aineiston yhden tai useamman attribuutin laajaan rakenteistamattomaan kuvailuun aineistosta. @fi
definition: Relaterer en ressource til en note, der giver supplerende oplysninger om indhold, der er registreret, som et attribut til udtrykket. @da
definition: Relates a resource to a broad unstructured description of one or more attributes of a resource.
definition: Setzt eine Ressource in Beziehung zu einer umfassenden, unstrukturierten Beschreibung eines Merkmals oder mehrerer Merkmale einer Ressource. @de
definition: يربط بين مصدر ووصف مستفيض غير محدد لواحدة أو أكثر من سمات مصدر. @ar
definition: 将一种资源与一种资源的一个或多个属性的一个宽泛的、非结构化的描述关联起来。 @zh-hans

has note on manifestation or item (Deprecated)
lexical alias: noteOnManifestationOrItem.en
status: Deprecated
type: Property
definition: Relates a resource to an annotation providing additional information about resource or resource attributes. (Deprecated)

has epoch
lexical alias: epoch.en
status: Published
type: Property
label: epok ile ilişkilidir @tr
label: epookki aineistossa @fi
label: har epoke @da
label: hat Epoche @de
label: heeft tijdperk @nl
label: korszaka a következő: @hu
label: له مُدّة زمنية @ar
label: 有历元 @zh-hans
inverse of: is epoch of
definition: Bir kaynağı, bir cisim için konum veya bir yörünge için yönelim ölçümlerine atıfta bulunulan bir zaman aralığıyla ilişkilendirir. @tr
definition: Hozzákapcsol egy forrást egy időtartamhoz, amelyre egy test mérési pozíciója vagy egy keringési pálya orientációja utal. @hu
definition: Liittää aineiston ajanjaksoon, jonka mukaan tähtitaivaan kohteiden sijainnit ja ratojen suunnat on annettu. @fi
definition: Relaterer en ressource til et vilkårligt tidspunkt, som målene for et legemes position eller en banes retning henviser til. @da
definition: Relates a resource to a timespan to which measurements of position for a body or orientation for an orbit are referred.
definition: Setzt eine Ressource in Beziehung zu einem Zeitraum, auf den sich Positionsmessungen für einen Körper oder die Orientierung einer Umlaufbahn beziehen. @de
definition: يربط بين مصدر ومدى زمني يُحال إليه قياسات وضع لجسم أو لتوجه مداري. @ar
definition: 将一种资源与提及物体位置或运行轨道方位之测量的一个时间段关联起来。 @zh-hans

has landscape architect
lexical alias: landscapeArchitect.en
status: Published
type: Property
label: har landskabsarkitekt @da
label: hat Landschaftsarchitektin/Landschaftsarchitekten @de
label: heeft landschapsarchitect @nl
label: maisema-arkkitehti aineistossa @fi
label: peyzaj mimarı ile ilişkilidir @tr
label: tájépítésze a következő: @hu
label: له مهندس تنسيق مواقع @ar
label: 有景观设计师 @zh-hans
sub property of: has architect
inverse of: is landscape architect of
definition: Bir kaynağı, kaynağın peyzaj çalışmasından sorumlu mimar olan temsilci ile ilişkilendirir. @tr
definition: Hozzákapcsol egy forrást egy építész ágenshez, aki felelős tájépítészeti források létrehozásáért. @hu
definition: Liittää aineiston toimijaan, joka vastaa maisemasunnittelusta. @fi
definition: Relaterer en ressource til en arkitekt, der er ansvarlig for at forme landskaber. @da
definition: Relates a resource to an agent who is an architect who is responsible for creating landscape resources.
definition: Setzt eine Ressource in Beziehung zu einer Architektin/einem Architekten, die/der für die Erschaffung landschaftlicher Ressourcen verantwortlich ist. @de
definition: يربط مصدر بوكيل هو مهندس معماري مسؤول عن إنشاء مصادر تنسيق المواقع. @ar
definition: 将一种资源与作为建筑师并负责创建景观资源的一个行为者关联起来。 @zh-hans

is finding aid of
has subproperty: is catalogue of
has subproperty: is hierarchic finding aid of
lexical alias: findingAidOf.en
status: Published
type: Property
label: er hjælpeverktøj til @da
label: is vind-hulpmiddel voor @nl
label: ist Findmittel für @de
label: keresési segédlet a következőhöz: @hu
label: luettelo aineistoon @fi
label: rehber bilgisidir @tr
label: és instrument de descripció de @ca
label: هو معينات البحث لـ @ar
label: 是……的查询工具 @zh-hans
sub property of: is description of
inverse of: has finding aid
alternative label: is finding aid for
alternative label: için rehber bilgidir @tr
alternative label: luettelo aineistolle @fi
alternative label: és instrument de descripció per @ca
definition: Bir kaynağı, bir üstveri seti tarafından tanımlanmış bir koleksiyon kaynağı olan bir kaynakla ilişkilendirir. @tr
definition: Hozzákapcsol egy forrást egy levéltári gyűjtemény forrásához, amelyet leírnak a gyűjtemény szervezetének, elrendezésének és tartalmának a kalauzában. @hu
definition: Liittää aineiston aineistoon, joka on metatietokokonaisuudella kuvailtu kokoelma-aineisto. @fi
definition: Relaciona un recurs amb un recurs que és un recurs de col·lecció de recursos que és descrit per un conjunt de descripció de metadades. @ca
definition: Relaterer en ressource til en arkivsamling, der er beskrevet i et hjælpeværktøj, dvs. en vejledning om organisering, ordning og indhold af samlingen. @da
definition: Relates a resource to a resource that is a collection resource that is described by a metadata description set.
definition: Setzt eine Ressource in Beziehung zu einer Archivsammlung, die in einer Orientierungshilfe zum Aufbau, zur Anordnung und zu den Inhalten beschrieben ist. @de
definition: يربط بين مصدر ومصدر يمثل مجموعة أرشيفية موصوفة في دليل لتنظيم، ترتيب، وفهرسة المجموعة. @ar
definition: 将一种资源与作为一种收藏资源并被一种元数据描述集合描述的一种资源关联起来。 @zh-hans

has sculptor
lexical alias: sculptor.en
status: Published
type: Property
label: aineiston kuvanveistäjä @fi
label: har skulptør @da
label: hat Bildhauerin/Bildhauer @de
label: heeft beeldhouwer @nl
label: heykeltıraş ile ilişkilidir @tr
label: szobrásza a következő: @hu
label: له نَحّات @ar
label: 有雕塑家 @zh-hans
sub property of: has artist
inverse of: is sculptor of
definition: Bir kaynağı, kaynağı modelleme, oyma ya da benzer teknikle üç boyutlu bir kaynak olarak oluşturmaktan sorumlu sanatçı olan bir temsilci ile ilişkilendirir. @tr
definition: Hozzákapcsol egy forrást egy művész ágenshez, aki felelős egy háromdimenziós forrás megalkotásáért modellezési, faragási vagy hasonló technikával. @hu
definition: Liittää aineiston toimijaan, joka vastaa kolmiulotteisen teoksen luomisesta muovaamalla, veistämällä tai vastaavalla tekniikalla. @fi
definition: Relaterer en ressource til en kunstner, der er ansvarlig for at have skabt et tredimensionelt værk vha. modellering, billedhuggerkunst eller en lignende teknik. @da
definition: Relates a resource to an agent who is an artist who is responsible for creating a three-dimensional resource by modeling, carving, or similar technique.
definition: Setzt eine Ressource in Beziehung zu einer Künstlerin/einem Künstler, die/der für die Schaffung einer dreidimensionalen Ressource durch Modellieren, Schnitzen oder ähnliche Techniken verantwortlich ist. @de
definition: يربط مصدر بوكيل هو فنان ينطوي على مسؤوليته إنشاء مصدر ثلاثي الأبعاد عن طريق النمذجة أو النحت أو تقنية مشابهة. @ar
definition: 将一种资源与作为一个艺术家并通过模型、雕刻或类似技术负责创建一种三维资源的一个行为者关联起来。 @zh-hans

has screenwriter
lexical alias: screenwriter.en
status: Published
type: Property
label: aineiston käsikirjoittaja @fi
label: forgatókönyvírója a következő: @hu
label: har manuskriptforfatter @da
label: hat Drehbuchautorin/Drehbuchautor @de
label: heeft scenarioschrijver @nl
label: senarist ile ilişkilidir @tr
label: له كاتب سيناريو @ar
label: 有影视剧编剧 @zh-hans
sub property of: has author
inverse of: is screenwriter of
definition: Bir kaynağı, senaryo, metin ya da sahne yazarı olan bir temsilci ile ilişkilendirir. @tr
definition: Hozzákapcsol egy forrást egy ágenshez, aki szerzője egy forgatókönyvnek, szövegkönyvnek vagy jelenetnek. @hu
definition: Liittää aineiston toimijaan, joka on näytelmän, käsikirjoituksen tai kohtauksen kirjoittaja. @fi
definition: Relaterer en ressource til en forfatter af en drejebog, et manuskript eller en scene. @da
definition: Relates a resource to an agent who is an author of a screenplay, script, or scene.
definition: Setzt eine Ressource in Beziehung zu einer Verfasserin/einem Verfasser eines Drehbuchs, eines Skripts oder einer Szene. @de
definition: يربط مصدر بوكيل هو مؤلف سيناريو، أو نص، أو مشهد. @ar
definition: 将一种资源与作为影视剧剧本、脚本或场景著者的一个行为者关联起来。 @zh-hans

has lyricist
see also: has librettist
lexical alias: lyricist.en
status: Published
type: Property
label: aineiston sanoittaja @fi
label: dalszövegírója a következő: @hu
label: har forfatter til sangtekst @da
label: hat Textdichterin/Textdichter @de
label: heeft liedtekstschrijver @nl
label: söz yazarı ile ilişkilidir @tr
label: كاتب أغاني @ar
label: 有作词者 @zh-hans
sub property of: has author
inverse of: is lyricist of
definition: Bir kaynağı, bir müzikalin şarkısı da dahil olmak üzere popüler bir şarkının sözlerinin yazarı olan bir temsilci ile ilişkilendirir. @tr
definition: Hozzákapcsol egy forrást egy ágenshez, aki egy könnyűzenei dal szövegének szerzője, beleértve a musicaldalokat is. @hu
definition: Liittää aineiston toimijaan, joka on populaarimusiikkiin kuuluvan laulun (mukaan lukien musikaalin laulun) sanojen kirjoittaja. @fi
definition: Relaterer en ressource til en forfatter til sangteksten til en populær sang, inkl. en eller flere sange fra en musical. @da
definition: Relates a resource to an agent who is an author of the words of a popular song, including a song from a musical.
definition: Setzt eine Ressource in Beziehung zu einer Verfasserin/einem Verfasser des Texts eines populären Lieds, einschließlich eines Lieds aus einem Musical. @de
definition: يربط مصدر بوكيل هو مؤلف لكلمات أغنية شعبية، بما في ذلك أغنية من مسرحية موسيقية. @ar
definition: 将一种资源与作为一首流行歌曲（包括音乐剧中的歌曲）歌词的著者的一个行为者关联起来。 @zh-hans
scope note: Authoring of just dialogue from a musical is excluded
scope note: Bir müzikalde sadece dialogların yazılması hariçtir. @tr
scope note: Ei kata pelkän musikaalin dialogin kirjoittajaa. @fi
scope note: Musical párbeszédeinek szerzősége nem tartozik ide. @hu
scope note: Nur das Verfassen des Dialogs eines Musicals fällt nicht darunter. @de
scope note: Omfatter ikke forfatteren til dialogen i en musical. @da
scope note: يُستبعد تأليف الحوار فقط من مسرحية موسيقية. @ar
scope note: 不包括音乐剧中只是对话的著者。 @zh-hans

has librettist
see also: has lyricist
lexical alias: librettist.en
status: Published
type: Property
label: har librettist @da
label: hat Librettistin/Librettist @de
label: heeft librettist @nl
label: libretisti aineistossa @fi
label: librettistája a következő: @hu
label: libretto yazarı ile ilişkilidir @tr
label: له واضع كلمات الأوبرا @ar
label: 有台本作者 @zh-hans
sub property of: has author
inverse of: is librettist of
definition: Bir kaynağı, opera, bale veya müzikal sahnesi için başka bir kaynak veya oratoryo gibi müzikal veya koreografik bir kaynağın sözlerinin yazarı olan bir temsilci ile ilişkilendirir @tr
definition: Hozzákapcsol egy forrást egy szerző ágenshez, aki olyan zenei vagy koreografikus forrás szövegét szerzi, mint egy opera, balett, oratórium, vagy más zenés színpadi forrás. @hu
definition: Liittää aineiston toimijaan, joka on musiikki- tai koreografisen teoksen, kuten oopperan, baletin tai muun musiikillisen näyttämöteoksen tai oratorion sanojen kirjoittaja. @fi
definition: Relaterer en ressource til en forfatter af teksten til en opera eller en anden ressource af et musikalsk sceneværk, eller et oratorium. @da
definition: Relates a resource to an agent who is an author of the words of a musical or choreographic resource such as an opera, a ballet, or other resource for the musical stage, or an oratorio.
definition: Setzt eine Ressource in Beziehung zu einer Verfasserin/einem Verfasser des Texts für eine Musikressource oder choreografische Ressource, wie zum Beispiel einer Oper, einem Ballett oder einer anderen Musikressource für die Bühne, oder für ein Oratorium. @de
definition: يربط مصدر بوكيل هو مؤلف لكلمات مصدر موسيقي أو راقص مثل أوبرا، باليه، أو أي مصدر آخر للمسرح الموسيقي، أو موسيقى دينية. @ar
definition: 将一种资源与作为歌剧、芭蕾等音乐或编舞资源或其他舞台音乐资源或者清唱剧的歌词的著者的一个行为者关联起来。 @zh-hans
scope note: A musical dalainak szövegírója nem tartozik ide. @hu
scope note: Authoring of the words of just the songs from a musical is excluded.
scope note: Bir müzikalde sadece şarkıların sözlerinin yazılması hariçtir. @tr
scope note: Ei kata pelkän musikaalin laulunsanojen kirjoittajaa. @fi
scope note: Nur das Verfassen der Liedtexte eines Musicals fällt nicht darunter. @de
scope note: Omfatter ikke forfatteren til sangteksterne i en musical. @da
scope note: يُستبعد تأليف كلمات الأغاني فقط من مسرحية موسيقية. @ar
scope note: 不包括音乐剧中只是歌曲的词著者。 @zh-hans

is replacement in part of
lexical alias: replacementInPartOf.en
status: Published
type: Property
label: er delvis erstatning af @da
label: is gedeeltelijke vervanging van @nl
label: ist teilweise Ersatz von @de
label: korvaa aineiston osittain @fi
label: kısmen değiştirilmesidir @tr
label: részben helyettesíti a következőt: @hu
label: هو استبدال في جزء لـ @ar
label: 是……的部分替代 @zh-hans
sub property of: is preceded by
inverse of: is replaced in part by
definition: Bir kaynağı, içeriği başka bir kaynağın içeriği tarafından kısmen değiştirilmiş ve geçersiz kılınmış bir kaynakla ilişkilendirir. @tr
definition: Hozzákapcsol egy forrást egy forráshoz, amelynek tartalmát részben túlhaladja és elavulttá teszi egy másik forrás tartalma. @hu
definition: Liittää aineiston aineistoon, jonka sisällön toisen aineiston sisältö osittain korvaa ja tekee vanhentuneeksi. @fi
definition: Relaterer en ressource til en tidligere ressource, hvis indhold er blevet delvist erstattet af en senere ressource, normalt fordi den senere ressource indeholder opdateret eller ny information, der betyder, at den tidligere ressource er forældet. @da
definition: Relates a resource to a resource whose content is partially superseded and rendered obsolete by the content of another resource.
definition: Setzt eine Ressource in Beziehung zu einer Ressource, deren Inhalt teilweise durch den Inhalt einer anderen Ressource ersetzt und überflüssig wird. @de
definition: يربط بين مصدر ومصدر يتم استبدال محتواه جزئيًا ويصبح متقادمًا في وجود محتوى مصدر آخر. @ar
definition: 将一种资源与其内容被另一种资源之内容部分地替代并废止的一种资源关联起来。 @zh-hans
scope note: Bu öğe genel olarak durağan bir kaynak veya entegre bir kaynak için geçerlidir. @tr
scope note: Denne relation anvendes generelt til enkeltstående monografier, flerbindsværker og integrerende ressourcer. @da
scope note: Ezt az elemet általában az statikus vagy integráló forrásokra alkalmazzák. @hu
scope note: Im Allgemeinen trifft dieses Element auf eine statische Ressource oder eine integrierende Ressource zu. @de
scope note: This element applies in general to a static resource or an integrating resource.
scope note: Tämä elementti soveltuu yleensä staattiseen tai päivittyvään aineistoon. @fi
scope note: ينطبق هذا العنصر بشكل عام على مصدر ثابت أو مصدر متكامل. @ar
scope note: 该元素一般适用于一种静态资源或者集成性资源。 @zh-hans

is replacement of
lexical alias: replacementOf.en
status: Published
type: Property
label: değiştirilmesidir @tr
label: er erstatning af @da
label: helyettesíti a következőt: @hu
label: is vervanging van @nl
label: ist Ersatz von @de
label: korvattu aineisto @fi
label: هو استبدال لـ @ar
label: 是……的替代 @zh-hans
sub property of: is preceded by
inverse of: is replaced by
definition: Bir kaynağı, içeriği başka bir kaynağın içeriği tarafından değiştirilmiş ve geçersiz kılınmış bir kaynakla ilişkilendirir. @tr
definition: Hozzákapcsol egy forrást egy forráshoz, amelynek tartalmát túlhaladja és elavulttá teszi egy másik forrás tartalma. @hu
definition: Liittää aineiston aineistoon, jonka sisällön toisen aineiston sisältö korvaa ja tekee vanhentuneeksi. @fi
definition: Relaterer en ressource til en tidligere ressource, hvis indhold er blevet erstattet af en senere ressource, normalt fordi den senere ressource indeholder opdateret eller ny information, der betyder, at den tidligere ressource er forældet. @da
definition: Relates a resource to a resource whose content is superseded and rendered obsolete by the content of another resource.
definition: Setzt eine Ressource in Beziehung zu einer Ressource, deren Inhalt durch den Inhalt einer anderen Ressource ersetzt und überflüssig wird. @de
definition: يربط بين مصدر ومصدر يتم استبدال محتواه ويصبح متقادمًا في وجود محتوى مصدر آخر. @ar
definition: 将一种资源与其内容被另一种资源之内容替代并废止的一种资源关联起来。 @zh-hans
scope note: Bu öğe genel olarak durağan bir kaynak veya entegre bir kaynak için geçerlidir. @tr
scope note: Denne relation anvendes generelt til enkeltstående monografier, flerbindsværker og integrerende ressourcer. @da
scope note: Ezt az elemet általában az statikus vagy integráló forrásokra alkalmazzák. @hu
scope note: Im Allgemeinen trifft dieses Element auf eine statische Ressource oder eine integrierende Ressource zu. @de
scope note: This element applies in general to a static resource or an integrating resource.
scope note: Tämä elementti soveltuu yleensä staattiseen tai päivittyvään aineistoon. @fi
scope note: ينطبق هذا العنصر بشكل عام على مصدر ثابت أو مصدر متكامل. @ar
scope note: 该元素一般适用于一种静态资源或者集成性资源。 @zh-hans

has special playback characteristic
lexical alias: specialPlaybackCharacteristic.en
status: Published
type: Property
label: aineiston äänentoiston erityisominaisuudet @fi
label: har særlige afspilningskarakteristika @da
label: hat besondere Wiedergabeeigenschaft @de
label: heeft speciale afspeelkenmerken @nl
label: speciális visszajátszási jellemzője a következő: @hu
label: özel oynatma özelliği ile ilişkilidir @tr
label: له خاصية خاصة للتشغيل @ar
label: 有特别回放特征 @zh-hans
sub property of: has sound characteristic
definition: Bir kaynağı, bir ekolayzer sistemi, gürültü azaltma sistemi veya bir ses kaydı yaparken kullanılan diğer işlemlerle ilişkilendirir. @tr
definition: Hozzákapcsol egy forrást egy kiegyenlítési rendszerhez, hangcsökkentő rendszerhez vagy egyéb eljáráshoz, amelyet egy hangfelvétel készítésénél használnak. @hu
definition: Liittää aineiston äänitteen äänityksessä käytettyyn taajuuskorjausjärjestelmään, kohinanvaimennusjärjestelmään tai muuhun prosessointiin. @fi
definition: Relaterer en ressource til et equalizersystem, støjbegrænsningssystem etc., der er anvendt til at lave en lydoptagelse. @da
definition: Relates a resource to an equalization system, noise-reduction system, or other processing that is used in making an audio recording.
definition: Setzt eine Ressource in Beziehung zu einem Ausgleichssystem, einem Störgeräusch-Reduktionssystem oder einer anderen Verarbeitung, das/die bei der Erstellung von Audioaufnahmen verwendet wird. @de
definition: يربط بين مصدر ونظام موازن الترددات، نظام خفض ضوضاء، أو غيرها من النظم المُستخدمة في إعداد تسجيل صوتي. @ar
definition: 将一种资源与在一种录音制作中所使用的平衡系统、降噪系统或其他处理关联起来。 @zh-hans

has associated institution (Deprecated)
lexical alias: associatedInstitution.en
status: Deprecated
type: Property
label: har tilknyttet institution @da
definition: Relaterer en ressource til en institution der almindeligvis opfattes knyttet til en agent. @da
definition: Relates an agent to an institution commonly associated with an agent. (Deprecated)

has granting institution or faculty (Deprecated)
lexical alias: grantingInstitutionOrFaculty.en
status: Deprecated
type: Property
label: har tildelende institution eller fakultet @da
sub property of: has other agent associated with resource (Deprecated)
definition: Relaterer et værk til en institution eller et fakultet, der tildeler en kandidat en akademisk grad. @da
definition: Relates a resource to an institution or faculty conferring an academic degree on a candidate. (Deprecated)

has agent history
lexical alias: agentHistory.en
status: Published
type: Property
label: har agenthistorie @da
label: hat Geschichte eines Akteurs @de
label: heeft actor geschiedenis @nl
label: temsilci geçmişi ile ilişkilidir @tr
label: toimijan historia @fi
label: ágens története a következő: @hu
label: له وكيل تاريخ @ar
label: 有行为者历史 @zh-hans
definition: Bir temsilciyi, temsilciye ait bibliografik ya da tarihi bilgiyle ilişkilendirir @tr
definition: Hozzákapcsol egy ágenst egy ágensre vonatkozó életrajzi vagy történeti információhoz. @hu
definition: Liittää toimijan biografiseen tai historialliseen informaatioon toimijasta. @fi
definition: Relaciona un agent amb un sumari d’informació sobre la història d’un agent. @ca
definition: Relaterer en ressource til biografiske eller historiske oplysninger om en agent. @da
definition: Relates an agent to a summary of information about the history of an agent.
definition: Setzt einen Akteur in Beziehung zu biografischen oder historischen Informationen über einen Akteur. @de
definition: يربط بين وكيل ومعلومات متعلقة بالسيرة الذاتية أو معلومات تاريخية عن وكيل ما. @ar
definition: 将一个行为者与关于一个行为者历史的信息提要关联起来。 @zh-hans

has supplementary content
lexical alias: supplementaryContent.en
status: Published
type: Property
label: har supplerende indhold @da
label: hat ergänzenden Inhalt @de
label: heeft aanvullende content @nl
label: kiegészítő tartalma a következő: @hu
label: lisätty aineistosisältö @fi
label: tamamlayıcı içerik ile ilişkilidir @tr
label: له محتوى تكميلي @ar
label: 有补充内容 @zh-hans
definition: Bir kaynağı, bir çoğaltma topluluğu tarafından somutlaştırılan ana kaynakları tamamlayan kaynak türlerinin göstergesiyle ilişkilendirir. @tr
definition: Hozzákapcsol egy forrást egy forrás azon típusainak a jelöléséhez, amelyek kiegészítik az aggregátumban megtestesülő fő forrásokat. @hu
definition: Liittää aineiston ilmaukseen niistä aineistoista, jotka täydentävät laajennusaggregaatin sisältämiä aineistoja. @fi
definition: Relaterer en ressource til en indikation af indhold der opdaterer eller supplerer en ressources primære indhold. @da
definition: Relates a resource to an indication of the kinds of resource that supplement the main resources that are embodied by an augmentation aggregate.
definition: Setzt eine Ressource in Beziehung zu einer Angabe der Ressourcenarten, die die Hauptressourcen ergänzen, welche durch ein Erweiterungsaggregat verkörpert werden. @de
definition: يربط بين مصدر ومؤشر لأنواع المصادر التي تُكمل المصادر الرئيسية التي يتم تجسيدها بواسطة إضافة تجميعة. @ar
definition: 将一种资源与补充被一种附增合集具体化的主要资源的资源的类型的指示关联起来。 @zh-hans

has illustrative content
lexical alias: illustrativeContent.en
status: Published
type: Property
label: aineiston kuvasisältö @fi
label: har illustrativt indhold @da
label: hat illustrierenden Inhalt @de
label: heeft illustratieve content @nl
label: illusztratív tartalma a következő: @hu
label: resimleyici içerik ile ilişkilidir @tr
label: له محتوى توضيحي @ar
label: 有插图内容 @zh-hans
definition: Bir kaynağı, bir çoğaltma topluluğu tarafından somutlaştırılan ana kaynakları tamamlayan görüntü içeriği türlerinin göstergesiyle ilişkilendirir. @tr
definition: Hozzákapcsol egy forrást egy képi tartalom azon típusainak a jelöléséhez, amely kiegészíti a bővülésből eredő aggregátumban megtestesülő fő forrásokat. @hu
definition: Liittää aineiston ilmaukseen niistä kuvasisällöistä, jotka täydentävät laajennusaggregaatin sisältämiä aineistoja. @fi
definition: Relaterer en ressource til en tilstedeværelse af billedindhold, der medfølger en ressources primære indhold. @da
definition: Relates a resource to an indication of the kinds of image content that supplement the main resources that are embodied by an augmentation aggregate.
definition: Setzt eine Ressource in Beziehung zu einer Angabe der Arten von Bildinhalt, die die Hauptressourcen ergänzt, die durch ein Erweiterungsaggregat verkörpert werden. @de
definition: يربط بين مصدر ومؤشر لأنواع محتوى الصورة التي تُكمل المصادر الرئيسية التي يتم تجسيدها بواسطة إضافة تجميعة. @ar
definition: 将一种资源与补充被一种附增合集具体化的主要资源的图像内容的资源的类型的指示关联起来。 @zh-hans

has accessibility content
lexical alias: accessibilityContent.en
status: Published
type: Property
label: aineiston saavutettavuussisältö @fi
label: akadálymentesítési tartalma a következő: @hu
label: erişilebilinir içeriği ile ilişkilidir @tr
label: har tilgængelighedsfremmende indhold @da
label: hat barrierefreien Inhalt @de
label: heeft toegankelijkheidscontent @nl
label: له محتوى تَسهيلي/ محتوى إتاحة @ar
label: 有无障碍内容 @zh-hans
definition: Bir kaynağı, bir çoğaltma topluluğu tarafından somutlaştırılan ana kaynakları algılamak için alternatif duyusal modeller sağlayan kaynak türlerinin göstergesiyle ilişkilendirir. @tr
definition: Hozzákapcsol egy forrást egy forrás azon típusainak a jelöléséhez, amelyek alternatív érzékelési módokat nyújtanak a bővülésből eredő aggregátumban megtestesülő fő források észleléséhez. @hu
definition: Liittää aineiston ilmaukseen niistä aineistoista, jotka tarjoavat vaihtoehtoisia aistintatapoja laajennusaggregaatin sisältämien pääaineistojen vastaanottamiseksi. @fi
definition: Relaterer en ressource til en indikation af indhold, der giver alternative sansemåder for at forstå en ressources primære indhold. @da
definition: Relates a resource to an indication of the kinds of resource that provide alternative sensory modes to perceive the main resources that are embodied by an augmentation aggregate.
definition: Setzt eine Ressource in Beziehung zu einer Angabe der Ressourcenarten, die alternative, sensorische Formen liefern, um die Hauptressource wahrzunehmen, welche durch ein Erweiterungsaggregat verkörpert werden. @de
definition: يربط بين مصدر ومؤشر لأنواع المصادر التي تُوفر أنماطًا حسية بديلة لإدراك المصادر الرئيسية التي يتم تجسيدها بواسطة إضافة تجميعة. @ar
definition: 将一种资源与提供用于感知被一种附增合集具体的主要资源的交替感官模式的资源的类型的指示关联起来。 @zh-hans
scope note: Accessibility content includes accessible labels, audio description, captioning, image description, sign language, and subtitles. Accessibility content does not include subtitles in a language different from the spoken content.
scope note: Az akadálymentesítési tartalmak magukban foglalnak akadálymentes címkéket, hangzó leírást, képleírást, jelnyelvet és feliratozást. Nem tartoznak ide az egy új zenei forrás létrehozását eredményező lényegi változtatások. @hu
scope note: Erişilebilirlik içeriği, erişilebilir etiketler, sesli açıklama, resim açıklamaları, işaret dili ve altyazıları içerir. Erişilebilirlik içeriği, konuşulan içerikten farklı bir dilde altyazı içermez. @tr
scope note: Omfatter lydbeskrivelser, rubrikker, billedbeskrivelser, tegnsprog, og undertekster. Omfatter ikke undertekster på et andet sprog end det talte. @da
scope note: Saavutettavuussisältö sisältää saavutettavat nimikkeet, kuunneltavan kuvauksen, otsikoinnin, kuvien kuvauksen, viittomakielen ja tekstityksen. Saavutettavuussisältö ei sisällä tekstitystä, joka eroaa puhutusta sisällöstä. @fi
scope note: Zum barrierefreien Inhalt gehören barrierefreie Labels, eine Audiodeskription, Untertitel für Hörgeschädigte, Bildbeschreibungen, Gebärdensprache und Untertitel. Zum barrierefreien Inhalt gehören nicht die Untertitel in einer Sprache, die von dem gesprochenen Inhalt abweichen. @de
scope note: يتضمن المحتوى التَسهيلي الآتي: ملصقات يمكن الوصول إليها، وصف صوتي، تعليق، وصف صورة، لغة إشارة، وترجمات. ولا يتضمن المحتوى التَسهيلي ترجمة بلغة مختلفة عن المحتوى المنطوق. @ar
scope note: 无障碍内容包括无障碍标签、音频描述、说明文字、图像描述、记号语言和字幕。无障碍内容不包括不同于口语内容的另一种语言的字幕。 @zh-hans

has format of notated music
lexical alias: formatOfNotatedMusic.en
status: Published
type: Property
label: har type af noteret musik @da
label: hat musikalische Ausgabeform @de
label: heeft format van bladmuziek @nl
label: notaya alınmış müziğin formatı ile ilişkilidir @tr
label: nuottiaineiston muoto @fi
label: zenei lejegyzés formátuma a következő: @hu
label: لها صيغة من موسيقى مدونة @ar
label: 有乐谱的形式 @zh-hans
definition: Bir kaynağı, nota biçiminde sunulan bir kaynağın içeriğinin müzikal veya fiziksel düzeniyle ilişkilendirir. @tr
definition: Hozzákapcsol egy forrást egy forrás tartalmának zenei vagy fizikai elrendezéséhez, amely egy zenei lejegyzés formájában jelenik meg. @hu
definition: Liittää aineiston nuottikirjoituksen muodossa esitetyn aineiston musiikilliseen tai fyysiseen layoutiin. @fi
definition: Relaterer en ressource til et musikalsk eller fysisk layout af en ressources indhold, der er præsenteret som musikalsk notation. @da
definition: Relates a resource to a musical or physical layout of the content of a resource that is presented in the form of musical notation.
definition: Setzt eine Ressource in Beziehung zu einem musikalischen oder physischen Layout des Inhalts einer Ressource, der in Form einer Musiknotation präsentiert wird. @de
definition: يربط بين مصدر وتخطيط موسيقي أو مادي لمحتوى مصدر يُعرض في شكل من أشكال التدوين الموسيقي. @ar
definition: 将一种资源与以乐谱形式呈现的一种资源之内容的音乐或物理布局关联起来。 @zh-hans

has dissertation or thesis information
lexical alias: dissertationOrThesisInformation.en
status: Published
type: Property
label: disszertációja/tézisinformációja a következő: @hu
label: har afhandlings- eller specialeoplysninger @da
label: hat Hochschulschriftenvermerk @de
label: heeft dissertatie- of these-informatie @nl
label: tez bilgisi ile ilişkilidir @tr
label: väitöskirjan tai opinnäytteen tiedot @fi
label: له معلومات عن رسالة جامعية دكتوراه أو ماجستير @ar
label: 有学位论文信息 @zh-hans
definition: Bir kaynağı, bir kaynağın sunulduğu akademik kurumu, dereceyi ve yılı tanımlayan bir bildirim ile ilişkilendirir. @tr
definition: Hozzákapcsol egy forrást egy közléshez, amely azonosítja egy forrás kapcsolódó tudományos intézményét, fokozatát és az évet amelyben bemutatták. @hu
definition: Liittää aineiston merkintöön akateemisesta instituutiosta, tutkinnosta ja aineiston vuodesta. @fi
definition: Relaterer en ressource til en oplysning der identificerer en akademisk institution, en akademisk grad og året hvor ressourcen blev forsvaret. @da
definition: Relates a resource to a statement that identifies an academic institution, degree, and year for which a resource was presented.
definition: Setzt eine Ressource in Beziehung zu einer Angabe, die eine akademische Institution, einen Grad oder ein Jahr, in dem eine Arbeit präsentiert wurde, bezeichnet. @de
definition: يربط بين مصدر وبيان يحدد المؤسسة الأكاديمية، والدرجة العلمية، والسَنة التي قُدم فيها المصدر. @ar
definition: 将一种资源与标识一种资源被提交的学术机构、学位和年份的说明关联起来。 @zh-hans

has contact information
lexical alias: contactInformation.en
status: Published
type: Property
label: har kontaktoplysninger @da
label: hat Kontaktinformationen @de
label: heeft contactinformatie @nl
label: iletişim bilgisi ile ilişkilidir @tr
label: kapcsolati információja a következő: @hu
label: yhteystiedot @fi
label: له بيانات اتصال @ar
label: 有联络信息 @zh-hans
definition: Bir kaynağı, bir kaynağın elde edilebileceği bir temsilci ile bir isim, adres veya diğer iletişim araçlarıyla ilişkilendirir. @tr
definition: Hozzákapcsol egy forrást egy ágens nevéhez, címéhez vagy a vele folytatott kommunikáció egyéb módjához, amely révén egy forrás elérhető. @hu
definition: Liitää aineiston toimijan, jolta aineisto on saatavissa, nimeen, osoitteeseen tai muuhun yhteystietoon. @fi
definition: Relaterer en ressource til et navn, en adresse, etc. for en organisation etc. hvorfra en ressource kan fremskaffes. @da
definition: Relates a resource to a name, address, or other means of communicating with an agent from which a resource may be obtained.
definition: Setzt eine Ressource in Beziehung zu einem Namen, einer Adresse oder einem anderen Kommunikationsmittel eines Akteurs, von dem eine Ressource erworben werden kann. @de
definition: يربط بين مصدر وإسم، عنوان، أو غيرها من بيانات الاتصال لوكيل يمكن الحصول منه على مصدر. @ar
definition: 将一种资源与资源可以通过其获得的一个行为者的名称、地址或其他通讯方式关联起来。 @zh-hans
scope note: A kapcsolati információ magában foglalja egy kiadott forrás kiadójának, terjesztőjének, stb., illetve a forrást megőrző archiváló repozitóriumnak a nevét, címét, stb. @hu
scope note: Contact information includes the name, address, etc. of the publisher, distributor, etc. of a published resource, or of the archival repository that holds the resource.
scope note: Darunter fällt der Name, die Adresse und so weiter des Verlags, Vertriebs und so weiter eine veröffentlichten Ressource oder des Archivrepositorys, das die Ressource aufbewahrt. @de
scope note: Kontaktoplysninger inkluderer navn adresse, etc. på en udgiven ressources udgiver, distributør, etc., eller på det arkiv som ejer ressourcen. @da
scope note: Yhteystietoon sisältyy julkaistun aineiston kustantajan, jakelijan jne. tai säilyttävän arkiston nimi, osoite jne. @fi
scope note: İletişim bilgileri, yayımlanmış bir kaynağın yayıncısı, dağıtıcısı vb. ile bu kaynağı elinde bulunduran arşiv deposunun adı, adresi vb. bilgileri içerir. @tr
scope note: تتضمن بيانات الاتصال اسم وعنوان الناشر، الموزع، إلخ. وغيرها من بيانات الاتصال الخاصة بمصدر منشور، أو بالمستودع الأرشيفي الذي يحتفظ بالمصدر. @ar
scope note: 联络信息包括出版资源的出版者、发行者等或者收藏该资源的档案资料库的名称和地址等。 @zh-hans

has history of resource
lexical alias: historyOfResource.en
status: Published
type: Property
label: aineiston historia @fi
label: forrás története a következő: @hu
label: har ressourcehistorie @da
label: hat Geschichte einer Ressource @de
label: heeft geschiedenis van resource @nl
label: kaynağın geçmişi ile ilişkilidir @tr
label: له تاريخ مصدر @ar
label: 有资源的历史 @zh-hans
definition: Bir kaynağı, bir kaynağın tarihinin kısa özet bilgisiyle ilişkilendirir. @tr
definition: Hozzákapcsol egy forrást egy forrás történetéről szóló információk összefoglalásához. @hu
definition: Liittää aineiston tiivistelmään aineiston historiatiedoista. @fi
definition: Relaterer en ressource til en opsummering af oplysninger om en ressources historie. @da
definition: Relates a resource to a summary of information about the history of a resource.
definition: Setzt eine Ressource in Beziehung zu Informationen über die Geschichte einer Ressource. @de
definition: يربط بين مصدر وملخص معلومات عن تاريخ مصدر ما. @ar
definition: 将一种资源与关于一种资源历史的信息提要关联起来。 @zh-hans

has biographical information (Deprecated)
lexical alias: biographicalInformation.en
status: Deprecated
type: Property
label: har biografiske oplysninger @da
definition: Relaterer en agent til en opsummering af oplysninger om en persons liv eller historie. @da
definition: Relates an agent to a summary of information about the life or history of an agent. (Deprecated)

has other title information
lexical alias: otherTitleInformation.en
status: Published
type: Property
label: aineiston muu nimeketieto @fi
label: diğer başlık bilgisi ile ilişkilidir @tr
label: egyéb címinformációja a következő: @hu
label: har anden titelinformation @da
label: hat Titelzusatz @de
label: heeft andere titelinformatie @nl
label: له بيانات أخرى لعنوان @ar
label: 有其他题名信息 @zh-hans
sub property of: has title
definition: Bir kaynağı, bir kaynağın başlığıyla birlikte görünen ve ona bağlı olan bir kelime, karakter veya kelime ya da karakter grubuyla ilişkilendirir. @tr
definition: Hozzákapcsol egy forrást egy szóhoz, karakterhez, vagy szavak vagy karakterek egy csoportjához, amely egy forrás főcímével párosulva, vagy annak alávetve jelenik meg. @hu
definition: Liittää aineiston sanaan, merkkiin tai ryhmään sanoja ja/tai merkkejä, jotka esiintyvät aineiston päänimekkeen kanssa ja sille alisteisina. @fi
definition: Relaterer en ressource til et ord, tegn eller en gruppe af ord og/eller tegn, der optræder i forbindelse med, og er underordnet, en ressources hovedtitel. @da
definition: Relates a resource to a word, character, or group of words or characters that appears in conjunction with, and is subordinate to, a title proper of a resource.
definition: Setzt eine Ressource in Beziehung zu einem Wort, einem Zeichen oder einer Gruppe von Wörtern oder Zeichen, die in Verbindung mit dem Haupttitel einer Ressource erscheinen und diesem nachgeordnet sind. @de
definition: يربط بين مصدر وكلمة، حرف، أو مجموعة كلمات أو تمثيلات تظهر بمصاحبة عنوان مُنَاسِب لمصدر، وتكون تابعًا له. @ar
definition: 将一种资源与和一种资源的正题名一起出现并附属于正题名的一个词、字符、或一组词或字符关联起来。 @zh-hans

has other title information of series
lexical alias: otherTitleInformationOfSeries.en
status: Published
type: Property
label: har anden titelinformation for serie @da
label: hat Titelzusatz einer Reihe @de
label: heeft andere titelinformatie van reeks @nl
label: sarjan muu nimeketieto aineistolle @fi
label: serinin diğer başlık bilgisi ile ilişkilidir @tr
label: sorozati egyéb címinformációja a következő: @hu
label: له بيانات عنوان أخرى لسلسلة @ar
label: 有丛编的其他提名信息 @zh-hans
definition: Bir kaynağı, bir dizinin başlığıyla birlikte görünen ve ona bağlı olan bir kelime, karakter veya kelime ya da karakter grubuyla ilişkilendirir. @tr
definition: Hozzákapcsol egy forrást egy szóhoz, karakterhez, vagy szavak vagy karakterek egy csoportjához, amely egy sorozat főcímével párosulva, vagy annak alávetve jelenik meg. @hu
definition: Liittää aineiston sanaan, merkkiin tai ryhmään sanoja ja/tai merkkejä, jotka esiintyvät sarjan päänimekkeen kanssa ja sille alisteisina. @fi
definition: Relaterer en ressource til et ord, tegn eller en gruppe af ord og/eller tegn, der optræder i forbindelse med, og er underordnet, en series hovedtitel. @da
definition: Relates a resource to a word, character, or group of words or characters that appears in conjunction with, and is subordinate to, a title proper of a series.
definition: Setzt eine Ressource in Beziehung zu einem Wort, einem Zeichen oder einer Gruppe von Wörtern oder Zeichen, die in Verbindung mit dem Haupttitel einer Ressource erscheinen und diesem nachgeordnet sind. @de
definition: يربط بين مصدر وكلمة، حرف، أو مجموعة كلمات أو تمثيلات تظهر بمصاحبة عنوان مُنَاسِب لسلسلة، وتكون تابعًا لها. @ar
definition: 将一种资源与和一种丛编的正题名一起出现并附属于正题名的一个词、字符、或一组词或字符关联起来。 @zh-hans

has other title information of subseries (Deprecated)
lexical alias: otherTitleInformationOfSubseries.en
status: Deprecated
type: Property
label: har anden titelinformation for underserie @da
definition: Relaterer en ressource til et ord, tegn eller en gruppe af ord og/eller tegn, der optræder i forbindelse med, og er underordnet, en underseries hovedtitel. @da
definition: Relates a resource to a word, character, or group of words or characters that appears in conjunction with, and is subordinate to, a title proper of a subseries. (Deprecated)

has restrictions on access
lexical alias: restrictionsOnAccess.en
status: Published
type: Property
label: erişim kısıtlaması ile ilişkilidir @tr
label: har adgangsrestriktioner for ressource @da
label: hat Zugangsbeschränkung @de
label: heeft beperking op toegang @nl
label: hozzáférési korlátozása a következő: @hu
label: saatavuuden rajoitukset aineistolle @fi
label: له قيود على الإتاحة @ar
label: 有获取限制 @zh-hans
definition: Bir kaynağı, bir kaynağa erişime getirilen sınırlamalarla ilişkilendirir. @tr
definition: Hozzákapcsol egy forrást egy korlátozáshoz, amelyet egy forráshoz való hozzáféréshez rendelnek. @hu
definition: Liittää aineiston aineiston saatavuudelle asetettuihin rajoituksiin. @fi
definition: Relaterer en ressource til begrænsninger for adgang til en ressource. @da
definition: Relates a resource to limitations placed on access to a resource.
definition: Setzt eine Ressource in Beziehung zu Beschränkungen des Zugangs zu einer Ressource. @de
definition: يربط بين مصدر وقيود مفروضة على الوصول إلى مصدر ما. @ar
definition: 将一种资源与对一种资源的获取设置的限制关联起来。 @zh-hans

has restrictions on use
lexical alias: restrictionsOnUse.en
status: Published
type: Property
label: aineiston käyttöehdot @fi
label: felhasználási korlátozása a következő: @hu
label: har brugsrestriktioner for ressource @da
label: hat Benutzungsbeschränkung @de
label: heeft beperking op gebruik @nl
label: kullanım kısıtlaması ile ilişkilidir @tr
label: له قيود على الاستخدام @ar
label: 有使用限制 @zh-hans
definition: Bir kaynağı, kaynağın çoğaltılmasına, yayınlanmasına, sergilenmesine vb. konulan bir sınırlamayla ilişkilendirir. @tr
definition: Hozzákapcsol egy forrást egy korlátozáshoz, amelyet egy forrás másolásához, publikálásához, kiállításához stb. rendelnek. @hu
definition: Liittää aineiston aineiston käyttörajoituksiin koskien esim. kopiointia, julkaisemista tai esille asettamista. @fi
definition: Relaterer en ressource til begrænsninger relateret til ret til reproduktion, publicering, udstilling etc. af en ressource. @da
definition: Relates a resource to a limitation placed on reproduction, publication, exhibition, etc., of a resource.
definition: Setzt eine Ressource in Beziehung zu einer Beschränkung der Verwendungsart einer Ressource, wie zum Beispiel Reproduktion, Veröffentlichung, Ausstellung und so weiter. @de
definition: يربط بين مصدر وقيود مفروضة على الاستنساخ، النشر، المعَرض، إلخ.، لمصدر ما. @ar
definition: 将一种资源与对一种资源的复制、出版、展览等设置的限制关联起来。 @zh-hans

has details of cartographic content
lexical alias: detailsOfCartographicContent.en
status: Published
type: Property
label: aineiston kartografisen sisällön tarkemmat tiedot @fi
label: har andre detaljer om kartografisk indhold @da
label: hat Details zu kartografischem Inhalt @de
label: heeft details van cartografische content @nl
label: kartografik içeriğin ayrıntıları ile ilişkilidir @tr
label: kartográfiai tartalom részletei a következők: @hu
label: له تفاصيل محتوى رسم الخرائط @ar
label: 有地图内容的细节 @zh-hans
definition: Bir kaynağı, matematiksel verilerin ve bir kaynağın kartografik içeriğinin ölçek, projeksiyon ve koordinat bildirimlerinde kaydedilmeyen diğer özelliklerinin bir göstergesiyle ilişkilendirir. @tr
definition: Hozzákapcsol egy forrást egy forrás kartográfiai tartalmának matematikai adatait és más sajátosságait mutató jelöléshez, amely nincs rögzítve a méretarányról, vetületről és koordinátákról szóló közlésekben. @hu
definition: Merkintä matemaattisista tiedoista ja muista aineiston kartografisen sisällön ominaisuuksista, joita ei ole merkitty mittakaava-, projektio- tai koordinaatiomerkintöihin. @fi
definition: Relaterer en ressource til en indikation af matematiske data og andre karakteristika ved en ressources kartografiske indhold, der ikke er registreret som del af målestoks-, projicerings- eller koordinatoplysninger. @da
definition: Relates a resource to an indication of mathematical data and other features of the cartographic content of a resource not recorded in statements of scale, projection, and coordinates.
definition: Setzt eine Ressource in Beziehung zu einer Angabe von mathematische Daten und sonstigen Besonderheiten des kartografischen Inhalts einer Ressource, die nicht in Maßstabs-, Projektions- und Koordinatenangaben erfasst werden. @de
definition: يربط بين مصدر ومؤشر لبيانات رياضية ومعالم أخرى لمحتوى رسم خرائط لمصدر لم يتم تسجيله في بيانات مقياس، عَرض، وإحداثيات. @ar
definition: 将一种资源与在比例尺、投影和坐标说明中未记录的一种资源的地图内容的数学数据和其他特征的表示关联起来。 @zh-hans

has first alphanumeric designation of sequence
lexical alias: firstAlphanumericDesignationOfSequence.en
status: Published
type: Property
label: har numerisk og/eller alfabetisk betegnelse for første nummer eller del af sekvens @da
label: hat alphanumerische Bezeichnung der ersten Ausgabe einer fortlaufenden Ressource @de
label: heeft eerste alfanumerieke aanduiding van reeks @nl
label: numerointijakson ensimmäinen numero- ja/tai kirjainmäärite aineistolle @fi
label: sorrendiségének alfanumerikus kezdőjelölése a következő: @hu
label: sıranın ilk alfanümerik tanımlanması ile ilişkilidir @tr
label: له تسمية رقمية أولى لتسلسل @ar
label: 有序列的第一个字母数字标识 @zh-hans
sub property of: has numbering of sequence
inverse of: is first alphanumeric designation of sequence of
definition: Bir kaynağı, bir sayı dizisinde yayınlanan bir serinin ilk sayısında veya bir kısmında sunulan sayısal veya alfabetik formdaki tanım ile ilişkilendirir. @tr
definition: Hozzákapcsol egy forrást egy megjelöléshez, amely egy sorozat számozási sorrendjében, számok vagy alfabetikus karakterek formájában jelzi az első részt vagy számot. @hu
definition: Liittää aineiston numeroista tai kirjaimista muodostuvaan määritteeseen, joka ilmaisee aineiston osien tai iteraatioiden numerointijakson ensimmäisen määritteen. @fi
definition: Relaciona un recurs amb un nomen que és una designació en la forma de números o caràcters alfabètics que s’usa per indicar la primera en una seqüència de numeració de les parts o iteracions d’un recurs. @ca
definition: Relaterer en ressource til en betegnelse i numerisk og/eller alfabetisk form på første nummer eller del af en nummereringssekvens for et periodikum. @da
definition: Relates a resource to a nomen that is a designation in the form of numbers or alphabetic characters that is used to indicate the first in a sequence of numbering of the parts or iterations of a resource.
definition: Setzt eine Ressource in Beziehung zu einer Bezeichnung in Form von Nummern oder Buchstaben, die innerhalb einer Zählfolge auf der ersten Ausgabe einer fortlaufenden Ressource erscheint. @de
definition: يربط بين مصدر وتسمية على شكل رقمي أو أبجدي مُقدمة في عدد أول أو جزء أول من تسلسل صدر في ترقيم متسلسل. @ar
definition: 将一种资源与作为以数字或字母字符形式用于标识一种资源的部分或更新后整体的编号序列中第一个的标识的一个命名关联起来。 @zh-hans

has last alphanumeric designation of sequence
lexical alias: lastAlphanumericDesignationOfSequence.en
status: Published
type: Property
label: har numerisk og/eller alfabetisk betegnelse for sidste nummer eller del af sekvens @da
label: hat alphanumerische Bezeichnung der letzten Ausgabe einer fortlaufenden Ressource @de
label: heeft laatste alfanumerieke aanduiding van reeks @nl
label: numerointijakson viimeinen numero- ja/tai kirjainmäärite aineistolle @fi
label: sorrendiségének alfanumerikus zárójelölése a következő: @hu
label: sıranın son alfanümerik tanımlanması ile ilişkilidir @tr
label: له تسمية رقمية أخيرة لتسلسل @ar
label: 有序列的最后一个字母数字标识 @zh-hans
sub property of: has numbering of sequence
inverse of: is last alphanumeric designation of sequence of
definition: Bir kaynağı, bir sayı dizisinde yayınlanan bir serinin son sayısında veya bir kısmında sunulan sayısal veya alfabetik formdaki tanım ile ilişkilendirir. @tr
definition: Hozzákapcsol egy forrást egy megjelöléshez, amely egy sorozat számozási sorrendjében, számok vagy alfabetikus karakterek formájában jelzi az utolsó részt vagy számot. @hu
definition: Liittää aineiston numeroista tai kirjaimista muodostuvaan määritteeseen, joka ilmaisee aineiston osien tai iteraatioiden numerointijakson viimeisen määritteen. @fi
definition: Relaciona un recurs amb un nomen que és una designació en la forma de números o caràcters alfabètics que s’usa per indicar la darrera en una seqüència de numeració de les parts o iteracions d’un recurs. @ca
definition: Relaterer en ressource til en betegnelse i numerisk og/eller alfabetisk form på sidste nummer eller del af en nummereringssekvens for et periodikum. @da
definition: Relates a resource to a nomen that is a designation in the form of numbers or alphabetic characters that is used to indicate the last in a sequence of numbering of the parts or iterations of a resource.
definition: Setzt eine Ressource in Beziehung zu einer Bezeichnung in Form von Nummern oder Buchstaben, die innerhalb einer Zählfolge auf der letzten Ausgabe einer fortlaufenden Ressource erscheint. @de
definition: يربط بين مصدر وتسمية على شكل رقمي أو أبجدي مُقدمة في عدد أخير أو جزء أخير من تسلسل صدر في ترقيم متسلسل. @ar
definition: 将一种资源与作为以数字或字母字符形式用于标识一种资源的部分或更新后整体的编号序列中最后一个的标识的一个命名关联起来。 @zh-hans

has first chronological designation of sequence
lexical alias: firstChronologicalDesignationOfSequence.en
status: Published
type: Property
label: har kronologisk betegnelse for første nummer eller del af sekvens @da
label: hat chronologische Bezeichnung der ersten Ausgabe einer fortlaufenden Ressource @de
label: heeft eerste chronologische aanduiding van reeks @nl
label: numerointijakson ensimmäinen aikamäärite aineistolle @fi
label: sorrendiségének kronológiai kezdőjelölése a következő: @hu
label: sıranın ilk kronolojik tanımlanması ile ilişkilidir @tr
label: له تسمية زمنية أولى لتسلسل @ar
label: 有序列的第一个年代标识 @zh-hans
sub property of: has numbering of sequence
inverse of: is first chronological designation of sequence of
definition: Bir kaynağı, bir numaralandırma dizisinde yayınlanan bir serinin ilk baskısında veya bir kısmında sunulan tarih formundaki bir tanımla ilişkilendirir. @tr
definition: Hozzákapcsol egy forrást egy megjelöléshez, amely egy sorozat számozási sorrendjében, dátum formájában jelzi az első részt vagy számot. @hu
definition: Liittää aineiston päivämäärästä tai muusta ajanjaksosta muodostuvaan määritteeseen, joka ilmaisee aineiston osien tai iteraatioiden numerointijakson ensimmäisen määritteen. @fi
definition: Relaciona un recurs amb un nomen que és una designació en la forma d’una data o un altre interval de temps que s’usa per indicar la primera en una seqüència de numeració de les parts o iteracions d’un recurs. @ca
definition: Relaterer en ressource til en betegnelse i form af en datering på første nummer eller del af en nummereringssekvens for et periodikum. @da
definition: Relates a resource to a nomen that is a designation in the form of a date or other timespan that is used to indicate the first in a sequence of numbering of the parts or iterations of a resource.
definition: Setzt eine Ressource in Beziehung zu einer Bezeichnung in Form eines Datums, das innerhalb einer Zählfolge auf der ersten Ausgabe einer fortlaufenden Ressource erscheint. @de
definition: يربط بين مصدر وتسمية في شكل بيانات مُقدم في عدد أول أو جزء أول من تسلسل صدر في ترقيم متسلسل. @ar
definition: 将一种资源与作为以日期或其他时间段形式用于标识一种资源的部分或更新后整体的编号序列中第一个的标识的一个命名关联起来。 @zh-hans
scope note: Betegnelsen omfatter et år; år og måned; måned, dag og år. @da
scope note: Darunter fällt ein Jahr; ein Monat und ein Jahr; ein Tag, ein Monat und ein Jahr. @de
scope note: Designation includes a year; year and month; month, day, and year.
scope note: Jelölés lehet év; év és hónap; hónap, nap és év. @hu
scope note: Määrite sisältää vuoden; vuoden ja kuukauden; kuukauden, päivän ja vuoden. @fi
scope note: Tanımlama, yıl; yıl ve ay; ay, gün ve yılı içerir. @tr
scope note: تشمل التسمية: سنة؛ سنة وشهر؛ شهر، يوم، وسنة. @ar
scope note: 标识包括年，年和月，年、月和日。 @zh-hans

has last chronological designation of sequence
lexical alias: lastChronologicalDesignationOfSequence.en
status: Published
type: Property
label: har kronologisk betegnelse for sidste nummer eller del af sekvens @da
label: hat chronologische Bezeichnung der letzten Ausgabe einer fortlaufenden Ressource @de
label: heeft laatste chronologische aanduiding van reeks @nl
label: numerointijakson viimeinen aikamäärite aineistolle @fi
label: sorrendiségének kronológiai zárójelölése a következő: @hu
label: sıranın son kronolojik tanımlanması ile ilişkilidir @tr
label: له تسمية زمنية أخيرة لتسلسل @ar
label: 有序列的最后一个年代标识 @zh-hans
sub property of: has numbering of sequence
inverse of: is last chronological designation of sequence of
definition: Bir kaynağı, bir numaralandırma dizisinde yayınlanan bir serinin son baskısında veya bir kısmında sunulan tarih formundaki bir tanımla ilişkilendirir. @tr
definition: Hozzákapcsol egy forrást egy megjelöléshez, amely egy sorozat számozási sorrendjében, dátumformátumban jelzi az utolsó részt vagy számot. @hu
definition: Liittää aineiston päivämäärästä tai muusta ajanjaksosta muodostuvaan määritteeseen, joka ilmaisee aineiston osien tai iteraatioiden numerointijaksonviimeisen määritteen. @fi
definition: Relaciona un recurs amb un nomen que és una designació en la forma d’una data o un altre interval de temps que s’usa per indicar la darrera en una seqüència de numeració de les parts o iteracions d’un recurs. @ca
definition: Relaterer en ressource til en betagnelse i form af en datering på sidste nummer eller del af en nummereringssekvens for et periodikum. @da
definition: Relates a resource to a nomen that is a designation in the form of a date or other timespan that is used to indicate the last in a sequence of numbering of the parts or iterations of a resource.
definition: Setzt eine Ressource in Beziehung zu einer Bezeichnung in Form eines Datums, das innerhalb einer Zählfolge auf der letzten Ausgabe einer fortlaufenden Ressource erscheint. @de
definition: يربط بين مصدر وتسمية في شكل بيانات مُقدمة في عدد أخير أو جزء أخير من تسلسل صدر في ترقيم متسلسل. @ar
definition: 将一种资源与作为以日期或其他时间段形式用于标识一种资源的部分或更新后整体的编号序列中最后一个的标识的一个命名关联起来。 @zh-hans
scope note: Betegnelsen omfatter et år; år og måned; måned, dag og år. @da
scope note: Darunter fällt ein Jahr; ein Monat und ein Jahr; ein Tag, ein Monat und ein Jahr. @de
scope note: Designation includes a year; year and month; month, day, and year.
scope note: Jelölés lehet év; év és hónap; hónap, nap és év. @hu
scope note: Määrite sisältää vuoden; vuoden ja kuukauden; kuukauden, päivän ja vuoden. @fi
scope note: Tanımlama, yıl; yıl ve ay; ay, gün ve yılı içerir. @tr
scope note: تشمل التسمية: سنة؛ سنة وشهر؛ شهر، يوم، وسنة. @ar
scope note: 标识包括年，年和月，年、月和日。 @zh-hans

is split into
lexical alias: splitInto.en
status: Published
type: Property
label: bölünmüştür @tr
label: er opdelt i @da
label: is gesplitst tot @nl
label: ist gesplittet in @de
label: jakautunut aineisto @fi
label: szétvált a következőbe: @hu
label: هو منشطِر إلى @ar
label: 被分成 @zh-hans
sub property of: is succeeded by
inverse of: is split from
definition: Bir kaynağı, tamamlanmış başka bir artzamanlı kaynağın kısmi içeriğini sürdüren artzamanlı bir kaynak olan bir kaynakla ilişkilendirir. @tr
definition: Hozzákapcsol egy forrást egy diakronikus forráshoz, amely egy másik, befejezett diakronikus forrás részleges tartalmát folytatja. @hu
definition: Liittää aineiston aineistoon, joka on diakroninen aineisto, joka jatkaa toisen, valmiin diakronisen aineiston osittaista sisältöä. @fi
definition: Relaterer et ressource til en ressource, der er resultatet af opdelingen af en tidligere ressource i to eller flere separate ressourcer. @da
definition: Relates a resource to a resource that is a diachronic resource that continues the partial content of another diachronic resource that is completed.
definition: Setzt eine Ressource in Beziehung zu einer diachronen Ressource, die teilweise den Inhalt einer anderen abgeschlossenen, diachronen Ressource fortführt. @de
definition: يربط بين مصدر ومصدر ممتد زمنيًا يُكْمل المحتوى الجزئي لمصدر آخر ممتد زمنيًا ومكتمل. @ar
definition: 将一种资源与作为一种历时资源继承另一种已完成的历时资源的部分内容的一种资源关联起来。 @zh-hans

is merged to form
lexical alias: mergedToForm.en
status: Published
type: Property
label: egyesül a következőkkel: @hu
label: er lagt sammen til @da
label: is samengevoegd om te vormen @nl
label: ist vereinigt, um ... zu bilden @de
label: olarak birleştirilmiştir @tr
label: yhdistynyt aineisto @fi
label: هو مدمج لتشكيل @ar
label: 被合并而形成 @zh-hans
sub property of: is succeeded by
inverse of: is merger of
definition: Bir kaynağı, iki veya daha fazla kaynağın bir araya gelmesiyle oluşan bir kaynakla ilişkilendirir. @tr
definition: Hozzákapcsol egy forrást egy forráshoz, amely két vagy több forrás egyesüléséből jött létre. @hu
definition: Liittää aineiston aineistoon, joka on syntynyt kahden tai useamman aineiston yhdistymisestä. @fi
definition: Relaterer en ressource til en ressource, der er dannet ved at lægge to eller flere ressourcer sammen. @da
definition: Relates a resource to a resource that is formed from a coming together of two or more resources.
definition: Setzt eine Ressource in Beziehung zu einer Ressource, die durch ein Zusammenführen von zwei oder mehreren Ressourcen gebildet wird. @de
definition: يربط بين مصدر ومصدر مكون من تجميع لمصدرين أو أكثر معًا. @ar
definition: 将一种资源与两种或多种资源一起形成的一种资源关联起来。 @zh-hans

is merger of
lexical alias: mergerOf.en
status: Published
type: Property
label: birleşmesidir @tr
label: egyesítője a következőknek: @hu
label: er sammenlægning af @da
label: is samenvoeging van @nl
label: ist Vereinigung von @de
label: yhdistyjä (aineisto) @fi
label: هو مدمج لـ @ar
label: 是……的合并 @zh-hans
sub property of: is preceded by
inverse of: is merged to form
definition: Bir kaynağı, yeni bir kaynak oluşturmak için bir veya daha fazla başka kaynakla bir araya gelen kaynakla ilişkilendirir. @tr
definition: Hozzákapcsol egy forrást egy forráshoz, amely egy vagy több egyéb forrással egyesült egy új forrás létrehozása érdekében. @hu
definition: Liittää aineiston aineistoon, joka on yhdistynyt yhden tai useamman aineiston kanssa ja muodostanut uuden aineiston. @fi
definition: Relaterer en ressource til en ressource, der sammen med en eller flere andre ressourcer danner en ny ressource. @da
definition: Relates a resource to a resource that came together with one or more other resources to form a new resource.
definition: Setzt eine Ressource in Beziehung zu einer Ressource, die mit einer anderen Ressource oder mehreren anderen Ressourcen zusammengeführt wird, um eine neue Ressource zu bilden. @de
definition: يربط بين مصدر ومصدر تم دمجه مع مصدر آخر أو أكثر لتكوين مصدر جديد. @ar
definition: 将一种资源与和一种或者多种其他资源一起形成一种新的资源的一种资源关联起来。 @zh-hans

has equinox
lexical alias: equinox.en
status: Published
type: Property
label: ekinoks ile ilişkilidir @tr
label: har jævndøgn @da
label: hat Äquinoktium @de
label: heeft equinox @nl
label: napéjegyenlősége a következő: @hu
label: tasauspiste aineistossa @fi
label: له اعتدال @ar
label: 有二分点 @zh-hans
inverse of: is equinox of
definition: Bir kaynağı, güneş sapmasının 0° olduğu anda ekliptik ve gök ekvatorunun kesişme noktası olan bir zaman aralığıyla ilişkilendirir. @tr
definition: Hozzákapcsol egy forrást egy időtartamhoz, amely a nappálya és az égi egyenlítő kereszteződési pontja, amelyet a nap akkor foglal el, amikor a deklinációja 0°. @hu
definition: Liittää aineiston ajanjaksoon, joka käyttää ekliptikan ja taivaanekvaattorin leikkauspistettä, jossa aurinko on, kun sen deklinaatio on 0°. @fi
definition: Relaterer en ressource til et af himmelsfærens og himmelækvators to skæringspunkter, hvor solen befinder sig, når dens hældning er 0°. @da
definition: Relates a resource to a timespan that is a point of intersection of the ecliptic and the celestial equator, occupied by the sun when its declination is 0°.
definition: Setzt eine Ressource in Beziehung zu einem von zwei Kreuzungspunkten der Sonnenbahn und des Himmelsäquators, die von der Sonne überquert werden, wenn ihre Deklination 0° beträgt. @de
definition: يربط بين مصدر وفترة زمنية تمثل نقطة تقاطع بين مسار الشمس وخط الاستواء السماوي، تحتله الشمس عندما يكون انحرافها صفر "0". @ar
definition: 将一种资源与作为当太阳的赤纬角度为0时其所占黄道和天赤道的一个交叉点的一个时间段关联起来。 @zh-hans

has parallel other title information
has subproperty: has parallel other title information of series
lexical alias: parallelOtherTitleInformation.en
status: Published
type: Property
label: har parallel anden titelinformation @da
label: hat parallelen Titelzusatz @de
label: heeft parallelle overige titelinformatie @nl
label: paralel diğer başlık bilgisi ile ilişkilidir @tr
label: párhuzamos egyéb címinformációja a következő: @hu
label: rinnakkainen muu nimiketieto aineistolle @fi
label: له بيانات عنوان أخرى بديلة @ar
label: 有并列其他题名信息 @zh-hans
sub property of: has title
definition: Bir kaynağı, farklı başlık bilgisi öğesinde kaydedilenden farklı bir dil veya metindeki diğer başlık bilgisiyle ilişkilendirir. @tr
definition: Hozzákapcsol egy forrást egyéb címinformációhoz egy olyan nyelven vagy írásrendszerben, amely eltér az egyéb címinformáció elemében jelölttől. @hu
definition: Liittää aineiston tietoelementtiin tallennetusta muusta nimiketiedosta eroavaan toiseen nimeketietoon toisella kielellä ja/tai kirjoitusjärjestelmällä. @fi
definition: Relaterer en ressource til andre titeloplysninger på et andet sprog og/eller i et andet alfabet end det som er anvendt ved angivelsen af andre titeloplysninger. @da
definition: Relates a resource to an other title information in a language or script that differs from that recorded in an other title information element.
definition: Setzt eine Ressource in Beziehung zu einem Titelzusatz in einer Sprache oder Schrift, der von dem bereits erfassten Titelzusatz abweicht. @de
definition: يربط بين مصدر وبيانات أخرى لعنوان بلغة أو نص مختلف عن تلك المُسجلة داخل عنصر بيانات عنوان أخر. @ar
definition: 将一种资源与用不同于记录在其他题名信息元素中一种语言或文字的其他题名信息关联起来。 @zh-hans

has parallel other title information of series
has subproperty: has parallel other title information of subseries (Deprecated)
lexical alias: parallelOtherTitleInformationOfSeries.en
status: Published
type: Property
label: har parallel anden titelinformation for serie @da
label: hat parallelen Titelzusatz einer Reihe @de
label: heeft parallelle overige titelinformatie van reeks @nl
label: sarjan rinnakkainen muu nimiketieto aineistolle @fi
label: serinin paralel diğer başlık bilgisi ile ilişkilidir @tr
label: sorozat párhuzamos egyéb címinformációja a következő: @hu
label: له بيانات عنوان أخرى بديلة لسلسلة @ar
label: 有丛编的并列其他题名信息 @zh-hans
sub property of: has parallel other title information
definition: Bir kaynağı, bir dizinin farklı başlık bilgisi öğesinde kaydedilenden farklı bir dil veya metindeki dizinin farklı başlık bilgisiyle ilişkilendirir. @tr
definition: Hozzákapcsol egy forrást egy sorozat egyéb címinformációjához egy olyan nyelven vagy írásrendszerben, amely eltér a sorozat elemében jelölt egyéb címinformációtól. @hu
definition: Liittää aineiston tietoelementtiin tallennetusta muusta sarjan nimiketiedosta eroavaan toiseen nimeketietoon toisella kielellä ja/tai kirjoitusjärjestelmällä. @fi
definition: Relaterer en ressource til andre titeloplysninger for en serie på et andet sprog og/eller i et andet alfabet end det som er anvendt ved angivelsen af andre titeloplysninger for en serie. @da
definition: Relates a resource to an other title information of a series in a language or script that differs from that recorded in an other title information of series element.
definition: Setzt eine Ressource in Beziehung zu einem Titelzusatz einer Reihe in einer Sprache oder Schrift, der von dem bereits erfassten Titelzusatz einer Reihe abweicht. @de
definition: يربط بين مصدر وبيانات عنوان أخرى لسلسة بلغة أو نص مختلف عن تلك المُسجلة داخل عنصر بيانات عنوان أخرى لسلسة. @ar
definition: 将一种资源与用不同于记录在丛编其他题名信息元素中一种语言或文字的丛编其他题名信息关联起来。 @zh-hans

has parallel other title information of subseries (Deprecated)
lexical alias: parallelOtherTitleInformationOfSubseries.en
status: Deprecated
type: Property
label: har parallel anden titelinformation for underserie @da
sub property of: has parallel other title information of series
definition: Relaterer en ressource til andre titeloplysninger for en serie på et andet sprog og/eller i et andet alfabet end det som er anvendt ved angivelsen af andre titeloplysninger for en underserie. @da
definition: Relates a resource to an other title information of a subseries in a language or script that differs from that recorded in an other title information of subseries element. (Deprecated)

has additional scale information
lexical alias: additionalScaleInformation.en
status: Published
type: Property
label: ek ölçek bilgisi ile ilişkilidir @tr
label: har supplerende målestoksforhold @da
label: hat zusätzliche Informationen zu einem Maßstab @de
label: heeft aanvullende schaalinformatie @nl
label: lisätieto aineiston mittakaavasta @fi
label: további méretarány-információja a következő: @hu
label: له معلومات إضافية لمقياس @ar
label: 有附加比例尺信息 @zh-hans
sub property of: has scale
definition: Bir kaynağı, ölçekle ilgili ek bilgilerin göstergesiyle ilişkilendirir. @tr
definition: Hozzákapcsol egy forrást egy a méretarányról szóló kiegészítő információ jelöléséhez. @hu
definition: Liittää aineiston mittakaavaan lisättyjen tietojen merkintään. @fi
definition: Relaterer en ressource til en indikation af supplerende oplysninger om målestoksforhold. @da
definition: Relates a resource to an indication of supplemental information about scale.
definition: Setzt eine Ressource in Beziehung zu ergänzenden Informationen zu einem Maßstab. @de
definition: يربط بين مصدر ومؤشر لمعلومات تكلميلية بشأن مقياس. @ar
definition: 将一种资源与关于比例尺的补充信息表示关联起来。 @zh-hans
scope note: Az összehasonlító mérések vagy egy forrástartalom adott részeinek méretarányra vonatkozó korlátozásainak közlése is idetartozik. @hu
scope note: Darunter fällt eine Angabe von Vergleichsmaßen oder eine Begrenzung des Maßstabs auf bestimmte Teile des Inhalts einer Ressource. @de
scope note: Karşılaştırmalı ölçümlerin bildirimi veya ölçeğin bir kaynağın içeriğinin belirli bölümleriyle sınırlandırılması da dahildir. @tr
scope note: Lisätieto mittakaavasta tarkoittaa merkintöä vertailevista mitoista tai mittakaavan rajauksesta aineiston sisällön tiettyihin osiin yms. @fi
scope note: Statement of comparative measurements or limitation of the scale to particular parts of the content of a resource are included.
scope note: Supplerende målestoksforhold omfatter angivelse i flere måleenheder eller som begrænsning af målestoksforholdet til visse dele af ressourcen. @da
scope note: تتضمن بيان قياسات مقارنة أو قيود لمقياس لأجزاء محددة من محتوى المصدر. @ar
scope note: 包括一种资源之内容的比较测量的说明或对资源内容特定部分的比例尺限制 @zh-hans

has uniform resource locator
lexical alias: uniformResourceLocator.en
status: Published
type: Property
label: URL-osoite @fi
label: egységes forrás-helymeghatározója a következő: @hu
label: har uniform resource locator @da
label: hat Uniform Resource Locator @de
label: heeft Uniform Resource Locator @nl
label: tekdüzen kaynak bulucu ile ilişkilidir @tr
label: له محّدد مصادر مُوحّد @ar
label: 有统一资源定位符 @zh-hans
alternative label: Egy egységes forrás-helymeghatározó (Uniform Resource Locator – URL) magába foglal minden olyan forrásazonosítót, amelynek célja, hogy egy forráshoz szabványos webböngésző használatáva online hozzáférést biztosítson. @hu
alternative label: URL
alternative label: محّدد مصادر مُوحّد @ar
definition: Bir kaynağı çevrimiçi bir kaynağın adresiyle ilişkilendirir. @tr
definition: Hozzákapcsol egy forrást egy online forrás webcíméhez. @hu
definition: Liittää aineiston verkkoaineiston osoitteeseen. @fi
definition: Relaterer en ressource til en adresse på en ressource hvortil der er fjernadgang. @da
definition: Relates a resource to an address of an online resource.
definition: Setzt eine Ressource in Beziehung zu einer Adresse einer Online-Ressource. @de
definition: يربط بين مصدر وعنوان لمصدر متاح على الخط المباشر @ar
definition: 将一种资源与一种联机资源的地址关联起来。 @zh-hans
scope note: A Uniform Resource Locators includes all resource identifiers intended to provide online access to a resource using a standard Internet browser.
scope note: Darunter fallen alle Identifikatoren, die konzipiert sind, um unter Verwendung eines Standard-Internet-Browsers Online-Zugang auf eine Ressource anzubieten. @de
scope note: En Uniform Ressource Locator inkluderer alle ressourceidentifikatorer der har for hensigt at give online access til en ressource gennem at bruge en standard internetbrowser. @da
scope note: Tek Biçimli Kaynak Bulucusu, standart bir internet tarayıcısı kullanarak bir kaynağa çevrimiçi erişim sağlamayı amaçlayan tüm kaynak tanımlayıcıları içerir. @tr
scope note: URL @hu
scope note: URL-osoite käsittää kaikki aineiston tunnisteet, joiden tarkoituksena on antaa pääsy verkossa olevaan aineistoon standardia verkkoselainta käyttäen. @fi
scope note: تتضمن محّددات المصادر المُوحّدة كل معرفات المصدر التي تهدف إلى توفير الإتاحة على الخط المباشر لمصدر باستخدام متصفح إنترنت معياري @ar
scope note: 统一资源定位符包括使用标准的互联网浏览器对资源进行联机检索的所有资源标识符。 @zh-hans

has address of agent
lexical alias: addressOfAgent.en
status: Published
type: Property
label: har adresse på agent @da
label: hat Adresse eines Akteurs @de
label: heeft adres van actor @nl
label: temsilcinin adresi ile ilişkilidir @tr
label: toimijan osoite @fi
label: ágens címe a következő: @hu
label: له عنوان مراسلة لوكيل @ar
label: 有行为者的地址 @zh-hans
inverse of: is address of agent of (Deprecated)
definition: Bir temsilciyi, bir temsilcinin adresiyle ilişkilendirir. @tr
definition: Hozzákapcsol egy ágenst egy ágens címéhez. @hu
definition: Liittää aineiston toimijan osoitteeseen. @fi
definition: Relaterer en ressourcetil en agents bopælsadresse, forretningsadresse eller arbejdsgivers adresse og/eller en e-mail- eller internetadresse. @da
definition: Relates an agent to an address of an agent.
definition: Setzt einen Akteur in Beziehung zu einer Adresse eines Akteurs. @de
definition: يربط بين وكيل وعنوان مراسلة خاص بوكيل. @ar
definition: 将一个行为者与一个行为者的一个地址关联起来。 @zh-hans

has layout
lexical alias: layout.en
status: Published
type: Property
label: aineiston layout @fi
label: düzen ile ilişkilidir @tr
label: har layout @da
label: hat Layout @de
label: heeft opmaak @nl
label: tördelése a következő: @hu
label: له تصميم طباعي @ar
label: 有版式 @zh-hans
definition: Bir kaynağı, bir kaynaktaki metin, görüntü, dokunsal notasyon veya diğer içeriğin düzenlemesiyle ilişkilendirir. @tr
definition: Hozzákapcsol egy forrást szöveg, képek, tapintható lejegyzés vagy egyéb tartalom elrendezéséhez egy forrásban. @hu
definition: Liittää aineiston aineistoon sisältyvien tekstin, kuvien, taktiilin nuottikirjoituksen tai muun aineiston sisällön sommitteluun. @fi
definition: Relaterer en ressource til opstilling af tekst, billeder, taktil notation etc. i en ressource. @da
definition: Relates a resource to an arrangement of text, images, tactile notation, or other content in a resource.
definition: Setzt eine Ressource in Beziehung zu einer Anordnung von Text, Bildern, taktiler Notation und so weiter in einer Ressource. @de
definition: يربط بين مصدر وترتيب نص، صور، كتابة بارزة، أو أي محتوى آخر في مصدر ما. @ar
definition: 将一种资源与资源中对文本、图像、触摸标记或其他内容的安排关联起来。 @zh-hans

has year degree granted
lexical alias: yearDegreeGranted.en
status: Published
type: Property
label: akademik derecenin verildiği yıl ile ilişkilidir @tr
label: fokozatszerzési éve a következő: @hu
label: har år, hvor grad er tildelt @da
label: hat Jahr, in dem ein akademischer Grad verliehen wird @de
label: heeft jaar graad toegekend @nl
label: tutkinnon myöntämisvuosi @fi
label: له عام منح درجة @ar
label: 有学位授予年份 @zh-hans
sub property of: has date of resource
inverse of: is year degree granted of
definition: Bir kaynağı, derece veren bir kurum veya fakülte tarafından akademik derecenin verildiği bir zaman aralığı ile ilişkilendirir. @tr
definition: Hozzákapcsol egy forrást egy időtartamhoz, amelyben egy adományozó intézmény vagy kar tudományos fokozatot adott egy jelöltnek. @hu
definition: Liittää aineiston ajanjaksoon, jolloin laitos tai tiedekunta on myöntänyt akateemisen oppiarvon. @fi
definition: Relaterer en ressource til et kalenderår, hvor en institution eller et fakultet har tildelt en kandidat en akademisk grad. @da
definition: Relates a resource to a timespan during which an academic degree is conferred by a granting institution or faculty.
definition: Setzt eine Ressource in Beziehung zu einem Zeitraum, in dem ein akademischer Grad, der mit einer Hochschulschrift in Verbindung steht, von einer Institution oder Fakultät verliehen wird. @de
definition: يربط بين مصدر وفترة زمنية يتم خلالها منح درجة أكاديمية من قبل مؤسسة مانحة أو هيئة تدريس. @ar
definition: 将一种资源与一个授予机构或院系在期间授予一个学位的一个时间段关联起来。 @zh-hans

has title proper
lexical alias: titleProper.en
status: Published
type: Property
label: aineiston päänimeke @fi
label: başlık ile ilişkilidir @tr
label: főcíme a következő: @hu
label: har hovedtitel @da
label: hat Haupttitel @de
label: heeft hoofdtitel @nl
label: له العنوان نفسه @ar
label: 有正题名 @zh-hans
sub property of: has title
inverse of: is title proper of
definition: Bir kaynağı, bir kaynağın ana adıyla, yani normalde bir kaynağı adlandırırken kullanılan başlıkla ilişkilendirir. @tr
definition: Hozzákapcsol egy forrást egy forrás fő megnevezéséhez, azaz a forrás általánosan használt címéhez. @hu
definition: Liittää aineiston aineiston ensisijaiseen nimekkeeseen eli aineiston nimeämisessä normaalisti käytettyyn nimekkeeseen. @fi
definition: Relaterer en ressource til et hovednavn på en ressource, dvs. en titel, der normalt anvendes, når en ressource navngives. @da
definition: Relates a resource to a chief name of a resource, that is, a title normally used when naming a resource.
definition: Setzt eine Ressource in Beziehung zu einem Hauptnamen einer Ressource, das heißt einem Titel, der normalerweise bei der Benennung einer Ressource verwendet wird. @de
definition: يربط بين مصدر ومصدر له اسم بارز (اسم رئيسي)، وهذا يعني استخدام عنوان يستخدم عادةً عند تسمية مصدر. @ar
definition: 将一种资源与一种资源的一个主要名称（亦即命名一种资源所通常使用的一个题名）关联起来。 @zh-hans
scope note: Alternatif bir başlık, asıl başlığın bir parçası olarak ele alınır. @tr
scope note: An alternative title is treated as part of the title proper.
scope note: Az alternatív címet a főcím részeként kezelik. @hu
scope note: Ein Alternativtitel wird als Teil eines Haupttitels behandelt. @de
scope note: En alternativ titel behandles som del af en hovedtitel. @da
scope note: Vaihtoehtoista nimekettä pidetään päänimekkeen osana. @fi
scope note: يتم التعامل مع العنوان البديل كجزء من العنوان نفسه. @ar
scope note: 交替题名被处理为正题名的部分。 @zh-hans

has title of series
has subproperty: has title proper of subseries (Deprecated)
lexical alias: titleOfSeries.en
status: Published
type: Property
label: har hovedtitel for serie @da
label: hat Titel einer Reihe @de
label: heeft titel van reeks @nl
label: sarjan nimeke aineistolle @fi
label: seri başlığı ile ilişkilidir @tr
label: sorozatcíme a következő: @hu
label: له عنوان لسلسلة @ar
label: 有丛编题名 @zh-hans
sub property of: has title of resource
inverse of: is title of series of
definition: Bir kaynağı, bir dizinin bir bölümünün kaynağında görünen bir bölüm adıyla ilişkilendirir. @tr
definition: Hozzákapcsol egy forrást egy sorozat megnevezéséhez, amely a sorozat részét képező forráson van feltüntetve. @hu
definition: Liittää aineiston sarjan nimeen, joka esiintyy aineistossa, joka on sarjan osa. @fi
definition: Relaterer en ressource til et navn på en ressource, der optræder på en ressource af en del af en serie. @da
definition: Relates a resource to a name of a series appearing on a resource of a part of a series.
definition: Setzt eine Ressource in Beziehung zu einem Namen einer Reihe, der auf einer Ressource als Teil einer Reihe erscheint. @de
definition: يربط بين مصدر واسم سلسلة تظهر على مصدر لجزء من سلسلة. @ar
definition: 将一种资源与出现在丛编一部分的一种资源上的一个丛编的名称关联起来。 @zh-hans

has title proper of subseries (Deprecated)
lexical alias: titleProperOfSubseries.en
status: Deprecated
type: Property
label: har hovedtitel for underserie @da
sub property of: has title of series
inverse of: is title proper of subseries of (Deprecated)
definition: Relaterer en ressource til et navn på en ressource, der optræder på en ressource af en del af en underserie. @da
definition: Relates a resource to a name of a series appearing on a resource of a part of a subseries. (Deprecated)

has coverage of content
lexical alias: coverageOfContent.en
status: Published
type: Property
label: aineiston sisällön kattavuus @fi
label: har indholdsdækning @da
label: hat inhaltlichen Bezugsrahmen @de
label: heeft bereik van content @nl
label: içerik kapsamı ile ilişkilidir @tr
label: tartalmi vonatkozása a következő: @hu
label: له تغطية المحتوى @ar
label: 有内容的覆盖面 @zh-hans
definition: Bir kaynağı, bir kaynağın içeriğinin kronolojik veya coğrafi kapsamıyla ilişkilendirir. @tr
definition: Hozzákapcsol egy forrást egy forrás tartalmának kronológiai vagy földrajzi vonatkozásához. @hu
definition: Liittää aineiston ajalliseen tai maantieteelliseen kattavuuteen aineiston sisällössä. @fi
definition: Relaterer en ressource til en kronologisk eller geografisk dækning af en ressources indhold. @da
definition: Relates a resource to a chronological or geographic coverage of the content of a resource.
definition: Setzt eine Ressource in Beziehung zu einem chronologischen oder geografischen Bezugsrahmen des Inhalts einer Ressource. @de
definition: يربط بين مصدرًا وتغطية زمنية أو جغرافية لمحتوى مصدر. @ar
definition: 将一种资源与一种资源之内容的时间覆盖面或地理覆盖面关联起来。 @zh-hans

has resolution
lexical alias: resolution.en
status: Published
type: Property
label: felbontása a következő: @hu
label: har opløsning @da
label: hat Auflösung @de
label: heeft resolutie @nl
label: resoluutio aineistossa @fi
label: çözünürlük ile ilişkilidir @tr
label: له درجة وضوح @ar
label: 有分辨率 @zh-hans
sub property of: has digital file characteristic
definition: Bir kaynağı, görüntünün piksel vb. cinsinden ölçümüyle ifade edilen, dijital bir görüntüdeki ayrıntıların netliği veya inceliğiyle ilişkilendirir. @tr
definition: Hozzákapcsol egy forrást a részletek világosságához vagy finomságához egy digitális képen, amely a kép pixelben, stb. megadott mértékében fejeződik ki. @hu
definition: Liittää aineiston digitaalisen kuvan tarkkuuteen, joka ilmaistaan pikseleinä tms. @fi
definition: Relaterer en ressource til et digitalt billedes skarphed eller finhedsgrad, udtrykt som en måling af pixels i et billede etc. @da
definition: Relates a resource to a clarity or fineness of detail in a digital image, expressed by a measurement of the image in pixels, etc.
definition: Setzt eine Ressource in Beziehung zu einer Klarheit oder einem Feinheitsgrad der Details in einem digitalen Bild, die/der durch eine Abmessung des Bilds in Pixeln und so weiter ausgedrückt wird. @de
definition: يربط بين مصدر ووضوح أو جودة التفاصيل في صورة رقمية، تم التعبير عنها بمقاييس الصورة بالبكسل، إلخ @ar
definition: 将一种资源与数字图像中由图像像素等的度量表达的细部清晰度或精细度关联起来。 @zh-hans

has intended audience
lexical alias: intendedAudience.en
status: Published
type: Property
label: aineiston kohderyhmä @fi
label: célközönsége a következő: @hu
label: har målgruppe @da
label: hat Zielgruppe @de
label: hedef kitle ile ilişkilidir @tr
label: heeft beoogde doelgroep @nl
label: له جمهور مستهدف @ar
label: 有目标受众 @zh-hans
definition: Bir kaynağı, bir kaynağın içeriğinin amaçlandığı veya içeriğin uygun olduğu düşünülen bir kullanıcı kategorisiyle ilişkilendirir. @tr
definition: Hozzákapcsol egy forrást egy használói kategóriához, amelynek a forrás tartalmát szánták, vagy amelynek a tartalmat alkalmasnak tekintik. @hu
definition: Liittää aineiston käyttäjäryhmään, jolle aineiston on tarkoitettu tai jolle aineiston katsotaan soveltuvan. @fi
definition: Relaterer en ressource til en brugerkategori, som en ressources indhold er beregnet for, eller for hvilken indholdet anses passende. @da
definition: Relates a resource to a category of user for whom the content of a resource is intended, or for whom the content is considered suitable.
definition: Setzt eine Ressource in Beziehung zu einer Gruppe von Benutzenden, für die der Inhalt einer Ressource gedacht ist oder für die der Inhalt als passend angesehen wird. @de
definition: يربط بين مصدر وفئة من المستخدمين المُستهدفين من قبل محتوى مصدر، أو الذين يُعد محتوى المصدر مناسبًا لهم. @ar
definition: 将一种资源与一种资源之内容的目标使用者或者一种资源之内容被认为适合的使用者的类别关联起来。 @zh-hans

has terms of availability
lexical alias: termsOfAvailability.en
status: Published
type: Property
label: aineiston saatavuusehdot @fi
label: elde edilebilirlik koşulları ile ilişkilidir @tr
label: har anskaffelsesvilkår @da
label: hat Bezugsbedingung @de
label: heeft voorwaarden voor beschikbaarheid @nl
label: hozzáférési feltétele a következő: @hu
label: له شروط إتاحة @ar
label: 有获得方式 @zh-hans
definition: Bir kaynağı, bir yayıncının, dağıtımcının vb. normalde bir kaynağı veya bir kaynağın fiyatını tedarik edeceği koşulla ilişkilendirir. @tr
definition: Hozzákapcsol egy forrást egy feltételhez, amely szerint a kiadó, terjesztő, stb. a szokásos módon szolgáltat majd egy forrást, vagy határozza meg a forrás árát. @hu
definition: Liittää aineiston kustantajan, jakelijan tms. asettamiin aineiston toimitusta tai hintaa määrittäviin ehtoihin. @fi
definition: Relaterer en ressource til en etingelse, under hvilke udgiveren, distributøren etc. normalt vil levere en ressource eller prisen på en ressource. @da
definition: Relates a resource to a condition under which a publisher, distributor, etc., will normally supply a resource or the price of a resource.
definition: Setzt eine Ressource in Beziehung zu einem Preis oder einer Kondition, zu dem/der ein Verlag, Vertrieb und so weiter eine Ressource normalerweise liefert. @de
definition: يربط بين مصدر وحالة يقوم عادةً بموجبها ناشر، موزع، إلخ. بتوريد مصدر أو ثمن مصدر. @ar
definition: 将一种资源与出版者、发行者等通常提供一种资源的条件或者一种资源的价格关联起来。 @zh-hans

has track configuration
lexical alias: trackConfiguration.en
status: Published
type: Property
label: aineiston ääniraidan sijainti @fi
label: har sporkonfiguration @da
label: hat Tonspurlage @de
label: heeft trackconfiguratie @nl
label: parça yapılandırması ile ilişkilidir @tr
label: sávkonfigurációja a következő: @hu
label: له بنية مسار @ar
label: 有音轨配置 @zh-hans
sub property of: has sound characteristic
definition: Bir kaynağı, bir ses bandındaki bir ses parçasının yapılandırmasıyla ilişkilendirir. @tr
definition: Hozzákapcsol egy forrást egy hangsávos filmen a hangsáv konfigurációjának részleteihez. @hu
definition: Liittää aineiston ääniraidan asemointiin äänifilmissä. @fi
definition: Relaterer en ressource til en konfiguration af lydsporet til en film med lydspor. @da
definition: Relates a resource to a configuration of an audio track on a sound-track film.
definition: Setzt eine Ressource in Beziehung zu einer Positionierung der Tonspur auf einem Film mit Tonspur. @de
definition: يربط بين مصدر وضبط مسار صوتي على مسار صوت فيلم. @ar
definition: 将一种资源与原声电影片上的音轨配置关联起来。 @zh-hans

has place of origin of resource
lexical alias: placeOfOriginOfResource.en
status: Published
type: Property
label: aineiston alkuperään liittyvä paikka @fi
label: forrás származási helye a következő: @hu
label: har oprindelsessted for ressourcen @da
label: hat Ursprungsort einer Ressource @de
label: heeft plaats van herkomst van resource @nl
label: kaynağın menşei yeri ile ilişkilidir @tr
label: له مكان لمنشأ مصدر @ar
label: 有资源的原地点 @zh-hans
sub property of: has related place of resource
inverse of: is place of origin of resource of
definition: Bir kaynağı, kaynağın ortaya çıktığı yerle ilişkilendirir. @tr
definition: Hozzákapcsol egy forrást egy helyhez, ahonnan egy forrás származik. @hu
definition: Liittää aineiston paikkaan, jossa aineisto on saanut alkunsa. @fi
definition: Relaterer en ressource til et land eller andet område, hvorfra en ressource stammer. @da
definition: Relates a resource to a place from which a resource originated.
definition: Setzt eine Ressource in Beziehung zu einem Geografikum, aus dem eine Ressource stammt. @de
definition: يربط بين مصدرً ومكان نشأ منه مصدر @ar
definition: 将一种资源与一种资源起源的一个地点关联起来。 @zh-hans

has date of establishment
lexical alias: dateOfEstablishment.en
status: Published
type: Property
label: aineistoon liittyvä toimijan perustamisaika @fi
label: alapítási időpontja a következő: @hu
label: har etableringsår @da
label: hat Gründungsdatum @de
label: heeft datum van oprichting @nl
label: kuruluş tarihi ile ilişkilidir @tr
label: له تاريخ تأسيس @ar
label: 有成立日期 @zh-hans
sub property of: has date associated with agent (Deprecated)
inverse of: is date of establishment of
definition: Bir kaynağı, bir temsilcinin kurulduğu veya oluşturulduğu tarihle ilişkilendirir. @tr
definition: Hozzákapcsol egy forrást egy időponthoz, amikor az ágenst alapították. @hu
definition: Relaciona un agent amb un interval de temps durant el qual un agent es crea o es funda. @ca
definition: Relaterer en ressource til et år eller en dato hvor en agent blev etableret eller grundlagt. @da
definition: Relates an agent to a timespan during which an agent is established or founded.
definition: Setzt eine Ressource in Beziehung zu einem Datum, zu dem ein Akteur eingeführt oder gegründet wurde. @de
definition: liittää aineiston ajanjaksoon, jonka aikana toimija on perustettu. @fi
definition: يربط بين مصدر وتاريخ أنشئ أو تأسس خلاله وكيل. @ar
definition: 将一个行为者与一个行为者成立或创办的时间段关联起来。 @zh-hans

has date of termination
lexical alias: dateOfTermination.en
status: Published
type: Property
label: aineistoon liittyvä toimijan lakkauttamisaika @fi
label: har ophørsår @da
label: hat Auflösungsdatum @de
label: heeft datum van opheffing @nl
label: megszüntetés időpontja a következő: @hu
label: sonlanma tarihi ile ilişkilidir @tr
label: له تاريخ توقف @ar
label: 有终止日期 @zh-hans
sub property of: has date associated with agent (Deprecated)
inverse of: is date of termination of
definition: Bir kaynağı, bir temsilcinin sonlandırıldığı veya feshedildiği tarihle ilişkilendirir. @tr
definition: Hozzákapcsol egy forrást egy időponthoz, amikor az ágenst megszüntették vagy feloszlatták. @hu
definition: Relaciona un agent amb un interval de temps durant el qual un agent cessa o es dissol. @ca
definition: Relaterer en ressource til år eller dato, hvor en agent ophørte eller blev opløst. @da
definition: Relates an agent to a timespan during which an agent is terminated or dissolved.
definition: Setzt eine Ressource in Beziehung zu einem Datum, zu dem ein Akteur aufgehoben oder aufgelöst wurde. @de
definition: liittää aineiston ajanjaksoon, jonka aikana toimija on lakkautettu tai hajotettu. @fi
definition: يربط بين مصدر وتاريخ توقف الوكيل خلاله أو حُلّ. @ar
definition: 将一个行为者与一个行为者终止或解散的时间段关联起来。 @zh-hans

has date of conference
lexical alias: dateOfConference.en
status: Published
type: Property
label: har datering af konference etc. @da
label: hat Datum einer Konferenz @de
label: heeft datum van conferentie @nl
label: konferans tarihi ile ilişkilidir @tr
label: konferencia időpontja a következő: @hu
label: konferenssin aika @fi
label: له تاريخ مؤتمر @ar
label: 有会议的日期 @zh-hans
sub property of: has date associated with agent (Deprecated)
inverse of: is date of conference of
definition: Bir kaynağı, bir konferansın, kongrenin, toplantının, serginin, fuarın, festivalin vb. düzenlendiği tarihi veya tarih aralığıyla ilişkilendirir. @tr
definition: Hozzákapcsol egy forrást egy dátumhoz vagy dátumtartományhoz, amikor konferenciát, kongresszust, találkozót, kiállítást, vásárt, fesztivált, stb. tartottak. @hu
definition: Liittää aineiston päivämäärään tai päivämääriin, jolloin konferenssi, kongressi, kokous, näyttely, messut, festivaalit tms. pidettiin. @fi
definition: Relaciona un agent amb un interval de temps durant el qual se celebra un congrés, una exposició o qualsevol altre esdeveniment formalment esmentat i convocat. @ca
definition: Relaterer en ressource til et år eller en dato eller en række heraf, hvor en konference, en kongres, et møde, en udstilling, en messe, en festival etc. blev afholdt. @da
definition: Relates an agent to a timespan during which a conference, exhibition, or other formally named and convened event is held.
definition: Setzt eine Ressource in Beziehung zu einem Datum oder einem Datumsbereich, zu dem eine Konferenz, ein Kongress, eine Ausstellung, eine Messe, ein Festival und so weiter stattfindet. @de
definition: يربط بين مصدر وتاريخ أو نطاق تواريخ تم فيها عقد مؤتمر، اِجتماع، لقاء، معرض فني، مهرجان، اِحتِفَال، إلخ. @ar
definition: 将一个行为者与会议、展览或其他正式命名并举办的活动的时间跨度关联起来。 @zh-hans

has date of resource
has subproperty: has year degree granted
lexical alias: dateOfResource.en
status: Published
type: Property
label: aineiston ajankohta @fi
label: forráshoz kapcsolódó idő a következő: @hu
label: har datering af ressource @da
label: hat Datum einer Ressource @de
label: heeft datum van resource @nl
label: kaynak tarihi ile ilişkilidir @tr
label: له تاريخ مصدر @ar
label: 有资源的日期 @zh-hans
sub property of: has related timespan of resource
inverse of: is date of resource of
definition: Bir kaynağı, bir kaynakla en erken ilişkilendirilen zaman aralığıyla ilişkilendirir. @tr
definition: Hozzákapcsol egy forrást egy legkorábbi időtartamhoz, ami egy forrással társítható. @hu
definition: Liittää aineiston varhaisimpaan aineistoon liittyvään ajankohtaan. @fi
definition: Relaterer en ressource til tidligste dato knyttet til en ressource. @da
definition: Relates a resource to a timespan that is the earliest associated with a resource.
definition: Setzt eine Ressource in Beziehung zu einem Zeitraum, der am frühesten mit einer Ressource in Verbindung steht. @de
definition: يربط بين مصدر ونطاق زمني يمثل أقرب تاريخ مرتبط بمصدر. @ar
definition: 将一种资源与和一种资源有关的最早的时间段关联起来。 @zh-hans

has equipment or system requirement
lexical alias: equipmentOrSystemRequirement.en
status: Published
type: Property
label: aineiston laitteisto- tai järjestelmävaatimukset @fi
label: ekipman veya sistem gereksinimi ile ilişkilidir @tr
label: eszköz- vagy rendszerkövetelménye a következő: @hu
label: har afspilningsudstyr eller systemkrav @da
label: hat Geräte- oder Systemanforderung @de
label: heeft apparatuur- of systeemeis @nl
label: له أجهزة أو متطلبات تشغيل @ar
label: 有设备或系统要求 @zh-hans
definition: Bir kaynağı, elektronik analog veya dijital bir kaynağın içeriğine erişim için gerekli bir sistem veya ekipmanla ilişkilendirir. @tr
definition: Hozzákapcsol egy forrást egy rendszerhez vagy eszközhöz, amely egy analóg vagy digitális forrás tartalmához való hozzáféréshez szükséges. @hu
definition: Liittää aineiston laitteisiin tai järjestelmiin, joita tarvitaan analogiseen tai digitaaliseen sisältöön pääsemiseksi. @fi
definition: Relaterer en ressource til udstyr eller system, der er påkrævet, for at en analog, digital etc. ressource kan anvendes, afspilles etc. @da
definition: Relates a resource to a system or equipment required for access to the content of an electronic analog or digital resource.
definition: Setzt eine Ressource in Beziehung zu einem Gerät oder einem System, das für die Verwendung, Wiedergabe und so weiter einer elektronisch-analogen oder digitalen Ressource erforderlich ist. @de
definition: يربط بين مصدر ونظام أو جهاز مطلوب للوصول إلى محتوى مصدر إلكتروني تناظري أو رقمي. @ar
definition: 将一种资源与存取一种电子模拟或数字资源内容所要求的系统或设备关联起来。 @zh-hans

has presentation format
lexical alias: presentationFormat.en
status: Published
type: Property
label: aineiston esitysformaatti @fi
label: har fremvisningsformat @da
label: hat Wiedergabeformat @de
label: heeft presentatieformaat @nl
label: prezentációs formátuma a következő: @hu
label: sunum formatı ile ilişkilidir @tr
label: له شكل عرض @ar
label: 有呈现格式 @zh-hans
sub property of: has projection characteristic of motion picture film
definition: Bir kaynağı, yansıtılan bir görüntünün üretiminde kullanılan formatla ilişkilendirir. @tr
definition: Hozzákapcsol egy forrást egy formátumhoz, amelyet egy kivetített kép előállításához használnak. @hu
definition: Liittää aineiston heijastettavan kuvan tuottamisessa käytettävään formaattiin. @fi
definition: Relaterer en ressource til et format, der er anvendt ved fremstillingen af et projiceret billede. @da
definition: Relates a resource to a format that is used in the production of a projected image.
definition: Setzt eine Ressource in Beziehung zu einem Format, das bei der Entstehung eines projizierten Bilds verwendet wird. @de
definition: يربط بين مصدر وصيغة مُستخدمة في إنتاج صورة مرئية. @ar
definition: 将一种资源与用于一个投影图像制作的格式关联起来。 @zh-hans

has fuller form of name
lexical alias: fullerFormOfName.en
status: Published
type: Property
label: har mere fuldstændig navneform @da
label: hat vollständigere Namensform @de
label: heeft meer volledige vorm van naam @nl
label: ismin tam hali ile ilişkilidir @tr
label: nimen täydellisempi muoto aineistossa @fi
label: teljesebb névformája a következő: @hu
label: له شكل كامل للاسم @ar
label: 有名称的完整形式 @zh-hans
inverse of: is fuller form of name of
definition: Bir kaynağı, tercih edilen ad olarak seçilen bir biçimde yalnızca bir baş harf veya kısaltma ile temsil edilen bir adın bir bölümünün tam haliyle veya tercih edilen ad olarak seçilen bir biçimde yer almayan adın bir bölümüyle ilişkilendirir. @tr
definition: Hozzákapcsol egy forrást egy név olyan részének teljes névformájához, amelyet csak egy kezdőbetű vagy rövidítés reprezentál az előnyben részesített névként választott formában, vagy a név egy olyan részéhez, amely nincs előnyben részesített névként választott formában. @hu
definition: Liittää aineiston alkukirjaimin, lyhenteellä tai muuten lyhennetyn tai muokatun nimen tai nimen osan täydellisempään muotoon. @fi
definition: Relaciona un recurs amb un nomen que és un nom d’agent que inclou la forma més completa d’un nom o d’una part d’un nom representat per una inicial, una abreviació o una forma escurçada o modificada altrament. @ca
definition: Relaterer en ressource til en mere fuldstændig navneform for en person, hvis navn i foretrukken form indeholder initialer, forkortelser eller andre varianter. @da
definition: Relates a resource to a nomen that is a name of agent that includes the fuller form of a name or part of a name represented by an initial, abbreviation, or shortened or otherwise modified form.
definition: Setzt eine Ressource in Beziehung zu einer vollständigen Form eines Namens, dessen bevorzugte Namensform nur durch eine Initiale oder eine Abkürzung dargestellt wird, oder zu einem Teil eines Namens, der nicht als bevorzugte Namensform gewählt wird. @de
definition: يربط بين مصدر وشكل كامل لجزء من الاسم يتم تمثيله فقط من خلال اسم أول أو اختصار في شكل يتم اختياره كاسم مفضل، أو جزء من اسم غير مضمن في شكل تم اختياره كاسم مفضل. @ar
definition: 将一种资源与一个作为行为者名称（包括名称的完整形式或由首字母缩写、缩略或缩短或其他修改形式的名称部分）的命名关联起来。 @zh-hans

has gender
lexical alias: gender.en
status: Published
type: Property
label: cinsiyet ile ilişkilidir @tr
label: har køn @da
label: hat Geschlecht @de
label: heeft gender @nl
label: neme a következő: @hu
label: sukupuoli @fi
label: له نوع جنس @ar
label: 有性别 @zh-hans
definition: Bir temsilciyi, temsilcinin tanımladığı bir cinsiyetle ilişkilendirir. @tr
definition: Hozzákapcsol egy ágenst egy nemhez, amellyel egy ágens azonosul. @hu
definition: Liittää toimijan sukupuoleen, johon toimija identifioituu. @fi
definition: Relaterer en ressource til et køn med hvilket en agent identificerer sig. @da
definition: Relates an agent to a gender with which an agent identifies.
definition: Setzt einen Akteur in Beziehung zu einem Geschlecht, mit dem sich ein Akteur identifiziert. @de
definition: يربط بين وكيل ونوع جنس يُعرف به وكيل. @ar
definition: 将一个行为者与一个行为者所识别的性别关联起来。 @zh-hans

has groove characteristic
has subproperty: has groove pitch
has subproperty: has groove width
lexical alias: grooveCharacteristic.en
status: Published
type: Property
label: barázdajellemzője a következő: @hu
label: har rillekarakteristika @da
label: hat Rilleneigenschaft @de
label: heeft groefkenmerken @nl
label: oluk özelliği ile ilişkilidir @tr
label: uran ominaisuudet aineistossa @fi
label: له خاصية مسار @ar
label: 有纹槽特征 @zh-hans
sub property of: has sound characteristic
definition: Bir kaynağı analog bir diskin oluk genişliği veya analog bir silindirin yiv aralığı ile ilişkilendirir. @tr
definition: Hozzákapcsol egy forrást egy analóg lemez vagy diszk barázdaszélességéhez, vagy egy analóg henger barázdamagasságához. @hu
definition: Liittää aineiston analogisen levyn uran leveyteen tai analogisen äänilieriön urajakoon. @fi
definition: Relaterer en ressource til rillebredde på en analog disc eller rilledybde på en analog cylinder. @da
definition: Relates a resource to a groove width of an analog disc or a groove pitch of an analog cylinder.
definition: Setzt eine Ressource in Beziehung zu einer Rillenbreite einer Schallplatte oder einem Rillenabstand eines Phonographenzylinders. @de
definition: يربط بين مصدر وعرض مسار لقرص تناظري أو مسار لاسطوانة تناظرية. @ar
definition: 将一种资源与模拟盘的纹槽宽度或模拟筒的纹槽间距关联起来。 @zh-hans

has numbering of sequence
has subproperty: has first alphanumeric designation of sequence
has subproperty: has last alphanumeric designation of sequence
has subproperty: has first chronological designation of sequence
has subproperty: has last chronological designation of sequence
has subproperty: has first chronological designation of alternative sequence
has subproperty: has last chronological designation of alternative sequence
has subproperty: has first alphanumeric designation of alternative sequence
has subproperty: has last alphanumeric designation of alternative sequence
lexical alias: numberingOfSequence.en
status: Published
type: Property
label: har nummerering af periodika @da
label: hat Zählung einer fortlaufenden Ressource @de
label: heeft nummering van volgorde @nl
label: numerointijakso aineistossa @fi
label: sorrendiségszámozása a következő: @hu
label: sıranın numaralandırılması ile ilişkilidir @tr
label: له ترقيم متسلسل @ar
label: 有序列的编号 @zh-hans
definition: Bir kaynağı, bir kaynağın ayrı parçalarının veya tekrarlamalarının dizisinin ilk ve son belirteçleriyle ilişkilendirir. @tr
definition: Hozzákapcsol egy forrást egy forrás egyes részeinek vagy iterációinak a sorrendjében az elsőt és az utolsót mutatót jelöléshez. @hu
definition: Liittää aineiston ensimmäiseen ja viimeiseen määritteseen, joilla ilmaistaan aineiston yksittäisten osien tai iteraatioiden peräkkäisyyttä. @fi
definition: Relaterer en ressource til en betegnelse for hvert nummer eller hver del af et periodikum. @da
definition: Relates a resource to the first and last designations of a sequence of the individual parts or iterations of a resource.
definition: Setzt eine Ressource in Beziehung zu der ersten und letzten Bezeichnung der einzelnen Ausgaben einer fortlaufenden Ressource. @de
definition: يربط بين مصدر وأول وآخر تسمية لتسلسل خاص بأجزاء منفردة أو أجزاء أو أعداد لمصدر. @ar
definition: 将一种资源与一种资源的个别部分或更新后整体的序列中第一个和最后一个的标识关联起来。 @zh-hans
scope note: Nummerering af omfatter et tal, et bogstav, ethvert andet tegn eller en kombination af disse med eller uden tilhørende tekst og/eller en kronologisk betegnelse. @da

has ISSN
lexical alias: issn.en
status: Published
type: Property
label: ISSN ile ilişkilidir @tr
label: ISSN-je a következő: @hu
label: aineiston ISSN @fi
label: har ISSN for serie @da
label: hat ISSN einer Reihe @de
label: heeft ISSN @nl
label: له ترقيم دولي موحد للدوريات @ar
label: 有国际标准连续出版物号 @zh-hans
inverse of: is ISSN of
definition: Bir kaynağı, ISSN kayıt kurumu tarafından bir diziye atanan bir tanımlayıcı ile ilişkilendirir. @tr
definition: Hozzákapcsol egy forrást egy azonosítóhoz, amelyet egy ISSN regisztrációs ügynökség rendelt hozzá egy sorozathoz. @hu
definition: Liittää aineiston ISSN-rekisteröintitoimistoon myöntämään sarjan tunnisteeseen. @fi
definition: Relaterer en ressource til en unik identifikator givet til en serie af en ISSN-registreringsinstitution. @da
definition: Relates a resource to an identifier that is assigned to a series by an ISSN registration agency.
definition: Setzt eine Ressource in Beziehung zu einem Identifikator, der einer Reihe von einem ISSN-Zentrum zugewiesen wird. @de
definition: يربط بين مصدر ومعرف خُصص لسلسلة من قبل وكالة تسجيل الترقيم الدولي الموحد للدوريات @ar
definition: 将一种资源与一个国际标准连续出版物号注册机构分配给一种丛编的一个标识符关联起来。 @zh-hans

has ISSN of subseries (Deprecated)
lexical alias: issnOfSubseries.en
status: Deprecated
type: Property
label: har ISSN for underserie @da
definition: Relaterer en ressource til en unik identifikator givet til en underserie af en ISSN-registreringsinstitution. @da
definition: Relates a resource to an identifier assigned to a subseries by an ISSN registration agency. (Deprecated)

has medium of performance (Deprecated)
lexical alias: mediumOfPerformance.en
status: Deprecated
type: Property
label: har originalbesætning @da
definition: Relaterer en ressource til et instrument, en sangstemme og/eller en ensemble som en musikressource oprindeligt blev udtænkt til. @da
definition: Relates a resource to an instrument, voice, or ensemble for which a musical resource was originally conceived. (Deprecated)

has medium of performance of musical content
lexical alias: mediumOfPerformanceOfMusicalContent.en
status: Published
type: Property
label: har besætning @da
label: hat Besetzung für musikalischen Inhalt @de
label: heeft uitvoeringsmedium van muzikale content @nl
label: musiikkisisällön esityskokoonpano aineistossa @fi
label: müzikal içeriğin performans ortamı ile ilişkilidir @tr
label: zenei tartalom előadásmédiuma a következő: @hu
label: له وسيط أداء لمحتوى موسيقي @ar
label: 有音乐内容的表演媒介 @zh-hans
definition: Bir kaynağı bir enstrüman, ses veya grupla ve bir kaynağın müzikal içeriğini çalmak için kullanılan veya kullanılması amaçlanan parçaların, sanatçıların ve ellerin sayısı ile ilişkilendirir. @tr
definition: Hozzákapcsol egy forrást egy hangszerhez, hanghoz vagy együtteshez, illetve egy forrás zenei tartalmának előadásához használt, vagy használni kívánt szólamok, előadók és kezek számához . @hu
definition: Liittää aineiston musiikkiesityksessä käytettävään tai käytettäväksi aiottuun soittimeen, lauluääneen tai esittäjäryhmään ja osien, esiintyjien ja käsien lukumäärään. @fi
definition: Relaterer en ressource til et instrument, en stemme og eller ensemble anvendt, eller påtænkt anvendt, til opførelse af musikindhold. @da
definition: Relates a resource to an instrument, voice, or ensemble and the number of parts, performers and hands used, or intended to be used, to perform the musical content of a resource.
definition: Setzt eine Ressource in Beziehung zu einem Instrument, einer Singstimme oder einem Ensemble und der Anzahl der Stimmen, der Ausführenden und Hände, das/die zur Darbietung eines musikalischen Inhalts einer Ressource verwendet wird/werden oder verwendet werden soll/sollen. @de
definition: يربط بين مصدرً وآلة، صوت، أو مجموعة وعدد من أجزاء، فنانين وعاملين مُستخدمين أو يُعتزم استخدامهم لأداء المحتوى الموسيقي لمصدر ما. @ar
definition: 将一种资源与一种资源的音乐内容之表演所用或构想所用的乐器、人声或组合以及声部、表演者和手的数量关联起来。 @zh-hans

has frequency
lexical alias: frequency.en
status: Published
type: Property
label: aineiston ilmestymistiheys @fi
label: gyakorisága a következő: @hu
label: har frekvens @da
label: hat Erscheinungsfrequenz @de
label: heeft frequentie @nl
label: yayın sıklığı ile ilişkilidir @tr
label: له تتابع الصدور @ar
label: 有频率 @zh-hans
definition: Bir kaynağı, artzamanlı bir kaynağın bir sayısının veya kısmının yayımlandığı bir aralıkla ilişkilendirir. @tr
definition: Hozzákapcsol egy forrást egy időközhöz, amelyben egy diakronikus forrás egy számát vagy részét közreadják. @hu
definition: Liittää aineiston diakronisen teoksen osien, numeroiden tai iteraatioiden ilmestymistiheyteen. @fi
definition: Relaterer en ressource til et interval, ved hvilke en series numre eller dele udgives eller det interval der er mellem opdateringer af en integrerende ressource. @da
definition: Relates a resource to an interval at which an issue or part of a diachronic resource is issued.
definition: Setzt eine Ressource in Beziehung zu einem Intervall, in dem die Ausgaben oder Teile einer diachronen Ressource erscheinen. @de
definition: يربط بين مصدر وفترة زمنية يتم فيها صدور عدد أو جزء من مصدر ممتد زمنيًا. @ar
definition: 将一种资源与一种历时资源的期或部分的发行的时间间隔关联起来。 @zh-hans

has dimensions
has subproperty: has dimensions of cartographic image
has subproperty: has dimensions of still image
lexical alias: dimensions.en
status: Published
type: Property
label: aineiston koko @fi
label: boyutlar ile ilişkilidir @tr
label: har størrelse @da
label: hat Maße @de
label: heeft afmetingen @nl
label: mérete a következő: @hu
label: له أبعاد @ar
label: 有尺寸 @zh-hans
definition: Bir kaynağı, bir taşıyıcının veya kaynak deposunun ölçümüyle ilişkilendirir. @tr
definition: Hozzákapcsol egy forrást egy forrás hordozójának vagy tárolójának méretéhez. @hu
definition: Liittää aineiston tallenteen tai säilytyskotelon mittoihin. @fi
definition: Relaterer en ressource til et mål for en ressources bærer eller dens opbevaringsudstyr. @da
definition: Relates a resource to a measurement of a carrier or a container of a resource.
definition: Setzt eine Ressource in Beziehung zu einer Abmessung eines Datenträgers oder eines Behältnisses einer Ressource. @de
definition: يربط بين مصدر ومقاييس حامل أو حاوية خاصة بمصدر. @ar
definition: 将一种资源与一种资源的载体或容器的测量值关联起来。 @zh-hans

has dimensions of cartographic image
lexical alias: dimensionsOfCartographicImage.en
status: Published
type: Property
label: har størrelse på kort etc. - kartografi @da
label: hat Maße eines kartografischen Bilds @de
label: heeft afmetingen van cartografisch beeld @nl
label: kartografik görüntü boyutları ile ilişkilidir @tr
label: kartografisen kuvan koko aineistossa @fi
label: kartográfiai kép mérete a következő: @hu
label: له أبعاد لصور خرائطية @ar
label: 有地图图像的尺寸 @zh-hans
sub property of: has dimensions
definition: Bir kaynağı haritanın bir yüzünün ölçümü vb. ile ilişkilendirir. @tr
definition: Hozzákapcsol egy forrást egy térképtükör, stb. méretéhez. @hu
definition: Liittää aineiston kartan tai muun vastaavan aineiston kuvapuolen mittoihin. @fi
definition: Relaterer en ressource til et mål for en billedside af et kort etc. @da
definition: Relates a resource to a measurement of a face of a map or cartographic diagram, view, profile, or section.
definition: Setzt eine Ressource in Beziehung zu einer Abmessung eines Kartenfelds und so weiter. @de
definition: يربط بين مصدر ومقاييس الوجه الخاص بخريطة، إلخ. @ar
definition: 将一种资源与地图的一面或地图线图、透视图或截面图的测量值关联起来。 @zh-hans

has dimensions of still image
lexical alias: dimensionsOfStillImage.en
status: Published
type: Property
label: durağan görüntü boyutları ile ilişkilidir @tr
label: har størrelse på fast billede @da
label: hat Maße eines unbewegten Bilds @de
label: heeft afmetingen van stilstaand beeld @nl
label: stillkuvan koko aineistossa @fi
label: állókép mérete a következő: @hu
label: له أبعاد الصورة الثابتة @ar
label: 有静态图像的尺寸 @zh-hans
sub property of: has dimensions
definition: Bir kaynağı, hareketsiz bir görüntünün resimsel alanının ölçümüyle ilişkilendirir. @tr
definition: Hozzákapcsol egy forrást egy állókép képterületének a méretéhez. @hu
definition: Liittää aineiston stillkuvan kuva-alueen mittoihin. @fi
definition: Relaterer en ressource til et mål for et fast billedes billedområde. @da
definition: Relates a resource to a measurement of the pictorial area of a still image.
definition: Setzt eine Ressource in Beziehung zu einer Abmessung der Bildfläche eines unbewegten Bilds. @de
definition: يربط بين مصدر ومقاييس المساحة المصورة في صورة ثابتة. @ar
definition: 将一种资源与一个静态图像的图画区域的测量值关联起来。 @zh-hans

has projection of cartographic content
lexical alias: projectionOfCartographicContent.en
status: Published
type: Property
label: har projektion af kartografisk indhold @da
label: hat Projektion von kartografischem Inhalt @de
label: heeft projectie van cartografische content @nl
label: kartografik içeriğin projeksiyonu ile ilişkilidir @tr
label: karttasisällön projektio aineistossa @fi
label: térképészeti tartalom vetülete a következő: @hu
label: له إسقاط محتوى رسم خرائطي @ar
label: 有地图内容的投影 @zh-hans
definition: Bir kaynağı, dünyanın veya bir gök küresinin yüzeyini bir düzlem üzerinde temsil etmek için kullanılan bir yöntem veya sistemle ilişkilendirir. @tr
definition: Hozzákapcsol egy forrást egy olyan módszerhez vagy rendszerhez, amelyet a Föld vagy egy égitest felszínének síkbeli ábrázolására használnak. @hu
definition: Liittää aineiston maapallon tai taivaanpallon pinnan kaksiulotteiseen esittämiseen käytettyyn menetelmään tai järjestelmään. @fi
definition: Relaterer en ressource til en metode eller system anvendt til at repræsentere jordens overflade eller overfladen på et himmellegeme på et kort. @da
definition: Relates a resource to a method or system used to represent the surface of the earth or of a celestial sphere on a plane.
definition: Setzt eine Ressource in Beziehung zu einer Methode oder einem System, die/das angewendet wird, um die Oberfläche der Erde oder einer Himmelskugel auf einer Ebene zu repräsentieren. @de
definition: يربط بين مصدر وطريقة أو نظام مستخدم لتمثيل سطح الأرض أو الكرة السماوية على مسطح. @ar
definition: 将一种资源与用于在一个平面上表示地球或天球表面的方法或系统关联起来。 @zh-hans

has type of recording
lexical alias: typeOfRecording.en
status: Published
type: Property
label: felvételtípusa a következő: @hu
label: har indspillingskarakteristika @da
label: hat Art einer Aufnahme @de
label: heeft opname type @nl
label: kayıt türü ile ilişkilidir @tr
label: äänen tallennustapa aineistossa @fi
label: له نوع تسجيل @ar
label: 有录音的类型 @zh-hans
sub property of: has sound characteristic
definition: Bir kaynağı, oynatma için ses içeriğini kodlamak için kullanılan yöntemle ilişkilendirir. @tr
definition: Hozzákapcsol egy forrást egy módszerhez, amelyet audiótartalom kódolásához használnak visszajátszás céljára. @hu
definition: Liittää aineiston menetelmään, jota on käytetty äänen tallentamiseksi äänentoistoa varten. @fi
definition: Relaterer en ressource til en metode, der er anvendt til at kode lydindhold til afspilning. @da
definition: Relates a resource to a method used to encode audio content for playback.
definition: Setzt eine Ressource in Beziehung zu einem Verfahren, das zur Kodierung von Audio-Inhalt für die Wiedergabe verwendet wird. @de
definition: يربط بين مصدر وطريقة مستخدمة في تشفير محتوى صوتي مطلوب للتشغيل. @ar
definition: 将一种资源与用于编码供回放的音频内容的方法关联起来。 @zh-hans

has name of distributor
lexical alias: nameOfDistributor.en
status: Published
type: Property
label: aineiston jakelijan nimi @fi
label: dağıtımcının adı ile ilişkilidir @tr
label: har distributørnavn @da
label: hat Vertriebsnamen @de
label: heeft naam van distributeur @nl
label: terjesztő neve a következő: @hu
label: له اسم موزع @ar
label: 有发行者名称 @zh-hans
sub property of: has appellation of entity
inverse of: is name of distributor of
definition: Bir kaynağı, yayımlanmış bir kaynağın dağıtımından sorumlu olan bir temsilcinin adıyla ilişkilendirir. @tr
definition: Hozzákapcsol egy forrást egy ágens nevéhez, amely felelős egy kiadott forrás terjesztéséért. @hu
definition: Liittää aineiston julkaistun aineiston jakelusta vastaavan toimijan nimeen. @fi
definition: Relaciona un recurs amb un nomen que és un nom d’un agent que és responsable de la distribució d’un recurs publicat. @ca
definition: Relaterer en ressource til et navn på agent, der er ansvarlig for distribution af en ressource i publiceret form. @da
definition: Relates a resource to a nomen that is a name of an agent who is responsible for distributing a published resource.
definition: Setzt eine Ressource in Beziehung zum Namen eines Akteurs, der für den Vertrieb einer veröffentlichten Ressource verantwortlich ist. @de
definition: يربط بين مصدر واسم وكيل مسؤول عن توزيع مصدر منشور. @ar
definition: 将一种资源与作为负责一种出版资源的发行的一个行为者的名称的一个命名关联起来。 @zh-hans

has name of producer
lexical alias: nameOfProducer.en
status: Published
type: Property
label: aineiston tuottajan nimi @fi
label: előállító neve a következő: @hu
label: har producers navn @da
label: hat Erzeugername @de
label: heeft naam van producent @nl
label: yapımcının adı ile ilişkilidir @tr
label: له اسم منتج @ar
label: 有制作者名称 @zh-hans
sub property of: has appellation of entity
inverse of: is name of producer of
definition: Bir kaynağı, yayınlanmamış bir kaynağın yazılmasından, üretilmesinden, oluşturulmasından veya başka bir yöntemle elde edilmesinden sorumlu olan temsilcinin adı olan isimle ilişkilendirir. @tr
definition: Hozzákapcsol egy forrást egy nomenhez, amely egy kiadatlan forrás írásáért, összeállításáért, készítéséért vagy egyéb módú előállításáért felelős ágens neve. @hu
definition: Liittää aineiston nomeniin, joka on julkaisemattoman aineiston kaiverruksesta, valmistuksesta, kokoonpanosta tai muusta tuotantotavasta vastaavan toimijan nimi. @fi
definition: Relaterer en ressource til et navn på agent, der er ansvarlig for indgravering, fremstilling, konstruktion etc. af ressource i upubliceret form. @da
definition: Relates a resource to a nomen that is a name of an agent who is responsible for inscribing, fabricating, constructing, or other method of producing an unpublished resource.
definition: Setzt eine Ressource in Beziehung zum Namen eines Akteurs, der für das Gravieren, Fabrizieren, Konstruieren oder eine andere Entstehungsmethode einer unveröffentlichten Ressource verantwortlich ist. @de
definition: يربط بين مصدر وتسمية وهي اسم وكيل مسؤول عن تسجيل، تصنيع، إنشاء، أو بأي طريقة أخرى من طرق الإنتاج، مصدر غير منشور. @ar
definition: 将一种资源与作为负责镌刻、制造、构建或其他方法制作一种非出版资源的一个行为者之名称的一个命名关联起来。 @zh-hans

has name of manufacturer
lexical alias: nameOfManufacturer.en
status: Published
type: Property
label: aineiston valmistajan nimi @fi
label: gyártó neve a következő: @hu
label: har producentnavn @da
label: hat Herstellername @de
label: heeft naam van vervaardiger @nl
label: üreticinin adı ile ilişkilidir @tr
label: له اسم صانع @ar
label: 有生产者名称 @zh-hans
sub property of: has appellation of entity
inverse of: is name of manufacturer of
definition: Bir kaynağı, yayınlanmış bir kaynağın basılması, çoğaltılması, dökümü veya başka bir yöntemle üretilmesinden sorumlu olan bir temsilcinin adı olan isimle ilişkilendirir. @tr
definition: Hozzákapcsol egy forrást egy nomenhez, amely egy kiadott forrás nyomtatásáért, sokszorosításáért, öntéséért vagy egyéb gyártási módszeréért felelős ágens neve. @hu
definition: Liittää aineiston nomeniin, joka on julkaistun aineiston painamisesta, monistamisesta, kirjasinten valamisesta tai muusta valmistustavasta vastaavan toimijan nimi. @fi
definition: Relaterer en ressource til et navn på agent, der er ansvarlig for trykning, duplikering, støbning etc. af en ressource i publiceret form. @da
definition: Relates a resource to a nomen that is a name of an agent who is responsible for printing, duplicating, casting, or other method of manufacturing a published resource.
definition: Setzt eine Ressource in Beziehung zum Namen eines Akteurs, der für den Druck, die Vervielfältigung, den Guss oder eine andere Herstellungsmethode einer veröffentlichten Ressource verantwortlich ist. @de
definition: يربط بين مصدر وتسمية وهي اسم وكيل مسؤول عن طبع، نسخ، طَرَح، أو مرتبط بأي طريقة أخرى بتصنيع مصدر منشور. @ar
definition: 将一种资源与作为负责印刷、复制、铸造或其他方法生产一种出版资源的一个行为者之名称的一个命名关联起来。 @zh-hans

has name of publisher
lexical alias: nameOfPublisher.en
status: Published
type: Property
label: aineiston kustantajan nimi @fi
label: har udgivers navn @da
label: hat Verlagsnamen @de
label: heeft naam van uitgever @nl
label: kiadói neve a következő: @hu
label: yayıncının adı ile ilişkilidir @tr
label: له اسم ناشر @ar
label: 有出版者名称 @zh-hans
sub property of: has appellation of entity
inverse of: is name of publisher of
definition: Bir kaynağı, yayınlanan bir kaynağı yayınlamaktan, piyasaya sürmekten veya basmaktan sorumlu olan aracının adıyla ilişkilendirir. @tr
definition: Hozzákapcsol egy forrást egy ágens nevéhez, amely felelős egy publikált forrás kiadásáért, kibocsájtásáért vagy megjelentetéséért. @hu
definition: Liittää aineiston julkaistun aineiston kustantamisesta tai julkistamisesta vastaavaan toimijaan. @fi
definition: Relaciona un recurs amb un nomen que és un nom d’un agent que és responsable de la publicació, la posada en circulació o l’emissió d’un recurs publicat. @ca
definition: Relaterer en ressource til et navn på en agent, der er ansvarlig for at publicere, offentliggøre eller udgive en ressource. @da
definition: Relates a resource to a nomen that is a name of an agent who is responsible for publishing, releasing, or issuing a published resource.
definition: Setzt eine Ressource in Beziehung zu einem Namen eines Akteurs, der für das Veröffentlichen, die Freigabe oder die Herausgabe einer Ressource verantwortlich ist. @de
definition: يربط بين مصدر واسم وكيل مسؤول عن نشر، تحرير، أو إصدار مصدر منشور. @ar
definition: 将一种资源与作为负责出版、发布、发行一种出版资源的一个行为者之名称的一个命名关联起来。 @zh-hans

has preferred name of place
lexical alias: preferredNameOfPlace.en
status: Published
type: Property
label: előnyben részesített helyneve a következő: @hu
label: har foretrukken navneform for et sted @da
label: hat bevorzugten Namen eines Geografikums @de
label: heeft geprefereerde naam van plaats @nl
label: paikan ensisijainen nimi @fi
label: tercih edilen yer adı ile ilişkilidir @tr
label: له اسم مُفضل لمكان @ar
label: 有地点的首选名称 @zh-hans
sub property of: has name of place
inverse of: is preferred name of place of
definition: Bir yeri, belirli bir uygulama veya içerikte tercih edilmek üzere seçilen yer adıyla ilişkilendirir. @tr
definition: Hozzákapcsol egy helyet egy helynévhez, amelyet egy adott alkalmazásban vagy összefüggésben előnyben részesítenek. @hu
definition: Liittää paikan nimeen, joka on valittu ensisijaiseksi tietyssä sovelluksessa tai kontekstissa. @fi
definition: Relaciona un lloc amb un nomen que és un nom de lloc que se selecciona com a preferent en una aplicació o un context específic. @ca
definition: Relaterer en ressource til et navn eller en navneform, der er valgt til identifikation af et sted. @da
definition: Relates a place to a nomen that is a name of place that is selected for preference in a specific application or context.
definition: Setzt ein Geografikum in Beziehung zu einem Namen eines Geografikums, der in einer bestimmten Anwendung oder in einem bestimmten Kontext als Vorzugsform bestimmt wird. @de
definition: يربط بين مكان واسم مكان اُختير كاسم مُفضل في تطبيق محدد أو سياق محدد. @ar
definition: 将一个地点与作为在一个特定的应用或语境中被首选的一个地点名称的一个命名关联起来。 @zh-hans

has preferred name of agent
lexical alias: preferredNameOfAgent.en
status: Published
type: Property
label: har foretrukken navneform for agent @da
label: hat bevorzugten Namen eines Akteurs @de
label: heeft geprefereerde naam van actor @nl
label: tercih edilen temsilci adı ile ilişkilidir @tr
label: toimijan ensisijainen nimi @fi
label: ágens előnyben részesített névalakja a következő: @hu
label: له اسم مُفضل لوكيل @ar
label: 有行为者的首选名称 @zh-hans
sub property of: has name of agent
inverse of: is preferred name of agent of
definition: Bir temsilciyi, belirli bir uygulama veya bağlamda tercih için seçilen temsilci ismiyle ilişkilendirir. @tr
definition: Hozzákapcsol egy ágenst egy ágensnévhez, amelyet egy adott alkalmazásban vagy összefüggésben előnyben részesítenek. @hu
definition: Liittää toimijan nimeen, joka on valittu toimijan ensisijaiseksi nimeksi tietyssä sovelluksessa tai kontekstissa. @fi
definition: Relaciona un agent amb un nomen que és un nom d’agent que se selecciona com a preferent en una aplicació o un context específic. @ca
definition: Relaterer en ressource til et navn eller en navneform, der er valgt til identifikation af en person. @da
definition: Relates an agent to a nomen that is a name of agent that is selected for preference in a specific application or context.
definition: Setzt einen Akteur in Beziehung zu einem Namen eines Akteurs, der in einer bestimmten Anwendung oder in einem bestimmten Kontext als Vorzugsform bestimmt wird. @de
definition: يربط بين وكيل واسم وكيل ااُختير كاسم مُفضل في تطبيق محدد أو سياق محدد. @ar
definition: 将一个行为者与作为一个行为者的名称并在一个特定的应用或语境中被首选的一个命名关联起来。 @zh-hans

has extent
lexical alias: extent.en
status: Published
type: Property
label: aineiston laajuus @fi
label: har omfang @da
label: hat Umfang @de
label: heeft omvang @nl
label: kapsam ile ilişkilidir @tr
label: terjedelme a következő: @hu
label: له امتداد @ar
label: 有数量 @zh-hans
definition: Bir kaynağı, kaynağın kapsamının bir yönünü ölçen bir tür, sayı ve ölçüm birimi ile ilişkilendirir. @tr
definition: Hozzákapcsol egy forrást egy típushoz, számhoz és mértékegységhez, amely a forrás terjedelmének számszerű aspektusa. @hu
definition: Liittää aineiston tyyppiin, lukuun ja mittayksikköön, jotka ilmaisevat aineiston laajuutta. @fi
definition: Relaterer en ressource til antal og type af enheder og/eller underenheder, der udgør en ressource. @da
definition: Relates a resource to a type, number, and measurement unit that quantify an aspect of the extent of a resource.
definition: Setzt eine Ressource in Beziehung zu einer Art, Nummer und Maßeinheit, die eine Eigenschaft des Umfangs einer Ressource beziffert. @de
definition: يربط بين مصدر ونوع، رقم، ووحدة القياس التي تحدد جانبًا من مدى مصدر. @ar
definition: 将一种资源与把一种资源的一个数量方面定量化的一个类型、数字和计量单位关联起来。 @zh-hans

has file size
lexical alias: fileSize.en
status: Published
type: Property
label: aineiston tiedoston koko @fi
label: dosya boyutu ile ilişkilidir @tr
label: fájlmérete a következő: @hu
label: har filstørrelse @da
label: hat Dateigröße @de
label: heeft bestandsgrootte @nl
label: له حجم ملف @ar
label: 有文件大小 @zh-hans
sub property of: has digital file characteristic
definition: Bir kaynağı, dijital bir doyadaki bit sayılarıyla ilişkilendirir. @tr
definition: Hozzákapcsol egy forrást egy digitális fájl bájtjainak számához. @hu
definition: Liittää aineiston digitaalisen tiedoston tavumäärään. @fi
definition: Relaterer en ressource til antal bytes i en digital fil. @da
definition: Relates a resource to a number of bytes in a digital file.
definition: Setzt eine Ressource in Beziehung zu einer Anzahl der Bytes in einer Datei. @de
definition: يربط بين مصدر وعدد البايتات في ملف رقمي. @ar
definition: 将一种资源与一个数字文件中的字节数关联起来。 @zh-hans

has configuration of playback channels
lexical alias: configurationOfPlaybackChannels.en
status: Published
type: Property
label: har konfiguration af afspilningskanaler @da
label: hat Konfiguration von Wiedergabekanälen @de
label: heeft configuratie van afspeelkanalen @nl
label: oynatma kanallarının konfigürasyonu ile ilişkilidir @tr
label: toistokanavien määrä aineistossa @fi
label: visszajátszási csatornák konfigurációja a következő: @hu
label: له إعدادات قنوات التشغيل @ar
label: 有回放声道的配置 @zh-hans
sub property of: has sound characteristic
definition: Bir kaynağı, kayıt yapmak için kullanılan bir dizi ses kanalıyla ilişkilendirir. @tr
definition: Hozzákapcsol egy forrást a hangcsatornák számához, amelyeket lemezfelvétel készítésekor használnak. @hu
definition: Liittää aineiston äänityksessä käytettyjen äänikanavien määrään. @fi
definition: Relaterer en ressource til et antal lydkanaler, der blev anvendt til at lave en indspilning. @da
definition: Relates a resource to a number of sound channels used to make a recording.
definition: Setzt eine Ressource in Beziehung zu einer Anzahl von Tonkanälen, die für die Wiedergabe einer Aufnahme verwendet werden. @de
definition: يربط بين مصدر ورقم قنوات الصوت المستخدمة في تسجيل. @ar
definition: 将一种资源与用于制作一个录音制品的声道数关联起来。 @zh-hans

has tape configuration
lexical alias: tapeConfiguration.en
status: Published
type: Property
label: bant yapılandırması ile ilişkilidir @tr
label: felvevőszalag konfigurációja a következő: @hu
label: har båndkonfiguration @da
label: hat Bandkonfiguration @de
label: heeft bandconfiguratie @nl
label: ääninauhan raitojen määrä aineistossa @fi
label: له بنية شريط @ar
label: 有磁带配置 @zh-hans
sub property of: has sound characteristic
definition: Bir kaynağı bir ses kasetindeki bir dizi parça ile ilişkilendirir. @tr
definition: Hozzákapcsol egy forrást a sávok számához egy audiószalagon. @hu
definition: Liittää aineiston ääninauhalla olevien ääniraitojen lukumäärään. @fi
definition: Relaterer en ressource til et antal spor på et lydbånd. @da
definition: Relates a resource to a number of tracks on an audiotape.
definition: Setzt eine Ressource in Beziehung zu einer Anzahl der Spuren auf einem Tonband. @de
definition: يربط بين مصدر وعدد المسارات على شريط صوت. @ar
definition: 将一种资源与录音磁带上的音轨数关联起来。 @zh-hans

has mount
lexical alias: mount.en
status: Published
type: Property
label: aineiston tukimateriaali @fi
label: foglalata a következő: @hu
label: har montage / ramme @da
label: hat Halterung @de
label: heeft ondersteuning @nl
label: montaj malzemesi ile ilişkilidir @tr
label: له حامل @ar
label: 有衬底/底座 @zh-hans
definition: Bir kaynağı, bir kaynağın temel malzemesinin bağlı olduğu destek veya taşımak için kullanılan fiziksel bir malzeme ile ilişkilendirir. @tr
definition: Hozzákapcsol egy forrást egy fizikai anyaghoz, amelyet tartóként vagy támaszként használnak, amelyhez egy forrás alapanyagát csatolták. @hu
definition: Liittää aineiston materiaaliin, johon aineiston pohjamateriaali kiinnitetään aineiston tukemiseksi tai kannattamiseksi. @fi
definition: Relaterer en ressource til et fysisk materiale, der udgør den støtte eller bagbeklædning, som en ressources basismateriale er fastgjort på. @da
definition: Relates a resource to a physical material used for the support or backing to which the base material of a resource is attached.
definition: Setzt eine Ressource in Beziehung zu einem physischen Material, das für die Halterung oder die Stütze verwendet wird, an dem das Trägermaterial einer Ressource angebracht ist. @de
definition: يربط بين مصدر ومادة مادية تُستخدم في التدعيم أو السند لمادة القاعدة التي يكون المصدر ملصق بها. @ar
definition: 将一种资源与用于支撑或背衬的资源的基底材料所附着的物理材料关联起来。 @zh-hans

has capture information
lexical alias: captureInformation.en
status: Published
type: Property
label: har sted, år eller dato for optagelse @da
label: hat Information zur Aufzeichnung @de
label: heeft vastleginformatie @nl
label: kaydetme bilgisi ile ilişkilidir @tr
label: rögzítési információja a következő: @hu
label: tallennusinformaatio aineistosta @fi
label: له معلومات مُلتقطة @ar
label: 有摄录信息 @zh-hans
definition: Bir kaynağı, bir yer, tarih veya bir kaydın içeriğinin kaydedilmesi, filme alınması vb. ile bağlantılı olan diğer bilgilerle ilişkilendirir. @tr
definition: Hozzákapcsol egy forrást egy helyhez, időhöz vagy egyéb információhoz, amelyet egy forrás tartalmának rögzítéséhez, filmezéséhez, stb. társítanak. @hu
definition: Liittää aineiston paikkaan, päivämäärään tai muuhun informaatioon, joka liittyy aineiston sisällön äänittämiseen, filmaamiseen tms. @fi
definition: Relaciona un recurs amb un lloc, data o altra informació que s’associa amb l’enregistrament, la filmació o un altre mètode per obtenir el contingut d’un recurs. @ca
definition: Relaterer en ressource til et sted og år eller dato, hvor et udtryks indhold blev optaget, indspillet etc. @da
definition: Relates a resource to a place, date, or other information that is associated with the recording, filming, or other method of obtaining the content of a resource.
definition: Setzt eine Ressource in Beziehung zu einem Geografikum, einem Datum oder anderen Informationen, das/die mit der Aufnahme, dem Filmen und so weiter des Inhalts einer Ressource in Verbindung steht/stehen. @de
definition: يربط بين مصدر ومكان، تاريخ، أو أية معلومات أخرى مرتبطة بتسجيل، تصوير، إلخ.، محتوى مصدر. @ar
definition: 将一种资源与和一种资源的内容的录制、拍摄或其他获取方法有关的地点、日期或其他信息关联起来。 @zh-hans

has place of capture
lexical alias: placeOfCapture.en
status: Published
type: Property
label: aineiston tallennuspaikka @fi
label: har optagelsessted @da
label: heeft plaats van vastleggen @nl
label: ist Aufzeichnungsort @de
label: kayıt yeri ile ilişkilidir @tr
label: rögzítés helye a következő: @hu
label: له مكان التقاط @ar
label: 有摄录地点 @zh-hans
sub property of: has related place of resource
inverse of: is place of capture of
definition: Bir kaynağı, bir kaynağın içeriğinin kaydedilmesi, filme alınması vb. ile bağlantılı bir yerle ilişkilendirir. @tr
definition: Hozzákapcsol egy forrást egy helyhez, amely egy forrás tartalmának rögzítéséhez, filmezéséhez, stb. kapcsolódik. @hu
definition: Liittää aineiston paikkaan, joka liitty aineiston sisällön äänittämiseen, filmaamiseen tms. @fi
definition: Relaterer en ressource til et sted, hvor et udtryks indhold, optagelse, indspilning etc., blev optaget. @da
definition: Relates a resource to a place associated with recording, filming, etc., the content of a resource.
definition: Setzt eine Ressource in Beziehung zu einem Geografikum, das mit der Aufnahme, dem Filmen und so weiter des Inhalts einer Ressource in Verbindung steht. @de
definition: يربط بين مصدر ومكان مرتبط بتسجيل، تصوير، إلخ.، محتوى مصدر. @ar
definition: 将一种资源与和一种资源的内容的录制、拍摄等有关的一个地点关联起来。 @zh-hans

has duration
lexical alias: duration.en
status: Published
type: Property
label: aineiston kesto @fi
label: har spilletid @da
label: hat Dauer @de
label: heeft tijdsduur @nl
label: időtartama a következő: @hu
label: süre ile ilişkilidir @tr
label: له مُدة @ar
label: 有持续时间 @zh-hans
inverse of: is duration of (Deprecated)
definition: Bir kaynağı, oynama süresi, performans süresi, çalışma süresi veya başka bir süre uzunluğu olan kaynak kapsamı ile ilişkilendirir. @tr
definition: Hozzákapcsol egy forrást egy forrás terjedelméhez, amely játékidő, előadás ideje, futási idő vagy egyéb időtartomány. @hu
definition: Liittää aineiston aineiston laajuuteen, joka on soittoaika, esitysaika, toistoaika tai muu ajan pituus. @fi
definition: Relaterer en ressource til varighed, spilletid, opførelsestid, etc. for en ressources indhold. @da
definition: Relates a resource to an extent of resource that is a playing time, performance time, running time, or other length of time.
definition: Setzt eine Ressource in Beziehung zum Umfang einer Ressource, bei dem es sich um eine Wiedergabezeit, eine Aufführungszeit, eine Laufzeit oder eine andere Zeitspanne handelt. @de
definition: يربط بين مصدر ومدى مصدر يمثل وقت التشغيل، وقت الأداء، مدة العرض، أو فترة زمنية أخرى. @ar
definition: 将一种资源与作为播放时间、表演时间、运行时间或其他时间长度的资源的数量关联起来。 @zh-hans

has colour content
lexical alias: colourContent.en
status: Published
type: Property
label: aineiston värisisältö @fi
label: har farveindhold @da
label: hat Farbinhalt @de
label: heeft kleurcontent @nl
label: renk içeriği ile ilişkilidir @tr
label: színtartalma a következő: @hu
label: له محتوى ملون @ar
label: 有颜色内容 @zh-hans
definition: Bir kaynağı, bir kaynaktaki renk veya tonun varlığına ilişkin bir gösterge ile ilişkilendirir. @tr
definition: Hozzákapcsol egy forrást egy forrásban megtestesülő, a hang színét vagy színárnyalatát mutató jelöléshez. @hu
definition: Liittää aineiston aineistoon sisältyvän värin tai sävyn ilmaukseen. @fi
definition: Relaterer en ressource til en tilstedeværelse af farve, nuance etc. i en ressources indhold. @da
definition: Relates a resource to an indication of the presence of colour or tone in a resource.
definition: Setzt eine Ressource in Beziehung zu einer Angabe über das Vorhandensein von Farbe oder Tönung in einer Ressource. @de
definition: يربط بين مصدر ومؤشر وجود اللون أو درجة اللون في مصدر. @ar
definition: 将一种资源与一种资源的颜色或色调是否出现的指示关联起来。 @zh-hans
scope note: Alapszíneknek tekinthetők a fekete, a fehér, valamint az alapszínek feketével, fehérrel és szürkével kevert árnyalatai. A színtartalom azon forrásokra vonatkozik, amelyeknek a tartalomtípusa kartográfiai kép, kartográfiai mozgókép, háromdimenziós kartográfiai forma, mozgásírás; zenei lejegyzés, előadott mozgás, állókép, szöveg, háromdimenziós mozgókép, háromdimenziós forma vagy kétdimenziós mozgókép. @hu
scope note: Black, white, single colour shades of black, single colour tints of white, and single colour tones of gray are considered to be single colours. Colour content applies to a resource with a content type of "cartographic image", "cartographic moving image", "cartographic three-dimensional form", "notated movement", "notated music", "performed movement", "still image", "text", "three-dimensional moving image", "three-dimensional form", or "two-dimensional moving image".
scope note: Musta, valkoinen, yksiväriset mustan sävyt, yksiväriset valkoisen sävyt ja yksiväriset harmaan sävyt lasketaan yksivärisiksi. Värisisältöä sovelletaan aineistoon jonka sisältötyypin arvo on "kartografinen kuva", "kartografinen liikkuva kuva", "kartografinen kolmiulotteinen muoto", "liikenotaatio", "nuottiaineisto", "esitetty liike", "stillkuva", "teksti", " kolmiulotteinen liikkuva kuva", "kolmiulotteinen muoto" tai "kaksiulotteinen liikkuva kuva". @fi
scope note: Schwarz, Weiß, einfarbige Schwarztöne, einfarbige Weißtönungen und einfarbige Grauschattierungen werden als einfarbig angesehen. Farbinhalt gibt es in einer Ressource mit dem Inhaltstyp kartografisches Bild, kartografisches Bewegtbild, kartografische dreidimensionale Form, Bewegtnotation, Noten, aufgeführte Bewegung, unbewegtes Bild, Text, dreidimensionales Bewegtbild, dreidimensionale Form oder zweidimensionales Bewegtbild. @de
scope note: Siyah, beyaz, siyahın tek renk tonları, beyazın tek renk tonları ve grinin tek renk tonları tek renk olarak kabul edilir. Renk içeriği, "kartografik görüntü", "kartografik hareketli görüntü", "kartografik üç boyutlu form", "notalı hareket", "notalı müzik", "icra edilen hareket", "sabit görüntü", "metin", "üç boyutlu hareketli görüntü", "üç boyutlu form" veya "iki boyutlu hareketli görüntü" içerik türüne sahip bir kaynak için geçerlidir. @tr
scope note: Sort, hvid, enkeltfarvede skygger af sort, enkeltfarvede nuancer af hvidt og enkeltfarvede toner af gråt anses for at være enkelte farver. @da
scope note: تعتبر الألوان التالية: الأسود، الأبيض، تدرجات أحادية اللون من الأسود، صبغات أحادية اللون من الأبيض، ودرجات أحادية اللون من الرمادي من الألوان الفردية. ينطبق محتوى اللون على مصدر له نوع محتوى من "صورة خرائطية"، "صورة متحركة خرائطية"، "شكل خرائطي ثلاثي الأبعاد"، "حركة مدونة"، "موسيقى مدونة"، "حركة مؤداة"، "صورة ثابتة"، "نص"، "صورة متحركة ثُلاثية الأبعاد"، "شكل ثلاثي الأبعاد"، أو "صورة متحركة ثنائية الأبعاد" @ar
scope note: 黑色、白色、单色黑阴影、单色白色调、单色灰色调都被认为是单色。颜色内容适用于有如下内容类型值的内容表达：“地图图像”、“地图动态图像”、“地图三维形式”、“动作谱”、“乐谱”、“表演动作”、“静止图像”、“文本”、“三维动态图像”、“三维形式”、或“二维动态图像”。 @zh-hans

has sound content
lexical alias: soundContent.en
status: Published
type: Property
label: aineiston äänisisältö @fi
label: hangtartalma a következő: @hu
label: har lydindhold @da
label: hat Toninhalt @de
label: heeft geluidscontent @nl
label: ses içeriği ile ilişkilidir @tr
label: له محتوى صوت @ar
label: 有声音内容 @zh-hans
definition: Bir kaynağı, bir kaynak tarafından somutlaştırılan sesin varlığının veya yokluğunun bir göstergesi ile ilişkilendirir. @tr
definition: Hozzákapcsol egy forrást egy forrásban megtestesülő, a hang jelenlétét vagy hiányát mutató jelöléshez. @hu
definition: Liittää aineiston ilmaukseen aineiston sisältämän äänen mukanaolosta tai puuttumisesta. @fi
definition: Relaterer en ressource til en tilstedeværelse eller fravær af lyd i en ressource. @da
definition: Relates a resource to an indication of the presence or absence of sound embodied by a resource.
definition: Setzt eine Ressource in Beziehung zu einer Angabe über das Vorhandensein beziehungsweise Nichtvorhandensein von Ton, der durch eine Ressource verkörpert wird. @de
definition: يربط بين مصدر وإشارة إلى وجود أو عدم وجود صوت متجسد في مصدر. @ar
definition: 将一种资源与一种资源所具体化的声音出现或不出现的指示关联起来。 @zh-hans
scope note: Hangtartalmat tartalmazó forrás a következő tartalomtípusokra vonatkozó értékekkel: „előadott zene”, „hangok” és „beszéd”. @hu
scope note: Lydindhold findes i en ressource med indholdstype "indspillet musik", "lyd", eller "talet ord". @da
scope note: Ses içeriği, içerik türü "kaydedilmiş müzik", "sesler" veya "söz" olan kaynakta mevcuttur. @tr
scope note: Sound content is present in an resource with a content type of "recorded music", "sounds", or "spoken word."
scope note: Toninhalte gibt es in einer Ressource mit dem Inhaltstyp aufgeführte Musik, Töne oder gesprochene Worte. @de
scope note: Äänisisältö ilmaistaan aineistossa sisältötyypin arvolla "esitetty musiikki", "ääni" tai "puhe". @fi
scope note: محتوى صوت متواجد في مصدر له نوع محتوى من "موسيقى مُسجلة"، " أصوات"، أو "كلمة منطوقة". @ar
scope note: 声音内容出现于有如下内容类型值的一种内容表达：“表演音乐”、“声音”、或“口语” @zh-hans

has production method
has subproperty: has production method for tactile resource (Deprecated)
has subproperty: has production method for manuscript (Deprecated)
lexical alias: productionMethod.en
status: Published
type: Property
label: aineiston valmistusmenetelmä @fi
label: előállítási módszere a következő: @hu
label: har produktionsmetode @da
label: hat Entstehungsmethode @de
label: heeft productiemethode @nl
label: yapım yöntemi ile ilişkilidir @tr
label: له طريقة إنتاج @ar
label: 有制作方法 @zh-hans
definition: Bir kaynağı, bir kaynağı üretmek için kullanılan süreçle ilişkilendirir. @tr
definition: Hozzákapcsol egy forrást egy eljáráshoz, amelyet egy forrás előállítására használnak. @hu
definition: Liittää aineiston aineiston tuottamisessa käytettävään menetelmään. @fi
definition: Relaterer en ressource til en proces anvendt til at fremstille en ressource. @da
definition: Relates a resource to a process that is used to produce a resource.
definition: Setzt eine Ressource in Beziehung zu einem Verfahren, das angewendet wird, um eine Ressource zu erzeugen. @de
definition: يربط بين مصدر وعملية مستخدمة في إنتاج مصدر. @ar
definition: 将一种资源与用于制作一种资源的一个过程关联起来。 @zh-hans

has production method for tactile resource (Deprecated)
lexical alias: productionMethodForTactileResource.en
status: Deprecated
type: Property
sub property of: has production method
definition: Relates a resource to the process used to produce a tactile resource (e.g., embossing, thermoform).. (Deprecated)

has production method for manuscript (Deprecated)
lexical alias: productionMethodForManuscript.en
status: Deprecated
type: Property
sub property of: has production method
definition: Relates a resource to the process used to produce an original manuscript or a copy.. (Deprecated)

has horizontal scale of cartographic content
lexical alias: horizontalScaleOfCartographicContent.en
status: Published
type: Property
label: har horisontal målestok for kartografisk indhold @da
label: hat horizontalen Maßstab bei kartografischem Inhalt @de
label: heeft horizontale schaal van cartografische content @nl
label: kartografik içeriğin yatay ölçeği ile ilişkilidir @tr
label: kartografisen sisällön horisontaalinen mittakaava aineistossa @fi
label: kartográfiai tartalom vízszintes méretaránya a következő: @hu
label: له مقياس أفقي لمحتوى رسم خرائطي @ar
label: 有地图内容的水平比例尺 @zh-hans
sub property of: has scale
definition: Bir kaynağı, kaynağın kartografik içeriğindeki yatay mesafelerin temsil ettikleri gerçek mesafelere oranıyla ilişkilendirir. @tr
definition: Hozzákapcsol egy forrást a vízszintes távolságok arányához egy forrás kartográfiai tartalmában, amely a tényleges távolságokat képviseli és reprezentálja. @hu
definition: Liittää aineiston kartografisen sisällön horisontaalisten etäisyyksien suhteeseen niiden esittämiin todellisiin mittoihin. @fi
definition: Relaterer en ressource til et forhold mellem horisontale afstande i et udtryks kartografiske indhold og de virkelige afstande, de repræsenterer. @da
definition: Relates a resource to a ratio of horizontal distances in the cartographic content of a resource to the actual distances they represent.
definition: Setzt eine Ressource in Beziehung zu einem Verhältnis der horizontalen Entfernungen bei kartografischem Inhalt einer Ressource zu den tatsächlichen Entfernungen, die sie repräsentieren. @de
definition: يربط بين مصدر ونسبة المسافات الأفقية في محتوى رسم خرائطي لمصدر بالمسافات الفعلية التي يمثلها. @ar
definition: 将一种资源与资源的地图内容的水平距离与它代表的实际距离的比关联起来。 @zh-hans

has scale of still image or three-dimensional form
lexical alias: scaleOfStillImageOrThreeDimensionalForm.en
status: Published
type: Property
label: durağan görüntü veya üç boyutlu formun ölçeği ile ilişkilidir @tr
label: har målestoksforhold for fast billede eller tredimensionel form @da
label: hat Maßstab eines unbewegten Bilds oder einer dreidimensionalen Form @de
label: heeft schaal van stilstaand beeld of drie-dimensionale vorm @nl
label: stillkuvan tai kolmiulotteisen muodon mittakaava aineistossa @fi
label: állókép vagy háromdimenziós forma méretaránya a következő: @hu
label: له مقياس صورة ثابتة أو شكل ثلاثي الأبعاد @ar
label: 有静态图像或三维形式的比例尺 @zh-hans
sub property of: has scale
definition: Bir kaynağı, bir hareketsiz görüntünün veya kaynak tarafından somutlaştırılan üç boyutlu formun boyutlarının, temsil ettiği öğenin boyutlarına oranıyla ilişkilendirir. @tr
definition: Hozzákapcsol egy forrást egy forrásban megtestesített állókép vagy háromdimenziós forma méretének és a forrás által ábrázolt dolog méretének viszonyításához. @hu
definition: Liittää aineiston suhteeseen, joka on stillkuvan tai kolmiulotteisen muodon mittojen suhde esitetyn kohteen mittoihin. @fi
definition: Relaterer en ressource til et forhold mellem et fast billede eller en tredimensionel form i et udtryk og dimensionerne for den ting, billedet eller formen repræsenterer. @da
definition: Relates a resource to a ratio of the dimensions of a still image or three-dimensional form embodied by a resource to the dimensions of the thing it represents.
definition: Setzt eine Ressource in Beziehung zu einem Verhältnis der Maße eines unbewegten Bilds oder einer dreidimensionalen Form, das/die in einer Ressource verkörpert wird, zu den Maßen der Sache, die es/sie repräsentiert. @de
definition: يربط بين مصدر ونسبة أبعاد صورة ثابتة أو شكل ثلاثي الأبعاد يجسده مصدر بأبعاد الشيء الذي يمثله. @ar
definition: 将一种资源与资源所具体化的静态图像或三维形式的尺寸与其所代表的实体尺寸之比关联起来。 @zh-hans

has scale
has subproperty: has additional scale information
has subproperty: has horizontal scale of cartographic content
has subproperty: has scale of still image or three-dimensional form
has subproperty: has vertical scale of cartographic content
lexical alias: scale.en
status: Published
type: Property
label: aineiston mittakaava @fi
label: har målestoksforhold @da
label: hat Maßstab @de
label: heeft schaal @nl
label: méretaránya a következő: @hu
label: ölçek ile ilişkilidir @tr
label: له مقياس @ar
label: 有比例尺 @zh-hans
definition: Bir kaynağı, bir görüntünün veya üç boyutlu formun boyutlarının temsil edilen şeyin boyutlarına oranıyla ilişkilendirir. @tr
definition: Hozzákapcsol egy forrást egy forrásban megtestesített kép vagy háromdimenziós forma méretének és a forrás által ábrázolt dolog méretének viszonyításához. @hu
definition: Liittää aineiston kuvan tai kolmiulotteisen muodon aineiston mittojen suhteeseen sen esittämän kohteen mittoihin. @fi
definition: Relaterer en ressource til et forhold mellem et billede eller en tredimensionel form og dimensionerne for den ting, billedet eller formen repræsenterer. @da
definition: Relates a resource to a ratio of the dimensions of an image or three-dimensional form to the dimensions of the thing that is represented.
definition: Setzt eine Ressource in Beziehung zu einem Verhältnis der Maße eines Bilds oder einer dreidimensionalen Form zu den Maßen der Sache, die es/sie repräsentiert. @de
definition: يربط بين مصدر ونسبة أبعاد صورة أو شكل ثلاثي الأبعاد بأبعاد الشيء الذي يتم تمثيله. @ar
definition: 将一种资源与一种图像或三维形式的尺寸与其所代表的东西的尺寸之比关联起来。 @zh-hans
scope note: A méretarány alkalmazható egy forrásban reprezentált vízszintes, függőleges, ferde és/vagy más méretekre. @hu
scope note: Ein Maßstab kann auf horizontale, vertikale, winklige und/oder andere Maße angewendet werden, die in einer Ressource repräsentiert sind. @de
scope note: Mittakaava voi koskea aineistossa esitettyjä horisontaalisia, vertikaalisia, kulma- tai muita mittoja. @fi
scope note: Målestoksforhold kan gælde for horisontale, vertikale, kantede og/eller andre mål repræsenterede i en ressource. @da
scope note: Scale can apply to horizontal, vertical, angular, and/or other measurements represented in the resource.
scope note: Ölçek, kaynakta temsil edilen yatay, dikey, açısal ve/veya diğer ölçümlere uygulanabilir. @tr
scope note: يمكن تطبيق المقياس على القياسات الأفقية والرأسية والزاوية و / أو غيرها من القياسات الممثلة في المصدر. @ar
scope note: 比例尺可应用于资源所代表的水平、垂直、角度和/或其他测量。 @zh-hans

has aspect ratio
lexical alias: aspectRatio.en
status: Published
type: Property
label: en boy oranı ile ilişkilidir @tr
label: har billedformat @da
label: hat Bildformat @de
label: heeft aspectratio @nl
label: kuvasuhde aineistossa @fi
label: képaránya a következő: @hu
label: له نسبة باعية @ar
label: 有宽高比 @zh-hans
definition: Bir kaynağı, hareketli bir görüntünün genişliğinin yüksekliğine olan sayısal oranıyla ilişkilendirir. @tr
definition: Hozzákapcsol egy forrást egy arányszámhoz, amely egy mozgókép szélességét viszonyítja annak magasságához. @hu
definition: Liittää aineiston liikkuvan kuvan leveyden ja korkeuden väliseen numeeriseen suhteeseen. @fi
definition: Relaterer en ressource til et numerisk forhold mellem bredde og højde i et levende billede. @da
definition: Relates a resource to a numerical ratio of the width to the height of a moving image.
definition: Setzt eine Ressource in Beziehung zu einem Zahlenverhältnis von der Breite zur Höhe einer Bewegtbildressource. @de
definition: يربط بين مصدر ونسبة عددية من العرض إلى ارتفاع لصورة متحركة. @ar
definition: 将一种资源与一种动态图像的宽度和高度的数字比关联起来。 @zh-hans

has generation of audio recording (Deprecated)
lexical alias: generationOfAudioRecording.en
status: Deprecated
type: Property
sub property of: has generation
definition: Relates a resource to the relationship between an original audio carrier and the carrier of a reproduction made from the original (e.g., a tape duplication master, a test pressing).. (Deprecated)

has generation
has subproperty: has generation of audio recording (Deprecated)
has subproperty: has generation of digital resource (Deprecated)
has subproperty: has generation of motion picture film (Deprecated)
has subproperty: has generation of videotape (Deprecated)
has subproperty: has generation of microform (Deprecated)
lexical alias: generation.en
status: Published
type: Property
label: generációja a következő: @hu
label: har generation @da
label: hat Kopiengeneration @de
label: heeft generatie @nl
label: nesil ile ilişkilidir @tr
label: sukupolvi aineistossa @fi
label: له توليد @ar
label: 有代 @zh-hans
definition: Bir kaynağı, orijinal bir taşıyıcı ile orijinalden yeniden üretilen bir taşıyıcı arasındaki bağlantıyla ilişkilendirir. @tr
definition: Hozzákapcsol egy forrást egy eredeti hordozó és az eredetiből készült másolat hordozója közötti viszonyhoz. @hu
definition: Liittää aineiston alkuperäisen tallenteen ja siitä tuotetun jäljenteen tallenteen väliseen suhteeseen. @fi
definition: Relaterer en ressource til et forhold mellem en oprindelig bærere og bæreren af en reproduktion baseret på originalen. @da
definition: Relates a resource to a relationship between an original carrier and a carrier of a reproduction that is made from the original.
definition: Setzt eine Ressource in Beziehung zu einer Beziehung zwischen einem Originaldatenträger und dem Datenträger einer Reproduktion, die vom Original erstellt wird. @de
definition: يربط بين مصدر وعلاقة بين حامل أصلي والحامل الخاص بإعادة الإنتاج المصنوع من الأصل. @ar
definition: 将一种资源与原始载体和原件复制品的载体之间的关系关联起来。 @zh-hans

has generation of digital resource (Deprecated)
lexical alias: generationOfDigitalResource.en
status: Deprecated
type: Property
sub property of: has generation
definition: Relates a resource to the relationship between an original carrier of a digital resource and the carrier of a reproduction made from the original (e.g., a derivative master).. (Deprecated)

has generation of motion picture film (Deprecated)
lexical alias: generationOfMotionPictureFilm.en
status: Deprecated
type: Property
sub property of: has generation
definition: Relates a resource to the relationship between an original carrier of a motion picture film resource and the carrier of a reproduction made from the original (e.g., a reference print).. (Deprecated)

has generation of videotape (Deprecated)
lexical alias: generationOfVideotape.en
status: Deprecated
type: Property
sub property of: has generation
definition: Relates a resource to the relationship between an original carrier of a videotape resource and the carrier of a reproduction made from the original (e.g., a show copy).. (Deprecated)

has generation of microform (Deprecated)
lexical alias: generationOfMicroform.en
status: Deprecated
type: Property
sub property of: has generation
definition: Relates a resource to the relationship between an original microform carrier and the carrier of a reproduction made from the original (e.g., a printing master).. (Deprecated)

has polarity
lexical alias: polarity.en
status: Published
type: Property
label: har polaritet @da
label: hat Polarität @de
label: heeft polariteit @nl
label: polarite ile ilişkilidir @tr
label: polariteetti aineistossa @fi
label: polaritása a következő: @hu
label: له استقطاب ألوان @ar
label: 有极性 @zh-hans
definition: Bir kaynağı, bir görüntüdeki renklerin ve tonların, yeniden üretilen nesnenin renkleri ve tonlarıyla olan bağlantısıyla ilişkilendirir. @tr
definition: Hozzákapcsol egy forrást egy kép színei és tónusai, valamint a reprodukált objektum színei és tónusai között fennálló kapcsolathoz. @hu
definition: Liittää aineiston suhteeseen, joka kuvan väreillä ja valoisuudella on kuvan kohteen väreihin ja valoisuuteen. @fi
definition: Relaterer en ressource til et forhold mellem farver og nuancer i et billede og farver og nuancer i den reproducerede genstand. @da
definition: Relates a resource to a relationship of the colours and tones in an image to the colours and tones of the object reproduced.
definition: Setzt eine Ressource in Beziehung zum Verhältnis der Farben und Tönungen in einem Bild zu den Farben und Tönungen des reproduzierten Objekts. @de
definition: يربط بين مصدر وعلاقة خاصة بالألوان ودرجات الألوان في صورة ما بألوان ودرجات شيء/لون معاد إنتاجه. @ar
definition: 将一种资源与一个图像中色彩和色调与被复制对象的色彩和色调的关系关联起来。 @zh-hans

is absorption of
lexical alias: absorptionOf.en
status: Published
type: Property
label: beolvasztása a következőnek: @hu
label: er absorbering af @da
label: is opname van @nl
label: ist darin aufgegangen @de
label: kapsanmasıdır @tr
label: sulautunut aineisto @fi
label: هو احتواء لـ @ar
label: 是……的吸收 @zh-hans
sub property of: is preceded by
inverse of: is absorbed by
definition: Bir kaynağı, içeriği başka bir kaynağın içeriğine dahil edilen bir kaynakla ilişkilendirir. @tr
definition: Hozzákapcsol egy forrást egy forráshoz, amelynek tartalma beolvad egy másik forrás tartalmába. @hu
definition: Liittää aineiston aineistoon, jonka sisältö on yhdistynyt toisen aineiston sisältöön. @fi
definition: Relaterer en ressource til en ressource, der er blevet inkorporeret i en anden ressource. @da
definition: Relates a resource to a resource whose content is incorporated in the content of another resource.
definition: Setzt ein Ressource in Beziehung zu einer Ressource, deren Inhalt in den Inhalt einer anderen Ressource eingeflossen ist. @de
definition: يربط بين مصدر ومصدر يكون محتواه مدمجًا في محتوى مصدر آخر. @ar
definition: 将一种资源与其内容被纳入另一种资源之内容的一种资源关联起来。 @zh-hans

is absorption in part of
lexical alias: absorptionInPartOf.en
status: Published
type: Property
label: beolvasztása részben a következőnek: @hu
label: er delvis absorbering af @da
label: is gedeeltelijke opname van @nl
label: ist teilweise darin aufgegangen @de
label: kısmen kapsanmasıdır @tr
label: osittain sulautunut aineisto @fi
label: هو احتواء في جزء لـ @ar
label: 是……的部分吸收 @zh-hans
sub property of: is preceded by
inverse of: is absorbed in part by
definition: Bir kaynağı, kısmi içeriği başka bir kaynağın içeriğine dahil edilen bir kaynakla ilişkilendirir. @tr
definition: Hozzákapcsol egy forrást egy forráshoz, amelynek részleges tartalma beolvad egy másik forrás tartalmába. @hu
definition: Liittää aineiston aineistoon, jonka osittainen sisältö on yhdistynyt toisen aineiston sisältöön. @fi
definition: Relaterer en ressource til en ressource, der er delvis inkorporeret i en anden ressource. @da
definition: Relates a resource to a resource whose partial content is incorporated in the content of another resource.
definition: Setzt eine Ressource in Beziehung zu einer Ressource, deren Inhalt teilweise in den Inhalt einer anderen Ressource eingeflossen ist. @de
definition: يربط بين مصدر ومصدر يكون محتواه الجزئي مدمجًا في محتوى مصدر آخر. @ar
definition: 将一种资源与其部分内容被纳入另一种资源之内容的一种资源关联起来。 @zh-hans

is continuation of
lexical alias: continuationOf.en
status: Published
type: Property
label: devamıdır @tr
label: er fortsættelse af @da
label: folytatása a következőnek: @hu
label: is voortzetting van @nl
label: ist Fortsetzung von @de
label: jatkoa aineistolle @fi
label: هو استمرار لـ @ar
label: 是……的继承 @zh-hans
sub property of: is preceded by
inverse of: is continued by
definition: Bir kaynağı, içeriği başka bir art zamanlı kaynak tarafından sürdürülen, tamamlanmış artzamanlı bir kaynak olan kaynakla ilişkilendirir. @tr
definition: Hozzákapcsol egy forrást egy befejezett diakronikus forráshoz, amelynek tartalmát egy másik diakronikus forrás folytatja. @hu
definition: Liittää aineiston aineistoon, joka on valmis diakroninen aineisto, jonka sisältöä jatkaa toinen diakroninen aineisto. @fi
definition: Relaterer en ressource til en ressource, der fortsættes af en senere ressources indhold. @da
definition: Relates a resource to a resource that is a diachronic resource that is completed whose content is continued by another diachronic resource.
definition: Setzt eine Ressource in Beziehung zu einer abgeschlossenen diachronen Ressource, deren Inhalt durch eine andere diachrone Ressource fortgeführt wird. @de
definition: يربط بين مصدر ومصدر ممتد زمنيًا ومكتمل، ومحتواه مستمر من خلال مصدر آخر ممتد زمنيًا. @ar
definition: 将一种资源与作为一种已完成的历时资源而且其内容被另一种历时资源继承的一种资源关联起来。 @zh-hans
scope note: Bu öğe, genel olarak ardışık bir kaynak için geçerlidir. @tr
scope note: Denne relation anvends generelt for periodika. @da
scope note: Ez az elem általában a folyamatos forrásokra vonatkozik. @hu
scope note: Im Allgemeinen trifft dieses Element auf eine sukzessive Ressource zu. @de
scope note: This element applies in general to a successive resource.
scope note: Tämä elementti soveltuu yleensä peräkkäisesti ilmestyvään aineistoon. @fi
scope note: ينطبق هذا العنصر بشكل عام على مصدر متتالي. @ar
scope note: 该元素一般适用于一种相继资源。 @zh-hans

is sequel to (Deprecated)
lexical alias: sequelTo.en
status: Deprecated
type: Property
label: er efterfølger til @da
sub property of: is preceded by
inverse of: has sequel
definition: Relaterer en ressource til en ressource, hvis fortælling fortsættes af en senere ressource. @da
definition: Relates a resource to a resource whose narrative is continued by a later resource.. (Deprecated)

has bibliographic format
lexical alias: bibliographicFormat.en
status: Published
type: Property
label: aineiston bibliografinen koko @fi
label: bibliográfiai formátuma a következő: @hu
label: bibliyografik format ile ilişkilidir @tr
label: har bibliografisk format @da
label: hat bibliografisches Format @de
label: heeft boekformaat @nl
label: له شكل ببليوجرافي @ar
label: 有书目格式 @zh-hans
definition: Bir kaynağı, basılı veya el yazması bir kaynaktaki bütün bir sayfa ile o sayfanın dolu bırakılması, kesilmesi veya katlanması durumunda ortaya çıkan yapraklar arasındaki orantılı bir bağlantıyla ilişkilendirir. @tr
definition: Hozzákapcsol egy forrást egy aránybeli viszonyhoz, amely egy nyomtatott vagy kéziratos forrás teljes lapja és az egyes lapok között jön létre, ha a lapot teljesnek hagyják, elvágják vagy összehajtják. @hu
definition: Liittää aineiston painetussa tai käsikirjoitusaineistossa kokonaisen arkin ja yksittäisten lehtien väliseen kokosuhteeseen, joka riippuu siitä, onko arkki kokonainen, leikattu tai taitettu. @fi
definition: Relaterer en ressource til detaljer om resultatet af at folde et trykt ark, så der dannes en samling af blade. @da
definition: Relates a resource to a proportional relationship between a whole sheet in a printed or manuscript resource, and the individual leaves that result if that sheet is left full, cut, or folded.
definition: Setzt eine Ressource in Beziehung zu einem proportionalen Verhältnis zwischen einem ganzen Bogen in einer gedruckten oder handschriftlichen Ressource und den einzelnen Blättern, die resultieren, wenn der Bogen im Ganzen gelassen, geschnitten oder gefaltet wird. @de
definition: يربط بين مصدر وعلاقة نسبية بين ورقة كاملة في مصدر مطبوع أو مخطوط، والأوراق الفردية التي تنتج إذا تركت الورقة كاملة، أو مقطوعة، أو مطوية. @ar
definition: 将一种资源与印刷或手稿资源的一个整张和导致在一种资源中是否完整、裁切或折叠的单独页之间的比例关系关联起来。 @zh-hans

has vertical scale of cartographic content
lexical alias: verticalScaleOfCartographicContent.en
status: Published
type: Property
label: aineiston kartografisen sisällön vertikaalinen mittakaava @fi
label: har vertikal skala for kartografisk indhold @da
label: hat vertikalen Maßstab bei kartografischem Inhalt @de
label: heeft verticale schaal van cartografische content @nl
label: kartografik içeriğin dikey ölçeği ile ilişkilidir @tr
label: kartográfiai tartalom függőleges méretaránya a következő: @hu
label: له مقياس عَمُودِي لمحتوى رسم خرائطي @ar
label: 有地图内容的垂直比例尺 @zh-hans
sub property of: has scale
definition: Bir kaynağı, kaynağın kartografik içeriğinin yükseklik ölçeği veya dikey boyutuyla ilişkilendirir. @tr
definition: Hozzákapcsol egy forrást egy kartográfiai tartalom emelkedési vagy függőleges dimenziójának a léptékéhez. @hu
definition: Liittää aineiston kartografisen sisällön esittämään korkeuden tai vertikaalisen ulottuvuuden mittakaavaan. @fi
definition: Relaterer en ressource til en koteskala eller skala for vertikal dimension for en ressources kartografiske indhold. @da
definition: Relates a resource to a scale of elevation or vertical dimension of the cartographic content of a resource.
definition: Setzt eine Ressource in Beziehung zu einem Maßstab der Höhe oder einem vertikalen Maß von kartografischem Inhalt einer Ressource. @de
definition: يربط بين مصدر ومقياس ارتفاع أو بُعد عَمُودِي لمحتوى رسم خرائطي لمصدر ما. @ar
definition: 将一种资源与资源的地图内容的高度或垂直尺寸的比例尺关联起来。 @zh-hans

has key
lexical alias: key.en
status: Published
type: Property
label: aineiston sävellaji @fi
label: har toneart @da
label: hat Tonart @de
label: heeft toonsoort @nl
label: kulcsa a következő: @hu
label: ton ile ilişkilidir @tr
label: له مُفتاح @ar
label: 有调 @zh-hans
definition: Bir kaynağı, bir kaynağın müzikal içeriğinin performansı için kullanılan veya kullanılması amaçlanan tonal merkezi veya ana tonal merkezi belirleyen bir dizi perde ilişkisiyle ilişkilendirir. @tr
definition: Hozzákapcsol egy forrást hangmagassági kapcsolatok halmazához, amely tonális központot vagy fő tonális központot hoz létre, amelyet a forrás zenei tartalmának előadásához használnak vagy használni kívánnak. @hu
definition: Liittää aineiston sävelsuhteiden joukkoon, johon aineiston musiikillisen sisällön esityksessä käytetty tai käytettäväksi tarkoitettu tonaalinen keskus tai pääasiallinen tonaalinen keskus perustuu. @fi
definition: Relaterer en ressource til et sæt af tonehøjdeforhold, der fastlægger et musikressources tonale eller væsentligste tonale centrum. @da
definition: Relates a resource to a set of pitch relationships that establishes the tonal centre, or principal tonal centre, used, or intended to be used, for performance of musical content of a resource.
definition: Setzt eine Ressource in Beziehung zu einem Satz an Tonhöhenbeziehungen, der das tonale Zentrum oder das hauptsächliche tonale Zentrum begründet, das für eine Darbietung eines musikalischen Inhalts einer Ressource verwendet wird oder verwendet werden soll. @de
definition: يربط بين مصدر ومجموعة من علاقات النغمات التي تؤسس مركز النغمات أو مركز النغمات الرئيسي المستخدم أو المزمع استخدامه لأداء المحتوى الموسيقي لمصدر ما. @ar
definition: 将一种资源与为一种资源的音乐内容之表演建立所用或计划所用的调性中心或主调性中心的一组音高关系关联起来。 @zh-hans

has reduction ratio
lexical alias: reductionRatio.en
status: Published
type: Property
label: csökkentési aránya a következő: @hu
label: har reduktionsforhold @da
label: hat Verkleinerungsfaktor @de
label: heeft verkleiningsfactor @nl
label: küçültme oranı ile ilişkilidir @tr
label: pienennyssuhde aineistossa @fi
label: له معدل تصغير @ar
label: 有缩率 @zh-hans
definition: Bir kaynağı, mikro görüntünün boyutunun üretildiği orijinal görüntüye göre sayısal oranıyla ilişkilendirir. @tr
definition: Hozzákapcsol egy forrást egy mikrokép méretének számarányához az eredetihez viszonyítva, amelyből azt előállították. @hu
definition: Liittää aineiston numeeriseen suhdelukuun, joka ilmaisee mikrokokoiseksi pienennetyn kuvan suhteen alkuperäiseen kuvaan, josta pienennetty kuva on tuotettu. @fi
definition: Relaterer en ressource til et numerisk forhold for størrelsen på et mikrobillede i forhold til den original, som det er fremstillet ud fra. @da
definition: Relates a resource to a numerical ratio of the size of a micro-image in relation to an original from which it was produced.
definition: Setzt eine Ressource in Beziehung zu einem Zahlenverhältnis zwischen der Größe eines Mikro-Bilds im Verhältnis zu dem Original, von dem es hergestellt wird. @de
definition: يربط بين مصدر ونسبة عددية لحجم صورة مصغرة بالنسبة للأصل الذي انتجت منه. @ar
definition: 将一种资源与缩微图像尺寸和其所复制的原件之间的数值比关联起来。 @zh-hans

has font size
lexical alias: fontSize.en
status: Published
type: Property
label: betűmérete a következő: @hu
label: har skriftstørrelse @da
label: hat Schriftgröße @de
label: heeft lettergrootte @nl
label: kirjasinkoko aineistossa @fi
label: yazı tipi boyutu ile ilişkilidir @tr
label: له حجم خط @ar
label: 有字体大小 @zh-hans
definition: Bir kaynağı, kaynaktaki karakterleri ve sembolleri temsil etmek için kullanılan harfin boyutuyla ilişkilendirir. @tr
definition: Hozzákapcsol egy forrást ahhoz a típusmérethez, amely a karaktereket és szimbólumokat reprezentálja egy forrásban. @hu
definition: Liittää aineiston aineiston merkeissä ja symboleissa käytettävään kirjasimen kokoon. @fi
definition: Relaterer en ressource til en størrelse på den skrifttype, der er anvendt til at repræsentere tegn og symboler i en ressource. @da
definition: Relates a resource to a size of the type that is used to represent the characters and symbols in a resource.
definition: Setzt eine Ressource in Beziehung zu den Details zur Größe der Schrift, die zur Repräsentation der Zeichen und Symbole in einer Ressource verwendet wird. @de
definition: يربط بين مصدر وحجم الخط المستخدم في تمثيل التمثيلات والرموز في مصدر. @ar
definition: 将一种资源与在一种资源中用于表示字符和符号的字型的大小关联起来。 @zh-hans

has immediate source of acquisition of resource
lexical alias: immediateSourceOfAcquisitionOfResource.en
status: Published
type: Property
label: aineiston hankintalähde @fi
label: forrás közvetlen beszerzési forrása a következő: @hu
label: har direkte anskaffelseskilde for eksemplar @da
label: hat Bezugsquelle einer Ressource @de
label: heeft directe bron van verwerving van resource @nl
label: kaynağın doğrudan sağlandığı kaynak ile ilişkilidir @tr
label: له مصدر حالى لاقتناء مصدر @ar
label: 有资源的直接获取来源 @zh-hans
definition: Bir kaynağı, bir yöntem, kaynak ve satın alma tarihi de dahil olmak üzere bir kaynağın doğrudan edinildiği koşullarla ilişkilendirir. @tr
definition: Hozzákapcsol egy forrást azokhoz a körülményekhez, amelyek keretében egy forrást közvetlenül beszereznek, beleértve a beszerzés módszerét, forrását és időpontját. @hu
definition: Liittää aineiston aineiston hankintaolosuhteisiin, kuten hankintatapaan, -lähteeseen ja -ajankohtaan. @fi
definition: Relaterer en ressource til en kilde, hvorfra institutionen har anskaffet en ressource, samt de omstændigheder under hvilke det blev modtaget. @da
definition: Relates a resource to the circumstances under which a resource is directly acquired, including a method, source, and date of acquisition.
definition: Setzt eine Ressource in Beziehung zu den Umständen, unter denen eine Ressource direkt erworben wird. Darunter fallen Erwerbungsmethoden, Erwerbungsquellen und Erwerbungsdaten. @de
definition: يربط بين مصدر والظروف التي تم فيها اقتناء مصدر بصورة مباشرة، ويشمل ذلك طريقة الاقتناء، مصدره، تاريخه. @ar
definition: 将一种资源与资源直接被获取的环境（包括获取的方法、来源和日期）关联起来。 @zh-hans

has nature of content
lexical alias: natureOfContent.en
status: Published
type: Property
label: aineiston sisällön luonne @fi
label: har indholdets art @da
label: hat Art des Inhalts @de
label: heeft aard van content @nl
label: içeriğin niteliği ile ilişkilidir @tr
label: tartalmának jellege a következő: @hu
label: له طبيعة محتوى @ar
label: 有内容的性质 @zh-hans
definition: Bir kaynağı, kaynağın birincil içeriğinin belirli bir karakteriyle ilişkilendirir. @tr
definition: Hozzákapcsol egy forrást egy forrás elsődleges tartalmának adott jellegzetességéhez. @hu
definition: Liittää aineiston sen pääasiallisen sisällön erityispiirteeseen. @fi
definition: Relaterer en ressource til en specifik egenskab ved en ressources primære indhold. @da
definition: Relates a resource to a specific character of the primary content of a resource.
definition: Setzt eine Ressource in Beziehung zu einer spezifischen Eigenschaft des primären Inhalts einer Ressource. @de
definition: يربط بين مصدر وخاصية معينة في المحتوى الأساسي لمصدر. @ar
definition: 将一种资源与一种资源的主要内容的特定特征关联起来。 @zh-hans

has projection speed
lexical alias: projectionSpeed.en
status: Published
type: Property
label: har projektionshastighed @da
label: hat Projektionsgeschwindigkeit @de
label: heeft projectiesnelheid @nl
label: projisointinopeus aineistolle @fi
label: vetítési sebessége a következő: @hu
label: yansıtma hızı ile ilişkilidir @tr
label: له سرعة عرض @ar
label: 有投影速度 @zh-hans
sub property of: has projection characteristic of motion picture film
definition: Bir kaynağı, amaçlanan hareketli görüntüyü üretmek için planlanmış bir taşıyıcının çalıştırılması gereken bir hızla ilişkilendirir. @tr
definition: Hozzákapcsol egy forrást egy sebességhez, amelyen egy kivetített hordozónak működnie kell, hogy a kívánt mozgóképet elő tudják állítani. @hu
definition: Liittää aineiston nopeuteen, jolla projisoitava tallenne tulee esittää liikkuvan kuvan näyttämiseksi tarkoitetulla tavalla. @fi
definition: Relaterer en ressource til en hastighed, ved hvilken en projiceret bærer skal betjenes for at producere det ønskede levende billede. @da
definition: Relates a resource to a speed at which a projected carrier must be operated to produce the moving image intended.
definition: Setzt eine Ressource in Beziehung zu einer Geschwindigkeit, mit der ein projizierbarer Datenträger betrieben werden muss, um das beabsichtigte Bewegtbild zu erzeugen. @de
definition: يربط بين مصدر وسرعة يجب أن يشغل بها حامل عرض لكي ينتج عنه الصور المتحركة المطلوبة. @ar
definition: 将一种资源与一种投影载体要产生所期望的动态图像必须操作的速度关联起来。 @zh-hans

has playing speed
lexical alias: playingSpeed.en
status: Published
type: Property
label: har omdrejningshastighed @da
label: hat Abspielgeschwindigkeit @de
label: heeft afspeelsnelheid @nl
label: lejátszási sebessége a következő: @hu
label: toistonopeus aineistolle @fi
label: çalma hızı ile ilişkilidir @tr
label: له سرعة تشغيل @ar
label: 有播放速度 @zh-hans
sub property of: has sound characteristic
definition: Bir kaynağı, amaçlanan sesi üretmek için bir ses taşıyıcısının çalıştırılması gereken hız ile ilişkilendirir. @tr
definition: Hozzákapcsol egy forrást egy sebességhez, amelyen egy hanghordozónak működnie kell, hogy a kívánt hangot elő tudják állítani. @hu
definition: Liittää aineiston nopeuteen, jolla äänitallenne on toistettava äänen tuottamiseksi tarkoitetulla tavalla. @fi
definition: Relaterer en ressource til en hastighed, som en lydbærer skal betjenes ved for at producere den ønskede lyd. @da
definition: Relates a resource to a speed at which an audio carrier must be operated to produce the sound intended.
definition: Setzt eine Ressource in Beziehung zu einer Geschwindigkeit, mit der ein Tonträger für die korrekte Wiedergabe abgespielt werden muss. @de
definition: يربط بين مصدر وسرعة يجب أن يشغل بها حامل صوت لكي ينتج الصوت المطلوب. @ar
definition: 将一种资源与一种音频载体要产生所期望的声音必须操作的速度关联起来。 @zh-hans

has encoded bitrate
lexical alias: encodedBitrate.en
status: Published
type: Property
label: har kodet bitrate @da
label: hat Bitrate @de
label: heeft gecodeerde bitsnelheid @nl
label: kodlanmış bit hızı ile ilişkilidir @tr
label: koodattu bittinopeus aineistolle @fi
label: kódolt bitrátája a következő: @hu
label: له معدل للبتات المُشفرة @ar
label: 有编码的比特率 @zh-hans
sub property of: has digital file characteristic
inverse of: is assistant to
definition: Bir kaynağı, ses, video veya diğer içerik akışının oynatılmak üzere tasarlandığı bir hız ile ilişkilendirir. @tr
definition: Hozzákapcsol egy forrást egy sebességhez, amelyen egy sztrímelt audió, videó vagy egyéb tartalom terv szerint lejátszódik. @hu
definition: Nopeus, jolla suoratoistoääni, -video tai muu sisältö on suunniteltu toistettavan. @fi
definition: Relaciona un recurs amb una velocitat a la qual es dissenya l’estríming d’àudio, vídeo o un altre contingut @ca
definition: Relaterer en ressource til en hastighed, som streamet lyd, video etc. er skabt til at spille ved. @da
definition: Relates a resource to a speed at which streaming audio, video, or other content is designed to play..
definition: Setzt eine Ressource in Beziehung zu einer Geschwindigkeit, mit der Audio-, Video-Streaming und so weiter abgespielt werden. @de
definition: يربط بين مصدر وسرعة تم بها تصميم بيانات صوتية متدفقة عبر الانترنت، فيديو، أو أي محتوى آخر للتشغيل. @ar
definition: 将一种资源与流播音频、视频或其他内容被设计播放的速度关联起来。 @zh-hans

has preferred title of resource
lexical alias: preferredTitleOfResource.en
status: Published
type: Property
label: aineiston ensisijainen nimeke @fi
label: forrás előnyben részesített címe a következő: @hu
label: har foretrukken titel for ressourcen @da
label: hat bevorzugten Titel einer Ressource @de
label: heeft geprefereerde titel van resource @nl
label: tercih edilen kaynak başlığı ile ilişkilidir @tr
label: له عنوان مفضل لمصدر @ar
label: 有资源的首选题名 @zh-hans
sub property of: has title of resource
inverse of: is preferred title of resource of
definition: Bir kaynağı, belirli bir uygulama veya bağlamda tercih edilmek üzere seçilmiş bir kaynak başlığıyla ilişkilendirir. @tr
definition: Hozzákapcsol egy forrást egy forrás címéhez, amelyet egy adott alkalmazásban vagy összefüggésben előnyben részesítenek. @hu
definition: Liittää aineiston nimekkeeseen, joka on valittu ensisijaiseksi tietyssä sovelluksessa tai kontekstissa. @fi
definition: Relaciona un recurs amb un nomen que és un títol d’un recurs que se selecciona com a preferent en una aplicació o un context específic. @ca
definition: Relaterer en ressource til en titel eller titelform, der er valgt til identifikation af ressourcen. @da
definition: Relates a resource to a nomen that is a title of resource that is selected for preference in a specific application or context.
definition: Setzt eine Ressource in Beziehung zu einem Titel einer Ressource, der in einer bestimmten Anwendung oder in einem bestimmten Kontext als Vorzugsform bestimmt wird. @de
definition: يربط بين مصدر وعنوان مصدر اُختير كعنوان مُفضل في تطبيق محدد أو سياق محدد. @ar
definition: 将一种资源与作为资源的一个题名并在一个特定的应用或语境下被首选的一个命名关联起来。 @zh-hans

has parallel title proper
has subproperty: has parallel title of series
lexical alias: parallelTitleProper.en
status: Published
type: Property
label: aineiston rinnakkainen päänimeke @fi
label: har parallel hovedtitel @da
label: hat Paralleltitel @de
label: heeft parallelle hoofdtitel @nl
label: paralel esas başlık ile ilişkilidir @tr
label: párhuzamos főcíme a következő: @hu
label: له عنوان موزاي مُنَاسِب @ar
label: 有并列正题名 @zh-hans
sub property of: has title
inverse of: is parallel title proper of
definition: Bir kaynağı başka bir dilde veya komut dosyasındaki bir başlıkla ilişkilendirir. @tr
definition: Hozzákapcsol egy forrást egy főcímhez egy másik nyelven vagy írásmódban. @hu
definition: Liittää aineiston päänimekkeeseen toisella kielellä tai kirjoitusjärjestelmällä. @fi
definition: Relaciona un recurs amb un nomen que és un títol propi en una altra llengua o escriptura. @ca
definition: Relaterer en ressource til en hovedtitel på et andet sprog og/eller i et andet alfabet. @da
definition: Relates a resource to a nomen that is a title proper in another language or script.
definition: Setzt eine Ressource in Beziehung zu einem Haupttitel in einer anderen Sprache oder einer anderen Schrift. @de
definition: يربط بين مصدر وعنوان مُنَاسِب بلغة أخرى أو نص آخر. @ar
definition: 将一种资源与作为用另一种语言或文字的一个正题名的一个命名关联起来。 @zh-hans
scope note: An alternative title in another language and/or script is treated as part of the parallel title proper.
scope note: Başka bir dilde ve / veya komut dosyasındaki alternatif bir başlık, uygun paralel başlığın bir parçası olarak ele alınır. @tr
scope note: Ein Alternativtitel in einer anderen Sprache oder einer anderen Schrift wird als Teil des Paralleltitels behandelt. @de
scope note: En alternativ titel på et andet sprog eller i et andet alfabet behandles som del af en parallel hovedtitel. @da
scope note: Más nyelven és/vagy írásmódban a vagylagos címet a párhuzamos főcím részeként kell kezelni. @hu
scope note: Vaihtoehtoista nimekettä toisella kielellä ja/tai kirjoitusjärjestelmällä pidetään rinnakkaisen päänimekkeen osana. @fi
scope note: يتم التعامل مع عنوان بديل في لغة و / أو نص آخر كجزء من العنوان الموازي المناسب. @ar
scope note: 用另一种语言和/或文字的一种交替题名被处理为并列正题名的部分。 @zh-hans

has parallel title of series
has subproperty: has parallel title proper of subseries (Deprecated)
lexical alias: parallelTitleOfSeries.en
status: Published
type: Property
label: har parallel hovedtitel for serie @da
label: hat Paralleltitel einer Reihe @de
label: heeft parallelle hoofdtitel van reeks @nl
label: párhuzamos sorozatcíme a következő: @hu
label: sarjan rinnakkainen nimeke aineistolle @fi
label: serinin paralel başlığı ile ilişkilidir @tr
label: له عنوان موزاي لسلسلة @ar
label: 有丛编的并列题名 @zh-hans
sub property of: has parallel title proper
inverse of: is parallel title of series of
definition: Bir kaynağı başka bir dilde veya alfabedeki bir dizinin başlığıyla ilişkilendirir. @tr
definition: Hozzákapcsol egy forrást egy sorozat címéhez egy másik nyelven vagy írásmódban. @hu
definition: Liittää aineiston sarjan nimekkeeseen toisella kielellä tai kirjoitusjärjestelmällä. @fi
definition: Relaciona un recurs amb un nomen que és un títol d’una col·lecció en una altra llengua o escriptura. @ca
definition: Relaterer en ressource til en hovedtitel for en serie på et andet sprog og/eller i et andet alfabet. @da
definition: Relates a resource to a nomen that is a title of series in another language or script.
definition: Setzt eine Ressource in Beziehung zu einem Titel einer Reihe, der in einer anderen Sprache oder einer anderen Schrift vorliegt. @de
definition: يربط بين مصدر وعنوان سلسلة بلغة أخرى أو نص آخر. @ar
definition: 将一种资源与作为用另一种语言或文字的一个丛编题名的一个命名关联起来。 @zh-hans

has parallel title proper of subseries (Deprecated)
lexical alias: parallelTitleProperOfSubseries.en
status: Deprecated
type: Property
label: har parallel hovedtitel for underserie @da
sub property of: has parallel title of series
definition: Relaterer en ressource til en hovedtitel for en underserie på et andet sprog og/eller i et andet alfabet. @da
definition: Relates a resource to a title proper of a subseries in another language or script. (Deprecated)

has place of death
lexical alias: placeOfDeath.en
status: Published
type: Property
label: halálozásának helye a következő: @hu
label: har dødssted @da
label: hat Sterbeort @de
label: heeft plaats van overlijden @nl
label: toimijan kuolinpaikka @fi
label: ölüm yeri ile ilişkilidir @tr
label: له مكان وفاة @ar
label: 有去世地点 @zh-hans
sub property of: has related place of agent
inverse of: is place of death of
definition: Bir temsilciyi, bir temsilcinin öldüğü bir yerle ilişkilendirir. @tr
definition: Hozzákapcsol egy ágenst egy helyhez, ahol az ágens elhunyt. @hu
definition: Liittää toimijan paikkaan, jossa toimija kuoli. @fi
definition: Relaterer en ressource til en landsby, by, region, stat og/eller land, hvor en agent døde. @da
definition: Relates an agent to a place where an agent dies.
definition: Setzt einen Akteur in Beziehung zu einem Geografikum, in dem ein Akteur gestorben ist. @de
definition: يربط بين وكيل ومكان توفي فيه وكيل. @ar
definition: 将一个行为者与一个行为者去世的地点关联起来。 @zh-hans

has place of birth
lexical alias: placeOfBirth.en
status: Published
type: Property
label: doğum yeri ile ilişkilidir @tr
label: har fødested @da
label: hat Geburtsort @de
label: heeft geboorteplaats @nl
label: születésének helye a következő: @hu
label: toimijan synnyinpaikka @fi
label: له مكان ميلاد @ar
label: 有出生地点 @zh-hans
sub property of: has related place of agent
inverse of: is place of birth of
definition: Bir temsilciyi, bir temsilcinin doğduğu yerle ilişkilendirir. @tr
definition: Hozzákapcsol egy ágenst egy helyhez, ahol az ágens született. @hu
definition: Liittää toimijan paikkaan, jossa toimija syntyi. @fi
definition: Relaciona un agent amb un lloc on és nascut un agent. @ca
definition: Relaterer en ressource til en landsby, by, region, stat og/eller land, hvor en agent blev født. @da
definition: Relates an agent to a place where an agent is born.
definition: Setzt einen Akteur in Beziehung zu einem Geografikum, in dem ein Akteur geboren ist. @de
definition: يربط بين وكيل ومكان وُلِد فيه وكيل. @ar
definition: 将一个行为者与一个行为者出生的地点关联起来。 @zh-hans

has recording medium
lexical alias: recordingMedium.en
status: Published
type: Property
label: aineiston äänen tallennusmedian tyyppi @fi
label: har optagemedie @da
label: hat Aufzeichnungsmedium @de
label: heeft opnamemedium @nl
label: kayıt ortamı ile ilişkilidir @tr
label: rögzítőmédiuma a következő: @hu
label: له وسيط تسجيل @ar
label: 有录音媒介 @zh-hans
sub property of: has sound characteristic
definition: Bir kaynağı, bir ses taşıyıcısına ses kaydetmek için kullanılan bir ortam türüyle ilişkilendirir. @tr
definition: Hozzákapcsol egy forrást egy médiumtípushoz, amelyet egy hanghordozóra való hangrögzítésre használnak. @hu
definition: Liittää aineiston tallennusmediaan, jolla ääni tallennetaan äänitallenteelle. @fi
definition: Relaterer en ressource til en type af medie, der er anvendt til at optage lyd på en lydbærer. @da
definition: Relates a resource to a type of medium used to record sound on an audio carrier.
definition: Setzt eine Ressource in Beziehung zu einer Art des Mediums, das verwendet wird, um Ton auf einem Tonträger festzuhalten. @de
definition: يربط بين مصدر ونوع وسيط مستخدم في تسجيل الصوت على حامل صوتي. @ar
definition: 将一种资源与用于在音频载体上记录声音的媒介类型关联起来。 @zh-hans

has base material for microfilm, microfiche, photographic film, and motion picture film (Deprecated)
lexical alias: baseMaterialForMicrofilmMicrofichePhotographicFilmAndMotionPictureFilm.en
status: Deprecated
type: Property
definition: Relates a resource to the underlying physical material of a microfilm, microfiche, photographic film, or motion picture film resource. (Deprecated)

has base material
lexical alias: baseMaterial.en
status: Published
type: Property
label: aineiston pohjamateriaali @fi
label: alapanyaga a következő: @hu
label: har basismateriale @da
label: hat Trägermaterial @de
label: heeft basismateriaal @nl
label: temel malzeme ile ilişkilidir @tr
label: له مادة أساسية @ar
label: 有基底材料 @zh-hans
sub property of: has material
definition: Bir kaynağı, kaynağın altında yatan fiziksel bir malzemeyle ilişkilendirir. @tr
definition: Hozzákapcsol egy forrást egy forrás mögöttes fizikai anyagához. @hu
definition: Liittää aineiston aineiston fyysiseen pohjamateriaaliin. @fi
definition: Relaterer en ressource til en manifestations underliggende fysiske materiale. @da
definition: Relates a resource to an underlying physical material of a resource.
definition: Setzt eine Ressource in Beziehung zu einem zugrunde liegenden, physischen Material einer Ressource. @de
definition: يربط بين مصدر ومادة ملموسة أساسية لمصدر. @ar
definition: 将一种资源与一种资源的下层物理材料关联起来。 @zh-hans

has key title
lexical alias: keyTitle.en
status: Published
type: Property
label: aineiston avainnimeke @fi
label: ana başlık ile ilişkilidir @tr
label: har nøgletitel @da
label: hat Key Title @de
label: heeft key title @nl
label: kulcscíme a következő: @hu
label: له عنوان مُفتاحي @ar
label: 有识别题名 @zh-hans
sub property of: has related nomen of resource
inverse of: is key title of
definition: Bir kaynağı, bir ISSN kayıt kuruluşu tarafından atanan bir kaynak başlığıyla ilişkilendirir. @tr
definition: Hozzákapcsol egy forrást egy forráscímhez, amelyet egy ISSN nyilvántartó ügynökség utal ki. @hu
definition: Liittää aineiston ISSN-rekisteröintiyksikön antamaan aineiston nimekkeeseen. @fi
definition: Relaciona un recurs amb un nomen que és un títol d’un recurs que és assignat per una agència de registre de l’ISSN. @ca
definition: Relaterer en ressource til et unikt navn, der gives til en ressource af et ISSN-registreringsorgan. @da
definition: Relates a resource to a nomen that is a title of resource that is assigned by an ISSN registration agency.
definition: Setzt ein Werk in Beziehung zu einem Titel eines Werks, der durch eine ISSN-Registrierungsstelle vergeben wird. @de
definition: يربط بين مصدر وعنوان مصدر خصصته وكالة تسجيل ترقيم دولي موحد للدوريات. @ar
definition: 将一种资源与作为被国际标准连续出版物号一个注册机构分配之资源的一个题名的一个命名关联起来。 @zh-hans

has date of death
lexical alias: dateOfDeath.en
status: Published
type: Property
label: halálozásának ideje a következő: @hu
label: har dødsår @da
label: hat Sterbedatum @de
label: heeft datum van overlijden @nl
label: toimijan kuolinaika @fi
label: ölüm tarihi ile ilişkilidir @tr
label: له تاريخ وفاة @ar
label: 有去世日期 @zh-hans
sub property of: has date associated with agent (Deprecated)
inverse of: is date of death of
definition: Bir temsilciyi, bir temsilcinin öldüğü yılla ilişkilendirir. @tr
definition: Hozzákapcsol egy ágenst egy évhez, amikor az ágens elhunyt. @hu
definition: Liittää toimijan vuoteen, jona toimija kuoli. @fi
definition: Relaciona un agent amb un interval de temps durant el qual un agent mor. @ca
definition: Relaterer en ressource til det år en agent døde. @da
definition: Relates an agent to a timespan during which an agent died.
definition: Setzt einen Akteur in Beziehung zu einem Jahr, in dem ein Akteur gestorben ist. @de
definition: يربط بين وكيل وعام توفى فيه وكيل. @ar
definition: 将一个行为者与一个行为者去世的时间段关联起来。 @zh-hans

has date of birth
lexical alias: dateOfBirth.en
status: Published
type: Property
label: doğum tarihi ile ilişkilidir @tr
label: har fødselsår @da
label: hat Geburtsdatum @de
label: heeft geboortedatum @nl
label: születésének ideje a következő: @hu
label: toimijan syntymäaika @fi
label: له تاريخ ميلاد @ar
label: 有出生日期 @zh-hans
sub property of: has date associated with agent (Deprecated)
inverse of: is date of birth of
definition: Bir temsilciyi, bir temsilcinin doğduğu yılla ilişkilendirir. @tr
definition: Hozzákapcsol egy ágenst egy évhez, amikor az ágens született. @hu
definition: Liittää toimijan vuoteen, jona toimija syntyi. @fi
definition: Relaciona un agent amb un interval de temps durant el qual un agent va néixer. @ca
definition: Relaterer en ressource til det år en agent blev født. @da
definition: Relates an agent to a timespan during which an agent was born.
definition: Setzt einen Akteur in Beziehung zu einem Jahr, in dem ein Akteur geboren wurde. @de
definition: يربط بين وكيل وعام وُلِد فيه وكيل. @ar
definition: 将一个行为者与一个行为者出生的时间段关联起来。 @zh-hans

is writer of added lyrics of (Deprecated)
see also: is lyricist of
lexical alias: writerOfAddedLyricsOf.en
status: Deprecated
type: Property
label: er forfatter af tilføjede sangtekster til @da
sub property of: is writer of added text of (Deprecated)
inverse of: has writer of added lyrics (Deprecated)
definition: Relaterer en forfatter af ord, der er tilføjet til en musikressource til en ressource. @da
definition: Relates an agent to a resource that includes a contribution of adding written words to music. (Deprecated)
scope note: Forfattelse af sangtekster i samarbejde med en komponist for at skabe en originalressource er ikke omfattet. @da
scope note: Writing of lyrics in collaboration with a composer to form an original resource is excluded.. (Deprecated)

is appellee of
lexical alias: appelleeOf.en
status: Published
type: Property
label: er indstævnet af @da
label: fellebezési alperese a következőnek: @hu
label: is gedaagde van @nl
label: ist Berufungsbeklagte/Berufungsbeklagter/Revisionsbeklagte/Revisionsbeklagter von @de
label: muutoksenhakijan (toimijan) vastapuoli @fi
label: temyiz edilenidir @tr
label: له مُستأنف ضده @ar
label: 是……的被上诉者 @zh-hans
sub property of: is other agent associated with resource of (Deprecated)
inverse of: has appellee
definition: Bir temsilciyi, bir temsilciye itiraz eden bir alt mahkemenin kararını kaydeden bir yüksek mahkemenin yasal kaynağıyla ilişkilendirir. @tr
definition: Hozzákapcsol egy ágenst egy felsőbb bíróság jogi forrásához, amely rögzíti egy alsóbb szintű bíróságnak azt az ítéletét, amely egy ágens ellenében fellebbez. @hu
definition: Liittää toimijan ylemmän oikeusasteen aineistoon, johon sisältyy toimijan alemmasta oikeusasteesta saama langettava päätös. @fi
definition: Relaterer en agent mod hvem der er gjort indsigelse over en underrets beslutning, der er registreret i en juridisk ressource fra en højere retsinstans til en ressource. @da
definition: Relates an agent to a legal resource of a higher court that records a decision of a lower court that appeals against an agent.
definition: Setzt einen Akteur in Beziehung zu einer juristischen Ressource einer höheren Instanz, das ein Gerichtsurteil festhält, bei dem gegen einen Akteur Rechtsmittel gegen ein Gerichtsurteil einer unteren Instanz eingelegt werden. @de
definition: يربط بين وكيل ومصدر قانوني لمحكمة أعلى تُقر حكمًا صادرًا عن محكمة أدنى يُستأنف ضد وكيل. @ar
definition: 将一个行为者与一种记录下级法院起诉一个行为者的决定的上级法院的法律资源关联起来。 @zh-hans

is other agent associated with resource of (Deprecated)
has subproperty: is degree granting institution of
has subproperty: is host institution of
has subproperty: is production company of
has subproperty: is court governed of
has subproperty: is medium of
has subproperty: is appellee of
has subproperty: is dedicator of
has subproperty: is curator of (Deprecated)
has subproperty: is honouree of
has subproperty: is illuminator of
has subproperty: is producer of
has subproperty: is director of
has subproperty: is restorationist of
has subproperty: has sponsored resource of agent
has subproperty: is director of photography of
has subproperty: is dedicatee of
has subproperty: is addressee of
has subproperty: is appellant of
has subproperty: is binder of
has subproperty: is plaintiff of
has subproperty: is inscriber of
has subproperty: is judge of
has subproperty: is defendant of
has subproperty: is annotator of
has subproperty: is autographer of
has subproperty: is issuing agent of
has subproperty: is degree committee member of
has subproperty: is participant in treaty of
has subproperty: is researcher of
has subproperty: is organizer of
has subproperty: is editorial director of
has subproperty: is founder agent of resource of
lexical alias: otherAgentAssociatedWithResourceOf.en
status: Deprecated
type: Property
label: er anden agent forbundet med ressource @da
inverse of: has other agent associated with resource (Deprecated)
definition: Relaterer en agent, der er forbundet med en ressource på en anden måde end som ophav til en ressource. @da
definition: Relates an agent to a resource that involves a responsibility other than creating, having custody, owning, producing, publishing, distributing, or manufacturing. (Deprecated)

is dedicator of
lexical alias: dedicatorOf.en
status: Published
type: Property
label: dedikálója a következőnek: @hu
label: er tilegner af @da
label: is opdrager van @nl
label: ist Widmende/Widmender von @de
label: ithaf edenidir @tr
label: omistuskirjoitus aineistossa @fi
label: هو مُهدي كتاب @ar
label: 是……的题献者 @zh-hans
sub property of: is other agent associated with resource of (Deprecated)
inverse of: has dedicator
definition: Bir temsilciyi, ilgili bir temsilcinin ilhamının veya desteğinin onayı olarak atanan bir kaynakla ilişkilendirir. @tr
definition: Hozzákapcsol egy ágenst egy forráshoz, amelyet a forráshoz kapcsolódó ágens ösztönzésének vagy támogatásának köszöneteként jelölnek meg. @hu
definition: Liittää toimijan aineistoon, joka on omistettu liittyvälle toimijalle kiitoksena inspiraatiosta tai tuesta. @fi
definition: Relaterer en agent, som har tilegnet en ressource til en ressource. @da
definition: Relates an agent to a resource that is assigned as an acknowledgement of the inspiration or support of a related agent.
definition: Setzt einen Akteur in Beziehung zu einer Ressource, die als Zeichen der Anerkennung oder Unterstützung einem in Beziehung stehenden Akteur gewidmet ist. @de
definition: يربط بين وكيل ومصدر تم تعيينه باعتباره إقرارًا بإلهام أو دعم وكيل ذي صلة. @ar
definition: 将一个行为者与被指定对一个相关行为者的启发或支持之感谢的一种资源关联起来。 @zh-hans

is curator of (Deprecated)
lexical alias: curatorOf.en
status: Deprecated
type: Property
label: er kurator af @da
label: is curator van @nl
label: ist Kuratorin/Kurator von @de
label: kuraattori aineistossa @fi
label: kurátora a következőnek: @hu
label: هو أَمِين معرض لـ @ar
sub property of: is other agent associated with resource of (Deprecated)
inverse of: has curator (Deprecated)
definition: Hozzákapcsol egy ágenst egy forráshoz, amelyet egy kiállításba vagy gyűjteménybe aggregáltak vagy szerveztek. @hu
definition: Liittää toimijan aineistoon, joka on koottu tai järjestetty näyttelyksi tai kokoelmaksi. @fi
definition: Relaterer en agent der har udtænkt, samlet og/eller arrangeret en udstilling, samling eller et andet eksemplar til en ressource. @da
definition: Relates an agent to a resource that is aggregated or organized in an exhibition or collection. (Deprecated)
definition: Setzt einen Akteur in Beziehung zu einer Ressource, die in einer Ausstellung oder Sammlung aggregiert oder organisiert ist. @de
definition: يربط بين وكيل ومصدر تم تجميعه أو تنظيمه في معرض أو مجموعة. @ar

is surveyor of
lexical alias: surveyorOf.en
status: Published
type: Property
label: er landmåler i @da
label: földmérője a következőnek: @hu
label: is landmeter van @nl
label: ist Landvermesserin/Landvermesser von @de
label: maanmittari (toimija) aineistossa @fi
label: topograf @tr
label: هو مسّاح لـ @ar
label: 是……的测绘者 @zh-hans
sub property of: is contributor of (Deprecated)
inverse of: has surveyor
definition: Bir temsilciyi, temsil edilen bir coğrafi alan için ölçümler veya boyutsal ilişkiler sağlama temsilcisinin katkısını içeren bir kartografik kaynakla ilişkilendirir. @tr
definition: Hozzákapcsol egy ágenst egy kartográfiai forráshoz, amely magában foglalja az ágens közreműködését a reprezentált földrajzi terület mérésében vagy dimenziós összefüggéseinek szolgáltatásában. @hu
definition: Liittää toimijan kartografiseen aineistoon, jossa toimija on osallisena maantieteellisen alueen mittojen tai mittasuhteiden tuottamisessa. @fi
definition: Relaterer en agent, der har bidraget til en kartografisk ressource ved at sørge for opmålinger eller målestoksforhold til et repræsenteret geografisk område til en ressource. @da
definition: Relates an agent to a cartographic resource that incorporates a contribution by an agent of providing measurements or dimensional relationships for a geographic area that is represented.
definition: Setzt einen Akteur in Beziehung zu einer kartografischen Ressource, zu der ein Akteur beiträgt, indem er Messwerte oder Abmessungsverhältnisse für einen dargestellten geografischen Bereich zur Verfügung stellt. @de
definition: يربط بين وكيل ومصدر رسم خرائطي يتضمن إسهام وكيل بتقديم القياسات أوالعلاقات بين الأبعاد لمنطقة جغرافية يتم تمثيلها. @ar
definition: 将一个行为者与包括为一个地理区域提供测量或尺寸关系的一个行为者的贡献的一种地图资源关联起来。 @zh-hans

is animator of
see also: is artist of
lexical alias: animatorOf.en
status: Published
type: Property
label: animaattori (toimija) aineistossa @fi
label: animatörüdür @tr
label: animátora a következőnek: @hu
label: er animator til @da
label: is animator van @nl
label: ist Trickfilmzeichnerin/Trickfilmzeichner von @de
label: هو فنان رسوم متحركة لـ @ar
label: 是……的动画师 @zh-hans
sub property of: is contributor of (Deprecated)
inverse of: has animator
definition: Bir temsilciyi, hareketsiz nesnelere veya çizimlere görünür hareket veren temsilcinin katkısını içeren bir kaynakla ilişkilendirir. @tr
definition: Hozzákapcsol egy ágenst egy forráshoz, amely magában foglalja az ágens közreműködését élettelen tárgyak vagy rajzok látszólagos mozgatásában. @hu
definition: Liittää toimijan aineistoon, jossa toimija on osallisena tuottamalla näennäistä liikettä elottomiin esineisiin tai piirroksiin. @fi
definition: Relaterer en agent der der har bidraget til en levende billed-ressource eller et computerprogram ved at give en illusion af bevægelse til livløse genstande eller tegninger til en ressource. @da
definition: Relates an agent to a resource that includes a contribution by an agent of giving apparent movement to inanimate objects or drawings.
definition: Setzt einen Akteur in Beziehung zu einer Ressource, zu der ein Akteur beiträgt, indem er unbelebte Objekte oder Zeichnungen in scheinbare Bewegung versetzt. @de
definition: يربط بين وكيل ومصدر يتضمن إسهام وكيل لإعطاء حركة واضحة لكائنات غير حية أو رسومات. @ar
definition: 将一个行为者与包括一个行为者对给予无生命对象或绘画以貌似运动之贡献的一种资源关联起来。 @zh-hans
scope note: Animasyonlu çizimlerin oluşturulması hariçtir. @tr
scope note: Az animált rajzok megalkotása nem tartozik ide. @hu
scope note: Creation of the drawings that are animated is excluded.
scope note: Darunter fällt nicht die Schaffung der Zeichnungen, die animiert werden. @de
scope note: Ei koske animaatiopiirrosten tekijää. @fi
scope note: Skabelse af de tegninger der er animeret er ikke omfattet. @da
scope note: يُستبعد إنشاء الرسومات المتحركة. @ar
scope note: 不包括动画图的创作。 @zh-hans

is arranger of music of
see also: is composer of
lexical alias: arrangerOfMusicOf.en
status: Published
type: Property
label: er musikarrangør af @da
label: is arrangeur van muziek van @nl
label: ist Arrangeurin/Arrangeur von @de
label: müziğinin aranjörüdür @tr
label: sovittaja (toimija) aineistossa @fi
label: zenei hangszerelője a következőnek: @hu
label: هو موزع موسيقي لـ @ar
label: 是……的音乐改编者 @zh-hans
sub property of: is contributor of (Deprecated)
inverse of: has arranger of music
definition: Bir temsilciyi, kaynağın başlangıçta amaçlandığından farklı bir performans ortamı için bir müzik bestesini yeniden yazan temsilcinin katkısını içeren bir kaynakla ilişkilendirir. @tr
definition: Hozzákapcsol egy ágenst egy forráshoz, amely magában foglalja az ágens közreműködését zenei kompozíció újraírásában, amikor az előadásmédiuma különbözik attól, mint amelyre a forrást eredetileg szánták. @hu
definition: Liittää toimijan aineistoon, jossa toimija on osallisena muokkaamalla sävellyksen alkuperäisteoksesta poikkeavalle esityskokoonpanolle. @fi
definition: Relaterer en agent der har bidraget til en musikressource ved at omskrive kompositionen til en anden besætning end den, ressourcen oprindeligt var beregnet til til et ressource. @da
definition: Relates an agent to a resource that includes a contribution by an agent of rewriting a musical composition for a medium of performance different from that for which the resource was originally intended.
definition: Setzt einen Akteur in Beziehung zu einer Ressource, zu der ein Akteur beiträgt, indem er eine Komposition für eine bestimmte Besetzung umschreibt, die sich von der Originalbesetzung unterscheidet, für die die Ressource ursprünglich konzipiert war. @de
definition: يربط بين وكيل ومصدر يتضمن إسهام وكيل في إعادة كتابة لحن موسيقي لوسيط أداء يختلف عن الوسيط الذي كان العمل مقررا له أصلاً. @ar
definition: 将一个行为者与包括一个改写音乐作曲用于不同于资源最初意图的一个表演媒介的一个行为者的贡献的一种资源关联起来。 @zh-hans

is writer of added text of (Deprecated)
has subproperty: is writer of added lyrics of (Deprecated)
lexical alias: writerOfAddedTextOf.en
status: Deprecated
type: Property
label: er forfatter til tilføjet tekst til @da
sub property of: is writer of supplementary content of (Deprecated)
inverse of: has writer of added text (Deprecated)
definition: Relaterer en agent der har bidraget til et udtryk af en fortrinsvisikke-tekstlig ressource ved at sørge for tekst til den ikke-tekstlige ressource til en ressource. @da
definition: Relates an agent to a resource that includes a contribution of adding text, such as captions for photographs or descriptions of maps. (Deprecated)

is draftsman of
lexical alias: draftsmanOf.en
status: Published
type: Property
label: er teknisk tegner af @da
label: is technisch tekenaar van @nl
label: ist technische Zeichnerin/technischer Zeichner von @de
label: műszaki rajzolója a következő: @hu
label: piirtäjä (toimija) aineistossa @fi
label: teknik ressamıdır @tr
label: هو رسام هندسي لـ @ar
label: 是……的绘图者 @zh-hans
sub property of: is contributor of (Deprecated)
inverse of: has draftsman
definition: Bir temsilciyi, binalar, gemiler, uçaklar, makineler, nesneler vb. için ayrıntılı planlar veya çizimler yapan bir temsilcinin katkısını içeren bir kaynakla ilişkilendirir. @tr
definition: Hozzákapcsol egy ágenst egy forráshoz, amely magában foglalja az ágens közreműködését épületek, hajók, repülőgépek, gépek, objektumok, stb. részletes terveinek vagy rajzainak elkészítésében. @hu
definition: Liittää toimijan aineistoon, jossa toimija on osallisena tuottamalla tarkkoja suunnitelmia tai piirroksia rakennuksista, laivoista, lentokoneista, laitteista, esineistä tms. @fi
definition: Relaterer en agent, der har bidraget til en ressource af en arkitekt, opfinder etc. ved at lave detaljerede planer eller tegninger til bygninger, skibe, luftfartøjer, maskiner, genstande etc. til en ressource. @da
definition: Relates an agent to a resource that includes a contribution by an agent of making detailed plans or drawings for buildings, ships, aircraft, machines, objects, etc.
definition: Setzt einen Akteur in Beziehung zu einer Ressource, zu der ein Akteur beiträgt, indem er detaillierte Pläne oder Zeichnungen für Gebäude, Schiffe, Flugzeuge, Maschinen, Objekte oder ähnliches erstellt. @de
definition: يربط بين وكيل ومصدر يتضمن إسهام وكيل في وضع خطط أو رسومات مفصلة للمباني، السفن، الطائرات، الآلات، والأشياء، إلخ. @ar
definition: 将一个行为者与包括为建筑物、船舶、飞行器、机械装置、物体等制作详细平面图或绘制草图的一个行为者的贡献的一种资源关联起来。 @zh-hans

is transcriber of
see also: is arranger of music of
lexical alias: transcriberOf.en
status: Published
type: Property
label: er afskriver af @da
label: is transcribeerder van @nl
label: ist Transkribiererin/Transkribierer von @de
label: kopyalayıcı @tr
label: transkriboija (toimija) aineistossa @fi
label: átírója a következő: @hu
label: هو ناسخ لـ @ar
label: 是……的转写者 @zh-hans
sub property of: is contributor of (Deprecated)
inverse of: has transcriber
definition: Bir temsilciyi, daha önce yazılmamış veya belirtilmemiş içeriği yazan veya not eden veya bir gösterim sisteminden diğerine değiştiren temsilcinin katkısını içeren bir kaynakla ilişkilendirir. @tr
definition: Hozzákapcsol egy ágenst egy forráshoz, amely magában foglalja az ágens közreműködését korábban le nem írt vagy le nem jegyzett tartalom leírásában vagy lejegyzésében, vagy egyik jelölési rendszerről a másikra történő átvitelében. @hu
definition: Liittää toimijan aineistoon, jossa toimija on osallisena kirjoittamalla muistiin tai nuotintamalla aiemmin kirjoittamattoman tai nuotintamattoman sisällön tai muuttamalla sen nuotinnusjärjestelmästä toiseen. @fi
definition: Relaterer en agent, der har bidraget til en ressource ved at nedskrive eller notere uskrevet eller ikke-noteret indhold, eller ved at ændre det fra et notationssystem til et andet til en ressource. @da
definition: Relates an agent to a resource that includes a contribution by an agent of writing down or notating previously unwritten or unnotated content, or by changing it from one system of notation to another.
definition: Setzt einen Akteur in Beziehung zu einer Ressource, zu der ein Akteur beiträgt, indem er ungeschriebenen und nicht notierten Inhalt niederschreibt oder ihn von einem Notationssystem in ein anderes überträgt. @de
definition: يربط بين وكيل ومصدر يتضمن إسهام وكيل في كتابة أو تدوين محتوى لم يسبق كتابته أو تدوينه، أو عن طريق تغييره من نظام تدوين إلى آخر. @ar
definition: 将一个行为者与包括写下或记谱之前未写下或未记谱的内容或者将其从一种记谱体系改成另一种记谱体系的一个行为者的贡献的资源关联起来。 @zh-hans
scope note: Afskrift af en musikressource for et andet instrument eller optrædende gruppe er ikke omfattet. @da
scope note: Bir müzik kaynağının farklı bir enstrüman veya performans grubu için transkripsiyonu hariçtir. @tr
scope note: Darunter fällt keine Transkription einer Musikressource für ein anderes Instrument oder ein anderes aufführendes Ensemble. @de
scope note: Egy zenei forrás átirata egy másik hangszerre vagy előadói csoportra nem tartozik ide. @hu
scope note: Transcription of a musical resource for a different instrument or performing group is excluded.
scope note: Tähän ei kuulu musiikkiteoksen transkribointi eri soittimelle tai esitysryhmälle. @fi
scope note: يُستبعد نسخ مصدر موسيقي لآلة أو مجموعة أداء مختلفة. @ar
scope note: 不包括为不同乐器或表演组合所作的音乐资源的改写。 @zh-hans

is musical director of
lexical alias: musicalDirectorOf.en
status: Published
type: Property
label: er musikdirektør for @da
label: is muzikaal director van @nl
label: ist musikalische Leiterin/musikalischer Leiter von @de
label: musiikillinen johtaja (toimija) aineistossa @fi
label: müzik yönetmenidir @tr
label: zenei rendezője a következőnek: @hu
label: هو مُدير موسيقي لـ @ar
label: 是……的音乐总监 @zh-hans
sub property of: is contributor of (Deprecated)
inverse of: has musical director
definition: Bir temsilciyi, hareketli bir görüntü prodüksiyonu veya müzikal veya dramatik bir sunum veya eğlence için bestecilerin, ses editörlerinin ve ses karıştırıcılarının faaliyetlerini koordine eden bir temsilcisinin katkısını içeren bir kaynakla ilişkilendirir. @tr
definition: Hozzákapcsol egy ágenst egy forráshoz, amely magában foglalja az ágens közreműködését zeneszerzők, hangszerkesztők és hangkeverők feladatainak összehangolásában mozgókép-produkcióban, zenei vagy drámai előadásban vagy szórakoztató műsorban. @hu
definition: Liittää toimijan aineistoon, jossa toimija on osallisena koordinoimalla säveltäjien, äänileikkaajien ja äänimiksaajien toimintaa elokuvatuotannossa tai musiikki- tai näytelmäesityksessä. @fi
definition: Relaterer en agent, der har bidraget til en ressource ved at koordinere komponistens, tonemesterens og lydmiksernes aktiviteter ved en levende billedproduktion eller en musikalsk eller dramatisk præsentation eller underholdning til en ressource. @da
definition: Relates an agent to a resource that includes a contribution by an agent of coordinating the activities of composers, sound editors, and sound mixers for a moving image production or for a musical or dramatic presentation or entertainment.
definition: Setzt einen Akteur in Beziehung zu einer Ressource, zu der ein Akteur beiträgt, indem er die Arbeit der Komponistin/des Komponisten, der Tonarbeiterin/des Tonbearbeiters und der Tonmeisterin/des Tonmeisters für eine Bewegtbildproduktion oder eine musikalische oder dramatische Darbietung oder Aufführung koordiniert. @de
definition: يربط بين وكيل ومصدر يتضمن إسهام وكيل في تنسيق أنشطة ملحني، محرري، ومازجي الصوت لإنتاج فيلم أو لعرض موسيقي أو درامي أو ترفيهي. @ar
definition: 将一个行为者与包括为动态图像制作或者为音乐或戏剧呈现或娱乐协调作曲者、音响编辑、音响师活动的一个行为者的贡献的一种资源关联起来 @zh-hans

is costume designer of
lexical alias: costumeDesignerOf.en
status: Published
type: Property
label: er kostumedesigner til @da
label: is kostuumontwerper van @nl
label: ist Kostümbildnerin/Kostümbildner von @de
label: jelmeztervezője a következőnek: @hu
label: kostüm tasarımcısıdır @tr
label: puvustaja (toimija) aineistossa @fi
label: هو مصمم أزياء لـ @ar
label: 是……的服装设计者 @zh-hans
sub property of: is contributor of (Deprecated)
inverse of: has costume designer
definition: Bir temsilciyi, hareketli bir görüntü yapımı veya müzikal veya dramatik bir sunum ya da eğlence için kostüm tasarlayan bir temsilcisinin katkısını içeren bir kaynakla ilişkilendirir. @tr
definition: Hozzákapcsol egy ágenst egy forráshoz, amely magában foglalja az ágens közreműködését jelmezek tervezésében mozgókép-produkciókhoz, zenei vagy drámai előadásokhoz vagy szórakoztató műsorokhoz. @hu
definition: Liittää toimijan aineistoon, jossa toimija on osallisena suunnittelemalla elokuvatuotannon tai musiikki- tai näytelmäesityksen puvustuksen. @fi
definition: Relaterer en agent, der har bidraget til en ressource ved at designe kostumer til en levende billedproduktion eller til en musikalsk eller dramatisk præsentation eller underholdning til en ressource. @da
definition: Relates an agent to a resource that includes a contribution by an agent of designing costumes for a moving image production or for a musical or dramatic presentation or entertainment.
definition: Setzt einen Akteur in Beziehung zu einer Ressource, zu der ein Akteur beiträgt, indem er die Kostüme für eine Bewegtbildproduktion oder für eine musikalische oder dramatische Darbietung oder Aufführung entwirft. @de
definition: يربط بين وكيل ومصدر يتضمن إسهام وكيل في تصميم الأزياء لإنتاج صورة متحركة أو لعرض موسيقي أو درامي أو ترفيهي. @ar
definition: 将一个行为者与包括为动态图像制作或者为音乐或戏剧呈现或娱乐设计服装的一个行为者的贡献的一种资源关联起来。 @zh-hans

is translator of
lexical alias: translatorOf.en
status: Published
type: Property
label: er oversætter af @da
label: fordítója a következőnek: @hu
label: is vertaler van @nl
label: ist Übersetzerin/Übersetzer von @de
label: kääntäjä (toimija) aineistossa @fi
label: tercüman @tr
label: هو مُترجم لـ @ar
label: 是……的译者 @zh-hans
sub property of: is contributor of (Deprecated)
inverse of: has translator
definition: Bir temsilciyi, kaynağın dil içeriğini farklı bir dilde ifade etme temsilcisinin katkısını içeren bir kaynakla ilişkilendirir. @tr
definition: Hozzákapcsol egy ágenst egy forráshoz, amely magában foglalja az ágens közreműködését a forrás nyelvi tartalmának más nyelven történő kifejezésével. @hu
definition: Liittää toimijan aineistoon, jossa toimija on osallisena ilmaisemalla teoksen kielellisen sisällön toisella kielellä. @fi
definition: Relaciona un agent amb un recurs que inclou una contribució d’un agent expressant el contingut lingüístic del recurs una llengua diferent. @ca
definition: Relaterer en agent, der har bidraget til en ressource ved at udtrykke værkets sproglige indhold på et andet sprog end det, der er anvendt i tidligere udtryk af en oprindelig ressource til en ressource. @da
definition: Relates an agent to a resource that includes a contribution by an agent of expressing the linguistic content of the resource in a different language.
definition: Setzt einen Akteur in Beziehung zu einer Ressource, zu der ein Akteur beiträgt, indem er den sprachlichen Inhalt der Ressource in einer anderen Sprache ausdrückt. @de
definition: يربط بين وكيل ومصدر يتضمن إسهام وكيل في التعبير عن المحتوى اللغوي للمصدر بلغة مختلفة. @ar
definition: 将一个行为者与包括用另一种语言表达资源语言内容的一个行为者的贡献的一种资源关联起来。 @zh-hans
scope note: Aynı dilin farklı zaman dilimlerindeki biçimleri arasındaki dilsel içeriğin çevirisi de dahildir. @tr
scope note: Darunter fallen Übersetzungen sprachlichen Inhalts zwischen Formen derselben Sprache aus verschiedenen Zeitperioden. @de
scope note: En oversætter kan også oversætte sprogligt indhold mellem former af samme sprog fra forskellige tidsperioder. @da
scope note: Kääntäjä voi myös kääntää kielisisältöä saman kielen eri aikakausien kielimuotojen välillä. @fi
scope note: Translation of linguistic content between forms of the same language from different time periods is included.
scope note: Ugyanannak a nyelvnek a különböző időszakokból származó formái közötti nyelvi tartalom fordítása is ide tartozik. @hu
scope note: يتضمن ترجمة المحتوى اللغوي بين أشكال تكون من نفس اللغة من فترات زمنية مختلفة. @ar
scope note: 包括同一种语言的不同时期的形式之间的语言内容的翻译。 @zh-hans

is art director of
lexical alias: artDirectorOf.en
status: Published
type: Property
label: er kunstnerisk leder for @da
label: is artdirector van @nl
label: ist Art Director von @de
label: lavastaja (toimija) aineistossa @fi
label: művészeti vezetője a következő: @hu
label: sanat yönetmenidir @tr
label: هو مخرج فني لـ @ar
label: 是……的艺术总监 @zh-hans
sub property of: is contributor of (Deprecated)
inverse of: has art director
definition: Bir temsilciyi, hareketli görüntü yapımları için setler oluşturan sanatçıları ve zanaatkarları denetleyen temsilcinin katkısını içeren bir kaynakla ilişkilendirir. @tr
definition: Hozzákapcsol egy ágenst egy forráshoz, amely magában foglalja egy ágens közreműködését, aki művészeket és mozgókép-produkciókhoz díszletépítőket és mesterembereket felügyel. @hu
definition: Liittää toimijan aineistoon, jossa toimija on osallisena valvomalla taiteilijoita ja käsityöläisiä, jotka rakentavat lavasteita elokuvatuotantoihin. @fi
definition: Relaterer en agent, der har bidraget til en ressource ved at føre tilsyn med de kunstnere og håndværkere, der har bygget kulisserne til levende billedproduktioner til en ressource. @da
definition: Relates an agent to a resource that includes a contribution by an agent of overseeing artists and craftspeople who build sets for moving image productions.
definition: Setzt einen Akteur in Beziehung zu einer Ressource, zu der ein Akteur beiträgt, indem er Künstlerinnen/Künstler und Kunsthandwerkerinnen/Kunsthandwerker betreut, die Sets für Bewegtbildproduktionen aufbauen. @de
definition: يربط بين وكيل ومصدر يتضمن إسهام وكيل بالإشراف على الفنيين والحرفيين الذين يبنون مواقع لإنتاج الأفلام. @ar
definition: 将一个行为者与包括监督为动态图像制作建造布景的艺术家和艺人的一个行为者的贡献的一种资源关联起来。 @zh-hans

is performer of
has subproperty: is conductor of
has subproperty: is actor of
has subproperty: is onscreen presenter of
has subproperty: is dancer of
has subproperty: is instructor of
has subproperty: is host of
has subproperty: is moderator of
has subproperty: is puppeteer of
has subproperty: is panelist of
has subproperty: is instrumentalist of
has subproperty: is commentator of
has subproperty: is narrator of
has subproperty: is storyteller of
has subproperty: is speaker of
has subproperty: is singer of
lexical alias: performerOf.en
status: Published
type: Property
label: előadója a következőnek: @hu
label: er performer i @da
label: esittäjä (toimija) aineistossa @fi
label: is uitvoerder van @nl
label: ist Ausführende/Ausführender von @de
label: sanatçısıdır @tr
label: هو مؤدٍ لـ @ar
label: 是……的表演者 @zh-hans
sub property of: is contributor of (Deprecated)
inverse of: has performer
definition: Bir temsilciyi, müzik yapan, oynayan, dans eden, konuşan vb. temsilcinin katkılarını içeren bir kaynakla ilişkilendirir. @tr
definition: Hozzákapcsol egy ágenst egy forráshoz, amely magában foglalja az ágens közreműködését zene, színjátszás, tánc, élőbeszéd, stb. előadásában. @hu
definition: Liittää toimijan aineistoon, jossa toimija on osallisena tanssijana, näyttelijänä, puhujana tai muissa rooleissa, usein musiikillisessa tai draamallisessa esityksessä. @fi
definition: Relaterer en agent, der har bidraget til en ressource ved at opføre musik, spille skuespil, danse, tale etc., ofte i en musik- eller dramapræsentation etc. til en ressource. @da
definition: Relates an agent to a resource that includes a contribution by an agent of performing music, acting, dancing, speaking, etc.
definition: Setzt einen Akteur in Beziehung zu einer Ressource, zu der ein Akteur beiträgt, indem er Musik aufführt, schauspielt, tanzt oder spricht und so weiter. @de
definition: يربط بين وكيل ومصدر يتضمن إسهام وكيل في أداء موسيقى، تمثيل، رقص، حوار، إلخ. @ar
definition: 将一个行为者与包括表演音乐、扮演、舞蹈、说话等的一个行为者的贡献的一种资源关联起来。 @zh-hans

is court reporter of
has subproperty: is aggregator of
lexical alias: courtReporterOf.en
status: Published
type: Property
label: bírósági jegyzőkönyvvezetője a következőnek: @hu
label: er retsstenograf i @da
label: is rechtbankverslaggever van @nl
label: ist Gerichtsstenografin/Gerichtsstenograf von @de
label: kirjuri (toimija) aineistossa oikeudenkäyntiasiakirjoissa @fi
label: yazmanıdır @tr
label: هو كاتب محكمة لـ @ar
label: 是……的法院书记官 @zh-hans
sub property of: is contributor of (Deprecated)
inverse of: has court reporter
definition: Bir mahkemenin kararlarını yayınlanmak üzere hazırlayarak bir kaynağa katkıda bulunan bir temsilciyi bir kaynakla ilişkilendirir. @tr
definition: Hozzákapcsol egy ágenst, amely hozzájárul egy forráshoz azzal, hogy egy bíróság ítéleteit készíti elő közlésre. @hu
definition: Liittää toimijan aineistoon, jossa toimija on osallisena osalllisena valmistelemalla tuomioistuimen lausunnon julkaistavaksi. @fi
definition: Relaterer en agent, der har bidraget til en ressource ved at klargøre en domstols afgørelser til publicering til en ressource. @da
definition: Relates an agent who contributes to a resource by preparing a court's opinions for publication to a resource.
definition: Setzt einen Akteur in Beziehung zu einer Ressource, zu der er beiträgt, indem er eine Urteilsbegründung zur Veröffentlichung vorbereitet. @de
definition: يربط وكيلًا يُساهم في مصدر من خلال إعداد رأي محكمة للنشر في أحد المصادر. @ar
definition: 将一个通过准备用于公布的法院意见而对一种资源作出贡献的一个行为者与一种资源关联起来。 @zh-hans

is writer of introduction of (Deprecated)
lexical alias: writerOfPrefaceOf.en
status: Deprecated
type: Property
label: er forfatter til forord til @da
sub property of: is writer of supplementary content of (Deprecated)
inverse of: has writer of preface (Deprecated)
definition: Relaterer en agent, der har bidraget til en ressource ved at sørge for et forord til den originale ressource til en ressource. @da
definition: Relates an agent who contributes to a resource by providing an introduction to an original resource to a resource. (Deprecated)

is writer of added commentary of (Deprecated)
lexical alias: writerOfAddedCommentaryOf.en
status: Deprecated
type: Property
label: er forfatter til tilføjet kommentar til @da
sub property of: is writer of supplementary content of (Deprecated)
inverse of: has writer of added commentary (Deprecated)
definition: Relaterer en agent, der har bidraget til en ressource ved at sørge for en fortolkning eller kritisk forklaring af en oprindelig ressource til en ressource. @da
definition: Relates an agent to a resource that includes a contribution of providing an interpretation or critical explanation. (Deprecated)

is writer of afterword of (Deprecated)
lexical alias: writerOfIntroductionOf.en
status: Deprecated
type: Property
label: er forfatter til introduktion til @da
sub property of: is writer of supplementary content of (Deprecated)
inverse of: has writer of introduction (Deprecated)
definition: Relaterer en agent, der har bidraget til en ressource ved at sørge for en indledning til en oprindelig ressource til en ressource. @da
definition: Relates an agent to a resource that includes a contribution of providing an introduction. (Deprecated)

is writer of supplementary content of (Deprecated)
has subproperty: is writer of added text of (Deprecated)
has subproperty: is writer of introduction of (Deprecated)
has subproperty: is writer of added commentary of (Deprecated)
has subproperty: is writer of afterword of (Deprecated)
has subproperty: is writer of preface of (Deprecated)
has subproperty: is writer of postface of (Deprecated)
lexical alias: writerOfSupplementaryTextualContentOf.en
status: Deprecated
type: Property
label: er forfatter til supplerende tekstindhold til @da
sub property of: is contributor of (Deprecated)
inverse of: has writer of supplementary textual content (Deprecated)
definition: Relaterer en agent, der har bidraget til en ressource ved at sørge for supplerende tekstindhold, som fx en indledning eller et forord til en oprindeligg ressource til en ressource. @da
definition: Relates an agent to a resource that includes a contribution of providing supplementary textual content such as an introduction or a preface. (Deprecated)

is editor of
lexical alias: editorOf.en
status: Published
type: Property
label: editörüdür @tr
label: er redaktør af @da
label: is redacteur van @nl
label: ist Herausgeberin/Herausgeber von @de
label: szerkesztője a következőnek: @hu
label: toimittaja (toimija) aineistossa @fi
label: هو مُحرر لـ @ar
label: 是……的编者 @zh-hans
sub property of: is contributor of (Deprecated)
inverse of: has editor (Deprecated
definition: Bir temsilciyi, içeriği gözden seçiren veya açıklığa kavuşturan veya kaynakların bir kısmının bir veya daha fazla içerik oluşturucu tarafından seçilen ve toplayan temsilcinin katkısını içeren bir kaynakla ilişkilendirir. @tr
definition: Hozzákapcsol egy ágenst egy forráshoz, amely magában foglalja az ágens közreműködését a tartalom átdolgozásában vagy áttekintésében, vagy az egy vagy több létrehozótól származó források vagy részforrások kiválasztásában és aggregálásában. @hu
definition: Liittää toimijan aineistoon, jossa toimija on osallisena yhden tai useamman toimijan luoman sisällön tarkistamisessa tai selventämisessä tai resurssien tai resurssien osien valinnassa ja yhdistämisessä. @fi
definition: Relaterer en agent, der har bidraget til en ressource ved at revidere eller præcisere indholdet, fx tilføje en introduktion, noter, eller andet vigtigt materiale til en ressource. @da
definition: Relates an agent to a resource that includes a contribution by an agent of revision or clarification of the content, or selection and aggregation of resources, or parts of resources, by one or more creators.
definition: Setzt eine Akteur in Beziehung zu einer Ressource, zu der ein Akteur beiträgt, indem er den Inhalt überarbeitet oder erläutert, oder Ressourcen, oder Teile von Ressourcen, von einer geistige Schöpferin/einem geistigen Schöpfer oder mehreren geistigen Schöpferinnen/geistigen Schöpfern auswählt und aggregiert. @de
definition: يربط بين وكيل ومصدر يتضمن إسهام وكيل في مراجعة المحتوى أو توضيحه، أو اختيار وتجميع مصادر، أو أجزاء من مصادر، بواسطة واحد أو أكثر من المُنشِئُين. @ar
definition: 将一个行为者与包括修正或澄清一个或多个创作者完成的内容、或资源的选编和编制合集、或资源的部分的一个行为者的贡献的一种资源关联起来。 @zh-hans

is abridger of
see also: is author of
lexical alias: abridgerOf.en
status: Published
type: Property
label: er forkorter af @da
label: is inkorter van @nl
label: ist Kürzende/Kürzender von @de
label: lyhentäjä (toimija) aineistossa @fi
label: rövidítője a következőnek: @hu
label: özetleyenidir @tr
label: هو مُلَخِّص لـ @ar
label: 是……的缩编者 @zh-hans
sub property of: is contributor of (Deprecated)
inverse of: has abridger
definition: Bir temsilciyi, genel anlamı veya sunum şeklini değiştirmeden başka bir kaynağı kısaltan temsilcinin katkısını içeren bir kaynakla ilişkilendirir. @tr
definition: Hozzákapcsol egy ágenst egy forráshoz, amely magában foglalja az ágens közreműködését egy másik forrás lerövidítésével úgy, hogy a prezentáció általános jelentése vagy módja nem változik. @hu
definition: Liittää toimijan aineistoon, jossa toimija on osallisena lyhentämällä siihen liittyvää aineistoa muuttamatta esityksen yleistä sisältöä tai tyyliä. @fi
definition: Relaterer en agent, der har bidraget til en ressource ved at forkorte eller komprimere den oprindelige ressource, men som i alt væsentligt har ladt den oprindelige ressources karakter og indhold være uændret til en ressource. @da
definition: Relates an agent to a resource that includes a contribution by an agent of shortening another resource without changing the general meaning or manner of presentation.
definition: Setzt einen Akteur in Beziehung zu einer Ressource, zu der ein Akteur beiträgt, indem er eine andere Ressource kürzt, ohne die allgemeine Bedeutung oder Art der Darstellung zu verändern. @de
definition: يربط بين وكيل ومصدر يتضمن إسهام وكيل في تلخيص مصدرًا آخر دون تغيير المعنى العام أو طريقة العرض. @ar
definition: 将一个行为者与包括缩短另一种资源而不改变其总体意义或呈现方式的一个行为者的贡献的一种资源关联起来。 @zh-hans

is recording engineer of
lexical alias: recordingEngineerOf.en
status: Published
type: Property
label: er indspilningstekniker for @da
label: hangrögzítője a következőnek: @hu
label: is opnametechnicus van @nl
label: ist Aufnahmetechnikerin/Aufnahmetechniker von @de
label: ses kayıt mühendisidir @tr
label: äänittäjä (toimija) aineistossa @fi
label: هو مهندس تسجيل لـ @ar
label: 是……的录制工程师 @zh-hans
sub property of: is contributor of (Deprecated)
inverse of: has recording engineer
definition: Bir temsilciyi, bir kayıt oturumunun ses içeriğinin teknik yönlerini denetleyen bir temsilcinin katkısını içeren bir kaynakla ilişkilendirir. @tr
definition: Hozzákapcsol egy ágenst egy forráshoz, amely magában foglalja az ágens közreműködését a hangtartalom rögzítését szolgáló munkamenet műszaki aspektusainak felügyeletében. @hu
definition: Liittää toimijan aineistoon, jossa toimija on osallisena valvomalla äänityksen teknistä toteutusta. @fi
definition: Relaterer en lydtekniker, der har bidraget til en ressource ved at føre tilsyn med de tekniske aspekter af en optagelsessession til en ressource. @da
definition: Relates an agent to a resource that includes a contribution by an agent of supervising the technical aspects of the audio content of a recording session.
definition: Setzt einen Akteur in Beziehung zu einer Ressource, zu der ein Akteur beiträgt, indem er die technischen Aspekte des Audio-Inhalts einer Aufnahme überwacht. @de
definition: يربط بين وكيل ومصدر يتضمن إسهام وكيل بالإشراف على الجوانب الفنية لمحتوى صوتي لجلسة تسجيل. @ar
definition: 将一个行为者与包括监督一个录制过程中的音频内容的技术方面的一个行为者的贡献的一种资源关联起来。 @zh-hans

is contributor agent of still image of
see also: is artist of
has subproperty: is letterer of
lexical alias: contributorAgentOfStillImageOf.en
status: Published
type: Property
label: durağan görüntüsüne katkıda bulunan temsilcisidir @tr
label: er illustrator til @da
label: is bijdrager-actor van stilstaand beeld van @nl
label: ist Akteur als Illustratorin/Illustrator von @de
label: közreműködő ágense a következő állóképnek: @hu
label: stillkuvaan osallinen (toimija) aineistossatoimija @fi
label: هو وكيل مساهم في صور ثابتة لـ @ar
label: 是……的静态图像的贡献者行为者 @zh-hans
sub property of: is contributor of (Deprecated)
inverse of: has contributor agent of still image
definition: Bir temsilciyi, bir temsilci tarafından oluşturulan hareketsiz bir görüntü kaynağını somutlaştıran toplayıcı bir kaynakla ilişkilendirir. @tr
definition: Hozzákapcsol egy ágenst egy aggregátum forráshoz, amely egy ágens által létrehozott állóképforrást testesít meg. @hu
definition: Liittää toimijan aineistoon, jossa toimija on osallisena luomalla aggregaattiin sisältyvän stillkuva-aineiston. @fi
definition: Relaterer en agent, der har bidraget til en ressource ved at supplere hovedindholdet med tegninger, diagrammer, fotos etc. til en ressource. @da
definition: Relates an agent to a resource that is an aggregate that embodies a still image resource created by an agent.
definition: Setzt einen Akteur in Beziehung zu einer Ressource, bei der es sich um ein Aggregat handelt, das eine von einem Akteur erschaffene unbewegte Bildressource verkörpert. @de
definition: يربط بين وكيل ومصدر عبارة عن تجميعة تجسد مصدر صور ثابتة أنشأه وكيل. @ar
definition: 将一个行为者与作为一种合集、把一个行为者所创作的一种静态图像资源具体化的一种资源关联起来。 @zh-hans

is recordist of
lexical alias: recordistOf.en
status: Published
type: Property
label: er tonemester for @da
label: is opnamemaker van @nl
label: ist Tonmeisterin/Tonmeister von @de
label: rögzítője a következőnek: @hu
label: ses kayıt teknisyenidir @tr
label: taltioija (toimija) aineistossa @fi
label: هو فني تسجيل لـ @ar
label: 是……的录制者 @zh-hans
sub property of: is contributor of (Deprecated)
inverse of: has recordist
definition: Bir temsilciyi, doğal seslerin, folklorik olayların, müziğin veya diğer performansların saha kayıtları da dahil olmak üzere, bir kayıt oturumu sırasında ses veya video yakalamak için bir kayıt cihazı kullanan temsilcisinin katkısını içeren bir kaynakla ilişkilendirir. @tr
definition: Hozzákapcsol egy ágenst egy forráshoz, amely magában foglalja az ágens közreműködését hang vagy videó rögzítését szolgáló felvevő eszköz használatában egy felvétel során, beleértve természetes hangokat, folklór eseményeket, zenét vagy más előadásokat is. @hu
definition: Liittää toimijan aineistoon, jossa toimija on osallisena käyttämällä tallennuslaitetta äänen tai videon taltioimiseen tallennustilanteessa. @fi
definition: Relaterer en agent, der har bidraget til en ressource ved at anvende et optageudstyr til at fange lyd og/eller video under en optagelsessession, inkl. feltoptagelser af naturlige lyde, folkloristiske begivenheder, musik etc. til en ressource. @da
definition: Relates an agent to a resource that includes a contribution by an agent of using a recording device to capture sound or video during a recording session, including field recordings of natural sounds, folkloric events, music, or other performances.
definition: Setzt einen Akteur in Beziehung zu einer Ressource, zu der ein Akteur beiträgt, indem er mit einem Aufnamegerät Ton oder Video aufnimmt. Darunter fallen Field Recordings natürlicher Geräusche, folkloristische Events, Musik oder ähnliches. @de
definition: يربط بين وكيل ومصدر يتضمن إسهام وكيل في استخدام جهاز تسجيل لالتقاط الصوت أو الفيديو أثناء جلسة تسجيل، بما في ذلك التسجيلات الخارجية للأصوات الطبيعية أو الأحداث الفولكلورية أو الموسيقى أو العروض الأخرى. @ar
definition: 将一个行为者与包括通过采用录制设备在录制期间摄录声音或视频（包括自然声音、民俗活动、音乐或其他表演的现场录制）的一个行为者的贡献的一种资源关联起来。 @zh-hans

is contributor of (Deprecated)
has subproperty: is surveyor of
has subproperty: is animator of
has subproperty: is arranger of music of
has subproperty: is draftsman of
has subproperty: is transcriber of
has subproperty: is musical director of
has subproperty: is costume designer of
has subproperty: is translator of
has subproperty: is art director of
has subproperty: is performer of
has subproperty: is court reporter of
has subproperty: is writer of supplementary content of (Deprecated)
has subproperty: is editor of
has subproperty: is abridger of
has subproperty: is recording engineer of
has subproperty: is contributor agent of still image of
has subproperty: is recordist of
has subproperty: is stage director of
has subproperty: is presenter of
has subproperty: is editor of moving image resource of
has subproperty: is production designer of
has subproperty: is minute taker of
has subproperty: is visual effects provider of
has subproperty: is special effects provider of
has subproperty: is writer of foreword of (Deprecated)
has subproperty: is sound designer of
has subproperty: is lighting designer of
has subproperty: is onscreen participant of
has subproperty: is software developer of
has subproperty: is colourist of
has subproperty: is makeup artist of
has subproperty: is censor of
lexical alias: contributorOf.en
status: Deprecated
type: Property
label: er bidragyder til @da
inverse of: has contributor (Deprecated)
definition: Relaterer en agent der bidrager til en ressource til en ressource. @da
definition: Relates an agent to a resource that includes a contribution. (Deprecated)

is stage director of
lexical alias: stageDirectorOf.en
status: Published
type: Property
label: er sceneinstruktør af @da
label: is toneelregisseur van @nl
label: ist Bühnenregisseurin/Bühnenregisseur von @de
label: näyttämöohjaaja (toimija) aineistossa @fi
label: sahne yönetmeni @tr
label: színpadi rendezője a következőnek: @hu
label: هو مدير مسرح لـ @ar
label: 是……的舞台导演 @zh-hans
sub property of: is contributor of (Deprecated)
inverse of: has stage director
definition: Bir temsilciyi, bir sahne performansının genel yönetim ve denetimten sorumlu bir temsilcinin katkısını içeren bir kaynakla ilişkilendirir. @tr
definition: Hozzákapcsol egy ágenst egy forráshoz, amely magában foglalja az ágens közreműködését egy színpadi előadás általános menedzselésében és felügyeletében. @hu
definition: Liittää toimijan aineistoon, jossa toimija on osallisena johtamalla ja valvomalla näyttämöesitystä. @fi
definition: Relaterer en agent, der har bidraget til en ressource af et sceneværk gennem den generelle ledelse af og tilsyn med en forestilling til en ressource. @da
definition: Relates an agent to a resource that includes a contribution by an agent of general management and supervision of a stage performance.
definition: Setzt einen Akteur in Beziehung zu einer Ressource einer Bühnendarbietung, zu der ein Akteur durch die allgemeine Betreuung und Leitung beiträgt. @de
definition: يربط بين وكيل ومصدر يتضمن إسهام وكيل في الإدارة العامة لأداء مسرحي والإشراف عليه. @ar
definition: 将一个行为者与包括一个行为者对舞台表演总体管理和监督的贡献的一种资源关联起来。 @zh-hans

is current owner of
has subproperty: is depositor of
lexical alias: currentOwnerOf.en
status: Published
type: Property
label: er nuværende ejer af @da
label: is huidige eigenaar van @nl
label: ist gegenwärtige Eigentümerin/gegenwärtiger Eigentümer von @de
label: jelenlegi tulajdonosa a következőnek: @hu
label: mevcut sahibidir @tr
label: nykyinen omistaja (toimija) aineistossa @fi
label: هو مالك حالي لـ @ar
label: 是……的当前拥有者 @zh-hans
sub property of: is owner of
inverse of: has current owner
definition: Bir temsilciyi, mevcut yasal mülkiyet için bir temsilcinin sorumluluğunu içeren bir kaynakla ilişkilendirir. @tr
definition: Hozzákapcsol egy ágenst egy forráshoz, amelyhez hozzátartozik az ágens jelenlegi tulajdonjog iránti felelőssége. @hu
definition: Liittää toimijan aineistoon, jonka toimija tällä hetkellä laillisesti omistaa. @fi
definition: Relaterer en agent, der p.t. er i lovlig besiddelse af en ressource til en ressource. @da
definition: Relates an agent to a resource that involves a responsibility of an agent for current legal possession.
definition: Setzt einen Akteur in Beziehung zu einer Ressource, die sich derzeit im rechtmäßigen Besitz eines Akteurs befindet. @de
definition: يربط بين وكيل ومصدر ينطوي على مسؤولية وكيل عن الملكية القانونية الحالية. @ar
definition: 将一个行为者与涉及一个当前法定所有权的一个行为者的责任的一种资源关联起来。 @zh-hans

has employee
lexical alias: employee.en
status: Published
type: Property
label: alkalmazottja a következő: @hu
label: har ansat @da
label: hat Arbeitnehmerin/Arbeitnehmer @de
label: heeft werknemer @nl
label: työntekijä (toimija) aineistossa @fi
label: çalışan ile ilişkilidir @tr
label: له موظف @ar
label: 有雇员 @zh-hans
inverse of: has employer
definition: Bir temsilci tarafından istihdam edilen bir temsilciyi bir temsilciyle ilişkilendirir. @tr
definition: Hozzákapcsol egy ágenst egy ágens alkalmazásában álló ágenshez. @hu
definition: Liittää toimijan toimijan työllistämään toimijaan. @fi
definition: Relaciona un agent amb un agent que és empleat per un agent. @ca
definition: Relaterer en agent der er ansat af en agent til en agent. @da
definition: Relates an agent to an agent who is employed by an agent.
definition: Setzt einen Akteur in Beziehung zu einem Akteur, der einen Akteur beschäftigt. @de
definition: يربط وكيلًا تم توظيفه من قبل وكيل لوكيل. @ar
definition: 将一个行为者与被一个行为者雇用的一个行为者关联起来。 @zh-hans

is former owner of
has subproperty: is donor of
has subproperty: is seller of
lexical alias: formerOwnerOf.en
status: Published
type: Property
label: aiempi omistaja (toimija) aineistossa @fi
label: er tidligere ejer af @da
label: eski sahibidir @tr
label: is voormalige eigenaar van @nl
label: ist frühere Eigentümerin/früherer Eigentümer von @de
label: korábbi tulajdonosa a következőnek: @hu
label: هو مالك سابق لـ @ar
label: 是……的先前拥有者 @zh-hans
sub property of: is owner of
inverse of: has former owner
definition: Bir temsilciyi, eski yasal mülkiyete ilişkin bir temsilcinin sorumluluğunu içeren bir kaynakla ilişkilendirir. @tr
definition: Hozzákapcsol egy ágenst egy forráshoz, amelyhez hozzátartozik az ágens korábbi tulajdonjog iránti felelőssége. @hu
definition: Liittää toimijan aineistoon, jonka toimija on aiemmin laillisesti omistanut. @fi
definition: Relaterer en agent, der tidligere har været i lovligbesiddelse af en ressource til en ressource. @da
definition: Relates an agent to a resource that involves a responsibility of an agent for former legal possession.
definition: Setzt einen Akteur in Beziehung zu einer Ressource, die früher im rechtmäßigen Besitz eines Akteurs war. @de
definition: يربط بين وكيل ومصدر ينطوي على مسؤولية وكيل عن الملكية القانونية السابقة. @ar
definition: 将一个行为者与涉及一个先前法定所有权的一个行为者的责任的一种资源关联起来。 @zh-hans

is custodian of
lexical alias: custodianOf.en
status: Published
type: Property
label: er forvalter af @da
label: is bewaarder van @nl
label: ist Verwahrerin/Verwahrer von @de
label: koruyucusudur @tr
label: letétkezelője a következőnek: @hu
label: säilyttäjä (toimija) aineistossa @fi
label: هو وَصِيّ لـ @ar
label: 是……的保管者 @zh-hans
inverse of: has custodian
definition: Bir temsilciyi, yasal velayete ilişkin bir temsilcinin sorumluluğunu içeren bir kaynakla ilişkilendirir. @tr
definition: Hozzákapcsol egy ágenst egy forráshoz, amelyhez hozzátartozik az ágens megőrzés iránti felelőssége. @hu
definition: Liittää toimijan aineistoon, jonka laillinen säilyttäjä toimija on. @fi
definition: Relaterer en agent, der er lovligt berettiget til at have en ressource i depot til en ressource. @da
definition: Relates an agent to a resource that involves a responsibility of an agent for legal custody.
definition: Setzt einen Akteur in Beziehung zu einer Ressource, die sich in der rechtmäßigen Verwahrung eines Akteurs befindet. @de
definition: يربط بين وكيل ومصدر ينطوي على مسؤولية وكيل عن الوصاية القانونية. @ar
definition: 将一个行为者与涉及合法保管的一个行为者的责任的一种资源关联起来。 @zh-hans

is owner of
has subproperty: is current owner of
has subproperty: is former owner of
lexical alias: ownerOf.en
status: Published
type: Property
label: er ejer af @da
label: is eigenaar van @nl
label: ist Eigentümerin/Eigentümer von @de
label: omistaja (toimija) aineistossa @fi
label: sahibidir @tr
label: tulajdonosa a következőnek: @hu
label: هو مالك لـ @ar
label: 是……的拥有者 @zh-hans
inverse of: has owner
definition: Bir temsilciyi, yasal mülkiyete ilişkin bir temsilcinin sorumluluğunu içeren bir kaynakla ilişkilendirir. @tr
definition: Hozzákapcsol egy ágenst egy forráshoz, amelyhez hozzátartozik az ágens tulajdonjog iránti felelőssége. @hu
definition: Liittää toimijan aineistoon, jonka toimija laillisesti omistaa. @fi
definition: Relaterer en agent, der er i lovlig besiddelse af en ressource til en ressource. @da
definition: Relates an agent to a resource that involves a responsibility of an agent for legal possession.
definition: Setzt einen Akteur in Beziehung zu einer Ressource, die im rechtmäßigen Besitz eines Akteurs ist. @de
definition: يربط بين وكيل ومصدر ينطوي على مسؤولية وكيل عن الملكية القانونية. @ar
definition: 将一个行为者与涉及法定所有权的一个行为者的责任的一种资源关联起来。 @zh-hans

has officer
has subproperty: has chief executive
has subproperty: has trustee
lexical alias: officer.en
status: Published
type: Property
label: har embedsmand @da
label: hat leitende Angestellte/leitenden Angestellten @de
label: heeft functionaris @nl
label: tisztviselője a következő: @hu
label: viranhaltija (toimija) aineistossa @fi
label: yetkili ile ilişkilidir @tr
label: له موظف مسؤول @ar
label: 有任职者 @zh-hans
sub property of: has related agent of agent
inverse of: is officer of
definition: Bir temsilcide görev yapan veya bir temsilciye komuta eden temsilciyi bir temsilciyle ilişkilendirir. @tr
definition: Hozzákapcsol egy tisztséget betöltő ágenst vagy egy utasítást adó ágenst egy ágenshez. @hu
definition: Liittää toimijaan viranhaltijana tai johtajana toimivan toimijan. @fi
definition: Relaciona un agent amb un agent que té un càrrec en un agent. @ca
definition: Relaterer en agent der har et embede i en ledelse eller der leder en agent til en agent. @da
definition: Relates an agent to an agent who holds an office in an agent.
definition: Setzt einen Akteur in Beziehung zu einem Akteur, der ein Amt innehat oder einen Akteur befehligt. @de
definition: يربط بين وكيل يشغل منصبًا في أو يشرف على وكيل ووكيل. @ar
definition: 将一个行为者与在一个行为者任职的一个行为者关联起来。 @zh-hans

is honouree of
lexical alias: honoureeOf.en
status: Published
type: Property
label: er festskriftmodtager af @da
label: is geëerde van @nl
label: ist Gefeierte/Gefeierter von @de
label: kunnioitettu henkilö (toimija) aineistossa @fi
label: méltatottja a következőnek: @hu
label: onurlandırılanıdır @tr
label: له مكرَّم لـ @ar
label: 是……的被纪念者 @zh-hans
sub property of: is other agent associated with resource of (Deprecated)
inverse of: has honouree
alternative label: honoree of
alternative label: kunnioitettu henkilö @fi
alternative label: méltatottja: @hu
alternative label: مكرَّم لـ @ar
alternative label: ……的被纪念者 @zh-hans
definition: Bir temsilciyi, bir temsilciye olan saygısını ve hürmetini gösteren bir kaynakla ilişkilendirir. @tr
definition: Hozzákapcsol egy ágenst egy forráshoz, amely jelzi egy ágens megbecsülését és tiszteletét. @hu
definition: Liittää toimijan aineistoon, jolla osoitetaan arvostusta ja kunnioitusta toimijalle. @fi
definition: Relaterer en agent, der hædres af en ressource til en ressource. @da
definition: Relates an agent to a resource that marks the esteem of and respect for an agent.
definition: Setzt einen Akteur in Beziehung zu einer Ressource, die einen Akteur ehrt. @de
definition: يربط بين وكيل ومصدر يدل على تقدير وحترام لوكيل. @ar
definition: 将一个行为者与表示对一个行为者尊重或尊敬的一种资源关联起来。 @zh-hans

is broadcaster of
lexical alias: broadcasterOf.en
status: Published
type: Property
label: er broadcaster af @da
label: is uitzender van @nl
label: ist Sender von @de
label: lähetyksestä vastaava henkilö (toimija) aineistossa @fi
label: műsorszolgáltatója a következőnek: @hu
label: yayıncısıdır @tr
label: هو مذيع لـ @ar
label: 是……的广播者 @zh-hans
sub property of: is publisher of
inverse of: has broadcaster
definition: Bir temsilciyi, radyo, televizyon, web yayını vb. yoluyla bir izleyiciye yayın yapmakla görevli bir temsilcinin sorumluluğunu içeren bir kaynakla ilişkilendirir. @tr
definition: Hozzákapcsol egy ágenst egy forráshoz, amelyhez hozzátartozik az ágens felelőssége műsorszórásért, amely a közönség felé rádión, televízión, webes közvetítésen stb. keresztül történik. @hu
definition: Liittää toimijan aineistoon, jossa toimija vastaa radio-, televisio-, suoratoisto- tms. lähetyksen välittämisestä yleisölle. @fi
definition: Relaterer en agent, der har været involveret i transmission af en ressource til et publikum via radio, tv, webcast etc til en ressource. @da
definition: Relates an agent to a resource that involves a responsibility of an agent for broadcasting to an audience via radio, television, webcast, etc.
definition: Setzt einen Akteur in Beziehung zu einer Ressource, bei der ein Akteur für die Ausstrahlung über Hörfunk, Fernsehen oder Webcast und so weiter verantwortlich ist. @de
definition: يربط بين وكيل ومصدر ينطوي على مسؤولية وكيل عن البث إلى جمهور عبر الإذاعة والتلفزيون والإنترنت، الخ. @ar
definition: 将一个行为者与涉及一个通过广播、电视、网路直播等向听众播音的一个行为者的责任的一种资源关联起来。 @zh-hans

is film distributor of
lexical alias: filmDistributorOf.en
status: Published
type: Property
label: elokuvan jakelija (toimija) aineistossa @fi
label: er filmdistributør af @da
label: film dağıtımcısıdır @tr
label: filmterjesztője a következőnek: @hu
label: is filmdistributeur van @nl
label: ist Filmvertrieb von @de
label: هو موزع أفلام لـ @ar
label: 是……的电影发行者 @zh-hans
sub property of: is distributor of
inverse of: has film distributor
definition: Bir temsilciyi, hareketli bir görüntünün sinemalara veya diğer kanallara dağıtılmasıyla görevli bir temsilcinin sorumluluğunu içeren bir kaynakla ilişkilendirir. @tr
definition: Hozzákapcsol egy ágenst egy forráshoz, amelyhez hozzátartozik az ágens felelőssége mozgóképszínházak vagy más csatornák útján történő terjesztéséért. @hu
definition: Liittää toimijan aineistoon, jossa toimija vastaa elokuvan tms. aineiston jakelusta elokuvateattereille tai muille jakelukanaville. @fi
definition: Relaterer en agent, der har været involveret i distribueringen af en levende billed-ressource til biografer eller andre distributionskanaler til en ressource. @da
definition: Relates an agent to a resource that involves a responsibility of an agent for distribution of a moving image to theatres or other channels.
definition: Setzt einen Akteur in Beziehung zu einer Ressource, bei der ein Akteur für den Vertrieb eines Bewegtbilds an Kinos oder andere Vertriebskanäle verantwortlich ist. @de
definition: يربط بين وكيل ومصدر ينطوي على مسؤولية وكيل عن توزيع فيلم على قاعات العرض أو عبر قنوات أخرى. @ar
definition: 将一个行为者与涉及向剧院或其他渠道发行动态图像的一个行为者的责任的一种资源关联起来。 @zh-hans

is book designer of
lexical alias: bookDesignerOf.en
status: Published
type: Property
label: er bogdesigner for @da
label: graafinen suunnittelija (toimija) aineistossa @fi
label: is boekontwerper van @nl
label: ist Buchgestalterin/Buchgestalter von @de
label: kitap tasarımcısıdır @tr
label: könyvtervezője a következőnek: @hu
label: هو مُصمم كتاب لـ @ar
label: 是……的图书设计者 @zh-hans
sub property of: is creator of
inverse of: has book designer
definition: Bir temsilciyi, harf ve illüstrasyon düzenlemesi, malzeme seçimi ve kullanılan süreç dahil olmak üzere bir kitabın tüm grafik tasarımından sorumlu bir temsilcinin sorumluluğunu içeren bir kaynakla ilişkilendirir. @tr
definition: Hozzákapcsol egy ágenst egy forráshoz, amelyhez hozzátartozik az ágens felelőssége egy könyv teljes grafikai tervezéséért, beleértve a nyomdai betűtípus és az illusztrációk elrendezését, az anyagválasztást és az alkalmazott eljárást. @hu
definition: Liittää toimijan aineistoon, jossa toimija vastaa kirjan graafisesta suunnittelusta, taitosta, materiaalien valinnasta ja käytettävistä valmistusmenetelmistä. @fi
definition: Relaterer en agent, der har været involveret i fremstillingen af en ressource ved at være ansvarlig for hele en bogs grafiske design, inkl. opsætning af tekst og illustrationer, materialevalg og anvendt proces til en ressource. @da
definition: Relates an agent to a resource that involves a responsibility of an agent for the entire graphic design of a book, including arrangement of type and illustration, choice of materials, and process used.
definition: Setzt einen Akteur in Beziehung zu einer Ressource, bei der ein Akteur für das gesamte grafische Design eines Buchs, einschließlich Schriftbild, Bildgestaltung, Materialwahl und angewandter Verfahren, verantwortlich ist. @de
definition: يربط بين وكيل ومصدر ينطوي على مسؤولية وكيل عن التصميم الجرافيكي لكتاب بالكامل، ويشمل ذلك تنسيق الحروف والإيضاحيات، واختيار المواد، والعمليات المستخدمة. @ar
definition: 将一个行为者与涉及一种图书的整体平面设计（包括字体和插图的设计、材料的选取和工艺流程的使用等）的一个行为者的责任的一种资源关联起来。 @zh-hans

is engraver of
lexical alias: engraverOf.en
status: Published
type: Property
label: er gravør af @da
label: gravür sanatçısıdır @tr
label: is graveur van @nl
label: ist Stecherin/Stecher von @de
label: kaivertaja (toimija) aineistossa @fi
label: vésnöke a következőnek: @hu
label: هو نقّاش لـ @ar
label: 是……的雕版者 @zh-hans
sub property of: is printmaker of
inverse of: has engraver
definition: Bir temsilciyi, baskı için kullanılan ahşap veya metal bir plaka gibi bir yüzey üzerinde harfleri, şekilleri vb. kesmekle görevli bir temsilcinin sorumluluğunu içeren bir kaynakla ilişkilendirir. @tr
definition: Hozzákapcsol egy ágenst egy forráshoz, amelyhez hozzátartozik az ágens felelőssége betűknek, számoknak stb. nyomtatáshoz használt fa- vagy fémlemez felületére történő metszéséért. @hu
definition: Liittää toimijan aineistoon, jossa toimija vastaa kirjainten, kuvioiden tai muiden merkkien painamisessa käytettävälle pinnalle, kuten puu- tai metallipinnalle. @fi
definition: Relaterer en agent, der har været involveret i fremstillingen af en ressource ved at udskære bogstaver, figurer etc. på en overflade såsom en træ- eller metalplade, der har været anvendt til trykning til en ressource. @da
definition: Relates an agent to a resource that involves a responsibility of an agent for cutting letters, figures, etc., on a surface such as a wooden or metal plate used for printing.
definition: Setzt einen Akteur in Beziehung zu einer Ressource, bei der ein Akteur für das Schneiden von Buchstaben, figürlichen Darstellungen und so weiter in eine Oberfläche, wie zum Beispiel eine Holz- oder Metallplatte, die zum Drucken benutzt wird, verantwortlich ist. @de
definition: يربط بين وكيل ومصدر ينطوي على مسؤولية وكيل عن نقش الحروف، والأشكال، إلخ.، على سطح مثل لوح خشبي أو معدني يستخدم للطباعة. @ar
definition: 将一个行为者与涉及通过在木版或金属版等表面上雕刻字母、图形等以用于印刷的一个行为者的责任的一种资源关联起来。 @zh-hans

is braille embosser of
lexical alias: brailleEmbosserOf.en
status: Published
type: Property
label: Braille-dombornyomója a következőnek: @hu
label: braille kabartmacısıdır @tr
label: er punktskriftspræger af @da
label: is brailleerder van @nl
label: ist Brailleschriftprägerin/Brailleschriftpräger von @de
label: pistekirjoituksen tekijä (toimija) aineistossa @fi
label: هو نقاش حروف بطريقة برايل لـ @ar
label: 是……的布莱叶盲文点字制作者 @zh-hans
sub property of: is manufacturer of
inverse of: has braille embosser
definition: Bir temsilciyi, bir kalem, özel kabartma yazıcı veya başka bir aygıt kullanarak braille hücrelerini kabartmakla görevli bir temsilcinin sorumluluğunu içeren bir kaynakla ilişkilendirir. @tr
definition: Hozzákapcsol egy ágenst egy forráshoz, amelyhez hozzátartozik az ágens felelőssége braille-cellák dombornyomásáért íróvessző, speciális dombornyomtató vagy más eszköz használatával. @hu
definition: Liittää toimijan aineistoon, jossa toimija vastaa pistekirjoitusmerkkien tuottamisesta piirtimen, erityistulostimen tai muun laitteen avulla @fi
definition: Relater en agent, der har været involveret i fremstillingen af en ressource ved at præge punktskriftsceller vha. en stift, særlig prægeprinter eller anden anordning til en ressource. @da
definition: Relates an agent to a resource that involves a responsibility of an agent for embossing braille cells using a stylus, special embossing printer, or other device.
definition: Setzt einen Akteur in Beziehung zu einer Ressource, bei der ein Akteur für das Prägen von Braillezeichen verantwortlich ist, indem er einen Griffel, einen speziellen Brailledrucker oder ein anderes Gerät verwendet. @de
definition: يربط بين وكيل ومصدر ينطوي على مسؤولية وكيل عن نقش حروف برايل باستخدام قلم، طابعة خاصة للنقش، أو أي أداة أخرى. @ar
definition: 将一个行为者与涉及通过使用刻写针、专门的压纹机或其他设备压印布莱叶盲文的一个行为者的责任的一种资源关联起来。 @zh-hans

is printmaker of
has subproperty: is engraver of
has subproperty: is lithographer of
has subproperty: is etcher of
has subproperty: is collotyper of
lexical alias: printmakerOf.en
status: Published
type: Property
label: baskı sanatçısıdır @tr
label: er grafiker af @da
label: is prentmaker van @nl
label: ist Druckgrafikerin/Druckgrafiker von @de
label: kuvalaatan valmistaja (toimija) aineistossa @fi
label: nyomtatványkészítője a következőnek: @hu
label: هو طبّاع لـ @ar
label: 是……的印版制作者 @zh-hans
sub property of: is creator of
inverse of: has printmaker
definition: Bir temsilciyi, kabartma, oyuk veya planografik baskı yüzeyi yapmakla görevli bir temsilcinin sorumluluğunu içeren bir kaynakla ilişkilendirir. @tr
definition: Hozzákapcsol egy ágenst egy forráshoz, amelyhez hozzátartozik az ágens felelőssége egy relief, egy mélynyomásos vagy síknyomásos felület készítéséért. @hu
definition: Liittää toimijan aineistoon, jossa toimija vastaa kohokuvan, syväpainon tai laakapainon painopinnan valmistamisesta. @fi
definition: Relaterer en agent, der har været involveret i fremstillingen af en ressource ved at lave en relief-, dybtryks- eller fladtryksoverflade til en ressource. @da
definition: Relates an agent to a resource that involves a responsibility of an agent for making a relief, intaglio, or planographic printing surface.
definition: Setzt einen Akteur in Beziehung zu einer Ressource, bei der ein Akteur für die Herstellung einer Hochdruck-, Tiefdruck- oder Flachdruckoberfläche verantwortlich ist. @de
definition: يربط بين وكيل ومصدر ينطوي على مسؤولية وكيل عن عمل سطح طباعة بارزة، أو غائرة، أو مستوية. @ar
definition: 将一个行为者与涉及制作浮雕、凹版或平版印刷表面的一个行为者的责任的一种资源关联起来。 @zh-hans

is caster of
lexical alias: casterOf.en
status: Published
type: Property
label: dökümcüsüdür @tr
label: er støber af @da
label: is gieter van @nl
label: ist Formgießerin/Formgießer von @de
label: valaja (toimija) aineistossa @fi
label: öntvénykészítője a következőnek: @hu
label: هو عامل صب لـ @ar
label: 是……的铸造者 @zh-hans
sub property of: is creator of
inverse of: has caster
definition: Bir temsilciyi, bir maddenin bir kalıba sıvı veya erimiş bir maddeyi dökmesi ve kalıbın şeklini alması için katılaşmaya bırakmakla görevli bir temsilcinin sorumluluğunu içeren bir kaynakla ilişkilendirir. @tr
definition: Hozzákapcsol egy ágenst egy forráshoz, amelyhez hozzátartozik az ágens felelőssége folyékony vagy olvasztott anyag öntőformába öntéséért, hogy az ott megszilárduljon és fölvegye az öntőforma formáját. @hu
definition: Liittää toimijan aineistoon, jossa toimija vastaa aineiston valmistamisesta muovaamalla sulatettua tai nestemäistä ainetta muotin avulla. @fi
definition: Relaterer en agent, der har været involveret i fremstillingen af en ressource ved at hælde en væske eller et varmt, flydende stof i en form og lade det størkne, så det har taget form efter formen til en ressource. @da
definition: Relates an agent to a resource that involves a responsibility of an agent for pouring a liquid or molten substance into a mold and leaving it to solidify to take the shape of the mold.
definition: Setzt einen Akteur in Beziehung zu einer Ressource, bei der ein Akteur dafür verantwortlich ist, eine Flüssigkeit oder eine geschmolzene Substanz in eine Form zu gießen, die in der Gießform verbleibt, bis sie ausgehärtet ist. @de
definition: يربط بين وكيل ومصدر ينطوي على مسؤولية وكيل عن صب مادة سائلة أو مصهورة في قالب وتركها للتصلب لأخذ شكل القالب. @ar
definition: 将一个行为者与涉及将液体或融化的物质倒入模具中使其按模具固化成型的一个行为者的责任的一种资源关联起来。 @zh-hans

is lithographer of
lexical alias: lithographerOf.en
status: Published
type: Property
label: er litograf af @da
label: is lithograaf van @nl
label: ist Lithografin/Lithograf von @de
label: kőnyomatkészítője a következőnek: @hu
label: litografi (toimija) aineistossa @fi
label: taş baskı sanatçısıdır @tr
label: هو طبّاع على الحجر لـ @ar
label: 是……的平版制作者 @zh-hans
sub property of: is printmaker of
inverse of: has lithographer
definition: Bir temsilciyi, litografik baskı için bir taş veya plaka hazırlamakla görevli bir temsilcinin sorumluluğunu içeren bir kaynakla ilişkilendirir. @tr
definition: Hozzákapcsol egy ágenst egy forráshoz, amelyhez hozzátartozik az ágens felelőssége egy kő vagy lemez litográfiai nyomtatáshoz történő előkészítéséért. @hu
definition: Liittää toimijan aineistoon, jossa toimija vastaa aineiston valmistamisesta valmistamalla litografiassa käytetyn kivilaatan tai muun painolaatan. @fi
definition: Relaterer en agent, der har været involveret i fremstillingen af en ressource ved at forberede en sten eller plade til litografisk trykning til en ressource. @da
definition: Relates an agent to a resource that involves a responsibility of an agent for preparing a stone or plate for lithographic printing.
definition: Setzt einen Akteur in Beziehung zu einer Ressource, bei der ein Akteur für die Vorbereitung eines Steins oder einer Platte für lithografischen Druck verantwortlich ist. @de
definition: يربط بين وكيل ومصدر ينطوي على مسؤولية وكيل عن تجهيز حجر أو لوح للطباعة الحجرية. @ar
definition: 将一个行为者与涉及制作用于平版印刷的石头或平版的一个行为者的责任的一种资源关联起来。 @zh-hans
scope note: A lithographer includes a graphic artist creating a design directly on the surface from which printing will be done.
scope note: A litográfus egy grafikusművész, aki közvetlenül azon a felületen készít tervet, amelyről a nyomtatás történik. @hu
scope note: Bir taş baskı sanatçısı, baskının yapılacağı yüzey üzerinde doğrudan bir tasarım yaratan bir grafik sanatçısını içerir. @tr
scope note: Darunter fallen Grafikerinnen/Grafiker, die ein Muster direkt auf der Oberfläche erstellen, von der aus gedruckt werden soll. @de
scope note: En litograf inkluderer en grafisk artist der har skabt et design direkte på overfladen, hvorfra trykning vil blive lavet. @da
scope note: Litografi tarkoittaa myös graafikkoa, joka tekee piirroksen suoraan painamiseen käytettävälle pinnalle. @fi
scope note: يتضمن مصطلح طبّاع على الحجر كذلك فنان الجرافيك الذي ينشيء تصميمًا مباشرًا على السطح الذي ستتم الطباعة منه. @ar
scope note: 平版制作者包括直接在用于印刷的表面进行设计创作的平面美术家 @zh-hans

is platemaker of
lexical alias: platemakerOf.en
status: Published
type: Property
label: er plademager af @da
label: is plaatmaker van @nl
label: ist Druckformherstellerin/Druckformhersteller von @de
label: levhacısıdır @tr
label: nyomólemez-készítője a követezőnek: @hu
label: painolaatan valmistaja (toimija) aineistossa @fi
label: هو مُحضِّر سطح طباعى لـ @ar
label: 是……的制版者 @zh-hans
sub property of: has related resource of agent
inverse of: has platemaker
definition: Bir temsilciyi, basılı görüntülerin veya metnin yapımında kullanılan baskı kalıplarını hazırlamakla görevli bir temsilcinin sorumluluğunu içeren bir kaynakla ilişkilendirir. @tr
definition: Hozzákapcsol egy ágenst egy forráshoz, amelyhez hozzátartozik az ágens felelőssége nyomólemezek előkészítéséért nyomtatott képek vagy szövegek előállításához. @hu
definition: Liittää toimijan aineistoon, jossa toimija vastaa painettujen kuvien tai tekstin valmistuksessa käytettävien painolaattojen tai -levyjen valmistuksesta. @fi
definition: Relaciona un agent amb un recurs que implica una responsabilitat d’un agent en la preparació de les planxes usades en l’elaboració d’imatges impreses o text imprès. @ca
definition: Relaterer en agent, der har været involveret i fremstillingen af en ressource ved at forberede plader, der anvendes til fremstilling af trykte billeder og/eller tekst til en ressource. @da
definition: Relates an agent to a resource that involves a responsibility of an agent for preparing plates used in the making of printed images or text.
definition: Setzt einen Akteur in Beziehung zu einer Ressource, bei der ein Akteur für die Anfertigung von Druckformen für die Produktion von gedruckten Bildern oder gedrucktem Text verantwortlich ist. @de
definition: يربط بين وكيل ومصدر ينطوي على مسؤولية وكيل عن تجهيز الأسطح المستخدمة في إنتاج صور أو نص مطبوع. @ar
definition: 将一个行为者与涉及准备用于制作图像和/或文字印刷平版的一个行为者的责任的一种资源关联起来。 @zh-hans

is etcher of
lexical alias: etcherOf.en
status: Published
type: Property
label: er raderer af @da
label: etsaaja (toimija) aineistossa @fi
label: is etser van @nl
label: ist Radiererin/Radierer von @de
label: karckészítője a következőnek: @hu
label: oymacısıdır @tr
label: هو حَفَّارُ بالزِنْكُوغْراف (الكليشيهات) لـ @ar
label: 是……的蚀刻者 @zh-hans
sub property of: is printmaker of
inverse of: has etcher
definition: Bir temsilciyi, metal, cam veya baskı için kullanılan diğer bazı yüzeyleri asit veya başka bir aşındırıcı maddeye maruz bırakmaya ilişkin bir temsilcinin sorumluluğunu içeren bir kaynakla ilişkilendirir @tr
definition: Hozzákapcsol egy ágenst egy forráshoz, amelyhez hozzátartozik az ágens felelőssége nyomtatáshoz használt fém-, üveg- vagy valamilyen más felület savnak vagy más maró anyagnak történő alávetéséért. @hu
definition: Liittää toimijan aineistoon, jossa toimija vastaa metallin, lasin tai muun pinnan etsaamisesta hapon tai muun syövyttävän aineen avulla. @fi
definition: Relaterer en agent, der har været involveret i fremstillingen af en ressource ved at udsætte metal, glas eller en anden overflade, der anvendes til trykning, for syre eller et andet ætsende stof til en ressource. @da
definition: Relates an agent to a resource that involves a responsibility of an agent for subjecting metal, glass, or some other surface used for printing, to acid or another corrosive substance.
definition: Setzt einen Akteur in Beziehung zu einer Ressource, bei der ein Akteur dafür verantwortlich ist, Metall, Glas oder eine andere Oberfläche, die zum Drucken benutzt wird, mit Säure oder einer anderen ätzenden Substanz zu behandeln. @de
definition: يربط بين وكيل ومصدر ينطوي على مسؤولية وكيل عن غمر معدن أو زجاج أو أي سطح آخر يستخدم للطباعة، في حامض أو في أي مادة أخرى كاوية. @ar
definition: 将一个行为者与涉及使用酸或其他腐蚀性物质施于用来印刷的金属、玻璃或其他表面上的一个行为者的责任的一种资源关联起来。 @zh-hans

is collotyper of
lexical alias: collotyperOf.en
status: Published
type: Property
label: er lystrykker af @da
label: fénynyomatkészítője a következőnek: @hu
label: is lichtdrukker van @nl
label: ist Lichtdruckerin/Lichtdrucker von @de
label: kollotypian valmistaja (toimija) aineistossa @fi
label: kolotip baskıcısıdır @tr
label: هو طبّاع صور فوتوغرافية لـ @ar
label: 是……的珂罗版制作者 @zh-hans
sub property of: is printmaker of
inverse of: has collotyper
definition: Bir temsilciyi, fotomekanik işlem kullanarak baskılar yapmak için kullanılan, mürekkep alıcı ve mürekkep itici yüzeylere sahip sertleştirilmiş bir jelatin veya diğer kolloid filmi hazırlamakla görevli bir temsilcinin sorumluluğu içeren bir kaynakla ilişkilendirir @tr
definition: Hozzákapcsol egy ágenst egy forráshoz, amelyhez hozzátartozik az ágens felelőssége nyomtatványok fotómechanikai eljárással történő közvetlen előállításáért, amihez festékfelvevő és festéktaszító felülettel rendelkező zselatin vagy más kolloid megkeményedett filmjét használja. @hu
definition: Liittää toimijan aineistoon, jonka valmistamisesta toimija on vastuussa tekemällä vedoksia suoraan kovettuneelta gelatiinifilmiltä tai muulta materiaalilta, jossa on mustetta imeviä ja hylkiviä pintoja. @fi
definition: Relaciona un agent amb un recurs que implica una responsabilitat d’un agent en la preparació d’una pel·lícula endurida de gelatina o d’un altre col·loide que té superfícies que accepten o rebutgen la tinta i que s’usa per fer gravats usant un procés fotomecànic. @ca
definition: Relaterer en agent, der har været involveret i fremstillingen af en ressource vha. en fotomekanisk proces, hvorved der er blevet lavet tryk direkte fra et hærdet gelatinelag eller andet kolloid, der har blækmodtagelige og blækafvisende overflader til en ressource. @da
definition: Relates an agent to a resource that involves a responsibility of an agent for preparing a hardened film of gelatin or other colloid that has ink-receptive and ink-repellent surfaces and that is used to make prints using a photomechanical process.
definition: Setzt einen Akteur in Beziehung zu einer Ressource, bei der ein Akteur für die Verwendung eines fotomechanischen Verfahrens zur Herstellung von Abzügen direkt von einem gehärteten Film aus Gelatine oder einem anderen Kolloid, der druckerfarbenaufnehmende und -abweisende Oberflächen aufweist, verantwortlich ist. @de
definition: يربط بين وكيل ومصدر ينطوي على مسؤولية وكيل عن استخدام عمليات ميكانيكية ضوئية لإنتاج المطبوعات مباشرة من فيلم صلد من الجيلاتين أو من غيره من المواد الغروية التي تحتوي على أسطح مستقبلة أو طاردة للحبر. @ar
definition: 将一个行为者与涉及利用一面吸墨而另一面不吸墨的明胶或其他硬胶片进行影印的一个行为者的责任的一种资源关联起来。 @zh-hans

is printer of
lexical alias: printerOf.en
status: Published
type: Property
label: er trykker af @da
label: is drukker van @nl
label: ist Druckerin/Drucker von @de
label: matbaacısıdır @tr
label: nyomdásza a következőnek: @hu
label: painaja (toimija) aineistossa @fi
label: هو فني طباعة لـ @ar
label: 是……的印刷者 @zh-hans
sub property of: is manufacturer of
inverse of: has printer
definition: Bir temsilciyi, kitap, gazete, dergi, ışık baskılı fotoğraf, partisyon vb. gibi daktilo veya baskı kalıplarından basılı metin, notalı müzik vb. üreten bir temsilcinin sorumluluğunu içeren bir kaynakla ilişkilendirir. @tr
definition: Hozzákapcsol egy ágenst egy forráshoz, amelyhez hozzátartozik az ágens felelőssége nyomtatott szöveg, zenei lejegyzés, stb. nyomdai szedéséből vagy nyomólemezekről történő gyártásáért, például könyv, hírlap, magazin, egyoldalas nyomtatvány, partitúra, stb. esetében. @hu
definition: Liittää aineiston toimijaan, joka vastaa painetun tekstin, nuottiaineiston tai muun aineiston valmistamisesta painolaatalta tai -levyltä. @fi
definition: Relaterer en agent, der har været involveret i fremstillingen af en ressource af trykt tekst, noteret musik etc. fra typer eller plader, såsom en bog, en avis, et tidsskrift, en plakat, et partitur etc. til en ressource. @da
definition: Relates an agent to a resource that involves a responsibility of an agent for manufacturing printed text, notated music, etc., from type or plates, such as a book, newspaper, magazine, broadside, score, etc.
definition: Setzt einen Akteur in Beziehung zu einer Ressource, bei der ein Akteur für die Herstellung von gedrucktem Text, Noten und so weiter durch Drucktypen oder Druckformen, wie zum Beispiel in einem Buch, in einer Zeitung, in einem Magazin, in einem Einblattdruck, in einer Partitur oder ähnlichem, verantwortlich ist. @de
definition: يربط بين وكيل ومصدر ينطوي على مسؤولية وكيل عن إنتاج نص مطبوع، موسيقى مدونة، إاخ.، من نوع أو من لوحات، مثل كتاب، جريدة، مجلة، نشرة مطوِيّة، توزيع الموسيقي، إلخ. @ar
definition: 将一个行为者与涉及用活字或平版生产印刷文字、乐谱等（例如图书、报纸、杂志、海报、总谱等）的一个行为者的责任的一种资源关联起来。 @zh-hans

is presenter of
lexical alias: presenterOf.en
status: Published
type: Property
label: bemutatója a következőnek: @hu
label: er præsentator i @da
label: esittäjä (toimija) aineistossa @fi
label: is presenterende van @nl
label: ist Präsentatorin/Präsentator von @de
label: sunucusudur @tr
label: هو مُقدم لـ @ar
label: 是……的出品人 @zh-hans
sub property of: is contributor of (Deprecated)
inverse of: has presenter
definition: Bir temsilciyi, muhtemelen bir şekilde yapım, finans veya dağıtımla bağlantılı olan bir temsilci için hareketli bir görüntü kaynağında "X sunar" atfına sahip bir kaynakla ilişkilendirir. @tr
definition: Hozzákapcsol egy ágenst egy mozgóképforráshoz, amelynek „az X bemutatja:” stáblistaeleme arra az ágensre vonatkozik, amely valószínűleg valamilyen módon az előállításhoz, a finanszírozáshoz vagy a terjesztéshez kapcsolódik. @hu
definition: Liittää aineiston toimijaan, joka mainitaan alku- tai lopputekstien "X esittää:" -merkinnössä ja joka todennäköisesti liittyy liikkuvan kuvan teoksen aineiston tuotantoon, rahoitukseen tai jakeluun jollakin tavoin. @fi
definition: Relaterer en agent, der er nævnt i en fortekst i levende billedmaterialer som ”X præsenterer”-tekst, og som sandsynligvis er knyttet til produktion, finansiering eller distribution på en eller anden måde til en ressource. @da
definition: Relates an agent to a resource with an "X presents:" credit in a resource of a moving image for an agent who is probably associated with production, finance, or distribution in some way.
definition: Setzt einen Akteur in Beziehung zu einer Ressource, bei der ein Akteur in einem "X präsentiert"-Vorspann einer Bewegtbildressource erwähnt wird und der wahrscheinlich mit Produktion, Finanzierung oder Vertrieb in Verbindung steht. @de
definition: يربط بين وكيل ومصدر ذو اعتماد "أحد التقديمات:" في مصدر لفيلم لوكيل قد يكون مرتبطًا بطريقة ما بالإنتاج، أو التمويل، أو التوزيع. @ar
definition: 将一个行为者与在一种动态图像资源的摄制人员名单中以“某某 出品”（X presents）的方式提及一个行为者且该行为者和该片的制作、财务或发行等有某些联系的一种资源关联起来。 @zh-hans

is member of
lexical alias: memberOf.en
status: Published
type: Property
label: har medlem af @da
label: is lid van @nl
label: ist Mitglied von @de
label: jäsen @fi
label: medyumudur @tr
label: tagja a következőnek: @hu
label: هو عضو لـ @ar
label: 是……的成员 @zh-hans
inverse of: has member
definition: Bir temsilciyi, bir temsilcinin üyesi olduğu bir temsilciyle ilişkilendirir. @tr
definition: Hozzákapcsol egy olyan egy ágenst egy ágenshez, amelynek egy ágens a tagja. @hu
definition: Liittää toimijan yhteistoimijaan, jonka jäsen toimija on. @fi
definition: Relaterer en agent som en agent er medlem af til en agent. @da
definition: Relates an agent of which an agent is a member to an agent.
definition: Setzt einen Akteur in Beziehung zu einem Akteur, dem ein Akteur angehört. @de
definition: يربط وكيلًا يكون الوكيل عضوًا لوكيل. @ar
definition: 将一个行为者与作为一个行为者的一个成员的一个行为者关联起来。 @zh-hans

is degree supervisor of
lexical alias: degreeSupervisorOf.en
status: Published
type: Property
label: er vejleder i @da
label: fokozat témavezetője a következőnek: @hu
label: is graad-begeleider van @nl
label: ist Betreuerin/Betreuer einer Hochschulschrift von @de
label: opinnäytteen ohjaaja (toimija) aineistossa @fi
label: tez danışmanıdır @tr
label: هو مشرف على درجة أكاديمية لـ @ar
label: 是……的学位导师 @zh-hans
sub property of: is creator of
inverse of: has degree supervisor
definition: Bir temsilciyi, akademik dereceyi veya tezi denetleyen, tez veya doktora tezi araştırmasının danışmanı veya denetmeni olarak sorumluluk içeren bir kaynakla ilişkilendirir. @tr
definition: Hozzákapcsol egy ágenst egy forráshoz, amelyhez hozzátartozik az ágens felelőssége szakdolgozati vagy disszertációs kutatás tanácsadójaként vagy felügyelőjeként, aki egy tudományos fokozatot vagy értekezést ellenőriz. @hu
definition: Liittää aineiston toimijaan, joka vastaa akateemisen opinnäytteen tai väitöskirjan ohjaamisesta tai valvomisesta. @fi
definition: Relaterer en person, som fx en speciale- eller forskningsafhandlingsvejleder, der har ført tilsyn med enten en akademisk grad eller et speciale til en ressource. @da
definition: Relates an agent to a resource that involves a responsibility as an advisor or supervisor of thesis or dissertation research, overseeing either an academic degree or thesis.
definition: Setzt einen Akteur in Beziehung zu einer Ressource, bei der eine Beraterin/ein Berater oder eine Betreuerin/ein Betreuer für die Beratung und Aufsicht von Forschungstätigkeiten im Rahmen einer Hochschularbeit verantwortlich ist. @de
definition: يربط بين وكيل ومصدر ينطوي على تحمل المسؤولية بصفته مستشار أو مشرف على أطروحة ماجستير أو دكتوراه أو أبحاث متعلقة بأطروحة، والإشراف على إما درجة أكاديمية أو أطروحة. @ar
definition: 将一个行为者与涉及作为学位论文研究的导师的责任（监督学位或者论文）的资源关联起来。 @zh-hans

is illuminator of
lexical alias: illuminatorOf.en
status: Published
type: Property
label: er illuminator af @da
label: illuminoinnin tekijä (toimija) aineistossa @fi
label: illuminátora a következőnek: @hu
label: is verluchter van @nl
label: ist Illuminatorin/Illuminator von @de
label: tezhip sanatçısıdır @tr
label: هو مزخرِف لـ @ar
label: 是……的彩饰者 @zh-hans
sub property of: is other agent associated with resource of (Deprecated)
inverse of: has illuminator
definition: Bir temsilciyi, değerli metaller veya renkler kullanılarak, genellikle ayrıntılı tarasarımlar ve motiflerle süslenmiş bir kaynakla ilişkilendirir. @tr
definition: Hozzákapcsol egy ágenst egy forráshoz, amelyet nemesfémeket vagy színeket használva díszítenek, gyakran kidolgozott rajzokkal és motívumokkal. @hu
definition: Liittää toimijan aineistoon, joka on koristeltu jalometalleja tai värejä käyttäen, usein yksityiskohtaisin kuvioin tai motiivein. @fi
definition: Relaterer en person der sørger for at der er tilført en udsmukning til en særlig ressource vha. ædelmetal eller farve, ofte med udsøgte mønstre og motiver til en ressource. @da
definition: Relates an agent to a resource that is decorated using precious metals or colour, often with elaborate designs and motifs.
definition: Setzt einen Akteur in Beziehung zu einer Ressource, die durch Edelmetalle oder Farbe, häufig mit kunstvollen Mustern und Motiven, (aus-)gestaltet wird. @de
definition: يربط بين وكيل ومصدر مُزيّن بمعادن ثمينة أو بألوان، غالبًا بتصاميم وزخارف منمقة. @ar
definition: 将一个行为者与被用贵重的金属或色彩（通常有精心的设计和图案）进行装饰的一种资源关联起来。 @zh-hans

is editor of moving image resource of
lexical alias: editorOfMovingImageResourceOf.en
status: Published
type: Property
label: er klipper af @da
label: hareketli görüntü kaynağının editörüdür @tr
label: is filmeditor van bewegend beeld-resource van @nl
label: ist Filmeditorin/Filmeditor von @de
label: liikkuvan kuvan leikkaaja (toimija) aineistossa @fi
label: mozgóképforrás szerkesztője a következőnek: @hu
label: هو محرر مصدر صور متحركة لـ @ar
label: ……动态图像资源的剪辑师 @zh-hans
sub property of: is contributor of (Deprecated)
inverse of: has editor of moving image resource
definition: Bir temsilciyi, hem görsel hem işitsel yönlerini içeren, film, video veya diğer hareketli görüntü formatlarının montajı, düzenlemesi ve kırpılmasına katkı sunan bir kaynakla ilişkilendirir @tr
definition: Hozzákapcsol egy ágenst egy forráshoz, amely magában foglal film, videó vagy más mozgóképformátum összeállításával, elrendezésével és vágásával járó közreműködést, beleértve mind a vizuális, mind az audió szempontokat. @hu
definition: Liittää toimijan aineistoon, jossa toimija vastaa elokuvan, videon tai muiden elokuvaformaattien kokoamisesta, järjestämisestä ja leikkauksesta sekä kuvan että äänen osalta. @fi
definition: Relaciona un agent amb un recurs que inclou una contribució d’aplegar, arranjar i retallar pel·lícules, vídeos o altres formats d’imatge en moviment, inclosos tant els aspectes visuals com els d’àudio. @ca
definition: Relaterer en agent, der er ansvarlig for at have samlet, arrangeret og klippet film, video eller andre levende billedformater, inkl. både visuelle og lydmæssige aspekter til en ressource. @da
definition: Relates an agent to a resource that includes a contribution of assembling, arranging, and trimming film, video, or other moving image formats, including both visual and audio aspects.
definition: Setzt einen Akteur in Beziehung zu einer Ressource, die einen Beitrag zum Zusammensetzen, Arrangieren und Nachschneiden von Film-, Video- oder anderen Bewegtbildformaten beinhaltet. Darunter fallen Video- und Audio-Eigenschaften. @de
definition: يربط بين وكيل ومصدر يتضمن المساهمة في تجميع الأفلام أو الفيديو أو أشكال الصور المتحركة الأخرى وترتيبها وتشذيبها، بما في ذلك الجوانب المرئية والمسموعة. @ar
definition: 将一个行为者与包括对影片、视频或其他动态图像格式（包括视频和音频方面）的汇编、编排和剪辑的一个贡献的一种资源关联起来。 @zh-hans

is programmer of
lexical alias: programmerOf.en
status: Published
type: Property
label: er programmør af @da
label: is programmeur van @nl
label: ist Programmiererin/Programmierer von @de
label: ohjelmoija (toimija) aineistossa @fi
label: programcısıdır @tr
label: programozója a következőnek: @hu
label: هو مُبرمج لـ @ar
label: 是……的编程者 @zh-hans
sub property of: is creator of
inverse of: has programmer
definition: Bir temsilciyi, bilgisayar programlamayla görevli bir temsilcinin sorumluluğunu içeren bir kaynakla ilişkilendirir @tr
definition: Hozzákapcsol egy ágenst egy forráshoz, amelyhez hozzátartozik egy ágens felelőssége számítógépes programozásért. @hu
definition: Liittää toimijan aineistoon, jossa toimija vastaa tietokoneohjelman luomisesta. @fi
definition: Relaterer en agent, der er ansvarlig for at have skabt et computerprogram til en ressource. @da
definition: Relates an agent to a resource that involves a responsibility of an agent for computer programming.
definition: Setzt einen Akteur in Beziehung zu einer Ressource, bei der ein Akteur für die Schaffung eines Computerprogramms verantwortlich ist. @de
definition: يربط بين وكيل ومصدر ينطوي على مسؤولية وكيل عن برمجة الكمبيوتر. @ar
definition: 将一个行为者与涉及创建一个计算机程序的一个行为者的责任的一种资源关联起来。 @zh-hans

is designer of
lexical alias: designerOf.en
status: Published
type: Property
label: er designer af @da
label: is ontwerper van @nl
label: ist Designerin/Designer von @de
label: suunnittelija (toimija) aineistossa @fi
label: tasarımcısıdır @tr
label: tervezője a következőnek: @hu
label: هو مصمم لـ @ar
label: 是……的设计者 @zh-hans
sub property of: is creator of
inverse of: has designer
definition: Bir temsilciyi, bir nesnenin tasarımıyla görevli bir temsilcinin sorumluluğunu içeren bir kaynakla ilişkilendirir. @tr
definition: Hozzákapcsol egy ágenst egy forráshoz, amelyhez hozzátartozik egy ágens felelőssége egy tárgy tervezéséért. @hu
definition: Liittää toimijan aineistoon, jossa toimija vastaa esineen suunnittelusta. @fi
definition: Relaterer en agent, der er ansvarlig for at have skabt et design for en genstand til en ressource. @da
definition: Relates an agent to a resource that involves a responsibility of an agent for design of an object.
definition: Setzt einen Akteur in Beziehung zu einer Ressource, bei der ein Akteur für die Gestaltung eines Objekts verantwortlich ist. @de
definition: يربط بين وكيل ومصدر ينطوي على مسؤولية وكيل عن تصميم كائن. @ar
definition: 将一个行为者与涉及设计一个物体的一个行为者的责任的一种资源关联起来。 @zh-hans

is cartographer of
lexical alias: cartographerOf.en
status: Published
type: Property
label: er kartograf til @da
label: is cartograaf van @nl
label: ist Kartografin/Kartograf von @de
label: kartografi (toimija) aineistossa @fi
label: kartografıdır @tr
label: térképésze a következőnek: @hu
label: هو رسام خرائط لـ @ar
label: 是……的地图绘制者 @zh-hans
sub property of: is creator of
inverse of: has cartographer
definition: Bir temsilciyi, bir kartografik kaynağa ilişkin bir temsilcinin sorumluluğunu içeren bir kaynakla ilişkilendirir. @tr
definition: Hozzákapcsol egy ágenst egy forráshoz, amelyhez hozzátartozik egy ágens felelőssége egy kartográfiai forrásért. @hu
definition: Liittää toimijan aineistoon, jossa toimija vastaa kartografisesta aineistosta. @fi
definition: Relaterer en agent, der er ansvarlig for at have skabt et kort, et atlas, en globus eller et andet kartografisk værk til en ressource. @da
definition: Relates an agent to a resource that involves a responsibility of an agent for a cartographic resource.
definition: Setzt einen Akteur in Beziehung zu einer Ressource, bei der ein Akteur für eine kartografische Ressource verantwortlich ist. @de
definition: يربط بين وكيل ومصدر ينطوي على مسؤولية وكيل عن مصدر رسم خرائط. @ar
definition: 将一个行为者与涉及一个行为者对一种地图资源的责任的一种资源关联起来。 @zh-hans

is composer of
lexical alias: composerOf.en
status: Published
type: Property
label: bestecisidir @tr
label: er komponist til @da
label: is componist van @nl
label: ist Komponistin/Komponist von @de
label: säveltäjä (toimija) aineistossa @fi
label: zeneszerzője a következőnek: @hu
label: هو مُلحن لـ @ar
label: 是……的作曲者 @zh-hans
sub property of: is creator of
inverse of: has composer
definition: Bir temsilciyi, müzik için bir temsilcinin sorumluluğunu içeren bir müzikal bir kaynak ile ilişkilendirir @tr
definition: Hozzákapcsol egy ágenst egy zenei forráshoz, amelyhez hozzátartozik egy ágens felelőssége a zenéért. @hu
definition: Liittää toimijan aineistoon, jossa toimija vastaa musiikkiaineiston luomisesta. @fi
definition: Relaterer en agent der er ansvarlig for at have skabt et musikværk til en ressource. @da
definition: Relates an agent to a musical resource that involves a responsibility of an agent for music.
definition: Setzt einen Akteur in Beziehung zu einer Musikressource, bei dem ein Akteur für die Musik verantwortlich ist. @de
definition: يربط وكيل بمصدر موسيقي ينطوي على مسؤولية وكيل عن موسيقى. @ar
definition: 将一个行为者与涉及一个行为者对音乐的责任的一种音乐资源关联起来。 @zh-hans

is inventor of
lexical alias: inventorOf.en
status: Published
type: Property
label: er opfinder af @da
label: feltalálója a következőnek: @hu
label: is uitvinder van @nl
label: ist Erfinderin/Erfinder von @de
label: keksijä (toimija) aineistossa @fi
label: mucididir @tr
label: هو مخترع لـ @ar
label: 是……的发明者 @zh-hans
sub property of: is creator of
inverse of: has inventor
definition: Hozzákapcsol egy új eszköz vagy eljárás létrehozásáért felelős ágenst egy forráshoz. @hu
definition: Liittää toimijan aineistoon, jossa toimija vastaa uuden laitteen tai prosessin luomisesta. @fi
definition: Relaterer en agent der er ansvarlig for at have skabt en ny anordning eller proces til en ressource. @da
definition: Relates an agent who is responsible for creating a new device or process to a resource.
definition: Setzt einen Akteur, der für die Schaffung eines neuen Geräts oder Prozesses verantwortlich ist, in Beziehung zu einer Ressource. @de
definition: Yeni bir cihaz veya işlem oluşturmaktan sorumlu olan bir temsilciyi bir kaynakla ilişkilendirir. @tr
definition: يربط وكيل مسؤول عن تصنيع جهاز جديد أو عملية جديدة لمصدر. @ar
definition: 将一个负责创建一个新装置或新过程的行为者与一种资源关联起来。 @zh-hans

is compiler of
see also: is editor of
has subproperty: is collection registrar of
lexical alias: compilerOf.en
status: Published
type: Property
label: derleyicisidir @tr
label: er kompilator af @da
label: is samensteller van @nl
label: ist Zusammenstellende/Zusammenstellender von @de
label: kokoaja (toimija) aineistossa @fi
label: összeállítója a következőnek: @hu
label: هو جامع لـ @ar
label: 是……的编纂者 @zh-hans
sub property of: is aggregator of
inverse of: has compiler
definition: Bir temsilciyi, bir üstveri seti oluşturmakla görevli bir temsilcinin sorumluluğunu içeren bir kaynak ile ilişkilendirir @tr
definition: Hozzákapcsol egy ágenst egy forráshoz, amelyhez hozzátartozik egy ágens felelőssége a kiválasztásáért, elrendezésért, aggregálásért, adatok és információk szerkesztéséért egy olyan forrás számára, mint egy bibliográfia vagy egy címtár. @hu
definition: Liittää toimijan aineistoon, jossa toimija vastaa metatietokokonaisuuden luomisesta. @fi
definition: Relaciona un agent amb un recurs que implica una responsabilitat d’un agent en la creació d’un conjunt de descripció de metadades @ca
definition: Relaterer en agent, der er ansvarlig for at have skabt et nyt værk såsom en bibliografi eller fortegnelse ved at udvælge, arrangere, sammenlægge og redigere data, oplysninger etc. til en ressource. @da
definition: Relates an agent to a resource that involves a responsibility of an agent for creating a metadata description set.
definition: Setzt einen Akteur in Beziehung zu einer Ressource, bei der ein Akteur für das Selektieren, Gliedern, Aggregieren und Editieren von Daten und Informationen für eine Ressource, zum Beispiel einer Bibliografie oder eines Verzeichnisses, verantwortlich ist. @de
definition: يربط بين وكيل ومصدر ينطوي على مسؤولية وكيل عن اختيار البيانات والمعلومات لمصدر وترتيبها، وتجميعها، وتحريرها، في ببليوجرافية أو في دليل. @ar
definition: 将一个行为者与涉及创建一个元数据描述集的一个行为者的责任的一种资源关联起来。 @zh-hans
scope note: A metadata description set includes a bibliography of resources, a directory of agents and places, and an analytic finding aid.
scope note: Bir üstveri seti; kaynakların bir bibliografyasını, temsilciler ve yerler dizini ve analitik rehber bilgi içerir. @tr
scope note: Metatietokokonaisuus sisältää aineistojen bibliografian, toimijoiden ja paikkojen hakemiston sekä hakemiston. @fi
scope note: Un conjunt de descripció de metadades inclou una bibliografia de recursos, un directori d’agents i llocs, i un instrument de descripció analític. @ca
scope note: 元数据描述集包括资源的书目、行为者和地点的名录、以及分析查询工具。 @zh-hans

is photographer of
lexical alias: photographerOf.en
status: Published
type: Property
label: er fotograf til @da
label: fotoğrafçısıdır @tr
label: fényképésze a következőnek: @hu
label: is fotograaf van @nl
label: ist Fotografin/Fotograf von @de
label: valokuvaaja (toimija) aineistossa @fi
label: هو مصور لـ @ar
label: 是……的摄影者 @zh-hans
sub property of: is creator of
inverse of: has photographer
definition: Bir temsilciyi, fotografçılığa ilişkin bir temsilcinin sorumluluğunu içeren fotografik bir kaynakla ilişkilendirir. @tr
definition: Hozzákapcsol egy ágenst egy fényképészeti forráshoz, amelyhez hozzátartozik egy ágens felelőssége a fotózásért. @hu
definition: Liittää toimijan aineistoon, jossa toimija vastaa valokuva-aineiston luomisesta. @fi
definition: Relaterer en agent der er ansvarlig for at have skabt et nyt fotografisk værk til en ressource. @da
definition: Relates an agent to a resource that is a photographic resource that involves a responsibility of an agent for photography.
definition: Setzt einen Akteur in Beziehung zu einer Ressource, bei der ein Akteur für die Fotografie verantwortlich ist. @de
definition: يربط بين وكيل ومصدر يمثل مصدرًا فوتوغرافيًا يتضمن مسؤولية وكيل عن التصوير الفوتوغرافي. @ar
definition: 将一个行为者与作为一种摄影资源并涉及一个行为者对摄影的责任的一种资源关联起来。 @zh-hans

is interviewer of
lexical alias: interviewerOf.en
status: Published
type: Property
label: er interviewer i @da
label: görüşmecisidir @tr
label: haastattelija (toimija) aineistossa @fi
label: interjúkészítője a következőnek: @hu
label: is interviewer van @nl
label: ist Interviewerin/Interviewer von @de
label: هو مُحاور لـ @ar
label: 是……的采访者 @zh-hans
sub property of: is creator of
inverse of: has interviewer
definition: Bir temsilciyi, görüşme, raporlama veya diğer bazı bilgi kaynaklarını toplayan temsilcinin katkısını içeren bir kaynakla ilişkilendirir. @tr
definition: Hozzákapcsol egy ágenst egy forráshoz, amely magában foglalja egy ágens közreműködését interjúban, riportban vagy más információgyűjtő ágensként. @hu
definition: Liittää toimijan aineistoon, jossa toimija vastaa aineiston luomisesta toimimalla haastattelijana, toimittajana, mielipidetutkijana tai muunlaisena tiedonkerääjänä. @fi
definition: Relaterer en agent, der er ansvarlig for at have skabt en ressource ved at optræde som interviewer, journalist, medarbejder ved et meningsmålingsinstitut eller en anden informationsindsamler til en ressource. @da
definition: Relates an agent to a resource that includes a contribution by an agent of interviewing, reporting, or some other information gathering agent.
definition: Setzt einen Akteur in Beziehung zu einer Ressource, zu der ein Akteur beiträgt, indem er als Interviewerin/Interviewer, Reporterin/Reporter, Meinungsforscherin/Meinungsforscher oder anderweitig Informationen zusammenträgt. @de
definition: يربط بين وكيل ومصدر يتضمن مساهمة وكيل في إجراء مقابلات، إعداد تقارير، أو وكيل من نوع آخر يجمع معلومات. @ar
definition: 将一个行为者与包括担当采访、报道、民意调查或其他类型信息搜集的一个行为者的贡献的一种资源关联起来。 @zh-hans

is artist of
has subproperty: is sculptor of
has subproperty: is calligrapher of
has subproperty: is book artist of
lexical alias: artistOf.en
status: Published
type: Property
label: er kunstner til @da
label: is kunstenaar van @nl
label: ist Künstlerin/Künstler von @de
label: művésze a következőnek: @hu
label: sanatçısıdır @tr
label: taiteilija (toimija) aineistossa @fi
label: هو فنان لـ @ar
label: 是……的美术家 @zh-hans
sub property of: is creator of
inverse of: has artist
definition: Bir temsilciyi, özgün bir grafik tasarım, çizim, resim…vb tasarlamak ve sıklıkla uygulamakla görevli bir temsilcinin sorumluluğu içeren bir kaynakla ilişkilendirir. @tr
definition: Hozzákapcsol egy ágenst egy forráshoz, amelyhez hozzátartozik egy ágens felelőssége egy eredeti grafikai terv, rajz, festmény stb. elgondolásáért és gyakran kivitelezéséért is. @hu
definition: Liittää toimijan aineistoon, jossa toimija vastaa alkuperäisen graafisen suunnittelun, piirroksen, maalauksen tms. luomisesta. @fi
definition: Relaterer en agent, der er ansvarlig for at have skabt en ressource ved at udtænke, og ofte udføre, et originalt grafisk design, en original tegning, et originalt maleri etc. til en ressource. @da
definition: Relates an agent to a resource that involves a responsibility of an agent for conceiving, and often implementing, an original graphic design, drawing, painting, etc.
definition: Setzt einen Akteur in Beziehung zu einer Ressource, bei der ein Akteur für die Konzeption und oft auch Umsetzung einer originalen grafischen Gestaltung, einer Zeichnung oder eines Gemäldes und so weiter verantwortlich ist. @de
definition: يربط بين وكيل ومصدر ينطوي على مسؤولية وكيل عن وضع تصور لتصميم جرافيكي، أو لرسم، أو للوحة زيتية أصلية، إلخ وغالباً تنفيذها. @ar
definition: 将一个行为者与涉及构思并经常是完成原创图形设计、绘图、绘画等的一个行为者的责任的一种资源关联起来。 @zh-hans

is interviewee of
lexical alias: intervieweeOf.en
status: Published
type: Property
label: er interviewet i @da
label: görüşülenidir @tr
label: haastateltava (toimija) aineistossa @fi
label: interjúalanya a következőnek: @hu
label: is geïnterviewde van @nl
label: ist Interviewte/Interviewter von @de
label: هو ضيف مقابلة لـ @ar
label: 是……的受访者 @zh-hans
sub property of: is creator of
inverse of: has interviewee
definition: Bir temsilciyi, genellikle bir muhabir veya bilgi toplayan başka bir temsilci tarafından görüşülen bir temsilcinin katksının içeren bir kaynakla ilişkilendirir. @tr
definition: Hozzákapcsol egy ágenst egy forráshoz, amelyhez hozzátartozik egy ágens felelőssége a válaszadásért egy interjúkészítőnek, rendszerint egy riporternek, vagy más információgyűjtő ágensnek. @hu
definition: Liittää toimijan aineistoon, jossa toimija on osallisena vastaamalla haastattelijalle. Yleensä haastattelija on toimittaja, mielipidetutkija tai muunlainen tiedonkeruun tekijä. @fi
definition: Relaterer en agent, der er ansvarlig for at have skabt en ressource ved at besvare spørgsmål fra en interviewer, normalt en journalist, medarbejder ved et meningsmålingsinstitut eller en anden informationsindsamler en ressource.. @da
definition: Relates an agent to a resource that includes a contribution by an agent of being interviewed, usually by a reporter or some other information gathering agent.
definition: Setzt einen Akteur in Beziehung zu einer Ressource, zu der ein Akteur beiträgt, indem er einer Interviewerin/einem Interviewer antwortet. Dabei handelt es sich normalerweise um eine Reporterin/einen Reporter oder einen anderen Akteur, der Informationen zusammenträgt. @de
definition: يربط بين وكيل ومصدر يتضمن إسهام وكيل بإجراء مقابلة معه، عادةً من جانب مراسل أو وكيل من نوع آخر يجمع معلومات. @ar
definition: 将一个行为者与涉及被采访（通常是被记者或其他信息收集行为者采访）的一个行为者的责任的一种资源关联起来。 @zh-hans

is choreographer of
lexical alias: choreographerOf.en
status: Published
type: Property
label: er koreograf til @da
label: is choreograaf van @nl
label: ist Choreografin/Choreograf von @de
label: koreografi (toimija) aineistossa @fi
label: koreografıdır @tr
label: koreográfusa a következőnek: @hu
label: هو مصمم رقصات لـ @ar
label: 是……的编舞者 @zh-hans
sub property of: is creator of
inverse of: has choreographer
definition: Bir temsilciyi, koreografi için bir temsilcinin sorumluluğunu içeren bir koreografik kaynak ile ilişkilendirir @tr
definition: Hozzákapcsol egy ágenst egy koreografikus forráshoz, amelyhez hozzátartozik egy ágens felelőssége a koreográfiáért. @hu
definition: Liittää toimijan aineistoon, jossa toimija vastaa koreografisesta aineistosta. @fi
definition: Relaterer en agent, der er ansvarlig for at have skabt en ressource af bevægelser til en ressource. @da
definition: Relates an agent to a choreographic resource that involves a responsibility of an agent for choreography.
definition: Setzt einen Akteur in Beziehung zu einer choreografischen Ressource, bei der ein Akteur für die Choreografie verantwortlich ist. @de
definition: يربط بين وكيل ومصدر رقص ينطوي على مسؤولية وكيل عن تصميم الرقصات. @ar
definition: 将一个行为者与涉及一个行为者的编舞责任的一种编舞资源关联起来。 @zh-hans

is author of
has subproperty: is screenwriter of
has subproperty: is lyricist of
has subproperty: is librettist of
has subproperty: is rapporteur of
lexical alias: authorOf.en
status: Published
type: Property
label: er forfatter til @da
label: is auteur van @nl
label: ist Verfasserin/Verfasser von @de
label: kirjoittaja (toimija) aineistossa @fi
label: szerzője a következőnek: @hu
label: yazarıdır @tr
label: هو مؤلف لـ @ar
label: 是……的著者 @zh-hans
sub property of: is creator of
inverse of: has author
definition: Bir temsilciyi, bir metin kaynağı oluşturmakla görevli bir temsilcinin sorumluluğunu içeren bir kaynakla ilişkilendirir @tr
definition: Hozzákapcsol egy ágenst egy forráshoz, amelyhez hozzátartozik egy ágens felelőssége egy szöveges forrás létrehozásáért. @hu
definition: Liittää toimijan aineistoon, jossa toimija vastaa tekstiaineiston luomisesta. @fi
definition: Relaterer en agent, der er ansvarlig for at have skabt en ressource hvis indhold primært består af tekst, uanset hvilken medietype eller genre der er tale om til en ressource. @da
definition: Relates an agent to a resource that involves a responsibility of an agent for creating a textual resource.
definition: Setzt einen Akteur in Beziehung zu einer Ressource, bei der ein Akteur für die Erschaffung einer textlichen Ressource verantwortlich ist. @de
definition: يربط بين وكيل ومصدر ينطوي على مسؤولية وكيل عن إنشاء مصدر نصي. @ar
definition: 将一个行为者与涉及创作一种文字资源的一个行为者的责任的一种资源关联起来。 @zh-hans

is architect of
has subproperty: is landscape architect of
lexical alias: architectOf.en
status: Published
type: Property
label: arkkitehti (toimija) aineistossa @fi
label: er arkitekt til @da
label: is architect van @nl
label: ist Architektin/Architekt von @de
label: mimarıdır @tr
label: építésze a következőnek: @hu
label: هو مهندس معماري لـ @ar
label: 是……的建筑设计师 @zh-hans
sub property of: is creator of
inverse of: has architect
definition: Bir temsilciyi, bir binanın veya başka bir yapının tamamlandığında nasıl görüneceğini göstermeyi amaçlayan resimli bir sunum da dahil olmak üzere, bir mimari tasarım oluşturmakla görevli bir temsilcinin sorumluluğunu içeren bir kaynakla ilişkilendirir. @tr
definition: Hozzákapcsol egy ágenst egy forráshoz, amelyhez hozzátartozik egy ágens felelőssége egy építészeti terv létrehozásáért, beleértve egy képi reprezentációt, amely bemutatja, hogy egy épület vagy más szerkezet hogyan fog kinézni, amikor elkészül. @hu
definition: Liittää toimijan aineiston, jossa toimija vastaa arkkitehtisuunnitelman luomisesta, mukaan lukien kuvaesityksestä, jonka tarkoitus on näyttää, miltä rakennus tai muu rakennelma näyttää valmiina. @fi
definition: Relaterer en agent, der er ansvarlig for at have skabt et arkitektonisk design, inkl. en billedrepræsentation, der er beregnet til at vise, hvordan en bygning etc. vil se ud, når den er færdig til et værk. @da
definition: Relates an agent to a resource that involves a responsibility of an agent for creating an architectural design, including a pictorial representation intended to show how a building or other structure will look when completed.
definition: Setzt einen Akteur in Beziehung zu einer Ressource, bei der ein Akteur für einen architektonischen Entwurf verantwortlich ist, einschließlich einer bildlichen Darstellung, die zeigt, wie ein Gebäude oder eine andere Konstruktion nach der Fertigstellung aussehen soll. @de
definition: يربط بين وكيل ومصدر ينطوي على مسؤولية وكيل عن إنشاء تصميم معماري، ويشمل ذلك عمل تمثيل تصويري لبيان كيف سيبدو مبنى أو هيكل آخر عند اكتماله. @ar
definition: 将一个行为者与涉及建筑设计（包括用于展示建筑或其他结构完成之后外观效果的绘画作品）创作的一个行为者的责任的一种资源关联起来。 @zh-hans

is filmmaker of
lexical alias: filmmakerOf.en
status: Published
type: Property
label: elokuvantekijä (toimija) aineistossa @fi
label: er filmskaber til @da
label: film üreticisidir @tr
label: filmkészítője a következőnek: @hu
label: is filmmaker van @nl
label: ist Filmemacherin/Filmemacher von @de
label: هو صانع أفلام لـ @ar
label: 是……的制片人 @zh-hans
sub property of: is creator of
inverse of: has filmmaker
definition: Bir temsilciyi, bağımsız veya kişisel bir filme ilişkin bir temsilcinin sorumluluğu içeren bir kaynakla ilişkilendirir. @tr
definition: Hozzákapcsol egy ágenst egy forráshoz, amelyhez hozzátartozik egy ágens felelőssége egy független- vagy magánfilmért. @hu
definition: Liittää toimijan aineistoon, jossa toimija vastaa itsenäisen tai henkilökohtaisen elokuvan luomisesta. @fi
definition: Relaterer en agent der er ansvarlig for at have skabt en uafhængig eller personlig film til en ressource. @da
definition: Relates an agent to a resource that involves a responsibility of an agent for an independent or personal film.
definition: Setzt einen Akteur in Beziehung zu einer Ressource, bei der ein Akteur für die Schaffung eines unabhängigen oder privaten Films verantwortlich ist. @de
definition: يربط بين وكيل ومصدر ينطوي على مسؤولية وكيل عن فيلم مستقل أو شخصي. @ar
definition: 将一个行为者与涉及创作一部独立或个人电影的一个行为者的责任的一种资源关联起来。 @zh-hans

is production designer of
lexical alias: productionDesignerOf.en
status: Published
type: Property
label: er produktionsdesigner for @da
label: is productieontwerper van @nl
label: ist Szenenbildnerin/Szenenbildner von @de
label: látványtervezője a következőnek: @hu
label: tuotannonsuunnittelija (toimija) aineistossa @fi
label: yapım tasarımcısıdır @tr
label: هو مصمم إنتاج لـ @ar
label: 是……的制作设计者 @zh-hans
sub property of: is contributor of (Deprecated)
inverse of: has production designer
definition: Bir aracıyı, hareketli bir görüntü yapımının genel görsel görünümünü tasarlayan aracının katkısını içeren bir kaynakla ilişkilendirir @tr
definition: Hozzákapcsol egy ágenst egy forráshoz, amely magában foglalja egy tervező ágens közreműködését mozgókép-produkció általános vizuális megjelenésében. @hu
definition: Liittää toimijan aineistoon, jossa toimija vastaa elokuvatuotannon visuaalisen ilmeen suunnittelusta. @fi
definition: Relaterer en agent, der er ansvarlig for at have designet en levende billedproduktions overordnede visuelle udseende til en ressource. @da
definition: Relates an agent to a resource that includes a contribution by an agent of designing the overall visual appearance of a moving image production.
definition: Setzt einen Akteur in Beziehung zu einer Ressource, zu der ein Akteur beiträgt, indem er für die Gestaltung des gesamten visuellen Erscheinungsbilds einer Bewegtbildproduktion verantwortlich ist. @de
definition: يربط بين وكيل ومصدر يتضمن إسهام وكيل في تصميم الصورة المرئية العامة لإنتاج أفلام. @ar
definition: 将一个行为者与包括设计动态图像制作整体视觉效果的一个行为者的贡献的一种资源关联起来。 @zh-hans

is distributor of
has subproperty: is film distributor of
lexical alias: distributorOf.en
status: Published
type: Property
label: dağıtımcısıdır @tr
label: er distributør af @da
label: is distributeur van @nl
label: ist Vertrieb von @de
label: jakelija (toimija) aineistossa @fi
label: terjesztője a következőnek: @hu
label: هو مُوزع لـ @ar
label: 是……的发行者 @zh-hans
inverse of: has distributor
definition: Bir temsilciyi, dağıtımla görevli bir temsilcinin sorumluluğunu içeren bir kaynakla ilişkilendirir @tr
definition: Hozzákapcsol egy ágenst egy forráshoz, amelyhez hozzátartozik az ágens felelőssége a terjesztésért. @hu
definition: Liittää toimijan aineistoon, jossa toimija vastaa julkaistun aineiston jakelusta. @fi
definition: Relaterer en agent der er ansvarlig for distribution af en manifestation til en ressource. @da
definition: Relates an agent to a resource that involves a responsibility of an agent for distribution.
definition: Setzt einen Akteur in Beziehung zu einer Ressource, bei der ein Akteur für den Vertrieb verantwortlich ist. @de
definition: يربط بين وكيل ومصدر ينطوي على مسؤولية وكيل عن التوزيع. @ar
definition: 将一个行为者与涉及发行的一个行为者的责任的一种资源关联起来。 @zh-hans

is producer of
has subproperty: is film producer of
has subproperty: is radio producer of
has subproperty: is television producer of
has subproperty: is audio producer of
lexical alias: producerOf.en
status: Published
type: Property
label: er producer af @da
label: is producent van @nl
label: ist Produzentin/Produzent von @de
label: producere a következőnek: @hu
label: tuottaja (toimija) aineistossa @fi
label: yapımcısıdır @tr
label: هو مُنتج لـ @ar
label: 是……的制作者 @zh-hans
sub property of: is other agent associated with resource of (Deprecated)
inverse of: has producer
definition: Bir temsilciyi, ekran, ses kaydı, televiyon, web yayını vb.için bir prodüksiyonun ticari yönlerinin çoğundan sorumlu bir temsilcinin sorumluluğunu içeren bir kaynakla ilişkilendirir. @tr
definition: Hozzákapcsol egy ágenst egy forráshoz, amelyhez hozzátartozik egy ágens felelőssége képernyőre kerülő műsor, hangfelvétel, televíziós, webes közvetítés, stb. legtöbb üzleti vonatkozásáért. @hu
definition: Liittää toimijan aineistoon, jossa toimija vastaa suurimmasta osasta elokuvan liiketoimintaa. @fi
definition: Relaterer en agent, der er ansvarlig for størstedelen af de forretningsmæssige aspekter ved en produktion beregnet til lærred, lydoptagelse, tv, webcast etc. til en ressource. @da
definition: Relates an agent to a resource that involves a responsibility of an agent for most of the business aspects of a production for screen, sound recording, television, webcast, etc.
definition: Setzt einen Akteur in Beziehung zu einer Ressource, bei der ein Akteur für die meisten geschäftlichen Aspekte einer Produktion für die Leinwand, für eine Tonaufnahme, für das Fernsehen, für einen Webcast und so weiter verantwortlich ist. @de
definition: يربط بين وكيل ومصدر ينطوي على مسؤولية وكيل عن معظم جوانب العمل في إنتاج للشاشة، وللتسجيل الصوتي، وللتلفزيون، وللبث عبر الإنترنت، إلخ. @ar
definition: 将一个行为者与涉及对银幕、录音、电视、网络直播等制作的大部分商业运作的一个行为者的责任的一种资源关联起来。 @zh-hans

is manufacturer of
has subproperty: is braille embosser of
has subproperty: is printer of
lexical alias: manufacturerOf.en
status: Published
type: Property
label: er producent af @da
label: gyártója a következőnek: @hu
label: is vervaardiger van @nl
label: ist Hersteller von @de
label: valmistaja (toimija) aineistossa @fi
label: üreticisidir @tr
label: هو مُصّنع لـ @ar
label: 是……的生产者 @zh-hans
sub property of: is appellation of entity of
inverse of: has manufacturer
definition: Bir temsilciyi, yazdırma, çoğaltma, oyuncu seçimine…vb ilişkin bir temsilcinin sorumluluğunu içeren bir kaynakla ilişkilendirir @tr
definition: Hozzákapcsol egy ágenst egy forráshoz, amelyhez hozzátartozik az ágens felelőssége a nyomtatásért, sokszorosításért, öntésért, stb. @hu
definition: Liittää toimijan aineistoon, jossa toimija vastaa painamisesta, monistamisesta, kirjasinten valamisesta tai muusta valmistustavasta. @fi
definition: Relaterer en agent der er ansvarlig for trykning, duplikering, støbning etc., til en ressource. @da
definition: Relates an agent to a resource that involves a responsibility of an agent for printing, duplicating, casting, etc.
definition: Setzt einen Akteur in Beziehung zu einer Ressource, bei der ein Akteur für den Druck, die Vervielfältigung, den Guss und so weiter verantwortlich ist. @de
definition: يربط بين وكيل ومصدر ينطوي على مسؤولية وكيل عن الطباعة، النسخ، الطَرَح، إلخ. @ar
definition: 将一个行为者与涉及印刷、复制、铸造等的一个行为者的责任的一种资源关联起来。 @zh-hans

is publisher of
has subproperty: is broadcaster of
lexical alias: publisherOf.en
status: Published
type: Property
label: er udgiver af @da
label: is uitgever van @nl
label: ist Verlag von @de
label: kiadója a következőnek: @hu
label: kustantaja (toimija) aineistossa @fi
label: yayıncısıdır @tr
label: هو ناشر لـ @ar
label: 是……的出版者 @zh-hans
inverse of: has publisher
definition: Bir temsilciyi, yayınlama, piyasaya sürme veya çıkarmaya ilişkin bir temsilcinin sorumluluğunu içeren bir kaynakla ilişkilendirir. @tr
definition: Hozzákapcsol egy ágenst egy forráshoz, amelyhez hozzátartozik az ágens felelőssége közzétételért, kiadásért vagy kibocsátásért. @hu
definition: Liittää toimijan aineistoon, jossa toimija vastaa kustantamisesta, julkaisemisesta tai ilmestymisestä. @fi
definition: Relaterer en agent, der er ansvarlig for at publicere, offentliggøre eller udsende en ressource til en ressource. @da
definition: Relates an agent to a resource that involves a responsibility of an agent for publishing, releasing, or issuing.
definition: Setzt einen Akteur in Beziehung zu einer Ressource, bei der ein Akteur für das Veröffentlichen, die Freigabe oder die Herausgabe verantwortlich ist. @de
definition: يربط بين وكيل ومصدر ينطوي على مسؤولية وكيل عن النشر، أو التحرير، أو الإصدار. @ar
definition: 将一个行为者与涉及出版、发布或发行的一个行为者的责任的一种资源关联起来。 @zh-hans

is minute taker of
lexical alias: minuteTakerOf.en
status: Published
type: Property
label: er referent i @da
label: is notulist van @nl
label: ist Protokollantin/Protokollant von @de
label: jegyzőkönyvvezetője a következőnek: @hu
label: pöytäkirjan laatija (toimija) aineistossa @fi
label: zabıt katibidir @tr
label: هو مدون لمحضر اجتماع لـ @ar
label: 是……的会议记录者 @zh-hans
sub property of: is contributor of (Deprecated)
inverse of: has minute taker
definition: Bir temsilciyi, bir toplantının tutanaklarını kaydeden temsilcinin katkısını içeren bir kaynakla ilişkilendirir @tr
definition: Hozzákapcsol egy ágenst egy forráshoz, amely magában foglalja az ágens közreműködését egy értekezlet jegyzőkönyvének rögzítésében. @hu
definition: Liittää toimijan aineistoon, jossa toimija vastaa kokouksen pöytäkirjan laatimisesta. @fi
definition: Relaterer en agent der er ansvarlig for at have taget referat ved et møde til en ressource. @da
definition: Relates an agent to a resource that includes a contribution by an agent of recording the minutes of a meeting.
definition: Setzt einen Akteur in Beziehung zu einer Ressource, zu der ein Akteur beiträgt, indem er für das Aufzeichnen des Protokolls einer Sitzung verantwortlich ist. @de
definition: يربط بين وكيل ومصدر يتضمن إسهام وكيل في تسجيل محاضر اجتماع. @ar
definition: 将一个行为者与包括写会议记录的一个行为者的贡献的一种资源关联起来。 @zh-hans

is creator of
has subproperty: is respondent of
has subproperty: is collector of
has subproperty: is enacting government of
has subproperty: is book designer of
has subproperty: is printmaker of
has subproperty: is caster of
has subproperty: is degree supervisor of
has subproperty: is programmer of
has subproperty: is designer of
has subproperty: is cartographer of
has subproperty: is composer of
has subproperty: is inventor of
has subproperty: is photographer of
has subproperty: is interviewer of
has subproperty: is artist of
has subproperty: is interviewee of
has subproperty: is choreographer of
has subproperty: is author of
has subproperty: is architect of
has subproperty: is filmmaker of
has subproperty: is praeses of
has subproperty: is consultant of
has subproperty: is commissioning agent of
has subproperty: is remix artist of
has subproperty: is casting director of
lexical alias: creatorOf.en
status: Published
type: Property
label: er ophav til @da
label: is maker van @nl
label: ist Geistige Schöpferin/Geistiger Schöpfer von @de
label: létrehozója a következőnek: @hu
label: tekijä (toimija) aineistossa @fi
label: yaratıcısıdır @tr
label: هو مُبدع لـ @ar
label: 是……的创作者 @zh-hans
inverse of: has creator
definition: Bir temsilciyi, bir oluşumun sorumluluğunu içeren bir kaynakla ilişkilendirir @tr
definition: Hozzákapcsol egy ágenst egy forráshoz, amelyhez hozzátartozik egy ágens felelőssége a létrehozásért. @hu
definition: Liittää toimijan aineistoon, jossa toimija vastaa aineiston luomisesta. @fi
definition: Relaterer en agent der er ansvarlig for skabelse af en ressource til en ressource. @da
definition: Relates an agent to a resource that involves a creation responsibility.
definition: Setzt einen Akteur in Beziehung zu einer Ressource, die mit einer Verantwortung bei der Erstellung verbunden ist. @de
definition: يربط بين وكيل مصدر يتضمن مسؤولية إبداعية. @ar
definition: 将一个行为者与涉及一个创作责任的一种资源关联起来。 @zh-hans

is director of
has subproperty: is film director of
has subproperty: is radio director of
has subproperty: is television director of
lexical alias: directorOf.en
status: Published
type: Property
label: er instruktør til @da
label: is regisseur van @nl
label: ist Regisseurin/Regisseur von @de
label: ohjaaja (toimija) aineistossa @fi
label: rendezője a következőnek: @hu
label: yönetmenidir @tr
label: هو مخرج لـ @ar
label: 是……的导演 @zh-hans
sub property of: is other agent associated with resource of (Deprecated)
inverse of: has director
definition: Bir temsilciyi, filme alınmış bir performansın, bir radyo veya televizyon programının vb. genel yönetimi ve denetiminden sorumlu bir temsilcinin sorumluluğunu içeren bir kaynakla ilişkilendirir. @tr
definition: Hozzákapcsol egy ágenst egy forráshoz, amelyhez hozzátartozik az ágens felelőssége egy filmforgatás, egy rádió- vagy televízióműsor, stb. általános menedzseléséért és felügyeletéért. @hu
definition: Liittää toimijan aineistoon, jossa toimija vastaa a elokuvaesityksen, radio- tai televisio-ohjelman tms. yleisestä johtamisesta. @fi
definition: Relaterer en agent der er ansvarlig for ledelse af og tilsyn med en filmoptagelse, et radio- eller tv-program etc. til en ressource. @da
definition: Relates an agent to a resource that involves a responsibility of an agent for the general management and supervision of a filmed performance, a radio or television program, etc.
definition: Setzt einen Akteur in Beziehung zu einer Ressource, bei der ein Akteur für das allgemeine Management und die Leitung einer verfilmten Darbietung, einer Hörfunk- oder Fernsehsendung und so weiter verantwortlich ist. @de
definition: يربط بين وكيل ومصدر ينطوي على مسؤولية وكيل عن الإدارة العامة والإشراف على أداء فيلم، برنامج إذاعي أو برنامج تلفزيوني، إلخ. @ar
definition: 将一个行为者与涉及电影表演、广播或电视节目等的全面管理和监督的一个行为者的责任的一种资源关联起来。 @zh-hans

is restorationist of
lexical alias: restorationistOf.en
status: Published
type: Property
label: entisöijä (toimija) aineistossa @fi
label: er konservator af @da
label: is restaurator van @nl
label: ist Restauratorin/Restaurator von @de
label: restaurátora a következőnek: @hu
label: restorasyon uzmanıdır @tr
label: هو أخصائي ترميم لـ @ar
label: 是……的修复者 @zh-hans
sub property of: is other agent associated with resource of (Deprecated)
inverse of: has restorationist
definition: Bir temsilciyi, bir dizi teknik, editoryal ve entelektüel işlemler kullanarak orijinal haline mümkün olduğunca yakın bir duruma geri getirerek bozulmanın telafisinden sorumlu bir temsilcinin sorumluluğunu içeren bir kaynakla ilişkilendirir. @tr
definition: Hozzákapcsol egy ágenst egy forráshoz, amelyhez hozzátartozik az ágens felelőssége technikai, szerkesztői és intellektuális eljárások alkalmazásáért, amivel ellensúlyozza a forrás romlását, hogy az eredeti állapotához a lehető legközelebb állítsa azt vissza. @hu
definition: Liittää toimijan aineistoon, jossa toimija vastaa teknisistä, toimituksellisista ja tiedollisista toimenpiteistä, joiden tarkoitus on palauttaa huonokuntoinen aineisto mahdollisimman lähelle sen alkuperäistä kuntoa. @fi
definition: Relaterer en agent, der er ansvarlig for rækken af tekniske, redaktionsmæssige og intellektuelle procedurer, der sigter mod at kompensere for forringelsen af en ressource ved at føre den tilbage til en tilstand, der er så tæt som muligt på dens oprindelige tilstand til en ressource. @da
definition: Relates an agent to a resource that involves a responsibility of an agent for compensation of degradation by bringing it back to a state as close as possible to its original condition using a set of technical, editorial, and intellectual procedures.
definition: Setzt einen Akteur in Beziehung zu einer Ressource, bei der ein Akteur für die technischen, redaktionellen und intellektuellen Verfahren verantwortlich ist, die darauf abzielen, die Zersetzung einer Ressource auszugleichen, indem sie in einen Zustand zurückversetzt wird, der ihrer ursprünglichen Beschaffenheit möglichst nahe kommt. @de
definition: يربط بين وكيل ومصدر ينطوي على مسؤولية وكيل عن التعويض عن تدهور حالته عن طريق إعادته إلى حالته الأصلية قدر المستطاع باستخدام مجموعة من الإجراءات الفنية، والتحريرية، والفكرية. @ar
definition: 将一个行为者与涉及为弥补损毁而担负一系列技术、编辑和智力操作、使之尽可能恢复到原始状态的一个行为者的责任的一种资源关联起来。 @zh-hans

has sponsored resource of agent
lexical alias: sponsoriedResourceOfAgent.en
status: Published
type: Property
label: er sponsorerende institution for @da
label: hat Akteur als Trägerin/Träger eines Werks von @de
label: heeft gesponsorde resource van actor @nl
label: sponsori (toimija) aineistossa @fi
label: temsilcinin sponsor olduğu kaynak ile ilişkilidir @tr
label: ágens szponzorált forrása a következő: @hu
label: له مصدر راعي لوكيل @ar
label: 有行为者的被赞助资源 @zh-hans
sub property of: is other agent associated with resource of (Deprecated)
inverse of: has sponsoring agent of resource
definition: Bir temsilciyi, bir kaynağın bazı yönlerini desteklemekle görevli bir temsilcinin sorumluluğunu içeren bir kaynakla ilişkilendirir @tr
definition: Hozzákapcsol egy ágenst egy forráshoz, amelyhez hozzátartozik az ágens felelőssége egy mű szponzorálásának valamely vonatkozásáért. @hu
definition: Liittää toimijan aineistoon, jossa toimija vastaa aineiston sponsoroinnista joltakin osin. @fi
definition: Relaterer en agent, der har sponsoreret et aspekt af en ressource, fx forskningsfinansiering, sponsorering af en event til en ressource. @da
definition: Relates an agent to a resource that involves a responsibility of an agent for sponsoring some aspect of a resource,
definition: Setzt einen Akteur in Beziehung zu einer Ressource, bei der ein Akteur für die finanzielle Unterstützung einzelner Aspekte einer Ressource verantwortlich ist. @de
definition: يربط بين وكيل ومصدر ينطوي على مسؤولية وكيل عن رعاية بعض جوانب مصدر. @ar
definition: 将一个行为者与涉及赞助一种资源某个方面的一个行为者的责任的一种资源关联起来。 @zh-hans
scope note: Darunter fallen Forschungsförderungen und die finanzielle Unterstützung einer Veranstaltung, die die Grundlage eines Werks bilden. @de
scope note: Includes funding research and sponsoring an event that is the basis of a resource.
scope note: Kattaa tutkimuksen rahoituksen ja teoksen perustana olevan tapahtuman sponsoroinnin. @fi
scope note: Magában foglalja kutatás finanszírozását és egy esemény szponzorálását, amely egy forrás alapját képezi. @hu
scope note: Omfatter finansiering af forskning og sponsorering af et event, der er basis for en ressource. @da
scope note: temsilcinin sponsor olduğu kaynak ile ilişkilidir @tr
scope note: يشمل ذلك تمويل البحوث ورعاية حدث يكون أساس لمصدر. @ar
scope note: 包括作为一种资源基础的科研资助和活动赞助 @zh-hans

has sponsoring agent of agent
lexical alias: sponsoringAgentOfAgent.en
status: Published
type: Property
label: har sponsor @da
label: hat Trägerin/Träger eines Akteurs @de
label: heeft sponsor van actor @nl
label: sponsoroiva toimija aineistossa @fi
label: temsilcinin sponsoru olan temsilci ile ilişkilidir @tr
label: ágens szponzoráló ágense a következő: @hu
label: له وكيل راعي لوكيل @ar
label: 有行为者的赞助行为者 @zh-hans
inverse of: has sponsored agent of agent
definition: Bir temsilciyi, bir temsilciye sponsor olan bir temsilciyle ilişkilendirir @tr
definition: Hozzákapcsol egy ágenst szponzoráló ágenst egy ágenshez. @hu
definition: Liittää toimijaan toimijaa sponsoroivan toimijan. @fi
definition: Relaterer en agent der sponsorerer en agent til en agent. @da
definition: Relates an agent sponsoring an agent to an agent.
definition: Setzt einen Akteur in Beziehung zu einem Akteur, der einen Akteur fördert. @de
definition: يربط بين وكيل راعي لوكيل ووكيل. @ar
definition: 将一个行为者与赞助一个行为者的一个行为者关联起来。 @zh-hans

is director of photography of
lexical alias: directorOfPhotographyOf.en
status: Published
type: Property
label: er filmfotograf til @da
label: görüntü yönetmenidir @tr
label: is cameraregisseur van @nl
label: ist Kamerafrau/Kameramann von @de
label: kuvaaja (toimija) aineistossa @fi
label: operatőre a következőnek: @hu
label: هو مدير التصوير الفوتوغرافي لـ @ar
label: 是……的摄影指导 @zh-hans
sub property of: is other agent associated with resource of (Deprecated)
inverse of: has director of photography
definition: Bir temsilciyi, elektronik olarak veya film veya video stoğundaki görüntülerin yakalanması ve genellikle aydınlatmanın seçilmesi ve düzenlenmesi için bir aracının sorumluluğunu içeren bir kaynakla ilişkilendirir. @tr
definition: Hozzákapcsol egy ágenst egy forráshoz, amelyhez hozzátartozik az ágens felelőssége képek elektronikusan, filmen vagy videoállományon történő rögzítéséért, gyakran a világítás kiválasztásáért és elrendezéséért is. @hu
definition: Relaciona un agent amb un recurs que inclou una responsabilitat d’un agent en la captura d’imatges, ja sigui electrònicament o sobre pel·lícula o vídeo, i que sovint selecciona i organitza la il·luminació. @ca
definition: Relaterer en agent, der optager billeder, enten elektronisk eller på film eller video og ofte vælger og arrangerer lyssætning. @da
definition: Relates an agent to a resource that involves a responsibility of an agent for capturing images, either electronically or on film or video stock, and often selecting and arranging the lighting.
definition: Setzt einen Akteur in Beziehung zu einer Ressource, bei der ein Akteur für die Aufzeichnung von Bildern, entweder elektronisch oder auf Film- oder Videomaterial, verantwortlich ist und häufig die Belichtung auswählt und arrangiert. @de
definition: n vastaa kuvien tallentamisesta joko sähköisesti tai filmille tai videolle, usein myös valaistuksen valitsemisesta ja järjestämisestä. @fi
definition: يربط بين وكيل ومصدر ينطوي على مسؤولية وكيل عن التقاط الصور، إما إلكترونيًا أو في فيلم أو فيديو، وغالبا ما يكون مسئولا عن اختيار الإضاءة وتوزيعها. @ar
definition: 将一个行为者与涉及通过电子、胶片或视频存储方式摄录影像、且经常负责灯光的选择和布置的一个行为者的责任的一种资源关联起来。 @zh-hans

has employer
lexical alias: employer.en
status: Published
type: Property
label: har arbejdsgiver @da
label: hat Arbeitgeberin/Arbeitgeber @de
label: heeft werkgever @nl
label: işveren ile ilişkilidir @tr
label: munkaadója a következő: @hu
label: työnantaja (toimija) @fi
label: له موظف @ar
label: 有雇员 @zh-hans
inverse of: has employee
definition: Bir temsilci istihdam eden bir temsilciyi bir temsilci ile ilişkilendirir. @tr
definition: Hozzákapcsol egy ágenst alkalmazó ágenst egy ágenshez. @hu
definition: Liittää toimijan toimijaan, joka työllistää toimijan. @fi
definition: Relaciona un agent amb un agent que emplea un agent. @ca
definition: Relaterer en agent der ansætter en agent til en agent. @da
definition: Relates an agent to an agent who employs an agent.
definition: Setzt einen Akteur in Beziehung zu einem Akteur, der einen Akteur beschäftigt. @de
definition: يربط بين وكيل يوظف وكيلًا ووكيل @ar
definition: 将一个行为者与雇用一个行为者的一个行为者关联起来。 @zh-hans

has hierarchical superior
lexical alias: hierarchicalSuperior.en
status: Published
type: Property
label: har hierarkisk overordnet @da
label: hat übergeordneten Akteur @de
label: heeft moederonderneming @nl
label: hierarchikus felettese a következő: @hu
label: hiyerarşik olarak bağlı üst kuruluş ile ilişkilidir @tr
label: kattoyhteisö (yhteistoimija) @fi
label: له رتبة أعلى في التسلسل الرئاسي @ar
label: 有上级 @zh-hans
inverse of: has hierarchical subordinate
definition: Hozzákapcsol egy ágenst, amely egy kapcsolódó ágens hierarchikus felettese, egy ágenshez. @hu
definition: Liittää yhteistoimijan yhteistoimijaan, joka on hierarkkisesti toista yhteistoimijaa ylempänä. @fi
definition: Relaciona un agent amb un agent que és jeràrquicament superior a un altre agent. @ca
definition: Relaterer en agent der er hierarkisk overordnet en anden agent til en agent. @da
definition: Relates an agent to an agent who is hierarchically superior to another agent.
definition: Setzt einen Akteur in Beziehung zu einem Akteur, der einem anderen Akteur übergeordnet ist. @de
definition: İlgili bir temsilciden hiyerarşik olarak üstün olan bir temsilciyi bir temsilciyle ilişkilendirir. @tr
definition: يربط بين وكيل ووكيل في مرتبة أعلى في التسلسل الرئاسي من وكيل ذي صلة. @ar
definition: 将一个行为者与另一个行为者的上级行为者关联起来。 @zh-hans

has hierarchical subordinate
lexical alias: hierarchicalSubordinate.en
status: Published
type: Property
label: alayhteisö (yhteistoimija) @fi
label: har hierarkisk underordnet @da
label: hat untergeordneten Akteur @de
label: heeft dochteronderneming @nl
label: hierarchikus alárendeltje a következő: @hu
label: hiyerarşik olarak bağlı alt kuruluş ile ilişkilidir @tr
label: له رتبة أدنى في التسلسل الرئاسي @ar
label: 有下级 @zh-hans
inverse of: has hierarchical superior
definition: Hozzákapcsol egy ágenst, amely egy kapcsolódó ágens hierarchikus alárendeltje, egy ágenshez. @hu
definition: Liittää yhteistoimijan yhteistoimijaan, joka on hierarkkisesti toisen yhteistoimijan alainen. @fi
definition: Relaciona un agent amb un agent que està subordinat a un altre agent. @ca
definition: Relaterer en agent der er underordnet en agent til en agent. @da
definition: Relates an agent to an agent who is subordinate to another agent.
definition: Setzt einen Akteur in Beziehung zu einem Akteur, der einem anderen Akteur untergeordnet ist. @de
definition: İlgili bir temsilciye bağlı olan bir temsilciyi bir temsilciyle ilişkilendirir. @tr
definition: يربط بين وكيل ووكيل في مرتبة أدنى من وكيل ذي صلة. @ar
definition: 将一个行为者与另一个行为者的下级行为者关联起来。 @zh-hans

has mergee
lexical alias: mergee.en
status: Published
type: Property
label: beolvadója a következő: @hu
label: birleşen kurum ile ilişkilidir @tr
label: har sammenlagt korporation @da
label: hat fusionierten Akteur @de
label: heeft fusiepartner @nl
label: kanssayhdistyjä (yhteistoimija) @fi
label: له هيئة مندمجة @ar
label: 有被合并的一方 @zh-hans
definition: Bir temsilcinin üçte birini oluşturmak için ilgili bir temsilci ile birleşen bir temsilciyle ilişkilendirir @tr
definition: Hozzákapcsol egy ágenst, amely egy harmadikat alkotva összeolvad egy kapcsolódó ágenssel, egy ágenshez. @hu
definition: Liittää toimijan yhteistoimijaan, joka on sulautunut toiseen muodostaakseen kolmannen yhteistoimijan. @fi
definition: Relaciona un agent amb un agent que s’ha fusionat amb un altre agent per formar-ne un tercer. @ca
definition: Relaterer en agent der er sammenlagt med en anden agent for at skabe en tredje agent til en agent. @da
definition: Relates an agent to an agent who merged with another agent to form a third.
definition: Setzt einen Akteur in Beziehung zu einem Akteur, der mit einem anderen Akteur fusioniert, um einen neue zu bilden. @de
definition: يربط بين وكيل ووكيل اندمج مع وكيل ذي صلة ليُشكلا وكيلًا ثالثًا. @ar
definition: 将一个行为者与一个和另一行为者合并后形成第三个行为者的行为者关联起来。 @zh-hans

has predecessor
lexical alias: predecessor.en
status: Published
type: Property
label: elődje a következő: @hu
label: har forgænger @da
label: hat Vorgängerin/Vorgänger @de
label: heeft voorganger @nl
label: yhteistoimijan edeltäjä @fi
label: önceki ile ilişkilidir @tr
label: له سَلَف @ar
label: 有前身 @zh-hans
inverse of: has successor
definition: Hozzákapcsol egy ágenst, amely egy kapcsolódó ágens elődje, egy ágenshez. @hu
definition: Liittää yhteisön toista yhteistoimijaa edeltäneeseen yhteistoimijaan. @fi
definition: Relaterer en agent der går forud for en anden agent til en agent. @da
definition: Relates an agent who precedes a related agent to an agent.
definition: Setzt einen Akteur in Beziehung zu einem Akteur, der einem Akteur vorausgeht. @de
definition: İlgili bir temsilciden önce gelen bir temsilciyi bir temsilciyle ilişkilendirir. @tr
definition: يربط بين وكيل ووكيل يسبق وكيل ذو صلة. @ar
definition: 将一个作为一个相关行为者前身的行为者与一个行为者关联起来。 @zh-hans

has product of merger
lexical alias: productOfMerger.en
status: Published
type: Property
label: beolvadás eredménye a következő: @hu
label: birleşme sonucu oluşan tüzel kişi ile ilişkilidir @tr
label: har produkt af sammenlægning @da
label: hat Ergebnis einer Fusion @de
label: heeft resultaat van fusie @nl
label: yhdistymisestä muodostunut yhteistoimija @fi
label: له نتاج اندماج @ar
label: 有合并而成的行为者 @zh-hans
inverse of: has component of merger
definition: Hozzákapcsol egy ágenst, amelyet két vagy több más ágens összeolvadása eredményezett, egy ágenshez. @hu
definition: Kahden tai useamman yhteistoimijan yhdistymisestä muodostunut yhteistoimija. @fi
definition: Relaterer en agent der er resultatet af en sammenlægning af to eller flere andre agenter til en agent. @da
definition: Relates an agent who resulted from a merger of two or more other agents to an agent.
definition: Setzt einen Akteur in Beziehung zu einem Akteur, der aus einer Fusion von zwei oder mehreren Akteuren entstanden ist. @de
definition: İki veya daha fazla temsilcinin birleşmesi sonucu ortaya çıkan bir temsilciyi bir temsilciyle ilişkilendirir. @tr
definition: يربط بين وكيل ووكيل نتج عن اندماج وكيلين أو أكثر من الوكلاء الأخرين. @ar
definition: 将两个其他行为者合并后产生的一个行为者与一个行为者与关联起来。 @zh-hans

has product of split
lexical alias: productOfSplit.en
status: Published
type: Property
label: bölünme sonucu oluşan tüzel kişi ile ilişkilidir @tr
label: har produkt af en opsplitning @da
label: hat Ergebnis einer Aufteilung @de
label: heeft resultaat van splitsing @nl
label: jakautumisesta muodostunut yhteistoimija @fi
label: szétválás terméke a következő: @hu
label: له نتاج انفصال @ar
label: 有分出的行为者 @zh-hans
inverse of: has predecessor of split
definition: Hozzákapcsol egy ágenst, amelyet egy kapcsolódó ágens szétválása vagy felosztása eredményezett, egy ágenshez. @hu
definition: Liittää yhteistoimijan yhteistoimijaan, joka on seuraus toisen yhteistoimijan jakautumisesta. @fi
definition: Relaterer en agent der er resultatet af en opsplitning af to eller flere andre agenter til en agent. @da
definition: Relates an agent who resulted from a split or division of a related agent to an agent.
definition: Setzt einen Akteur in Beziehung zu einem Akteur, der aus einer Aufteilung oder einer Teilung eines anderen Akteurs entstanden ist. @de
definition: İlgili bir temsilcinin bölünmesi veya ayrılması sonucu ortaya çıkan bir temsilciyi bir temsilciyle ilişkilendirir. @tr
definition: يربط بين وكيل ووكيل نتج عن انفصال أو تقسيم وكيل ذي صلة. @ar
definition: 将一个相关行为者分出或划分后形成的一个行为者与一个行为者关联起来。 @zh-hans

has successor
lexical alias: successor.en
status: Published
type: Property
label: har efterfølger @da
label: heeft opvolger @nl
label: ist Nachfolgerin/Nachfolger @de
label: seuraaja (yhteistoimija) @fi
label: utódja a következő: @hu
label: yerine geçen ile ilişkilidir @tr
label: له خَلِيفَة @ar
label: 有后继 @zh-hans
inverse of: has predecessor
definition: Hozzákapcsol egy ágenst, amely egy kapcsolódó ágenst követ vagy annak utódja, egy ágenshez. @hu
definition: Liittää yhteistoimijan toista yhteistoimijaa seuraavaan tai jatkavaan yhteistoimijaan. @fi
definition: Relaterer en agent der efterfølger eller kommer efter en anden agent til en agent. @da
definition: Relates an agent who succeeds or follows a related agent to an agent.
definition: Setzt einen Akteur in Beziehung zu einem Akteur, der einem anderen Akteur nachfolgt oder aus ihm hervorgeht. @de
definition: İlgili bir temsilciden sonra gelen veya onu takip eden bir temsilciyi bir temsilciyle ilişkilendirir. @tr
definition: يربط بين وكيل ووكيل يخلف أو يلي وكيل ذو صلة. @ar
definition: 将一个后继或紧随一个相关行为者的行为者与一个行为者关联起来。 @zh-hans

has founded agent of agent
lexical alias: foundedAgentOfAgent.en
status: Published
type: Property
label: har grundlagt entitet @da
label: hat gegründeten Akteur durch einen Akteur @de
label: heeft opgerichte actor van actor @nl
label: perustaja (toimija) @fi
label: temsilcinin kurduğu temsilci ile ilişkilidir @tr
label: ágens által alapított ágens a következő: @hu
label: له وكيل أسسه وكيل @ar
label: 有行为者的被创办行为者 @zh-hans
inverse of: has founder agent of agent
definition: Bir temsilcinin kurduğu bir temsilciyi bir temsilciyle ilişkilendirir. @tr
definition: Hozzákapcsol egy ágens által alapított ágenst egy ágenshez. @hu
definition: Liittää yhteistoimijan sen perustaneeseen toimijaan. @fi
definition: Relaciona un agent amb un agent que és iniciat per un agent. @ca
definition: Relaterer en agent der er grundlagt af en agent til en agent. @da
definition: Relates an agent to an agent who is initiated by an agent.
definition: Setzt einen Akteur in Beziehung zu einem Akteur, der von einem Akteur gegründet wurde. @de
definition: يربط بين وكيل ووكيل أسسه وكيل @ar
definition: 将一个行为者与被另一个行为者发起的一个行为者关联起来。 @zh-hans

has sponsored agent of agent
lexical alias: sponsoringAgentOfAgent.en
status: Published
type: Property
label: har sponsoreret entitet @da
label: hat Akteur als Träger eines Akteurs von @de
label: heeft gesponsorde actor van actor @nl
label: sponsori (toimija) @fi
label: temsilcinin sponsor olduğu temsilci ile ilişkilidir @tr
label: ágens szponzorált ágense a következő: @hu
label: له وكيل راعي لوكيل @ar
label: 有行为者的赞助行为者 @zh-hans
inverse of: has sponsoring agent of agent
definition: Bir temsilcinin sponsor olduğu bir temsilciyi bir temsilciyle ilişkilendirir. @tr
definition: Hozzákapcsol egy ágens által szponzorált ágenst egy ágenshez. @hu
definition: Liittää toimijaan toimijaa sponsoroivan toimijan. @fi
definition: Relaterer en agent som en agent sponsorerer til en agent. @da
definition: Relates an agent to an agent who is sponsored by another agent.
definition: Setzt einen Akteur in Beziehung zu einem Akteur, den ein Akteur fördert. @de
definition: يربط بين وكيل ووكيل يرعاه وكيل. @ar
definition: 将赞助一个行为者的一个行为者与一个行为者关联起来。 @zh-hans

is dedicatee of
lexical alias: dedicateeOf.en
status: Published
type: Property
label: dedikáltja a következőnek: @hu
label: er tilegnet i @da
label: is opgedragene van @nl
label: ist Widmungsempfängerin/Widmungsempfänger von @de
label: ithaf edilenidir @tr
label: omistuksen kohde (toimija) aineistossa @fi
label: هو مُهدَى إليه لـ @ar
label: 是……的被题献者 @zh-hans
sub property of: is other agent associated with resource of (Deprecated)
inverse of: has dedicatee
definition: Bir temsilciyi, anılmış olmaya ilişkin bir temsilcinin sorumluluğunu içeren bir kaynakla ilişkilendirir @tr
definition: Hozzákapcsol egy ágenst egy forráshoz, amely magában foglalja az ágensnek azt a felelősségét, amiért megemlékeznek róla. @hu
definition: Liittää toimijan aineistoon, joka on omistettu toimijalle. @fi
definition: Relaterer en agent som en ressource er tilegnet til en ressource. @da
definition: Relates an agent to a resource that involves a responsibility of an agent for being commemorated.
definition: Setzt einen Akteur in Beziehung zu einer Ressource, die einem Akteur gewidmet ist. @de
definition: يربط بين وكيل ومصدر ينطوي على مسؤولية وكيل عن الاحتفال به. @ar
definition: 将一个行为者与涉及被纪念的一个行为者的责任的一种资源关联起来。 @zh-hans

is addressee of
lexical alias: addresseeOf.en
status: Published
type: Property
label: aineiston vastaanottaja (toimija) @fi
label: címzettje a következőnek: @hu
label: er adressat i @da
label: is geadresseerde van @nl
label: ist Adressatin/Adressat von @de
label: muhatabıdır @tr
label: هو مُرسل إليه لـ @ar
label: 是……的接受者 @zh-hans
sub property of: is other agent associated with resource of (Deprecated)
inverse of: has addressee
definition: Bir temsilciyi, bir temsilciye muhatap olduğu kaynağın bir parçası veya bir kaynakla ilişkilendirir. @tr
definition: Hozzákapcsol egy ágenst egy forráshoz vagy egy forrás egy részéhez, amelyet az ágensnek címeztek. @hu
definition: Liittää toimijan aineistoon, jolle aineisto tai osa aineistosta on osoitettu. @fi
definition: Relaterer en agent, som en ressource eller en del af en ressource er adresseret til til en ressource. @da
definition: Relates an agent to a resource or a portion of a resource that is addressed to an agent.
definition: Setzt einen Akteur in Beziehung zu eine Ressource oder einem Teil einer Ressource, die/der an einen Akteur adressiert ist. @de
definition: يربط بين وكيل ومصدر أو بجزء من مصدر مرسل إلى وكيل. @ar
definition: 将一个行为者与要被一个行为者接受的一种资源或资源的一部分关联起来。 @zh-hans

is appellant of
lexical alias: appellantOf.en
status: Published
type: Property
label: er appellerende af @da
label: fellebezője a következőnek: @hu
label: is aanklager in beroep van @nl
label: ist Berufungsklagende/Berufungsklagender/Revisionsklagende/Revisionsklagender von @de
label: muutoksenhakija (toimija) aineistossa @fi
label: temyiz edenidir @tr
label: هو مستأنف لـ @ar
label: 是……的上诉者 @zh-hans
sub property of: is other agent associated with resource of (Deprecated)
inverse of: has appellant
definition: Bir temsilciyi, temsicli tarafından temyiz edilen bir alt mahkeme kararını kaydeden bir yüksek mahkemenin bir kararı ile ilişkilendirir @tr
definition: Hozzákapcsol egy ágenst egy felsőbb bíróság jogi forrásához, amely rögzíti egy alsóbb szintű bíróságnak azt az ítéletét, amelyet egy ágens megfellebbezett. @hu
definition: Liittää toimijan ylemmän oikeusasteen aineistoon, jossa toimija hakee muutosta alemman oikeusasteen päätökseen. @fi
definition: Relaterer en agent der appellerer en underrets beslutning i en juridisk ressource til en højere retsinstans til et værk. @da
definition: Relates an agent to a resource of a higher court recording a decision of a lower court that is appealed by an agent.
definition: Setzt einen Akteur in Beziehung zu einer Ressource einer höheren Instanz, die ein Gerichtsurteil einer unteren Instanz erfasst, gegen das ein Akteur Rechtsmittel (Berufung/Revision) einlegt. @de
definition: يربط بين وكيل ومصدر لمحكمة أعلى درجة تسجل قرار محكمة أدنى درجة يستأنفه وكيل. @ar
definition: 将一个行为者与一种记录下级法院被一个行为者起诉的决定的上级法院的一种资源关联起来。 @zh-hans

is binder of
lexical alias: binderOf.en
status: Published
type: Property
label: ciltleyicisidir @tr
label: er bogbinder af @da
label: is binder van @nl
label: ist Buchbinderin/Buchbinder von @de
label: könyvkötője a következőnek: @hu
label: sitoja (toimija) aineistossa @fi
label: هو مسؤول عن تجليد لـ @ar
label: 是……的装订者 @zh-hans
sub property of: is other agent associated with resource of (Deprecated)
inverse of: has binder
definition: Bir temsilciyi, bağlamakla görevli bir temsilcinin sorumluluğunu içeren bir kaynakla ilşkilendirir @tr
definition: Hozzákapcsol egy ágenst egy forráshoz, amelyhez hozzátartozik az ágens felelőssége a kötésért. @hu
definition: Liittää toimijan aineistoon, jossa toimija vastaa sidonnasta. @fi
definition: Relaterer en agent der indbinder en ressource til en ressource. @da
definition: Relates an agent to a resource that involves a responsibility of an agent for binding.
definition: Setzt einen Akteur in Beziehung zu einer Ressource, bei der ein Akteur für das Binden verantwortlich ist. @de
definition: يربط بين وكيل ومصدر ينطوي على مسؤولية وكيل عن التجليد @ar
definition: 将一个行为者与涉及一个装订行为者的责任的一种资源关联起来。 @zh-hans

is plaintiff of
lexical alias: plaintiffOf.en
status: Published
type: Property
label: davacısıdır @tr
label: er sagsøger af @da
label: felperese a következőnek: @hu
label: henkilökantaja (toimija) aineistossa @fi
label: is aanklager van @nl
label: ist Zivilklägerin/Zivilkläger von @de
label: هو مُدَّعي لـ @ar
label: 是……的原告 @zh-hans
sub property of: is other agent associated with resource of (Deprecated)
inverse of: has plaintiff
definition: Bir temcilciyi, bir hukuk davasında dava açmak için bir temsilcinin sorumluluğunu içeren bir kaynakla ilişkilendirir @tr
definition: Hozzákapcsol egy ágenst egy forráshoz, amelyhez hozzátartozik egy ágens felelőssége egy per elindításáért egy polgári jogi eljárásban. @hu
definition: Liittää toimijan aineistoon, jossa toimija vastaa kanteen nostamisesta siviilioikeudenkäyntiin. @fi
definition: Relaterer en agent der anlægger en civil sag til en ressource. @da
definition: Relates an agent to a resource that involves a responsibility of an agent for bringing a suit in a civil proceeding.
definition: Setzt einen Akteur in Beziehung zu einer Ressource, bei der ein Akteur eine Klage in ein Zivilverfahren einbringt. @de
definition: يربط بين وكيل ومصدر ينطوي على مسؤولية وكيل عن رفع دعوى مدنية. @ar
definition: 将一个行为者与涉及民事诉讼中一个起诉行为者责任的一种资源关联起来。 @zh-hans

has founder agent of agent
lexical alias: founderAgentOfAgent.en
status: Published
type: Property
label: har grundlægger @da
label: hat Begründerin/Begründer eines Akteurs @de
label: heeft oprichter-actor van actor @nl
label: perustaja (yhteistoimija) @fi
label: temsilcinin kurduğu kurucu temsilci ile ilişkilidir @tr
label: ágens alapító ágense a következő: @hu
label: له وكيل مؤسس لوكيل @ar
label: 有行为者的创办者行为者 @zh-hans
inverse of: has founded agent of agent
definition: Bir temsilci kuran bir temsilciyi bir temsilciyle ilişkilendirir. @tr
definition: Hozzákapcsol egy ágenst alapító ágenst egy ágenshez. @hu
definition: Liittää yhteistoimijan perustaneen toimijan yhteistoimijaan. @fi
definition: Relaciona un agent amb un agent que inicia un agent. @ca
definition: Relaterer en agent der har grundlagt en agent til en agent. @da
definition: Relates an agent to an agent who initiates an agent.
definition: Setzt einen Akteur in Beziehung zu einem Akteur, der einen Akteur gegründet hat. @de
definition: يربط بين وكيل ووكيل أسس وكيل. @ar
definition: 将一个行为者与发起一个行为者的一个行为者关联起来。 @zh-hans

is inscriber of
lexical alias: inscriberOf.en
status: Published
type: Property
label: armağan notu yazarıdır @tr
label: beírója a következőnek: @hu
label: er dedikationsskriver i @da
label: is opdrachtschrijver van @nl
label: ist beschriftende Person von @de
label: omistuskirjoituksen kirjoittaja (toimija) aineistossa @fi
label: هو كاتب إهداء لـ @ar
label: 是……的题写者 @zh-hans
sub property of: is other agent associated with resource of (Deprecated)
inverse of: has inscriber
definition: Bir temsilciyi, bir adanmışlık veya hediye beyanı gibi bir metni yazmak için bir temsilcinin sorumluluğunu içeren bir kaynakla ilişkilendirir. @tr
definition: Hozzákapcsol egy ágenst egy forráshoz, amelyhez hozzátartozik az ágens felelőssége egy olyan beírt szövegért, mint egy dedikáció vagy egy ajándékozási nyilatkozat. @hu
definition: Liittää toimijan aineistoon, johon toimija kirjoitta siihen omistuskirjoituksen tai merkinnön lahjoituksesta. @fi
definition: Relaterer en agent der har skrevet en dedikations- eller gaveangivelse på en ressource til en ressource. @da
definition: Relates an agent to a resource that involves a responsibility of an agent for inscribing a text, such as a statement of dedication or gift.
definition: Setzt einen Akteur in Beziehung zu einer Ressource, die mit einer Verantwortung verbunden ist, eine Widmung oder einen Schenkungsvermerk zu schreiben. @de
definition: يربط بين وكيل ومصدر ينطوي على مسؤولية وكيل عن كتابة نص، مثل بيان الإهداء أو الهدية. @ar
definition: 将一个行为者与涉及题写文字（诸如题献或赠与的说明）的责任的一种资源关联起来。 @zh-hans

is judge of
lexical alias: judgeOf.en
status: Published
type: Property
label: bírája a következőnek: @hu
label: er dommer i @da
label: is rechter van @nl
label: ist Richterin/Richter von @de
label: tuomari (toimija) aineistossa @fi
label: yargıcıdır @tr
label: هو قاضِي لـ @ar
label: 是……的法官 @zh-hans
sub property of: is other agent associated with resource of (Deprecated)
inverse of: has judge
definition: Bir temsilciyi, mahkemede yasal konularda duruşma ve karar vermeye ilişkin bir temsilcinin sorumluluğunu içeren bir kaynakla ilişkilendirir. @tr
definition: Hozzákapcsol egy ágenst egy forráshoz, amelyhez hozzátartozik egy ágens felelőssége a bíróságon a jogi ügyek tárgyalása és az ítélkezés. @hu
definition: Liittää toimijan aineistoon, jossa toimija kuulee ja päättää oikeusasioista tuomioistuimessa. @fi
definition: Relaterer en agent der hører og træffer beslutning om juridiske anliggender i retten til en ressource. @da
definition: Relates an agent to a resource that involves a responsibility of an agent for hearing and decision on legal matters in court.
definition: Setzte einen Akteur in Beziehung zu einer Ressource, bei der ein Akteur dafür verantwortlich ist, sich bei Gericht juristische Angelegenheiten anzuhören und darüber zu entscheiden. @de
definition: يربط بين وكيل ومصدر ينطوي على مسؤولية وكيل عن الاستماع إلى المسائل القانونية في محكمة والبت فيها. @ar
definition: 将一个行为者与涉及法院中关于法律事务审理和决定责任的一种资源关联起来。 @zh-hans

has member
lexical alias: member.en
status: Published
type: Property
label: har medlem af @da
label: hat Mitglied @de
label: heeft lid @nl
label: jäsen (toimija) @fi
label: tagja a következő: @hu
label: üye ile ilişkilidir @tr
label: له عضو @ar
label: 有成员 @zh-hans
inverse of: is member of
definition: Bir temsilcinin üyesi olan bir temsilciyi bir temsilciyle ilişkilendirir. @tr
definition: Hozzákapcsol egy ágenst, amely tagja egy ágensnek, egy ágenshez. @hu
definition: Liittää yhteistoimijan toimijaan, joka on yhteistoimijan jäsen. @fi
definition: Relaciona un agent amb un agent que és un membre d’un agent. @ca
definition: Relaterer en agent der er medlem af en agent til en agent. @da
definition: Relates an agent to an agent who is a member of an agent.
definition: Setzt einen Akteur in Beziehung zu einem Akteur, der Mitglied eines Akteurs ist. @de
definition: يربط بين وكيل ووكيل هو عضو لوكيل. @ar
definition: 将一个行为者与作为一个行为者之成员的一个行为者关联起来。 @zh-hans

is defendant of
has subproperty: is criminal defendant of
has subproperty: is civil defendant of
lexical alias: defendantOf.en
status: Published
type: Property
label: alperese a következőnek: @hu
label: davalısıdır @tr
label: er sagsøgt af @da
label: is verweerder van @nl
label: ist Angeklagte/Angeklagter von @de
label: vastaaja (toimija) aineistossa @fi
label: هو مُدَّعَى عليه لـ @ar
label: 是……的被告 @zh-hans
sub property of: is other agent associated with resource of (Deprecated)
inverse of: has defendant
definition: Bir temsilciyi, bir ceza davasında suçlanmak veya bir hukuk davasında dava edilmeye ilişkin bir temsilcinin sorumluluğunu içeren bir kaynakla ilişkilendirir. @tr
definition: Hozzákapcsol egy ágenst egy forráshoz, amelyhez hozzátartozik annak felelőssége, hogy egy ágenst egy büntetőeljárásban megvádolnak, vagy egy polgári perben beperelnek. @hu
definition: Liittää toimijan aineistoon, jossa toimija on syytettynä rikosoikeudenkäynnissä tai haastetuna siviilioikeudenkäynnissä. @fi
definition: Relaterer en agent der er anklaget i en straffesag eller sagsøgt i en civil sag til en ressource. @da
definition: Relates an agent to a resource that involves a responsibility of an agent for being accused in a criminal proceeding or sued in a civil proceeding.
definition: Setzt einen Akteur in Beziehung zu einer Ressource, die mit einer Verantwortung verbunden ist, als Akteur in einem Strafverfahren angeklagt oder in einem Zivilverfahren verklagt zu werden. @de
definition: يربط بين وكيل ومصدر ينطوي على مسؤولية وكيل عن اتهامه في دعوى جنائية أو مقاضاته في دعوى مدنية. @ar
definition: 将一个行为者与涉及在刑事或民事诉讼中被控告的一个行为者的责任的一种资源关联起来。 @zh-hans

is praeses of
lexical alias: praesesOf.en
status: Published
type: Property
label: danışmanıdır @tr
label: elnöke a következőnek: @hu
label: er præses i @da
label: is preses van @nl
label: ist Praeses von @de
label: preeses (toimija) aineistossa @fi
label: هو رئيس جلسة لـ @ar
label: 是……的评审人 @zh-hans
sub property of: is creator of
inverse of: has praeses
definition: Bir temsilciyi, normalde bir tez öneren ve ardından gelen tartışmaya katılan, akademik bir tartışmanın fakülte moderatörü olarak sorumluluk içeren bir kaynakla ilişkilendirir. @tr
definition: Hozzákapcsol egy ágenst egy forráshoz, amelyhez hozzátartozik egy tudományos vita kari moderátorának felelőssége, aki szokásos módon előterjeszt egy szakdolgozatot, és részt vesz az azt követő vitában. @hu
definition: Liittää toimijan aineistoon, jossa toimija vastaa väitöskirjan esittelystä väitöstilasuudessa tiedekunnan edustajana ja osallistuu keskusteluun väitöstilaisuuden puheenjohtajana. @fi
definition: Relaterer en agent der er fakultetsordstyrer for et akademisk afhandlingsforsvar, normalt ved at fremsætte en tese og deltage i det efterfølgende afhandlingsforsvar til en ressource. @da
definition: Relates an agent to a resource that involves a responsibility as a faculty moderator of an academic disputation, normally proposing a thesis and participating in the ensuing disputation.
definition: Setzt einen Akteur in Beziehung zu einer Ressource, bei der ein Akteur auf Fakultätsseite eine akademische Disputation moderiert, normalerweise eine These vorschlägt und an der sich daraus ergebenden Disputation teilnimmt. @de
definition: يربط بين وكيل ومصدر ينطوي على مسؤوليته رئاسة جلسة أعضاء هيئة التدريس في مناظرة أكاديمية، ويقترح عادة أطروحة ويشارك في المناظرة اللاحقة. @ar
definition: 将一个行为者与涉及作为学术辩论的主持教师（通常是提出一个论题并参与后续的辩论）责任的一种资源关联起来。 @zh-hans

is annotator of
lexical alias: annotatorOf.en
status: Published
type: Property
label: er annotationsforfatter i @da
label: is annotator van @nl
label: ist annotierender Akteur von @de
label: jegyzetekkel ellátója a következőnek: @hu
label: lisähuomautusten kirjoittaja (toimija) aineistossa @fi
label: yorumlayıcısıdır @tr
label: هو مُعَلِّق على @ar
label: 是……的手写批注者 @zh-hans
sub property of: is other agent associated with resource of (Deprecated)
inverse of: has annotator
definition: Bir temsilciyi, elle eklenen notları ve diğer bilgileri taşıyan bir kaynakla ilişkilendirir. @tr
definition: Hozzákapcsol egy ágenst egy forráshoz, amely jegyzeteket és más, kézzel írott információt hordoz. @hu
definition: Liittää toimijan aineistoon, joka sisältää käsinkirjoitettuja huomautuksia ja muita selityksiä. @fi
definition: Relaterer en agent der skriver annotationer i hånden på en ressource til en ressource. @da
definition: Relates an agent to a resource that carries notes and other information added by hand.
definition: Setzt einen Akteur in Beziehung zu einer Ressource, die handschriftlich Anmerkungen und andere Informationen beinhaltet. @de
definition: يربط بين وكيل ومصدر يشتمل على ملاحظات ومعلومات أخرى أضيفت بخط اليد. @ar
definition: 将一个行为者与载有手加批注和其他信息的一种资源关联起来。 @zh-hans

is consultant of
lexical alias: consultantOf.en
status: Published
type: Property
label: asiantuntija (toimija) aineistossa @fi
label: danışmanıdır @tr
label: er rådgiver for @da
label: is consultant van @nl
label: ist Beraterin/Berater von @de
label: tanácsadója a következőnek: @hu
label: هو استشاري لـ @ar
label: 是……的顾问 @zh-hans
sub property of: is creator of
inverse of: has consultant
definition: Bir temsilciyi, bir kaynağın yaratıcısına danışma hizmetleri sağlama ve genellikle tavsiyelerde bulunmakta görevli bir temsilcinin sorumluluğunu içeren bir kaynakla ilişkilendirir. @tr
definition: Hozzákapcsol egy ágenst egy forráshoz, amelyhez hozzátartozik az ágens felelőssége tanácsadó szolgáltatásért és gyakran egy forrás létrehozójának tett ajánlatért is. @hu
definition: Liittää toimijan aineistoon, jossa toimija on vastuussa asiantuntijapalveluiden tarjoamisesta ja suositusten antamisesta aineiston tekijälle. @fi
definition: Relaterer en agent, der yder rådgivning, og ofte kommer med anbefalinger, til en anden agent, der er repræsenteret som ophav til en ressource til en ressource. @da
definition: Relates an agent to a resource that involves a responsibility of an agent for providing consultation services, and often making recommendations, to a creator of a resource.
definition: Setzt einen Akteur in Beziehung zu einer Ressource, bei der ein Akteur einer geistigen Schöpferin/einem geistigen Schöpfer einer Ressource Beratungsdienste anbietet und Empfehlungen macht. @de
definition: يربط بين وكيل ومصدر ينطوي على مسؤولية وكيل عن تقديم خدمات استشارية، وغالبًا ما يقدم مقترحات، لمُنشيء مصدر. @ar
definition: 将一个行为者与涉及向资源创作者提供咨询服务并经常提供建议的一个行为者的责任的一种资源关联起来。 @zh-hans

is autographer of
lexical alias: autographerOf.en
status: Published
type: Property
label: aláírója a következőnek: @hu
label: er autografskriver i @da
label: imza sahibidir @tr
label: is handtekening-zetter van @nl
label: ist Unterzeichnerin/Unterzeichner von @de
label: nimikirjoituksen kirjoittaja (toimija) aineistossa @fi
label: هو موقِّع على @ar
label: 是……的亲笔签名者 @zh-hans
sub property of: is other agent associated with resource of (Deprecated)
inverse of: has autographer
definition: Bir temsilciyi, üzerinde görünen el yazması imzaya ilişkin bir temsilcinin sorumluluğunu içeren bir kaynakla ilişkilendirir. @tr
definition: Hozzákapcsol egy ágenst egy forráshoz, amelyhez hozzátartozik az ágens felelőssége az azon megjelenő kézírásos aláírásért. @hu
definition: Liittää toimijan aineistoon, jossa on toimijan käsinkirjoitettu nimikirjoitus. @fi
definition: Relaterer en agent hvis håndskrivne signatur forekommer på en ressource til en ressource. @da
definition: Relates an agent to a resource that involves a responsibility of an agent for a manuscript signature appearing on it.
definition: Setzt einen Akteur in Beziehung zu einer Ressource mit einer handschriftlichen Unterschrift. @de
definition: يربط بين وكيل ومصدر ينطوي على مسؤولية وكيل عن توقيع مخطوط يظهر عليه. @ar
definition: 将一个行为者与涉及在手稿上出现的签名的行为者的责任的一种资源关联起来。 @zh-hans

is issuing agent of
lexical alias: issuingAgentOf.en
status: Published
type: Property
label: aineiston julkaisija (toimija) aineistossa @fi
label: er ansvarlig institution for @da
label: is uitvaardiger-actor van @nl
label: ist herausgebender Akteur von @de
label: kibocsátó ágense a következőnek: @hu
label: piyasaya çıkaran temsilcisidir @tr
label: هو وكيل جهة إصدار لـ @ar
label: 是……的颁布行为者 @zh-hans
sub property of: is other agent associated with resource of (Deprecated)
inverse of: has issuing agent
definition: Bir temsilciyi, kuruluşun resmi bir organı gibi bir kaynağı yayınlamaya ilişkin bir temsilcinin sorumluluğunu içeren bir kaynakla ilişkilendirir. @tr
definition: Hozzákapcsol egy ágenst egy forráshoz, amelyhez hozzátartozik az ágens felelőssége egy olyan forrás kibocsátásáért, mint amilyen egy társaság hivatalos sajtóorgánuma. @hu
definition: Liittää toimijan aineistoon, jonka julkaisemisesta toimija, esimerkiksi virallinen toimielin, vastaa. @fi
definition: Relaterer en agent, der har udgivet en ressource, såsom en officiel skrift fra agenten til en ressource. @da
definition: Relates an agent to a resource that involves a responsibility of an agent for issuing a resource, such as an official organ of the body.
definition: Setzt einen Akteur in Beziehung zu einer Ressource, bei der ein Akteur für die Herausgabe einer Ressource, zum Beispiel eines offiziellen Organs der Körperschaft, verantwortlich ist. @de
definition: يربط بين وكيل ومصدر ينطوي على مسؤولية وكيل عن إصدار مصدر، مثل العضوية الرسمية لهيئة. @ar
definition: 将一个行为者与涉及一个颁布一种资源（例如一个团体的机关刊物）的一个行为者的责任的一种资源关联起来。 @zh-hans

is landscape architect of
lexical alias: landscapeArchitectOf.en
status: Published
type: Property
label: er landskabsarkitekt til @da
label: is landschapsarchitect van @nl
label: ist Landschaftsarchitektin/Landschaftsarchitekt von @de
label: maisema-arkkitehti (toimija) aineistossa @fi
label: peyzaj mimarıdır @tr
label: tájépítésze a következőnek: @hu
label: هو مهندس تنسيق مواقع لـ @ar
label: 是……的景观设计师 @zh-hans
sub property of: is architect of
inverse of: has landscape architect
definition: Bir temsilciyi, peyzajın mimari yönlerine ilişkin bir temsilcinin sorumluluğunu içeren bir kaynakla ilişkilendirir. @tr
definition: Hozzákapcsol egy ágenst egy forráshoz, amelyhez hozzátartozik egy ágens felelőssége a tájépítészet építészeti vonatkozásaiért. @hu
definition: Liittää toimijan aineistoon, jossa toimija vastaa maisemasuunnittelun arkkitehtonisista osa-alueista. @fi
definition: Relaterer en arkitekt, der er ansvarlig for at have skabt landskabsressourcer til en ressource. @da
definition: Relates an agent to a resource that involves a responsibility of an agent for architectural aspects of landscaping.
definition: Setzt einen Akteur in Beziehung zu einem Werk, bei dem ein Akteur für die Schaffung von Landschaften verantwortlich ist. @de
definition: يربط بين وكيل ومصدر ينطوي على مسؤولية وكيل عن الجوانب المعمارية لتنسيق المواقع. @ar
definition: 将一个行为者与涉及景观之建筑方面的一个行为者的责任的一种资源关联起来。 @zh-hans

is sculptor of
lexical alias: sculptorOf.en
status: Published
type: Property
label: er skulptør til @da
label: heykeltıraşı @tr
label: is beeldhouwer van @nl
label: ist Bildhauerin/Bildhauer von @de
label: kuvanveistäjä (toimija) aineistossa @fi
label: szobrásza a következőnek: @hu
label: هو نَحّات لـ @ar
label: 是……的雕塑家 @zh-hans
sub property of: is artist of
inverse of: has sculptor
definition: Bir temsilciyi, üç boyutlu modelleme, oyma veya benzer bir tekniğe ilişkin bir temsilcnin sorumluluğunu içeren bir kaynakla ilişkilendirir. @tr
definition: Hozzákapcsol egy ágenst egy forráshoz, amelyhez hozzátartozik egy ágens felelőssége háromdimenziós modellezésért, faragásért vagy hasonló technikáért. @hu
definition: Liittää toimijan aineistoon, jossa toimija vastaa kolmiulotteisen teoksen luomisesta muovaamalla, veistämällä tai vastaavalla tekniikalla. @fi
definition: Relaterer en kunstner, der er ansvarlig for at have skabt en tredimensionel ressource vha. modellering, billedhuggerkunst eller lignende teknik til en ressource. @da
definition: Relates an agent to a resource that involves a responsibility of an agent for three-dimensional modeling, carving, or similar technique.
definition: Setzt einen Akteur in Beziehung zu einer Ressource, bei der ein Akteur für dreidimensionales Modellieren, Schnitzen oder ähnliche Techniken verantwortlich ist. @de
definition: يربط بين وكيل ومصدر ينطوي على مسؤولية وكيل عن النمذجة ثلاثية الأبعاد، أو النحت، أو تقنية مماثلة. @ar
definition: 将一个行为者与涉及三维模型、雕刻或类似技术的一个行为者的责任的一种资源关联起来。 @zh-hans

is screenwriter of
lexical alias: screenwriterOf.en
status: Published
type: Property
label: er manuskriptforfatter til @da
label: forgatókönyvírója a következőnek: @hu
label: is scenarioschrijver van @nl
label: ist Drehbuchautorin/Drehbuchautor von @de
label: käsikirjoittaja (toimija) aineistossa @fi
label: senarist @tr
label: هو كاتب سيناريو لـ @ar
label: 是……的影视剧编剧 @zh-hans
sub property of: is author of
inverse of: has screenwriter
definition: Bir temsilciyi, bir senaryo, metin veya sahne yazmakla görevli bir temsilcinin sorumluluğunu içeren bir kaynakla ilişkilendirir. @tr
definition: Hozzákapcsol egy ágenst egy forráshoz, amelyhez hozzátartozik egy ágens felelőssége egy forgatókönyv, szövegkönyv vagy jelenet szerzőségéért. @hu
definition: Liittää toimijan aineistoon, jossa toimija vastaa näytelmän, käsikirjoituksen tai kohtauksen kirjoittamisesta. @fi
definition: Relaterer en forfatter af en drejebog, et manuskript eller en scene til en ressource. @da
definition: Relates an agent to a resource that involves a responsibility of an agent for authoring a screenplay, script, or scene.
definition: Setzt einen Akteur in Beziehung zu einer Ressource, bei der ein Akteur für das Verfassen eines Drehbuchs, eines Skripts oder einer Szene verantwortlich ist. @de
definition: يربط بين وكيل ومصدر ينطوي على مسؤولية وكيل عن تأليف سيناريو، أو نص، أو مشهد. @ar
definition: 将一个行为者与涉及写作影视剧剧本、脚本或场景的一个行为者的责任的一种资源关联起来。 @zh-hans

is lyricist of
see also: is librettist of
lexical alias: lyricistOf.en
status: Published
type: Property
label: dalszövegírója a következőnek: @hu
label: er forfatter til sangtekst til @da
label: is liedtekstschrijver van @nl
label: ist Textdichterin/Textdichter von @de
label: sanoittaja (toimija) aineistossa @fi
label: söz yazarıdır @tr
label: هو كاتب أغاني لـ @ar
label: 是……的作词者 @zh-hans
sub property of: is author of
inverse of: has lyricist
definition: Bir temsilciyi, bir müzikalden bir şarkı da dahil olmak üzere popüler bir şarkının sözlerini yazmakla görevli bir temsilcinin sorumluluğunu içeren bir kaynakla ilişkilendirir. @tr
definition: Hozzákapcsol egy ágenst egy forráshoz, amelyhez hozzátartozik egy ágens felelőssége egy könyűzenei dalszöveg, musicaldalt is beleértve, szerzőségéért. @hu
definition: Liittää toimijan aineistoon, jossa toimija vastaa populaarimusiikkiin kuuluvan laulun (mukaan lukien musikaalilaulun) sanojen kirjoittajamisesta. @fi
definition: Relaterer en forfatter af ordene til en populær sang, inkl. en sang eller flere sange fra en musical til en ressource. @da
definition: Relates an agent to a resource that involves a responsibility of an agent for authoring the words of a popular song, including a song from a musical.
definition: Setzt einen Akteur in Beziehung zu einer Ressource, bei der ein Akteur für das Verfassen des Texts eines populären Lieds, einschließlich eines Lieds aus einem Musical, verantwortlich ist. @de
definition: يربط بين وكيل ومصدر ينطوي على مسؤولية وكيل عن تأليف كلمات أغنية شعبية، بما في ذلك أغنية في مَسرحية موسيقِيّة. @ar
definition: 将一个行为者与涉及流行歌曲（包括音乐剧中的歌曲）歌词的写作的一个行为者的责任的一种资源关联起来。 @zh-hans

is librettist of
see also: is lyricist of
lexical alias: librettistOf.en
status: Published
type: Property
label: er librettist til @da
label: is librettist van @nl
label: ist Librettistin/Librettist von @de
label: libretisti (toimija) aineistossa @fi
label: librettistája a következőnek: @hu
label: libretto yazarıdır @tr
label: هو واضع كلمات الأوبرا لـ @ar
label: 是……的台本作者 @zh-hans
sub property of: is author of
inverse of: has librettist
definition: Bir temsilciyi, bir operanın veya başka bir müzikal sahne kaynağının veya bir oratoryonun sözlerini yazmakla görevli bir temsilcinin sorumluluğunu içeren bir kaynakla ilişkilendirir. @tr
definition: Hozzákapcsol egy ágenst egy forráshoz, amelyhez hozzátartozik egy ágens felelőssége egy opera vagy más zenés színpadi forrás vagy egy oratórium szövegének szerzősége. @hu
definition: Liittää toimijan aineistoon, jossa toimija vastaa oopperan tai muun musiikillisen näyttämöteoksen tai oratorion sanojen kirjoittamisesta. @fi
definition: Relaterer en forfatter af ordene til en opera eller anden musikalsk sceneressource, eller et oratorium til en ressource. @da
definition: Relates an agent to a resource that involves a responsibility of an agent for authoring the words of an opera or other musical stage resource, or an oratorio.
definition: Setzt einen Akteur in Beziehung zu einer Ressource, bei der ein Akteur für das Verfassen des Texts einer Oper, einer sonstigen Bühnenressource oder eines Oratoriums verantwortlich ist. @de
definition: يربط بين وكيل ومصدر ينطوي على مسؤولية وكيل عن تأليف كلمات أوبرالية أو مصدر مسرحي موسيقي آخر، أو موسيقى دينية. @ar
definition: 将一个行为者与涉及歌剧或其他舞台音乐作品或者清唱剧的歌词的写作的一个行为者的责任的一种资源关联起来。 @zh-hans

has accompanying resource relationship with (Deprecated)
has subproperty: is accompanied by
has subproperty: is complemented by
has subproperty: is augmented by
has subproperty: is augmentation of
has subproperty: is held with
lexical alias: accompanyingResourceRelationshipWith.en
status: Deprecated
type: Property
label: har ledsaget ressource-relation med @da
definition: Relaterer en ressource til en ressource, der er en berigelse af, eller er beriget af, eller er komplementeret af en ressource. @da
definition: Relates a resource to a resource that is an augmentation of, or is augmented by, or is complemented by, or accompanies, or is accompanied by a resource. (Deprecated)

has derivative resource relationship with (Deprecated)
has subproperty: has derivative
has subproperty: has source
lexical alias: derivativeResourceRelationshipWith.en
status: Deprecated
type: Property
label: har afledt ressource-relation med @da
definition: Relaterer en ressource til en ressource, der er baseret på eller er en afledning af en ressource. @da
definition: Relates a resource to a resource that is based on or is a derivative of a related resource. (Deprecated)

has descriptive resource relationship with (Deprecated)
lexical alias: descriptiveResourceRelationshipWith.en
status: Deprecated
type: Property
definition: Relates a resource to a resource that is described in or is a description of the resource. (Deprecated)

has equivalent resource relationship with (Deprecated)
has subproperty: has equivalent
lexical alias: equivalentResourceRelationshipWith.en
status: Deprecated
type: Property
label: har ækvivalent ressource @da
definition: Relaterer en ressource til en ressource, der ækvivalent til en anden ressource. @da
definition: Relates a resource to a resource that is equivalent to a related resource. (Deprecated)

has sequential resource relationship with (Deprecated)
has subproperty: is preceded by
has subproperty: is succeeded by
lexical alias: sequentialResourceRelationshipWith.en
status: Deprecated
type: Property
label: har sekventiel ressource-relation med @da
definition: Relaterer en ressource til en ressource, der er forudgået af eller efterfulgt af en ressource. @da
definition: Relates a resource to a resource that is preceded by or succeeded by a related resource. (Deprecated)

has whole-part resource relationship with (Deprecated)
has subproperty: is part of resource
has subproperty: has part resource
lexical alias: wholePartResourceRelationshipWith.en
status: Deprecated
type: Property
label: har helhed-del-ressource-relation med @da
definition: Relaterer en ressource til en ressource, der indgår i, eller indeholder en ressouce. @da
definition: Relates a resource to a resource that is contained in or contains a related resource. (Deprecated)

has writer of afterword (Deprecated)
lexical alias: writerOfAfterword.en
status: Deprecated
type: Property
label: har forfatter af efterord @da
sub property of: has writer of supplementary textual content (Deprecated)
inverse of: is writer of preface of (Deprecated)
definition: Relaterer en ressource til en agent, der har bidraget til en ressource ved at tilvejebringe et efterskrift til en originalressource. @da
definition: Relates a resource to an agent who contributes to a resource by providing an afterword to an original resource. (Deprecated)

has writer of postface (Deprecated)
lexical alias: writerOfPostface.en
status: Deprecated
type: Property
label: har forfatter af efterskrift @da
sub property of: has writer of supplementary textual content (Deprecated)
inverse of: is writer of postface of (Deprecated)
definition: Relaterer en ressource til en agent, der har bidraget til en ressource ved at tilvejebringe et efterskrift til en originalressource. @da
definition: Relates a resource to an agent who contributes to a resource by providing a postface to an original resource. (Deprecated)

is writer of preface of (Deprecated)
lexical alias: writerOfAfterwordOf.en
status: Deprecated
type: Property
label: er forfatter til efterord til @da
sub property of: is writer of supplementary content of (Deprecated)
inverse of: has writer of afterword (Deprecated)
definition: Relaterer en agent der har bidraget til en ressource ved at sørge for et efterord til en oprindelig ressource til en ressource. @da
definition: Relates an agent to a resource that includes a contribution of providing an afterword. (Deprecated)

is writer of postface of (Deprecated)
lexical alias: writerOfPostfaceOf.en
status: Deprecated
type: Property
label: er forfatter til efterskrift til @da
sub property of: is writer of supplementary content of (Deprecated)
inverse of: has writer of postface (Deprecated)
definition: Relaterer en agent, der har bidraget til een ressource ved at sørge for en efterskrift til en oprindelig ressource til en ressource. @da
definition: Relates an agent to a resource that includes a contribution of providing a postface. (Deprecated)

is musical theatre adaptation of
lexical alias: musicalTheatreAdaptationOf.en
status: Published
type: Property
label: er musikteaterbearbejdelse af @da
label: is muziektheaterbewerking van @nl
label: ist Musiktheaterbearbeitung von @de
label: musikaaliversio aineistosta @fi
label: müzikal tiyatro uyarlamasıdır @tr
label: zeneszínházi feldolgozása a következőnek: @hu
label: هو اقتباس مسرحي موسيقي لـ @ar
label: 是……的音乐戏剧改编 @zh-hans
sub property of: is adaptation of
inverse of: is adapted as musical theatre
definition: Bir kaynağı, müzikal tiyatro kaynağı olarak uyarlanmış bir kaynakla ilişkilendirir. @tr
definition: Hozzákapcsol egy forrást egy forráshoz, amelyet zeneszínházi forrásként adaptáltak. @hu
definition: Liittää aineiston musikaaliksi sovitettuun aineistoon. @fi
definition: Relaterer en ressource til en ressource, der er blevet bearbejdet til musikteater-ressource. @da
definition: Relates a resource to a resource that is adapted as a musical theatre resource.
definition: Setzt eine Ressource in Beziehung zu einer Ressource, die als Musiktheaterressource bearbeitet ist. @de
definition: يربط بين مصدر ومصدر مقتبس كمصدر مسرحي موسيق. @ar
definition: 将一种资源与被改编为一种音乐戏剧资源的一种资源关联起来。 @zh-hans

is opera adaptation of
lexical alias: operaAdaptationOf.en
status: Published
type: Property
label: er operabearbejdelse af @da
label: is operabewerking van @nl
label: ist Opernbearbeitung von @de
label: oopperasovitus aineistosta @fi
label: opera uyarlamasıdır @tr
label: operafeldolgozása a következőnek: @hu
label: هو اقتباس أوبرالي لـ @ar
label: 是……的歌剧改编 @zh-hans
sub property of: is adaptation of
inverse of: is adapted as opera
definition: Bir kaynağı, opera olarak uyarlanmış bir kaynakla ilişkilendirir. @tr
definition: Hozzákapcsol egy forrást egy forráshoz, amelyet operaként adaptáltak. @hu
definition: Liittää aineiston oopperaksi sovitettuun aineistoon. @fi
definition: Relaterer en ressource til en ressource, der er blevet bearbejdet til opera. @da
definition: Relates a resource to a resource that is adapted as an opera.
definition: Setzt eine Ressource in Beziehung zu einer Ressource, die als Oper bearbeitet ist. @de
definition: يربط بين مصدر ومصدر مقتبس كمصدر أوبرالي. @ar
definition: 将一种资源与被改编为歌剧的一种资源关联起来。 @zh-hans

is adapted as musical theatre
lexical alias: adaptedAsMusicalTheatre.en
status: Published
type: Property
label: er bearbejdet til musikteater @da
label: is bewerkt als muziektheater @nl
label: ist bearbeitet als Musiktheaterstück @de
label: musikaaliversio (aineisto) @fi
label: müzikal tiyatro olarak uyarlanmıştır @tr
label: zeneszínházi feldolgozása a következőként: @hu
label: هو مقتبس كمسرح موسيقي @ar
label: 被改编为音乐戏剧 @zh-hans
sub property of: is adapted as
inverse of: is musical theatre adaptation of
definition: Bir kaynağı, başka bir kaynağa dayalı olarak bir müzikal tiyatro kaynağıyla ilişkilendirir. @tr
definition: Hozzákapcsol egy forrást egy zeneszínházi forráshoz, amely egy másik forráson alapul. @hu
definition: Liittää aineiston musiikkiteatteriaineistoon, joka perustuu toiseen aineistoon. @fi
definition: Relaterer en ressource til en musikteater-ressource baseret på en oprindelig ressource. @da
definition: Relates a resource to a musical theatre resource based on another resource.
definition: Setzt eine Ressource in Beziehung zu einer Musiktheaterressource, die auf einer anderen Ressource basiert. @de
definition: يربط بين مصدر ومصدر مسرحي موسيقي يعتمد على مصدر آخر. @ar
definition: 将一种资源与基于另一种资源的一种音乐戏剧资源的一种资源关联起来。 @zh-hans

is adapted as opera
lexical alias: adaptedAsOpera.en
status: Published
type: Property
label: er bearbejdet til opera @da
label: is bewerkt als opera @nl
label: ist bearbeitet als Oper @de
label: oopperasovitus (aineisto) @fi
label: opera olarak uyarlanmıştır @tr
label: operaként való feldolgozása a következő: @hu
label: هو مقتبس كأوبرا @ar
label: 被改编为歌剧 @zh-hans
sub property of: is adapted as
inverse of: is opera adaptation of
definition: Bir kaynağı, başka bir kaynağa dayanan bir operay ile ilişkilendirir. @tr
definition: Hozzákapcsol egy forrást egy operához, amely egy másik forráson alapul. @hu
definition: Liittää aineiston ooppera-aineistoon, joka perustuu toiseen aineistoon. @fi
definition: Relaterer en ressource til en opera baseret på en oprindelig ressource. @da
definition: Relates a resource to an opera based on another resource.
definition: Setzt eine Ressource in Beziehung zu einer Oper, die auf einer anderen Ressource basiert. @de
definition: يربط بين مصدر وأوبرا تعتمد على مصدر آخر. @ar
definition: 将一种资源与基于另一种资源的一种歌剧关联起来。 @zh-hans

has music
has subproperty: has incidental music
has subproperty: has video music
has subproperty: has television program music
has subproperty: has radio program music
has subproperty: is music for motion picture
has subproperty: has motion picture music
lexical alias: music.en
status: Published
type: Property
label: er musik @da
label: hat Musik @de
label: heeft muziek @nl
label: musiikkia sisältävä aineisto @fi
label: müzik ile ilişkilidir @tr
label: zenéje a következő: @hu
label: له موسيقى @ar
label: 有音乐 @zh-hans
sub property of: is complemented by
inverse of: is music for
definition: Bir kaynağı, bir kaynağı tamamlayan bir müzik kaynağıyla ilişkilendirir. @tr
definition: Hozzákapcsol egy forrást egy zenei forráshoz, amely kiegészíti a forrást. @hu
definition: Liittää aineiston musiikkiaineistoon, joka täydentää aineistoa. @fi
definition: Relaciona un recurs amb un recurs que és un recurs musical que complementa un recurs. @ca
definition: Relaterer en ressource til en musikressource, der er anvendt i en film, et skuespil, et tv-program etc. @da
definition: Relates a resource to a resource that is a musical resource that complements a resource.
definition: Setzt eine Ressource in Beziehung zu einer Musikressource, die eine Ressource ergänzt. @de
definition: يربط بين مصدر ومصدر موسيقي يُكمل مصدرًا. @ar
definition: 将一种资源与作为一种音乐资源而补充一种资源的一种资源关联起来。 @zh-hans

is music for
has subproperty: is incidental music for
has subproperty: is music for video
has subproperty: is music for television program
has subproperty: is music for radio program
lexical alias: musicFor.en
status: Published
type: Property
label: er musik til @da
label: is muziek voor @nl
label: ist Musik für @de
label: musiikki aineistoon @fi
label: müziğidir @tr
label: zene a következőhöz: @hu
label: هي موسيقى لـ @ar
label: 是用于……的音乐 @zh-hans
sub property of: is complemented by
inverse of: has music
definition: Bir kaynağı, müzikal bir kaynakla tamamlanan bir kaynakla ilişkilendirir. @tr
definition: Hozzákapcsol egy forrást egy forráshoz, amelyet egy zenei forrás egészít ki. @hu
definition: Liittää aineiston aineistoon, jota täydentää musiikkiaineisto. @fi
definition: Relaciona un recurs amb un recurs que es complementa amb un recurs musical. @ca
definition: Relaterer en ressource til en ressource såsom en film, et skuespil, et tv-program etc., der anvender en musikressource. @da
definition: Relates a resource to a resource that is complemented by a musical resource.
definition: Setzt eine Ressource in Beziehung zu einer Ressource, die durch eine Musikressource vervollständigt wird. @de
definition: يربط بين مصدر ومصدر يكمله مصدر موسيقي. @ar
definition: 将一种资源与被一种音乐资源补充的一种资源关联起来。 @zh-hans

has video music
lexical alias: videoMusic.en
status: Published
type: Property
label: er videomusik @da
label: hat Videomusik @de
label: heeft videomuziek @nl
label: video müziği ile ilişkilidir @tr
label: videon musiikki (aineisto) @fi
label: videozenéje a következő: @hu
label: له موسيقى فيديو @ar
label: 有视频音乐 @zh-hans
sub property of: has music
inverse of: is music for video
definition: Bir kaynağı, video olan bir kaynağı tamamlayan bir müzik kaynağıyla ilişkilendirir. @tr
definition: Hozzákapcsol egy forrást egy zenei forráshoz, amely kiegészít egy videóforrást. @hu
definition: Liittää aineiston musiikkiaineistoon, joka täydentää videoaineistoa. @fi
definition: Relaterer en ressource til en musikressource, der er anvendt i en video. @da
definition: Relates a resource to a musical resource that complements a resource that is a video.
definition: Setzt eine Ressource in Beziehung zu einer Musikressource, die ein Video ergänzt. @de
definition: يربط بين مصدر ومصدر موسيقي يُكمل مصدرًا يمثل فيديو. @ar
definition: 将一种资源与补充作为视频的一种资源的一种音乐资源关联起来。 @zh-hans

is music for video
lexical alias: musicForVideo.en
status: Published
type: Property
label: er musik til video @da
label: is muziek voor video @nl
label: ist Musik für Video @de
label: musiikki videoon (aineisto) @fi
label: video müziğidir @tr
label: videózene a következőhöz: @hu
label: هي موسيقى لفيديو @ar
label: 是用于视频的音乐 @zh-hans
sub property of: is music for
inverse of: has video music
definition: Bir kaynağı, müzik kaynağıyla tamamlanan bir video olan bir kaynakla ilişkilendirir. @tr
definition: Hozzákapcsol egy forrást videóforráshoz, amelyet egy zenei forrás egészít ki. @hu
definition: Liittää aineiston musiikkiaineistolla täydennettyyn videoaineistoon. @fi
definition: Relaterer en ressource til en ressource, der anvender en musikressource i en video. @da
definition: Relates a resource to a resource that is a video that is complemented by a musical resource.
definition: Setzt eine Ressource in Beziehung zu einem Video (Ressource), das durch eine Musikressource vervollständigt wird. @de
definition: يربط بين مصدر ومصدر هو فيديو يُكمله مصدر موسيقي. @ar
definition: 将一种资源与被一种音乐资源补充的作为视频的一种资源关联起来。 @zh-hans

has television program music
lexical alias: televisionProgramMusic.en
status: Published
type: Property
label: er tv-programmusik @da
label: hat Fernsehsendungsmusik @de
label: heeft televisieprogramma-muziek @nl
label: televisio-ohjelman musiikki (aineisto) @fi
label: televizyon programı müziği ile ilişkilidir @tr
label: televízióműsor zenéje a következő: @hu
label: له موسيقي برنامج تليفزيوني @ar
label: 有电视节目音乐 @zh-hans
sub property of: has music
inverse of: is music for television program
definition: Bir kaynağı, bir televizyon programı olan bir kaynağı tamamlayan bir müzik kaynağıyla ilişkilendirir. @tr
definition: Hozzákapcsol egy forrást egy zenei forráshoz, amely kiegészít egy televízióműsor-forrást. @hu
definition: Liittää aineiston televisio-ohjelma-aineistoa täydentävään musiikkiaineistoon. @fi
definition: Relaterer en ressource til en musikressource. der er anvendt i et tv-program. @da
definition: Relates a resource to a musical resource that complements a resource that is a television program.
definition: Setzt eine Ressource in Beziehung zu einer Musikressource, die eine Fernsehsendung ergänzt. @de
definition: يربط بين مصدر ومصدر موسيقي يُكمل مصدرًا يمثل برنامج تليفزيوني. @ar
definition: 将一种资源与补充作为电视节目的一种资源的一种音乐资源关联起来。 @zh-hans

is music for television program
lexical alias: musicForTelevisionProgram.en
status: Published
type: Property
label: er musik til tv-program @da
label: is muziek voor televisieprogramma @nl
label: ist Musik für Fernsehsendung @de
label: televisio-ohjelman musiikki (aineisto) @fi
label: televizyon programı müziğidir @tr
label: zene a következő televízióműsorhoz: @hu
label: هي موسيقى لبرنامج تلفزيوني @ar
label: 是用于电视节目的音乐 @zh-hans
sub property of: is music for
inverse of: has television program music
definition: Bir kaynağı, müzik kaynağıyla tamamlanan bir televizyon programı olan bir kaynakla ilişkilendirir. @tr
definition: Hozzákapcsol egy forrást egy televízióműsor-forráshoz, amelyet egy zenei forrás egészít ki. @hu
definition: Liittää aineiston aineistoon, joka on musiikkiaineistolla täydennetty televisio-ohjelma. @fi
definition: Relaterer en ressource til en ressource, der anvender en musikressource i et tv-program. @da
definition: Relates a resource to a resource that is a television program that is complemented by a musical resource.
definition: Setzt eine Ressource in Beziehung zu einer Fernsehsendung (Ressource), die durch eine Musikressource vervollständigt wird. @de
definition: يربط بين مصدر ومصدر هو برنامج تلفزيوني يُكمله مصدر موسيقي. @ar
definition: 将一种资源与被一种音乐资源补充的作为电视节目的一种资源关联起来。 @zh-hans

has radio program music
lexical alias: radioProgramMusic.en
status: Published
type: Property
label: er radioprogrammusik @da
label: hat Hörfunksendungsmusik @de
label: heeft radioprogramma-muziek @nl
label: radio-ohjelman musiikki (aineisto) @fi
label: radyo programı müziği ile ilişkilidir @tr
label: rádióműsor zenéje a következő: @hu
label: له موسيقى برنامج إذاعي @ar
label: 有广播节目音乐 @zh-hans
sub property of: has music
inverse of: is music for radio program
definition: Bir kaynağı, bir radyo programı olan bir kaynağı tamamlayan bir müzik kaynağıyla ilişkilendirir. @tr
definition: Hozzákapcsol egy forrást egy zenei forráshoz, amely kiegészít egy rádióműsor-forrást. @hu
definition: Liittää aineiston musiikkiaineistoon, joka täydentää aineistoa, joka on radio-ohjelma. @fi
definition: Relaterer en ressource til en musikressource, der er anvendt i et radioprogram. @da
definition: Relates a resource to a musical resource that complements a resource that is a radio program.
definition: Setzt eine Ressource in Beziehung zu einer Musikressource, die eine Hörfunksendung (Ressource) ergänzt. @de
definition: يربط بين مصدر ومصدر موسيقي يُكمل مصدرًا يمثل برنامج إذاعي. @ar
definition: 将一种资源与补充作为广播节目的一种资源的一种音乐资源关联起来。 @zh-hans

is music for radio program
lexical alias: musicForRadioProgram.en
status: Published
type: Property
label: er musik til radioprogram @da
label: is muziek voor radioprogramma @nl
label: ist Musik für Hörfunksendung @de
label: musiikki radio-ohjelmaan (aineisto) @fi
label: radyo programı müziğidir @tr
label: zene a következő rádióműsorhoz: @hu
label: هي موسيقى لبرنامج إذاعي @ar
label: 是用于广播节目的音乐 @zh-hans
sub property of: is music for
inverse of: has radio program music
definition: Bir kaynağı, müzikal kaynakla tamamlanan bir radyo programı olan bir kaynakla ilişkilendirir. @tr
definition: Hozzákapcsol egy forrást egy rádióműsor-forráshoz, amelyet egy zenei forrás egészít ki. @hu
definition: Liittää aineiston aineistoon, joka on musiikkiaineistolla täydennetty radio-ohjelma. @fi
definition: Relaterer en ressource til en ressource, der anvender en musikressource i et radioprogram. @da
definition: Relates a resource to a resource that is a radio program that is complemented by a musical resource.
definition: Setzt eine Ressource in Beziehung zu einer Hörfunksendung (Ressource), die durch eine Musikressource vervollständigt wird. @de
definition: يربط بين مصدر ومصدر هو برنامج إذاعي يُكمله مصدر موسيقي. @ar
definition: 将一种资源与补充作为广播节目的一种资源的一种音乐资源关联起来。 @zh-hans

is music for motion picture
lexical alias: musicForMotionPicture.en
status: Published
type: Property
label: er musik til film @da
label: is muziek voor speelfilm @nl
label: ist Musik für Film @de
label: musiiki elokuvaan (aineisto) @fi
label: sinema filmi müziğidir @tr
label: zene a következő mozgóképhez: @hu
label: هي موسيقى لفيلم سينمائي @ar
label: 是用于电影的音乐 @zh-hans
sub property of: has music
inverse of: has motion picture music
definition: Bir kaynağı, müzikal kaynakla tamamlanan bir sinema filmi olan bir kaynakla ilişkilendirir. @tr
definition: Hozzákapcsol egy forrást egy mozgókép-forráshoz, amelyet egy zenei forrás egészít ki. @hu
definition: Liittää aineiston aineistoon, joka on musiikkiaineistolla täydennetty elokuva. @fi
definition: Relaterer en ressource til en ressource, der anvender en musikressource i en film. @da
definition: Relates a resource to a resource that is a motion picture that is complemented by a musical resource.
definition: Setzt eine Ressource in Beziehung zu einer Filmressource, die durch eine Musikressource vervollständigt wird. @de
definition: يربط بين مصدر ومصدر هو فيلم سينمائي يُكمله مصدر موسيقي. @ar
definition: 将一种资源与补充作为电影的一种资源的一种音乐资源关联起来。 @zh-hans

has motion picture music
lexical alias: motionPictureMusic.en
status: Published
type: Property
label: elokuvamusiikki @fi
label: er filmmusik @da
label: heeft speelfilmmuziek @nl
label: ist Filmmusik @de
label: mozgókép zenéje a következő: @hu
label: sinema filmi müziği ile ilişkilidir @tr
label: له موسيقى فيلم سينمائي @ar
label: 有电影音乐 @zh-hans
sub property of: has music
inverse of: is music for motion picture
definition: Bir kaynağı, sinema filmi olan bir kaynağı tamamlayan bir müzik kaynağıyla ilişkilendirir. @tr
definition: Hozzákapcsol egy forrást egy zenei forráshoz, amely kiegészít egy mozgókép-forrást. @hu
definition: Liittää aineiston musiikkiaineistoon, joka täydentää elokuva-aineistoa. @fi
definition: Relaciona un recurs amb un recurs que és un recurs musical que complementa un recurs que és una pel·lícula cinematogràfica. @ca
definition: Relaterer en ressource til en musikressource, der er anvendt i en film. @da
definition: Relates a resource to a resource that is a musical resource that complements a resource that is a motion picture.
definition: Setzt eine Ressource in Beziehung zu einer Musikressource, die ein Filmwerk ergänzt. @de
definition: يربط بين مصدر ومصدر موسيقي يُكمل مصدرًا يمثل فيلم سينمائي. @ar
definition: 将一种资源与补充作为电影的一种资源的一种音乐资源关联起来。 @zh-hans

has predecessor of split
lexical alias: predecessorOfSplit.en
status: Published
type: Property
label: ana kuruluş ile ilişkilidir @tr
label: har forgænger til opsplitning @da
label: hat Vorgängerin/Vorgänger einer Aufteilung @de
label: heeft voorganger van splitsing @nl
label: jakautunut yhteisö @fi
label: szétválás előtti jogelődje a következő: @hu
label: له وكيل سابق نتيجة انفصال @ar
label: 有分出行为者的前身 @zh-hans
inverse of: has product of split
definition: Hozzákapcsol egy ágenst, amely szétválik vagy egy kapcsolódó ágens részévé válik, egy ágenshez. @hu
definition: Liittää yhteistoimijan yhteistoimijaan, joka on jakautunut tai eronnut liittyväksi yhteistoimijaksi. @fi
definition: Relaterer en agent der blev opdelt eller opsplittet i en anden agent til en agent. @da
definition: Relates an agent who split or divided into a related agent to an agent.
definition: Setzt einen Akteur in Beziehung zu einem Akteur, der einem anderen Akteur nachfolgt oder aus ihm hervorgeht. @de
definition: İlgili bir temsilciye bölünmüş veya ayrılmış bir temsilciyi bir temsilciyle ilişkilendirir. @tr
definition: يربط بين وكيل ووكيل انفصل أو انقسم إلى وكيل ذي صلة. @ar
definition: 将一个行为者与被分出或被划分成一个相关行为者的一个行为者关联起来。 @zh-hans

has component of merger
lexical alias: componentOfMerger.en
status: Published
type: Property
label: beolvadás alkotóeleme a következő: @hu
label: birleşme bileşeni ile ilişkilidir @tr
label: har del af sammenlægning @da
label: hat Beteiligte/Beteiligten an einer Fusion @de
label: heeft onderdeel van fusie @nl
label: yhdistynyt yhteistoimija @fi
label: له مكون الإندماج @ar
label: 有合并的组成部分 @zh-hans
inverse of: has product of merger
definition: Bir veya daha fazla diğer temsilciyle birleşerek ilgili bir temsilci oluşturan bir temsilciyi bir temsilciyle ilişkilendirir. @tr
definition: Hozzákapcsol egy ágenst, amely egy vagy több más ágenssel egyesülve alkotott kapcsolódó ágenst, egy ágenshez. @hu
definition: Liittää yhteistoimijaan, joka muodostaa uuden yhdistymällä yhden tai useamman muun yhteistoimijan kanssa. @fi
definition: Relaciona un agent amb un agent que forma un altre agent fusionant-se amb un o més agents. @ca
definition: Relaterer en agent der har dannet en anden agent gennem sammenlægning med en eller flere andre agenter til en agent. @da
definition: Relates an agent to an agent who forms another agent by merging with one or more other agents.
definition: Setzt einen Akteur in Beziehung zu einem Akteur, der durch Fusion mit einem anderen Akteur oder mehreren anderen Akteuren einen in Beziehung stehenden Akteur gebildet hat. @de
definition: يربط بين وكيل ووكيل قام بتشكيل وكيل ذو صلة عن طريق الاندماج مع وكيل أو وكلاء آخرين. @ar
definition: 将一个行为者与通过与一个或多个行为者合并而形成另一个行为者的一个行为者关联起来。 @zh-hans

is officer of
has subproperty: is chief executive of
has subproperty: is trustee of
lexical alias: officerOf.en
status: Published
type: Property
label: er embedsmand i @da
label: hat leitende Angestellte/leitenden Angestellten von @de
label: heeft functionaris van @nl
label: tisztviselője: @hu
label: toimihenkilö @fi
label: yetkilisi ile ilişkilidir @tr
label: és directiu de @ca
label: له مسؤول عن @ar
label: 是……的任职者 @zh-hans
sub property of: has related agent of agent
inverse of: has officer
definition: Bir temsilciyi, bir makamda görev yapan veya bir temsilciye komuta eden bir temsilci ile ilişkilendirir. @tr
definition: Hozzákapcsol egy ágenst egy tisztséget betöltő vagy utasítást adó ágenshez. @hu
definition: Liittää yhteistoimijan toimijaan, jolla on yhteistoimijassa toimi tai virka. @fi
definition: Relaciona un agent amb un agent que ocupa un càrrec en un agent o que comanda un agent. @ca
definition: Relaterer en agent til en agent hvor en agent har et embede eller som en person leder. @da
definition: Relates an agent to an agent holding an office in or commanding an agent.
definition: Setzt einen Akteur in Beziehung zu einem Akteur, der ein Amt innehat oder einen Akteur leitet. @de
definition: يربط بين وكيل ووكيل يشغل منصبًا أو يُشرف على وكيل. @ar
definition: 将一个行为者与在一个行为者中任职或掌控一个行为者的一个行为者关联起来。 @zh-hans

has broader affiliated agent
lexical alias: broaderAffiliatedAgent.en
status: Published
type: Property
label: daha geniş bağlı temsilci ile ilişkilidir @tr
label: har bredere tilknyttet agent @da
label: hat Dachverband @de
label: heeft breder aangesloten actor @nl
label: laajempi emoyhtiö @fi
label: tágabb értelmű tagágense a következő: @hu
label: له وكيل تابع على نطاق أوسع @ar
label: 有更广泛的隶属行为者 @zh-hans
definition: Bir temsilciyi, yerel bir bağlı kuruluş adına hareket eden bir temsilciyle ve daha geniş bir organizasyon düzeyindeki diğer kişilerle ilişkilendirir. @tr
definition: Hozzákapcsol egy ágenst egy ágenshez, amely helyi tagszervezete és mások érdekében tágabb szervezeti szinten jár el. @hu
definition: Liittää yhteistoimijan laajempaan yhteistoimijaan, jolla on yhteys paikallisiin tytäryhtiöihin organisaatiorakenteen kautta. @fi
definition: Relaterer en agent der agerer for en lokalt tilknyttet agent og andre på et bredere organisatorisk niveau til en agent. @da
definition: Relates an agent to an agent who acts for a local affiliated body and others at a broader organizational level.
definition: Setzt einen Akteur in Beziehung zu einem Akteur, der für eine lokale Filiale und für andere, auf einer größeren organisatorischen Ebene, handelt. @de
definition: يربط بين وكيل ووكيل يعمل لصالح هيئة محلية تابعة وهيئات أخرى على مستوى تنظيمي أوسع. @ar
definition: 将一个行为者与为一个本地隶属团体行为并为一个更广泛的组织层次其他团体行为的一个行为者关联起来。 @zh-hans

has local affiliate
lexical alias: localAffiliate.en
status: Published
type: Property
label: har lokal filial @da
label: hat lokalen Partner @de
label: heeft lokaal aangeslotene @nl
label: helyi leányvállalata a következő: @hu
label: paikallinen tytäryhtiö @fi
label: yerel bağlı kuruluş ile ilişkilidir @tr
label: له تابع محلي @ar
label: 有本地隶属 @zh-hans
definition: Hozzákapcsol egy helyi ágenst, amely része egy tágabb értelmű ágensnek amely annak és másoknak az érdekében cselekszik szélesebb szervezeti szinten, egy ágenshez. @hu
definition: Kendisi adına hareket eden daha geniş bir aracıya bağlı yerel bir aracıyı ve daha geniş bir organizasyonel seviyedeki diğerlerini bir aracıyla ilişkilendirir. @tr
definition: Liittää yhteistoimijan paikalliseen yhteistoimijaan, jolla on yhteys emoyhtiön edustamaan laajempaan organisaatioon. @fi
definition: Relaciona un agent amb un agent local que està afiliat amb una entitat més àmplia que actua per a aquella i per a altres entitats en un nivell organitzatiu més ampli. @ca
definition: Relaterer en lokal agent der er tilknyttet et bredere organ som agerer for den og andre på et bredere organisatorisk niveau til en agent. @da
definition: Relates an agent to an agent that is local who is affiliated with a broader body which acts for it and others at a broader organizational level.
definition: Setzt einen Akteur in Beziehung zu einem lokalen Akteur, der mit einem Dachverband verbunden ist, der für ihn und andere auf einer größeren organisatorischen Ebene handelt. @de
definition: يربط بين وكيل ووكيل محلي تابع لوكيل أوسع يعمل لصالحه ولصالح آخرين على مستوى تنظيمي أوسع. @ar
definition: 将一个行为者与作为本地的并隶属于一个更广泛的团体、为其并为一个更广泛的组织层次其他团体行为的一个行为者关联起来。 @zh-hans

has choreography
lexical alias: choreography.en
status: Published
type: Property
label: er koregorafi @da
label: hat Choreografie @de
label: heeft choreografie @nl
label: koreografi ile ilişkilidir @tr
label: koreografia-aineisto @fi
label: koreográfiája a következő: @hu
label: له فن تصميم الرقصات @ar
label: 有编舞 @zh-hans
sub property of: is complemented by
inverse of: is choreography for
definition: Bir kaynağı koreografik bir kaynak olan bir kaynakla ilişkilendirir. @tr
definition: Hozzákapcsol egy forrást egy koreografikus forráshoz. @hu
definition: Liittää aineiston aineistoon, joka on koreografinen aineisto. @fi
definition: Relaciona un recurs amb un recurs que és un recurs coreogràfic que complementa un recurs. @ca
definition: Relaterer en ressource til en ressource, der giver koreografien til brug i en relateret ressource. @da
definition: Relates a resource to a resource that is a choreographic resource that complements a resource.
definition: Setzt eine Ressource in Beziehung zu einer choreografischen Ressource. @de
definition: يربط بين مصدر ومصدر يُمثل مصدر تصميم الرقصات. @ar
definition: 将一种资源与作为一种编舞资源并补充一种资源的一种资源关联起来。 @zh-hans

is choreography for
lexical alias: choreographyFor.en
status: Published
type: Property
label: er koreografi til @da
label: is choreografie voor @nl
label: ist Choreografie für @de
label: koreografia aineistoon @fi
label: koreografisidir @tr
label: koreográfia a következőhöz: @hu
label: هو فن تصميم الرقصات لـ @ar
label: 是用于……的编舞 @zh-hans
sub property of: is complemented by
inverse of: has choreography
definition: Bir kaynağı, koreografik bir kaynakla tamamlanan bir kaynakla ilişkilendirir. @tr
definition: Hozzákapcsol egy forrást egy forráshoz, amelyet egy koreografikus forrás egészít ki. @hu
definition: Liittää aineiston koreografisella aineistolla täydennettyn aineistoon. @fi
definition: Relaterer en ressource til en ressource, der anvender en relateret ressources koreografi. @da
definition: Relates a resource to a resource that is complemented by a choreographic resource.
definition: Setzt eine Ressource in Beziehung zu einer Ressource, die durch eine choreografische Ressource vervollständigt wird. @de
definition: يربط بين مصدر ومصدر يُكمله مصدر تصميم الرقصات. @ar
definition: 将一种资源与被一种编舞资源补充的一种资源关联起来。 @zh-hans

is adapted as graphic novel
lexical alias: adaptedAsGraphicNovel.en
status: Published
type: Property
label: er bearbejdet til graphic novel @da
label: is bewerkt als stripboek @nl
label: ist bearbeitet als Graphic Novel @de
label: képregényként való feldolgozása a következő: @hu
label: sarjakuvaversio (aineisto) @fi
label: çizgi roman olarak uyarlanmıştır @tr
label: هو مقتبس كرواية مصورة @ar
label: 被改编为图解小说 @zh-hans
sub property of: is adapted as
inverse of: is graphic novelization of
definition: Bir kaynağı, başka bir kaynağa dayalı olarak bir grafik romanla ilişkilendirir. @tr
definition: Hozzákapcsol egy forrást egy képregényhez, amely egy másik forráson alapul. @hu
definition: Liittää aineiston toiseen aineistoon perustuvaan sarjakuva-aineistoon. @fi
definition: Relaterer en ressource til en graphic novel baseret på en oprindelig ressource. @da
definition: Relates a resource to a graphic novel based on another resource
definition: Setzt eine Ressource in Beziehung zu einer Graphic Novel, die auf einer anderen Ressource basiert. @de
definition: يربط بين مصدر ورواية مصورة تعتمد على مصدر آخر. @ar
definition: 将一种资源与基于另一种资源的一种图解小说关联起来。 @zh-hans

is graphic novelization of
lexical alias: graphicNovelizationOf.en
status: Published
type: Property
label: er omskrivning til graphic novel af @da
label: is stripboekversie van @nl
label: ist Bearbeitung als Graphic Novel von @de
label: képregény-feldolgozása a következőnek: @hu
label: sarjakuvaversio aineistosta @fi
label: çizgi romanlaştırılmasıdır @tr
label: هو رواية مصورة لـ @ar
label: 是……的图解小说化 @zh-hans
sub property of: is adaptation of
inverse of: is adapted as graphic novel
definition: Bir kaynağı, çizgi roman olarak uyarlanmış bir kaynakla ilişkilendirir. @tr
definition: Hozzákapcsol egy forrást egy forráshoz, amelyet képregényként adaptáltak. @hu
definition: Liittää aineiston aineistoon, joka on sovitettu sarjakuvaksi. @fi
definition: Relaterer et en ressource til en ressource, der er blevet bearbejdet som en graphic novel. @da
definition: Relates a resource to a resource that is adapted as a graphic novel.
definition: Setzt eine Ressource in Beziehung zu einer Ressource, die als Graphic Novel bearbeitet ist. @de
definition: يربط بين مصدر ومصدر تم اقتباسها كرواية مصورة. @ar
definition: 将一种资源与被改编为图解小说的一种资源关联起来。 @zh-hans

is adapted as video game
lexical alias: adaptedAsVideoGame.en
status: Published
type: Property
label: er bearbejdet som computerspil @da
label: is bewerkt als computerspel @nl
label: ist bearbeitet als Videospiel @de
label: video oyunu olarak uyarlanmıştır @tr
label: videopelisovitus (aineisto) @fi
label: videójátékként való feldolgozása a következő: @hu
label: هو مقتبس كلعبة فيديو @ar
label: 被改编为视频游戏 @zh-hans
sub property of: is adapted as
inverse of: is video game adaptation of
definition: Bir kaynağı, başka bir kaynağa dayanan bir video oyunu olan kaynakla ilişkilendirir. @tr
definition: Hozzákapcsol egy forrást egy videójátékhoz, amely egy másik forráson alapul. @hu
definition: Liittää aineiston toiseen aineistoon perustuvaan videopeliaineistoon. @fi
definition: Relaciona un recurs amb un recurs que és un videojoc basat en un altre recurs. @ca
definition: Relaterer en ressource til en videospilsressource baseret på en oprindelig ressource. @da
definition: Relates a resource to a resource that is a video game based on another resource.
definition: Setzt eine Ressource in Beziehung zu einem Videospiel, das auf einer anderen Ressource basiert. @de
definition: يربط بين مصدر ولعبة فيديو تعتمد على مصدر آخر. @ar
definition: 将一种资源与基于另一种资源的一种视频游戏关联起来。 @zh-hans

is video game adaptation of
lexical alias: videoGameAdaptationOf.en
status: Published
type: Property
label: er computerspilbearbejdelse af @da
label: is computerspelbewerking van @nl
label: ist Videospielbearbeitung von @de
label: video oyunu uyarlamasıdır @tr
label: videopelisovitus (aineisto) @fi
label: videójáték-feldolgozása a következőnek: @hu
label: هو اقتباس لعبة فيديو لـ @ar
label: 是……的视频游戏改编 @zh-hans
sub property of: is adaptation of
inverse of: is adapted as video game
definition: Bir kaynağı, video oyunu olarak uyarlanmış bir kaynakla ilişkilendirir. @tr
definition: Hozzákapcsol egy forrást egy forráshoz, amelyet videójátékként adaptáltak. @hu
definition: Liittää aineiston aineistoon, joka on sovitettu videopeliksi. @fi
definition: Relaterer en ressource til en ressource, der er blevet bearbejdet som et computerspil. @da
definition: Relates a resource to a resource that is adapted as a video game.
definition: Setzt eine Ressource in Beziehung zu einer Ressource, die als Videospiel bearbeitet ist. @de
definition: يربط بين مصدر ومصدر مُقتبس كلعبة فيديو. @ar
definition: 将一种资源与被改编为一种视频游戏的一种资源关联起来。 @zh-hans

has papermaker
lexical alias: papermaker.en
status: Published
type: Property
label: aineiston paperin valmistaja @fi
label: har papirproducent @da
label: hat Papiermacherin/Papiermacher @de
label: heeft papierproducent @nl
label: kağıt üreticisi ile ilişkilidir @tr
label: papírgyártója a következő: @hu
label: له صانع ورق @ar
label: 有造纸者 @zh-hans
sub property of: has related agent of resource
inverse of: is papermaker of
definition: Bir kaynağı, bir kaynağı üretmek için kullanılan kağıdın üretiminden sorumlu olan bir temsilci ile ilişkilendirir. @tr
definition: Hozzákapcsol egy forrást egy ágenshez, amely felelős egy forrás gyártásához használt papír előállításáért. @hu
definition: Liittää aineiston toimijaan, joka vastaa aineiston valmistamiseen käytetyn paperin valmistamisesta. @fi
definition: Relaciona un recurs amb un agent que és responsable de l’elaboració del paper usat en un recurs. @ca
definition: Relaterer en ressource til en agent, der er ansvarlig for fremstilling af papir, som er anvendt til fremstilling af en ressource. @da
definition: Relates a resource to an agent who is responsible for the making of paper used in a resource.
definition: Setzt eine Ressource in Beziehung zu einem Akteur, der für die Produktion von Papier verantwortlich ist, das zur Herstellung einer Ressource verwendet wird. @de
definition: يربط مصدر بوكيل مسؤول عن إنتاج الورق المستخدم في صناعة مصدر. @ar
definition: 将一种资源与负责一种资源中所使用的纸张之制造的一个行为者关联起来。 @zh-hans

is papermaker of
lexical alias: papermakerOf.en
status: Published
type: Property
label: er papirproducent af @da
label: is papiermaker van @nl
label: ist Papiermacherin/Papiermacher von @de
label: kağıt üreticisidir @tr
label: paperin valmistaja (toimija) aineistossa @fi
label: papírgyártója a következőnek: @hu
label: هو صانع ورق لـ @ar
label: 是……的造纸者 @zh-hans
sub property of: has related resource of agent
inverse of: has papermaker
definition: Bir temsilciyi, bir temsilcinin kağıt yapma sorumluluğunu içeren bir kaynakla ilişkilendirir. @tr
definition: Hozzákapcsol egy ágenst egy forráshoz, amelyhez hozzátartozik az ágens felelőssége a papír előállításáért. @hu
definition: Liittää toimijan aineistoon, jossa toimija vastaa paperin valmistamisesta. @fi
definition: Relaciona un agent amb un recurs que implica una responsabilitat d’un agent en l’elaboració del paper. @ca
definition: Relaterer en agent, der er ansvarlig for at producere papir der bruges til at fremstille en manifestation til en ressource. @da
definition: Relates an agent to a resource that involves a responsibility of an agent for making paper.
definition: Setzt einen Akteur in Beziehung zu einer Ressource, bei der ein Akteur für die Produktion von Papier verantwortlich ist. @de
definition: يربط بين وكيل ومصدر ينطوي على مسؤولية وكيل عن إنتاج ورق. @ar
definition: 将一个行为者与涉及造纸的一个行为者的责任的一种资源关联起来。 @zh-hans

has visual effects provider
lexical alias: visualEffectsProvider.en
status: Published
type: Property
label: aineiston visuaalisten tehosteiden tekijä @fi
label: görsel efekt sağlayıcısı ile ilişkilidir @tr
label: har leverandør af visuelle effekter @da
label: hat Visual-effects-Provider @de
label: heeft aanbieder visuele effecten @nl
label: vizuális effektusok szolgáltatója a következő: @hu
label: له مُوَرّد للمؤثرات المرئية @ar
label: 有视觉效果提供者 @zh-hans
sub property of: has contributor (Deprecated)
inverse of: is visual effects provider of
definition: Bir kaynağı, üretim sonrası görsel efektleri tasarlayarak ve oluşturarak hareketli bir görüntü kaynağına katkıda bulunan bir temsilci ile ilişkilendirir. @tr
definition: Hozzákapcsol egy forrást egy ágenshez, amely hozzájárul egy mozgóképforráshoz azzal, hogy megtervezi és megalkotja az utómunkálati vizuális effektusokat. @hu
definition: Liittää aineiston toimijaan, joka on osallisena liikkuvan kuvan aineiston tekemisessä suunnittelemalla ja luomalla visuaaliset tehosteet jälkituotantovaiheessa. @fi
definition: Relaterer en ressource til en agent, der har bidraget til en levende billed-ressource ved at designe og skabe visuelle effekter efter produktionen. @da
definition: Relates a resource to an agent who contributes to a moving image resource by designing and creating post-production visual effects.
definition: Setzt eine Ressource in Beziehung zu einem Akteur, der zu einer Bewegtbildressource beiträgt, indem er in der Postproduktion visuelle Effekte entwirft und erstellt. @de
definition: يربط مصدر بوكيل يُساهم في مصدر فيلم سينمائي من خلال تصميم وإنشاء مؤثرات مرئية لمرحلة ما بعد الإنتاج. @ar
definition: 将一种资源与通过设计并创作后制作视觉效果而对一种动态图像资源作出贡献的一个行为者关联起来。 @zh-hans

has special effects provider
lexical alias: specialEffectsProvider.en
status: Published
type: Property
label: erikoistehosteiden tekijä @fi
label: har leverandør af specialeffekter @da
label: hat Special-effects-Provider @de
label: heeft aanbieder speciale effecten @nl
label: speciális effektusok szolgáltatója a következő: @hu
label: özel efekt sağlayıcısı ile ilişkilidir @tr
label: له مُوَرّد للمؤثرات الخاصة @ar
label: 有特殊效果提供者 @zh-hans
sub property of: has contributor (Deprecated)
inverse of: is special effects provider of
definition: Bir kaynağı, sette mekanik efektler ve kamera içi optik efektler gibi sette özel efektler tasarlayarak ve yaratarak hareketli bir görüntü veya ses kaynağına katkıda bulunan bir temsilci ile ilişkilendirir. @tr
definition: Hozzákapcsol egy forrást egy ágenshez, amely hozzájárul egy mozgókép- vagy hangzóforráshoz azzal, hogy megtervezi és megalkotja az olyan helyszíni speciális effektusokat, mint például a helyszíni mechanikai hatások és kamerán belüli optikai effektusok. @hu
definition: Liittää aineiston toimijaan, joka on osallisena liikkuvan kuvan aineiston tai ääniteosaineiston tekemisessä suunnittelemalla ja luomalla taltioinnin aikana tapahtuvat erikoistehosteet, kuten mekaaniset tehosteet ja kameralla toteutettavat optiset tehosteet. @fi
definition: Relaterer en ressource til en agent, der har bidraget til en levende billed- eller audioressource ved at designe og skabe specialeffekter på stedet som fx mekaniske effekter og optiske kameraeffekter. @da
definition: Relates a resource to an agent who contributes to a moving image or audio resource by designing and creating on-set special effects such as on-set mechanical effects and in-camera optical effects.
definition: Setzt eine Ressource in Beziehung zu einem Akteur, der zu einer Bewegtbild- oder Tonressource beiträgt, indem er am Set Spezialeffekte wie mechanische Effekte und optische Effekte in der Kamera entwirft und erstellt. @de
definition: يربط مصدر بوكيل يُساهم في مصدر فيلم سينمائي أو مصدر صوتي من خلال تصميم مؤثرات خاصة وإنشائها أثناء التصوير، مثل المؤثرات الميكانيكية والمؤثرات البصرية في الكاميرا. @ar
definition: 将一种资源与通过设计并创作现场特殊效果（例如现场机械效果和相机光学效果）而对一种动态图像或音频资源作出贡献的一个行为者关联起来。 @zh-hans

has letterer
lexical alias: letterer.en
status: Published
type: Property
label: aineiston tekstaaja @fi
label: betűrajzolója a következő: @hu
label: har bogstavtegner @da
label: heeft letteraar @nl
label: ist Letterer @de
label: yazı tasarımcısı ile ilişkilidir @tr
label: له رسّام حروف @ar
label: 有字母图案画者 @zh-hans
sub property of: has contributor agent of still image
inverse of: is letterer of
definition: Bir kaynağı, metin ve grafik ses efektleri çizerek bir çizgi romana vb. katkıda bulunan bir illüstratörle ilişkilendirir. @tr
definition: Hozzákapcsol egy forrást egy illusztrátorhoz, aki hozzájárul egy képregényhez, képregényalbumhoz, stb., azzal, hogy megrajzolja a szöveget és a grafikus hangeffektusokat. @hu
definition: Liittää aineiston toimijaan, joka on osallisena sarjakuvan, sarjakuvaromaanin tms. tekemisessä piirtämällä tekstin ja graafiset äänitehosteet. @fi
definition: Relaciona un recurs amb un agent que contribueix a un còmic, una novel·la gràfica, etc., dibuixant el text i els efectes sonors gràfics. @ca
definition: Relaterer en ressource til en illustrator, der har bidraget til et udtryk af en tegneserie, en graphic novel etc. ved at tegne teksten og de grafiske lydeffekter. @da
definition: Relates a resource to an agent who contributes to a comic book, graphic novel, etc., by drawing the text and graphic sound effects.
definition: Setzt eine Ressource in Beziehung zu einer Illustratorin/einem Illustrator, die/der zu einem Comicbuch, einer Graphic Novel und so weiter beiträgt, indem sie/er den Text und die grafischen Toneffekte zeichnet. @de
definition: يربط بين مصدر ورسّام توضيحي يُساهم في كتاب مصور، رواية مصورة، إلخ.، من خلال رسم النص وتصميم المؤثرات الصوتية المصاحبة. @ar
definition: 将一种资源与通过绘制文字和图案声音效果的为漫画书、图解小说等作出贡献的一个行为者关联起来。 @zh-hans

has rapporteur
see also: has minute taker
lexical alias: rapporteur.en
status: Published
type: Property
label: har rapportør @da
label: heeft rapporteur @nl
label: ist Berichterstatterin/Berichterstatter @de
label: kokousten raportoija aineistossa @fi
label: raportör ile ilişkilidir @tr
label: raportőre a következő: @hu
label: له مقَرِّر @ar
label: 有会务报告人 @zh-hans
sub property of: has author
inverse of: is rapporteur of
definition: Bir kaynağı, bir kuruluş tarafından toplantılarının işleyişi hakkında rapor vermek üzere atanan bir yazar olan bir temsilci ile ilişkilendirir. @tr
definition: Hozzákapcsol egy forrást egy szerző ágenshez, akit egy szervezet megbíz azzal, hogy készítsen jelentést az üléseinek a lefolyásáról. @hu
definition: Liittää aineiston toimijaan, joka vastaa organisaation kokousmenettelyistä. @fi
definition: Relaterer en ressource til en forfatter, der er udpeget af en organisation til at rapportere om udviklingen af dens møder. @da
definition: Relates a resource to an agent who is an author who is appointed by an organization to report on the proceedings of its meetings.
definition: Setzt eine Ressource in Beziehung zu einer Verfasserin/einem Verfasser (Akteur), die/der von einer Organisation eingestellt ist, um über den Ablauf ihrer Sitzungen zu berichten. @de
definition: يربط مصدر بوكيل مؤلف تم تعيينه من جانب منظمة لإعداد تقارير عن وقائع اجتماعاتها. @ar
definition: 将一种资源与作为一个著者并被一个组织指定为在其会议文集中报告的一个行为者关联起来。 @zh-hans
scope note: Darunter fällt nicht die Verantwortlichkeit, die sich auf das Protokollschreiben beschränkt. @de
scope note: Ei koske kokouksen pöytäkirjan laatimiseen rajautuvaa vastuuta. @fi
scope note: Nem tartozik bele a jegyzőkönyvvezetésre korlátozódó szerzőség. @hu
scope note: Omfatter ikke ansvar begrænset til at tage referat. @da
scope note: Responsibility limited to taking minutes is excluded.
scope note: Tutanak tutmakla sınırlı sorumluluk hariçtir. @tr
scope note: يتم استبعاد المسؤولية التي تقتصر على تدوين مضابط الجلسات. @ar
scope note: 不包括仅限于写会议记录的责任。 @zh-hans

has calligrapher
lexical alias: calligrapher.en
status: Published
type: Property
label: har kalligraf @da
label: heeft kalligraaf @nl
label: ist Kalligrafin/Kalligraf @de
label: kaligraf ile ilişkilidir @tr
label: kalligrafi aineistossa @fi
label: kalligráfusa a következő: @hu
label: له خَطَّاط @ar
label: 有书法者 @zh-hans
sub property of: has artist
inverse of: is calligrapher of
definition: Bir kaynağı, aynı temsilcinin yazılı metinden de sorumlu olup olmadığına bakılmaksızın, hattatlığın veya grafik sanatının estetik değerinin ön plana çıktığı kaligrafiden sorumlu sanatçı olan bir temsilci ile ilişkilendirir @tr
definition: Hozzákapcsol egy forrást egy művész ágenshez, aki felelős egy kalligráfia megalkotásáért, amelyben a szépírás esztétikai értéke vagy a grafika művészisége áll az érdeklődés fókuszában, tekintet nélkül arra, hogy ugyanaz az ágens a lejegyzett szöveg szerzője is egyben vagy sem. @hu
definition: Liittää aineiston toimijaan, joka vastaa kalligrafiasta, jossa pääpaino on käsin kirjoittamisen tai graafisen taiteen esteettisissä arvoissa, riippumatta siitä, vastaako sama toimija myös kirjoitetusta tekstistä. @fi
definition: Relaterer en ressource til en kunstner, der er ansvarlig for at have skabt en kalligrafisk ressource, hvor fokus ligger på den æstetiske værdi af skrivekunsten eller den kunstneriske grafiske dygtighed, uanset om den samme agent etc. også har forfattet den indskrevne tekst. @da
definition: Relates a resource to an agent who is an artist who is responsible for calligraphy where the focus of interest lies in the aesthetic value of the penmanship or graphic artistry, regardless of whether the same agent is also responsible for the inscribed text.
definition: Setzt eine Ressource in Beziehung zu einer Künstlerin/einem Künstler (Akteur), die/der für die Kalligrafie verantwortlich ist, bei der im Mittelpunkt des Interesses der ästhetische Wert dessen Schreibkunst oder die grafische Kunstfertigkeit liegt, unabhängig davon, ob derselbe Akteur auch für den aufgeschriebenen Text verantwortlich ist. @de
definition: يربط مصدر بوكيل فنانً مسؤول عن الخط حيث يكمن تركيز الاهتمام في القيمة الجمالية للخط أو فن الرسم، بغض النظر عما إذا كان الوكيل نفسه مسؤولاً أيضًا عن النص المدرج. @ar
definition: 将一种资源与作为一个艺术家负责书法（其中兴趣重点是书法或图形艺术的美学价值，不管同一行为者是否负责题写文字）的一个行为者关联起来。 @zh-hans

has book artist
lexical alias: bookArtist.en
status: Published
type: Property
label: har bogkunstner @da
label: hat Buchkünstlerin/Buchkünstler @de
label: heeft boekkunstenaar @nl
label: kirjataiteilija aineistossa @fi
label: kitap sanatçısı ile ilişkilidir @tr
label: könyvművésze a következő: @hu
label: له رَسّام كتب @ar
label: 有图书美术家 @zh-hans
sub property of: has artist
inverse of: is book artist of
definition: Bir kaynağı, kitabın biçimini kullanmaktan veya fiziksel yapısını değiştirmekten sorumlu bir sanatçı olan bir temsilci ile ilişkilendirir. @tr
definition: Hozzákapcsol egy forrást egy művész ágenshez, aki felelős a könyvforma kiaknázásáért vagy fizikai szerkezetének a megváltoztatásáért. @hu
definition: Liittää aineiston toimijaan, jossa toimija vastaa kirjan muodon hyödyntämisestä tai sen fyysisen rakenteen muuttamisesta. @fi
definition: Relaterer en ressource til en kunstner, der er ansvarlig for at have skabt kunstressourcer, der udnytter bogformen eller ændrer dens fysiske struktur som en del af en ressources indhold. @da
definition: Relates a resource to an agent who is an artist who is responsible for exploiting the book form or altering its physical structure.
definition: Setzt eine Ressource in Beziehung zu einer Künstlerin/einem Künstler (Akteur), die/der für die Verwertung der Buchform oder für die Veränderung ihrer physischen Struktur verantwortlich ist. @de
definition: يربط مصدر بوكيل فنان مسؤول عن توظيف شكل الكتاب أو تغيير بنيته المادية. @ar
definition: 将一种资源与作为一个艺术家负责开发图书外形或改变其物理结构的一个行为者关联起来。 @zh-hans

is visual effects provider of
lexical alias: visualEffectsProviderOf.en
status: Published
type: Property
label: er leverandør af visuelle effekter til @da
label: görsel efektler sağlayıcısıdır @tr
label: is aanbieder visuele effecten van @nl
label: ist Visual-effects-Provider von @de
label: visuaalisten tehosteiden tekijä (toimija) aineistossa @fi
label: vizuális effektusokat szolgáltatója a következőnek: @hu
label: هو مورد للمؤثرات المرئية لـ @ar
label: 是……的视觉效果提供者 @zh-hans
sub property of: is contributor of (Deprecated)
inverse of: has visual effects provider
definition: Bir temsilciyi, yapım sonrası görsel efektleri tasarlayan ve oluşturan bir temsilcinin katkısını içeren bir kaynakla ilişkilendirir. @tr
definition: Hozzákapcsol egy forrást egy ágenshez, amely magában foglalja az ágens közreműködését utómunkálati vizuális effektusok tervezésében és létrehozásában. @hu
definition: Liittää toimijan aineistoon, jonka tekemiseen toimija osallistuu suunnittelemalla ja luomalla visuaaliset tehosteet jälkituotantovaiheessa. @fi
definition: Relaterer en agent, der har bidraget til en levende billed-ressource ved at designe og skabe visuelle effekter efter produktionen til en ressource. @da
definition: Relates an agent to a resource that includes a contribution by an agent of designing and creating post-production visual effects.
definition: Setzt einen Akteur in Beziehung zu einer Ressource, zu der ein Akteur beiträgt, indem er in der Postproduktion visuelle Effekte entwirft und erstellt. @de
definition: يربط بين وكيل ومصدر يتضمن إسهام وكيل في تصميم وإنشاء مؤثرات مرئية لمرحلة ما بعد الإنتاج. @ar
definition: 将一个行为者与包括设计并创作制作后视觉效果的一个行为者的贡献的一种资源关联起来。 @zh-hans

is special effects provider of
lexical alias: specialEffectsProviderOf.en
status: Published
type: Property
label: er leverandør af specialeffekter til @da
label: erikoistehosteiden tekijä (toimija) aineistossa @fi
label: is aanbieder speciale effecten van @nl
label: ist Special-effects-Provider von @de
label: speciális effektusok szolgáltatója a következőnek: @hu
label: Özel efektler sağlayan @tr
label: هو مورد للمؤثرات الخاصة لـ @ar
label: 是……的特殊效果提供者 @zh-hans
sub property of: is contributor of (Deprecated)
inverse of: has special effects provider
definition: Bir temsilciyi, mekanik efektler ve kamera ışık efektleri gibi sette özel efektlerin tasarlanması ve oluşturulmasına katkı sağlayan bir kaynakla ilişkilendirir. @tr
definition: Hozzákapcsol egy forrást egy ágenshez, amely magában foglalja a közreműködést olyan helyszíni speciális effektusok tervezésében és létrehozásában, mint a mechanikai és kamerán belüli optikai hatások. @hu
definition: Liittää toimijan aineistoon, jonka tekemiseen toimija osallistuu suunnittelemalla ja luomalla taltioinnin aikana tapahtuvat erikoistehosteet, kuten mekaaniset tehosteet ja kameralla toteutettavat optiset tehosteet. @fi
definition: Relaterer en agent, der har bidraget til et udtryk af en levende billed- eller audioressource ved at designe og skabe specialeffekter på stedet til kulisser såsom mekaniske kulisseeffekter og optiske kameraeffekter til en ressource. @da
definition: Relates an agent to a resource that includes a contribution designing and creating on-set special effects, such as on-set mechanical effects and in-camera optical effects.
definition: Setzt einen Akteur in Beziehung zu einer Ressource, die einen Beitrag zum Entwurf und zur Erstellung von Spezialeffekten am Set leistet, wie zum Beispiel mechanische Effekte am Set und optische Effekte in der Kamera. @de
definition: يربط بين وكيل ومصدر يشمل المساهمة في تصميم مؤثرات خاصة وإنشائها أثناء التصوير، مثل المؤثرات الميكانيكية المُحددة والمؤثرات البصرية في الكاميرا. @ar
definition: 将一个行为者与包括设计并创作现场特殊效果（例如现场机械效果和相机光学效果）的贡献的一种资源关联起来。 @zh-hans

is letterer of
lexical alias: lettererOf.en
status: Published
type: Property
label: betűrajzolója a következőnek: @hu
label: er bogstavtegner til @da
label: is letteraar van @nl
label: ist Letterer von @de
label: tekstaaja (toimija) aineistossa @fi
label: yazı tasarımcısıdır @tr
label: هو رسّام حروف لـ @ar
label: 是……的字母图案画者 @zh-hans
sub property of: is contributor agent of still image of
inverse of: has letterer
definition: Bir temsilciyi, grafik roman, çizgi roman vb. için metin ve grafik ses efektleri çizen bir temsilcinin katkısını içeren bir kaynakla ilişkilendirir. @tr
definition: Hozzákapcsol egy forrást egy ágenshez, amely magában foglalja az ágens közreműködését képregény, képregényalbum stb. szövegének és grafikai hangeffektusainak rajzolásában. @hu
definition: Liitttää toimijan aineistoon, jossa toimija on osallisena sarjakuvan, sarjakuvaromaanin tms. tekemisessä piirtämällä tekstin ja graafiset äänitehosteet. @fi
definition: Relaterer en illustrator, der har bidraget til en tegneserie, en graphic novel etc. til en ressource. @da
definition: Relates an agent to a resource that includes a contribution by an agent of drawing text and graphic sound effects for a comic book, graphic novel, etc.
definition: Setzt einen Akteur in Beziehung zu einer Ressource, zu der ein Akteur beiträgt, indem er für ein Comicbuch, eine Graphic Novel und so weiter Text und grafische Toneffekte zeichnet. @de
definition: يربط بين وكيل ومصدر يتضمن إسهام وكيل في رسم نص وتصميم المؤثرات الصوتية المصاحبة لرسومات كتاب مصور، أو رواية مصورة، إلخ. @ar
definition: 将一个行为者与包括一个为漫画书、图解小说等绘制文字和图案声音效果的一个行为者的贡献的一种资源关联起来。 @zh-hans

is rapporteur of
see also: is librettist of
lexical alias: rapporteurOf.en
status: Published
type: Property
label: er rapportør af @da
label: is rapporteur van @nl
label: ist Berichterstatterin/Berichterstatter von @de
label: kokousten raportoija (toimija) aineistossa @fi
label: raportörüdür @tr
label: raportőre a következőnek: @hu
label: هو مقَرِّر لـ @ar
label: 是……的会务报告人 @zh-hans
sub property of: is author of
inverse of: has rapporteur
definition: Bir temsilciyi, bir kuruluşun toplantılarının tutanaklarını raporlamak için bir temsilcinin sorumluluğunu içeren bir kaynakla ilişkilendirir. @tr
definition: Hozzákapcsol egy forrást egy ágenshez, amelyhez hozzátartozik egy ágens felelőssége egy szervezet üléseinek lefolyásáról szóló jelentésért. @hu
definition: Liittää toimijan aineistoon, jossa toimija vastaa organisaation kokousmenettelyistä. @fi
definition: Relaterer en forfatter, der er udpeget af en organisation til at rapportere om udviklingen af dens møder til en ressource. @da
definition: Relates an agent to a resource that involves a responsibility of an agent for reporting on the proceedings of meetings of an organization.
definition: Setzt einen Akteur in Beziehung zu einer Ressource, bei der ein Akteur für das Berichten über den Ablauf von Sitzungen einer Organisation verantwortlich ist. @de
definition: يربط بين وكيل ومصدر ينطوي على مسؤولية وكيل عن إعداد تقرير عن وقائع اجتماعات منظمة. @ar
definition: 将一个行为者与涉及一个组织的会议文集报告的一个行为者的责任的一种资源关联起来。 @zh-hans

is calligrapher of
lexical alias: calligrapherOf.en
status: Published
type: Property
label: er kalligraf til @da
label: is kalligraaf van @nl
label: ist Kalligrafin/Kalligraf von @de
label: kaligrafıdır @tr
label: kalligrafi (toimija) aineistossa @fi
label: kalligráfusa a következőnek: @hu
label: هو خَطَّاط لـ @ar
label: 是……的书法者 @zh-hans
sub property of: is artist of
inverse of: has calligrapher
definition: Bir temsilciyi, yazılı metinden sorumlu olup olmadığına bakmadan ilgi odağı grafik sanatı veya hattatlığın estetik değerinde yer alan hat sanatından sorumlu bir temsilcinin sorumluluğunu içeren bir kaynakla ilişkilendirir. @tr
definition: Hozzákapcsol egy forrást egy ágenshez, amelyhez hozzátartozik az ágens szépírással kapcsolatos felelőssége, ahol az érdeklődés középpontjában a kézírás esztétikai értéke vagy a grafika művészisége áll, tekintet nélkül arra, hogy ugyanaz az ágens a lejegyzett szöveg szerzője is egyben vagy sem. @hu
definition: Liittää toimijan aineistoon, jossa toimija vastaa kalligrafiasta, jossa pääpaino on käsin kirjoittamisen tai graafisen taiteen esteettisissä arvoissa, riippumatta siitä, vastaako sama toimija myös kirjoitetusta tekstistä. @fi
definition: Relaterer en kunstner, der er ansvarlig for at have skabt en kalligrafisk ressource, hvor interessefokusset ligger på den æstetiske værdi af dets skønskrift eller kunstneriske grafiske dygtighed, uanset om den samme agent etc. også har forfattet den indskrevne tekst til et ressource. @da
definition: Relates an agent to a resource that involves a responsibility of an agent for calligraphy where the focus of interest lies in the aesthetic value of the penmanship or graphic artistry, regardless of whether the same agent is also responsible for the inscribed text.
definition: Setzt einen Akteur in Beziehung zu einer Ressource, bei der ein Akteur für die Kalligrafie verantwortlich ist, bei der im Mittelpunkt des Interesses der ästhetische Wert dessen Schreibkunst oder die grafische Kunstfertigkeit liegt, unabhängig davon, ob derselbe Akteur auch für den aufgeschriebenen Text verantwortlich ist. @de
definition: يربط بين وكيل ومصدر ينطوي على مسؤولية وكيل عن الخط حيث ينصب الاهتمام على القيمة الجمالية لفن الخط أو فن الرسم، بغض النظر عما إذا كان الوكيل نفسه مسؤولًا أيضًا عن النص المكتوب أم لا. @ar
definition: 将一个行为者与涉及书法（其中兴趣重点是书法或图形艺术的美学价值，不管同一行为者是否负责题写文字）的一个行为者的责任的一种资源关联起来。 @zh-hans

is book artist of
lexical alias: bookArtistOf.en
status: Published
type: Property
label: er bogkunstner til @da
label: is boekkunstenaar van @nl
label: ist Buchkünstlerin/Buchkünstler von @de
label: kirjataiteilija (toimija) aineistossa @fi
label: kitap sanatçısıdır @tr
label: könyvművésze a következőnek: @hu
label: هو رَسّام كتب لـ @ar
label: 是……的图书美术家 @zh-hans
sub property of: is artist of
inverse of: has book artist
definition: Bir temsilciyi, fiziksel yapısını değiştirmek veya kitap biçiminden yararlanmakla görevli bir temsilcinin sorumluluğunu içeren bir kaynakla ilişkilendirir. @tr
definition: Hozzákapcsol egy forrást egy ágenshez, amelyhez hozzátartozik az ágens felelőssége a könyvforma kiaknázásáért vagy fizikai szerkezetének megváltoztatásáért. @hu
definition: Liittää toimijan aineistoon, jossa toimija vastaa kirjan muodon hyödyntämisestä tai sen fyysisen rakenteen muuttamisesta. @fi
definition: Relaterer en kunstner, der er ansvarlig for at have skabt kunstressourcer, der udnytter bogformen eller ændrer dens fysiske struktur som en del af en ressources indhold til en ressource. @da
definition: Relates an agent to a resource that involves a responsibility of an agent for exploiting the book form or altering its physical structure
definition: Setzt einen Akteur in Beziehung zu einer Ressource, bei der ein Akteur für die Verwertung der Buchform oder für die Veränderung ihrer physischen Struktur verantwortlich ist. @de
definition: يربط بين وكيل ومصدر ينطوي على مسؤولية وكيل عن توظيف شكل الكتاب أو تغيير بنيته المادية. @ar
definition: 将一个行为者与涉及开发图书外形或改变其物理结构的一个行为者的责任的一种资源关联起来。 @zh-hans

has details of aspect ratio designation
lexical alias: detailsOfAspectRatioDesignation.en
status: Published
type: Property
label: aineiston kuvasuhdemääritteen tarkemmat tiedot @fi
label: en-boy oranı ile ilişkilidir @tr
label: har detaljer om billedformatbetegnelse @da
label: hat Details zur Bezeichnung eines Bildformats @de
label: heeft details van aspectratio-aanduiding @nl
label: vetületarány-jelölés részletei a következők: @hu
label: له تفاصيل لنسب باعية لتسمية @ar
label: 有宽高比标识细节 @zh-hans
definition: Bir kaynağı, bir hareketli görüntünün genişliğinin yüksekliğine oranını ayrıntılarıyla ilişkilendirir. @tr
definition: Hozzákapcsol egy forrást egy mozgókép szélességi-magassági vetületarányának a részleteihez. @hu
definition: Liittää aineiston tarkempiin tietoihin liikkuvan kuvan leveyden suhteesta korkeuteen. @fi
definition: Relaterer en ressource til detaljer om forholdet mellem bredde og højde i et levende billede. @da
definition: Relates a resource to details of a ratio of the width to the height of a moving image.
definition: Setzt eine Ressource in Beziehung zu Details zu einem Verhältnis von der Breite zu der Höhe eines Bewegtbilds. @de
definition: يربط بين مصدر وتفاصيل عن نسبة العرض إلى ارتفاع لصورة المتحركة. @ar
definition: 将一种资源与一种动态图像的宽和高的比之细节关联起来。 @zh-hans

has details of colour content (Deprecated)
lexical alias: detailsOfColourContent.en
status: Deprecated
type: Property
label: har detaljer om farveindhold @da
label: hat Details zum Farbinhalt @de
label: heeft details van kleurcontent @nl
label: színtartalom részletei a következők: @hu
label: värisisällön tarkemmat tiedot @fi
label: له تفاصيل لمحتوى ملون @ar
alternative label: has details of color content (Deprecated)
definition: Hozzákapcsol egy forrást egy forrás tartalmában megjelenő szín, színárnyalat, stb. részleteihez, illetve a megjelenő adott színekhez, színárnyalatokhoz, stb., beleértve a feketét és a fehéret is. @hu
definition: Liittää aineiston tietoihin, värien, (musta ja valkoinen mukaanlukien), sävyjen jne. esiintymisestä aineiston sisällössä. @fi
definition: Relaterer en ressource til detaljer om tilstedeværelse af farve, nuance etc. i en ressources indhold, samt de specifikke farver, nuancer etc., inkl. sort og hvid, der er til stede. @da
definition: Relates a resource to details of a presence of colour, tone, etc., in the content of a resource, and the specific colours, tones, etc., including black and white, present. (Deprecated)
definition: Setzt eine Ressource in Beziehung zu Details zu dem Vorhandensein von Farbe, Tönung und so weiter im Inhalt einer Ressource und den spezifischen vorhandenen Farben, Tönungen und so weiter (einschließlich Schwarz und Weiß). @de
definition: يربط بين مصدر وتفاصيل عن وجود لون، درجة اللون، إلخ.، في محتوى مصدر، والألوان والدرجات المحددة، إلخ.، بما في ذلك الأسود والأبيض، الحالي. @ar

has details of form of musical notation
lexical alias: detailsOfFormOfMusicalNotation.en
status: Published
type: Property
label: aineiston nuottikirjoituksen tyypin tarkemmat tiedot @fi
label: har detaljer om musikalsk notationsform @da
label: hat Details zur Form der Musiknotation @de
label: heeft details van vorm van muzieknotatie @nl
label: müzik notasyonu biçiminin ayrıntıları ile ilişkilidir @tr
label: zenei lejegyzés formájának részletei a következők: @hu
label: له تفاصيل عن شكل من أشكال التدوين الموسيقي @ar
label: 有乐谱形式的细节 @zh-hans
definition: Bir kaynağı, bir kaynağın müzikal içeriğini ifade etmek için kullanılan bir dizi karakter veya sembollerin ayrıntılarıyla ilişkilendirir. @tr
definition: Hozzákapcsol egy forrást egy forrás zenei tartalmát kifejező karakterek vagy szimbólumok csoportjának részleteihez. @hu
definition: Relaterer en ressource til detaljer om det tegnsæt og/eller symboler der anvendes for at udtrykke en ressources musikalske indhold. @da
definition: Relates a resource to details of a set of characters or symbols used to express musical content of a resource.
definition: Setzt eine Ressource in Beziehung zu Details zu dem Satz von Zeichen oder Symbolen der verwendet wird, um den musikalischen Inhalt einer Ressource auszudrücken. @de
definition: Tarkemmat tiedot merkeistä ja symboleista, joilla aineiston musiikkisisältö on ilmaistu. @fi
definition: يربط بين مصدر وتفاصيل عن مجموعة من التمثيلات أو الرموز المستخدمة للتعبير عن محتوى موسيقي لمصدر. @ar
definition: 将一种资源与用于表示一种资源之音乐内容的字符或符号的集合的细节关联起来。 @zh-hans

has details of form of notated movement
lexical alias: detailsOfFormOfNotatedMovement.en
status: Published
type: Property
label: aineiston nuottikirjoituksen tyypin tarkemmat tiedot @fi
label: har detaljer om bevægelsesnotationsform @da
label: hat Details zur Form der Bewegungsnotation @de
label: heeft details van vorm van bewegingsnotatie @nl
label: mozgásírásforma részletei a következők: @hu
label: notaya alınmış hareket biçiminin ayrıntıları ile ilişkilidir @tr
label: له تفاصيل عن شكل من أشكال الحركات المدونة @ar
label: 有动作谱形式的细节 @zh-hans
definition: Bir kaynağı, bir kaynağın hareket içeriğini ifade etmek için kullanılan bir dizi karakter veya sembollerin ayrıntılarıyla ilişkilendirir. @tr
definition: Hozzákapcsol egy forrást egy forrás mozgástartalmát kifejező karakterek vagy szimbólumok egy csoportjának részleteihez. @hu
definition: Liittää aineiston tarkempiin tietoihin merkeistä ja symboleista, joilla aineiston liikesisältö on ilmaistu. @fi
definition: Relaterer en ressource til detaljer om det sæt af tegn og/eller de symboler, der er anvendt til at udtrykke en ressources bevægelsesindhold. @da
definition: Relates a resource to details of a set of characters or symbols used to express movement content of a resource.
definition: Setzt eine Ressource in Beziehung zu Details zu dem Satz von Zeichen oder Symbolen der verwendet wird, um den Bewegungsinhalt einer Ressource auszudrücken. @de
definition: يربط بين مصدر وتفاصيل عن مجموعة من التمثيلات أو الرموز المستخدمة للتعبير عن محتوى حركي لمصدر. @ar
definition: 将一种资源与用于表示一种资源之动作内容的字符或符号的集合的细节关联起来。 @zh-hans

has details of format of notated music
lexical alias: detailsOfFormatOfNotatedMusic.en
status: Published
type: Property
label: har detaljer om format af noteret musik @da
label: hat Details zur musikalischen Ausgabeform @de
label: heeft details van format van bladmuziek @nl
label: notaya alınmış müzik formatının ayrıntıları ile ilişkilidir @tr
label: nuottiaineiston muodon tarkemmat tiedot @fi
label: zenei lejegyzés formátumának részletei a következők: @hu
label: له صيغة من موسيقى مدونة @ar
label: 有乐谱格式的细节 @zh-hans
definition: Bir kaynağı, müzik notasyonu biçiminde sunulan bir kaynağın içeriğinin fiziksel veya müzikal düzeninin ayrıntılarıyla ilişkilendirir. @tr
definition: Hozzákapcsol egy forrást egy forrás tartalmának zenei lejegyzés formájában megjelenő zenei vagy fizikai elrendezésének részleteihez. @hu
definition: Liittää aineiston tarkempiin tietoihin nuottikirjoituksen muodossa esitetyn aineiston sisällön musiikillisesta tai fyysisestä taitosta. @fi
definition: Relaterer en ressource til detaljer om det musikalske eller fysiske layout af en ressources indhold, der er repræsenteret som musikalsk notation. @da
definition: Relates a resource to details of a musical or physical layout of the content of a resource that is presented in a form of musical notation.
definition: Setzt eine Ressource in Beziehung zu Details zu dem musikalischen oder physischen Layout des Inhalts einer Ressource, der in Form einer Musiknotation präsentiert wird. @de
definition: يربط بين مصدر وتفاصيل عن تخطيط موسيقي أو مادي لمحتوى مصدر يُعرض في شكل من أشكال التدوين الموسيقي. @ar
definition: 将一种资源与以乐谱形式呈现的一种资源之内容的音乐或物理布局的细节关联起来。 @zh-hans

has details of form of tactile notation
lexical alias: detailsOfFormOfTactileNotation.en
status: Published
type: Property
label: aineiston taktiilin merkkijärjestelmän tyypin tarkemmat tiedot @fi
label: dokunsal notasyon biçiminin ayrıntıları ile ilişkilidir @tr
label: har detaljer om taktil notationsform @da
label: hat Details zur Form der taktilen Notation @de
label: heeft details van vorm van tactiele notatie @nl
label: tapintható lejegyzés formájának részletei a következők: @hu
label: له تفاصيل عن شكل من أشكال التدوين عن طريق اللمس @ar
label: 有触摸标记的形式的细节 @zh-hans
definition: Bir kaynağı, bir kaynağın içeriğini dokunma yoluyla algılanabilecek bir biçimde ifade etmek için kullanılan bir dizi karakter veya sembollerin ayrıntılarıyla ilişkilendirir. @tr
definition: Hozzákapcsol egy forrást egy forrás tartalmát érintés útján felfogható formában kifejező karakterek vagy szimbólumok egy csoportjának részleteihez. @hu
definition: Liittää aineiston tarkempiin tietoihin merkeistä ja symboleista, joilla aineiston sisältö on ilmaistu kosketeltavassa muodossa. @fi
definition: Relaterer en ressource til detaljer om det tegnsæt og/eller symboler, der er anvendt til at udtrykke en ressources indhold på en måde, der kan opfattes ved berøring. @da
definition: Relates a resource to details of a set of characters or symbols used to express the content of a resource in a form that can be perceived through touch.
definition: Setzt eine Ressource in Beziehung zu Details zu dem Satz von Zeichen oder Symbolen der verwendet wird, um den Inhalt einer Ressource in einer Form auszudrücken, die über den Tastsinn wahrgenommen werden kann. @de
definition: يربط بين مصدر وتفاصيل عن مجموعة من التمثيلات أو الرموز المستخدمة للتعبير عن محتوى مصدر في شكل يمكن إدراكه من خلال اللمس. @ar
definition: 将一种资源与用于通过触摸感知的形式来表达一种资源的内容的字符或符号的集合的细节关联起来。 @zh-hans

has details of script
lexical alias: detailsOfScript.en
status: Published
type: Property
label: alfabenin ayrıntıları ile ilişkilidir @tr
label: har detaljer om skriftstørrelse @da
label: hat Details zur Schrift @de
label: heeft details van schrift @nl
label: kirjoitusjärjestelmän tarkemmat tiedotaineiston @fi
label: szövegkönyv részletei a következők: @hu
label: له تفاصيل عن نص @ar
label: 有文字的细节 @zh-hans
definition: Bir kaynağı, bir kaynağın yazı dili içeriğini ifade etmek için kullanılan bir dizi sembol veya karakterlerin ayrıntılarıyla ilişkilendirir. @tr
definition: Hozzákapcsol egy forrást egy forrás nyelvi tartalmát kifejező karakterek vagy szimbólumok egy csoportjának részleteihez. @hu
definition: Liittää aineiston tarkempiin tietoihin merkki- tai symbolijärjestelmästä, jolla aineiston kirjoitettu kielellinen sisältö on kirjoitettu. @fi
definition: Relaterer en ressource til detaljer om det sæt af tegn og/eller de symboler, der er anvendt til at udtrykke en ressources skriftlige sprogindhold. @da
definition: Relates a resource to details of set of characters or symbols used to express written language content of a resource.
definition: Setzt eine Ressource in Beziehung zu Details zu dem Satz von Buchstaben oder Zeichen der verwendet wird, um den geschriebenen Sprachinhalt einer Ressource auszudrücken. @de
definition: يربط بين مصدر وتفاصيل عن مجموعة من التمثيلات أو الرموز المستخدمة للتعبير عن محتوى لغة مكتوبة لمصدر. @ar
definition: 将一种资源与用于表达一种资源的书写语言内容的字符或符号的集合的细节关联起来。 @zh-hans

has details of applied material
has subproperty: has details of emulsion on microfilm and microfiche
lexical alias: detailsOfAppliedMaterial.en
status: Published
type: Property
label: aineiston päällimateriaali @fi
label: az alkalmazott anyag részletei a következők: @hu
label: har detaljer om anvendt materiale @da
label: hat Details zu aufgebrachtem Material @de
label: heeft details van aangebracht materiaal @nl
label: uygulanan materyalin ayrıntıları ile ilişkilidir @tr
label: له تفاصيل عن مادة مُستخدمة @ar
label: 有施加材料的细节 @zh-hans
definition: Bir kaynağı, bir kaynağın temel malzemesine uygulanan fiziksel veya kimyasal bir maddenin ayrıntılarıyla ilişkilendirir. @tr
definition: Hozzákapcsol egy forrást egy forrás alapanyagaként alkalmazott fizikai vagy kémiai anyag részleteihez. @hu
definition: Liittää aineiston fysikaaliseen tai kemialliseen aineeseen, jota on laitettu aineiston pohjamateriaalin päälle. @fi
definition: Relaterer en ressource til detaljer om et fysisk eller kemisk stof, der er påført en ressources basismateriale. @da
definition: Relates a resource to details of a physical or chemical substance applied to a base material of a resource.
definition: Setzt eine Ressource in Beziehung zu Details zu einer physischen oder chemischen Substanz, die auf ein Trägermaterial einer Ressource aufgebracht ist. @de
definition: يربط بين مصدر وتفاصيل عن مادة فيزيائية أو كيميائية مستخدمة كمادة أساسية لمصدر. @ar
definition: 将一种资源与施加于一种资源的基底材料上的物理或化学物质的细节关联起来。 @zh-hans

has details of base material
lexical alias: detailsOfBaseMaterial.en
status: Published
type: Property
label: aineiston pohjamateriaalin tarkemmat tiedot @fi
label: alapanyag részletei a következők: @hu
label: har detaljer om basismateriale @da
label: hat Details zum Trägermaterial @de
label: heeft details van basismateriaal @nl
label: temel materyalin ayrıntıları ile ilişkilidir @tr
label: له تفاصيل عن مادة أساسية @ar
label: 有基底材料的细节 @zh-hans
definition: Bir kaynağı, bir kaynağın altında yatan fiziksel materyalin ayrıntılarıyla ilişkilendirir. @tr
definition: Hozzákapcsol egy forrást egy forrás mögöttes fizikai anyagának részleteihez. @hu
definition: Liittää aineiston tarkempiin tietoihin aineiston fyysisestä pohjamateriaalista. @fi
definition: Relaterer en ressource til detaljer om en ressources underliggende fysiske materiale til en ressource. @da
definition: Relates a resource to details of an underlying physical material of a resource.
definition: Setzt eine Ressource in Beziehung zu Details zu einem zugrunde liegenden, physischen Material einer Ressource. @de
definition: يربط بين مصدر وتفاصيل عن مادة ملموسة أساسية لمصدر. @ar
definition: 将一种资源与一种资源的下层物理材料的细节关联起来。 @zh-hans

has details of bibliographic format
lexical alias: detailsOfBibliographicFormat.en
status: Published
type: Property
label: aineiston bibliografisen koon tarkemmat tiedot @fi
label: bibliográfiai formátum részletei a következők: @hu
label: bibliyografik formatın ayrıntıları ile ilişkilidir @tr
label: har detaljer om bogformat @da
label: hat Details zum bibliografischen Format @de
label: heeft details van boekformaat @nl
label: له تفاصيل عن شكل ببليوجرافي @ar
label: 有书目格式细节 @zh-hans
definition: Bir kaynağı, basılı veya el yazması bir kaynaktaki bütün bir sayfa ile o sayfanın dolu bırakılması, kesilmesi veya katlanması durumunda ortaya çıkan yapraklar arasındaki orantılı bir bağlantının ayrıntılarıyla ilişkilendirir. @tr
definition: Hozzákapcsol egy forrást egy aránybeli viszonyhoz, amely egy nyomtatott vagy kézírásos forrás teljes lapja és az egyes lapok között van, amelyek akkkor keletkeznek, ha a lapot hagyják megtelni, elvágják vagy összehajtják. @hu
definition: Liittää aineiston tarkempiin tietoihin aineiston tai käsikirjoitusaineiston kokonaisen arkin ja erillisten lehtien välisestä kokosuhteesta, joka riippuu siitä, onko arkki kokonainen, leikattu tai taitettu. @fi
definition: Relaterer en ressource til detaljer om resultatet af at folde et trykt ark, så der dannes en samling af blade. @da
definition: Relates a resource to details of the proportional relationship between a whole sheet in a printed or manuscript resource, and the individual leaves that result if that sheet is left full, cut, or folded.
definition: Setzt eine Ressource in Beziehung zu Details zu dem proportionalen Verhältnis zwischen einem ganzen Bogen in einer gedruckten oder handschriftlichen Ressource und den einzelnen Blättern, die resultieren, wenn der Bogen im Ganzen gelassen, geschnitten oder gefaltet wird. @de
definition: يربط بين مصدر وتفاصيل عن علاقة نسبية بين ورقة كاملة في مصدر مطبوع أو مخطوط، والأوراق الفردية التي تنتج إذا تركت الورقة كاملة، مقطوعة، أو مطوية. @ar
definition: 将一种资源与导致在一种印刷或手稿资源中是否完整、裁切或折叠的一个整张和单独页之间的比例关系的细节关联起来。 @zh-hans

has details of broadcast standard
lexical alias: detailsOfBroadcastStandard.en
status: Published
type: Property
label: aineiston lähetysstandardin tarkemmat tiedot @fi
label: har detaljer om transmissionsstandard @da
label: hat Details zum Sendestandard @de
label: heeft details van uitzendstandaard @nl
label: műsorszórási szabvány részletei a következők: @hu
label: yayın standardının ayrıntıları ile ilişkilidir @tr
label: له تفاصيل عن معيار بث @ar
label: 有广播标准细节 @zh-hans
sub property of: has details of video characteristic
definition: Bir kaynağı, televizyon yayını için bir video kaynağı biçimi için kullanılan bir sistemin ayrıntılarıyla ilişkilendirir. @tr
definition: Hozzákapcsol egy forrást egy videóforrás-formátum televíziós műsorszórásához használt rendszer részleteihez. @hu
definition: Liittää aineiston tarkempiin tietoihin järjestelmästä, jonka mukaisesti videoaineisto muunnetaan televisiolähetystä varten. @fi
definition: Relaterer en ressource til detaljer om system, der anvendes til at formatere en videoressource til tv-transmission @da
definition: Relates a resource to details of a system used to format a video resource for television broadcast.
definition: Setzt eine Ressource in Beziehung zu Details zu einem System, das zur Formatierung einer Videoressource für eine Fernsehsendung verwendet wird. @de
definition: يربط بين مصدر وتفاصيل عن نظام مستخدم لتهيئة مصدر فيديو للبث التلفزيوني. @ar
definition: 将一种资源与用于电视广播的视频格式的一个体系的细节关联起来。 @zh-hans

has details of configuration of playback channels
lexical alias: detailsOfConfigurationOfPlaybackChannels.en
status: Published
type: Property
label: har detaljer om konfiguration af afspilningskanaler @da
label: hat Details zur Konfiguration von Wiedergabekanälen @de
label: heeft details van afspeelkanalenconfiguratie @nl
label: oynatma kanalları düzeninin ayrıntıları ile ilişkilidir @tr
label: toistokanavien määrän tarkemmat tiedot aineistolle @fi
label: visszajátszási csatornák konfigurációjának részletei a következők: @hu
label: له تفاصيل عن إعدادات قنوات التشغيل @ar
label: 有回放声道的配置的细节 @zh-hans
sub property of: has details of sound characteristic
definition: Bir kaynağı, bir kaydı yapmak için kullanılan ses kanallarının sayısının ayrıntılarıyla ilişkilendirir. @tr
definition: Hozzákapcsol egy forrást lemezfelvétel készítésére használt hangcsatornák egy számának részleteihez. @hu
definition: Liittää aineiston tarkempiin tietoihin äänitteen tekoon käytettyjen äänikanavien määrästä. @fi
definition: Relaterer en ressource til detaljer om et antal af lydkanaler, der blev anvendt til en indspilning @da
definition: Relates a resource to details of a number of sound channels used to make a recording.
definition: Setzt eine Ressource in Beziehung zu Details zur Anzahl von Tonkanälen, die für die Wiedergabe einer Aufnahme verwendet werden. @de
definition: يربط بين مصدر وتفاصيل عن رقم قنوات الصوت المستخدمة في تسجيل. @ar
definition: 将一种资源与用于制作一个录音制品的声道数的细节关联起来。 @zh-hans

has details of digital file characteristic
has subproperty: has details of digital representation of cartographic content
has subproperty: has details of encoding format
has subproperty: has details of file type
has subproperty: has details of regional encoding
lexical alias: detailsOfDigitalFileCharacteristic.en
status: Published
type: Property
label: aineiston digitaalisen tiedoston ominaisuuksien tarkemmat tiedot @fi
label: digitális fájljellemzők részletei a következők: @hu
label: dijital dosya özelliklerinin ayrıntıları ile ilişkilidir @tr
label: har detaljer om digitale filkarakteristika @da
label: hat Details zur Eigenschaft einer digitalen Datei @de
label: heeft details van kenmerken digitaal bestand @nl
label: له تفاصيل عن خاصية ملف رقمي @ar
label: 有数字文件特征的细节 @zh-hans
definition: Bir kaynağı, bir kaynaktaki metin, görüntü, ses, video ve diğer veri türlerinin dijital olarak kodlanmasıyla ilgili teknik özelliğin ayrıntılarıyla ilişkilendirir. @tr
definition: Hozzákapcsol egy forrást egy forrás szöveg, kép, hang, videó és más adattípusainak digitális kódolásához kapcsolódó műszaki specifikáció részleteihez. @hu
definition: Liittää aineiston tarkempiin tietoihin aineiston sisältämän tekstin, kuvan, äänen, videon tai muun datan digitaalisen koodauksen teknisestä määrityksestä. @fi
definition: Relaterer en ressource til detaljer om teknisk specifikation relateret til den digitale kodning af tekst, billede, audio-, video- og andre datatyper i en ressource. @da
definition: Relates a resource to details of a technical specification relating to a digital encoding of text, image, audio, video, and other types of data in a resource.
definition: Setzt eine Ressource in Beziehung zu Details zu einer technischen Spezifikation, die sich auf die digitale Kodierung von Text, Bild, Audio, Video und anderen Datentypen in einer Ressource bezieht. @de
definition: يربط بين مصدر وتفاصيل عن مواصفات فنية متعلقة بتشفير رقمي لنص، صورة، صوت، فيديو، وأي نوع بيانات آخر في مصدر. @ar
definition: 将一种资源与和一种资源中的文本、图像、音频、视频或其他类型数据的数字编码有关的一个技术规格的细节关联起来。 @zh-hans

has details of digital representation of cartographic content
lexical alias: detailsOfDigitalRepresentationOfCartographicContent.en
status: Published
type: Property
label: aineiston kartografisen sisällön digitaalisen esitysmuodon tarkemmat tiedot @fi
label: har detaljer om digital repræsentation af kartografisk indhold @da
label: hat Details zur digitalen Darstellung von kartografischem Inhalt @de
label: heeft details van digitale representatie van cartografische content @nl
label: kartografik içeriğin dijital temsilinin ayrıntıları ile ilişkilidir @tr
label: kartográfiai tartalom digitális ábrázolásának részletei a következők: @hu
label: له تفاصيل عن تمثيل رقمي للمحتوى الجغرافي @ar
label: 地图内容的数字表现的细节 @zh-hans
sub property of: has details of digital file characteristic
definition: Bir kaynağı, bir haritacılık kaynağı içindeki jeo-uzamsal bilginin kodlanmasının ayrıntılarıyla ilişkilendirir. @tr
definition: Hozzákapcsol egy forrást a földtérbeli információk kódolásának részleteihez egy kartográfiai forrásban. @hu
definition: Liittää aineiston tarkempiin tietoihin aineiston maantieteellisen paikkatiedon koodaamisesta. @fi
definition: Relaterer en ressource til detaljer om kodning af geospatiale oplysningerer i en kartografisk ressource. @da
definition: Relates a resource to details of an encoding of geospatial information in a cartographic resource.
definition: Setzt eine Ressource in Beziehung zu Details zur Kodierung von Geoinformationen in einer kartografischen Ressource. @de
definition: يربط بين مصدر وتفاصيل عن معلومات الترميز الجغرافي في مصدر خرائطي. @ar
definition: 将一种资源与资源中地理空间信息的编码细节关联起来。 @zh-hans

has details of emulsion on microfilm and microfiche
lexical alias: detailsOfEmulsionOnMicrofilmAndMicrofiche.en
status: Published
type: Property
label: har detaljer om emulsion på mikrofilm og mikrofiche @da
label: hat Details zur Emulsionsschicht auf Mikrofilm und Mikrofiche @de
label: heeft details van de emulsie op microfilm en microfiche @nl
label: mikrofilm ve mikrofiş üzerindeki emülsiyonun ayrıntıları ile ilişkilidir @tr
label: mikrofilmen és microfiche-en levő emulzió részletei a következők: @hu
label: mikrokortin ja mikrofilmin emulsion tarkemmat tiedot aineistolle @fi
label: له تفاصيل عن الطبقة الحساسة على ميكروفيلم وميكروفيش @ar
label: 有缩微胶卷和缩微平片上的乳剂的细节 @zh-hans
sub property of: has details of applied material
definition: .Bir kaynağı, bir mikrofilm veya mikrofiş üzerinde kaplama olarak kullanılan ışığa duyarlı kimyasalların süspansiyonunun ayrıntılarıyla ilişkilendirir. @tr
definition: Hozzákapcsol egy forrást mikrofilmen vagy mikrofiche-lemezen bevonatként használt fényérzékeny vegyszerek szuszpenziójának részleteihez. @hu
definition: Liittää aineiston tarkempiin tietoihin mikrofilmin tai mikrokortin valoherkkiä kemikaaleja sisältävästä pinnoitteesta. @fi
definition: Relaterer en ressource til detaljer om opslæmmede lysfølsomme kemikalier, der er anvendt som belægning på en mikrofilm eller mikrofiche @da
definition: Relates a resource to details of a suspension of light-sensitive chemicals used as a coating on a microfilm or microfiche.
definition: Setzt eine Ressource in Beziehung zu Details zu einer Suspension aus lichtempfindlichen Chemikalien, die als Beschichtung eines Mikrofilms oder eines Mikrofiches verwendet wird. @de
definition: يربط بين مصدر وتفاصيل عن نظام تسجيل خاص بالمواد الكيميائية المستخدمة كغطاء على ميكروفيلم أو ميكروفيش. @ar
definition: 将一种资源与缩微胶卷或缩微平片表面感光化合物的悬浮涂层的细节关联起来。 @zh-hans

has details of encoding format
lexical alias: detailsOfEncodingFormat.en
status: Published
type: Property
label: aineiston koodausmuodon tarkemmat tiedot @fi
label: har detaljer om kodningsformat @da
label: hat Details zum Kodierungsformat @de
label: heeft details van coderingsformaat @nl
label: kodlama formatının ayrıntıları ile ilişkilidir @tr
label: kódolási formátum részletei a következők: @hu
label: له تفاصيل عن نظام ترميز @ar
label: 有编码格式的细节 @zh-hans
sub property of: has details of digital file characteristic
definition: Bir kaynağı, bir kaynağın dijital içeriğini kodlamak için kullanılan bir şema veya standardın ayrıntılarıyla ilişkilendirir. @tr
definition: Hozzákapcsol egy forrást egy séma, szabvány stb. részleteihez, amelyet egy megjelenési forma digitális tartalmának kódolására használnak. @hu
definition: Liittää aineiston tarkempiin tietoihin aineiston digitaalisen sisällön koodaamiseen käytetystä skeemasta tai standardista. @fi
definition: Relaterer en ressource til detaljer om skema, standard etc., der anvendes til kodning af en ressources digitale indhold. @da
definition: Relates a resource to details of a schema or standard used to encode the digital content of a resource.
definition: Setzt eine Ressource in Beziehung zu Details zu dem Schema, Standard und so weiter, das/der zum Kodieren des digitalen Inhalts einer Ressource verwendet wird. @de
definition: يربط بين مصدر وتفاصيل عن خطة أو معيار مستخدم في تشفير المحتوى الرقمي لمصدر. @ar
definition: 将一种资源与用于对一种资源的数字内容进行编码的一种方案或标准的细节关联起来。 @zh-hans

has details of file type
lexical alias: detailsOfFileType.en
status: Published
type: Property
label: aineiston tiedostotyypin tarkemmat tiedot @fi
label: dosya türünün ayrıntıları ile ilişkilidir @tr
label: fájltípus részletei a következők: @hu
label: har detaljer om filtype @da
label: hat Details zum Dateityp @de
label: heeft details van bestandstype @nl
label: له تفاصيل عن نوع الملف @ar
label: 有文件类型细节 @zh-hans
sub property of: has details of digital file characteristic
definition: Bir kaynağı, bir bilgisayar dosyasında kodlanmış genel bir veri türünün içeriğinin ayrıntılarıyla ilişkilendirir. @tr
definition: Hozzákapcsol egy forrást egy számítógépes fájlban kódolt adattartalom általános típusának részleteihez. @hu
definition: Liittää aineiston tarkempiin tietoihin tiedostoon koodatun datasisällön yleisestä tyypistä. @fi
definition: Relaterer en ressource til detaljer om typen af dataindhold kodet i en computerfil. @da
definition: Relates a resource to details of a general type of data content encoded in a computer file.
definition: Setzt eine Ressource in Beziehung zu Details zu einer allgemeinen Art von Dateninhalt, der in einer Datei kodiert ist. @de
definition: يربط بين مصدر وتفاصيل عن نوع عام لمحتوى بيانات تم تشفيرها في ملف كمبيوتر. @ar
definition: 将一种资源与计算机文件中编码的数据内容的一般类型的细节关联起来。 @zh-hans

has details of font size
lexical alias: detailsOfFontSize.en
status: Published
type: Property
label: aineiston kirjasinkoon tarkemmat tiedot @fi
label: betűméret részletei a következők: @hu
label: har detaljer om skriftstørrelse @da
label: hat Details zur Schriftgröße @de
label: heeft details van lettergrootte @nl
label: yazı tipi boyutunun ayrıntıları ile ilişkilidir @tr
label: له تفاصيل عن حجم خط @ar
label: 有字体大小细节 @zh-hans
definition: Bir kaynağı, bir kaynaktaki karakterleri ve sembolleri temsil etmek için kullanılan harfin boyutunun ayrıntılarıyla ilişkilendirir. @tr
definition: Hozzákapcsol egy forrást a típusméret részleteihez, amelyet karakterek és jelek ábrázolására használnak egy forrásban. @hu
definition: Liittää aineiston tarkempiin tietoihin aineistossa esiintyvien merkkien ja symbolien koosta. @fi
definition: Relaterer en ressource til detaljer om størrelsen på den skrifttype, der er anvendt til at repræsentere tegn og symboler i en ressource. @da
definition: Relates a resource to details of a size of the type used to represent characters and symbols in a resource.
definition: Setzt eine Ressource in Beziehung zu Details zur Größe der Schrift, die zur Repräsentation von Zeichen und Symbole in einer Ressource verwendet wird. @de
definition: يربط بين مصدر وتفاصيل عن حجم الخط المستخدم في تمثيل التمثيلات والرموز في مصدر. @ar
definition: 将一种资源与在一种资源中用于表示字符和符号的字型的大小的细节关联起来。 @zh-hans

has details of generation of audio recording (Deprecated)
lexical alias: detailsOfGenerationOfAudioRecording.en
status: Deprecated
type: Property
sub property of: has details of generation
definition: Relates a resource to details of the relationship between an original audio carrier and the carrier of a reproduction made from the original (e.g., a tape duplication master, a test pressing). (Deprecated)

has details of generation of digital resource (Deprecated)
lexical alias: detailsOfGenerationOfDigitalResource.en
status: Deprecated
type: Property
sub property of: has details of generation
definition: Relates a resource to details of the relationship between an original carrier of a digital resource and the carrier of a reproduction made from the original (e.g., a derivative master).. (Deprecated)

has details of generation of microform (Deprecated)
lexical alias: detailsOfGenerationOfMicroform.en
status: Deprecated
type: Property
sub property of: has details of generation
definition: Relates a resource to details of the relationship between an original microform carrier and the carrier of a reproduction made from the original (e.g., a printing master).. (Deprecated)

has details of generation of motion picture film (Deprecated)
lexical alias: detailsOfGenerationOfMotionPictureFilm.en
status: Deprecated
type: Property
sub property of: has details of generation
definition: Relates a resource to details of the relationship between an original carrier of a motion picture film resource and the carrier of a reproduction made from the original (e.g., a reference print).. (Deprecated)

has details of generation of videotape (Deprecated)
lexical alias: detailsOfGenerationOfVideotape.en
status: Deprecated
type: Property
sub property of: has details of generation
definition: Relates a resource to details of the relationship between an original carrier of a videotape resource and the carrier of a reproduction made from the original (e.g., a show copy).. (Deprecated)

has details of groove characteristic
lexical alias: detailsOfGrooveCharacteristic.en
status: Published
type: Property
label: barázdajellemzők részletei a következők: @hu
label: har detaljer om rillekarakteristika @da
label: hat Details zur Rilleneigenschaft @de
label: heeft details van groefkenmerken @nl
label: oluk özelliğinin ayrıntıları ile ilişkilidir @tr
label: uran ominaisuuksien tarkemmat tiedot aineistolle @fi
label: له تفاصيل عن خاصية مسار @ar
label: 有纹槽特征的细节 @zh-hans
sub property of: has details of sound characteristic
definition: Bir kaynağı, bir analog silindirin oluk aralığı veya bir analog diskin oluk genişliğinin ayrıntılarıyla ilişkilendirir. @tr
definition: Hozzákapcsol egy forrást egy analóg lemez barázdaszélességének vagy egy analóg henger barázdamélységének részleteihez. @hu
definition: Liittää aineiston tarkempiin tietoihin analogisen levyn uran leveydestä tai äänilieriön urajaosta. @fi
definition: Relaterer en ressource til detaljer om rillebredden på en analog disk eller rilledybden på en analog cylinder. @da
definition: Relates a resource to details of a groove width of an analog disc or a groove pitch of an analog cylinder.
definition: Setzt eine Ressource in Beziehung zu Details zur Rillenbreite einer Schallplatte oder zum Rillenabstand eines Phonographenzylinders. @de
definition: يربط بين مصدر وتفاصيل عن عرض مسار لقرص تناظري أو مسار لاسطوانة تناظرية. @ar
definition: 将一种资源与模拟盘的纹槽宽度或模拟筒的纹槽间距的细节关联起来。 @zh-hans

has details of layout
lexical alias: detailsOfLayout.en
status: Published
type: Property
label: aineiston layoutin tarkemmat tiedot @fi
label: düzen ayrıntıları ile ilişkilidir @tr
label: har detaljer om layout @da
label: hat Details zum Layout @de
label: heeft details van lay-out @nl
label: tördelés részletei a következők: @hu
label: له تفاصيل عن تصميم طباعي @ar
label: 有版式细节 @zh-hans
definition: Bir kaynağı, bir kaynaktaki metin, görüntü, dokunsal notayon veya diğer içeriğin düzenlenmesinin ayrıntılarıyla ilişkilendirir. @tr
definition: Hozzákapcsol egy forrást szöveg, képek, tapintható lejegyzés vagy egyéb tartalom elrendezésének részleteihez egy forrásban. @hu
definition: Liittää aineiston tarkempiin tietoihin aineistoon sisältyvän tekstin, kuvien, taktiilin nuottikirjoituksen tai muun sisällön sommittelusta. @fi
definition: Relaterer en ressource til detaljer om opstilling af tekst, billeder, taktil notation etc. i en ressource. @da
definition: Relates a resource to details of an arrangement of text, images, tactile notation, or other content in a resource.
definition: Setzt eine Ressource in Beziehung zu Details zur Anordnung von Text, Bildern, taktiler Notation und so weiter in einer Ressource. @de
definition: يربط بين مصدر وتفاصيل عن ترتيب نص، صور، كتابة بارزة، أو أي محتوى آخر في مصدر ما. @ar
definition: 将一种资源与资源中对文本、图像、触摸标记或其他内容的安排的细节关联起来。 @zh-hans

has details of mount
lexical alias: detailsOfMount.en
status: Published
type: Property
label: aineiston tukimateriaalin tarkemmat tiedot @fi
label: foglalat részletei a következők: @hu
label: har detaljer om montage @da
label: hat Details zur Halterung @de
label: heeft details van ondersteuning @nl
label: montaj ayrıntıları ile ilişkilidir @tr
label: له تفاصيل عن حامل @ar
label: 有衬底/底座细节 @zh-hans
definition: Bir kaynağı, bir kaynağın temel malzemesinin bağlı olduğu destek veya taşımak için kullanılan fiziksel bir malzemenin ayrıntılarıyla ilişkilendirir. @tr
definition: Hozzákapcsol egy forrást egy forrás alapanyagához csatolt tartóként vagy támaszként használt fizikai anyag részleteihez. @hu
definition: Liittää aineiston tarkempiin tietoihin materiaalista, johon aineiston pohjamateriaali kiinnitetään aineiston tukemiseksi tai kannattamiseksi. @fi
definition: Relaterer en ressource til detaljer om det fysiske materiale, der udgør den støtte eller bagbeklædning, som en ressources basismateriale er fastgjort på. @da
definition: Relates a resource to details of a physical material used for the support or backing to which the base material of a resource is attached.
definition: Setzt eine Ressource in Beziehung zu Details zu einem physischen Material, das für die Halterung oder die Stütze verwendet wird, an dem das Trägermaterial einer Ressource angebracht ist. @de
definition: يربط بين مصدر وتفاصيل عن مادة مادية تُستخدم في تدعيم أو سند مادة القاعدة التي يكون المصدر ملصق بها. @ar
definition: 将一种资源与用于支撑或背衬的资源的基底材料所附着的物理材料的细节关联起来。 @zh-hans

has details of playing speed
lexical alias: detailsOfPlayingSpeed.en
status: Published
type: Property
label: har detaljer om omdrejningshastighed @da
label: hat Details zur Abspielgeschwindigkeit @de
label: heeft details van afspeelsnelheid @nl
label: lejátszási sebesség részletei a következők: @hu
label: oynatma hızı ayrıntıları ile ilişkilidir @tr
label: toistonopeuden tarkemmat tiedot aineistolle @fi
label: له تفاصيل عن سرعة تشغيل @ar
label: 有播放速度细节 @zh-hans
definition: Bir kaynağı, amaçlanan sesi üretmek için bir ses taşıyıcısının çalıştırılması gereken bir hızın ayrıntılarıyla ilişkilendirir. @tr
definition: Hozzákapcsol egy forrást egy sebesség részleteihez, amelyen a hanghordozónak működnie kell, hogy a kívánt hangot elő tudják állítani. @hu
definition: Liittää aineiston tarkempiin tietoihin nopeudesta, jolla äänitallenne on toistettava äänen tuottamiseksi tarkoitetulla tavalla. @fi
definition: Relaterer en ressource til detaljer om den hastighed, som en lydbærer skal betjenes ved for at producere den ønskede lyd. @da
definition: Relates a resource to details of a speed at which an audio carrier must be operated to produce the sound intended.
definition: Setzt eine Ressource in Beziehung zu Details zur Geschwindigkeit, mit der ein Tonträger für die korrekte Wiedergabe abgespielt werden muss. @de
definition: يربط بين مصدر وتفاصيل عن سرعة يجب أن يُشغل بها حامل صوت لكي ينتج الصوت المطلوب. @ar
definition: 将一种资源与一种音频载体要产生所期望的声音必须操作的速度的细节关联起来。 @zh-hans

has details of polarity
lexical alias: detailsOfPolarity.en
status: Published
type: Property
label: har detaljer om polaritet @da
label: hat Details zur Polarität @de
label: heeft details van polariteit @nl
label: polarite ayrıntıları ile ilişkilidir @tr
label: polariteetin tarkemmat tiedot aineistolle @fi
label: polaritás részletei a következők: @hu
label: له تفاصيل عن استقطاب ألوان @ar
label: 有极性细节 @zh-hans
definition: Bir kaynağı, bir görüntüdeki renklerin ve tonların, yeniden üretilen nesnenin renkleri ve tonlarıyla olan bağlantısının ayrıntılarıyla ilişkilendirir. @tr
definition: Hozzákapcsol egy forrást egy kép színei és tónusai, valamint a reprodukált tárgy színei és tónusai között fennálló viszony részleteihez. @hu
definition: Liittää aineiston tarkempiin tietoihin suhteesta, joka kuvan väreillä ja valoisuudella on kuvan kohteen väreihin ja valoisuuteen. @fi
definition: Relaterer en ressource til detaljer om forholdet mellem farver og nuancer i et billede samt farver og nuancer i den reproducerede genstand. @da
definition: Relates a resource to details of a relationship of the colours and tones in an image to the colours and tones of the object reproduced.
definition: Setzt eine Ressource in Beziehung zu Details zu dem Verhältnis der Farben und Tönungen in einem Bild zu den Farben und Tönungen des reproduzierten Objekts. @de
definition: يربط بين مصدر وتفاصيل عن علاقة خاصة بالألوان ودرجات الألوان في صورة ما بألوان ودرجات شيئًا معاد إنتاجه. @ar
definition: 将一种资源与一个图像中色彩和色调与被复制对象的色彩和色调的关系的细节关联起来。 @zh-hans

has details of presentation format
lexical alias: detailsOfPresentationFormat.en
status: Published
type: Property
label: esitysformaatin tarkemmat tiedot aineistolle @fi
label: har detaljer om fremvisningsformat @da
label: hat Details zum Wiedergabeformat @de
label: heeft details van presentatieformaat @nl
label: prezentációs formátum részletei a következők: @hu
label: sunum formatının ayrıntıları ile ilişkilidir @tr
label: له تفاصيل عن صيغة عرض @ar
label: 有呈现格式细节 @zh-hans
definition: Bir kaynağın, yansıtılan bir görüntünün üretiminde kullanılan bir biçimin ayrıntılarıyla ilişkilendirir. @tr
definition: Hozzákapcsol egy forrást egy kivetített kép előállításánál használt formátum részleteihez. @hu
definition: Liittää aineiston tarkempiin tietoihin heijastettavan kuvan tuottamisessa käytettävästä formaatista. @fi
definition: Relaterer en ressource til detaljer om det format, der er anvendt ved fremstillingen af et projiceret billede. @da
definition: Relates a resource to details of a format used in the production of a projected image.
definition: Setzt eine Ressource in Beziehung zu Details zu dem Format, das bei der Entstehung eines projizierten Bilds verwendet wird. @de
definition: يربط بين مصدر وتفاصيل عن صيغة مُستخدمة في إنتاج صورة مرئية. @ar
definition: 将一种资源与用于一个投影图像制作的格式的细节关联起来。 @zh-hans

has details of production method
has subproperty: has details of production method for manuscript (Deprecated)
has subproperty: has details of production method for tactile resource (Deprecated)
lexical alias: detailsOfProductionMethod.en
status: Published
type: Property
label: előállítási módszer részletei a következők: @hu
label: har detaljer om produktionsmetode @da
label: hat Details zur Entstehungsmethode @de
label: heeft details van productiemethode @nl
label: valmistusmenetelmän tarkemmat tiedot aineistolle @fi
label: üretim yöntemi ayrıntıları ile ilişkilidir @tr
label: له تفاصيل عن طريقة إنتاج @ar
label: 有制作方法细节 @zh-hans
definition: Bir kaynağı, bir kaynağın yapımı için kullanılan bir sürecin ayrıntılarıyla ilişkilendirir. @tr
definition: Hozzákapcsol egy forrást egy forrás előállítására használt eljárás részleteihez. @hu
definition: Liittää aineiston tarkempiin tietoihin aineiston tuottamisessa käytettävästä menetelmästä. @fi
definition: Relaterer en ressource til detaljer om den proces, der er anvendt til at fremstille en ressource. @da
definition: Relates a resource to details of a process used to produce a resource.
definition: Setzt eine Ressource in Beziehung zu Details zu dem Verfahren, das angewendet wird, um eine Ressource zu erzeugen. @de
definition: يربط بين مصدر وتفاصيل عن عملية مستخدمة في إنتاج مصدر. @ar
definition: 将一种资源与用于制作一种资源的一个过程的细节关联起来。 @zh-hans

has details of production method for manuscript (Deprecated)
lexical alias: detailsOfProductionMethodForManuscript.en
status: Deprecated
type: Property
sub property of: has details of production method
definition: Relates a resource to details of a process used to produce an original manuscript or a copy. (Deprecated)

has details of production method for tactile resource (Deprecated)
lexical alias: detailsOfProductionMethodForTactileResource.en
status: Deprecated
type: Property
sub property of: has details of production method
definition: Relates a resource to details of a process used to produce a tactile resource. (Deprecated)

has details of projection characteristic of motion picture film
has subproperty: has details of projection speed
lexical alias: detailsOfProjectionCharacteristicOfMotionPictureFilm.en
status: Published
type: Property
label: elokuvafilmin projisointiominaisuuksien tarkemmat tiedot aineistolle @fi
label: filmvetítési jellemzők részletei a következők: @hu
label: har detaljer om projektionskarakteristika for film @da
label: hat Details zur Projektionseigenschaft eines Films @de
label: heeft details van projectiekenmerken van speelfilm @nl
label: sinema filminin projeksiyon özelliğinin ayrıntıları ile ilişkilidir @tr
label: له تفاصيل عن خاصية عرض لفيلم صور متحركة @ar
label: 有电影胶卷的投影特征的细节 @zh-hans
definition: Bir kaynağı, bir sinema filminin planlanması ile ilgili teknik bir özelliğin ayrıntılarıyla ilişkilendirir. @tr
definition: Hozzákapcsol egy forrást egy mozgófilmhez kapcsolódó műszaki előírás vagy specifikáció részleteihez. @hu
definition: Liittää aineiston tarkempiin tietoihin elokuvafilmin projisointia koskevasta teknisestä määrityksestä. @fi
definition: Relaterer en ressource til detaljer om teknisk specifikation relateret til projektion af en film. @da
definition: Relates a resource to details of a technical specification relating to the projection of a motion picture film.
definition: Setzt eine Ressource in Beziehung zu Details zu einer technischen Spezifikation, die sich auf die Projektion eines Films bezieht. @de
definition: يربط بين مصدر وتفاصيل عن مواصفات فنية متعلقة بعرض فيلم صور متحركة. @ar
definition: 将一种资源与和一种电影胶卷的投影有关的技术规格的细节关联起来。 @zh-hans

has details of projection speed
lexical alias: detailsOfProjectionSpeed.en
status: Published
type: Property
label: har detaljer om projektionshastighed @da
label: hat Details zur Projektionsgeschwindigkeit @de
label: heeft details van projectiesnelheid @nl
label: projeksiyon hızı ayrıntıları ile ilişkilidir @tr
label: projisointinopeuden tarkemmat tiedot aineistolle @fi
label: vetítési sebesség részletei a következők: @hu
label: له تفاصيل عن سرعة عرض @ar
label: 有投影速度细节 @zh-hans
sub property of: has details of projection characteristic of motion picture film
definition: Bir kaynağı, amaçlanan hareketli görüntüyü üretmek için planlanmış bir taşıyıcının çalıştırılması gereken bir hızın ayrıntılarıyla ilişkilendirir. @tr
definition: Hozzákapcsol egy forrást azon sebesség részleteihez, amelyen egy kivetített hordozónak működnie kell, hogy a kívánt mozgóképet elő tudják állítani. @hu
definition: Liittää aineiston tarkempiin tietoihin nopeudesta, jolla projisoitava tallenne tulee esittää liikkuvan kuvan näyttämiseksi tarkoitetulla tavalla. @fi
definition: Relaterer en ressource til detaljer om den hastighed, som en projiceret bærer skal betjenes ved for at producere det ønskede levende billede. @da
definition: Relates a resource to details of a speed at which a projected carrier must be operated to produce the moving image intended.
definition: Setzt eine Ressource in Beziehung zu Details zur Geschwindigkeit, mit der ein projizierbarer Datenträger betrieben werden muss, um das beabsichtigte Bewegtbild zu erzeugen. @de
definition: يربط بين مصدر وتفاصيل عن سرعة يجب أن يشغل بها حامل عرض لكي ينتج عنه الصور المتحركة المطلوبة. @ar
definition: 将一种资源与一种投影载体要产生所期望的动态图像必须操作的速度的细节关联起来。 @zh-hans

has details of recording medium
lexical alias: detailsOfRecordingMedium.en
status: Published
type: Property
label: har detaljer om optagemedie @da
label: hat Details zum Aufzeichnungsmedium @de
label: heeft details van opnamemedium @nl
label: kayıt ortamı ayrıntıları ile ilişkilidir @tr
label: rögzítőmédium részletei a következők: @hu
label: äänen tallennusmedian tyypin tarkemmat tiedot aineistolle @fi
label: له تفاصيل عن وسيط تسجيل @ar
label: 有录音媒介的细节 @zh-hans
sub property of: has details of sound characteristic
definition: Bir kaynağı, bir ses taşıyıcısına ses kaydetmek için kullanılan bir ortam türünün ayrıntılarıyla ilişkilendirir. @tr
definition: Hozzákapcsol egy forrást azon médiumtípus részleteihez, amelyet egy hanghordozóra történő hangrögzítésre használnak. @hu
definition: Liittää aineiston tarkempiin tietoihin tallennusmediasta, jolla ääni tallennetaan äänitallenteelle. @fi
definition: Relaterer en ressource til detaljer om det optagemedie, der er anvendt til at optage lyd på en lydbærer. @da
definition: Relates a resource to details of a type of medium used to record sound on an audio carrier.
definition: Setzt eine Ressource in Beziehung zu Details zu einer Art des Mediums, das verwendet wird, um Ton auf einem Tonträger festzuhalten. @de
definition: يربط بين مصدر وتفاصيل عن نوع وسيط مستخدم في تسجيل الصوت على حامل صوتي. @ar
definition: 将一种资源与用于在音频载体上记录声音的媒介类型的细节关联起来。 @zh-hans

has details of reduction ratio designation
lexical alias: detailsOfReductionRatioDesignation.en
status: Published
type: Property
label: csökkenési arányjelölés részletei a következők: @hu
label: har detaljer om reduktionsforholdsbetegnelse @da
label: hat Details zur Bezeichnung eines Verkleinerungsfaktors @de
label: heeft details van benaming verkleiningsfactor @nl
label: küçültme oranının ayrıntıları ile ilişkilidir @tr
label: pienennyssuhteen määritteen tarkemmat tiedot aineistolle @fi
label: له تفاصيل عن تسمية نسبة تصغير الصور @ar
label: 有缩率标识细节 @zh-hans
definition: Bir kaynağı, üretildiği orijinali ile ilişkili bir mikro-görüntünün boyutunun genel bir tanımının ayrıntılarıyla ilişkilendirir. @tr
definition: Hozzákapcsol egy forrást azon általános megjelölés részleteihez, amely egy mikrokép nagyságát jelzi az eredetihez viszonyítva, amelyből azt előállították. @hu
definition: Liittää aineiston tarkempiin tietoihin yleisestä määritteestä, joka ilmaisee mikrokokoiseksi pienennetyn kuvan suhteen alkuperäiseen kuvaan, josta pienennetty kuva on tuotettu. @fi
definition: Relaterer en ressource til detaljer om betegnelsen for størrelse på et mikrobillede i forhold til den original, som det er fremstillet ud fra. @da
definition: Relates a resource to details of a general designation of the size of a micro-image in relation to the original from which it was produced.
definition: Setzt eine Ressource in Beziehung zu Details zu einer allgemeinen Bezeichnung für die Größe eines Mikro-Bilds im Verhältnis zum Original, von dem es hergestellt wird. @de
definition: يربط بين مصدر وتفاصيل عن تسمية عامة لحجم الصورة المصغرة وعلاقتها بالأصل الذي تم إنتاجها منه. @ar
definition: 将一种资源与缩微图像尺寸和其所复制的原件之间一般关系的标识的细节关联起来。 @zh-hans

has details of sound characteristic
has subproperty: has details of configuration of playback channels
has subproperty: has details of groove characteristic
has subproperty: has details of recording medium
has subproperty: has details of special playback characteristic
has subproperty: has details of tape configuration
has subproperty: has details of track configuration
has subproperty: has details of type of recording
lexical alias: detailsOfSoundCharacteristic.en
status: Published
type: Property
label: hangjellemzők részletei a következők: @hu
label: har detaljer om lydkarakteristika @da
label: hat Details zur Toneigenschaft @de
label: heeft details van geluidskenmerken @nl
label: ses özelliğinin ayrıntıları ile ilişkilidir @tr
label: äänen ominaisuuksien tarkemmat tiedot aineistolle @fi
label: له تفاصيل عن خاصية الصوت @ar
label: 有声音特征的细节 @zh-hans
definition: Bir kaynağı, bir kaynaktaki sesin kodlanmasıyla ilgili teknik özelliğinin ayrıntılarıyla ilişkilendirir. @tr
definition: Hozzákapcsol egy forrást azon műszaki előírás vagy specifikáció részleteihez, amely egy forrásban a hang kódolásához kapcsolódik. @hu
definition: Liittää aineiston tarkempiin tietoihin aineiston sisältämän äänen koodaamisen teknisestä määrityksestä. @fi
definition: Relaterer en ressouce til detaljer om teknisk specifikation relateret til kodning af lyd i en ressource. @da
definition: Relates a resource to details of a technical specification relating to the encoding of sound in a resource.
definition: Setzt eine Ressource in Beziehung zu Details zu einer technischen Spezifikation, die sich auf die Kodierung des Tons in einer Ressource bezieht. @de
definition: يربط بين مصدر وتفاصيل عن خصائص فنية متعلقة بالترميز لصوت في مصدر. @ar
definition: 将一种资源与和一种资源中的声音的编码有关的一个技术规格的细节关联起来。 @zh-hans

has details of special playback characteristic
lexical alias: detailsOfSpecialPlaybackCharacteristic.en
status: Published
type: Property
label: aineiston äänentoiston erityisominaisuuksien tarkemmat tiedot @fi
label: har detaljer om særlige afspilningskarakteristika @da
label: hat Details zu einer besonderen Wiedergabeeigenschaft @de
label: heeft details van bijzondere afspeelkenmerken @nl
label: speciális visszajátszási jellemzők részletei a következők: @hu
label: özel oynatma özelliğinin ayrıntıları ile ilişkilidir @tr
label: له تفاصيل عن خاصية خاصة للتشغيل @ar
label: 有特别回放特征的细节 @zh-hans
sub property of: has details of sound characteristic
definition: Bir kaynağı, bir ekolayzer sistemi, gürültü azaltma sistemi veya bir ses kaydı yaparken kullanılan diğer işlemlerin ayrıntılarıyla ilişkilendirir. @tr
definition: Hozzákapcsol egy forrást azon kiegyenlítő rendszer, zajcsökkentő rendszer stb. részleteihez, amelyeket egy hangfelvétel készítésénél használnak. @hu
definition: Liittää aineiston tarkempiin tietoihin äänitteen äänityksessä käytetystä taajuuskorjausjärjestelmästä, kohinanvaimennusjärjestelmästä tai muusta prosessoinnista. @fi
definition: Relaterer en ressource til detaljer om et equalizersystem, støjdæmpningssystem etc., der er anvendt til at lave en lydoptagelse. @da
definition: Relates a resource to details of an equalization system, noise-reduction system, or other processing that is used in making an audio recording.
definition: Setzt eine Ressource in Beziehung zu Details zu einem Ausgleichssystem, einem Störgeräusch-Reduktionssystem und so weiter, das zur Erstellung von Audioaufnahmen verwendet wird. @de
definition: يربط بين مصدر وتفاصيل عن نظام موازن الترددات، نظام خفض ضوضاء، أو غيرها من النظم المُستخدمة في إعداد تسجيل صوتي. @ar
definition: 将一种资源与在一种录音制作中所使用的平衡系统、降噪系统或其他处理的细节关联起来。 @zh-hans

has details of tape configuration
lexical alias: detailsOfTapeConfiguration.en
status: Published
type: Property
label: bant yapılandırmasının ayrıntıları ile ilişkilidir @tr
label: hangszalagkonfiguráció részletei a következők: @hu
label: har detaljer om båndkonfiguration @da
label: hat Details zur Bandkonfiguration @de
label: heeft details van configuratie geluidsband @nl
label: ääninauhan raitojen määrän tarkemmat tiedot aineistolle @fi
label: له تفاصيل عن بنية شريط @ar
label: 有磁带配置的细节 @zh-hans
sub property of: has details of sound characteristic
definition: Bir kaynağı, bir ses bandındaki parçaların sayısının ayrıntılarıyla ilişkilendirir. @tr
definition: Hozzákapcsol egy forrást egy hangszalagon lévő sávok számának részleteihez. @hu
definition: Liittää aineiston tarkempiin tietoihin ääninauhalla olevien ääniraitojen lukumäärästä. @fi
definition: Relaterer en ressource til detaljer om antal spor på et lydbånd. @da
definition: Relates a resource to details of a number of tracks on an audiotape.
definition: Setzt eine Ressource in Beziehung zu Details zur Anzahl der Spuren auf einem Tonband. @de
definition: يربط بين مصدر وتفاصيل عن عدد المسارات على شريط صوت. @ar
definition: 将一种资源与录音磁带上的音轨数的细节关联起来。 @zh-hans

has details of track configuration
lexical alias: detailsOfTrackConfiguration.en
status: Published
type: Property
label: har detaljer om lydsporskonfiguration @da
label: hat Details zur Tonspurlage @de
label: heeft details van nummerconfiguratie @nl
label: parça yapılandırmasının ayrıntıları ile ilişkilidir @tr
label: sávkonfiguráció részletei a következők: @hu
label: ääniraidan sijainnin tarkemmat tiedot aineistolle @fi
label: له تفاصيل عن بنية مسار @ar
label: 有音轨配置的细节 @zh-hans
sub property of: has details of sound characteristic
definition: Bir kaynağı, bir ses parçası filmi üzerindeki ses parçasının yapılandırmasının ayrıntılarıyla ilişkilendirir. @tr
definition: Hozzákapcsol egy forrást a hangsáv konfigurációjának részleteihez egy hangsávos filmen. @hu
definition: Liittää aineiston tarkempiin tietoihin ääniraidan sijainnista äänifilmissä. @fi
definition: Relaterer en ressource til detaljer om konfiguration af lydsporet til en film med soundtrack. @da
definition: Relates a resource to details of a configuration of the audio track on a sound-track film.
definition: Setzt eine Ressource in Beziehung zu Details zur Positionierung der Tonspur auf einem Film mit Tonspur. @de
definition: يربط بين مصدر وتفاصيل عن ضبط مسار صوتي على مسار صوت فيلم. @ar
definition: 将一种资源与原声电影片上的音轨配置的细节关联起来。 @zh-hans

has details of type of recording
lexical alias: detailsOfTypeOfRecording.en
status: Published
type: Property
label: har detaljer om indspilningskarakteristika @da
label: hat Details zur Art einer Aufnahme @de
label: heeft details van opnamesoort @nl
label: kayıt türü ayrıntıları ile ilişkilidir @tr
label: rögzítéstípus részletei a következők: @hu
label: äänen tallentamisen tavan tarkemmat tiedot aineistolle @fi
label: له تفاصيل عن نوع التسجيل @ar
label: 有录音的类型的细节 @zh-hans
sub property of: has details of sound characteristic
definition: Bir kaynağı, ses içeriğini oynatmak üzere kodlamak için kullanılan bir yöntemin ayrıntılarıyla ilişkilendirir. @tr
definition: Hozzákapcsol egy forrást azon módszer részleteihez, amelyet audiótartalom kódolásához használnak visszajátszás céljára. @hu
definition: Liittää aineiston tarkempiin tietoihin menetelmästä, jota on käytetty äänen tallentamiseksi äänentoistoa varten. @fi
definition: Relaterer en ressource til detaljer om den metode, der er anvendt til at kode lydindhold til afspilning. @da
definition: Relates a resource to details of a method used to encode audio content for playback.
definition: Setzt eine Ressource in Beziehung zu Details zu einem Verfahren, das zur Kodierung von Audio-Inhalt für die Wiedergabe verwendet wird. @de
definition: يربط بين مصدر وتفاصيل عن طريقة مستخدمة في تشفير محتوى صوتي مطلوب للتشغيل. @ar
definition: 将一种资源与用于编码音频内容供回放的方法的细节关联起来。 @zh-hans

has details of video characteristic
has subproperty: has details of broadcast standard
has subproperty: has details of video format
lexical alias: detailsOfVideoCharacteristic.en
status: Published
type: Property
label: har detaljer om videokarakteristika @da
label: hat Details zur Video-Eigenschaft @de
label: heeft details van videokenmerken @nl
label: video özelliğinin ayrıntıları ile ilişkilidir @tr
label: videon ominaisuuksien tarkemmat tiedot aineistolle @fi
label: videójellemző részletei a következők: @hu
label: له تفاصيل خاصية فيديو @ar
label: 有视频特征的细节 @zh-hans
definition: Bir kaynağı, bir kaynaktaki video görüntülerinin kodlanmasıyla ilgili teknik özelliğin ayrıntılarıyla ilişkilendirir. @tr
definition: Hozzákapcsol egy forrást azon műszaki specifikáció részleteihez, amely egy forrásban videóképek kódolásához kapcsolódik. @hu
definition: Liittää aineiston tarkempiin tietoihin aineiston sisältämän videon koodauksen teknisestä määrityksestä. @fi
definition: Relaterer en ressource til detaljer om teknisk specifikation relateret til kodning af videobilleder i en ressource. @da
definition: Relates a resource to details of a technical specification relating to an encoding of video images in a resource.
definition: Setzt eine Ressource in Beziehung zu Details zu einer technischen Spezifikation, die sich auf die Kodierung der Videobilder in einer Ressource bezieht. @de
definition: يربط بين مصدر وتفاصيل عن مواصفات فنية متعلقة بتكويد صور فيديو في مصدر. @ar
definition: 将一种资源与和一种资源中的视频图像的编码有关的一个技术规格的细节关联起来。 @zh-hans

has details of video format
lexical alias: detailsOfVideoFormat.en
status: Published
type: Property
label: aineiston videoformaatin tarkemmat tiedot @fi
label: har detaljer om videoformat @da
label: hat Details zum Videoformat @de
label: heeft details van videoformaat @nl
label: video formatı ayrıntıları ile ilişkilidir @tr
label: videóformátum részletei a következők: @hu
label: له تفاصيل عن خاصية فيديو @ar
label: 有视频格式的细节 @zh-hans
sub property of: has details of video characteristic
definition: Bir kaynağı, bir kaynağın analog video içeriğini kodlamak için kullanılan bir şema veya standardın ayrıntılarıyla ilişkilendirir. @tr
definition: Hozzákapcsol egy forrást azon séma vagy szabvány részleteihez, amelyet egy forrás analóg tartalmának kódolására használnak. @hu
definition: Relaterer en ressource til detaljer om standard etc., der anvendes til kodning af en ressources analoge videoindhold. @da
definition: Relates a resource to details of a schema or standard used to encode the analog video content of a resource.
definition: Setzt eine Ressource in Beziehung zu Details zu dem Schema, Standard und so weiter, das/der zur Kodierung des analogen Videoinhalts einer Ressource verwendet wird. @de
definition: Tarkemmat tiedot analogisen videon koodaukseen käytetystä skeemasta tai standardista. @fi
definition: يربط بين مصدر وتفاصيل عن خطة أو معيار مستخدم في تشفير محتوى الفيديو التناظري لمصدر. @ar
definition: 将一种资源与用于对一种资源的模拟视频内容进行编码的一个方案或标准的细节关联起来。 @zh-hans

has details of generation
has subproperty: has details of generation of audio recording (Deprecated)
has subproperty: has details of generation of digital resource (Deprecated)
has subproperty: has details of generation of microform (Deprecated)
has subproperty: has details of generation of motion picture film (Deprecated)
has subproperty: has details of generation of videotape (Deprecated)
lexical alias: detailsOfGeneration.en
status: Published
type: Property
label: aineiston sukupolven tarkemmat tiedot @fi
label: generáció részletei a következők: @hu
label: har detaljer om generation @da
label: hat Details zur Kopiengeneration @de
label: heeft details van generatie @nl
label: üretim ayrıntıları ile ilişkilidir @tr
label: له تفاصيل عن توليد @ar
label: 有代的细节 @zh-hans
definition: Bir kaynağı, orijinal bir taşıyıcı ile orijinalden yapılan bir çoğaltmanın taşıyıcısı arasındaki bağlantının ayrıntılarıyla ilişkilendirir. @tr
definition: Hozzákapcsol egy forrást egy eredeti hordozó és az eredetiből készült másolat hordozója közötti viszony részleteihez. @hu
definition: Liittää aineiston tarkempiin tietoihin alkuperäisen tallenteen ja siitä tuotetun jäljenteen tallenteen välisestä suhteesta. @fi
definition: Relaterer en ressource til detaljer om forholdet mellem en oprindelig bærer og bæreren af en reproduktion baseret på originalen. @da
definition: Relates a resource to details of a relationship between an original carrier and a carrier of a reproduction made from an original.
definition: Setzt eine Ressource in Beziehung zu Details zu einer Beziehung zwischen einem Originaldatenträger und einem Datenträger einer Reproduktion, die vom Original erstellt wird. @de
definition: يربط بين مصدر وتفاصيل عن علاقة بين حامل أصلي والحامل الخاص بإعادة الإنتاج المصنوع من الأصل. @ar
definition: 将一种资源与原始载体和原件复制品的载体之间的关系的细节关联起来。 @zh-hans

has details of illustrative content (Deprecated)
lexical alias: detailsOfIllustrativeContent.en
status: Deprecated
type: Property
label: har detaljer om illustrativt indhold @da
label: hat Details zu illustrierendem Inhalt @de
label: heeft details van illustratieve content @nl
label: illusztratív tartalom részletei a következők: @hu
label: kuvituksellisen sisällön tarkemmat tietot @fi
label: له تفاصيل عن محتوى توضيحي @ar
definition: Hozzákapcsol egy forrást egy forrás elsődleges tartalmát illusztrálni kívánó tartalom részleteihez. @hu
definition: Liittää aineiston lisätietoihin sen ensisijaista sisältöä kuvittamaan tarkoitetusta sisällöstä. @fi
definition: Relaterer en ressource til detaljer om indhold, der er beregnet til at illustrere et udtryks primære indhold. @da
definition: Relates a resource to details of content intended to illustrate a primary content of a resource. (Deprecated)
definition: Setzt eine Ressource in Beziehung zu Details zum Inhalt, die einen primären Inhalt einer Ressource verdeutlichen sollen. @de
definition: يربط بين مصدر وتفاصيل عن محتوى يهدف إلى توضيح محتوى أساسي لمصدر. @ar

has subject
has subproperty: is description of
lexical alias: subject.en
status: Published
type: Property
label: aineiston aihe @fi
label: har emne @da
label: hat Thema @de
label: heeft onderwerp @nl
label: konu ile ilişkilidir @tr
label: tárgya a következő: @hu
label: له موضوع @ar
label: 有主题 @zh-hans
inverse of: is subject of
definition: Bir kaynağı, bir kaynak hakkındaki bir konuyla ilişkilendirir. @tr
definition: Hozzákapcsol egy forrást egy témához, amely jelzi, hogy miről szól a forrás. @hu
definition: Liittää aineiston aineiston aiheeseen. @fi
definition: Relaterer en ressource til en ressources emne, fx en indikation om hvad en ressource handler om. @da
definition: Relates a resource to a topic that a resource is about.
definition: Setzt eine Ressource in Beziehung zu einem Thema, von dem eine Ressource handelt. @de
definition: يربط بين مصدر وموضوع يدور حوله مصدر. @ar
definition: 将一种资源与一种资源所关于的一个论题关联起来。 @zh-hans

is subject of
has subproperty: is described by
has subproperty: is evaluated by
lexical alias: subjectOf.en
status: Published
type: Property
label: Konu @tr
label: aineisto aiheena @fi
label: er emne i @da
label: is onderwerp van @nl
label: ist Thema von @de
label: tárgya a következőnek: @hu
label: هو موضوع لـ @ar
label: 是……的主题 @zh-hans
inverse of: has subject
definition: Bir kaynağı, bir kaynak hakkındaki kaynakla ilişkilendirir. @tr
definition: Hozzákapcsol egy forrást egy forráshoz, ami egy forrásról szól. @hu
definition: Liittää aineiston aineistoon, jonka aiheena aineisto on. @fi
definition: Relaterer en ressoure til en ressource, der handler om en ressource. @da
definition: Relates a resource to a resource that is about a resource.
definition: Setzt eine Ressource in Beziehung zu einer Ressource, von der eine Ressource handelt. @de
definition: يربط بين مصدر ومصدر يتعلق بمصدر. @ar
definition: 将一种资源与关于一种资源的一种资源关联起来。 @zh-hans

has graduate
lexical alias: graduate.en
status: Published
type: Property
label: diplomása a következő: @hu
label: har dimittend @da
label: hat Graduierte/Graduierten @de
label: heeft afgestudeerde @nl
label: loppututkinnon suorittanut (toimija) aineistossa @fi
label: mezun ile ilişkilidir @tr
label: له خريج @ar
label: 有毕业生 @zh-hans
inverse of: is graduate of
definition: Bir temsilciyi, derece veren bir kurum veya fakülteden bir akademik derece alan bir temsilciyle ilişkilendirir. @tr
definition: Hozzákapcsol egy ágenst egy ágenshez, aki tudományos fokozatot kap egy annak odaítélésére jogosult intézménytől vagy egyetemi kartól. @hu
definition: Liittää toimijan toimijaan, jolle laitos tai tiedekunta on myöntänyt akateemisen loppututkinnon. @fi
definition: Relaterer en agent til en agent der modtager en akademsk grad fra en institution eller fakultet, der tildeler en akademisk grad. @da
definition: Relates an agent to an agent who receives an academic degree from a granting institution or faculty.
definition: Setzt einen Akteur in Beziehung zu einem Akteur, der einen akademischen Grad von einer verleihenden Institution oder Fakultät erhält. @de
definition: يربط بين وكيل ووكيل يحصل على درجة أكاديمية من مؤسسة أو كلية مانحة. @ar
definition: 将一个行为者与从一个授予机构或院系获得学位的一个行为者关联起来。 @zh-hans

is graduate of
lexical alias: graduateOf.en
status: Published
type: Property
label: diplomása a következőnek: @hu
label: er dimittend fra @da
label: is afgestudeerde van @nl
label: ist Graduierte/Graduierter von @de
label: loppututkinnon suorittanut (toimija) @fi
label: mezunudur @tr
label: هو خريج في @ar
label: 是……的毕业生 @zh-hans
inverse of: has graduate
definition: Bir temsilciyi, bir temsilciye akademik derece veren bir fakülte veya bir kurumla ilişkilendirir. @tr
definition: Hozzákapcsol egy ágenst egy intézményhez vagy egyetemi karhoz, amely tudományos fokozatot ad egy személynek. @hu
definition: Liittää toimijan laitokseen tai tiedekuntaan, joka on myöntänyt toimijalle akateemisen loppututkinnon. @fi
definition: Relaterer en agent til en institution eller fakultet, der har tildelt en akademisk grad til en agent. @da
definition: Relates an agent to an institution or faculty that granted an academic degree to an agent.
definition: Setzt einen Akteur in Beziehung zu einer grad-verleihenden Institution, die einem Akteur einen akademischen Grad verleiht. @de
definition: يربط بين وكيل ومؤسسة أو كلية تمنح درجة أكاديمية لوكيل. @ar
definition: 将一个行为者与授予一个行为者学位的机构或院系关联起来。 @zh-hans

has writer of foreword (Deprecated)
lexical alias: writerOfForeword.en
status: Deprecated
type: Property
label: har forfatter til indledning @da
sub property of: has contributor (Deprecated)
inverse of: is writer of foreword of (Deprecated)
definition: Relaterer en ressource til en agent, der har bidraget til en ressource ved at tilvejebringe en indledning til den originale ressource. @da
definition: Relates a resource to an agent who contributes to a resource by providing a foreword to an original resource. (Deprecated)

is writer of foreword of (Deprecated)
lexical alias: writerOfForewordOf.en
status: Deprecated
type: Property
label: er forfatter til indledning til @da
sub property of: is contributor of (Deprecated)
inverse of: has writer of foreword (Deprecated)
definition: Relaterer en agent, der bidrager til en ressource ved at skrive en indledning til en oprindelig ressource til en ressource. @da
definition: Relates an agent to a resource that includes a contribution of providing a foreword. (Deprecated)

has sound designer
lexical alias: soundDesigner.en
status: Published
type: Property
label: aineiston äänisuunnittelija @fi
label: hangtervezője a következő: @hu
label: har lyddesigner @da
label: hat Tongestalterin/Tongestalter @de
label: heeft geluidsontwerper @nl
label: ses tasarımcısı ile ilişkilidir @tr
label: له مصمم صوت @ar
label: 有音响设计者 @zh-hans
sub property of: has contributor (Deprecated)
inverse of: is sound designer of
definition: Bir kaynağı, ses veya ses bileşenlerini tasarlayarak ve oluşturarak bir kaynağa katkıda bulunan bir temsilci ile ilişkilendirir. @tr
definition: Hozzákapcsol egy forrást egy ágenshez, amely hozzájárul egy forráshoz azzal, hogy megtervezi és megalkotja a hang/audióelemeket. @hu
definition: Liittää aineiston toimijaan, joka on aineistossa osallisena suunnittelemalla ja luomalla äänikomponentteja. @fi
definition: Relaterer en ressource til en agent, der har bidraget til een ressource ved at designe og skabe audio-/lyddele. @da
definition: Relates a resource to an agent who contributes to a resource by designing and creating audio or sound components.
definition: Setzt eine Ressource in Beziehung zu einem Akteur, der zu einer Ressource beiträgt, indem er Tonelemente entwirft und erstellt. @de
definition: يربط مصدر بوكيل يُساهم في مصدر من خلال تصميم عناصر سمعية أو صوتية وإنشائها. @ar
definition: 将一种资源与通过设计和创建音频或音响组成部分而对资源有贡献的一个行为者关联起来。 @zh-hans

is sound designer of
lexical alias: soundDesignerOf.en
status: Published
type: Property
label: Ses tasarımcısı @tr
label: er lyddesigner for @da
label: hangtervezője a következőnek: @hu
label: is geluidsontwerper van @nl
label: ist Tongestalterin/Tongestalter von @de
label: äänisuunnittelija (toimija) aineistossa @fi
label: هو مصمم صوت لـ @ar
label: 是……的音响设计者 @zh-hans
sub property of: is contributor of (Deprecated)
inverse of: has sound designer
definition: Bir temsilciyi, ses veya ses bileşenleri tasarlayan ve oluşturan bir temsilcinin katkısını içeren bir kaynakla ilişkilendirir. @tr
definition: Hozzákapcsol egy ágenst egy forráshoz, amely magában foglalja az ágens közreműködését audio- vagy hangösszetevők tervezésében és létrehozásában. @hu
definition: Liittää toimijan aineistoon, jossa toimija on osallisena suunnittelemalla ja luomalla äänikomponentteja. @fi
definition: Relaterer en agent, der har bidraget til en ressource ved at designe og skabe audio-/lyddele til en ressource. @da
definition: Relates an agent to a resource that includes a contribution by an agent of designing and creating audio or sound components
definition: Setzt einen Akteur in Beziehung zu einer Ressource, zu der ein Akteur beiträgt, indem er Tonelemente entwirft und erstellt. @de
definition: يربط بين وكيل ومصدر ينطوي على مسؤولية وكيل عن تصميم عناصر سمعية أو صوتية وإنشائها. @ar
definition: 将一个行为者与包括设计并创作音频或音响组成部分的一个行为者的贡献的一种资源关联起来。 @zh-hans

has lighting designer
lexical alias: lightingDesigner.en
status: Published
type: Property
label: aineiston valosuunnittelija @fi
label: har belysningsdesigner @da
label: hat Lichtgestalterin/Lichtgestalter @de
label: heeft lichtontwerper @nl
label: világítástervezője a következő: @hu
label: ışık tasarımcısı ile ilişkilidir @tr
label: له مصمم إضاءة @ar
label: 有灯光设计者 @zh-hans
sub property of: has contributor (Deprecated)
inverse of: is lighting designer of
definition: Bir kaynağı, aydınlatma bileşenlerinin tasarlanarak ve oluşturarak bir kaynağa katkıda bulunan bir temsilci ile ilişkilendirir. @tr
definition: Hozzákapcsol egy forrást egy ágenshez, amely hozzájárul egy forráshoz azzal, hogy megtervezi és megalkotja a világítás összetevőit. @hu
definition: Liittää aineiston toimijaan, joka on aineistossa osallisena suunnittelemalla ja luomalla valokomponentteja. @fi
definition: Relaterer en ressource til en agent, der har bidraget til en ressource ved at designe og skabe belysningsdele. @da
definition: Relates a resource to an agent who contributes to a resource by designing and creating lighting components.
definition: Setzt eine Ressource in Beziehung zu einem Akteur, der zu einer Ressource beiträgt, indem er Lichtelemente entwirft und erstellt. @de
definition: يربط مصدر بوكيل يُساهم في مصدر من خلال تصميم عناصرالإضاءة وإنشائها. @ar
definition: 将一种资源与通过设计和创建灯光组成部分而对资源有贡献的一个行为者关联起来。 @zh-hans

is lighting designer of
lexical alias: lightingDesignerOf.en
status: Published
type: Property
label: er belysningsdesigner for @da
label: is lichtontwerper van @nl
label: ist Lichtgestalterin/Lichtgestalter von @de
label: valosuunnittelija (toimija) aineistossa @fi
label: világítástervezője a következőnek: @hu
label: ışık tasarımcısıdır @tr
label: هو مصمم إضاءة لـ @ar
label: 是……的灯光设计者 @zh-hans
sub property of: is contributor of (Deprecated)
inverse of: has lighting designer
definition: Bir temsilciyi, aydınlatma bileşenlerini tasarlayan ve oluşturan bir temsilcinin katkısını içeren bir kaynakla ilişkilendirir. @tr
definition: Hozzákapcsol egy ágenst egy forráshoz, amely magában foglalja az ágens közreműködését világítási összetevők tervezésében és létrehozásában. @hu
definition: Liittää toimijan aineistoon, jossa toimija on osallisena suunnittelemalla ja luomalla valokomponentteja. @fi
definition: Relaterer en agent, der har bidraget til en ressource ved at designe og skabe belysningsdele til en ressource. @da
definition: Relates an agent to a resource that includes a contribution by an agent of designing and creating lighting components.
definition: Setzt einen Akteur in Beziehung zu einer Ressource, zu der ein Akteur beiträgt, indem er Lichtelemente entwirft und erstellt. @de
definition: يربط بين وكيل ومصدر ينطوي على مسؤولية وكيل عن تصميم عناصرالإضاءة وإنشائها. @ar
definition: 将一个行为者与包括设计并创作灯光组成部分的一个行为者的贡献的一种资源关联起来。 @zh-hans

has degree committee member
lexical alias: degreeCommitteeMember.en
status: Published
type: Property
label: diplomabizottsági tagja a következő: @hu
label: har medlem af kandidatudvalg @da
label: hat Mitglied eines Graduierungsausschusses @de
label: heeft graad commissie-lid @nl
label: opinnäytteen tarkastaja @fi
label: tez komitesi üyesi ile ilişkilidir @tr
label: له عضو لجنة تمنح درجة أكاديمية @ar
label: 有学位委员会成员 @zh-hans
sub property of: has other agent associated with resource (Deprecated)
inverse of: is degree committee member of
definition: Bir kaynağı, bir öğrencinin tezini veya bitirme tezini denetleyen bir komitede görev yapan bir temsilci ile ilişkilendirir. @tr
definition: Hozzákapcsol egy forrást egy ágenshez, aki egy olyan bizottságban szolgál, amely felügyeli egy hallgató szakdolgozatát vagy disszertációját. @hu
definition: Liittää aineiston toimijaan, joka toimii opiskelijan akateemisen opinnäytteen tai väitöskirjan tarkastaneessa komiteassa. @fi
definition: Relaciona un recurs amb un agent que forma part d’un comitè que supervisa una tesi o una dissertació d’un estudiant. @ca
definition: Relaterer en ressource til en agent, der er medlem af et udvalg, der fører tilsyn med en studerendes speciale eller afhandling. @da
definition: Relates a resource to an agent who serves on a committee that supervises a thesis or dissertation of a student.
definition: Setzt eine Ressource in Beziehung zu einem Akteur, der Mitglied eines Ausschusses ist, der eine Hochschulschrift von einer Studentin/einem Studenten beaufsichtigt. @de
definition: يربط مصدر بوكيل يعمل في لجنة تشرف على رسالة جامعية أو أطروحة لطالب. @ar
definition: 将一种资源与在一个委员会中任职并指导一个学生论文的一个行为者关联起来。 @zh-hans

is degree committee member of
lexical alias: degreeCommitteeMemberOf.en
status: Published
type: Property
label: diplomabizottsági tagja a következőnek: @hu
label: er medlem af kandidatudvalg i @da
label: is graad commissie-lid van @nl
label: ist Mitglied eines Graduierungsausschusses von @de
label: opinnäytteen tarkastaja (toimija) aineistossa @fi
label: tez komitesi üyesidir @tr
label: هي عضو لجنة تمنح درجة أكاديمية لـ @ar
label: 是……的学位委员会成员 @zh-hans
sub property of: is other agent associated with resource of (Deprecated)
inverse of: has degree committee member
definition: Bir temsilciyi, bir öğrencinin tezini veya doktora tezini denetleyen bir komitede görev yapmaya ilişkin bir temsilcinin sorumluluğunu içeren bir kaynakla ilişkilendirir. @tr
definition: Hozzákapcsol egy ágenst egy forráshoz, amelyhez hozzátartozik egy ágens olyan bizottságban való szolgálatának felelőssége, amely felügyeli egy hallgató szakdolgozatát vagy disszertációját. @hu
definition: Liittää toimijan aineistoon, jossa toimija vastaa opiskelijan akateemisen opinnäytteen tai väitöskirjan tarkastaneessa komiteassa. @fi
definition: Relaterer en agent, der er medlem i et udvalg der fører tilsyn med en students speciale eller afhandling til en ressource. @da
definition: Relates an agent to a resource that involves a responsibility of an agent for serving on a committee that supervises a thesis or dissertation of a student.
definition: Setzt einen Akteur in Beziehung zu einer Ressource, die mit einer Verantwortung verbunden ist, Mitglied eines Ausschusses zu sein, der eine Hochschulschrift von einer Studentin/einem Studenten beaufsichtigt. @de
definition: يربط بين وكيل ومصدر ينطوي على مسؤولية وكيل عن العمل في لجنة تشرف على رسالة جامعية أو أطروحة لطالب. @ar
definition: 将一个行为者与涉及指导学生论文的一个委员会中的责任的一种资源关联起来。 @zh-hans

is producer of unpublished resource of
lexical alias: producerOfUnpublishedResourceOf.en
status: Published
type: Property
label: előállítója a következő kiadatlan forrásnak: @hu
label: er producer af en upubliceret ressource af @da
label: is producent van ongepubliceerde resource van @nl
label: ist Erzeugerin/Erzeuger einer unveröffentlichten Manifestation von @de
label: julkaisemattoman aineiston tuottaja (toimija) aineistossa @fi
label: yayınlanmamış kaynağının yapımcısıdır @tr
label: هو مُنتج لمصدر غير مشهور لـ @ar
label: 是……的非出版资源的制作者 @zh-hans
inverse of: has producer of unpublished resource
definition: Bir temsilciyi, yazma, fabrikasyon, yapım vb. için bir temsilcinin sorumluluğunu içeren bir kaynakla ilişkilendirir. @tr
definition: Hozzákapcsol egy ágenst egy forráshoz, amelyhez hozzátartozik az ágens íráshoz, összeállításhoz, készítéshez stb. fűződő felelőssége. @hu
definition: Liittää toimijan aineistoon, jossa toimija vastaa julkaistun aineiston painamisesta, monistamisesta, kirjasinten valamisesta tai muusta valmistustavasta. @fi
definition: Relaterer agent der er ansvarlig for at indgravere, fremstille, konstruere etc. til en ressource, @da
definition: Relates an agent to a resource that involves a responsibility of an agent for inscribing, fabrication, construction, etc.
definition: Setzt einen Akteur in Beziehung zu einer Ressource, bei der ein Akteur für das Gravieren, Fabrizieren, Konstruieren und so weiter verantwortlich ist. @de
definition: يربط بين وكيل ومصدر ينطوي على مسؤولية وكيل عن الكتابة، التصنيع، الإنشاء، إلخ. @ar
definition: 将一个行为者与涉及镌刻、制造、构建等的一个行为者的责任的一种资源关联起来。 @zh-hans

has first chronological designation of alternative sequence
lexical alias: firstChronologicalDesignationOfAlternativeSequence.en
status: Published
type: Property
label: alternatif sıranın ilk kronolojik tanımlanması ile ilişkilidir @tr
label: alternativ kronologisk betegnelse for første nummer eller del af en sekvens @da
label: alternatív sorrendiségének kronológiai kezdőjelölése a következő: @hu
label: hat alternative chronologische Bezeichnung einer ersten Ausgabe oder eines ersten Teils einer Folge @de
label: heeft eerste chronologische aanduiding van alternatieve reeks @nl
label: vaihtoehtoisen numerointijakson ensimmäinen aikamäärite @fi
label: له تسمية زمنية أولى لتسلسل بديل @ar
label: 有交替序列的第一个年代标识 @zh-hans
sub property of: has numbering of sequence
inverse of: is first chronological designation of alternative sequence of
definition: Bir kaynağı, bir seri numaralandırma dizisinin ilk sayısında veya bir bölümünde tarih biçiminde sunulan ikinci veya sonraki bir numaralandırma sistemiyle ilişkilendirir. @tr
definition: Hozzákapcsol egy forrást egy második vagy más folyamatos számozáshoz, amely dátum formájában jelzi egy sorozat első részét vagy számát. @hu
definition: Liittää aineiston toiseen tai myöhempään numerointijärjestelmään, joka on esitetty ensimmäisen numeron päivämäärän muodossa tai sarjan numerointisarjan osana. @fi
definition: Relaciona un recurs amb un nomen que és una designació en la forma d’una data o un altre interval de temps que s’usa per indicar la primera en una seqüència concurrent de numeració de les parts o iteracions d’un recurs. @ca
definition: Relaterer en ressource til et andet eller efterfølgende nummereringssystem i form af en datering på første nummer eller del af nummereringssekvensen for et periodikum. @da
definition: Relates a resource to a nomen that is a designation in the form of a date or other timespan that is used to indicate the first in a concurrent sequence of numbering of the parts or iterations of a resource.
definition: Setzt eine Ressource in Beziehung zu einem zweiten oder nachfolgenden Zählungssystem, das in Form eines Datums auf der ersten Ausgabe oder dem ersten Teil einer fortlaufenden Ressource zu finden ist. @de
definition: يربط بين مصدر ونظام ترقيم ثانٍ أو تالٍ يُعرض في شكل تاريخ على الإصدار الأول أو الجزء الأول لتسلسل الترقيم لدورية. @ar
definition: 将一种资源与作为以日期或其他时间段形式用于标识一种资源的部分或更新后整体的并存编号序列中第一个的标识的一个命名关联起来。 @zh-hans
scope note: A designation includes a year; year and month; month, day, and year. A chronological designation of alternative sequence may include a date in a different calendar.
scope note: Betegnelsen omfatter et år; år og måned; måned, dag og år. En alternativ kronologisk betegnelse kan omfatte en dato i en anden kalender. @da
scope note: Bir atama bir yılı içerir; yıl ve ay; ay, gün ve yıl. Alternatif dizinin kronolojik gösterimi farklı bir takvimdeki bir tarihi içerebilir. @tr
scope note: Darunter fällt ein Jahr; ein Monat und ein Jahr; ein Tag, ein Monat und ein Jahr. Zu einer alternativen chronologischen Bezeichnung einer fortlaufenden Ressource kann auch ein Datum nach einem anderen Kalender gehören. @de
scope note: Jelölés lehet év, év és hónap, hónap, nap és év. Az alternatív sorrendiség kronológiai jelölése tartalmazhat dátumot egy másik naptárból is. @hu
scope note: Määrite sisältää vuoden; vuoden ja kuukauden; kuukauden, päivän ja vuoden. Vaihtoehtoinen aikamääre voi sisältää toisen kalenterin mukaisen ajankohdan. @fi
scope note: تشمل التسمية: سنة؛ سنة وشهر؛ شهر، يوم، وسنة. قد تتضمن التسمية الزمنية لتسلسل بديل تاريخًا في تقويم مختلف. @ar
scope note: 标识包括年，年和月，年、月和日。交替序列的年代标识可以包括不同历法的日期。 @zh-hans

has last chronological designation of alternative sequence
lexical alias: lastChronologicalDesignationOfAlternativeSequence.en
status: Published
type: Property
label: alternatif sıranın son kronolojik tanımlanması ile ilişkilidir @tr
label: alternativ kronologisk betegnelse for sidste nummer eller del af en sekvens @da
label: alternatív sorrendiségének kronológiai zárójelölése a következő: @hu
label: hat alternative chronologische Bezeichnung einer letzten Ausgabe oder eines letzten Teils einer Folge @de
label: heeft laatste chronologische aanduiding van alternatieve reeks @nl
label: vaihtoehtoisen numerointijakson viimeinen aikamäärite @fi
label: له تسمية زمنية أخيرة لتسلسل بديل @ar
label: 有交替序列的最后一个年代标识 @zh-hans
sub property of: has numbering of sequence
inverse of: is last chronological designation of alternative sequence of
definition: Bir kaynağı, bir seri numaralandırma dizisinin son sayısında veya bir bölümünde tarih biçiminde sunulan ikinci veya sonraki bir numaralandırma sistemiyle ilişkilendirir. @tr
definition: Hozzákapcsol egy forrást egy második vagy más folyamatos számozáshoz, amely dátum formájában jelzi egy sorozat utolsó részét vagy számát. @hu
definition: Liittää aineiston toiseen tai myöhempään numerointijärjestelmään, joka on esitetty viimeisen numeron päivämäärän muodossa tai sarjan numerointisarjan osana. @fi
definition: Relaciona un recurs amb un nomen que és una designació en la forma d’una data o un altre interval de temps que s’usa per indicar la darrera en una seqüència concurrent de numeració de les parts o iteracions d’un recurs. @ca
definition: Relaterer en ressource til et andet eller efterfølgende nummereringssystem i form af en datering på sidste nummer eller del af nummereringssekvensen for et periodikum. @da
definition: Relates a resource to a nomen that is a designation in the form of a date or other timespan that is used to indicate the last in a concurrent sequence of numbering of the parts or iterations of a resource.
definition: Setzt eine Ressource in Beziehung zu einem zweiten oder nachfolgenden Zählungssystem, das in Form eines Datums auf der letzten Ausgabe oder dem letzten Teil einer fortlaufenden Ressource zu finden ist. @de
definition: يربط بين مصدر ونظام ترقيم ثانٍ أو تالٍ يُعرض في شكل تاريخ على الإصدار الأخير أو الجزء الأخير لتسلسل الترقيم لدورية. @ar
definition: 将一种资源与作为以日期或其他时间段形式用于标识一种资源的部分或更新后整体的并存编号序列中最后一个的标识的一个命名关联起来。 @zh-hans
scope note: A designation includes a year; year and month; month, day, and year. A chronological designation of alternative sequence may include a date in a different calendar.
scope note: Betegnelsen omfatter et år; år og måned; måned, dag og år. En alternativ kronologisk betegnelse kan omfatte en dato i en anden kalender. @da
scope note: Bir atama bir yılı içerir; yıl ve ay; ay, gün ve yıl. Alternatif dizinin kronolojik gösterimi farklı bir takvimdeki bir tarihi içerebilir. @tr
scope note: Darunter fällt ein Jahr; ein Monat und ein Jahr; ein Tag, ein Monat und ein Jahr. Zu einer alternativen chronologischen Bezeichnung einer fortlaufenden Ressource kann auch ein Datum nach einem anderen Kalender gehören. @de
scope note: Jelölés lehet év, év és hónap, hónap, nap és év. Az alternatív sorrendiség kronológiai jelölése tartalmazhat dátumot egy másik naptárból is. @hu
scope note: Määrite sisältää vuoden; vuoden ja kuukauden; kuukauden, päivän ja vuoden. Vaihtoehtoinen aikamääre voi sisältää toisen kalenterin mukaisen ajankohdan. @fi
scope note: تشمل التسمية: سنة؛ سنة وشهر؛ شهر، يوم، وسنة. قد تتضمن التسمية الزمنية لتسلسل بديل تاريخًا في تقويم مختلف. @ar
scope note: 标识包括年，年和月，年、月和日。交替序列的年代标识可以包括不同历法的日期。 @zh-hans

has first alphanumeric designation of alternative sequence
lexical alias: firstAlphanumericDesignationOfAlternativeSequence.en
status: Published
type: Property
label: alternatif sıranın ilk alfanümerik tanımlanması ile ilişkilidir @tr
label: alternatív sorrendiségének alfanumerikus kezdőjelölése a következő: @hu
label: har alternativ numerisk og/eller alfabetisk betegnelse for første nummer eller del af en sekvens @da
label: hat alternative alphanumerische Bezeichnung der ersten Ausgabe oder des ersten Teils einer Folge @de
label: heeft eerste alfanumerieke aanduiding van alternatieve reeks @nl
label: vaihtoehtoisen numerointijakson ensimmäinen numero- tai kirjainmäärite @fi
label: له تسمية رقمية أولى لتسلسل بديل @ar
label: 有交替序列的第一个字母数字标识 @zh-hans
sub property of: has numbering of sequence
inverse of: is first alphanumeric designation of alternative sequence of
definition: Bir kaynağı, bir seri numaralandırma dizisinin ilk sayısında veya bir bölümünde sayısal veya alfabetik biçimde sunulan ikinci veya sonraki bir numaralandırma sistemiyle ilişkilendirir. @tr
definition: Hozzákapcsol egy forrást egy második vagy más folyamatos számozáshoz, amely számok vagy alfabetikus karakterek formájában jelzi egy sorozat első részét vagy számát. @hu
definition: Liittää aineiston toiseen tai myöhempään numerointijärjestelmään, joka on esitetty numeroin tai aakkosin sarjan ensimmäisessä numerossa tai sarjan numerointisarjan osana. @fi
definition: Relaciona un recurs amb un nomen que és una designació en la forma de números o caràcters alfabètics que s’usa per indicar la primera en una seqüència concurrent de numeració de les parts o iteracions d’un recurs. @ca
definition: Relaterer en ressource til et andet eller efterfølgende nummereringssystem i numerisk og/eller alfabetisk form på første nummer eller del af nummereringssekvensen for et periodikum. @da
definition: Relates a resource to a nomen that is a designation in the form of numbers or alphabetic characters that is used to indicate the first in a concurrent sequence of numbering of the parts or iterations of a resource.
definition: Setzt eine Ressource in Beziehung zu einem zweiten oder nachfolgenden Zählungssystem, das in Form von Nummern oder Buchstaben auf der ersten Ausgabe oder dem ersten Teil einer fortlaufenden Ressource zu finden ist. @de
definition: يربط بين مصدر ونظام ترقيم ثانٍ أو تالٍ يُعرض في شكل أرقام أو حروف هجائية على الإصدار الأول أو الجزء الأول لتسلسل الترقيم لدورية. @ar
definition: 将一种资源与作为以数字或字母字符形式用于标识一种资源的部分或更新后整体的并存编号序列中第一个的标识的一个命名关联起来。 @zh-hans

has last alphanumeric designation of alternative sequence
lexical alias: lastAlphanumericDesignationOfAlternativeSequence.en
status: Published
type: Property
label: alternatif sıranın son alfanümerik tanımlanması ile ilişkilidir @tr
label: alternatív sorrendiségének alfanumerikus zárójelölése a következő: @hu
label: har alternativ numerisk og/eller alfabetisk betegnelse for sidste nummer eller del af en sekvens @da
label: hat alternative alphanumerische Bezeichnung der letzten Ausgabe oder des letzten Teils einer Folge @de
label: heeft laatste alfanumerieke aanduiding van alternatieve reeks @nl
label: vaihtoehtoisen numerointijakson viimeinen numero- tai kirjainmäärite @fi
label: له تسمية رقمية أخيرة لتسلسل بديل @ar
label: 有交替序列的最后一个字母数字标识 @zh-hans
sub property of: has numbering of sequence
inverse of: is last alphanumeric designation of alternative sequence of
definition: Bir kaynağı, bir seri numaralandırma dizisinin son sayısında veya bir bölümünde sayısal veya alfabetik biçimde sunulan ikinci veya sonraki bir numaralandırma sistemiyle ilişkilendirir. @tr
definition: Hozzákapcsol egy forrást egy második vagy más folyamatos számozáshoz, amely számok vagy alfabetikus karakterek formájában jelzi egy sorozat utolsó részét vagy számát. @hu
definition: Liittää aineiston toiseen tai myöhempään numerointijärjestelmään, joka on esitetty numeroin tai aakkosin sarjan viimeisessä numerossa tai sarjan numerointisarjan osana. @fi
definition: Relaciona un recurs amb un nomen que és una designació en la forma de números o caràcters alfabètics que s’usa per indicar la darrera en una seqüència concurrent de numeració de les parts o iteracions d’un recurs. @ca
definition: Relaterer en ressource til et andet eller efterfølgende nummereringssystem i numerisk og/eller alfabetisk form på sidste nummer eller del af nummereringssekvensen for et periodikum. @da
definition: Relates a resource to a nomen that is a designation in the form of numbers or alphabetic characters that is used to indicate the last in a concurrent sequence of numbering of the parts or iterations of a resource.
definition: Setzt eine Ressource in Beziehung zu einem zweiten oder nachfolgenden Zählungssystem, das in Form von Nummern oder Buchstaben auf der letzten Ausgabe oder dem letzten Teil einer fortlaufenden Ressource zu finden ist. @de
definition: يربط بين مصدر ونظام ترقيم ثانٍ أو تالٍ يُعرض في شكل أرقام أو حروف هجائية على الإصدار الأخير أو الجزء الأخير لتسلسل الترقيم لدورية. @ar
definition: 将一种资源与作为以数字或字母字符形式用于标识一种资源的部分或更新后整体的并存编号序列中最后一个的标识的一个命名关联起来。 @zh-hans

has scope of usage (Deprecated)
lexical alias: scopeOfUsage.en
status: Deprecated
type: Property
label: har anvendelsessammenhæng @da
definition: Relaterer et navn til en ressourcetype eller -form, der er knyttet til det navn, der er valgt som foretrukket navn for en agent. @da
definition: Relates a name to a type or form of resource associated with a name chosen as a preferred name for an agent. (Deprecated)

has details of duration
lexical alias: detailsOfDuration.en
status: Published
type: Property
label: har detaljer om spilletid @da
label: hat Details zur Dauer @de
label: heeft details van tijdsduur @nl
label: időtartam részletei a következők: @hu
label: süre ayrıntıları ile ilişkilidir @tr
label: tarkemmat tiedot aineiston kestosta @fi
label: له تفاصيل عن مدة @ar
label: 有持续时间细节 @zh-hans
definition: Bir kaynağı, oynatma süresi, performans süresi, çalışma süresi veya diğer bir süre uzunluğu olan bir kaynak kapsamının ayrıntılarıyla ilişkilendirir. @tr
definition: Hozzákapcsol egy forrást egy forrás terjedelmének következő részleteihez: játékidő, előadás ideje, futásidő vagy egyéb időtartomány. @hu
definition: Relaterer en ressource til detaljer om varighed, spilletid, opførelsestid etc. for en ressources indhold. @da
definition: Relates a resource to aetails of an extent of resource that is a playing time, performance time, running time, or other length of time.
definition: Setzt eine Ressource in Beziehung zu Details zu dem Umfang einer Ressource, bei dem es sich um eine Wiedergabezeit, eine Aufführungszeit, eine Laufzeit oder eine andere Zeitspanne handelt. @de
definition: Tarkemmat tiedot aineiston laajuudesta, joka on soittoaika, esitysaika, toistoaika tai muu ajan pituus. @fi
definition: يربط بين مصدر وتفاصيل عن مدى مصدر يمثل وقت التشغيل، وقت الأداء، مدة العرض، أو فترة زمنية أخرى. @ar
definition: 将一种资源与作为播放时间、表演时间、运行时间或其他时间长度的资源的数量的细节关联起来。 @zh-hans

has onscreen participant
see also: has onscreen presenter
lexical alias: onscreenParticipant.en
status: Published
type: Property
label: aineiston liikkuvaan kuvaan osallistuja @fi
label: ekran katılımcısı ile ilişkilidir @tr
label: har programmedvirkende @da
label: hat On-Screen-Teilnehmerin/On-Screen-Teilnehmer @de
label: heeft deelnemer in beeld @nl
label: képernyőn megjelenő résztvevője a következő: @hu
label: له مشارك على الشاشة @ar
label: 有屏幕参与者 @zh-hans
sub property of: has contributor (Deprecated)
inverse of: is onscreen participant of
definition: Bir kaynağı, katılımcı olarak aktif rol alarak kurgusal olmayan hareketli görüntü kaynağına katkıda bulunan bir temsilci ile ilişkilendirir. @tr
definition: Hozzákapcsol egy forrást egy ágenshez, amely egy dokumentarista vagy tényirodalmi mozgóképforráshoz hozzájárul azzal, hogy résztvevőként aktív szerepet játszik benne. @hu
definition: Liittää aineiston toimijaan, joka osallistuu ei-fiktiivisen liikkuvan kuvan teoksen aineiston tekemiseen ottamalla aktiivisen roolin osallistujana. @fi
definition: Relaterer et udtryk til en agent, der har bidraget til en levende billed-ressource af faktuel karakter ved at påtage sig en aktiv rolle som deltager. @da
definition: Relates a resource to an agent who contributes to a nonfiction moving image resource by taking an active role as a participant.
definition: Setzt eine Ressource in Beziehung zu einem Akteur, der zu einer Dokumentarfilmressource beiträgt, indem er eine aktive Rolle als Teilnehmer einnimmt. @de
definition: يربط مصدر بوكيل يُساهم في مصدر صور متحركة غير خيالية من خلال القيام بدور نشط كمشارك. @ar
definition: 将一种资源与通过积极参与而对一种非虚构动态图像资源有贡献的一个行为者关联起来。 @zh-hans
scope note: Appearance on screen to provide contextual or background information is excluded.
scope note: Az olyan képernyőn való megjelenés, amely környezetfüggő vagy háttérinformációkat nyújt, nem tartozik ide. @hu
scope note: Bağlamsal veya arka plan bilgisi sağlamak için ekranda görünme hariçtir. @tr
scope note: Darunter fallen keine Bildschirmauftritte, die Kontext- oder Hintergrundinformationen liefern. @de
scope note: Ei koske esiintymistä lisä- tai taustatietojen kertojana. @fi
scope note: Optræden på skærmen for at give kontekstuel eller baggrundsinformation er ikke omfattet. @da
scope note: يُستبعد المظهر الذي يظهر على الشاشة لتقديم معلومات تتعلق بالسياق أو الخلفية. @ar
scope note: 不包括提供背景信息在屏幕上出现的情况。 @zh-hans

is onscreen participant of
see also: is onscreen presenter of
lexical alias: onscreenParticipantOf.en
status: Published
type: Property
label: ekran katılımcısıdır @tr
label: er programmedvirkende i @da
label: is deelnemer in beeld van @nl
label: ist On-Screen-Teilnehmerin/On-Screen-Teilnehmer von @de
label: képernyőn megjelenő résztvevője a következőnek: @hu
label: liikkuvaan kuvaan osallistuja (toimija) aineistossa @fi
label: هو مشارك على الشاشة لـ @ar
label: 是……的屏幕参与者 @zh-hans
sub property of: is contributor of (Deprecated)
inverse of: has onscreen participant
definition: Bir temsilciyi, katılımcı olarak aktif rol alan temsilcinin katkısını içeren bir kaynakla ilişkilendirir. @tr
definition: Hozzákapcsol egy ágenst egy forráshoz, amely magában foglalja egy résztvevőként aktív szerepet vállaló ágens közreműködését. @hu
definition: Liittää aineiston toimijaan, jossa toimija on osallisena ei-fiktiivisen liikkuvan kuvan teoksen aineiston tekemiseen ottamalla aktiivisen roolin osallistujana. @fi
definition: Relaterer en agent, der har bidraget til en levende non-fiction billed-ressource ved at påtage sig en aktiv rolle som deltager til en ressource. @da
definition: Relates an agent to a resource that includes a contribution by an agent of taking an active role as a participant.
definition: Setzt einen Akteur in Beziehung zu einer Ressource, zu der ein Akteur beiträgt, indem er eine aktive Rolle als Teilnehmer einnimmt. @de
definition: يربط بين وكيل ومصدر يتضمن إسهام وكيل في القيام بدور نشط كمشارك. @ar
definition: 将一个行为者与包括作为积极参与者的一个行为者的贡献的一种资源关联起来。 @zh-hans
scope note: Appearance on screen to provide contextual or background information is excluded.
scope note: Az olyan képernyőn való megjelenés, amely környezetfüggő vagy háttérinformációkat nyújt, nem tartozik ide. @hu
scope note: Bağlamsal veya arka plan bilgisi sağlamak için ekranda görünme hariçtir. @tr
scope note: Darunter fallen keine Bildschirmauftritte, die Kontext- oder Hintergrundinformationen liefern. @de
scope note: Ei koske esiintymistä lisä- tai taustatietojen kertojana. @fi
scope note: Optræden på skærmen for at give kontekstuel eller baggrundsinformation er ikke omfattet. @da
scope note: يُستبعد المظهر الذي يظهر على الشاشة لتقديم معلومات تتعلق بالسياق أو الخلفية. @ar
scope note: 不包括提供背景信息在屏幕上出现的情况。 @zh-hans

has commissioning agent
lexical alias: commissioningAgent.en
status: Published
type: Property
label: görevlendiren temsilci ile ilişkilidir @tr
label: har bestillende institution @da
label: hat Auftraggeberin/Auftraggeber @de
label: heeft opdrachtgever-actor @nl
label: megrendelő ágense a következő: @hu
label: toimeksiantaja aineistossa @fi
label: له وكيل جهة تكليف @ar
label: 有委托行为者 @zh-hans
sub property of: has creator
inverse of: is commissioning agent of
definition: Bir kaynağı, bir kaynağı görevlendirmekten sorumlu olan bir temsilci ile ilişkilendirir. @tr
definition: Hozzákapcsol egy forrást egy ágenshez, amely felelős egy forrás megrendeléséért. @hu
definition: Liittää aineiston toimijaan, joka vastaa aineiston teettämisestä. @fi
definition: Relaterer en ressource til en agent, der er ansvarlig for at have bestilt en ressource. @da
definition: Relates a resource to an agent who is responsible for commissioning a resource.
definition: Setzt eine Ressource in Beziehung zu einem Akteur, der eine Ressource in Auftrag gibt. @de
definition: يربط مصدر بوكيل مسؤول عن التكليف بمصدر. @ar
definition: 将一种资源与负责委托一种资源的一个行为者关联起来。 @zh-hans

is commissioning agent of
lexical alias: commissioningAgentOf.en
status: Published
type: Property
label: er bestillende institution for @da
label: görevlendiren temsilcisidir @tr
label: is opdrachtgever van @nl
label: ist Auftraggeberin/Auftraggeber von @de
label: megrendelő ágense a következőnek: @hu
label: toimeksiantaja (toimija) aineistossa @fi
label: هو وكيل جهة تكليف لـ @ar
label: 是……的委托行为者 @zh-hans
sub property of: is creator of
inverse of: has commissioning agent
definition: Bir temsilciyi, bir kaynağı görevlendiren bir temsilcinin sorumluluğunu içeren bir kaynakla ilişkilendirir. @tr
definition: Hozzákapcsol egy ágenst egy forráshoz, amelyhez hozzátartozik az ágens felelőssége egy forrás megrendeléséért. @hu
definition: Liittää toimijan aineistoon, jossa toimija vastaa aineiston teettämisestä. @fi
definition: Relaterer en agent der er ansvarlig for at have bestilt en ressource til en ressource. @da
definition: Relates an agent to a resource that involves a responsibility of an agent for commissioning a resource.
definition: Setzt einen Akteur in Beziehung zu einer Ressource, bei der ein Akteur dafür verantwortlich ist, eine Ressource in Auftrag zu geben. @de
definition: يربط بين وكيل ومصدر ينطوي على مسؤولية وكيل عن التكليف بمصدر. @ar
definition: 将一个行为者与涉及委托一种资源的一个行为者的责任的一种资源关联起来。 @zh-hans

has software developer
lexical alias: softwareDeveloper.en
status: Published
type: Property
label: har softwareudvikler @da
label: hat Softwareentwicklerin/Softwareentwickler @de
label: heeft softwareontwikkelaar @nl
label: ohjelmistokehittäjä aineistossa @fi
label: szoftverfejlesztője a következő: @hu
label: yazılımcı ile ilişkilidir @tr
label: له مطور برمجيات @ar
label: 有软件开发者 @zh-hans
sub property of: has contributor (Deprecated)
inverse of: is software developer of
definition: Bir kaynağı, yazılım araştırarak, tasarlayarak, uygulayarak veya test ederek bir kaynağa katkıda bulunan bir temsilci ile ilişkilendirir. @tr
definition: Hozzákapcsol egy forrást egy ágenshez, amely hozzájárul egy forráshoz azzal, hogy szoftvereket kutat, tervez, implementál vagy tesztel. @hu
definition: Liittää aineiston toimijaan, joka on osallisena aineistossa tutkimalla, suunnittelemalla, toteuttamalla tai testaamalla ohjelmistoa. @fi
definition: Relaterer en ressource til en agent, der har bidraget til en ressource ved at researche, designe, implementere eller teste software. @da
definition: Relates a resource to an agent who contributes to a resource by researching, designing, implementing, or testing software.
definition: Setzt eine Ressource in Beziehung zu einem Akteur, der zu einer Ressource beiträgt, indem er Software untersucht, konzipiert, implementiert oder testet. @de
definition: يربط مصدر بوكيل يُساهم في مصدر من خلال البحث في البرمجيات، أو تصميمها، أو تنفيذها، أو اختبارها. @ar
definition: 将一种资源与通过研究、设计、实施或测试软件而对一种资源有贡献的一个行为者关联起来。 @zh-hans

is software developer of
lexical alias: softwareDeveloperOf.en
status: Published
type: Property
label: er softwareudvikler til @da
label: is softwareontwikkelaar van @nl
label: ist Softwareentwicklerin/Softwareentwickler von @de
label: ohjelmistokehittäjä (toimija) aineistossa @fi
label: szoftverfejlesztője a következőnek: @hu
label: yazılımcısı @tr
label: هو مطور برمجيات لـ @ar
label: 是……的软件开发者 @zh-hans
sub property of: is contributor of (Deprecated)
inverse of: has software developer
definition: Bir temsilciyi, yazılımı araştıran, tasarlayan, uygulayan veya test eden temsilcinin katkılarını içeren bir kaynakla ilişkilendirir. @tr
definition: Hozzákapcsol egy forrást egy forráshoz, amely magában foglalja az ágens közreműködését szoftverkutatásban, tervezésben, implementálásban vagy tesztelésben. @hu
definition: Liittää toimijan aineistoon, jossa toimija on osallisena aineistossa tutkimalla, suunnittelemalla, toteuttamalla tai testaamalla ohjelmistoa. @fi
definition: Relaciona un agent amb un recurs que inclou una contribució d’un agent en la recerca, el disseny, la posada en marxa o l’examen de programari. @ca
definition: Relaterer en agent, der har bidraget til en ressource ved at researche, designe, implementere eller teste software til en ressource. @da
definition: Relates an agent to a resource that includes a contribution by an agent of researching, designing, implementing, or testing software.
definition: Setzt einen Akteur in Beziehung zu einer Ressource, zu der ein Akteur beiträgt, indem er Software untersucht, konzipiert, implementiert oder testet. @de
definition: يربط بين وكيل ومصدر يتضمن إسهام وكيل في البحث في البرمجيات، أو تصميمها، أو تنفيذها، أو اختبارها. @ar
definition: 将一个行为者与包括研究、设计、实施或测试软件的一个行为者的贡献的一种资源关联起来。 @zh-hans

is oratorio adaptation of
lexical alias: oratorioAdaptationOf.en
status: Published
type: Property
label: er oratoriebearbejdelse af @da
label: is oratoriumbewerking van @nl
label: ist Oratorienbearbeitung von @de
label: oratoriosovitus aineistosta @fi
label: oratoryo uyarlamasıdır @tr
label: oratórium-feldolgozása a következőnek: @hu
label: هو اقتباس موسيقى دينية لـ @ar
label: 是……的清唱剧改编 @zh-hans
sub property of: has source
inverse of: is adapted as oratorio
definition: Bir kaynağı, oratoryo olarak uyarlanmış bir kaynakla ilişkilendirir. @tr
definition: Hozzákapcsol egy forrást egy forráshoz, amelyet oratóriumként adaptáltak. @hu
definition: Liittää aineiston oratorioksi sovitettuun aineistoon. @fi
definition: Relaterer en ressource til en ressource, der er blevet bearbejdet som et oratorium. @da
definition: Relates a resource to a resource that is adapted as an oratorio.
definition: Setzt eine Ressource in Beziehung zu einer Ressource, die als Oratorium bearbeitet ist. @de
definition: يربط بين مصدر ومصدر تم اقتباسه كموسيقى دينية. @ar
definition: 将一种资源与被改编为清唱剧的一种资源关联起来。 @zh-hans

is adapted as oratorio
lexical alias: adaptedAsOratorio.en
status: Published
type: Property
label: er bearbejdet til oratorium @da
label: is bewerkt als oratorium @nl
label: ist bearbeitet als Oratorium @de
label: oratoriosovitus (aineisto) @fi
label: oratoryo olarak uyarlanmıştır @tr
label: oratóriumként való feldolgozása a következő: @hu
label: هو مُقتبس كموسيقى دينية لـ @ar
label: 被改编为清唱剧 @zh-hans
sub property of: has derivative
inverse of: is oratorio adaptation of
definition: Bir kaynağı, başka bir kaynağa dayanan bir oratoryo ile ilişkilendirir. @tr
definition: Hozzákapcsol egy forrást egy oratóriumhoz, amely egy másik forráson alapul. @hu
definition: Liittää aineiston oratorioon, joka perustuu toiseen aineistoon. @fi
definition: Relaterer en ressource til et oratorium baseret på en oprindelig ressource. @da
definition: Relates a resource to an oratorio based on another resource.
definition: Setzt eine Ressource in Beziehung zu einem Oratorium, das auf einer anderen Ressource basiert. @de
definition: يربط بين مصدر وموسيقى دينية تعتمد على مصدر آخر. @ar
definition: 将一种资源与基于另一种资源的一种清唱剧关联起来。 @zh-hans

is inspired by
lexical alias: inspiredBy.en
status: Published
type: Property
label: er inspireret af @da
label: esinlenmiştir @tr
label: inspiraation lähde (aineisto) @fi
label: inspirálta a következő: @hu
label: is geïnspireerd door @nl
label: ist angeregt durch @de
label: هو مُستَوحىً مِن @ar
label: 受……启发 @zh-hans
sub property of: has source
inverse of: is inspiration for
definition: Bir kaynağı, ilgili bir kaynağa ilham kaynağı olarak kullanılan bir kaynakla ilişkilendirir. @tr
definition: Hozzákapcsol egy forrást egy forráshoz, amely egy másik forrás inspirációjaként szolgál. @hu
definition: Liittää aineiston aineistoon, joka toimii toisen, liittyvän aineiston inspiraationa. @fi
definition: Relaterer en ressource til en ressource, der tjener som inspiration for en anden ressource. @da
definition: Relates a resource to a resource that serves as the inspiration for a related resource.
definition: Setzt eine Ressource in Beziehung zu einer Ressource, die als Anregung für eine in Beziehung stehende Ressource dient. @de
definition: يربط بين مصدر ومصدر يمثل مصدر إلهام لمصدر ذي صلة. @ar
definition: 将一种资源与作为一种相关资源的启发的一种资源关联起来。 @zh-hans

is inspiration for
lexical alias: inspirationFor.en
status: Published
type: Property
label: er inspiration til @da
label: inspiraatio aineistolle @fi
label: inspirációja a következőnek: @hu
label: is inspiratie voor @nl
label: ist Anregung für @de
label: için ilham kaynağıdır @tr
label: هو مُستَوحي لـ @ar
label: 是对……的启发 @zh-hans
sub property of: has derivative
inverse of: is inspired by
definition: Bir kaynağı, ilgili bir kaynaktan ilham alan bir kaynakla ilişkilendirir. @tr
definition: Hozzákapcsol egy forrást egy forráshoz, amelyet egy kapcsolódó forrás inspirált. @hu
definition: Liittää aineiston aineistoon, joka on saanut inspiraatiota toisesta, liittyvästä aineistosta. @fi
definition: Relaterer en ressource til en ressource, der var inspireret af en anden ressource. @da
definition: Relates a resource to a resource that was inspired by a related resource.
definition: Setzt eine Ressource in Beziehung zu einer Ressource, die von einer in Beziehung stehenden Ressource angeregt ist. @de
definition: يربط بين مصدر ومصدر مُستَوحي من مصدر ذي صلة. @ar
definition: 将一种资源与受一种相关资源启发的一种资源关联起来。 @zh-hans

has participant in treaty
lexical alias: participantInTreaty.en
status: Published
type: Property
label: antlaşmanın katılımcısı ile ilişkilidir @tr
label: har traktatdeltager @da
label: hat Vertragspartnerin/Vertragspartner @de
label: heeft deelnemer in verdrag @nl
label: szerződő fele a következő: @hu
label: valtiosopimuksen allekirjoittaja @fi
label: له مُشَارِك في معاهدة @ar
label: 有条约的参与者 @zh-hans
sub property of: has other agent associated with resource (Deprecated)
inverse of: is participant in treaty of
definition: Bir kaynağı, bir anlaşmayı imzalayan, onaylayan veya anlaşmaya katılan bir temsilci ile ilişkilendirir. @tr
definition: Hozzákapcsol egy forrást egy ágenshez, amely aláírt, ratifikált vagy jóváhagyott egy szerződést. @hu
definition: Liittää aineiston toimijaan joka on allekirjoittanut tai ratifioinut valitosopimuksen tai liittynyt valtiosopimukseen. @fi
definition: Relaterer en ressource til en regering, mellemstatslig organisation eller anden agent, der har underskrevet, ratificeret eller tiltrådt en traktat. @da
definition: Relates a resource to an agent who has signed, ratified, or acceded to a treaty.
definition: Setzt eine Ressource in Beziehung zu einem Akteur, der ein Abkommen unterzeichnet, ratifiziert hat oder ihm beigetreten ist. @de
definition: يربط مصدر بوكيل وقّع، أبرَم، أو انضم إلى معاهدة. @ar
definition: 将一种资源与签署、批准或加入一个条约的一个行为者关联起来。 @zh-hans

is participant in treaty of
lexical alias: participantInTreatyOf.en
status: Published
type: Property
label: antlaşmasının katılımcısıdır @tr
label: er traktatdeltager i @da
label: is deelnemer in verdrag van @nl
label: ist Vertragspartnerin/Vertragspartner von @de
label: résztvevője a következő szerződésnek: @hu
label: valtiosopimuksen allekirjoittaja (yhteistoimija) @fi
label: هو مُشَارِك في معاهدة لـ @ar
label: 是……的条约的参与者 @zh-hans
sub property of: is other agent associated with resource of (Deprecated)
inverse of: has participant in treaty
definition: Bir kaynağa bir anlaşmayı imzalamış, onaylamış veya katılmış bir hükümeti, uluslararası hükümetler arası organı veya başka bir aracıyı ilişkilendirir. @tr
definition: Hozzákapcsol egy kormányt, nemzetközi kormányközi szervet, vagy egyéb szerződést aláíró, ratifikáló vagy jóváhagyó ágenst egy forráshoz. @hu
definition: Liittää aineistoon hallituksen, hallitustenvälisen toimielimen tai muun yhteistoimijan, joka on allekirjoittanut tai ratifioinut valitosopimuksen tai liittynyt valtiosopimukseen. @fi
definition: Relaterer en regering, mellemstatslig instans eller anden agent, der har underskrevet, ratificeret eller tiltrådt til en traktat til en ressource. @da
definition: Relates a government, international intergovernmental body, or other agent who has signed, ratified, or acceded to a treaty to a resource.
definition: Setzt einen Akteur in Beziehung zu einer Ressource, bei der eine Regierung, eine internationale zwischenstaatliche Körperschaft oder ein anderer Akteur ein Abkommen unterzeichnet, ratifiziert hat oder ihm beigetreten ist. @de
definition: يربط بين مصدر وحكومة أو هيئة حكومية دولية، أو وكيل آخر وقّع، أبرَم، أو انضم إلى معاهدة. @ar
definition: 将签署、批准或加入一个条约的一个政府、国际政府间组织或其他行为者与一种资源关联起来。 @zh-hans

has researcher
lexical alias: researcher.en
status: Published
type: Property
label: araştırmacı ile ilişkilidir @tr
label: har researcher @da
label: hat Forscherin/Forscher @de
label: heeft onderzoeker @nl
label: kutatója a következő: @hu
label: tutkija aineistossa @fi
label: له باحث @ar
label: 有研究者 @zh-hans
sub property of: has other agent associated with resource (Deprecated)
inverse of: is researcher of
definition: Bir kaynağı, bir kaynağın oluşturulmasını desteklemek için araştırma yapan bir temsilci ile ilişkilendirir. @tr
definition: Hozzákapcsol egy forrást egy ágenshez, amely kutatást végez egy forrás megalkotásának támogatására. @hu
definition: Liittää aineiston toimijaan, joka tekee aineiston syntymistä tukevaa tutkimusta. @fi
definition: Relaterer en ressource til en agent, der udfører forskning til støtte for skabelsen af en ressource. @da
definition: Relates a resource to an agent who does research in support of the creation of a resource.
definition: Setzt eine Ressource in Beziehung zu einem Akteur, der Forschung betreibt, um das Schaffen einer Ressource zu unterstützen. @de
definition: يربط مصدر بوكيل يُساهم في إجراء بحث لدعم إنشاء مصدر. @ar
definition: 将一种资源与从事研究以支持一种资源的创作的一个行为者关联起来。 @zh-hans

is researcher of
lexical alias: researchOf.en
status: Published
type: Property
label: araştırmacısıdır @tr
label: er researcher for @da
label: is onderzoeker van @nl
label: ist Forscherin/Forscher von @de
label: kutatója a következőnek: @hu
label: tutkija (toimija) aineistossa @fi
label: هو باحث لـ @ar
label: 是……的研究者 @zh-hans
sub property of: is other agent associated with resource of (Deprecated)
inverse of: has researcher
definition: Bir temsilciyi, bir kaynağı destekleyen araştırmayla sorumlu bir temsilcinin sorumluluğunu içeren bir kaynakla ilişkilendirir. @tr
definition: Hozzákapcsol egy ágenst egy forráshoz, amelyhez hozzátartozik az ágens felelőssége a forrást támogató kutatásért. @hu
definition: Liittää toimijan aineistoon, jossa toimija vasta aineiston syntymistä tukevasta tutkimuksesta. @fi
definition: Relaterer en agent, der udfører forskning til støtte for skabelsen af en ressource til en ressource. @da
definition: Relates an agent to a resource that involves a responsibility of an agent for research in support of a resource.
definition: Setzt einen Akteur in Beziehung zu einer Ressource, bei der ein Akteur für die Forschung zur Unterstützung einer Ressource verantwortlich ist. @de
definition: يربط بين وكيل ومصدر ينطوي على مسؤولية وكيل عن البحث لدعم إنشاء مصدر. @ar
definition: 将一个行为者与涉及对一种资源研究支持的一个行为者的责任的一种资源关联起来。 @zh-hans

has colourist
lexical alias: colourist.en
status: Published
type: Property
label: coloristja a következő: @hu
label: har farvelægger @da
label: hat Koloristin/Kolorist @de
label: heeft inkleurder @nl
label: renklendirici ile ilişkilidir @tr
label: värittäjä aineistossa @fi
label: له فني تلوين @ar
label: 有着色者 @zh-hans
sub property of: has contributor (Deprecated)
inverse of: is colourist of
definition: Bir kaynağı, çizimlere, baskılara, fotoğraflara, haritalara, hareketli görüntülere veya diğer içeriğe renk uygulayarak kaynağa katkıda bulunan bir temsilci ile ilişkilendirir. @tr
definition: Hozzákapcsol egy forrást egy ágenshez, amely hozzájárul a forráshoz azzal, hogy színt hord fel rajzokra, nyomtatványokra, fényképekre, térképekre, mozgóképekre és más vizuális tartalmakra. @hu
definition: Liittää aineiston toimijaan, joka on osallisena aineistossa värittämällä piirustuksia, vedoksia, valokuvia, karttoja, elokuvia tms. @fi
definition: Relaterer en ressource til en agent, der har bidraget til en ressource ved at farvelægge tegninger, tryk, fotos, kort, levende billeder etc. @da
definition: Relates a resource to an agent who contributes to a resource by applying colour to drawings, prints, photographs, maps, moving images, or other content.
definition: Setzt eine Ressource in Beziehung zu einem Akteur, der zu einer Ressource beiträgt, indem er Farben auf Zeichnungen, Drucke, Fotografien, Karten, Bewegtbilder und so weiter aufbringt. @de
definition: يربط مصدر بوكيل يُساهم في مصدر من خلال تلوين الرسومات، المطبوعات، الصور الفوتوغرافية، الخرائط، الصور المتحركة، وأي محتوى مرئي آخر. @ar
definition: 将一种资源与通过将颜色施加于图画、印刷品、照片、地图、动态图像或其他内容上而对一种资源作出贡献的一个行为者关联起来。 @zh-hans

is colourist of
lexical alias: colouristOf.en
status: Published
type: Property
label: coloristja a következőnek: @hu
label: er farvelægger til @da
label: is inkleurder van @nl
label: ist Koloristin/Kolorist von @de
label: renklendiricidir @tr
label: värittäjä (toimija) aineistossa @fi
label: هو فني تلوين لـ @ar
label: 是……的着色者 @zh-hans
sub property of: is contributor of (Deprecated)
inverse of: has colourist
definition: Bir temsilciyi, bir temsilcinin çizimlere, baskılara, fotoğraflara, haritalara, hareketli görüntülere vb. renk uygulayan bir temsilcinin katkısını içeren bir kaynakla ilişkilendirir. @tr
definition: Hozzákapcsol egy ágenst egy forráshoz, amely magában foglalja az ágens közreműködését szín felhordásában rajzokra, nyomtatványokra, fényképekre, térképekre, mozgóképekre és más vizuális tartalmakra. @hu
definition: Liittää toimijan aineistoon, jossa toimija on osallisena värittämällä piirustuksia, vedoksia, valokuvia, karttoja, elokuvia tms. @fi
definition: Relaterer en agent, der har bidraget til en ressource ved at farvelægge tegninger, tryk, fotos, kort, levende billeder etc. til en ressource. @da
definition: Relates an agent to a resource that includes a contribution by an agent of applying colour to drawings, prints, photographs, maps, moving images, etc.
definition: Setzt einen Akteur in Beziehung zu einer Ressource, zu der ein Akteur beiträgt, indem er Farben auf Zeichnungen, Drucke, Fotografien, Karten, Bewegtbilder und so weiter aufbringt. @de
definition: يربط بين وكيل ومصدر يتضمن إسهام وكيل في تلوين الرسومات، المطبوعات، الصور الفوتوغرافية، الخرائط، الصور المتحركة...إلخ. @ar
definition: 将一个行为者与包括将颜色施加于图画、印刷品、照片、地图、动态图像等上的一个行为者的贡献的一种资源关联起来。 @zh-hans

has makeup artist
lexical alias: makeupArtist.en
status: Published
type: Property
label: har sminkør @da
label: hat Maskenbildnerin/Maskenbildner @de
label: heeft make-upartiest @nl
label: makyaj sanatçısı ile ilişkilidir @tr
label: maskeeraaja aineistossa @fi
label: sminkmestere a következő: @hu
label: له فنان ماكياج @ar
label: 有化妆艺术家 @zh-hans
sub property of: has contributor (Deprecated)
inverse of: is makeup artist of
definition: Bir kaynağı, hareketli bir görüntü yapımı veya müzikal veya dramatik bir sunum veya eğlence için makyaj ve protez uygulayarak bir kaynağa katkıda bulunan bir temsilci ile ilişkilendirir. @tr
definition: Hozzákapcsol egy forrást egy ágenshez, amely hozzájárul egy forráshoz azzal, hogy makeupot és protéziseket alkalmaz egy mozgókép-produkcióhoz, zenei vagy drámai bemutatóhoz, vagy szórakoztató műsorhoz. @hu
definition: Liittää aineiston toimijaan, joka vastaa elokuvan, musikaalin tai näyttämöteoksen maskeerauksesta. @fi
definition: Relaterer en ressource til en agent, der har bidraget til en ressource ved at lægge makeup og påsætte proteser til en levende billedproduktion eller til en musikalsk eller dramatisk præsentation eller til underholdning. @da
definition: Relates a resource to an agent who contributes to a resource by applying makeup and prosthetics for a moving image production or for a musical or dramatic presentation or entertainment.
definition: Setzt eine Ressource in Beziehung zu einem Akteur, der zu einer Ressource beiträgt, indem er Schminke und Prothetik für eine Bewegtbildproduktion oder eine musikalische oder dramatische Darbietung oder Aufführung aufträgt. @de
definition: يربط مصدر بوكيل يُساهم في مصدر من خلال وضع مكياج أو مكياج ترقيعي لإنتاج فيلم أو في عرض موسيقي أو درامي أو ترفيهي. @ar
definition: 将一种资源与通过为动态图像制作或者为音乐或戏剧呈现或娱乐施加化妆品或假体而对一种资源作出贡献的一个行为者关联起来。 @zh-hans

is makeup artist of
lexical alias: makeupArtistOf.en
status: Published
type: Property
label: er sminkør for @da
label: is make-upartiest van @nl
label: ist Maskenbildnerin/Maskenbildner von @de
label: makyaj sanatçısıdır @tr
label: maskeeraaja aineistossa @fi
label: sminkmestere a következőnek: @hu
label: هو فنان ماكياج لـ @ar
label: 是……的化妆艺术家 @zh-hans
sub property of: is contributor of (Deprecated)
inverse of: has makeup artist
definition: Bir temsilciyi, hareketli bir görüntü üretimi veya müzikal veya dramatik bir sunum veya eğlence için makyaj ve protez uygulayan bir temsilcinin katkısını içeren bir kaynakla ilişkilendirir. @tr
definition: Hozzákapcsol egy ágenst egy forráshoz, amely magában foglalja az ágens közreműködését szoftver kutatásában, tervezésében, implementálásában vagy tesztelésében. @hu
definition: Liittää toimijan aineistoon, jonka tekemiseen toimija osallistuu vastaamalla elokuvan, musikaalin tai näyttämöteoksen maskeerauksesta. @fi
definition: Relaciona un agent amb un recurs que inclou una contribució d’un agent aplicant maquillatge i pròtesis en el cas d’una producció d’imatge en moviment o una representació o un espectacle musical o dramàtic. @ca
definition: Relaterer en agent, der har bidraget til en ressource ved at lægge makeup og påsætte proteser til en levende billedproduktion eller til en musikalsk eller dramatisk præsentation eller til underholdningtil en ressource. @da
definition: Relates an agent to a resource that includes a contribution by an agent of applying makeup and prosthetics for a moving image production or for a musical or dramatic presentation or entertainment.
definition: Setzt einen Akteur in Beziehung zu einer Ressource, zu der ein Akteur beiträgt, indem er Schminke und Prothetik für eine Bewegtbildproduktion oder eine musikalische oder dramatische Darbietung oder Aufführung aufträgt. @de
definition: يربط بين وكيل ومصدر يتضمن إسهام وكيل في وضع مكياج أو مكياج ترقيعي لإنتاج فيلم أو في عرض موسيقي أو درامي أو ترفيهي. @ar
definition: 将一个行为者与包括为动态图像制作或者为音乐或戏剧呈现或娱乐施加化妆品或假体的一个行为者的贡献的一种资源关联起来。 @zh-hans

has choral conductor
lexical alias: choralConductor.en
status: Published
type: Property
label: har kordirigent @da
label: hat Chorleiterin/Chorleiter @de
label: heeft koordirigent @nl
label: koro şefi ile ilişkilidir @tr
label: kuoronjohtaja @fi
label: kórusvezetője a következő: @hu
label: له مايِسترو كورالي @ar
label: 有合唱指挥 @zh-hans
sub property of: has conductor
inverse of: is choral conductor of
definition: Bir kaynağı, müzikal veya dramatik bir sunumda bir koro icra eden gruba liderlik ederek müzikal bir kaynağa katkıda bulunan bir orkestra şefiyle ilişkilendirir. @tr
definition: Hozzákapcsol egy forrást egy karmesterhez, amely hozzájárul egy zenei forráshoz azzal, hogy énekkari előadói csoportot vezet egy zenei vagy drámai bemutatóban. @hu
definition: Liittää aineiston toimijaan, joka on osallisena aineistossa johtamalla kuoroa musiikki- tai näytelmäesityksessä. @fi
definition: Relaciona un recurs amb un agent que contribueix a una expressió dirigint una coral en una representació musical o dramàtica. @ca
definition: Relaterer en ressource til en dirigent, der har bidraget til en musikressource ved at lede et optrædende kor i en musikalsk eller dramatisk præsentation etc. @da
definition: Relates a resource to an agent who contributes to a resource by leading a choral performing group in a musical or dramatic presentation.
definition: Setzt eine Ressource in Beziehung zu einer Dirigentin/einem Dirigenten, die/der zu einer musikalischen Ressource beiträgt, indem sie/er einen Chor in einer musikalischen oder dramatischen Darbietung leitet. @de
definition: يربط بين مصدر ومايِسترو يُساهم في مصدر موسيقي من خلال قيادة فريق كورال في عرض موسيقي أو درامي. @ar
definition: 将一种资源与通过在音乐或戏剧呈现中领导一个合唱表演团体而对一种资源作出贡献的一个行为者关联起来。 @zh-hans

is choral conductor of
lexical alias: choralConductorOf.en
status: Published
type: Property
label: er kordirigent i @da
label: is koordirigent van @nl
label: ist Chorleiterin/Chorleiter von @de
label: koro şefidir @tr
label: kuoronjohtaja (toimija) aineistossa @fi
label: kórusvezetője a következőnek: @hu
label: هو مايِسترو كورالي لـ @ar
label: 是……的合唱指挥 @zh-hans
sub property of: is conductor of
inverse of: has choral conductor
definition: Bir temsilciyi, müzikal veya dramatik bir sunumda bir koro performans grubuna liderlik eden bir temsilcinin katkısını içeren bir müzik kaynağıyla ilişkilendirir. @tr
definition: Hozzákapcsol egy ágenst egy zenei forráshoz, amely magában foglalja egy zenei vagy drámai bemutatóban énekkari előadó csoportot vezető ágens közreműködését. @hu
definition: Liittää toimijan aineistoon, jossa toimija on osallisena johtamalla kuoroa musiikki- tai näytelmäesityksessä. @fi
definition: Relaterer en dirigent, der har bidraget til en musikressource ved at lede et optrædende kor i en musikalsk eller dramatisk præsentation etc. til en ressource. @da
definition: Relates an agent to a musical resource that includes a contribution by an agent of leading a choral performing group in a musical or dramatic presentation.
definition: Setzt einen Akteur in Beziehung zu einer musikalischen Ressource, zu der ein Akteur beiträgt, indem er einen Chor in einer musikalischen oder dramatischen Darbietung leitet. @de
definition: يربط بين وكيل ومصدر موسيقي يتضمن إسهام وكيل في قيادة فريق كورال في عرض موسيقي أو درامي. @ar
definition: 将一个行为者与包括在音乐或戏剧呈现中领导一个合唱表演团体的一个行为者的贡献的一种音乐资源关联起来。 @zh-hans

has instrumental conductor
lexical alias: instrumentalConductor.en
status: Published
type: Property
label: enstrüman şefi ile ilişkilidir @tr
label: har instrumentaldirigent @da
label: hat Orchesterleiterin/Orchesterleiter @de
label: heeft instrumentaal dirigent @nl
label: kapellimestari aineistossa @fi
label: zenekari karmestere a következő: @hu
label: له مايِسترو لآلات عزف @ar
label: 有器乐指挥 @zh-hans
sub property of: has conductor
inverse of: is instrumental conductor of
definition: Bir kaynağı, müzikal veya dramatik bir sunumda enstrümantal bir performans grubuna liderlik ederek müzikal bir kaynağa katkıda bulunan bir şefle ilişkilendirir. @tr
definition: Hozzákapcsol egy forrást egy karmesterhez, amely hozzájárul egy zenei forráshoz azzal, hogy hangszeres előadói csoportot vezet egy zenei vagy drámai bemutatóban. @hu
definition: Liittää aineiston kapellimestariin, joka osallistuu aineiston tekemiseen johtamalla soitinryhmää musiikki- tai näytelmäesityksessä. @fi
definition: Relaciona un recurs amb un agent que contribueix a un recurs dirigint un grup instrumental en una representació musical o dramàtica. @ca
definition: Relaterer en ressource til en dirigent, der har bidraget til en musikressource ved at lede en optrædende instrumentalgruppe i en musikalsk eller dramatisk præsentation etc. @da
definition: Relates a resource to an agent who contributes to a resource by leading an instrumental performing group in a musical or dramatic presentation.
definition: Setzt eine Ressource in Beziehung zu einer Dirigentin/einem Dirigenten, die/der zu einer musikalischen Ressource beiträgt, indem sie/er eine Instrumentalgruppe in einer musikalischen oder dramatischen Darbietung leitet. @de
definition: يربط بين مصدر ومايِسترو يُساهم في مصدر موسيقي من خلال قيادة فرقة عزف في عرض موسيقي أو درامي. @ar
definition: 将一种资源与通过在一个音乐或戏剧呈现中领导一个器乐表演团体而对一种资源作出贡献的一个行为者关联起来。 @zh-hans

is instrumental conductor of
lexical alias: instrumentalConductorOf.en
status: Published
type: Property
label: enstrüman şefidir @tr
label: er instrumentaldirigent i @da
label: is instrumentaal dirigent van @nl
label: ist Orchesterleiterin/Orchesterleiter von @de
label: kapellimestari (toimija) aineistossa @fi
label: zenekari karmestere a következőnek: @hu
label: هو مايِسترو لآلات عزف لـ @ar
label: 是……的器乐指挥 @zh-hans
sub property of: is conductor of
inverse of: has instrumental conductor
definition: Bir temsilciyi, müzikal veya dramatik bir sunumda enstrümantal performans gösteren bir grubu yürütme ve yönetme konusunda bir temsilcinin katkısını içeren bir kaynakla ilişkilendirir. @tr
definition: Hozzákapcsol egy ágenst egy forráshoz, amely magában foglalja egy zenei vagy drámai bemutatóban hangszeres előadói csoportot vezénylő és vezető ágens közreműködését. @hu
definition: Liittää toimijan aineistoon, jossa toimija on osallisena johtamalla soitinryhmää musiikki- tai näytelmäesityksessä tms. @fi
definition: Relaterer en dirigent, der har bidraget til en musikressource ved at lede en optrædende instrumentalgruppe i en musikalsk eller dramatisk præsentation etc. til en ressource. @da
definition: Relates an agent to a resource that includes a contribution by an agent of conducting and leading an instrumental performing group in a musical or dramatic presentation
definition: Setzt einen Akteur in Beziehung zu einer Ressource, zu der ein Akteur beiträgt, indem er eine Instrumentalgruppe in einer musikalischen oder dramatischen Darbietung leitet. @de
definition: يربط بين وكيل ومصدر يتضمن إسهام وكيل في إدارة فرقة عزف وقيادتها في عرض موسيقي أو درامي. @ar
definition: 将一个行为者与包括在音乐或戏剧呈现中指挥并领导一个器乐表演团体的一个行为者的贡献的一种资源关联起来。 @zh-hans

has commemoration
lexical alias: commemoration.en
status: Published
type: Property
label: anma ile ilişkilidir @tr
label: har mindemarkering @da
label: hat Gedenkschrift @de
label: heeft herdenking @nl
label: megemlékezik róla a következő: @hu
label: muistoaineisto @fi
label: له إحْياء ذِكْرى أو تكريم @ar
label: 有纪念 @zh-hans
sub property of: has referential resource relationship with (Deprecate)
inverse of: is commemoration of
definition: Bir kaynağı, daha önceki bir kaynağı anmak için oluşturulan bir kaynakla ilişkilendirir. @tr
definition: Hozzákapcsol egy forrást egy forráshoz, amelyet egy korábbi forrásra való megemlékezés céljából hoztak létre. @hu
definition: Liittää aineiston aineistoon, joka on luotu aiemman aineiston muistoksi. @fi
definition: Relaterer en ressource til en ressource, der er skabt for at mindes en tidligere ressource. @da
definition: Relates a resource to a resource created to commemorate an earlier resource.
definition: Setzt eine Ressource in Beziehung zu einer Ressource, die erstellt wurde, um einer früheren Ressource zu gedenken. @de
definition: يربط بين مصدر ومصدر تم إنشاؤه للاحتفاء بمصدر سابق. @ar
definition: 将一种资源与被创建以纪念一种较早资源的一种资源关联起来。 @zh-hans

is commemoration of
lexical alias: commemorationOf.en
status: Published
type: Property
label: anılmasıdır @tr
label: er mindemarkering af @da
label: is herdenking van @nl
label: ist Gedenkschrift für @de
label: megemlékezés a következőről: @hu
label: muistoaineisto @fi
label: هو إحْياء ذِكْرى أو تكريم لـ @ar
label: 是……的纪念 @zh-hans
sub property of: has referential resource relationship with (Deprecate)
inverse of: has commemoration
definition: Bir kaynağı, daha sonraki bir kaynakta anılan bir kaynakla ilişkilendirir. @tr
definition: Hozzákapcsol egy forrást egy forráshoz, amelyről egy későbbi forrásban emlékeznek meg. @hu
definition: Liittää aineiston aineistoon, jota muistetaan myöhemmässä aineistossa. @fi
definition: Relaterer n ressource til en ressource, der mindes i en senere ressource. @da
definition: Relates a resource to a resource commemorated in a later resource.
definition: Setzt eine Ressource in Beziehung zu einer Ressource, der durch eine spätere Ressource gedacht wird. @de
definition: يربط بين مصدر ومصدر تم الاحتفاء به في عمل لاحق. @ar
definition: 将一种资源与被一种较晚资源纪念的一种资源关联起来。 @zh-hans

has referential resource relationship with (Deprecate)
has subproperty: has commemoration
has subproperty: is commemoration of
lexical alias: referentialResourceRelationship.en
status: Deprecated
type: Property
label: har henvisende ressourcerelation med @da
definition: Relaterer en ressource til en ressource der henviser til en anden ressource. @da
definition: Relates a resource to a resource that references a related resource. (Deprecated)

has organizer
lexical alias: organizer.en
status: Published
type: Property
label: har arrangør @da
label: hat Veranstalterin/Veranstalter @de
label: heeft organisator @nl
label: järjestäjä aineistossa @fi
label: organizatör ile ilişkilidir @tr
label: szervezője a következő: @hu
label: له مُنَظِّم @ar
label: 有组织者 @zh-hans
sub property of: has other agent associated with resource (Deprecated)
inverse of: is organizer of
definition: Bir kaynağı, bir kaynağa yol açan bir konferans, sergi veya başka bir etkinlik düzenleyen bir temsilci ile ilişkilendirir. @tr
definition: Hozzákapcsol egy forrást egy ágenshez, amely egy forrás létrejöttét eredményező konferenciát, kiállítást vagy egyéb eseményt szervez. @hu
definition: Liittää aineiston toimijaan, joka järjestää konferenssin, näyttelyn tai muun tapahtuman, jonka seurauksena syntyy aineisto. @fi
definition: Relaterer en ressource til en agent, der har arrangeret den udstilling, event eller konference eller det kursus eller program etc., der gav anledning til en ressource. @da
definition: Relates a resource to an agent who organizes a conference, exhibition, or other event that gives rise to a resource.
definition: Setzt eine Ressource in Beziehung zu einem Akteur, der eine Konferenz, eine Ausstellung oder ein anderes Ereignis organisiert beziehungsweise veranstaltet, aus der/dem eine Ressource hervorgeht. @de
definition: يربط مصدر بوكيل يُنظم مؤتمر، معرض، أو حدث آخر يسفر عن مصدر. @ar
definition: 将一种资源与组织会议、展览或其他事件以产生一种资源的一个行为者关联起来。 @zh-hans

is organizer of
lexical alias: organizerOf.en
status: Published
type: Property
label: er arrangør af @da
label: is organisator van @nl
label: ist Veranstalterin/Veranstalter von @de
label: järjestäjä (toimija) aineistossa @fi
label: organizatörüdür @tr
label: szervezője a következőnek: @hu
label: هو مُنَظِّم لـ @ar
label: 是……的组织者 @zh-hans
sub property of: is other agent associated with resource of (Deprecated)
inverse of: has organizer
definition: Bir temsilciyi, bir kaynağa yol açan bir konferans, sergi veya başka bir etkinliği düzenlemekte görevli bir temsilcinin sorumluluğunu içeren bir kaynakla ilişkilendirir. @tr
definition: Hozzákapcsol egy ágenst egy forráshoz, amelyhez hozzátartozik az ágens felelőssége egy forrás létrejöttét eredményező konferencia, kiállítás vagy más esemény szervezéséért. @hu
definition: Liittää toimijan aineistoon, jossa toimija vastaa konferenssin, näyttelyn tai muun tapahtuman, jonka seurauksena syntyy aineisto, järjestämisestä. @fi
definition: Relaterer en agent, der organiserer en udstilling, et event, en konference etc. der gav ophav til en ressource til en ressource. @da
definition: Relates an agent to a resource that involves a responsibility of an agent for organizing a conference, exhibition, or other event that gives rise to a resource.
definition: Setzt einen Akteur in Beziehung zu einer Ressource, bei der ein Akteur für die Organisation beziehungsweise Veranstaltung einer Konferenz, einer Ausstellung oder eines anderen Ereignisses verantwortlich ist, aus der/dem eine Ressource hervorgeht. @de
definition: يربط بين وكيل ومصدر ينطوي على مسؤولية وكيل عن تنظيم مؤتمر، معرض، أو حدث آخر يسفر عن مصدر. @ar
definition: 将一个行为者与涉及组织会议、展览或其他事件以产生一种作品的一个行为者的责任的一种资源关联起来。 @zh-hans

has censor
see also: has author
lexical alias: censor.en
status: Published
type: Property
label: cenzora a következő: @hu
label: har censor @da
label: hat Zensorin/Zensor @de
label: heeft censor @nl
label: sansür ile ilişkilidir @tr
label: sensori (toimija) aineistossa @fi
label: له رقيب من طرف الرقابة @ar
label: 有审查者 @zh-hans
sub property of: has contributor (Deprecated)
inverse of: is censor of
definition: Bir kaynağı, ahlaki, politik, askeri veya diğer gerekçelerle sakıncalı görülen kısımları bastırmak amacıyla içeriği revize ederek, ancak niteliğini ve içeriğini büyük ölçüde değiştirmeden bırakarak bir kaynağa katkıda bulunan bir temsilci ile ilişkilendirir. @tr
definition: Hozzákapcsol egy forrást egy ágenshez, amely hozzájárul egy forráshoz azzal, hogy a tartalmat felülvizsgálja morális, politikai, katonai vagy egyéb alapon kifogásolható részek kiküszöbölése céljából, ugyanakkor a jellegzetességeket és a tartalmat lényegében változatlanul hagyja. @hu
definition: Liittää aineiston toimijaan, joka tarkastaa aineiston sisältöä kiistanalaisen sisällön salaamiseksi moraalisin, poliittisin, sotilaallisin tai muin perustein, mutta jättäen alkuperäisen teoksen luonteen ja yleisen sisällön olennaisilta osiltaan muuttumattomaksi. @fi
definition: Relaciona un recurs amb un agent que contribueix a un recurs revisant el contingut d’un altre recurs amb el propòsit de suprimir el contingut considerat objectable per motius ètics, polítics, militars o altres motius, però deixant la natura i el contingut general sense canvis substancials. @ca
definition: Relaterer en ressource til en agent, der bidrager til en ressource ved at revidere indholdet med henblik på at undertrykke dele, der anses for at være moralsk, politisk, militært eller af anden årsag stødende, men som i alt væsentligt lader originalværkets karakter og indhold være uændret. @da
definition: Relates a resource to an agent who contributes to a resource by revising the content of another resource for the purpose of suppressing content deemed objectionable on moral, political, military, or other grounds, but leaving the nature and general content substantially unchanged.
definition: Setzt eine Ressource in Beziehung zu einem Akteur, der zu einer Ressource beiträgt, indem er den Inhalt überarbeitet, um Teile zu unterdrücken, die aus moralischen, politischen, militärischen oder anderen Gründen unerwünscht sind, ohne den Charakter und den Inhalt substantiell zu verändern. @de
definition: يربط مصدر بوكيل يُساهم في مصدر من خلال مراجعة محتوى بغرض حذف المحتوى الذي قد يُرفض لأسباب أخلاقية أو سياسية أو عسكرية أو لاعتبارت أخرى، دون إحداث تغيير جوهري في طابعه العام أو في مضمونه. @ar
definition: 将一种资源与通过修订另一种资源的内容以禁止视为不符合道德、政治、军事或其他背景的内容但却保持性质和总体内容不变而对一种资源有贡献的一个行为者关联起来。 @zh-hans
scope note: Darunter fallen keine substantiellen Veränderungen, die zur Schaffung einer neuen Ressource führen. @de
scope note: Ei koske oleellista muokkausta, joka johtaa uuden aineiston luomiseen. @fi
scope note: Nem tartoznak ide az egy új forrás létrehozását eredményező lényegi változtatások. @hu
scope note: Substantial modification that results in the creation of a new resource is excluded.
scope note: Væsentlige ændringer, der resulterer i skabelsen af et nyt værk er ikke omfattet. @da
scope note: Yeni bir kaynağın oluşturulmasıyla sonuçlanan önemli değişiklikler hariç tutulur. @tr
scope note: يُستبعد إجراء تعديل جوهري ينتج عنه إنشاء مصدر جديد. @ar
scope note: 不包括导致一种新资源创作的实质性修改。 @zh-hans

is censor of
see also: is author of
lexical alias: censorOf.en
status: Published
type: Property
label: cenzora a következőnek: @hu
label: er censor i @da
label: is censor van @nl
label: ist Zensorin/Zensor von @de
label: sansürcüsüdür @tr
label: sensori (toimija) aineistossa @fi
label: هو رقيب من طرف الرقابة لـ @ar
label: 是……的审查者 @zh-hans
sub property of: is contributor of (Deprecated)
inverse of: has censor
definition: Bir temsilciyi, ahlaki, politik, askeri veya diğer gerekçelerle sakıncalı görülen kısımları bastırmak amacıyla içeriği revize etmeye yönelik bir katkı içeren, ancak niteliğini ve içeriğini büyük ölçüde değiştirmeden bırakan bir kaynakla ilişkilendirir. @tr
definition: Hozzákapcsol egy ágenst egy forráshoz, amely magában foglalja az ágens közreműködését egy másik forrás tartalmának a felülvizsgálatában, morális, politikai, katonai vagy egyéb alapon kifogásolható részek kiküszöbölése céljából, ugyanakkor a jellegzetességeket és a tartalmat lényegében változatlanul hagyja. @hu
definition: Liittää toimijan aineistoon, jossa toimija tarkastaa aineiston sisältöä kiistanalaisen sisällön salaamiseksi moraalisin, poliittisin, sotilaallisin tai muin perustein, mutta jättäen alkuperäisen teoksen luonteen ja yleisen sisällön olennaisilta osiltaan muuttumattomaksi. @fi
definition: Relaterer en agent, der har bidraget til en ressource ved at revidere indholdet med henblik på at undertrykke dele, der anses for at være moralsk, politisk, militært eller af anden årsag stødende, men som i alt væsentligt har ladt det oprindelige værks karakter og indhold være uændret til en ressource @da
definition: Relates an agent to a resource that includes a contribution for revising the content for the purpose of suppressing parts deemed objectionable on moral, political, military, or other grounds, but leaving the nature and content substantially unchanged.
definition: Setzt einen Akteur in Beziehung zu einer Ressource, zu der ein Akteur beiträgt, indem er den Inhalt überarbeitet, um Teile zu unterdrücken, die aus moralischen, politischen, militärischen oder anderen Gründen unerwünscht sind, ohne den Charakter und den Inhalt substantiell zu verändern. @de
definition: يربط بين وكيل ومصدر يتضمن المُساهمة في مراجعة محتوى بغرض حذف المحتوى الذي قد يُرفض لأسباب أخلاقية أو سياسية أو عسكرية أو لاعتبارت أخرى، دون إحداث تغيير جوهري في طابعه العام أو في مضمونه. @ar
definition: 将一个行为者与包括修订内容以禁止视为不符合道德、政治、军事或其他背景的内容但却保持性质和总体内容不变的一个行为者的贡献的资源关联起来。 @zh-hans
scope note: Darunter fallen keine substantiellen Veränderungen, die zur Schaffung einer neuen Ressource führen. @de
scope note: Ei koske oleellista muokkausta, joka johtaa uuden aineiston luomiseen. @fi
scope note: Nem tartoznak ide az egy új forrás létrehozását eredményező lényegi változtatások. @hu
scope note: Substantial modification that results in the creation of a new resource is excluded.
scope note: Væsentlige ændringer, der resulterer i skabelsen af et nyt værk er ikke omfattet. @da
scope note: Yeni bir kaynağın oluşturulmasıyla sonuçlanan önemli değişiklikler hariç tutulur. @tr
scope note: يُستبعد إجراء تعديل جوهري ينتج عنه إنشاء مصدر جديد. @ar
scope note: 不包括导致一种新资源创作的实质性修改。 @zh-hans

has colleague
has subproperty: has assistant
has subproperty: is assistant to
has subproperty: has co-worker
has subproperty: has partner
lexical alias: colleague.en
status: Published
type: Property
label: har kollega @da
label: hat Kollegin/Kollegen @de
label: heeft collega @nl
label: kollega (toimija) @fi
label: kollégája a következő: @hu
label: meslektaş ile ilişkilidir @tr
label: له زميل @ar
label: 有同事 @zh-hans
sub property of: has related agent of agent
definition: Bir temsilciyi bir mesleğin, personelin veya akademik fakültenin bir üyesiyle ilişkilendirir. @tr
definition: Hozzákapcsol egy ágenst ugyanannak a szakmának, személyzetnek vagy felsőoktatási karnak a tagjához. @hu
definition: Liittää toimijan toimijaan, joka on saman ammattikunnan, henkilöstön tai tieteenalan jäsen. @fi
definition: Relaciona un agent amb un agent que és un company de professió, del personal o del professorat acadèmic. @ca
definition: Relaterer en agent til en medlem af samme profession, personale, eller akademisk fakultet. @da
definition: Relates an agent to an agent who is a fellow member of a profession, staff, or academic faculty.
definition: Setzt einen Akteur in Beziehung zu jemandem der mit anderen zusammen im gleichen Beruf, im gleichen Betrieb, in der gleichen Einrichtung oder Organisation und so weiter tätig ist. @de
definition: يربط بين وكيل وزميل عضو في مهنة، في هيئة تدريس، أو في كلية أكاديمية. @ar
definition: 将一个行为者与作为从业、行政或教学的同事的一个行为者关联起来 @zh-hans

has friend
lexical alias: friend.en
status: Published
type: Property
label: arkadaş ile ilişkilidir @tr
label: barátja a következő: @hu
label: har ven @da
label: hat Freundin/Freund @de
label: heeft vriend @nl
label: ystävä (toimija) @fi
label: له صديق @ar
label: 有朋友 @zh-hans
sub property of: has related agent of agent
definition: Bir temsilciyi, ilgili bir temsilciyle karşılıklı sevgi veya saygı bağı paylaşan bir temsilciyle ilişkilendirir. @tr
definition: Hozzákapcsol egy ágenst egy ágenshez, aki a kölcsönös szeretet kötelékében osztozik vagy így tekint egy kapcsolódó ágensre. @hu
definition: Liittää toimijan toimijaan, jolla on molemminpuolinen kiintymys- tai kunnioitussuhde liittyvään toimijaan. @fi
definition: Relaterer en agent til en agent, der deler et bånd af gensidig ømhed eller respekt med en anden agent. @da
definition: Relates an agent to an agent who shares a bond of mutual affection or regard with a related agent.
definition: Setzt einen Akteur in Beziehung zu einem Akteur, der eine gegenseitige Zuneigung oder Achtung mit einem in Beziehung stehenden Akteur teilt. @de
definition: يربط بين وكيل ووكيل تجمعه مودة أو احترام متبادل مع وكيل ذي صلة. @ar
definition: 将一个行为者与和一个相关行为者有共同感情或尊重的一个行为者关联起来。 @zh-hans

has enrolled student
lexical alias: enrolledStudent.en
status: Published
type: Property
label: beiratkozott tanulója a következő: @hu
label: har indskreven studerende @da
label: hat immatrikulierte Studentin/immatrikulierten Studenten @de
label: heeft ingeschreven student @nl
label: kayıtlı öğrenci ile ilişkilidir @tr
label: oppilas (toimija) @fi
label: له طالب مسجل @ar
label: 有注册学生 @zh-hans
sub property of: has related agent of agent
inverse of: is student at
definition: Bir temsilciyi, bir eğitim kurumunda eğitim alan bir temsilciyle ilişkilendirir. @tr
definition: Hozzákapcsol egy ágenst egy ágenshez, aki egy oktatási intézményben oktatásban részesül. @hu
definition: Liittää toimijan toimijaan, joka saa opetusta oppilaitoksessa. @fi
definition: Relaterer en agent til en agent, der modtager undervisning ved en uddannelsesinstitution. @da
definition: Relates an agent to an agent who receives instruction at an educational institution.
definition: Setzt einen Akteur in Beziehung zu einem Akteur, der in einer Bildungseinrichtung unterrichtet wird. @de
definition: يربط بين وكيل ووكيل يتلقى التعليم في مؤسسة تعليمية. @ar
definition: 将一个行为者与在一个教育机构里接受教学的一个行为者关联起来。 @zh-hans

is student at
lexical alias: studentAt.en
status: Published
type: Property
label: er studerende på @da
label: is student aan @nl
label: ist Studentin/Student an @de
label: oppilas (toimija) @fi
label: tanulója a következőnek: @hu
label: öğrencisidir @tr
label: هو طالب في @ar
label: 是……处的学生 @zh-hans
sub property of: has related agent of agent
inverse of: has enrolled student
definition: Bir temsilciyi, bir temsilciye eğitim sağlayan bir eğitim kurumu olan bir temsilciyle ilişkilendirir. @tr
definition: Hozzákapcsol egy ágenst egy oktatási intézmény ágenshez, amely oktatást nyújt egy ágens számára. @hu
definition: Liittää henkilön henkilöön, joka saa opetusta toiselta toimijalta. @fi
definition: Relaterer en agent til en uddannelsesinstitution, der giver undervisning til en agent. @da
definition: Relates an agent to an agent who is an educational institution that provides instruction to an agent.
definition: Setzt einen Akteur in Beziehung zu einer Bildungseinrichtung, die einem Akteur Unterricht erteilt. @de
definition: يربط بين وكيل ووكيل هو مؤسسة تعليمية تقدم التعليم لوكيل. @ar
definition: 将一个行为者与作为教育机构为一个行为者提供教学的一个行为者关联起来。 @zh-hans

has assistant
lexical alias: assistant.en
status: Published
type: Property
label: asistan ile ilişkilidir @tr
label: assistentti (toimija) @fi
label: asszisztense a következő: @hu
label: har assistent @da
label: hat Assistentin/Assistenten @de
label: heeft assistent @nl
label: له مساعد @ar
label: 有助理 @zh-hans
sub property of: has colleague
inverse of: has preferred title of resource
definition: Bir temsilciyi, başka bir temsilciye yardım eden bir meslektaş olan bir temsilciyle ilişkilendirir. @tr
definition: Hozzákapcsol egy ágenst egy kolléga ágenshez, aki egy másik ágensnek segít. @hu
definition: Liittää toimijan toimijaan, joka on kollega, joka avustaa toista toimijaa. @fi
definition: Relaterer en agent til en kollega, der hjælper en anden agent. @da
definition: Relates an agent to an agent who is a colleague who helps another agent.
definition: Setzt einen Akteur in Beziehung zu einer Kollegin/einem Kollegen, die/der einen anderen Akteur unterstützt. @de
definition: يربط بين وكيل ووكيل هو زميل يساعد وكيلًا آخر. @ar
definition: 将一个行为者与作为帮助另一个行为者的同事的一个行为者关联起来。 @zh-hans

is assistant to
lexical alias: assistantTo.en
status: Published
type: Property
label: asistanıdır @tr
label: assistentti (toimija) @fi
label: asszisztense a következőnek: @hu
label: er assistent for @da
label: is assistent van @nl
label: ist Assistentin/Assistent von @de
label: هو مساعد لـ @ar
label: 是……的助理 @zh-hans
sub property of: has colleague
inverse of: has encoded bitrate
definition: Bir temsilciyi, başka bir temsilcinin yardım ettiği bir meslektaş olan bir temsilciyle ilişkilendirir. @tr
definition: Hozzákapcsol egy ágenst egy kolléga ágenshez, akit egy másik ágens segít. @hu
definition: Liittää toimijan toimijaan, joka on kollega, jota toinen toimija avustaa. @fi
definition: Relaterer en agent til en kollega, der bliver hjulpet af en anden agent. @da
definition: Relates an agent to an agent who is a colleague who is helped by another agent.
definition: Setzt einen Akteur in Beziehung zu einer Kollegin/einem Kollegen, der/dem von einem anderen Akteur geholfen wird. @de
definition: يربط بين وكيل ووكيل هو زميل تلقى مساعدة من وكيلًا آخر. @ar
definition: 将一个行为者与作为另一个行为者帮助的同事的一个行为者关联起来。 @zh-hans

has co-worker
lexical alias: coworker.en
status: Published
type: Property
label: har arbejdskollega @da
label: hat Arbeitskollegin/Arbeitskollegen @de
label: heeft naaste collega @nl
label: iş arkadaşı ile ilişkilidir @tr
label: munkatársa a következő: @hu
label: työtoveri (toimija) @fi
label: له زميل عمل @ar
label: 有共事者 @zh-hans
sub property of: has colleague
definition: Bir temsilciyi, ilgili bir temsilciyle çalışan veya onunla görev paylaşan bir meslektaş olan bir temsilciyle ilişkilendirir. @tr
definition: Hozzákapcsol egy ágenst egy kolléga ágenshez, aki egy másik ágenssel együtt dolgozik vagy egy feladatot oszt meg vele. @hu
definition: Liittää toimijan, toimijan, joka on joka on kollega, joka työskentelee tai jakaa tehtävän liittyvän toimijan kanssa. @fi
definition: Relaciona un agent amb un agent que és un col·lega que treballa amb o comparteix una tasca amb un altre agent. @ca
definition: Relaterer en agent til en kollega, der arbejder sammen med eller deler opgaver med en anden agent. @da
definition: Relates an agent to an agent who is a colleague who works with or shares a task with another agent.
definition: Setzt einen Akteur in Beziehung zu einer Kollegin/einem Kollegen, die/der mit einem in Beziehung stehenden Akteur zusammenarbeitet oder mit ihm eine Aufgabe teilt. @de
definition: يربط بين وكيل ووكيل هو زميل يعمل مع وكيلًا ذي صلة أو يشاركه مهمة. @ar
definition: 将一个行为者与作为同事与另一个行为者一起工作或分担一个任务的一个行为者关联起来。 @zh-hans

has partner
lexical alias: partner.en
status: Published
type: Property
label: har partner @da
label: hat Partnerin/Partner @de
label: heeft bedrijfspartner @nl
label: kumppani (toimija) @fi
label: partner ile ilişkilidir @tr
label: partnere a következő: @hu
label: له شريك @ar
label: 有合伙人 @zh-hans
sub property of: has colleague
definition: Bir temsilciyi, ilgili bir temsilciyle ortak ilgi alanına giren bir faaliyette, çoğunlukla bir iş ortaklığında çalışan bir meslektaş olan bir temsilciyle ilişkilendirir. @tr
definition: Hozzákapcsol egy ágenst egy kolléga ágenshez, aki egy másik ágenssel dolgozik egy közös érdekű tevékenységben, leggyakrabban üzleti partnerségben. @hu
definition: Liittää toimijan toimijaan, joka on kollega, joka toimii toisen toimijan kanssa yhteiseksi hyväksi, useimmiten liikekumppanina. @fi
definition: Relaterer en agent til en kollega, der arbejder sammen med en anden agent med en aktivitet af fælles interesse, i de fleste tilfælde, et forretningspartnerskab. @da
definition: Relates an agent to an agent who is a colleague working with a related agent in an activity of common interest, most often a business partnership.
definition: Setzt einen Akteur in Beziehung zu einer Kollegin/einem Kollegen, die/der mit einem in Beziehung stehenden Akteur in einer Tätigkeit von gemeinsamem Interesse, meist in einer Geschäftspartnerschaft, zusammenarbeitet. @de
definition: يربط بين وكيل ووكيل هو زميل يعمل مع وكيل ذي صلة في نشاط محل اهتمام مشترك، غالبًا شراكة تجارية. @ar
definition: 将一个行为者与作为同事与一个相关行为者在共同兴趣范围内一起工作（最常见的是商业合伙人）的一个行为者关联起来。 @zh-hans

has fellow student
lexical alias: fellowStudent.en
status: Published
type: Property
label: har medstuderende @da
label: hat Kommilitonin/Kommilitonen @de
label: heeft medestudent @nl
label: okul arkadaşı ile ilişkilidir @tr
label: opiskelutoveri (toimija) @fi
label: tanulótársa a következő: @hu
label: له زميل دراسة @ar
label: 有同学 @zh-hans
sub property of: has related agent of agent
definition: Bir temsilciyi, kendisi de resmi olarak öğrenmeyle meşgul olan başka bir öğrencinin bir arkadaşıyla ilişkilendirir. @tr
definition: Hozzákapcsol egy ágenst egy ágenshez, aki egy másik, a tanulásban szintén formálisan részt vevő tanulónak a társa. @hu
definition: Liittää toimijan kanssaopiskelijaan, joka myös virallisesti opiskelee. @fi
definition: Relaciona un agent amb un agent que és un associat d’un altre estudiant que també es dedica formalment a l’aprenentatge. @ca
definition: Relaterer en agent til en en anden students kollega, der også er formelt beskæftigt med at studere. @da
definition: Relates an agent to an agent who is an associate of another student who is also formally engaged in learning.
definition: Setzt einen Akteur in Beziehung zu einer Studienkollegin/einem Studienkollegen einer anderen Studentin/eines anderen Studenten, die/der sich ebenfalls offiziell mit Studieren befasst. @de
definition: يربط بين وكيل وزميل طالب آخر ينخرط أيضًا في التعلم بصورة رسمية. @ar
definition: 将一个行为者与作为另一个也是正式参加学习的学生的伙伴的一个行为者关联起来。 @zh-hans

has student
lexical alias: student.en
status: Published
type: Property
label: har student @da
label: hat Studentin/Student @de
label: heeft student @nl
label: oppilas (toimija) @fi
label: tanulója a következő: @hu
label: öğrenci ile ilişkilidir @tr
label: له طالب @ar
label: 有学生 @zh-hans
sub property of: has related agent of agent
inverse of: has teacher
definition: Bir temsilciyi, ilgili bir temsilciden eğitim alan bir temsilciyle ilişkilendirir. @tr
definition: Hozzákapcsol egy ágenst egy ágenshez, aki egy kapcsolódó ágenstől oktatásban részesül. @hu
definition: Liittää toimijan toimijaan joka saa opetusta toiselta, liittyvältä toimijalta. @fi
definition: Relaterer en agent til en agent, der modtager undervisning af en anden agent. @da
definition: Relates an agent to an agent who receives instruction from a related agent.
definition: Setzt einen Akteur in Beziehung zu einem Akteur, der von einem in Beziehung stehenden Akteur unterrichtet wird. @de
definition: يربط بين وكيل ووكيل يتلقى تعليمات من وكيل ذي صلة. @ar
definition: 将一个行为者与从一个相关行为者接受教学的一个行为者关联起来。 @zh-hans

has teacher
lexical alias: teacher.en
status: Published
type: Property
label: har lærer @da
label: hat Lehrerin/Lehrer @de
label: heeft leraar @nl
label: opettaja (toimija) @fi
label: tanára a következő: @hu
label: öğretmen ile ilişkilidir @tr
label: له مدرس @ar
label: 有教师 @zh-hans
sub property of: has related agent of agent
inverse of: has student
definition: Bir temsilciyi, ilgili bir temsilciye talimat veren bir temsilciyle ilişkilendirir. @tr
definition: Hozzákapcsol egy ágenst egy ágenshez, aki egy kapcsolódó ágenst oktat. @hu
definition: Liittää toimijan toista toimijaa opettavaan liittyvään toimijaan. @fi
definition: Relaterer en agent til en agent, der underviser en anden agent. @da
definition: Relates an agent to an agent who instructs a related agent.
definition: Setzt einen Akteur in Beziehung zu einem Akteur, der einen in Beziehung stehenden Akteur unterrichtet. @de
definition: يربط بين وكيل ووكيل يقوم بتعليم وكيل ذي صلة. @ar
definition: 将一个行为者与给予一个相关行为者教学的一个行为者关联起来。 @zh-hans

has chief executive
lexical alias: chiefExecutive.en
status: Published
type: Property
label: felsővezetője a következő: @hu
label: genel müdür ile ilişkilidir @tr
label: har virksomhedsleder @da
label: hat Geschäftsführerin/Geschäftsführer @de
label: heeft directeur @nl
label: pääjohtaja (toimija) @fi
label: له رئيس تنفيذي @ar
label: 有总裁 @zh-hans
sub property of: has officer
inverse of: is chief executive of
definition: Bir temsilciyi, bir temsilcinin en üst düzey yetkilisi olan bir memurla ilişkilendirir. @tr
definition: Hozzákapcsol egy ágenst egy tisztviselőhöz, aki egy ágens rangidős tisztviselője. @hu
definition: Liittää yhteistoimijan toimijan toimihenkilöön, joka kuuluu yhteisön ylimpiin viranhaltijoihin. @fi
definition: Relaterer en agent til en embedsmand, der har den højeste stilling i en agent. @da
definition: Relates an agent to an officer who is a top ranking official of an agent.
definition: Setzt einen Akteur in Beziehung zu einer leitenden Angestellten/einem leitenden Angestellten, die/der das höchste Amt innehat. @de
definition: يربط بين وكيل ومسؤول رفيع المستوى لدى وكيل. @ar
definition: 将一个行为者与作为一个行为者顶级官员的一个任职者关联起来。 @zh-hans

is chief executive of
lexical alias: chiefExecutiveOf.en
status: Published
type: Property
label: er virksomhedsleder for @da
label: felsővezetője a következőnek: @hu
label: genel müdürüdür @tr
label: is directeur van @nl
label: ist Geschäftsführerin/Geschäftsführer von @de
label: pääjohtaja (toimija) @fi
label: هو رئيس تنفيذي لـ @ar
label: 是……的总裁 @zh-hans
sub property of: is officer of
inverse of: has chief executive
definition: Bir temsilciyi, bir temsilcinin üst düzey bir memur olduğu bir temsilci ile ilişkindir. @tr
definition: Hozzákapcsol egy ágenst egy ágenshez, amelyben a tisztviselő a rangidős. @hu
definition: Liittää toimijan yhteistoimijaan, jossa toimija kuuluu ylimpiin viranhaltijoihin. @fi
definition: Relaterer en agent til en agent, hvor en embedsmand har den højeste stilling. @da
definition: Relates an agent to an agent in which an officer is a top ranking official.
definition: Setzt einen Akteur in Beziehung zu einem Akteur, bei dem eine leitende Angestellte/ein leitender Angestellter das höchste Amt innehat. @de
definition: يربط بين وكيل ووكيل يكون فيه المسؤول رفيع المستوى. @ar
definition: 将一个行为者与一个任职者在其中任顶级官员的一个行为者关联起来。 @zh-hans

has trustee
lexical alias: trustee.en
status: Published
type: Property
label: edunvalvoja (toimija) @fi
label: har forvalter @da
label: hat Treuhänderin/Treuhänder @de
label: heeft trustee @nl
label: vezetője a következő: @hu
label: yetkili ile ilişkilidir @tr
label: له مدير عام @ar
label: 有受托人 @zh-hans
sub property of: has officer
inverse of: is trustee of
definition: Bir temsilciyi, bir temsilcinin yararına hareket etmesi için yönetim yetkisi verilmiş bir memurla ilişkilendirir. @tr
definition: Hozzákapcsol egy ágenst egy tisztviselőhöz, aki adminisztratív hatalmat kap egy ágensben, hogy annak javára cselekedjék. @hu
definition: Liittää toimijan toimihenkilöön, jolla on valtuudet tehdä päätöksiä yhteisön eduksi. @fi
definition: Relaterer en agent til en embedsmand, der har fået administrationsbeføjelse i en agent til at agere i dens interesse. @da
definition: Relates an agent to an officer granted powers of administration in an agent in order to act for its benefit.
definition: Setzt einen Akteur in Beziehung zu einer leitenden Angestellten/einem leitenden Angestellten, der/dem die Verwaltungsvollmachten über einen Akteur übertragen wird, um zu dessen Nutzen zu agieren. @de
definition: يربط بين وكيل ومسؤول مُنح صلاحيات الإدارة فيها للعمل من أجل مصلحتها. @ar
definition: 将一个行为者与在一个行为者中被赋予为其利益行动的权力一个任职者关联起来。 @zh-hans

is trustee of
lexical alias: trusteeOf.en
status: Published
type: Property
label: edunvalvoja (toimija) @fi
label: er forvalter af @da
label: is trustee van @nl
label: ist Treuhänderin/Treuhänder von @de
label: vezetője a következőnek: @hu
label: çevirmendir @tr
label: هو مدير عام لـ @ar
label: 是……的受托人 @zh-hans
sub property of: is officer of
inverse of: has trustee
definition: Bir temsilciyi, bir memura kendi yararına hareket etmesi için yönetim yetkileri veren bir temsilciyle ilişkilendirir. @tr
definition: Hozzákapcsol egy ágenst egy ágenshez, amely adminisztratív hatalommal ruházza fel egy tisztviselőt, hogy az ágens javára cselekedjen. @hu
definition: Liittää toimijan yhteistoimijaan, jossa toimihenkilöllä on valtuudet tehdä päätöksiä yhteisön eduksi. @fi
definition: Relaterer en agent til en agent, der giver administrationsbeføjelser til en embedsmand til at agere i dens interesse. @da
definition: Relates an agent to an agent who grants powers of administration to an officer in order to act for its benefit.
definition: Setzt einen Akteur in Beziehung zu einem Akteur, der einer leitenden Angestellten/einem leitenden Angestellten die Verwaltungsvollmachten überträgt, um zu dessen Nutzen zu agieren. @de
definition: يربط بين وكيل ووكيل مُنح صلاحيات الإدارة فيها للعمل من أجل مصلحتها. @ar
definition: 将一个行为者与赋予一个任职者为其利益行动的权力的一个行为者关联起来。 @zh-hans

has note on identifier for resource
lexical alias: noteOnIdentifierForResource.en
status: Published
type: Property
label: har note om identifikator for ressourcen @da
label: hat Anmerkung zum Identifikator für eine Ressource @de
label: heeft noot bij identificatie van resource @nl
label: huomautus aineiston tunnisteesta @fi
label: kaynağın tanımlayıcısı hakkında not ile ilişkilidir @tr
label: megjegyzése azonosítóról a következő forráshoz: @hu
label: له تبصرة عن محدد لمصدر @ar
label: 有关于资源的标识符的附注 @zh-hans
sub property of: has note on resource
definition: Bir kaynağı, bir kaynak için bir tanımlayıcı hakkında bilgi sağlayan kaynakla ilgili bir notla ilişkilendirir. @tr
definition: Hozzákapcsol egy forrást egy forrásra tett megjegyzéshez, amely információt nyújt egy forrásnak szánt azonosítóról. @hu
definition: Liittää aineiston huomautukseen, joka sisältää tietoa aineiston tunnisteesta. @fi
definition: Relaterer en ressource til en note, der giver oplysninger om identifikatorer for ressourcen, der ikke fremgår af identifikatorangivelsen for ressourcen. @da
definition: Relates a resource to a note on resource that provides information on an identifier for a resource.
definition: Setzt eine Ressource in Beziehung zu einer Anmerkung zur Ressource, die Informationen über einen Identifikator für eine Ressource enthält. @de
definition: يربط بين مصدر وتبصرة على مصدر تعطي معلومات عن معرف لمصدر. @ar
definition: 将一个资源与提供关于一种资源的一个标识符的信息的一个关于资源的附注关联起来。 @zh-hans

has editorial director
see also: has editor (Deprecated
lexical alias: editorialDirector.en
status: Published
type: Property
label: főszerkesztője a következő: @hu
label: har ansvarshavende redaktør @da
label: hat Chefredakteurin/Chefredakteur @de
label: heeft hoofdredacteur @nl
label: toimituspäällikkö aineistossa @fi
label: yayın yönetmeni ile ilişkilidir @tr
label: له مدير تحرير @ar
label: 有主编 @zh-hans
sub property of: has other agent associated with resource (Deprecated)
inverse of: is editorial director of
definition: Aineisto, jossa toimija on juridisesti tai tiedollisesti, mutta ei luovasti, vastuussa diakronisen aineiston toimituslinjasta ja sisällöstä. @fi
definition: Bir kaynağı, bir artzamanlı kaynağın içeriği için yasal veya fikri sorumluluğu olan ancak yaratıcı sorumluluğu olmayan bir temsilci ile ilişkilendirir. @tr
definition: Hozzákapcsol egy forrást egy ágenshez, amelynek jogi vagy szellemi, de nem alkotói felelőssége van egy diakronikus forrás szerkesztési politikájáért és tartalmáért. @hu
definition: Relaterer en ressource til en agent, der er juridisk og/eller intellektuelt ansvarlig for indholdet, bortset fra dets skabelse, af et periodikum, en integrerende ressource eller et flerbindsværk. @da
definition: Relates a resource to an agent who has legal or intellectual responsibility, but not creative responsibility, for the editorial policy and content of a diachronic resource.
definition: Setzt eine Ressource in Beziehung zu einem Akteur, der die rechtliche oder intellektuelle, aber keine kreative, Verantwortung für die redaktionelle Vorgehensweise und den Inhalt einer diachronen Ressource trägt. @de
definition: يربط مصدر بوكيل يتحمل مسؤولية قانونية أو مسؤولية فكرية، ولا يتحمل مسؤولية إبداعية، بشأن سياسة تحريرية ومحتوى مصدر ممتد زمنيا. @ar
definition: 将一种资源与有对一种历时资源的编辑政策和内容的法律或知识责任（但非创作责任）的一个行为者关联起来。 @zh-hans

is editorial director of
see also: is editor of
lexical alias: editorialDirectorOf.en
status: Published
type: Property
label: er ansvarshavende redaktør af @da
label: főszerkesztője a következőnek: @hu
label: is hoofdredacteur van @nl
label: ist Chefredakteurin/Chefredakteur von @de
label: toimituspäällikkö (toimija) @fi
label: yayın yönetmenidir @tr
label: هو مدير تحرير لـ @ar
label: 是……的主编行为者 @zh-hans
sub property of: is other agent associated with resource of (Deprecated)
inverse of: has editorial director
definition: Bir temsilciyi, bir seri, bütünleştirici kaynak veya çok parçalı monografik kaynağın içeriği için oluşturma dışında bir sorumluluk içeren bir kaynakla ilişkilendirir. @tr
definition: Hozzákapcsol egy ágenst egy forráshoz, amelyhez hozzátartozik a tartalom létrehozásán kívüli felelősség egy sorozatért, integráló forrásért vagy többrészes monografikus forrásért. @hu
definition: Liittää toimijan aineistoon, jossa toimija on juridisesti tai tiedollisesti, mutta ei luovasti, vastuussa diakronisen aineiston toimituslinjasta ja sisällöstä. @fi
definition: Relaterer en agent, der er juridisk og/eller intellektuelt ansvarlig for indholdet, bortset fra dets skabelse, af et periodikum, en integrerende ressource eller et flerbindsværk til en ressource. @da
definition: Relates an agent to a resource that involves a responsibility other than creating for the content of a serial, integrating resource, or multipart monographic resource.
definition: Setzt einen Akteur in Beziehung zu einer Ressource, die mit einer anderen Verantwortung verbunden ist, als den Inhalt einer fortlaufenden, integrierenden oder mehrteiligen monografischen Ressource zu erstellen. @de
definition: يربط بين وكيل ومصدر ينطوي على مسؤولية تختلف عن إنشاء محتوى تسلسلي، مصدر متكامل، أو مصدر دراسات متعددة الأجزاء. @ar
definition: 将一个行为者与涉及对一种连续出版物、集成性资源或多部分单行资源的内容创作以外的责任的一种资源关联起来。 @zh-hans

has founder agent of resource
lexical alias: founderAgentOfResource.en
status: Published
type: Property
label: aineiston perustaja @fi
label: forrás alapító ágense a következő: @hu
label: har stifter af ressource @da
label: hat Begründerin/Begründer einer Ressource @de
label: heeft oprichter-actor van resource @nl
label: kaynağın kurucu temsilcisi ile ilişkilidir @tr
label: له وكيل مؤسس لمصدر @ar
label: 有资源的创办者行为者 @zh-hans
sub property of: has other agent associated with resource (Deprecated)
inverse of: is founder agent of resource of
definition: Bir kaynağı, artzamanlı bir kaynağı başlatmaktan sorumlu olan bir temsilci ile ilişkilendirir. @tr
definition: Hozzákapcsol egy forrást egy ágenshez, amely felelős egy diakronikus forrás indításáért. @hu
definition: Liittää aineiston toimijaan, joka on vastannut diakronisen teoksen alullepanosta. @fi
definition: Relaterer en ressource til en agent, der er ansvarlig for at have etableret et periodikum, en integrerende ressource eller et flerbindsværk. @da
definition: Relates a resource to an agent who is responsible for initiating a diachronic resource.
definition: Setzt eine Ressource in Beziehung zu einem Akteur, der für das Begründen einer diachronen Ressource verantwortlich ist. @de
definition: يربط مصدر بوكيل مسؤول عن البدء في مصدر ممتد زمنيًا. @ar
definition: 将一种资源与负责发起一种历时资源的一个行为者关联起来。 @zh-hans

is founder agent of resource of
lexical alias: founderAgentOfResourceOf.en
status: Published
type: Property
label: alapító ágense a következő forrásnak: @hu
label: er stifter af værk til @da
label: is oprichter-actor van resource van @nl
label: ist Begründerin/Begründer einer Ressource von @de
label: kaynağının kurucu temsilcisidir @tr
label: perustaja (toimija) aineistossa @fi
label: هو وكيل مؤسس لمصدر لـ @ar
label: 是……的资源的创办者 @zh-hans
sub property of: is other agent associated with resource of (Deprecated)
inverse of: has founder agent of resource
definition: Bir temsilciyi, bir seri, bütünleyici kaynak veya çok parçalı monograf oluşturmakla görevli bir temsilcinin sorumluluğunu içeren bir kaynakla ilişkilendirir. @tr
definition: Hozzákapcsol egy ágenst egy forráshoz, amelyhez hozzátartozik az ágens felelőssége sorozat, integráló forrás vagy többrészes monografikus forrás alapításáért. @hu
definition: Liittää toimijan aineistoon, johon liittyy toimijan vastuu sarja-aineiston, päivittyvän aineiston tai moniosaisen monografian luomisesta. @fi
definition: Relaterer en agent, der er ansvarlig for at have etableret et periodikum, en integrerende ressource eller et flerbindsværk til en ressource. @da
definition: Relates an agent to a resource that involves a responsibility of an agent for establishing a serial, integrating resource, or multipart monograph.
definition: Setzt einen Akteur in Beziehung zu einer Ressource, die mit einer Verantwortung eines Akteurs verbunden ist, eine fortlaufende, integrierende oder mehrteilig monografische Ressource einzuführen. @de
definition: يربط بين وكيل ومصدر ينطوي على مسؤولية وكيل إنشاء سلسلة، مصدر متكامل، أو دراسات متعددة الأجزاء. @ar
definition: 将一个行为者与涉及创办一种连续出版物、集成性资源或多部分单行出版物的一个行为者的责任的一种资源关联起来。 @zh-hans

has aspect ratio designation
lexical alias: aspectRatioDesignation.en
status: Published
type: Property
label: en boy oranı tanımı ile ilişkilidir @tr
label: har billedformatbetegnelse @da
label: hat Bezeichnung eines Bildformats @de
label: heeft aspectratio-aanduiding @nl
label: kuvasuhdemäärite aineistolle @fi
label: képarányjelölése a következő: @hu
label: له تسمية نسب باعية @ar
label: 有宽高比标识 @zh-hans
definition: Bir kaynağı, hareketli bir görüntünün genişliğinin yüksekliğine oranının genel bir tanımıyla ilişkilendirir. @tr
definition: Hozzákapcsol egy forrást egy mozgókép szélességének a magassághoz való arányáról szóló általános megjelöléshez. @hu
definition: Liittää aineiston liikkuvan kuvan aineiston leveyden ja korkeuden välisen suhteen yleiseen määritteeseen. @fi
definition: Relaterer en ressource til en almindelig betegnelse for det numeriske forhold mellem bredde og højde i et levende billede. @da
definition: Relates a resource to a general designation of the ratio of the width to the height of a moving image.
definition: Setzt eine Ressource in Beziehung zu einer allgemeinen Bezeichnung des Verhältnisses von Breite zu Höhe eines Bewegtbilds. @de
definition: يربط بين مصدر وتسمية عامة لنسبة من العرض إلى ارتفاع لصورة متحركة. @ar
definition: 将一种资源与一种动态图像的宽和高的比之一般标识关联起来。 @zh-hans

has scale designation
lexical alias: scaleDesignation.en
status: Published
type: Property
label: har målestoksbetegnelse @da
label: hat Maßstabsbezeichnung @de
label: heeft schaalaanduiding @nl
label: mittakaavan määrite aineistolle @fi
label: méretarány-jelölése a következő: @hu
label: ölçek tanımlaması ile ilişkilidir @tr
label: له تسمية مقياس @ar
label: 有比例尺标识 @zh-hans
definition: Bir kaynağı, bir görüntünün veya üç boyutlu formun içeriğinin boyutlarının temsil ettiği şeyin boyutlarına oranının eksikliğinin genel bir tanımıyla ilişkilendirir. @tr
definition: Hozzákapcsol egy forrást egy általános megjelöléshez, amely egy kép vagy egy háromdimenziós forma tartalmi dimenzióinak és az általa ábrázolt dolog dimenzióinak arányának hiányára vonatkozik. @hu
definition: Liittää aineiston yleiseen määritteeseen kuvan tai kolmiulotteisen muodon ja niiden esittämän asian mittojen välisten mittasuhteiden puuttumisesta. @fi
definition: Relaterer en ressource til en almindelig betegnelse for manglen på forhold mellem indholdet af et billede eller en tredimensionel form, og dimensionerne for den ting, billedet eller formen repræsenterer. @da
definition: Relates a resource to a general designation of a lack of a ratio of the dimensions of the content of an image or three-dimensional form to the dimensions of the thing it represents.
definition: Setzt eine Ressource in Beziehung zu einer allgemeinen Bezeichnung für ein fehlendes Verhältnis der Abmessungen des Inhalts eines Bilds oder einer dreidimensionalen Form zu den Abmessungen der Sache, das es/sie repräsentiert. @de
definition: يربط بين مصدر وتسمية عامة لنقص نسبة أبعاد محتوى صورة أو شكل ثلاثي الأبعاد إلى أبعاد الشيء الذي تمثله. @ar
definition: 将一种资源与关于一个图像或三维形式之内容的尺寸与其所表示的事物之尺寸之比缺失的一般标识关联起来。 @zh-hans

has cartographic data type
lexical alias: cartographicDataType.en
status: Published
type: Property
label: aineiston kartografinen tietotyyppi @fi
label: har kartografisk datatype @da
label: hat kartografischen Datentyp @de
label: heeft cartografisch datatype @nl
label: kartografik veri türü ile ilişkilidir @tr
label: kartográfiai adattípusa a következő: @hu
label: له نوع بيانات خرائطية @ar
label: 有地图数据类型 @zh-hans
sub property of: has digital representation of cartographic content
definition: Bir kaynağı, jeo-uzamsal özelliklerin makine tarafından okunabilen bir temsiliyle ilişkilendirir. @tr
definition: Hozzákapcsol egy forrást térinformatikai jellemzők géppel olvasható ábrázolásához. @hu
definition: Liittää aineiston maantieteellisten ominaisuuksien konelukuiseen esitykseen. @fi
definition: Relaterer en ressource til en maskinlæsbar repræsentation af geospatiale træk. @da
definition: Relates a resource to a machine-readable representation of geospatial features.
definition: Setzt eine Ressource in Beziehung zu einer maschinenlesbaren Darstellung von Geodaten. @de
definition: يربط بين مصدر وتمثيل مقروء آليًا لملامح جغرافية مكانية. @ar
definition: 将一种资源与地理空间特征的机器可读表现关联起来。 @zh-hans

has details of cartographic data type
lexical alias: detailsOfCartographicDataType.en
status: Published
type: Property
label: aineiston kartografisen tietotyypin tarkemmat tiedot @fi
label: har detaljer om kartografisk datatype @da
label: hat Details zum kartografischen Datentyp @de
label: heeft details van cartografisch datatype @nl
label: kartografik veri türünün ayrıntıları ile ilişkilidir @tr
label: kartográfiai adattípus részletei következők: @hu
label: له تفاصيل عن نوع بيانات خرائطية @ar
label: 有地理数据类型的细节 @zh-hans
definition: Bir kaynağı, jeo-uzamsal özelliklerin makine tarafından okunabilir temsilinin ayrıntılarıyla ilişkilendirir. @tr
definition: Hozzákapcsol egy forrást térinformatikai jellemzők géppel olvasható ábrázolásának részleteihez. @hu
definition: Liittää aineiston tarkempiin tietoihin maantieteellisten ominaisuuksien konelukuisesta esityksestä. @fi
definition: Relaterer en ressource til detaljer om en maskinlæsbar repræsentation af geospatiale træk. @da
definition: Relates a resource to details of a machine-readable representation of geospatial features.
definition: Setzt eine Ressource in Beziehung zu den Details zu einer maschinenlesbaren Darstellung von Geodaten. @de
definition: يربط بين مصدر وتفاصيل عن تمثيل مقروء آليًا لملامح جغرافية مكانية. @ar
definition: 将一种资源与地理空间特征的机器可读表现的细节关联起来。 @zh-hans

has reduction ratio designation
lexical alias: reductionRatioDesignation.en
status: Published
type: Property
label: csökkenési arányjelölése a következő: @hu
label: har reduktionsforholdsbetegnelse @da
label: hat Bezeichnung des Verkleinerungsfaktors @de
label: heeft aanduiding verkleiningfactor @nl
label: küçültme oranı tanımlaması ile ilişkilidir @tr
label: pienennyssuhteen määrite aineistolle @fi
label: له تسمية نسبة تصغير الصور @ar
label: 有缩率标识 @zh-hans
definition: Bir kaynağı, üretildiği bir orijinale göre bir mikro görüntünün boyutunun genel bir tanımıyla ilişkilendirir. @tr
definition: Hozzákapcsol egy forrást egy általános megjelöléshez, amely a mikrokép méretének az eredetiből viszonyított számarányára vonatkozik, amelyből azt előállították. @hu
definition: Liittää aineiston yleiseen määritteeseen, joka ilmaisee mikrokokoiseksi pienennetyn kuvan suhteen alkuperäiseen kuvaan, josta pienennetty kuva on tuotettu. @fi
definition: Relaterer en ressource til en almindelig betegnelse for størrelsen på et mikrobillede i forhold til den original, som det er fremstillet ud fra. @da
definition: Relates a resource to a general designation of the size of a micro-image in relation to an original from which it was produced.
definition: Setzt eine Ressource in Beziehung zu einer allgemeinen Bezeichnung für die Größe eines Mikro-Bilds im Verhältnis zum Original, von dem es hergestellt wird. @de
definition: يربط بين مصدر وتسمية عامة لحجم الصورة المصغرة وعلاقتها بالأصل الذي تم إنتاجها منه. @ar
definition: 将一种资源与缩微图像尺寸和其所复制的原件之间关系的一般标识关联起来。 @zh-hans

has surname
lexical alias: surname.en
status: Published
type: Property
label: har efternavn @da
label: hat Nachname @de
label: heeft achternaam @nl
label: soyadı ile ilişkilidir @tr
label: toimijan sukunimi @fi
label: vezetékneve a következő: @hu
label: له اسم عائلة @ar
label: 有姓 @zh-hans
inverse of: is surname of
definition: Bir temsilciyi, aile adı olarak kullanılan bir isimle ilişkilendirir. @tr
definition: Hozzákapcsol egy ágenst egy vezetéknévként használt névhez. @hu
definition: Liittää toimijan suvun nimenä käytettyyn nimeen. @fi
definition: Relaterer en agent til et navn, der anvendes som familienavn. @da
definition: Relates an agent to a name used as a family name.
definition: Setzt einen Akteur in Beziehung zu einem Namen, der als Familienname benutzt wird. @de
definition: يربط بين وكيل واسم يُستخدم كاسم عائلة. @ar
definition: 将一个行为者与用作家族姓氏的一个名称关联起来。 @zh-hans

has given name
lexical alias: givenName.en
status: Published
type: Property
label: adı ile ilişkilidir @tr
label: har fornavn @da
label: hat Vornamen @de
label: is voornaam @nl
label: toimijan etunimi @fi
label: utóneve a következő: @hu
label: له اسم أول @ar
label: 有名 @zh-hans
inverse of: is given name of
definition: Bir temsilciyi, bir temsilciye doğumda veya daha sonraki bir noktada soyadına ek olarak veya soyadı yerine verilen bir isimle ilişkilendirir. @tr
definition: Hozzákapcsol egy ágenst egy névhez, amelyet az ágens születésekor kapott vagy később vett fel, és a vezetéknevével együtt vagy ahelyett használja. @hu
definition: Liittää toimijan nimeen, joka on annettu toimijalle syntymässä tai myöhempänä ajankohtana sukunimen lisäksi tai sen sijaan. @fi
definition: Relaciona un agent amb un nomen que és un nom d’agent donat al moment del naixement o en algun moment posterior, a més de, o en lloc d’un cognom. @ca
definition: Relaterer en agent til et navn, der gives til en agent ved fødslen eller, på et senere tidspunkt oveni, eller i stedet for, et efternavn. @da
definition: Relates an agent to a nomen that is a name of agent given at birth or at some later point in addition to, or instead of, a surname.
definition: Setzt einen Akteur in Beziehung zu einem Namen, der ihm bei der Geburt oder zu einem späteren Zeitpunkt, zusätzlich oder anstatt eines Nachnamens, gegeben wird. @de
definition: يربط بين وكيل واسم أطلق على وكيل عند ولادته أو لاحقا مضافا إليه اسم عائلة أو عوضا عنه. @ar
definition: 将一个行为者与作为行为者在出生时候或之后某时候被给予、姓以外附加或替代姓的一个名称的命名关联起来。 @zh-hans

has variant name of place
lexical alias: variantNameOfPlace.en
status: Published
type: Property
label: har variantnavn for et sted @da
label: hat abweichenden Namen eines Geografikums @de
label: heeft variant naam van plaats @nl
label: helynévváltozata a következő: @hu
label: paikan varianttinimi @fi
label: yerin alternatif ismi ile ilişkilidir @tr
label: له اسم مختلف لمكان @ar
label: 有地点的变异名称 @zh-hans
sub property of: has name of place
inverse of: is variant name of place of
definition: Bir yeri, belirli bir uygulama veya bağlamda tercih edilmeyen bir yer adıyla ilişkilendirir. @tr
definition: Hozzákapcsol egy helyet egy helynévhez, amelyet egy adott alkalmazásban vagy összefüggésben nem részesítenek előnyben. @hu
definition: Liittää paikan paikannimeen, jota ei ole valittu ensisijaiseksi tietyssä sovelluksessa tai kontekstissa. @fi
definition: Relaterer et sted til en navn eller navneform, hvorunder et sted er kendt, og som adskiller sig fra det navn eller den navneform, der er valgt som foretrukket navn. @da
definition: Relates a place to a name of place that is not selected for preference in a specific application or context.
definition: Setzt ein Geografikum in Beziehung zu einem Namen eines Geografikums, der in einer bestimmten Anwendung oder in einem bestimmten Kontext nicht als Vorzugsform bestimmt wird. @de
definition: يربط بين مكان واسم مكان لم يتم اختياره كاسم مختلف مفضل في تطبيق معين أو في سياق معين. @ar
definition: 将一个地点与在一个特定的应用或语境中未被首选的一个地点名称关联起来。 @zh-hans

is remix artist of
see also: is DJ of
lexical alias: remixArtistOf.en
status: Published
type: Property
label: er remixer til @da
label: is remixartiest van @nl
label: ist Remix Artist von @de
label: remix sanatçısıdır @tr
label: remixművésze a következőnek: @hu
label: uudelleenmiksaaja (toimija) aineistossa @fi
label: هو فنان ريميكس لـ @ar
label: 是……的合成艺术家 @zh-hans
sub property of: is creator of
inverse of: has remix artist
definition: Bir temsilciyi, önceden kaydedilmiş sesleri düzenleme, yeniden birleştirme, karıştırma ve yeniden üretmeyle görevli bir temsilcinin sorumluluğunu içeren bir kaynakla ilişkilendirir. @tr
definition: Hozzákapcsol egy ágenst egy forráshoz, amelyhez hozzátartozik egy ágens felelőssége korábbi hangfelvételek manipulálásáért, újrakombinálásáért, keveréséért és reprodukálásáért. @hu
definition: Liittää toimijan aineistoon, jossa toimija vastaa aiemmin äänitettyjen äänten manipuloimisesta, yhdistelemisestä, sekoittamisesta ja uudelleen tuottamisesta. @fi
definition: Relaterer en agent til en lydressource, skabt ved at manipulere, rekombinere, mixet og reproducere tidligere indspillede lyde. @da
definition: Relates an agent to a resource that involves a responsibility of an agent for manipulating, recombining, mixing, and reproducing previously recorded sounds.
definition: Setzt einen Akteur in Beziehung zu einer Ressource, bei der ein Akteur für das Bearbeiten, Rekombinieren, Mischen und Reproduzieren einer bestehenden Tonaufnahme verantwortlich ist. @de
definition: يربط بين وكيل ومصدر ينطوي على مسؤولية وكيل عن معالجة المواد السمعية المسجلة مسبقًا وإعادة تجميعها ومزجها واستنساخها. @ar
definition: 将一个行为者与涉及操纵、重新组合、混合和复制事先录制的声音的一个行为者的责任的一种资源关联起来。 @zh-hans
scope note: Darunter fallen keine Nachbearbeitungen, die weder Art noch Inhalt der Originalressource wesentlich verändern, sowie das Zusammenmischen von aufgenommenen Einzelspuren (Kanälen) zu einem scheinbar ununterbrochen durchgehenden Klangerlebnis. @de
scope note: Ei kata uudelleenmiksaamista, joka ei oleellisesti muuta alkuperäisen teoksen luonnetta ja sisältöä eikä aiemmin äänitettyjen musiikkikappaleiden yhdistämistä yhdeksi musiikkikappaleeksi. @fi
scope note: Nem tartoznak ide sem azok a remixelési tevékenységek, amelyek nem változtatják meg lényegesen az eredeti forrás jellegét és tartalmát, sem a rögzített sávok látszólag egy folyamatos sávként való összemixelése. @hu
scope note: Orijinal kaynağın niteliğini ve içeriğini önemli ölçüde değiştirmeyen remiks faaliyetleri ve kaydedilen parçaların kesintisiz tek bir parça olarak görünecek şekilde birbirine karıştırılması hariçtir. @tr
scope note: Remixaktiviteter der ikke væsentligt ændrer natur og indhold på den oprindelige ressource, og miksning af indspillede lydspår til at fremstå som et uafbrudt spor ekskluderes. @da
scope note: Remixing activities that do not substantially change the nature and content of the original resource, and mixing recorded tracks together to appear as one continuous track are excluded.
scope note: تُستبعد أنشطة إعادة المزج التي لا تغير بشكل جوهري طبيعة ومحتوى المصدر الأصلي، وأنشطة مزج المسارات المسجلة لكي تبدو مسارًا واحدًا مستمرًا. @ar
scope note: 不包括不实质性改变原资源的性质和内容的合成活动、以及将录制的音轨混合成一个连续的音轨的活动。 @zh-hans

is casting director of
lexical alias: castingDirectorOf.en
status: Published
type: Property
label: cast yönetmenidir @tr
label: er casting director for @da
label: is castingdirector van @nl
label: ist Casting Director von @de
label: roolittaja (toimija) aineistossa @fi
label: szereposztó rendezője a következőnek: @hu
label: هو مدير طاقم التمثيل لـ @ar
label: 是……的角色导演 @zh-hans
sub property of: is creator of
inverse of: has casting director
definition: Bir temsilciyi, performans gösterenlere parça ve görev atamanın çoğu yönünden sorumlu bir temsilcinin sorumluluğunu içeren bir kaynakla ilişkilendirir. @tr
definition: Hozzákapcsol egy ágenst egy forráshoz, amelyhez hozzátartozik egy ágens felelőssége a szerepek és feladatok előadókra osztásának legtöbb vonatkozásáért. @hu
definition: Liittää toimijan aineistoon, jossa toimija vastaa useimmista esiintyjien roolien ja tehtävien antamiseen kuuluvista tehtävistä. @fi
definition: Relaterer en agent til en ressource, der inkorporerer et bidrag ved ansvar for de fleste aspekter af at tildele roller og opgaver til performere. @da
definition: Relates an agent to a resource that involves a responsibility of an agent for most aspects of assigning parts and duties to performers.
definition: Setzt einen Akteur in Beziehung zu einer Ressource, bei der ein Akteur für die meisten Aspekte der Rollenvergabe und Aufgabenzuteilung an Ausführende verantwortlich ist. @de
definition: يربط بين وكيل ومصدر ينطوي على مسؤولية وكيل عن تحديد معظم الجوانب المتعلقة بأدوار الممثلين ومهامهم. @ar
definition: 将一个行为者与涉及给演员分配角色和任务的大多数工作的一个行为者的责任的一种资源关联起来。 @zh-hans

is audio producer of
lexical alias: audioProducerOf.en
status: Published
type: Property
label: audio-producere a következőnek: @hu
label: er lydproducer for @da
label: is geluidsproducent van @nl
label: ist Produzentin/Produzent einer Tonaufnahme von @de
label: ses yapımcısıdır @tr
label: äänituottaja (toimija) aineistossa @fi
label: هو منتج مواد صوتية لـ @ar
label: 是……的音频制作者 @zh-hans
sub property of: is producer of
inverse of: has audio producer
definition: Bir temsilciyi, bir ses kaydının ticari yönlerinin çoğunu yönetmekle görevli bir temsilcinin sorumluluğunu içeren bir kaynakla ilişkilendirir. @tr
definition: Hozzákapcsol egy ágenst egy forráshoz, amelyhez hozzátartozik egy ágens felelőssége egy audiofelvétel legtöbb üzleti vonatkozásának menedzseléséért. @hu
definition: Liittää toimijan aineistoon, jossa toimija vastaa useimpien äänitteen liiketoiminnallisten tehtävien hoitamisesta. @fi
definition: Relaterer en agent til en ressource, der involverer et ansvar for de fleste forretningsmæssige aspekter af en lydoptagelse. @da
definition: Relates an agent to a resource that involves a responsibility of an agent for managing most of the business aspects of an audio recording.
definition: Setzt einen Akteur in Beziehung zu einer Ressource, bei der ein Akteur für die meisten geschäftlichen Aspekte einer Audioaufnahme verantwortlich ist. @de
definition: يربط بين وكيل ومصدر ينطوي على مسؤولية وكيل عن إدارة معظم جوانب الأعمال التجارية للتسجيل الصوتي. @ar
definition: 将一个行为者与涉及音频录制工作大多数方面之管理的一个行为者的责任的一种资源关联起来。 @zh-hans

is audio engineer of
has subproperty: is mixing engineer of
lexical alias: audioEngineerOf.en
status: Published
type: Property
label: er lydtekniker i @da
label: hangmestere a következőnek: @hu
label: is geluidstechnicus van @nl
label: ist Tontechnikerin/Tontechniker von @de
label: ses mühendisidir @tr
label: ääniteknikko (toimija) aineistossa @fi
label: هو مهندس صوت لـ @ar
label: 是……的音频工程师 @zh-hans
sub property of: has other agent associated with a resource (Deprecated)
inverse of: has audio engineer
definition: Bir temsilciyi, kayıt, miksaj ve yeniden üretim süreçleri sırasında sesin teknik yönlerini yöneten bir temsilcinin katkısını içeren bir kaynakla ilişkilendirir. @tr
definition: Hozzákapcsol egy ágenst egy forráshoz, amely magában foglalja az ágens közreműködését a hang technikai vonatkozásainak kezelésében a rögzítés, a keverés és a sokszorosítás folyamatában. @hu
definition: Liittää toimijan aineistoon, jossa toimija on osallisena valvomalla äänen teknisiä ominaisuuksia äänityksen, miksauksen ja toiston aikana. @fi
definition: Relaterer en agent til een ressource, der inkorporerer et bidrag til lydindholdet ved overvågning af de tekniske lydaspekter under processen med indspilning, mixning og reproduktion. @da
definition: Relates an agent to a resource that includes a contribution by an agent of managing the technical aspects of sound during the processes of recording, mixing, and reproduction.
definition: Setzt einen Akteur in Beziehung zu einer Ressource, zu der ein Akteur beiträgt, indem er die technischen Aspekte für den Ton während der Aufnahme, des Misch-Verfahrens und der Vervielfältigung handhabt. @de
definition: يربط بين وكيل ومصدر يتضمن إسهام وكيل في إدارة الجوانب الفنية للصوت أثناء عمليات التسجيل والمزج والاستنساخ. @ar
definition: 将一个行为者与包括声音的录制、合成和复制过程技术方面管理的一个行为者的贡献的一种资源关联起来。 @zh-hans

is mixing engineer of
see also: is remix artist of
lexical alias: mixingEngineerOf.en
status: Published
type: Property
label: er mixing engineer i @da
label: hangkeverője a következőnek: @hu
label: is mixtechnicus van @nl
label: ist Mischtontechnikerin/Mischtontechniker von @de
label: miksaaja (toimija) aineistossa @fi
label: ses miksaj mühendisidir @tr
label: هو مهندس مكساج لـ @ar
label: 是……的合成工程师 @zh-hans
sub property of: is audio engineer of
inverse of: has mixing engineer
definition: Bir temsilciyi, bir ses kaydının birden çok parçasını değiştirme, karıştırma ve birleştirme konusunda bir temsilcinin katkısını içeren bir kaynakla ilişkilendirir. @tr
definition: Hozzákapcsol egy ágenst egy forráshoz, amely magában foglalja az ágens közreműködését egy hangfelvétel sávjainak manipulálásában, keverésében és összeállításában. @hu
definition: Liittää toimijan aineistoon, jossa toimija on osallisena aineiston äänisisällössä käsittelemällä, miksaamalla ja yhdistelemällä useampia äänitteen raitoja. @fi
definition: Relaterer en agent til en ressource, der inkorporerer et bidrag til lydindholdet ved at manipulere, mixe og samle en indspilnings forskellige spor. @da
definition: Relates an agent to a resource that incorporates a contribution by an agent of manipulating, mixing and assembling the multiple tracks of an audio recording.
definition: Setzt einen Akteur in Beziehung zu einer Ressource, zu der ein Akteur beiträgt, indem er mehrere Tonspuren einer Aufnahme bearbeitet, mischt und zusammenlegt. @de
definition: يربط بين وكيل ومصدر يتضمن إسهام وكيل في معالجة المسارات المتعددة لتسجيل صوتي ومزجها وتجميعها. @ar
definition: 将一个行为者与包括操纵、合成和聚集一个录音的多个音轨的一个行为者的贡献的一种资源关联起来。 @zh-hans
scope note: Darunter fallen keine Nachbearbeitungen, die die Art und den Inhalt der Originalressource substantiell verändern, so dass eine neue Ressource entsteht. @de
scope note: Ei koske uudelleenmiksauksia, jotka olennaisesti muuttavat alkuperäisen aineiston luonnetta ja sisältöä, mikä johtaa uuteen aineistoon. @fi
scope note: Olyan újrakeverési vagy remixelő tevékenység, amely az eredeti forrás természetét és tartalmát lényegesen megváltoztatja és forrást művet eredményez, nem tartozik ide. @hu
scope note: Orijinal kaynağın niteliğini ve içeriğini önemli ölçüde değiştirerek yeni bir kaynakla sonuçlanan remiks faaliyetleri hariçtir. @tr
scope note: Remixing activities that substantially change the nature and content of the original resource, resulting in a new resource, are excluded.
scope note: Remixingaktiviteter der fortrinsvis ændrer natur og indhold på en oprindelig ressource og derved resulterer i en ny ressource, er ikke omfattet. @da
scope note: تُستبعد أنشطة إعادة المزج التي تغير بشكل جوهري طبيعة ومحتوى المصدر الأصلي، إلى حد ينتج معه مصدر جديد. @ar
scope note: 不包括实质性改变原资源的性质和内容导致一种新的资源的合成活动。 @zh-hans

is DJ of
see also: is mixing engineer of
lexical alias: DJOf.en
status: Published
type: Property
label: DJ (toimija) @fi
label: DJ'idir @tr
label: DJ-je a következőnek: @hu
label: er dj i @da
label: is deejay van @nl
label: ist DJ von @de
label: هو منسق دي جي لـ @ar
label: 是……的打碟者 @zh-hans
sub property of: has other agent associated with a resource (Deprecated)
inverse of: has DJ
definition: Bir temsilciyi, canlı bir performans sırasında veya bir kayıt stüdyosunda kesintisiz bir parça olarak görünmek üzere kaydedilmiş parçaları karıştıran temsilcinin katkısını içeren bir kaynakla ilişkilendirir. @tr
definition: Hozzákapcsol egy ágenst egy forráshoz, amely magában foglalja az ágens közreműködését felvett hangsávok élő előadás közben vagy egy hangstúdióban történő keverésében, hogy azok egy folyamatos műsorszámként jelenjenek meg. @hu
definition: Liittää toimijan aineistoon, jossa toimija on osallisena miksaamalla ääniraitoja yhteen yhtäjaksoiseksi raidaksi live-esityksessä tai äänitysstudiossa. @fi
definition: Relaterer en agent til en ressource, der inkorporerer et bidrag ved at mikse indspillede spor sammen under en live-optræden eller i et indspilningsstudie så at de fremstår som et uafbrudt spor. @da
definition: Relates an agent to a resource that includes a contribution by an agent of mixing recorded tracks together during a live performance or in a recording studio to appear as one continuous track.
definition: Setzt einen Akteur in Beziehung zu einer Ressource, zu der ein Akteur beiträgt, indem er während eines Live-Auftritts oder in einem Aufnahme-Studio aufgenommene Einzelspuren (Kanäle) zu einem scheinbar ununterbrochen durchgehenden Klangerlebnis zusammen mischt. @de
definition: يربط بين وكيل ومصدر يتضمن إسهام وكيل في مزج ألحان مسجلة أثناء أدائها مباشرة أو أثناء تسجيلها في استوديو لتبدو كمسار واحد مستمر. @ar
definition: 将一个行为者与包括在现场表演中或在录音工作室中混合已录制音轨使其出现为一个连续的音轨的一个行为者的贡献的一种资源关联起来。 @zh-hans
scope note: Darunter fallen keine Nachbearbeitungen, die die Art und den Inhalt der Originalressource substantiell verändern, so dass eine neue Ressource entsteht, sowie das Mischen und Zusammenlegen von mehreren Einzelspuren einer Aufnahme. @de
scope note: Ei koske uudelleenmiksauksia, jotka olennaisesti muuttavat alkuperäisen aineiston luonnetta ja sisältöä, mikä johtaa uuteen aineistoon. Ei koske useiden raitojen miksaamista ja kokoamista. @fi
scope note: Nem tartoznak ide azok az új forrást eredményező újrakeverési tevékenységek, amelyek jelentősen megváltoztatják az eredeti forrás jellegét és tartalmát, sem a felvétel több sávjának keverése és összeállítása. @hu
scope note: Orijinal kaynağın niteliğini ve içeriğini önemli ölçüde değiştirerek yeni bir kaynakla sonuçlanan remiks faaliyetleri ve bir kaydın birden çok parçasını karıştırma ve bir araya getirme faaliyetleri hariçtir. @tr
scope note: Remixing activities that substantially change the nature and content of the original resource, resulting in a new resource, and mixing and assembling the multiple tracks of a recording are excluded.
scope note: Remixingaktiviteter der fortrinsvis ændrer natur og indhold på en oprindelig ressource og derved resulterer i en ny ressource og mixe og samle in indspillings forskellige spor, er ikke omfattet. @da
scope note: تُستبعد أنشطة إعادة المزج التي تغير بشكل جوهري طبيعة ومحتوى المصدر الأصلي، إلى حد ينتج معه مصدر جديد، ومزج وتجميع المسارات المتعددة للتسجيل. @ar
scope note: 不包括实质性改变原资源的性质和内容导致一种新的资源以及混合和聚集一个录音的多个音轨的合成活动。 @zh-hans

is dubbing director of
lexical alias: dubbingDirectorOf.en
status: Published
type: Property
label: dubbausohjaaja (toimija) aineistossa @fi
label: dubbinginstruktør @da
label: dublaj yönetmenidir @tr
label: is stemregisseur van @nl
label: ist Synchronregisseurin/Synchronregisseur von @de
label: szinkronrendezője a következőnek: @hu
label: هو مخرج الدبلجة لـ @ar
label: 是……的混声导演 @zh-hans
sub property of: has other agent associated with a resource (Deprecated)
inverse of: has dubbing director
definition: Bir temsilciyi, bir ses parçasını tamamlamak için yeni diyalog veya diğer seslerin eklenmesi sürecinin genel yönetimi ve denetimi için bir temsilcinin temsilcisinin katkısını içeren bir kaynakla ilişkilendirir. @tr
definition: Hozzákapcsol egy ágenst egy forráshoz, amely magában foglalja egy ágens ágensének közreműködését új párbeszéd vagy más hangok hozzáadási folyamatának általános irányításában és felügyeletében egy hangsáv befejezése, teljessé tétele céljából. @hu
definition: Liittää toimijan aineistoon, jossa toimija on osallisena uuden dialogin tai muiden äänien lisäämisprosessin yleisessä johtamisessa ja valvonnassa aineiston ääniraidan täydentämiseksi. @fi
definition: Relaterer en agent til en ressource, der inkorporerer et bidrag af ansvar for generel ledelse og tilsyn af processen med at tilføje ny dialog eller andre lyde for at lave lydsporet komplet. @da
definition: Relates an agent to a resource that incorporates a contribution by an agent of an agent for the general management and supervision of the process of adding new dialogue or other sounds to complete a sound track.
definition: Setzt einen Akteur in Beziehung zu einer Ressource, zu der ein Akteur beiträgt, indem er das allgemeine Management und die Leitung beim Hinzufügen von neuem Dialog oder anderen Geräuschen übernimmt, um die Tonspur zu vervollständigen. @de
definition: يربط بين وكيل ومصدر يتضمن إسهام وكيل في الإدارة العامة والإشراف على عملية إضافة حوار جديد أو أصوات أخرى لإكمال مقطع صوتي. @ar
definition: 将一个行为者与包括总体管理和监督增加对话或其他声音以完成音轨的一个责任的一个行为者的贡献的一种资源关联起来。 @zh-hans

is music programmer of
see also: is composer of
lexical alias: musicProgrammerOf.en
status: Published
type: Property
label: er musikprogrammør i @da
label: is music programmer van @nl
label: ist Musik-Programmiererin/Musik-Programmierer von @de
label: musiikkiohjelmoija (toimija) aineistossa @fi
label: müzik programcısıdır @tr
label: zeneprogramozója a következőnek: @hu
label: هو مبرمج موسيقي لـ @ar
label: 是……的音乐编程者 @zh-hans
sub property of: has other agent associated with a resource (Deprecated)
inverse of: has music programmer
definition: Bir temsilciyi, ses üretmek için elektronik ses cihazları veya bilgisayar yazılımı kullanan bir temsilcinin katkısını içeren bir müzik kaynağıyla ilişkilendirir. @tr
definition: Hozzákapcsol egy ágenst egy forráshoz, amely magában foglalja az ágens közreműködését hangok generálásában elektronikus audioeszközök vagy számítógépes szoftver használatával. @hu
definition: Liittää toimijan musiikkiaineistoon, jossa toimija on osallisena tuottamalla ääniä sähköisillä äänilaitteilla tai tietokoneohjelmilla. @fi
definition: Relaterer en agent til en musikressource, der inkorporerer et bidrag ved at bruge elektronisk lydapparatur og/eller computersoftware til at skabe lyd. @da
definition: Relates an agent to a musical resource that incorporates a contribution by an agent of using electronic audio devices or computer software to generate sounds.
definition: Setzt einen Akteur in Beziehung zu einer musikalischen Ressource, zu der ein Akteur beiträgt, indem er durch das Einsetzen elektronischer Audio-Geräte oder von Computerprogrammen Klangeffekte erzeugt. @de
definition: يربط بين وكيل ومصدر يتضمن إسهام وكيل في استخدام أجهزة الصوت الإلكترونية أو برمجيات الحاسب لتوليد أصوات. @ar
definition: 将一个行为者与包括使用电子音频设备或计算机软件产生声音的一个行为者的贡献的一种音乐资源关联起来。 @zh-hans

has audio producer
lexical alias: audioProducer.en
status: Published
type: Property
label: audióproducere a következő: @hu
label: har lydproducer @da
label: hat Produzentin/Produzenten einer Tonaufnahme @de
label: heeft geluidsproducent @nl
label: ses yapımcısı ile ilişkilidir @tr
label: äänituottaja aineistossa @fi
label: له منتج مواد صوتية @ar
label: 有音频制作者 @zh-hans
sub property of: has producer
inverse of: is audio producer of
definition: Bir kaynağı, bir ses kaydının ticari yönlerinin çoğunu yönetmekten sorumlu yapımcı olan bir temsilci ile ilişkilendirir. @tr
definition: Hozzákapcsol egy forrást egy producer ágenshez, aki felelős egy hangfelvétel üzleti vonatkozásainak a zöméért. @hu
definition: Liittää aineiston toimijaan, joka on osallisena aineiston tekemisessä huolehtimalla äänen teknisistä näkökohdista äänitys-, miksaus- ja äänentoistoprosessien aikana. @fi
definition: Relaterer en ressource til en producer der er ansvarlig for de fleste forretningsmæssige aspekter af en lydoptagelse. @da
definition: Relates a resource to an agent who is a producer who is responsible for managing most of the business aspects of an audio recording.
definition: Setzt eine Ressource in Beziehung zu einer Produzentin/einem Produzenten, die/der für die meisten geschäftlichen Aspekte einer Audioaufnahme verantwortlich ist. @de
definition: يربط مصدر بوكيل منتج مسؤول عن إدارة معظم جوانب الأعمال التجارية للتسجيل الصوتي. @ar
definition: 将一种资源与作为一个制作者并负责音频录制工作大多数方面商业运作之管理的一个行为者关联起来。 @zh-hans

has casting director
lexical alias: castingDirector.en
status: Published
type: Property
label: har casting director @da
label: hat Casting Director @de
label: heeft castingdirector @nl
label: kast yönetmeni ile ilişkilidir @tr
label: roolittaja aineistossa @fi
label: szereposztó rendezője a következő: @hu
label: له مدير لطاقم التمثيل @ar
label: 有角色导演 @zh-hans
sub property of: has other agent associated with a resource (Deprecated)
inverse of: is casting director of
definition: Bir kaynağı, sanatçılara rol ve görev atamanın çoğu yönünden sorumlu olan bir temsilci ile ilişkilendirir. @tr
definition: Hozzákapcsol egy forrást egy ágenshez, aki felelős a szerepek és feladatok előadókra osztásának legtöbb vonatkozásáért. @hu
definition: Liittää aineiston toimijaan, joka vastaa useimmista esiintyjien roolien ja tehtävien antamiseen kuuluvista tehtävistä. @fi
definition: Relaterer en ressource til en agent ansvarlig for de fleste aspekter af at tildele roller og ansvar til performere. @da
definition: Relates a resource to an agent who is responsible for most aspects of assigning parts and duties to performers.
definition: Setzt eine Ressource in Beziehung zu einem Akteur, der für die meisten Aspekte der Rollenvergabe und Aufgabenzuteilung an Ausführende verantwortlich ist. @de
definition: يربط مصدر بوكيل مسؤول عن معظم الجوانب المتعلقة بأدوار الممثلين ومهامهم. @ar
definition: 将一种资源与负责给演员分配角色和任务的大多数工作的一个行为者关联起来。 @zh-hans

has remix artist
see also: has DJ
lexical alias: remixArtist.en
status: Published
type: Property
label: har remixer @da
label: hat Remix Artist @de
label: heeft remixartiest @nl
label: remix sanatçısı ile ilişkilidir @tr
label: remixművésze a következő: @hu
label: äänitaiteilija aineistossa @fi
label: له فنان ريميكس @ar
label: 有合成艺术家 @zh-hans
sub property of: has creator
inverse of: is remix artist of
definition: Bir kaynağı, önceden kaydedilmiş sesleri değiştirerek, yeniden birleştirerek, karıştırarak ve yeniden üreterek bir ses kaynağı oluşturmaktan sorumlu olan bir temsilci ile ilişkilendirir. @tr
definition: Hozzákapcsol egy forrást egy ágenshez, aki felelős egy audioforrás létrehozásáért korábban rögzített hangok manipulálásával, újrakombinálásával, keverésével és reprodukálásával. @hu
definition: Liittää aineiston toimijaan, joka vastaa ääniteoksen luomisesta manipuloimalla, yhdistelemällä, sekoittamalla ja uudelleen tuottamalla aiemmin äänitettyjä ääniä. @fi
definition: Relaterer en ressource til en agent ansvarlig for at skabe en lydressource ved at manipulere, rekombinere, mixe og reproducere tidligere indspillede lyde. @da
definition: Relates a resource to an agent who is responsible for creating an audio resource by manipulating, recombining, mixing, and reproducing previously recorded sounds.
definition: Setzt eine Ressource in Beziehung zu einem Akteur, der für das Schaffen einer Tonressource verantwortlich ist, indem er eine bestehende Tonaufnahme bearbeitet, rekombiniert, mischt und reproduziert. @de
definition: يربط مصدر بوكيل مسؤول عن إنشاء مصدر صوتي من خلال معالجة المواد السمعية المسجلة مسبقًا وإعادة تجميعها ومزجها واستنساخها. @ar
definition: 将一种资源与通过操纵、重新组合、混合和复制事先录制的声音而负责创建一种音频资源的一个行为者关联起来。 @zh-hans
scope note: Darunter fallen keine Nachbearbeitungen, die weder Art noch Inhalt der Originalressource wesentlich verändern, sowie das Zusammenmischen von aufgenommenen Einzelspuren (Kanälen) zu einem scheinbar ununterbrochen durchgehenden Klangerlebnis. @de
scope note: Ei kata uudelleenmiksaamista, joka ei oleellisesti muuta alkuperäisen teoksen luonnetta ja sisältöä eikä aiemmin äänitettyjen musiikkikappaleiden yhdistämistä yhdeksi musiikkikappaleeksi. @fi
scope note: Nem tartoznak ide sem azok a remixelési tevékenységek, amelyek nem változtatják meg lényegesen az eredeti forrás jellegét és tartalmát, sem a rögzített sávok látszólag egy folyamatos sávként való összemixelése. @hu
scope note: Orijinal kaynağın niteliğini ve içeriğini önemli ölçüde değiştirmeyen remiks faaliyetleri ve kaydedilen parçaların kesintisiz tek bir parça olarak görünecek şekilde birbirine karıştırılması hariçtir. @tr
scope note: Remix-aktiviteter der ikke væsentligt ændrer natur og indhold på originalværket, og mixning af indspillede lydspor til at fremstå som et uafbrudt spor er ikke omfattet. @da
scope note: Remixing activities that do not substantially change the nature and content of the original resource, and mixing recorded tracks together to appear as one continuous track are excluded.
scope note: تُستبعد أنشطة إعادة المزج التي لا تغير بشكل جوهري طبيعة ومحتوى المصدر الأصلي، وأنشطة مزج المسارات المسجلة لكي تبدو مسارًا واحدًا مستمرًا. @ar
scope note: 不包括不实质性改变原资源的性质和内容的合成活动、以及将录制的音轨混合成一个连续的音轨的活动。 @zh-hans

has audio engineer
has subproperty: has mixing engineer
lexical alias: audioEngineer.en
status: Published
type: Property
label: hangmestere a következő: @hu
label: har lydtekniker @da
label: hat Tontechnikerin/Tontechniker @de
label: heeft geluidstechnicus @nl
label: ses mühendisi ile ilişkilidir @tr
label: ääniteknikko aineistossa @fi
label: له مهندس صوت @ar
label: 有音频工程师 @zh-hans
sub property of: has contributor (Deprecated)
inverse of: is audio engineer of
definition: Bir kaynağı, kayıt, miksaj ve yeniden üretim süreçleri sırasında sesin teknik yönlerini yöneterek bir kaynağa katkıda bulunan bir aracıyla ilişkilendirir. @tr
definition: Hozzákapcsol egy forrást egy ágenshez, amely egy forráshoz hozzájárul azzal, hogy a felvétel, a keverés és reprodukálás folyamatai alatt a hang technikai vonatkozásait kezeli. @hu
definition: Liittää aineiston toimijaan, joka on osallisena aineiston tekemisessä huolehtimalla äänen teknisistä näkökohdista äänitys-, miksaus- ja äänentoistoprosessien aikana. @fi
definition: Relaterer en ressource til en agent der bidrager til en ressources lydindhold ved at overvåge de tekniske lydaspekter under optagelse, mixing og reproduktion. @da
definition: Relates a resource to an agent who contributes to a resource by managing the technical aspects of sound during the processes of recording, mixing, and reproduction.
definition: Setzt eine Ressource in Beziehung zu einem Akteur, der zu einer Ressource beiträgt, indem er die technischen Aspekte für den Ton während der Aufnahme, des Misch-Verfahrens und der Vervielfältigung handhabt. @de
definition: يربط مصدر بوكيل يُساهم في مصدر من خلال إدارة الجوانب الفنية للصوت أثناء عمليات التسجيل والمزج والاستنساخ. @ar
definition: 将一种资源与通过声音的录制、合成和复制过程技术方面管理而对一种资源有贡献的一个行为者关联起来。 @zh-hans

has mixing engineer
see also: has remix artist
lexical alias: mixingEngineer.en
status: Published
type: Property
label: aineiston miksaaja @fi
label: hangkeverője a következő: @hu
label: har mixingtekniker @da
label: hat Mischtontechnikerin/Mischtontechniker @de
label: heeft mixtechnicus @nl
label: ses miksaj mühendisi ile ilişkilidir @tr
label: له مهندس مكساج @ar
label: 有合成工程师 @zh-hans
sub property of: has audio engineer
inverse of: is mixing engineer of
definition: Bir kaynağı, bir kaydın birden fazla parçasını işleyerek, karıştırarak ve birleştirerek bir kaynağın ses içeriğine katkıda bulunan bir ses mühendisiyle ilişkilendirir. @tr
definition: Hozzákapcsol egy forrást egy hangmesterhez, aki hozzájárul egy forrás audio-tartalmához egy hangfelvétel sávjainak manipulálásával, keverésével és összeállításával. @hu
definition: Liittää aineiston toimijaan, joka on osallisena aineiston äänisisällössä käsittelemällä, miksaamalla ja yhdistelemällä useampia äänitteen raitoja. @fi
definition: Relaterer en ressource til en lydtekniker der bidrager til en ressources lydindhold ved at manipulere, mixe og samle de forskellige lydspor på en optagelse. @da
definition: Relates a resource to an audio engineer who contributes to the audio content of a resource by manipulating, mixing, and assembling the multiple tracks of a recording.
definition: Setzt eine Ressource in Beziehung zu einer Tontechnikerin/einem Tontechniker, die/der zum Audio-Inhalt einer Ressource beiträgt, indem sie/er mehrere Tonspuren einer Aufnahme bearbeitet, mischt und zusammenlegt. @de
definition: يربط بين مصدر ومهندس صوت يساهم في المحتوى الصوتي لمصدر من خلال معالجة المواد السمعية المسجلة مسبقًا وإعادة تجميعها ومزجها واستنساخها. @ar
definition: 将一种资源与通过操纵、合成和聚集一个录音的多个音轨而对一种资源的音频内容有贡献的一个音频工程师关联起来。 @zh-hans
scope note: Darunter fallen keine Nachbearbeitungen, die die Art und den Inhalt der Originalressource substantiell verändern, so dass eine neue Ressource entsteht. @de
scope note: Ei koske uudelleenmiksauksia, jotka olennaisesti muuttavat alkuperäisen teoksen luonnetta ja sisältöä, mikä johtaa uuteen aineistoon. @fi
scope note: Olyan újrakeverési vagy remixelő tevékenység, amely az eredeti forrás természetét és tartalmát lényegesen megváltoztatja és forrást művet eredményez, nem tartozik ide. @hu
scope note: Orijinal kaynağın niteliğini ve içeriğini önemli ölçüde değiştirerek yeni bir kaynakla sonuçlanan remiks faaliyetleri hariçtir. @tr
scope note: Remixing activities that substantially change the nature and content of the original resource, resulting in a new resource, are excluded.
scope note: Remixing-aktiviteter der væsentligt forandrer originalværkets karakter og indhold og derved resulterer i et nyt værk, er ikke omfattet. @da
scope note: تُستبعد أنشطة إعادة المزج التي تغير بشكل جوهري طبيعة ومحتوى المصدر الأصلي، إلى حد ينتج معه مصدر جديد. @ar
scope note: 不包括实质性改变原作品的性质和内容导致一种新的资源的合成活动。 @zh-hans

has music programmer
see also: has composer
lexical alias: musicProgrammer.en
status: Published
type: Property
label: har musikprogrammør @da
label: hat Musik-Programmiererin/Musik-Programmierer @de
label: heeft music programmer @nl
label: musiikkiohjelmoija aineistossa @fi
label: müzik programcısı ile ilişkilidir @tr
label: zeneprogramozója a következő: @hu
label: له مبرمج موسيقي @ar
label: 有音乐编程者 @zh-hans
sub property of: has contributor (Deprecated)
inverse of: is music programmer of
definition: Bir kaynağı, ses üretmek için elektronik ses cihazları veya bilgisayar yazılımı kullanarak bir kaynağa katkıda bulunan bir temsilci ile ilişkilendirir. @tr
definition: Hozzákapcsol egy forrást egy ágenshez, amely egy forráshoz hozzájárul azzal, hogy hangok előállítására elektronikus audiókészülékeket és/vagy számítógépes szoftvert használ. @hu
definition: Liittää aineiston toimijaan, joka on osallisena aineistossa tuottamalla ääniä sähköisillä äänilaitteilla tai tietokoneohjelmilla. @fi
definition: Relaciona un recurs amb un agent que contribueix a un recurs musical usant mecanismes electrònics àudio o programari d’ordinador per generar sons. @ca
definition: Relaterer en ressource til en agent, der bidrager til en musikressource ved at bruge elektronisk lydudstyr og/eller computersoftware til at generere lyd. @da
definition: Relates a resource to an agent who contributes to a musical resource by using electronic audio devices or computer software to generate sounds.
definition: Setzt eine Ressource in Beziehung zu einem Akteur, der zu einer Ressource beiträgt, indem er durch das Einsetzen elektronischer Audio-Geräte oder von Computerprogrammen Klangeffekte erzeugt. @de
definition: يربط مصدر بوكيل يُساهم في مصدر من خلال في استخدام أجهزة الصوت الإلكترونية أو برمجيات الحاسب لتوليد أصوات. @ar
definition: 将一种资源与通过使用电子音频设备或计算机软件产生声音而对一种音乐资源作出贡献的一个行为者关联起来。 @zh-hans
scope note: Darunter fällt nicht das Schaffen einer neuen Musikressource. @de
scope note: Egy új zenei forrás létrehozása nem tartozik ide. @hu
scope note: Ei koske uuden musiikkiteoksen luomista. @fi
scope note: Skabelse af en ny musikressource er ikke omfattet. @da
scope note: The creation of a new musical resource is excluded.
scope note: Yeni bir müzik kaynağının oluşturulması hariçtir. @tr
scope note: يُستبعد إنشاء مصدر موسيقي جديد. @ar
scope note: 不包括新音乐资源的创作。 @zh-hans

has dubbing director
lexical alias: dubbingDirector.en
status: Published
type: Property
label: dubbausohjaaja aineistossa @fi
label: dublaj yönetmeni ile ilişkilidir @tr
label: har dubbinginstruktør @da
label: hat Synchronregisseurin/Synchronregisseur @de
label: heeft stemregisseur @nl
label: szinkronrendezője a következő: @hu
label: له مخرج الدبلجة @ar
label: 有混声导演 @zh-hans
sub property of: has contributor (Deprecated)
inverse of: is dubbing director of
definition: Bir kaynağı, bir kaynağın film müziğini tamamlamak için yeni diyalog veya başka sesleri ekleme sürecinin genel yönetiminden ve denetiminden sorumlu olan bir temsilci ile ilişkilendirir. @tr
definition: Hozzákapcsol egy forrást egy ágenshez, amely felelős annak a folyamatnak az általános irányításáért és felügyeletéért, amelyben új dialógust vagy egyéb hangokat adnak hozzá egy forráshoz a hangsávja befejezése, teljessé tétele céljából. @hu
definition: Liittää aineiston toimijaan, joka vastaa uuden dialogin tai muiden äänien lisäämisprosessin yleisessä johtamisessa ja valvonnassa aineiston ääniraidan täydentämiseksi. @fi
definition: Relaterer en ressource til en agent, der er ansvarlig for den generelle ledelse og overvågning af processen med at tilføje ny dialog eller andre lyd for at fuldstændiggøre en ressources soundtrack. @da
definition: Relates a resource to an agent who is responsible for the general management and supervision of the process of adding new dialogue or other sounds to complete a sound track for a resource
definition: Setzt eine Ressource in Beziehung zu einem Akteur, der für das allgemeine Management und die Leitung beim Hinzufügen von neuem Dialog oder anderen Geräuschen verantwortlich ist, um die Tonspur einer Ressource zu vervollständigen. @de
definition: يربط مصدر بوكيل مسؤول عن الإدارة العامة والإشراف على عملية إضافة حوار جديد أو أصوات أخرى لإكمال مقطع صوتي لمصدر. @ar
definition: 将一种资源与对一种资源增加对话或其他声音以完成音轨的过程总体管理和监督负责的一个行为者关联起来。 @zh-hans

has DJ
see also: has mixing engineer
lexical alias: DJ.en
status: Published
type: Property
label: DJ aineistossa @fi
label: DJ ile ilişkilidir @tr
label: DJ-je a következő: @hu
label: har dj @da
label: hat DJ @de
label: heeft deejay @nl
label: له منسق دي جي @ar
label: 有打碟者 @zh-hans
sub property of: has contributor (Deprecated)
inverse of: is DJ of
definition: Bir kaynağı, canlı bir performans sırasında veya bir kayıt stüdyosunda kaydedilmiş parçaları kesintisiz bir parça olarak görünecek şekilde karıştıran bir temsilci ile ilişkilendirir. @tr
definition: Hozzákapcsol egy forrást egy ágenshez, amely hozzájárul egy forráshoz azzal, hogy felvett hangsávokat kever élő előadás közben vagy egy hangstúdióban, hogy azok folyamatos műsorszámként jelenjenek meg. @hu
definition: Liittää aineiston toimijaan, joka osallistuu aineiston tekemiseen miksaamalla ääniraitoja yhteen yhtäjaksoiseksi raidaksi live-esityksessä tai äänitysstudiossa. @fi
definition: Relaciona un recurs amb un agent que contribueix a un recurs mesclant pistes enregistrades conjuntament durant una actuació en directe o en un estudi de gravació perquè sembli una pista continua. @ca
definition: Relaterer en ressource til en agent, der mixer indspillede spor sammen under en live optræden eller i et indspilningsstudie så de fremstår som et uafbrudt spor. @da
definition: Relates a resource to an agent who contributes to a resource by mixing recorded tracks together during a live performance or in a recording studio to appear as one continuous track.
definition: Setzt eine Ressource in Beziehung zu einem Akteur, der während eines Live-Auftritts oder in einem Aufnahme-Studio aufgenommene Einzelspuren (Kanäle) zu einem scheinbar ununterbrochen durchgehenden Klangerlebnis zusammen mischt. @de
definition: يربط مصدر بوكيل يمزج ألحان مسجلة أثناء أدائها مباشرة أو أثناء تسجيلها في استوديو لتبدو كمسار واحد مستمر. @ar
definition: 将一种资源与通过在现场表演中或在录音工作室中混合已录制音轨使其出现为一个连续的音轨而对一种资源作出贡献的一个行为者关联起来。 @zh-hans
scope note: Darunter fallen keine Nachbearbeitungen, die die Art und den Inhalt der Originalressource substantiell verändern, so dass eine neue Ressource entsteht, sowie das Mischen und Zusammenlegen von mehreren Einzelspuren einer Aufnahme. @de
scope note: Ei koske uudelleenmiksauksia, jotka olennaisesti muuttavat alkuperäisen aineiston luonnetta ja sisältöä johtaen uuteen aineistoon, eikä äänitteen useampien raitojen miksaamista ja yhdistelyä. @fi
scope note: Nem tartoznak ide azok az új forrást eredményező újrakeverési tevékenységek, amelyek jelentősen megváltoztatják az eredeti forrás jellegét és tartalmát, sem a felvétel több sávjának keverése és összeállítása. @hu
scope note: Orijinal kaynağın niteliğini ve içeriğini önemli ölçüde değiştirerek yeni bir kaynakla sonuçlanan remiks faaliyetleri ve bir kaydın birden çok parçasını karıştırma ve bir araya getirme faaliyetleri hariçtir. @tr
scope note: Remixing activities that substantially change the nature and content of the original resource, resulting in a new resource, and mixing and assembling the multiple tracks of a recording are excluded.
scope note: Remixing-aktiviteter der væsentligt forandrer originalressourcens karakter og indhold og derved resulterer i en ny ressource samt mixing og sammensætning af de forskellige spor på en optagelse, er ikke omfattet. @da
scope note: تُستبعد أنشطة إعادة المزج التي تغير بشكل جوهري طبيعة ومحتوى المصدر الأصلي، إلى حد ينتج معه مصدر جديد، ومزج وتجميع المسارات المتعددة للتسجيل. @ar
scope note: 不包括实质性改变原资源的性质和内容导致一种新的资源以及混合和聚集一个录音的多个音轨的合成活动。 @zh-hans

has latitude
lexical alias: latitude.en
status: Published
type: Property
label: enlem ile ilişkilidir @tr
label: har breddegrad @da
label: hat Breitengrad @de
label: heeft breedtegraad @nl
label: leveysaste aineistossa @fi
label: szélessége a következő: @hu
label: له خط عرض @ar
label: 有纬度 @zh-hans
definition: Bir kaynağı, ekvatordan kuzey ve güneyde ölçülen bir gezegen veya uydu üzerindeki bir noktanın uzaklığıyla ilişkilendirir. @tr
definition: Hozzákapcsol egy forrást egy bolygó vagy hold egy pontjának az egyenlítőtől északra vagy délre mért távolságához. @hu
definition: Liittää aineiston planeetan tai satelliitin pisteen etäisyyteen, joka on mitattu pohjoiseen ja etelään päiväntasaajalta. @fi
definition: Relaciona un recurs amb la distància d’un lloc sobre un planeta o un satèl·lit que es mesura al nord i al sud de l’equador. @ca
definition: Relaterer en ressource til en afstand fra et punkt på en planet eller satellit målt nord og syd fra ækvator. @da
definition: Relates a resource to the distance of a place on a planet or satellite that is measured north and south from the equator.
definition: Setzt eine Ressource in Beziehung zu einer Entfernung eines Punkts auf einem Planeten oder Satelliten, der nördlich oder südlich vom Äquator gemessen wird. @de
definition: يربط بين مصدر ومسافة نقطة على كوكب أو قمر إصطناعي تم قياسها شمالًا وجنوبا من خط الاستواء. @ar
definition: 将一种资源与从行星或卫星的赤道向北和向南到行星或卫星上一个地点所测量的距离关联起来。 @zh-hans

has longitude
lexical alias: longitude.en
status: Published
type: Property
label: boylam ile ilişkilidir @tr
label: har længdegrad @da
label: hat Längengrad @de
label: heeft lengtegraad @nl
label: hosszúsága a következő: @hu
label: pituusaste aineistossa @fi
label: له خط طول @ar
label: 有经度 @zh-hans
definition: Bir kaynağı, bir referans meridyenden doğu ve batı olarak ölçülen bir gezegen veya uydu üzerindeki bir noktanın uzaklığıyla ilişkilendirir. @tr
definition: Hozzákapcsol egy forrást egy bolygó vagy hold egy pontjának a referencia-délkörtől (meridiántól) keletre és nyugatra mért távolságához. @hu
definition: Liittää aineiston planeetan tai satelliitin pisteen etäisyyteen, joka on mitattu itään ja länteen vertailumeridiaanista. @fi
definition: Relaciona un recurs amb la distància d’un lloc sobre un planeta o un satèl·lit que es mesura a l’est i a l’oest d’un meridià de referència. @ca
definition: Relaterer en ressource til en afstand fra et punkt på en planet eller satellit målt øst og vest fra referencemeridianen. @da
definition: Relates a resource to the distance of a place on a planet or satellite that is measured east and west from a reference meridian.
definition: Setzt eine Ressource in Beziehung zu einer Entfernung eines Punkts auf einem Planeten oder Satelliten, der östlich und westlich von einem Bezugsmeridian gemessen wird. @de
definition: يربط بين مصدر ومسافة نقطة على كوكب أو قمر إصطناعي تم قياسها شرقًا وغربًا من خط الزوال المرجعي. @ar
definition: 将一种资源与从行星或卫星的基准子午线向东和向西到行星或卫星上一个地点所测量的距离关联起来。 @zh-hans

has right ascension
lexical alias: rightAscension.en
status: Published
type: Property
label: har rektascension @da
label: hat Rektaszension @de
label: heeft rechte klimming @nl
label: rektaskensio aineistossa @fi
label: rektaszcenziója a következő: @hu
label: yükseliş ile ilişkilidir @tr
label: له صعود مستقيم @ar
label: 有赤经 @zh-hans
definition: Bir kaynağı, bir gök cismin ilkbahar ekinoksundan ekvator üzerinde doğuya doğru ölçülen açısal mesafesini, 0'dan 24 saate kadar cismin içinden geçen saat çemberiyle ilişkilendirir. @tr
definition: Hozzákapcsol egy forrást az egyenlítőtől keletre mért szögtávolsághoz a tavaszi napéjegyenlőségtől az órakörig egy égitesten keresztül, 0-tól 24 óráig. @hu
definition: Liittää aineiston taivaankappaleen kulmaetäisyyteen, joka on mitattu aikamitoissa taivaanekvaattoria pitkin kevättasauspisteestä vastapäivään. @fi
definition: Relaciona un recurs amb la distància angular d’un cos celeste que es mesura de 0 a 24 h, al llarg de l’equador en direcció est, des de l’equinocci vernal al cercle horari passant pel cos celeste. @ca
definition: Relaterer en ressource til en vinkelafstand målt mod øst ved ækvator fra forårsjævndøgn til timekransen gennem et himmellegeme, fra 0 til 24 timer. @da
definition: Relates a resource to the angular distance of a celestial body that is measured eastward on the equator from the vernal equinox to the hour circle through the body, from 0 to 24 hours.
definition: Setzt eine Ressource in Beziehung zu einem Winkelabstand zwischen dem Frühlingspunkt und dem Längenkreis, der auf der Äquatorebene gegen den Uhrzeigersinn gemessen und in einem Maß von 0 bis 24 Stunden angegeben wird. @de
definition: يربط بين مصدر ومسافة زاوية مقاسة باتجاه الشرق على خط الاستواء من الاعتدال الربيعي إلى دائرة الساعة عبر جرم سماوي، من 0 إلى 24 ساعة. @ar
definition: 将一种资源与天体赤道上从春分点到时圈向东度量的角距离（从0到24小时）关联起来。 @zh-hans

has declination
lexical alias: declination.en
status: Published
type: Property
label: deklinaatio aineistossa @fi
label: deklinációja a következő: @hu
label: eğim ile ilişkilidir @tr
label: har deklination @da
label: hat Deklination @de
label: heeft declinatie @nl
label: له زاوية ميل أو انحراف @ar
label: 有赤纬 @zh-hans
definition: Bir kaynağı, bir cismin içinden geçen saat dairesi boyunca gök ekvatorundan 90° ile kuzeyde veya güneyde ölçülen gök cisminin açısal mesafesi ile ilişkilendirir. @tr
definition: Hozzákapcsol egy forrást az égi egyenlítőtől az éggömbön lévő égitesthez 90°-ban északra vagy délre mért szögtávolsághoz az égitest óraköre mentén. @hu
definition: Liittää aineiston taivaankappaleen kulmaetäisyyteen, joka on mitattu taivaanekvaattorista pohjoiseen tai etelään 90°:een läpi kappaleen tuntiympyrää pitkin. @fi
definition: Relaciona un recurs amb la distància angular d’un cos celeste que es mesura al nord o al sud a 90º de l’equador celeste al llarg del cercle horari passant pel cos. @ca
definition: Relaterer en ressource til en vinkelafstand til et himmellegeme, målt nord eller syd gennem 90° fra himmelækvator langs himmellegemets timekrans. @da
definition: Relates a resource to the angular distance of a celestial body that is measured north or south through 90° from the celestial equator along the hour circle through the body.
definition: Setzt eine Ressource in Beziehung zu einem Winkelabstand eines Himmelskörpers vom Himmelsäquator, der nördlich oder südlich durch 90° vom Himmelsäquator entlang des Stundenkreises des Körpers gemessen wird. @de
definition: يربط بين مصدر ومسافة زاوية لجسم على الكرة السماوية مقاسة شمالًا أو جنوبًا خلال 90 درجة من خط الاستواء السماوي على طول دائرة ساعة الجسم. @ar
definition: 将一种资源与从天球赤道沿天体时圈通过90度向北或向南度量的角距离关联起来。 @zh-hans

has absorbed agent
lexical alias: absorbedAgent.en
status: Published
type: Property
label: har absorberet agent @da
label: hat übernommenen Akteur @de
label: heeft opgenomen actor @nl
label: kapsanmış temsilci ile ilişkilidir @tr
label: magába olvasztott ágense a következő: @hu
label: sulautunut toimija @fi
label: له وكيل مستحوذ عليه @ar
label: 有被吸收行为者 @zh-hans
inverse of: has absorbing agent
definition: Bir temsilciyi, başka bir temsilci tarafından kapsanan bir temsilciyle ilişkilendirir. @tr
definition: Hozzákapcsol egy ágenst egy ágenshez, amelyet magába olvasztott egy másik ágens. @hu
definition: Liittää toimijan toimijaan, joka on sulautunut toiseen toimijaan. @fi
definition: Relaterer en agent til en agent, der var absorberet af en anden agent. @da
definition: Relates an agent to an agent who was absorbed by another agent.
definition: Setzt einen Akteur in Beziehung zu einem Akteur, der von einem anderen Akteur übernommen wird. @de
definition: يربط بين وكيل ووكيل مستحوذ عليه من قبل وكيل أخر. @ar
definition: 将一个行为者与被另一个行为者吸收的一个行为者关联起来。 @zh-hans

has absorbing agent
lexical alias: absorbingAgent.en
status: Published
type: Property
label: har indlemmende agent @da
label: hat übernehmenden Akteur @de
label: heeft opnemende actor @nl
label: kapsayan temsilci ile ilişkilidir @tr
label: magába olvasztó ágense a következő: @hu
label: sulautunut toimija @fi
label: له وكيل مستحوذ @ar
label: 有吸收行为者 @zh-hans
inverse of: has absorbed agent
definition: Bir temsilciyi, başka bir temsilciyi kapsayan bir temsilci ile ilişkilendirir. @tr
definition: Hozzákapcsol egy ágenst egy ágenshez, amely magába olvaszt egy másik ágenst. @hu
definition: Liittää toimijan toimijaan, joka on sulauttanut itseensä toisen toimijan. @fi
definition: Relaterer en agent til en agent, der indlemmede en anden agent. @da
definition: Relates an agent to an agent who absorbed another agent.
definition: Setzt einen Akteur in Beziehung zu einem Akteur, der einen anderen Akteur übernimmt. @de
definition: يربط بين وكيل ووكيل يستحوذ على وكيل آخر. @ar
definition: 将一个行为者与吸收另一个行为者的一个行为者关联起来。 @zh-hans

has jointly held conference
lexical alias: jointlyHeldConference.en
status: Published
type: Property
label: har konference afholdt i fællesskab @da
label: hat gemeinsam durchgeführte Konferenz @de
label: heeft gezamenlijk gehouden conferentie @nl
label: közösen tartott konferenciája a következő: @hu
label: ortak düzenlenen konferans ile ilişkilidir @tr
label: yhteiskonferenssi (yhteistoimija) @fi
label: له مؤتمر يعقد بصورة مشتركة @ar
label: 有联合举办的会议 @zh-hans
definition: Bir temsilciyi, ilgili bir konferansla ortaklaşa düzenlenen bir konferans olan bir temsilci ile ilişkilendirir. @tr
definition: Hozzákapcsol egy ágenst egy ágenshez, amely egy olyan konferencia, amelyet közösen tartanak egy kapcsolódó konferenciával. @hu
definition: Liittää toimijan toimijaan, joka on yhdessä toisen konferenssin kanssa järjestettävä konferenssi. @fi
definition: Relaciona un agent amb un agent que és un congrés que se celebra conjuntament amb un congrés relacionat. @ca
definition: Relaterer en konference til en konference, der afholdes i fællesskab med en anden konference. @da
definition: Relates an agent to an agent who is a conference that is jointly held with a related conference.
definition: Setzt einen Akteur in Beziehung zu einer Konferenz, die gemeinsam mit einer anderen Konferenz durchgeführt wird. @de
definition: يربط بين وكيل ووكيل مؤتمر ر يُعقد بصورة مشتركة مع مؤتمر ذي صلة. @ar
definition: 将一个行为者与作为一次会议并和一次相关会议联合举办的一个行为者关联起来。 @zh-hans

has details of regional encoding
lexical alias: detailsOfRegionalEncoding.en
status: Published
type: Property
label: aineiston aluekoodin lisätiedot @fi
label: bölgesel kodlama ayrıntıları ile ilişkilidir @tr
label: har detaljer om regional kodning @da
label: hat Details zum Regionalcode @de
label: heeft details van regiocodering @nl
label: regionális kódolás részletei a következők: @hu
label: له تفاصيل عن كود منطقة @ar
label: 有地区编码的细节 @zh-hans
sub property of: has details of digital file characteristic
definition: Bir kaynağı, bir videodiskin veya video oyun taşıyıcısının kodlandığı, dünyanın bir veya daha fazla bölgesi için bir atamanın ayrıntılarıyla ilişkilendirir ve oynatmanın kodunu çözmek için yapılandırılmış bir cihazla sınırlı olduğunu belirtir. @tr
definition: Hozzákapcsol egy forrást egy a világ egy vagy több régiójára vonatkozó jelölés részleteihez, amelyre egy videólemezt vagy egy videójáték-hordozót kódoltak, jelezve, hogy a visszajátszás annak dekódolására konfigurált készülékre korlátozódik. @hu
definition: Liittää aineiston lisätietoihin määritteestä, jolla tunnistetaan videolevyn tai videopelitallenteen käyttöalue ja estetään niiden käyttäminen toisella alueella myydyllä soittimella. @fi
definition: Relaterer en ressource til detaljer om en kode, der identificerer den region i verden, som en videodisc er kodet til, og som forhindrer, at videodiscen bliver spillet på en afspiller solgt i en anden region. @da
definition: Relates a resource to details of a designation for one or more regions of the world for which a videodisc or video game carrier is encoded, indicating that playback is restricted to a device configured to decode it.
definition: Setzt eine Manifestation in Beziehung zu Details zu einer Bezeichnung, die die Region(en) der Welt angibt, für die eine Videodisk oder ein Videospiel-Datenträger kodiert ist, und der verhindert, dass die Disk von einem Wiedergabegerät, das in einer anderen Region verkauft wurde, abgespielt werden kann. @de
definition: يربط بين مصدر وتفاصيل عن تسمية لواحدة أو أكثر من مناطق العالم التي تم تشفير حامل الفيديو أو ألعاب الفيديو، يشير إلى أن عملية التشغيل مقصورة على الأجهزة المكودة بكود المنطقة فقط. @ar
definition: 将一种资源与视盘或视频游戏载体被编码后表示对设置解码回放的设备限制的世界上一个或多个地区的标识的细节关联起来。 @zh-hans

has note on capture
lexical alias: noteOnCapture.en
status: Published
type: Property
label: har note om optagelse @da
label: hat Anmerkung zur Aufzeichnung @de
label: heeft noot bij vastleggen @nl
label: huomautus aineiston tallennuksesta @fi
label: kayıt hakkında not ile ilişkilidir @tr
label: megjegyzése a rögzítésről a következő: @hu
label: له تبصرة عن التقاط @ar
label: 有关于摄录的附注 @zh-hans
sub property of: has note on resource
definition: Bir kaynağı, bir kaynağın içeriğinin kaydedilmesi, filme alınması vb. ile ilgili bilgileri sağlayan bir kaynak notuyla ilişkilendirir. @tr
definition: Hozzákapcsol egy forrást egy forrásra tett megjegyzéshez, amely információt nyújt egy forrás tartalmának felvételével, filmezésével, stb. társított információkról. @hu
definition: Liittää aineiston aineistoa koskevaan huomautukseen, joka sisältää aineiston sisällön äänitykseen, kuvaukseen tms. liittyviä tietoja. @fi
definition: Relaterer en ressource til en note der giver oplysninger knyttet til optagelse, indspilning etc. af indholdet af en ressource. @da
definition: Relates a resource to a note on resource that provides information associated with the recording, filming, etc., of the content of a resource.
definition: Setzt eine Ressource in Beziehung zu einer Anmerkung zur Ressource, die Informationen liefert, die mit der Aufnahme, dem Filmen und so weiter des Inhalts einer Ressource in Verbindung stehen. @de
definition: يربط بين مصدر وتبصرة عن مصدر مرتبطة بتسجيل، تصوير...إلخ، محتوى مصدر. @ar
definition: 将一种资源与提供关于资源之内容的和录制、摄制等有关信息的一个关于资源的附注关联起来。 @zh-hans
scope note: A felvételrögzítésről szóló megjegyzésbe olyan körülmények tartoznak, mint az élő adás vagy stúdiófelvétel, a használt eszközök stb. @hu
scope note: Darunter fallen auch die Umstände einer Aufzeichnung wie zum Beispiel, ob es sich um eine Live- oder Studioaufnahme handelt, welches Equipment verwendet wurde und so weiter. @de
scope note: Görüntü alımı ile ilgili not, örneğin canlı veya stüdyo kaydı, kullanılan ekipman vb. durumları içerir. @tr
scope note: Note om optagelse omfatter forhold såsom live- eller studieoptagelse, anvendt udstyr etc. @da
scope note: Note on capture includes the circumstances such as a live or studio recording, the equipment used, etc.
scope note: Tallennusta koskevaan huomautukseen kuuluvat sellaiset tapaukset kuin live- tai studioäänitys, käytetty laitteisto jne. @fi
scope note: تتضمن تبصرة عن التقاط الظروف مثل التسجيل المباشر أو التسجيل في الاستوديو، والمعدات المستخدمة...إلخ. @ar
scope note: 关于摄录（包括诸如实况录制或工作室录制、所用的设备等条件）的附注 @zh-hans

has access point for entity
has subproperty: has authorized access point for entity
has subproperty: has variant access point for entity
has subproperty: has access point for agent
has subproperty: has access point for place
has subproperty: has access point for resource
has subproperty: has access point for timespan
lexical alias: accessPointForEntity.en
status: Published
type: Property
label: entiteetin hakutieto @fi
label: entitás hozzáférési pontja a következő: @hu
label: har søgeindgang for entitet @da
label: hat Sucheinstieg für eine Entität @de
label: heeft ingang voor entiteit @nl
label: varlık için erişim noktası ile ilişkilidir @tr
label: له نقطة وصول لكيان @ar
label: 有实体的检索点 @zh-hans
sub property of: has appellation of entity
inverse of: is access point for entity of
definition: Bir varlığı, bir kelime kodlama şemasından alınan veya bir dizi kodlama şeması kullanılarak oluşturulan doğal dildeki bir varlığın unvanıyla ilişkilendirir. @tr
definition: Hozzákapcsol egy entitást egy entitás olyan természetes nyelvű megnevezéséhez, amely egy szótárkódolási sémából származik, vagy egy karakterlánc-kódolási séma használatával szerkesztett. @hu
definition: Liittää entiteetin luonnollisella kielellä olevaan entiteetin nimitykseen, joka on otettu sanaston merkintäjärjestelmästä tai on muodostettu käyttämällä merkkijonon merkintäjärjestelmää. @fi
definition: Relaciona una entitat amb un nomen que és una apel·lació d’entitat en llenguatge natural que s’obté d’un esquema de codificació de vocabulari o s’elabora usant un esquema de codificació de cadenes. @ca
definition: Relaterer en entitet til en entitetsbenævnelse på naturligt sprog, der er hentet fra et vokabularkodningsskema eller er konstrueret ved hjælp af et strengkodningsskema. @da
definition: Relates an entity to a nomen that is an appellation of entity in natural language that is taken from a vocabulary encoding scheme or is constructed using a string encoding scheme.
definition: Setzt eine Entität in Beziehung zu einer Bezeichnung für eine Entität in natürlicher Sprache, die einem Vocabulary Encoding Scheme entnommen oder mit einem String Encoding Scheme konstruiert wird. @de
definition: يربط بين كيان وتسمية كيان باللغة الطبيعية المأخوذة من مخطط ترميز مفردات أو مبنية باستخدام خطة ترميز سلسلة تمثيلات. @ar
definition: 将一个实体与作为一个实体的称谓、取自一个词表编码体系或者用一个串编码体系构建、用自然语言的一个命名关联起来。 @zh-hans

has appellation of entity
has subproperty: has name of agent
has subproperty: has title
has subproperty: has manufacturer
has subproperty: has name of distributor
has subproperty: has name of producer
has subproperty: has name of manufacturer
has subproperty: has name of publisher
has subproperty: has access point for entity
has subproperty: has identifier for entity
has subproperty: has name of entity
lexical alias: appellationOfEntity.en
status: Published
type: Property
label: entiteetin nimitys @fi
label: entitás megnevezése a következő: @hu
label: har benævnelse på entitet @da
label: hat Bezeichnung für eine Entität @de
label: heeft benaming van entiteit @nl
label: varlığın unvanı ile ilişkilidir @tr
label: له تسمية لكيان @ar
label: 有实体的称谓 @zh-hans
inverse of: is appellation of entity of
definition: Bir varlığı, bir varlığa atıfta bulunmak için belirli bir şema veya bağlam içinde kullanılan bir isimle ilişkilendirir. @tr
definition: Hozzákapcsol egy entitást egy nomenhez, amelyet egy adott sémán vagy kontextuson belül használnak egy entitásra való hivatkozásra. @hu
definition: Liittää entiteetin nomeniin, jota on käytetty tietyssä järjestelmässä tai kontekstissa viittaamaan entiteettiin. @fi
definition: Relaterer en entitet til et nomen, som er anvendt indenfor et givet skema eller en given kontekst for at henvise til en entitet. @da
definition: Relates an entity to a nomen that is used within a given scheme or context to refer to an entity.
definition: Setzt eine Entität in Beziehung zu einem Nomen, das in einem bestimmten Schema oder Kontext verwendet wird, um eine Entität zu referenzieren. @de
definition: يربط بين كيان وتسمية مستخدمة ضمن خطة أو سياق معين للإشارة إلى كيان. @ar
definition: 将一个实体与在一个给定的体系或语境中指称一个实体所用的一个命名关联起来。 @zh-hans

is access point for entity of
has subproperty: is authorized access point for entity of
has subproperty: is variant access point for entity of
has subproperty: is access point for agent of
has subproperty: is access point for place of
has subproperty: is access point for resource of
has subproperty: is access point for timespan of
lexical alias: accessPointForEntityOf.en
status: Published
type: Property
label: entiteetin hakutieto @fi
label: er søgeindgang for entitet af @da
label: hozzáférési pont a következő entitás számára: @hu
label: is ingang voor entiteit van @nl
label: ist Sucheinstieg für eine Entität von @de
label: varlığı için erişim noktasıdır @tr
label: هو نقطة وصول لكيان لـ @ar
label: 是……的实体的检索点 @zh-hans
sub property of: is appellation of entity of
inverse of: has access point for entity
definition: Bir ismi, bir kelime kodlama şemasından alınan veya bir dizi kodlama şeması kullanılarak oluşturulan doğal dilde bir unvana sahip olan bir varlıkla ilişkilendirir. @tr
definition: Hozzákapcsol egy noment egy entitáshoz, amelynek van egy olyan természetes nyelvű megnevezése, amely egy szótárkódolási sémából származik, vagy egy karakterlánc-kódolási séma használatával szerkesztett. @hu
definition: Liittää nomenin entiteettiin, jolla on luonnollisella kielellä oleva nimitys, joka on otettu sanaston merkintäjärjestelmästä tai on muodostettu käyttämällä merkkijonon merkintäjärjestelmää. @fi
definition: Relaterer et nomen til en entitet, der har en benævnelse på naturligt sprog, der er hentet fra et vokabularkodningsskema eller er konstrueret ved hjælp af et strengkodningsskema. @da
definition: Relates a nomen to an entity that has an appellation in natural language that is taken from a vocabulary encoding scheme or is constructed using a string encoding scheme.
definition: Setzt ein Nomen in Beziehung zu einer Entität, die eine Bezeichnung in natürlicher Sprache hat, die einem Vocabulary Encoding Scheme entnommen oder mit einem String Encoding Scheme konstruiert wird. @de
definition: يربط بين تسمية وكيان له اسم في لغة طبيعية مأخوذة من خطة ترميز مفردات أو مبنية باستخدام خطة ترميز سلسلة تمثيلات. @ar
definition: 将一个命名与有取自一个词表编码体系或者用一个串编码体系构建、用自然语言的一个称谓的一个实体关联起来。 @zh-hans

is appellation of entity of
has subproperty: is manufacturer of
has subproperty: is access point for entity of
has subproperty: is title of resource of
has subproperty: is name of agent of
has subproperty: is identifier for entity of
has subproperty: is name of distributor of
has subproperty: is name of entity of
has subproperty: is name of manufacturer of
has subproperty: is name of producer of
has subproperty: is name of publisher of
lexical alias: appellationOfEntityOf.en
status: Published
type: Property
label: entiteetin nimitys @fi
label: er benævnelse af en entitet af @da
label: is benaming van entiteit van @nl
label: ist Bezeichnung für eine Entität von @de
label: megnevezése a következő entitásnak: @hu
label: varlığının unvanıdır @tr
label: هي تسمية لكيان لـ @ar
label: 是……的实体的称谓 @zh-hans
inverse of: has appellation of entity
definition: Bir ismi, belirli bir şema veya bağlamda kullanılan bir ad tarafından atıfta bulunulan bir varlıkla ilişkilendirir. @tr
definition: Hozzákapcsol egy noment egy entitáshoz, amelyre egy adott sémában vagy kontextusban használt nomen hivatkozik. @hu
definition: Liittää nomenin entiteettiin, johon tietyssä järjestelmässä tai kontekstissa käytetyllä nomenilla viitataan. @fi
definition: Relaterer et nomen til en entitet, der er henvist til af et nomen brugt indenfor et givet skema eller et givet sammehhæng. @da
definition: Relates a nomen to an entity that is referred to by a nomen used within a given scheme or context.
definition: Setzt ein Nomen in Beziehung zu einer Entität, auf die mit einem Nomen referenziert wird, das in einem bestimmten Schema oder Kontext verwendet wird. @de
definition: يربط بين تسمية وكيان يشار إليه بتسمية مستخدمة ضمن خطة أو سياق معين. @ar
definition: 将一个命名与在一个给定的体系或语境中用一个命名指称的一个实体关联起来。 @zh-hans

is title of resource of
has subproperty: is variant title of resource of
has subproperty: is preferred title of resource of
has subproperty: is title of series of
lexical alias: titleOfResourceOf.en
status: Published
type: Property
label: aineiston nimeke @fi
label: címe a következő forrásnak: @hu
label: er titel af ressource af @da
label: is titel van resource van @nl
label: ist Titel einer Reihe von @de
label: kaynağının başlığıdır @tr
label: هو عنوان لمصدر لـ @ar
label: 是……的资源的题名 @zh-hans
sub property of: is appellation of entity of
inverse of: has title of resource
definition: Bir ismi, ortak söylemde kullanılan ifade ve günlük dilde kaynak olarak nitelendirilen bir kaynakla ilişkilendirir. @tr
definition: Hozzákapcsol egy noment egy forráshoz, amely rendelkezik egy a forráshoz tartozó természetes nyelvű megnevezéssel és a közbeszédben használt megfogalmazással. @hu
definition: Liittää nomenin aineistoon, jolla on yleisessä diskurssissa käytetty nimitys luonnollisella kielellä ja sanamuodolla. @fi
definition: Relaterer et nomen til en ressource der har en ressourcebenævnelse på naturligt sprog og med naturlig formulering, anvendt i almindelig samtale. @da
definition: Relates a nomen to a resource that has an appellation of resource in natural language and phrasing used in common discourse.
definition: Setzt ein Nomen in Beziehung zu einer Ressource, die über eine Bezeichnung für eine Ressource in natürlicher Sprache und Ausdrucksweise verfügt, die beim normalen Sprechen und Schreiben verwendet wird. @de
definition: يربط تسمية بمصدر له تسمية مصدر في لغة طبيعية وفي العبارات المستخدمة في الخطاب العام. @ar
definition: 将一个命名与有用自然语言和普通话语措词表达的资源的称谓的一种资源关联起来。 @zh-hans

has nomen string
lexical alias: nomenString.en
status: Published
type: Property
label: har nomenstreng @da
label: hat Nomen-Zeichenkette @de
label: heeft nomenstring @nl
label: isim dizgesi ile ilişkilidir @tr
label: nomenin merkkijono @fi
label: noment alkotó karakterlánca a következő: @hu
label: له سلسلة تمثيلات تسمية @ar
label: 有命名串 @zh-hans
definition: Bir isimi, bir varlıkla ilişkili bir unvanı oluşturan işaretlerin birleşimiyle ilişkilendirir. @tr
definition: Hozzákapcsol egy noment jelek kombinációjához, amely így egy entitáshoz kapcsolódó megnevezést formál. @hu
definition: Liittää nomenin merkkien yhdistelmään, joka muodostaa entiteettiin liittyvän nimityksen. @fi
definition: Relaterer et nomen til den kombination af tegn, der danner en betegnelse knyttet til en entitet. @da
definition: Relates a nomen to the combination of signs that forms an appellation associated with an entity.
definition: Setzt ein Nomen in Beziehung zu einer Kombination von Zeichen, die eine Bezeichnung bildet, die mit einer Entität in Verbindung steht. @de
definition: يربط بين تسمية ومجموعة من العلاقات التي تشكل تسمية مرتبطة بكيان. @ar
definition: 将一个命名与和一个实体有关的形成一个称谓的符号的组合关联起来。 @zh-hans

has relief representation
lexical alias: reliefRepresentation.en
status: Published
type: Property
label: domborzatábrázolás típusa a következő: @hu
label: har relieftype @da
label: hat Reliefdarstellung @de
label: heeft reliëftype @nl
label: kabartma temsili ile ilişkilidir @tr
label: korkeuserojen esitystapa @fi
label: té representació de relleu @ca
label: له نوع بارز @ar
label: 有地形表现 @zh-hans
alternative label: has relief type
alternative label: kabartma türü ile ilişkilidir @tr
alternative label: té tipus de relleu @ca
alternative label: 有地形类型 @zh-hans
definition: Bir kaynağı, arazi yüzeyinin ve arazinin yatay ve dikey boyutlarını gösteren bir yöntemle ilişkilendirir. @tr
definition: Hozzákapcsol egy forrást egy olyan jelölési módszerhez, amely a földfelszín és a terep vízszintes és függőleges méreteinek jelzésére irányul. @hu
definition: Liittää aineiston maanpinnan ja pinnanmuodostuksen horisontaalisten ja vertikaalisten mittojen merkitsemisen menetelmään. @fi
definition: Relaciona un recurs amb una representació cartogràfica de les formes de la superfície de la terra o d’un altre cos celeste, real o imaginari, mitjançant mètodes gràfics especials. @ca
definition: Relaterer en ressource til en metode til at angive de vandrette og lodrette dimensioner af landoverflade og terræn. @da
definition: Relates a resource to a cartographic representation of the surface forms of the earth or other celestial body, real or imaginary, by means of special graphic methods.
definition: Setzt eine Ressource in Beziehung zu einer Methode zur Angabe der horizontalen und vertikalen Darstellung des Geländes. @de
definition: يربط بين مصدر وطريقة تشير إلى الأبعاد الأفقية والرأسية لسطح الأرض وتضاريسها. @ar
definition: 将一种资源与通过特殊图形方法对（真实或虚构）地球或其他天体的表面形状的地图表现关联起来。 @zh-hans

has prime meridian
lexical alias: primeMeridian.en
status: Published
type: Property
label: başlangıç meridyeni ile ilişkilidir @tr
label: har primær meredian @da
label: hat Nullmeridian @de
label: heeft nulmeridiaan @nl
label: kezdő hosszúsági köre a következő: @hu
label: nollameridiaani aineistossa @fi
label: له خط الطول الأول @ar
label: 有本初子午线 @zh-hans
definition: Bir kaynağı, dünya yüzeyinde belirli bir yerden ve doğu ve batı boylamlarının ölçüldüğü karasal kutuplardan geçen sabit bir boylam çizgisiyle ilişkilendirir. @tr
definition: Hozzákapcsol egy forrást ahhoz az állandó hosszúsági körhöz, amely egy adott helyen áthalad a Föld felszínén és a földi pólusokon, és amelytől a keleti és nyugati hosszúsági fokokat mérik. @hu
definition: Liittää aineiston pysyvän pituusasteen viivaan, joka kulkee maan pinnalla olevan tietyn paikan ja maapallon napojen läpi, ja josta itäinen ja läntinen pituusaste mitataan. @fi
definition: Relaterer en ressource til en linje med konstant længdegrad, der passerer et givet sted på jordoverfladen og på de jordbaserede poler, hvorfra østlig og vestlig længdegrad måles. @da
definition: Relates a resource to a line of constant longitude passing through a given place on the surface of the earth and the terrestrial poles, from which longitude east and west is measured.
definition: Setzt eine Ressource in Beziehung zu einer Linie konstanter Länge, die durch ein bestimmtes Geografikum auf der Erdoberfläche und den Erdpolen verläuft und von der aus die Längengrade Ost und West gemessen werden. @de
definition: يربط بين مصدر وخط طول ثابت يمر عبر مكان معين على سطح الأرض والأقطاب الأرضية، والتي يقاس منها خط الطول شرقًا وغربًا. @ar
definition: 将一种资源与穿过地球表面一个指定的地点和地球两极并以此测量东经和西经的一条恒定经线关联起来。 @zh-hans

has authorized access point for entity
has subproperty: has authorized access point for agent
has subproperty: has authorized access point for place
has subproperty: has authorized access point for resource
has subproperty: has authorized access point for timespan
lexical alias: authorizedAccessPointForEntity.en
status: Published
type: Property
label: entiteetin auktorisoitu hakutieto @fi
label: entitás autorizált hozzáférési pontja a következő: @hu
label: har autoriseret søgeindgang for entitet @da
label: hat normierten Sucheinstieg für eine Entität @de
label: heeft geautoriseerde ingang voor entiteit @nl
label: tüzel kişi için yetkili erişim noktası ile ilişkilidir @tr
label: له نقطة اتاحة مقننة لكيان @ar
label: 有实体的规范检索点 @zh-hans
sub property of: has access point for entity
inverse of: is authorized access point for entity of
definition: Bir varlığı, belirli bir sözcük kodlama şemasında tercih için seçilen varlığa ilişkin bir erişim noktasıyla ilişkilendirir. @tr
definition: Hozzákapcsol egy entitást egy entitás hozzáférési pontjához, amelyet egy adott szótárkódolási sémából választanak ki előnyben részesítettként. @hu
definition: Liittää entiteetin entiteetin hakutietoon, joka on valittu ensisijaiseksi tietyssä sanaston merkintäjärjestelmässä. @fi
definition: Relaterer en entitet til en søgeindgang for entitet, der er valgt som foretrukken i et specifikt vokabularkodningsskema. @da
definition: Relates an entity to an access point for entity that is selected for preference in a specific vocabulary encoding scheme.
definition: Setzt eine Entität in Beziehung zu einem Sucheinstieg für eine Entität, der in einem bestimmten Vocabulary Encoding Scheme als Vorzugsform bestimmt wird. @de
definition: يربط بين كيان ونقطة إتاحة لكيان اُختيرت نقطة اتاحة مقننة مُفضلة في خطة ترميز مفردات محددة. @ar
definition: 将一个实体与在一个特定的词表编码体系中被首选的一个实体的检索点关联起来。 @zh-hans

has variant access point for entity
has subproperty: has variant access point for agent
has subproperty: has variant access point for place
has subproperty: has variant access point for resource
has subproperty: has variant access point for timespan
lexical alias: variantAccessPointForEntity.en
status: Published
type: Property
label: entiteetin varianttihakutieto @fi
label: entitás hozzáférésipont-változata a következő: @hu
label: har variant af søgeindgang for entitet @da
label: hat zusätzlichen Sucheinstieg für eine Entität @de
label: heeft variant ingang voor entiteit @nl
label: varlık için alternatif erişim noktası ile ilişkilidir @tr
label: له نقطة إتاحة مختلفة لكيان @ar
label: 有实体的变异检索点 @zh-hans
sub property of: has access point for entity
inverse of: is variant access point for entity of
definition: Bir varlığı, belirli bir sözcük kodlama şemasında tercih için seçilmeyen varlığa ilişkin bir erişim noktasıyla ilişkilendirir. @tr
definition: Hozzákapcsol egy entitást egy entitás hozzáférési pontjához, amelyet nem választanak ki egy adott szótárkódolási sémából előnyben részesítettként. @hu
definition: Liittää entiteetin entiteetin hakutietoon, jota ei ole valittu ensisijaiseksi tietyn sanaston merkintäjärjestelmässä. @fi
definition: Relaterer en entitet til en søgeindgang for entitet, der ikke er valgt som foretrukken i et specifikt vokabularkodningsskema. @da
definition: Relates an entity to an access point for entity that is not selected for preference in a specific vocabulary encoding scheme.
definition: Setzt eine Entität in Beziehung zu einem Sucheinstieg für eine Entität, der in einem bestimmten Vocabulary Encoding Scheme nicht als Vorzugsform bestimmt wird. @de
definition: يربط بين كيان ونقطة إتاحة لكيان لم يتم اختياره كنقطة إتاحة مختلفة مفضلة في خطة ترميز مفردات محددة. @ar
definition: 将一个实体与没有在一个特定的词表编码体系中被首选的一个实体的检索点关联起来。 @zh-hans

is authorized access point for entity of
has subproperty: is authorized access point for agent of
has subproperty: is authorized access point for place of
has subproperty: is authorized access point for resource of
has subproperty: is authorized access point for timespan of
lexical alias: authorizedAccessPointForEntityOf.en
status: Published
type: Property
label: autorizált hozzáférési pont a következő entitás számára: @hu
label: entiteetin auktorisoitu hakutieto @fi
label: er autoriseret søgeindgang for entitet af @da
label: is geautoriseerde ingang voor entiteit van @nl
label: ist normierter Sucheinstieg für eine Entität von @de
label: varlığı için yetkili erişim noktasıdır @tr
label: هو نقطة إتاحة مقننة لكيان لـ @ar
label: 是……的实体的规范检索点 @zh-hans
sub property of: is access point for entity of
inverse of: has authorized access point for entity
definition: Bir ismi, belirli bir kelime kodlama şemasında tercih edilmek üzere seçilen bir varlık için erişim noktası olan bir varlıkla ilişkilendirir. @tr
definition: Hozzákapcsol egy noment egy entitáshoz, amelynek van egy olyan hozzáférési pontja az entitás számára, amelyet egy adott szótárkódolási sémából kiválasztva előnyben részesítenek. @hu
definition: Liittää nomenin entiteettiin, jolla on hakutieto, joka on valittu ensisijaiseksi tietyssä sanaston merkintäjärjestelmässä. @fi
definition: Relaterer et nomen til en entitet, der har en søgeindgang for entitet, der er valgt som foretrukken i et særskilt vokabularkodningsskema. @da
definition: Relates a nomen to an entity that has an access point for entity that is selected for preference in a specific vocabulary encoding scheme.
definition: Setzt ein Nomen in Beziehung zu einer Entität, die über einen Sucheinstieg für eine Entität verfügt, der in einem bestimmten Vocabulary Encoding Scheme als Vorzugsform bestimmt wird. @de
definition: يربط بين تسمية وكيان له نقطة إتاحة لكيان اُختيرت نقطة اتاحة مقننة في خطة ترميز مفردات محددة. @ar
definition: 将一个命名与有在一个特定的词表编码体系中被首选的实体检索点的一种实体关联起来。 @zh-hans

has identifier for entity
has subproperty: has identifier for resource
has subproperty: has identifier for agent
has subproperty: has identifier for place
has subproperty: has identifier for timespan
lexical alias: identifierForEntity.en
status: Published
type: Property
label: entiteetin tunniste @fi
label: entitás azonosítója a következő: @hu
label: har dentifikator for entitet @da
label: hat Identifikator für eine Entität @de
label: heeft identificatie voor entiteit @nl
label: varlığın tanımlayıcısı ile ilişkilidir @tr
label: له معرف لكيان @ar
label: 有实体的标识符 @zh-hans
sub property of: has appellation of entity
inverse of: is identifier for entity of
definition: Bir varlığı, bir varlığı tanımlamak için kullanılan, genellikle doğal dil ve sosyal adlandırma kurallarından bağımsız bir kod, sayı veya başka bir dizgeden oluşan bir varlık unvanı ile ilişkilendirir. @tr
definition: Hozzákapcsol egy entitást egy entitás megnevezéséhez, amely egy kód-, szám-, vagy más típusú karakterláncból áll, amely általában független a természetes nyelvektől és társadalmi névkonvencióktól, és egy ágens azonosítására használják. @hu
definition: Liittää entiteetin entiteetin nimitykseen, joka koostuu koodista, luvusta tai muusta tavallisesti luonnollisesta kielestä ja yleisistä nimeämiskäytännöistä riippumattomasta merkkijonosta, jota käytetään entiteetin dentifiointiin. @fi
definition: Relaciona una entitat amb un nomen que és una apel·lació d’entitat que consisteix en un codi, número o qualsevol altra cadena, normalment independent del llenguatge natural i de les convencions lingüístiques socials, usada per identificar una entitat. @ca
definition: Relaterer en entitet til en entitetsbenævnelse, der består af kode, nummer, eller anden streng, normalt uafhængig af normalt sprog og sociale navngivningskonventioner, anvendt for at identificere en entitet. @da
definition: Relates an entity to a nomen that is an appellation of entity that consists of a code, number, or other string, usually independent of natural language and social naming conventions, used to identify an entity.
definition: Setzt eine Entität in Beziehung zu einer Bezeichnung für eine Entität, die aus einem Code, einer Nummer oder einer anderen Zeichenkette besteht, der/die normalerweise nicht in natürlicher Sprache und unabhängig von den sozialen Benennungskonventionen ist und zur Identifizierung einer Entität verwendet wird. @de
definition: يربط بين كيان وتسمية لكيان يتكون من رمز، رقم، أو سلسلة تمثيلات أخرى، مستقلة عادة عن اللغة الطبيعية وعن التسميات المتعارف عليها اجتماعيًا، المستخدمة لتعريف كيان. @ar
definition: 将一个实体与作为由代码、数字、或其他字符串构成、通常独立于自然语言和社会命名惯例、用以标识实体的实体称谓的一个命名关联起来。 @zh-hans
scope note: A kódolt karakterlánc általában független a természetes nyelvektől és társadalmi névkonvencióktól. @hu
scope note: Den kodede streng er normalt uafhængig af naturligt sprog og sociale navngivningskonventioner. @da
scope note: Die kodierte Zeichenkette ist normalerweise nicht in natürlicher Sprache und unabhängig von den sozialen Benennungskonventionen. @de
scope note: Kodlanmış dizi genellikle doğal dilden ve sosyal adlandırma kurallarından bağımsızdır. @tr
scope note: Koodattu merkkijono on yleensä luonnollisesta kielestä ja sosiaalisista nimeämisen käytännöistä riippumaton. @fi
scope note: The coded string is usually independent of natural language and social naming conventions.
scope note: عادة ما تكون سلسلة التمثيلات المرمزة مستقلة عن اللغة الطبيعية وعن التسميات المتعارف عليها اجتماعيًا. @ar
scope note: 编码串通常独立于自然语言和社会命名惯例。 @zh-hans

is name of agent of
has subproperty: is variant name of agent of
has subproperty: is preferred name of agent of
has subproperty: is fuller form of name of
has subproperty: is given name of
has subproperty: is surname of
lexical alias: nameOfAgentOf.en
status: Published
type: Property
label: er agentnavn på @da
label: is naam van actor van @nl
label: ist Name eines Akteurs von @de
label: temsilcisinin adıdır @tr
label: toimijan nimi @fi
label: ágensneve a következőnek: @hu
label: هو اسم لوكيل لـ @ar
label: 是……的行为者的名称 @zh-hans
sub property of: is appellation of entity of
inverse of: has name of agent
definition: Doğal dildeki bir temsilci sıfatını ve ortak söylemde kullanılan ifadeleri bir temsilci ile ilişkilendirir. @tr
definition: Hozzákapcsolja egy ágenshez egy ágens természetes nyelvi megnevezését és a közbeszéd során használt megfogalmazását. @hu
definition: Liittää toimijaan luonnollisella kielellä olevan toimijan nimityksen, jota käytetään yleisessä diskurssissa. @fi
definition: Relaterer en agentbenævnelse på naturligt sprog og med naturlig formulering, anvendt i almindelig diskurs til en agent. @da
definition: Relates an appellation of agent in natural language and phrasing used in common discourse to an agent.
definition: Setzt eine Bezeichnung für einen Akteur in natürlicher Sprache und Ausdrucksweise, die beim normalen Sprechen und Schreiben verwendet wird, in Beziehung zu einem Akteur. @de
definition: يربط بين وكيل وتسمية وكيل فىي اللغة الطبيعية وفي العبارات المستخدمة في الخطاب العام. @ar
definition: 将一个用自然语言和普通话语措词表达的行为者的称谓与一个行为者关联起来。 @zh-hans

is variant name of agent of
lexical alias: variantNameOfAgentOf.en
status: Published
type: Property
label: er variantnavn af agent på @da
label: is variant naam van actor van @nl
label: ist abweichender Name eines Akteurs von @de
label: névváltozata a következő ágensnek: @hu
label: temsilcinin farklı ismi @tr
label: toimijan varianttinimi @fi
label: هو اسم مختلف لوكيل لـ @ar
label: 是……的行为者的变异名称 @zh-hans
sub property of: is name of agent of
inverse of: has variant name of agent
definition: Bir ismi, belirli bir uygulamada veya bağlamda tercih edilmeyen bir temsilci adına sahip temsilciyle ilişkilendirir. @tr
definition: Hozzákapcsol egy noment egy ágenshez, amelynek van egy olyan ágensneve, amelyet egy adott alkalmazásban vagy kontextusban nem részesítenek előnyben. @hu
definition: Liittää nomenin toimijaan, jolla on toinen toimijan nimi, jota ei ole valittu ensisijaiseksi tietyssä sovelluksessa tai kontekstissa. @fi
definition: Relaterer et nomen til en agent, som har et agentnavn, der ikke er valgt som foretrukket i en specifik applikation eller et specifikt sammenhæng. @da
definition: Relates a nomen to an agent who has a name of agent that is not selected for preference in a specific application or context.
definition: Setzt ein Nomen in Beziehung zu einem Akteur, der über einen Namen für einen Akteur verfügt, der in einer bestimmten Anwendung oder in einem bestimmten Kontext nicht als Vorzugsform bestimmt wird. @de
definition: يربط بين تسمية ووكيل له اسم وكيل لم يتم اختياره كاسم مختلف مفضل ضمن تطبيق محدد أو سياق محدد. @ar
definition: 将一个命名与有在一个特定的应用或语境下未被首选的一个行为者名称的一个行为者关联起来。 @zh-hans

is variant name of place of
lexical alias: variantNameOfPlaceOf.en
status: Published
type: Property
label: er variant til stednavn på @da
label: is variant naam van plaats van @nl
label: ist abweichender Name eines Geografikums von @de
label: névváltozata a következő helynek: @hu
label: paikan varianttinimi @fi
label: yerin farklı ismi @tr
label: هو اسم مختلف لمكان لـ @ar
label: 是……的地点的变异名称 @zh-hans
sub property of: is name of place of
inverse of: has variant name of place
definition: Bir ismi, belirli bir uygulamada veya bağlamda tercih edilmeyen bir yer adına sahip bir yerle ilişkilendirir. @tr
definition: Hozzákapcsol egy noment egy helyhez, amelynek van egy helyneve, amelyet egy adott alkalmazásban vagy kontextusban nem részesítenek előnyben. @hu
definition: Liittää nomenin paikkaan, jolla on paikannimi, jota ei ole valittu ensisijaiseksi tietyssä sovelluksessa tai kontekstissa. @fi
definition: Relaterer et nomen til et sted, der har et stednavn, som ikke er valgt som foretrukket i en specifik applikation eller et specifikt sammenhæng. @da
definition: Relates a nomen to a place that has a name of place that is not selected for preference in a specific application or context.
definition: Setzt ein Nomen in Beziehung zu einem Geografikum, das über einen Namen für ein Geografikum verfügt, der in einer bestimmten Anwendung oder in einem bestimmten Kontext nicht als Vorzugsform bestimmt wird. @de
definition: يربط بين تسمية ومكان له اسم مكان لم يتم اختياره كاسم مختلف مفضل ضمن تطبيق محدد أو سياق محدد. @ar
definition: 将一个命名与有在一个特定的应用或语境中未被首选的一个地点名称的一个地点关联起来。 @zh-hans

is preferred name of place of
lexical alias: preferredNameOfPlaceOf.en
status: Published
type: Property
label: előnyben részesített helyneve a következőnek: @hu
label: er fortrukket stednavn på @da
label: is geprefereerde naam van plaats van @nl
label: ist bevorzugter Name eines Geografikums von @de
label: paikan ensisijainen nimi @fi
label: yerinin tercih edilen adıdır @tr
label: هو اسم مفضل لمكان لـ @ar
label: 是……的地点的首选名称 @zh-hans
sub property of: is name of place of
inverse of: has preferred name of place
definition: Bir ismi, belirli bir uygulamada veya bağlamda tercih edilen bir yer adına sahip bir yerle ilişkilendirir. @tr
definition: Hozzákapcsol egy noment egy helyhez, amelynek van egy olyan helyneve, amelyet egy adott alkalmazásban vagy kontextusban előnyben részesítenek. @hu
definition: Liittää nomenin paikkaan, jolla on ensisijaiseksi tietyssä sovelluksessa tai kontekstissa valittu paikannimi. @fi
definition: Relaterer et nomen til et sted, der har et stednavn, som er valgt som foretrukket i en specifik applikation eller i et specifikt sammenhæng. @da
definition: Relates a nomen to a place that has a name of place that is selected for preference in a specific application or context.
definition: Setzt ein Nomen in Beziehung zu einem Geografikum, das über einen Namen für ein Geografikum verfügt, der in einer bestimmten Anwendung oder in einem bestimmten Kontext als Vorzugsform bestimmt wird. @de
definition: يربط بين تسمية ومكان له اسم مكان اختير كاسم مفضل في تطبيق محدد أو في سياق محدد. @ar
definition: 将一个命名与有在一个特定的应用或语境中被首选的一个地点名称的一个地点关联起来。 @zh-hans

is preferred name of timespan of
lexical alias: preferredNameOfTimespanOf.en
status: Published
type: Property
label: ajanjakson ensisijainen nimi @fi
label: előnyben részesített időtartamneve a következőnek: @hu
label: er foretrukket navn på tidsperiode for @da
label: is geprefereerde naam van tijdspanne van @nl
label: ist bevorzugter Name eines Zeitraums von @de
label: zaman aralığının tercih edilen adıdır @tr
label: هو اسم مفضل لفترة زمنية لـ @ar
label: 是……的时间段的首选名称 @zh-hans
sub property of: is name of timespan of
inverse of: has preferred name of timespan
definition: Bir ismi, belirli bir uygulamada veya bağlamda tercih edilen bir zaman aralığı adına sahip bir zaman aralığıyla ilişkilendirir. @tr
definition: Hozzákapcsol egy noment egy időtartamhoz, amelynek van egy olyan időtartamneve, amelyet egy adott alkalmazásban vagy kontextusban előnyben részesítenek. @hu
definition: Liittää nomenin ajanjaksoon, jolla on ensisijaiseksi tietyssä sovelluksessa tai kontekstissa valittu ajanjakson nimi. @fi
definition: Relaterer et nomen til et tidsforløb, der har et navn på tidsforløb, der er valgt som foretrukket i en specifik applikation eller et specifikt sammenhæng. @da
definition: Relates a nomen to a timespan that has a name of timespan that is selected for preference in a specific application or context.
definition: Setzt ein Nomen in Beziehung zu einem Zeitraum, der über einen Namen für einen Zeitraum verfügt, der in einer bestimmten Anwendung oder in einem bestimmten Kontext als Vorzugsform bestimmt wird. @de
definition: ييربط تسمية بفترة زمنية لها اسم فترة زمنية اُختيرت كاسم مفضل في تطبيق محدد أو سياق محدد. @ar
definition: 将一个命名与有在一个特定的应用或语境中被首选的一个时间段名称的一个时间段关联起来。 @zh-hans

is variant title of resource of
lexical alias: variantTitleOfResourceOf.en
status: Published
type: Property
label: aineiston varianttinimi @fi
label: címváltozata a következő forrásnak: @hu
label: er varianttitel af ressource af @da
label: is variant titel van resource van @nl
label: ist abweichender Titel einer Ressource von @de
label: kaynağının alternatif adıdır @tr
label: هو عنوان مختلف لمصدر لـ @ar
label: 是……的资源的变异题名 @zh-hans
sub property of: is title of resource of
inverse of: has variant title of resource
definition: Bir ismi, belirli bir uygulamada veya bağlamda tercih edilmeyen kaynak adına sahip bir kaynakla ilişkilendirir. @tr
definition: Hozzákapcsol egy noment egy forráshoz, amely rendelkezik egy olyan forráshoz tartozó címmel, amelyet egy adott alkalmazásban vagy kontextusban nem részesítenek előnyben. @hu
definition: Liittää nomenin aineistoon, jolla on aineiston nimi, jota ei ole valittu ensisijaiseksi tietyssä sovelluksessa tai kontekstissa. @fi
definition: Relaterer et nomen til en ressource, som har en ressourcetitel der ikke er valgt som foretrukken in en specifik applikation eller i et specifikt sammenhæng. @da
definition: Relates a nomen to a resource that has a title of resource that is not selected for preference in a specific application or context.
definition: Setzt ein Nomen in Beziehung zu einer Ressource, die über einen Titel für eine Ressource verfügt, der in einer bestimmten Anwendung oder in einem bestimmten Kontext nicht als Vorzugsform bestimmt wird. @de
definition: يربط تسمية بمصدر له عنوان مصدر لم يتم اختياره كعنوان مختلف مفضل ضمن تطبيق محدد أو سياق محدد. @ar
definition: 将一个命名与有在一个特定的应用或语境中被未首选的一个资源题名的一种资源关联起来。 @zh-hans

has variant name of timespan
lexical alias: variantNameOfTimespan.en
status: Published
type: Property
label: ajanjakson varianttinimi @fi
label: har variantnavn for tidsforløb @da
label: hat abweichenden Namen eines Zeitraums @de
label: heeft variant naam van tijdspanne @nl
label: időtartam névváltozata a következő: @hu
label: zaman aralığının alternatif ismi ile ilişkilidir @tr
label: له اسم مختلف لفترة زمنية @ar
label: 有时间段的变异名称 @zh-hans
sub property of: has name of timespan
inverse of: is variant name of timespan of
definition: Bir zaman aralığını, belirli bir uygulamada veya bağlamda tercih için seçilmemiş bir zaman aralığının adıyla ilişkilendirir. @tr
definition: Hozzákapcsol egy időtartamot egy időtartamnévhez, amelyet egy adott alkalmazásban vagy összefüggésben nem részesítenek előnyben. @hu
definition: Liittää ajanjakson ajanjakson nimeen, jota ei ole valittu ensisijaiseksi tietyssä sovelluksessa tai kontekstissa. @fi
definition: Relaterer et tidsforløb til et navn på tidsforløb, der ikke er valgt som foretrukket i en specifik applikation eller i et specifikt sammenhæng. @da
definition: Relates a timespan to a name of timespan that is not selected for preference in a specific application or context.
definition: Setzt einen Zeitraum in Beziehung zu einem Namen eines Zeitraums, der in einer bestimmten Anwendung oder in einem bestimmten Kontext nicht als Vorzugsform bestimmt wird. @de
definition: يربط بين فنرة زمنية واسم فترة زمنية لم يتم اختيارها كاسم مختلف مفضل ضمن تطبيق محدد أو سياق محدد. @ar
definition: 将一个时间段与未在一个特定的应用或语境中被首选的一个时间段的名称关联起来。 @zh-hans

is preferred name of agent of
lexical alias: preferredNameOfAgentOf.en
status: Published
type: Property
label: Toimijan ensisijainen nimi @fi
label: előnyben részesített neve a következő ágensnek: @hu
label: er foretrukket navn på agent på @da
label: is geprefereerde naam van actor van @nl
label: ist bevorzugter Name eines Akteurs von @de
label: temsilcisinin tercih edilen adıdır @tr
label: هو اسم مفضل لوكيل لـ @ar
label: 是……的行为者的首选名称 @zh-hans
sub property of: is name of agent of
inverse of: has preferred name of agent
definition: Bir ismi, belirli bir uygulamada veya bağlamda tercih edilmeyen temsilci adına sahip bir temsilciyle ilişkilendirir. @tr
definition: Egy noment hozzákapcsol egy ágenshez, amelynek van egy olyan ágensneve, amelyet egy adott alkalmazásban vagy kontextusban előnyben részesítenek. @hu
definition: Liittää nomenin toimijaan, jolla on tietyssä sovelluksessa tai kontekstissa ensisijaiseksi valittu toimijan nimi. @fi
definition: Relaterer et nomen til en agent, som har et agentnavn, der er valgt som foretrukket i en specifik applikation eller et specifikt sammenhæng. @da
definition: Relates a nomen to an agent who has a name of agent that is selected for preference in a specific application or context.
definition: Setzt ein Nomen in Beziehung zu einem Akteur, der über einen Namen für einen Akteur verfügt, der in einer bestimmten Anwendung oder in einem bestimmten Kontext als Vorzugsform bestimmt wird. @de
definition: يربط بين تسمية ووكيل له اسم وكيل اُختير كاسم مفضل ضمن تطبيق محدد أو سياق محدد. @ar
definition: 将一个命名与有在一个特定的应用或语境下被首选的一个行为者名称的一个行为者关联起来。 @zh-hans

is identifier for entity of
has subproperty: is identifier for agent of
has subproperty: is identifier for resource of
has subproperty: is identifier for place of
has subproperty: is identifier for timespan of
lexical alias: identifierForEntityOf.en
status: Published
type: Property
label: azonosító a következő entitáshoz: @hu
label: entiteetin tunniste @fi
label: er identifikator for entitet af @da
label: is identificatie voor entiteit van @nl
label: ist Identifikator für eine Entität von @de
label: varlığının tanımlayıcısıdır @tr
label: هو معرف لكيان لـ @ar
label: 是……的实体的标识符 @zh-hans
sub property of: is appellation of entity of
inverse of: has identifier for entity
definition: Bir ismi, kelime kodlama şemasından alınan bir referans koduna sahip bir varlıkla ilişkilendirir. @tr
definition: Hozzákapcsol egy noment egy entitáshoz, amelynek van egy szótárkódolási sémából származó hivatkozásikódja. @hu
definition: Liittää nomenin entiteettiin, jolla on sanaston merkintäjärjestelmästä otettu viitekoodi @fi
definition: Relaterer et noment til en entitet, som jar en referencekode hetet fra et vokabularkodningsskema. @da
definition: Relates a nomen to an entity that has a reference code taken from a vocabulary encoding scheme.
definition: Setzt ein Nomen in Beziehung zu einer Entität, die über einen Referenzcode verfügt, der aus einem Vocabulary Encoding Scheme entnommen wird. @de
definition: يربط بين تسمية وكيان له رمز إحالة مأخوذ من خطة ترميز مفردات. @ar
definition: 将一个命名与有一个取自一个词表编码体系的指称代码的一个实体关联起来。 @zh-hans
scope note: A kódolt karakterlánc általában független a természetes nyelvektől és társadalmi névkonvencióktól. @hu
scope note: Den kodede streng er normalt uafhængig af naturligt sprog og sociale navngivningskonventioner. @da
scope note: Die kodierte Zeichenkette ist normalerweise nicht in natürlicher Sprache und unabhängig von den sozialen Benennungskonventionen. @de
scope note: Kodlanmış dizi genellikle doğal dilden ve sosyal adlandırma kurallarından bağımsızdır. @tr
scope note: Koodattu merkkijono on yleensä luonnollisesta kielestä ja sosiaalisista nimeämisen käytännöistä riippumaton. @fi
scope note: The coded string is usually independent of natural language and social naming conventions.
scope note: عادة ما تكون سلسلة التمثيلات المرمزة مستقلة عن اللغة الطبيعية وعن التسميات المتعارف عليها اجتماعيًا. @ar
scope note: 编码串通常独立于自然语言和社会命名惯例。 @zh-hans

is name of place of
has subproperty: is variant name of place of
has subproperty: is preferred name of place of
lexical alias: nameOfPlaceOf.en
status: Published
type: Property
label: er stednavn på @da
label: helyneve a következőnek: @hu
label: is naam van plaats van @nl
label: ist Name eines Geografikums von @de
label: paikan nimi @fi
label: yerinin adıdır @tr
label: هو اسم لمكان لـ @ar
label: 是……的地点的名称 @zh-hans
sub property of: is name of entity of
inverse of: has name of place
definition: Bir ismi, yerel dilde adı olan bir yerle ve yaygın söylemde kullanılan ifadelerle ilişkilendirir. @tr
definition: Hozzákapcsol egy noment egy helyhez, amelynek van természetes nyelvű megnevezése és a közbeszédben használt megfogalmazása. @hu
definition: Liittää nomenin paikkaan, jolla on yleisessä diskurssissa käytetty nimi luonnollisella kielellä ja sananmuodolla. @fi
definition: Relaterer et nomen til et sted, som har et navn på naturligt sprog og formuleringer anvendt i allmindelig diskurs. @da
definition: Relates a nomen to a place that has a name in natural language and phrasing used in common discourse.
definition: Setzt ein Nomen in Beziehung zu einem Geografikum, das über einen Namen in natürlicher Sprache und Ausdrucksweise verfügt, die beim normalen Sprechen und Schreiben verwendet wird. @de
definition: يربط بين تسمية ومكان له اسم في اللغة الطبيعية وفي العبارات المستخدمة في الخطاب العام. @ar
definition: 将一个命名与有用自然语言和普通话语措词表达的名称的一个地点关联起来。 @zh-hans

has preferred name of timespan
lexical alias: preferredNameOfTimespan.en
status: Published
type: Property
label: ajanjakson ensisijainen nimi @fi
label: har foretrukket navn på tidsforløb @da
label: hat bevorzugten Namen eines Zeitraums @de
label: heeft geprefereerde naam van tijdspanne @nl
label: időtartam előnyben részesített neve a következő: @hu
label: tercih edilen zaman aralığı adı ile ilişkilidir @tr
label: له اسم مفضل لفترة زمنية @ar
label: 有时间段的首选名称 @zh-hans
sub property of: has name of timespan
inverse of: is preferred name of timespan of
definition: Bir zaman aralığını, belirli bir uygulama veya bağlamda tercih için seçilmiş bir zaman aralığının adıyla ilişkilendirir. @tr
definition: Hozzákapcsol egy időtartamot egy időtartamnévhez, amely egy adott alkalmazásban vagy összefüggésben előnyben részesítenek. @hu
definition: Liittää ajanjakson ensisijaiseksi tietyssä sovelluksessa tai kontekstissa valittuun ajanjakson nimeen. @fi
definition: Relaciona un interval de temps amb un nomen que és un nom d’interval de temps que se selecciona com a preferent en una aplicació o un context específic. @ca
definition: Relaterer et tidsforløb til et navn på tidsforløb, der er valgt som foretrukket i en specifik applikation eller i et specifikt sammenhæng. @da
definition: Relates a timespan to a nomen that is a name of timespan that is selected for preference in a specific application or context.
definition: Setzt einen Zeitraum in Beziehung zu einem Namen eines Zeitraums, der in einer bestimmten Anwendung oder in einem bestimmten Kontext als Vorzugsform bestimmt wird. @de
definition: يربط بين فترة زمنية واسم لفترة زمنية اُختيرت كاسم مفضل ضمن تطبيق محدد أو سياق محدد. @ar
definition: 将一个时间段与作为一个时间段的名称并在一个特定的应用或语境中被首选的一个命名关联起来。 @zh-hans

is name of timespan of
has subproperty: is preferred name of timespan of
has subproperty: is variant name of timespan of
lexical alias: nameOfTimespanOf.en
status: Published
type: Property
label: ajanjakson nimi @fi
label: er navn på tidsforløb af @da
label: időtartamneve a következőnek: @hu
label: is naam van tijdspanne van @nl
label: ist Name eines Zeitraums von @de
label: zaman aralığının adıdır @tr
label: هو اسم لفترة زمنية لـ @ar
label: 是……的时间段的名称 @zh-hans
sub property of: is name of entity of
inverse of: has name of timespan
definition: Bir ismi, yerel dilde adı olan bir zaman aralığıyla ve yaygın söylemde kullanılan ifadelerle ilişkilendirir. @tr
definition: Hozzákapcsol egy noment egy időtartamhoz, amelynek van természetes nyelvű megnevezése és a közbeszédben használt megfogalmazása. @hu
definition: Liittää nomenin ajanjaksoon, jolla on jolla on yleisessä diskurssissa käytetty nimi luonnollisella kielellä ja sananmuodolla. @fi
definition: Relaterer et nomen til et tidsforløb, som har et navn på naturligt sprog och formuleringer brugt i almindelig diskurs. @da
definition: Relates a nomen to a timespan that has a name in natural language and phrasing used in common discourse.
definition: Setzt ein Nomen in Beziehung zu einem Zeitraum, der über einen Namen in natürlicher Sprache und Ausdrucksweise verfügt, die beim normalen Sprechen und Schreiben verwendet wird. @de
definition: ييربط تسمية بفترة زمنية لها اسم في اللغة الطبيعية وفي العبارات المستخدمة في الخطاب العام. @ar
definition: 将一个命名与有用自然语言和普通话语措词表达的名称的一个时间段关联起来。 @zh-hans

is variant name of timespan of
lexical alias: variantNameOfTimespanOf.en
status: Published
type: Property
label: ajanjakson varianttinimi @fi
label: er variantnavn på tidsforløb af @da
label: is variant naam van tijdspanne van @nl
label: ist abweichender Name eines Zeitraums von @de
label: névváltozata a következő időtartamnak: @hu
label: zaman aralığının farklı ismi @tr
label: هو اسم مختلف لفترة زمنية لـ @ar
label: 是……的时间段的变异名称 @zh-hans
sub property of: is name of timespan of
inverse of: has variant name of timespan
definition: Bir ismi, belirli bir uygulama veya bağlamda tercih edilmeyen bir bir zaman aralığı adına sahip zaman aralığı ile ilişkilendirir. @tr
definition: Hozzákapcsol egy noment egy időtartamhoz, amelynek van egy időtartamneve, amelyet egy adott alkalmazásban vagy kontextusban nem részesítenek előnyben. @hu
definition: Liittää nomenin ajanjaksoon, jolla on ajanjakson nimi, jota ei ole valittu ensisijaiseksi tietyssä sovelluksessa tai kontekstissa. @fi
definition: Relaciona un nomen amb un interval de temps que té un nom d’interval de temps que no se selecciona com a preferent en una aplicació o un context específic. @ca
definition: Relaterer et nomen til et tidsforløb, der har et navn på tidsforløb, der ikke er valgt som foretrukket i en specifik applikation eller et specifikt sammenhæng. @da
definition: Relates a nomen to a timespan that has a name of timespan that is not selected for preference in a specific application or context.
definition: Setzt ein Nomen in Beziehung zu einem Zeitraum, der über einen Namen für einen Zeitraum verfügt, der in einer bestimmten Anwendung oder in einem bestimmten Kontext nicht als Vorzugsform bestimmt wird. @de
definition: ييربط تسمية بفترة زمنية لها اسم فترة زمنية لم يتم اختياره كاسم مختلف مفضل ضمن تطبيق محدد أو سياق محدد. @ar
definition: 将一个命名与有在一个特定的应用或语境中未被首选的一个时间段名称的一个时间段关联起来。 @zh-hans

is preferred title of resource of
lexical alias: preferredTitleOfResourceOf.en
status: Published
type: Property
label: aineiston ensisijainen nimeke @fi
label: előnyben részesített címe a következő forrásnak: @hu
label: er foretrukken titel af ressource @da
label: is geprefereerde titel van resource van @nl
label: ist bevorzugter Titel einer Ressource von @de
label: kaynağının tercih edilen başlığıdır @tr
label: هو عنوان مفضل لمصدر لـ @ar
label: 是……的资源的首选题名 @zh-hans
sub property of: is title of resource of
inverse of: has preferred title of resource
definition: Bir ismi, belirli bir uygulama veya bağlamda tercih edilen bir kaynak adına sahip bir kaynakla ilişkilendirir. @tr
definition: Hozzákapcsol egy noment egy forráshoz, amely rendelkezik egy olyan forráshoz tartozó címmel, amelyet egy adott alkalmazásban vagy kontextusban előnyben részesítenek. @hu
definition: Liittää nomenin aineistoon, jolla on tietyssä sovelluksessa tai kontekstissa ensisijaiseksi valittu aineiston nimeke. @fi
definition: Relaterer et nomen til en ressource, som har en ressourcetitel der er valgt som foretrukken in en specifik applikation eller i et specifikt sammenhæng. @da
definition: Relates a nomen to a resource that has a title of resource that is selected for preference in a specific application or context.
definition: Setzt ein Nomen in Beziehung zu einer Ressource, die über einen Titel für eine Ressource verfügt, der in einer bestimmten Anwendung oder in einem bestimmten Kontext als Vorzugsform bestimmt wird. @de
definition: يربط تسمية بمصدر له عنوان اُختير كعنوان مفضل ضمن تطبيق محدد أو سياق محدد. @ar
definition: 将一个命名与有在一个特定的应用或语境中被首选的一个资源题名的一种资源关联起来。 @zh-hans

is variant access point for entity of
lexical alias: variantAccessPointForEntityOf.en
status: Published
type: Property
label: entiteetin varianttihakutieto @fi
label: er variansøgeindgang for entitet af @da
label: hozzáférésipont-változat a következő entitás számára: @hu
label: is variant ingang voor entiteit van @nl
label: ist zusätzlicher Sucheinstieg für eine Entität von @de
label: varlığı için farklı erişim noktasıdır @tr
label: هو نقطة وصول مختلفة لكيان لـ @ar
label: 是……的实体的变异检索点 @zh-hans
sub property of: is access point for entity of
inverse of: has variant access point for entity
definition: Bir ismi, belirli bir sözcük kodlama şemasında tercih edilmeyen varlık için bir erişim noktasına sahip olan bir varlıkla ilişkilendirir. @tr
definition: Hozzákapcsol egy noment egy olyan entitáshoz, amelynek van egy olyan hozzáférési pontja az entitás számára, amelyet egy adott szótárkódolási sémából kiválasztva nem részesítenek előnyben. @hu
definition: Liittää nomenin entiteettiin, jolla on entiteetin hakutieto, jota ei ole valittu ensisijaiseksi tietyssä sovelluksessa tai kontekstissa. @fi
definition: Relaterer et nomen til en entitet, som har en søgeindgang for entitet, der ikke er valgt som foretrukken i et specifikt vokabularkodningsskema. @da
definition: Relates a nomen to an entity that has an access point for entity that is not selected for preference in a specific vocabulary encoding scheme.
definition: Setzt ein Nomen in Beziehung zu einer Entität, die über einen Sucheinstieg für eine Entität verfügt, der in einem bestimmten Vocabulary Encoding Scheme nicht als Vorzugsform bestimmt wird. @de
definition: يربط بين تسمية وكيان له نقطة وصول لكيان لم يتم اختيارها كنقطة وصول مختلفة مفضلة ضمن تطبيق محدد أو سياق محدد. @ar
definition: 将一个命名与有在一个特定的词表编码体系中未被首选的实体检索点的一个实体关联起来。 @zh-hans

has name of timespan
has subproperty: has variant name of timespan
has subproperty: has preferred name of timespan
lexical alias: nameOfTimespan.en
status: Published
type: Property
label: ajanjakson nimi @fi
label: har navn på tidsforløb @da
label: hat Namen eines Zeitraums @de
label: heeft naam van tijdspanne @nl
label: időtartamneve a következő: @hu
label: zaman aralığının adı ile ilişkilidir @tr
label: له اسم لفترة زمنية @ar
label: 有时间段的名称 @zh-hans
sub property of: has name of entity
inverse of: is name of timespan of
definition: Bir zaman aralığını, doğal dilde ve ortak söylemde kullanılan ifadelerdeki bir zaman aralığı unvanıyla ilişkilendirir. @tr
definition: Hozzákapcsol egy időtartamot egy időtartam természetes nyelvi megnevezéséhez és a közbeszéd során használt megfogalmazásához. @hu
definition: Liittää ajanjakson yleisessä diskurssissa luonnollisella kielellä ja sananmuodolla käytettyyn nimitykseen. @fi
definition: Relaciona un interval de temps amb un nomen que és una apel·lació d’interval de temps en llenguatge i frases naturals usada en el discurs comú. @ca
definition: Relaterer et tidsforløb til en benævnelse på tidsforløb på naturligt sprog og med naturlig formulering anvendt in almindelig diskurs. @da
definition: Relates a timespan to a nomen that is an appellation of timespan in natural language and phrasing used in common discourse.
definition: Setzt einen Zeitraum in Beziehung zu einer Bezeichnung für einen Zeitraum in natürlicher Sprache und Ausdrucksweise, die beim normalen Sprechen und Schreiben verwendet wird. @de
definition: يربط بين فترة زمنية وتسمية لفترة زمنية في اللغة الطبيعية وفي العبارات المستخدمة في الخطاب العام. @ar
definition: 将一个时间段与作为用自然语言和普通话语措词表达的时间段的称谓的一个命名关联起来。 @zh-hans

has note on entity
has subproperty: has note on resource
has subproperty: has note on agent
lexical alias: noteOnEntity.en
status: Published
type: Property
label: entitásra vonatkozó megjegyzés a következő: @hu
label: har note om entitet @da
label: hat Anmerkung zur Entität @de
label: heeft noot bij entiteit @nl
label: huomautus entiteetistä @fi
label: varlık hakkında not ile ilişkilidir @tr
label: له تبصرة لكيان @ar
label: 有关于实体的附注 @zh-hans
definition: Bir varlığı, bir varlığın bir veya daha fazla özelliğinin yapılandırılmamış geniş tanımıyla ilişkilendirir. @tr
definition: Hozzákapcsol egy entitást egy vagy több entitás ismérvének általános strukturálatlan leírásához. @hu
definition: Liittää entiteetin laajaan rakenteistamattomaan kuvailuun entiteetin yhdestä tai useammasta attribuutista. @fi
definition: Relaterer en entitet til en en bred ustruktureret definition af en eller flere attributter af en entitet. @da
definition: Relates an entity to a broad unstructured description of one or more attributes of an entity.
definition: Setzt eine Entität in Beziehung zu einer umfassenden, unstrukturierten Beschreibung eines Merkmals oder mehrerer Merkmale einer Entität. @de
definition: يربط بين كيان ووصف مستفيض غير محدد لواحدة أو أكثر من سمات كيان. @ar
definition: 将一个实体与一个实体的一个或多个属性的宽泛的、非结构化的描述关联起来。 @zh-hans

is identifier for agent of
lexical alias: identifierForAgentOf.en
status: Published
type: Property
label: er identifkator for agent af @da
label: is identificatie voor actor van @nl
label: ist Identifikator für einen Akteur von @de
label: temsilcisinin tanımlayıcısıdır @tr
label: tunniste toimijalle @fi
label: ágensazonosítója a következőnek: @hu
label: هو معرف لوكيل لـ @ar
label: 是……的行为者的标识符 @zh-hans
sub property of: is identifier for entity of
inverse of: has identifier for agent
definition: Bir isim, bir kelime kodlama şemasından alınan bir referans kodu olan bir temsilci unvanına sahip olan bir temsilciyle ilişkilendirir. @tr
definition: Hozzákapcsol egy noment egy ágenshez, amelynek van olyan ágensmegnevezése, amely egy szótárkódolási sémából származó hivatkozási kód. @hu
definition: Liittää nomenin toimijaan, jolla on sanaston merkintäjärjestelmästä otettu viitekoodi nimityksenään. @fi
definition: Relaterer et nomen til en agent, som har en benævnelse for agent, der er en referencekode hentet fra et vokabularkodningsskema. @da
definition: Relates a nomen to an agent who has an appellation of agent who is a reference code taken from a vocabulary encoding scheme.
definition: Setzt ein Nomen in Beziehung zu einem Akteur, der über eine Bezeichnung für einen Akteur verfügt, die einen Referenzcode darstellt, der aus einem Vocabulary Encoding Scheme entnommen wird. @de
definition: يربط بين تسمية ووكيل له تسمية لوكيل عبارة عن رمز إحالة مأخوذ من خطة ترميز مفردات. @ar
definition: 将一个命名与有一个取自一个词表编码体系的指称代码作为行为者称谓的一个行为者关联起来。 @zh-hans
scope note: A kódolt karakterlánc általában független a természetes nyelvektől és társadalmi névkonvencióktól. @hu
scope note: Den kodede streng er normalt uafhængig af naturligt sprog og sociale navngivningskonventioner. @da
scope note: Die kodierte Zeichenkette ist normalerweise nicht in natürlicher Sprache und unabhängig von den sozialen Benennungskonventionen. @de
scope note: Kodlanmış dizi genellikle doğal dilden ve sosyal adlandırma kurallarından bağımsızdır. @tr
scope note: Koodattu merkkijono on yleensä luonnollisesta kielestä ja sosiaalisista nimeämisen käytännöistä riippumaton. @fi
scope note: The coded string is usually independent of natural language and social naming conventions.
scope note: عادة ما تكون سلسلة التمثيلات المرمزة مستقلة عن اللغة الطبيعية وعن التسميات المتعارف عليها اجتماعيًا. @ar
scope note: 编码串通常独立于自然语言和社会命名惯例。 @zh-hans

is identifier for resource of
has subproperty: is plate number for notated music of
has subproperty: is publisher number for notated music of
lexical alias: identifierForResourceOf.en
status: Published
type: Property
label: azonosító a következő forráshoz: @hu
label: er identifkator for ressource af @da
label: is identificatie voor resource van @nl
label: ist Identifikator für eine Ressource von @de
label: kaynağının tanımlayıcısıdır @tr
label: tunniste aineistolle @fi
label: هو معرف لمصدر لـ @ar
label: 是……的资源的标识符 @zh-hans
sub property of: is identifier for entity of
inverse of: has identifier for resource
definition: Bir ismi, bir kelime kodlama şemasından alınan bir referans kodu olan bir kaynak adına sahip olan bir kaynakla ilişkilendirir. @tr
definition: Hozzákapcsol egy noment egy forráshoz, amelynek van olyan forrásmegnevezése, amely egy szótárkódolási sémából származó hivatkozási kód. @hu
definition: Liittää nomenin aineistoon, jolla jolla on sanaston merkintäjärjestelmästä otettu viitekoodi nimityksenään. @fi
definition: Relaterer et nomen til en ressource der har en ressourcebenævnelse, som er en referencekode hentet fra et vokabularkodningsskema. @da
definition: Relates a nomen to a resource that has an appellation of resource that is a reference code taken from a vocabulary encoding scheme.
definition: Setzt ein Nomen in Beziehung zu einer Ressource, die über eine Bezeichnung für eine Ressource verfügt, die einen Referenzcode darstellt, der aus einem Vocabulary Encoding Scheme entnommen wird. @de
definition: يربط تسمية بمصدر له تسمية لمصدر عبارة عن رمز إحالة مأخوذ من خطة ترميز مفردات. @ar
definition: 将一个命名与有一个取自一个词表编码体系的指称代码作为资源称谓的一种资源关联起来。 @zh-hans
scope note: A kódolt karakterlánc általában független a természetes nyelvektől és társadalmi névkonvencióktól. @hu
scope note: Den kodede streng er normalt uafhængig af naturligt sprog og sociale navngivningskonventioner. @da
scope note: Die kodierte Zeichenkette ist normalerweise nicht in natürlicher Sprache und unabhängig von den sozialen Benennungskonventionen. @de
scope note: Kodlanmış dizi genellikle doğal dilden ve sosyal adlandırma kurallarından bağımsızdır. @tr
scope note: Koodattu merkkijono on yleensä luonnollisesta kielestä ja sosiaalisista nimeämisen käytännöistä riippumaton. @fi
scope note: The coded string is usually independent of natural language and social naming conventions.
scope note: عادة ما تكون سلسلة التمثيلات المرمزة مستقلة عن اللغة الطبيعية وعن التسميات المتعارف عليها اجتماعيًا. @ar
scope note: 编码串通常独立于自然语言和社会命名惯例。 @zh-hans

has name of entity
has subproperty: has name of place
has subproperty: has name of timespan
has subproperty: has preferred name of entity
has subproperty: has variant name of entity
lexical alias: nameOfEntity.en
status: Published
type: Property
label: entiteetin nimi @fi
label: entitás neve a következő: @hu
label: har navn på entitet @da
label: hat Namen einer Entität @de
label: heeft naam van entiteit @nl
label: varlığın adı ile ilişkilidir @tr
label: له اسم لكيان @ar
label: 有实体的名称 @zh-hans
sub property of: has appellation of entity
inverse of: is name of entity of
definition: Bir varlığı, ortak söylemde kullanılan ifade ve doğal dildeki varlık unvanlıyla ilişkilendirir. @tr
definition: Hozzákapcsol egy entitást egy entitás természetes nyelvi megnevezéséhez és közbeszédben használt megfogalmazásához. @hu
definition: Liittää entiteetin entiteetin yleisessä diskurssissa luonnollisella kielellä ja sananmuodolla käytettyyn nimitykseen. @fi
definition: Relaciona una entitat amb un nomen que és una apel·lació d’entitat en llenguatge i frases naturals usada en el discurs comú. @ca
definition: Relaterer en entitet til en benævnelse på entitet på naturligt sprog og med formuleringer brugt i almindelig diskurs. @da
definition: Relates an entity to a nomen that is an appellation of entity in natural language and phrasing used in common discourse.
definition: Setzt eine Entität in Beziehung zu einer Bezeichnung für eine Entität in natürlicher Sprache und Ausdrucksweise, die beim normalen Sprechen und Schreiben verwendet wird. @de
definition: يربط بين كيان وتسمية لكيان في اللغة الطبيعية وفي العبارات المستخدمة في الخطاب العام. @ar
definition: 将一个实体与作为用自然语言和普通话语措词表达的实体的称谓的一个命名关联起来。 @zh-hans

has preferred name of entity
lexical alias: preferredNameOfEntity.en
status: Published
type: Property
label: entiteetin ensisijainen nimi @fi
label: entitás előnyben részesített neve a következő: @hu
label: har foretrukket navn på entitet @da
label: hat bevorzugten Namen einer Entität @de
label: heeft geprefereerde naam van entiteit @nl
label: tercih edilen varlık adı ile ilişkilidir @tr
label: له اسم مفضل لكيان @ar
label: 有实体的首选名称 @zh-hans
sub property of: has name of entity
inverse of: is preferred name of entity of
definition: Bir varlığı, belirli bir uygulama veya bağlamda tercih edilen bir varlığın adıyla ilişkilendirir. @tr
definition: Hozzákapcsol egy entitást egy entitásnévhez, amelyet egy adott alkalmazásban vagy kontextusban előnyben részesítenek. @hu
definition: Liittää entiteetin ensisijaiseksi tietyssä sovelluksessa tai kontekstissa ensisijaiseksi valittuun entiteetin nimeen. @fi
definition: Relaciona una entitat amb un nomen que és un nom d’entitat que se selecciona com a preferent en una aplicació o un context específic. @ca
definition: Relaterer en entitet til et navn på entitet der er valgt som foretrukket i en specifik applikation eller et specifikt sammenhæng. @da
definition: Relates an entity to a nomen that is a name of entity that is selected for preference in a specific application or context.
definition: Setzt eine Entität in Beziehung zu einem Namen einer Entität, der in einer bestimmten Anwendung oder in einem bestimmten Kontext als Vorzugsform bestimmt wird. @de
definition: يربط بين كيان واسم كيان اُختير كاسم مفضل ضمن تطبيق محدد أو سياق محدد. @ar
definition: 将一个实体与一个作为实体名称并在特定应用或语境下优先选用的命名关联起来。 @zh-hans

has variant name of entity
lexical alias: variantNameOfEntity.en
status: Published
type: Property
label: entiteetin varianttinimi @fi
label: entitás névváltozata a következő: @hu
label: har variantnavn på entitet @da
label: hat abweichenden Namen einer Entität @de
label: heeft variant naam van entiteit @nl
label: varlığın alternatif ismi ile ilişkilidir @tr
label: له اسم مختلف لكيان @ar
label: 有实体的变异名称 @zh-hans
sub property of: has name of entity
inverse of: is variant name of entity of
definition: Bir varlığı, belirli bir uygulama veya bağlamda tercih edilmeyen bir varlığın adıyla ilişkilendirir. @tr
definition: Hozzákapcsol egy entitást egy entitásnévhez, amelyet egy adott alkalmazásban vagy kontextusban nem részesítenek előnyben. @hu
definition: Liittää entiteetin nimeen, jota ei tietyssä sovelluksessa tai kontekstissa ole valittu ensisijaiseksi entiteetin nimeksi. @fi
definition: Relaterer en entitet til et navn på entitet, som ikke er valgt som foretrukket i en specifik applikation eller i et specifikt sammenhæng. @da
definition: Relates an entity to a name of entity that is not selected for preference in a specific application or context.
definition: Setzt eine Entität in Beziehung zu einem Name einer Entität, der in einer bestimmten Anwendung oder in einem bestimmten Kontext nicht als Vorzugsform bestimmt wird. @de
definition: يربط بين كيان واسم كيان لم يتم اختياره كاسم مفضل ضمن تطبيق محدد أو سياق محدد. @ar
definition: 将一个实体与一个作为实体名称并不在特定应用或语境下优先选用的命名关联起来。 @zh-hans

is assigner agent of
lexical alias: assignerAgentOf.en
status: Published
type: Property
label: atayan temsilcisidir @tr
label: er agent der tildeler af @da
label: hozzárendelő ágense a következőnek: @hu
label: is toekenner-actor van @nl
label: ist Akteur als Zuweisende/Zuweisender von @de
label: nimeäjä (toimija) @fi
label: هو وكيل مخصص لـ @ar
label: 是……的分配者行为者 @zh-hans
inverse of: is assigned by agent
definition: Bir temsilciyi, temsilci tarafından varlığa atanan isimle ilişkilendirir. @tr
definition: Hozzákapcsol egy ágenst egy nomenhez, amelyet egy ágens rendel hozzá egy entitáshoz. @hu
definition: Liittää toimijan nomeniin, jonka toimija on antanut entiteetille. @fi
definition: Relaterer en agent til et nomen der er tildelt en entitet af en agent @da
definition: Relates an agent to a nomen that is assigned to an entity by an agent.
definition: Setzt einen Akteur in Beziehung zu einem Nomen, das von einem Akteur einer Entität zugewiesen ist. @de
definition: يربط بين وكيل وتسمية خصصها وكيل لكيان. @ar
definition: 将一个行为者与被一个行为者分配给一个实体的一个命名关联起来。 @zh-hans

is assigned by agent
lexical alias: assignedByAgent.en
status: Published
type: Property
label: er tildelt af agent @da
label: hozzárendelve a következő ágens által: @hu
label: is toegekend door actor @nl
label: ist von einem Akteur zugewiesen @de
label: temsilci tarafından atanmıştır @tr
label: toimijan antama nomen @fi
label: هو مخصص من قبل وكيل @ar
label: 被一个行为者分配 @zh-hans
inverse of: is assigner agent of
definition: Bir ismi, bir varlığa isim atayan temsilciyle ilişkilendirir. @tr
definition: Hozzákapcsol egy noment egy ágenshez, amely hozzárendel egy noment egy entitáshoz. @hu
definition: Liittää nomenin toimijaan, joka antaa entiteetille nomenin. @fi
definition: Relaterer et nomen til en agent, som tildeler et nomen til en entitet. @da
definition: Relates a nomen to an agent who assigns a nomen to an entity.
definition: Setzt ein Nomen in Beziehung zu einem Akteur, der einer Entität ein Nomen zuweist. @de
definition: يربط بين تسمية ووكيل خصص اسمًا لكيانًا. @ar
definition: 将一个命名与把一个命名分配给一个实体的一个行为者关联起来。 @zh-hans

has category of entity
has subproperty: has category of resource
lexical alias: categoryOfEntity.en
status: Published
type: Property
label: entiteetin kategoria @fi
label: entitás kategóriája a következő: @hu
label: har kategori af entitet @da
label: hat Kategorie einer Entität @de
label: heeft categorie van entiteit @nl
label: varlığın kategorisi ile ilişkilidir @tr
label: له فئة لكيان @ar
label: 有实体的类别 @zh-hans
definition: Bir varlığı, varlığın ait olduğu tür ile ilişkilendirir @tr
definition: Hozzákapcsol egy entitást ahhoz a típushoz, amelyhez az entitás tartozik. @hu
definition: Liittää entiteetin tyyppiin tai jaotteluun, johon entiteetti kuuluu. @fi
definition: Relaterer en entitet til en type som en entitet tilhører. @da
definition: Relates an entity to a type to which an entity belongs.
definition: Setzt eine Entität in Beziehung zu einer Art, zu der eine Entität gehört. @de
definition: يربط بين كيان ونوع ينتمي إليه كيان. @ar
definition: 将一个实体与一个实体所属于的类型关联起来。 @zh-hans

has fingerprint
lexical alias: fingerprint.en
status: Published
type: Property
label: aineiston sormenjälkitunniste @fi
label: har fingeraftryk @da
label: hat Fingerprint @de
label: heeft vingerafdruk @nl
label: parmak izi ile ilişkilidir @tr
label: ujjlenyomata a következő: @hu
label: له بصمة @ar
label: 有指纹 @zh-hans
sub property of: has identifier for resource
inverse of: is fingerprint of
definition: Bir kaynağı, yayın tarihi veya başka bir öğeyle birleştirilmesinden oluşan kaynaktaki belirli konumlardan bir grup karakteri içeren kaynak tanımlayıcısıyla ilişkilendirir. @tr
definition: Hozzákapcsol egy forrást egy forrásazonosítóhoz, amely a forrás meghatározott helyeiről származó karakterek csoportjából áll, kombinálva a közzététel időpontjával vagy más elemmel. @hu
definition: Liittää aineiston tunnisteeseen, muodostuu aineiston tietyistä kohdista poimittujen merkkien yhdistämisestä julkaisuaikaan tai muihin elementteihin. @fi
definition: Relaterer en ressource til en identifikator for en ressource, som består af en gruppe tegn fra bestemte steder i en ressource, kombineret med et udgivelsesdato eller et andet element. @da
definition: Relates a resource to an identifier for resource that consists of a group of characters from specified locations in a resource combined with a date of publication or other element.
definition: Setzt eine Ressource in Beziehung zu einem Identifikator für eine Ressource, der aus einer Kombination von einer Gruppe von Zeichen von bestimmten Stellen einer Ressource und einem Veröffentlichungsdatum oder einem anderen Element besteht. @de
definition: يربط بين مصدر ومعرف لمصدر يتضمن مجموعة تمثيلات من مواقع محددة فى مصدر مدمج مع تاريخ نشر أو عنصر آخر. @ar
definition: 将一种资源与作为一种资源的标识符、由资源中指定位置选取的一组字符并和出版日期或其他元素一起组成的一个命名关联起来。 @zh-hans

is name of distributor of
lexical alias: nameOfDistributorOf.en
status: Published
type: Property
label: aineiston jakelijan nimi @fi
label: dağıtımcısının adıdır @tr
label: er navn på distributør af @da
label: is naam van distributeur van @nl
label: ist Vertriebsname von @de
label: neve a következő terjesztőjének: @hu
label: هو اسم موزع لـ @ar
label: 是……的发行者的名称 @zh-hans
sub property of: is appellation of entity of
inverse of: has name of distributor
definition: Bir ismi, yayınlamış bir kaynağın dağıtımında temsilcinin sorumluluğunu içeren kaynakla ilişkilendirir. @tr
definition: Hozzákapcsol egy noment egy forráshoz, amelyhez hozzátartozik egy ágens felelőssége egy forrás terjesztéséért. @hu
definition: Liittää nomenin aineistoon, johon liittyy toimijan vastuu julkaistun aineiston jakelusta. @fi
definition: Relaterer et nomen til en ressource, som involverer ett agentansvar for at distribuere en udgiven ressource. @da
definition: Relates a nomen to a resource that involves a responsibility of an agent for distributing a published resource.
definition: Setzt ein Nomen in Beziehung zu einer Ressource, bei der ein Akteur für den Vertrieb einer veröffentlichten Ressource verantwortlich ist. @de
definition: يربط تسمية بمصدر ينطوي على مسؤولية وكيل عن توزيع مصدر منشور. @ar
definition: 将一个命名与涉及发行一种出版资源的一个行为者的责任的一种资源关联起来。 @zh-hans

is name of entity of
has subproperty: is name of place of
has subproperty: is name of timespan of
has subproperty: is preferred name of entity of
has subproperty: is variant name of entity of
lexical alias: nameOfEntityOf.en
status: Published
type: Property
label: entiteetin nimi @fi
label: entitásneve a következőnek: @hu
label: er navn på entitet af @da
label: is naam van entiteit van @nl
label: ist Name einer Entität von @de
label: varlığının adıdır @tr
label: هو اسم لكيان لـ @ar
label: 是……的实体的名称 @zh-hans
sub property of: is appellation of entity of
inverse of: has name of entity
definition: Bir ismi, yerel dilde varlık unvanına ve ortak söylemde kullanılan ifadelere sahip bir varlıkla ilişkilendirir. @tr
definition: Hozzákapcsol egy noment egy entitáshoz, amelynek van egy természetes nyelvű entitás-megnevezése és közbeszédben használt megfogalmazása. @hu
definition: Liittää nomenin entiteettiin, jolla on yleisessä diskurssissa käytetty nimitys luonnollisella kielellä ja sananmuodolla. @fi
definition: Relaterer et nomen til en entitet, som har en entitetsbenævnelse på naturligt sprog og med formuleringer brugt i almindelig diskurs. @da
definition: Relates a nomen to an entity that has an appellation of entity in natural language and phrasing used in common discourse.
definition: Setzt ein Nomen in Beziehung zu einer Entität, die über eine Bezeichnung für eine Entität in natürlicher Sprache und Ausdrucksweise verfügt, die beim normalen Sprechen und Schreiben verwendet wird. @de
definition: يربط بين تسمية وكيان له تسمية لكيان في اللغة الطبيعية وفي العبارات المستخدمة في الخطاب العام. @ar
definition: 将一个命名与有用自然语言和普通话语措词表达的实体的称谓的一个实体关联起来。 @zh-hans

is name of manufacturer of
lexical alias: nameOfManufacturerOf.en
status: Published
type: Property
label: aineiston valmistajan nimi @fi
label: er navn på producent af @da
label: is naam van vervaardiger van @nl
label: ist Herstellername von @de
label: neve a következő gyártójának: @hu
label: üreticisinin adıdır @tr
label: هو اسم لمُصّنع لـ @ar
label: 是……的生产者的名称 @zh-hans
sub property of: is appellation of entity of
inverse of: has name of manufacturer
definition: Bir ismi, yayımlanmış bir kaynağın basılması, çoğaltılması, yayınlanması vb. için bir temsilcinin sorumluluğunu içeren kaynakla ilişkilendirir. @tr
definition: Hozzákapcsol egy noment egy forráshoz, amelyhez hozzátartozik egy ágens felelőssége a kiadott forrás nyomtatásáért, sokszorosításáért, öntéséért, stb. @hu
definition: Liittää nomenin aineistoon, johon liittyy toimijan vastuu julkaistun aineiston painamisesta, monistamisesta, kirjasinten valamisesta tms. @fi
definition: Relaterer et nomen til en ressource, som involverer ett agentansvar for at for trykning, duplikering, støbning etc. af en udgiven ressource. @da
definition: Relates a nomen to a resource that involves a responsibility of an agent for printing, duplicating, casting, etc., a published resource.
definition: Setzt ein Nomen in Beziehung zu einer Ressource, bei der ein Akteur für den Druck, die Vervielfältigung, den Guss und so weiter einer veröffentlichten Ressource verantwortlich ist. @de
definition: يربط تسمية بمصدر ينطوي على مسؤولية وكيل عن طباعة، نسخ، طَرَح...إلخ، مصدر منشور. @ar
definition: 将一个命名与涉及一种出版资源的印刷、复制、铸造等的一个行为者的责任的一种资源关联起来。 @zh-hans

is name of producer of
lexical alias: nameOfProducerOf.en
status: Published
type: Property
label: aineiston tuottajan nimi @fi
label: er navn på producer af @da
label: is naam van producent van @nl
label: ist Erzeugername von @de
label: neve a következő előállítójának: @hu
label: yapımcısının adıdır @tr
label: له اسم لمنتج لـ @ar
label: 是……的制作者的名称 @zh-hans
sub property of: is appellation of entity of
inverse of: has name of producer
definition: Bir ismi, yayınlanmamış bir kaynağı yazmak, üretmek, inşa etmek vb. için bir temsilcinin sorumluluğunu içeren kaynakla ilişkilendirir. @tr
definition: Hozzákapcsol egy noment egy forráshoz, amelyhez hozzátartozik egy ágens felelőssége egy kiadatlan forrás írásáért, összeállításáért, készítéséért, stb. @hu
definition: Liittää nomenin aineistoon, johon liittyy toimijan vastuu julkaisemattoman aineiston kaiverruksesta, valmistuksesta, kokoonpanosta tms. @fi
definition: Relaterer et nomen til en ressource, som involverer ett agentansvar for indskrift, fremstilling, konstruktion etc. af en ikke udgiven ressource. @da
definition: Relates a nomen to a resource that involves a responsibility of an agent for inscribing, fabricating, constructing, etc., an unpublished resource.
definition: Setzt ein Nomen in Beziehung zu einer Ressource, bei der ein Akteur für das Gravieren, Fabrizieren, Konstruieren und so weiter einer unveröffentlichten Ressource verantwortlich ist. @de
definition: يربط تسمية بمصدر ينطوي على مسؤولية وكيل عن تسجيل، تصنيع، إنشاء...إلخ، مصدر غير منشور. @ar
definition: 将一个命名与涉及一种非出版资源的镌刻、制造、构建等的一个行为者的责任的一种资源关联起来。 @zh-hans

is name of publisher of
lexical alias: nameOfPublisherOf.en
status: Published
type: Property
label: aineiston kustantajan nimi @fi
label: er navn på udgiver af @da
label: is naam van uitgever van @nl
label: ist Verlagsname von @de
label: neve a következő kiadójának: @hu
label: yayıncısının adıdır @tr
label: هو اسم لناشر لـ @ar
label: 是……的出版者的名称 @zh-hans
sub property of: is appellation of entity of
inverse of: has name of publisher
definition: Bir ismi, yayımlanmış bir kaynağı yayınlamak, çıkartmak veya basmak için bir temsilcinin sorumluluğunu içeren kaynakla ilişkilendirir. @tr
definition: Hozzákapcsol egy noment egy forráshoz, amelyhez hozzátartozik egy ágens felelőssége kiadott források kiadásáért, kibocsájtásáért vagy megjelentetéséért. @hu
definition: Liittää nomenin aineistoon, johon liittyy toimijan vastuu julkaistujen aineistojen kustantamisesta, julkaisemisesta tai ilmestymisestä. @fi
definition: Relaterer et nomen til en ressource, som involverer et agentansvar for publicering frigivelse eller udgivelse af en udgiven ressource. @da
definition: Relates a nomen to a resource that involves a responsibility of an agent for publishing, releasing, or issuing a published resources.
definition: Setzt ein Nomen in Beziehung zu einer Ressource, bei der ein Akteur für das Veröffentlichen, die Freigabe oder die Herausgabe einer veröffentlichten Ressource verantwortlich ist. @de
definition: يربط تسمية بمصدر ينطوي على مسؤولية وكيل عن نشر، تحرير، أو إصدار مصدر منشور. @ar
definition: 将一个命名与涉及一种出版资源的出版、发布、或发行的一个行为者的责任的一种资源关联起来。 @zh-hans

is preferred name of entity of
lexical alias: preferredNameOfEntityOf.en
status: Published
type: Property
label: előnyben részesített neve a következő entitásnak: @hu
label: entiteetin ensisijainen nimi @fi
label: er foretrukket navn på entitet af @da
label: is geprefereerde naam van entiteit van @nl
label: ist bevorzugter Name einer Entität von @de
label: varlığının tercih edilen adıdır @tr
label: هو اسم مُفضل لكيان لـ @ar
label: 是……的实体的首选名称 @zh-hans
sub property of: is name of entity of
inverse of: has preferred name of entity
definition: Bir ismi, belirli bir uygulama veya bağlamda seçilen bir varlığın tercih edilen adıyla ilişkilendirir. @tr
definition: Hozzákapcsol egy noment egy entitáshoz, amelynek van egy olyan entitásneve, amelyet egy adott alkalmazásban vagy kontextusban előnyben részesítenek. @hu
definition: Liittää nomenin entiteettiin, jolla on on tietyssä sovelluksessa tai kontekstissa ensisijaiseksi valittu entiteetin nimi. @fi
definition: Relaterer et nomen til en entitet, som har et entitetsnavn, der er valgt som foretrukket i en specifik applikation eller et specifikt sammenhæng. @da
definition: Relates a nomen to an entity that has a name of entity that is selected for preference in a specific application or context.
definition: Setzt ein Nomen in Beziehung zu einer Entität, die über einen Namen für eine Entität verfügt, der in einer bestimmten Anwendung oder in einem bestimmten Kontext als Vorzugsform bestimmt wird. @de
definition: يربط بين تسمية وكيان له اسم كيان اُختير كاسم مُفضل في تطبيق محدد أو سياق محدد. @ar
definition: 将一个命名与有在一个特定的应用或语境中被首选的一个实体名称的一个实体关联起来。 @zh-hans

is variant name of entity of
has subproperty: is variant access point for agent of
has subproperty: is variant access point for place of
has subproperty: is variant access point for resource of
has subproperty: is variant access point for timespan of
lexical alias: variantNameOfEntityOf.en
status: Published
type: Property
label: entiteetin varianttinimi @fi
label: er variantnavn på entitet af @da
label: is variant naam van corporatie van @nl
label: ist abweichender Name einer Entität von @de
label: névváltozata a következő entitásnak: @hu
label: varlığının farklı ismi @tr
label: هو اسم مختلف لكيان لـ @ar
label: 是……的实体的变异名称 @zh-hans
sub property of: is name of entity of
inverse of: has variant name of entity
definition: Bir ismi, belirli bir uygulama veya bağlamda seçilen bir varlığın tercih edilmeyen adıyla ilişkilendirir. @tr
definition: Hozzákapcsol egy noment egy entitáshoz, amelynek van egy olyan entitásneve, amelyet egy adott alkalmazásban vagy kontextusban nem részesítenek előnyben. @hu
definition: Liittää nomenin entiteettiin, jolla on nimi, jota ei tietyssä sovelluksessa tai kontekstissa ole valittu ensisijaiseksi entiteetin nimeksi. @fi
definition: Relaterer et nomen til en entitet, som har et entitetsnavn, der ikke er valgt som foretrukket i en specifik applikation eller et specifikt sammenhæng. @da
definition: Relates a nomen to an entity that has a name of entity that is not selected for preference in a specific application or context.
definition: Setzt ein Nomen in Beziehung zu einer Entität, die über einen Namen für eine Entität verfügt, der in einer bestimmten Anwendung oder in einem bestimmten Kontext nicht als Vorzugsform bestimmt wird. @de
definition: يربط بين تسمية وكيان لم يتم اختياره كاسم مختلف مفضل ضمن تطبيق محدد أو سياق محدد. @ar
definition: 将一个命名与有在一个特定的应用或语境中未被首选的一个实体名称的一个实体关联起来。 @zh-hans

has thematic index number
lexical alias: thematicIndexNumber.en
status: Published
type: Property
label: aineiston temaattisen aineistoluettelon numero @fi
label: har tematisk indeksnummer @da
label: hat Werkverzeichnisnummer @de
label: heeft thematische index-nummer @nl
label: tematik dizin numarası ile ilişkilidir @tr
label: tematikus indexszáma a következő: @hu
label: له رقم كشاف موضوعي @ar
label: 有主题索引号 @zh-hans
sub property of: has numeric designation of musical resource
inverse of: is thematic index number of
definition: Bir kaynağı, bir bestecinin eserlerinden oluşan bir listeden belirlenen, genellikle kronolojik sıraya veya kategorilere göre düzenlenmiş, her bir beste veya büyük bestelerin her bir bölümü için temanın verildiği müzik eserinin sayısal bir belirteciyle ilişkilendirir. @tr
definition: Hozzákapcsol egy forrást egy zenei forrás számjelzéséhez, amelyet egy zeneszerző forrásainak a komponálás kronológiai sorrendje vagy kategóriák szerint rendezett jegyzékéből rendeltek hozzá, amely minden zeneművet vagy a nagyobb zeneművek egyes szakaszait témával látja el. @hu
definition: Liittää aineiston musiikkiaineiston numeeriseen määritteeseen, joka on otettu säveltäjän aineistoluettelosta. aineistoluettelo on tavallisesti järjestetty aikajärjestykseen tai kategorioittain sisältäen teeman jokaisesta sävellyksestä tai laajan sävellyksen jokaisesta osasta. @fi
definition: Relaterer en ressource til en numerisk betegnelse for en musikressource, som er tildelt fra en liste af ressourcer af en komponist, normalt arrangeret i kronologisk rækkefølge eller efter kategorier, med temaet angivet for enhver komposition eller for enhver del af store kompostioner. @da
definition: Relates a resource to a numeric designation of musical resource that is assigned from a list of resources of a composer, usually arranged in chronological order or by categories, with the theme given for each composition or for each section of large compositions.
definition: Setzt eine Ressource in Beziehung zu einer numerischen Bezeichnung einer Musikressource aus einem Ressourcenverzeichnis einer Komponistin/eines Komponisten, das in einer chronologischen Reihenfolge oder nach Kategorien angeordnet ist. Zusätzlich können darin Notenzitate in Form von Incipits oder thematischem Material für jede Komposition oder für jede Passage längerer Kompositionen aufgeführt sein. @de
definition: يربط بين مصدر وتسمية رقمية لمصدر موسيقي مخصص من قائمة مصادر لمؤلف موسيقى، وعادةً ما يتم ترتيبها بترتيب زمني أو حسب الفئات، مع تحديد الموضوع لكل تلحين أو لكل قسم من المقطوعات الكبيرة. @ar
definition: 将一种资源与根据作曲者的资源列表分配、通常按年代顺序或类别顺序排列、并有每个谱曲或更大谱曲每个部分的主题的音乐资源的数字标识关联起来。 @zh-hans

has serial number
lexical alias: serialNumber.en
status: Published
type: Property
label: har serienummer @da
label: hat laufende Nummer @de
label: heeft serienummer @nl
label: järjestysnumero aineistolle @fi
label: seri numarası ile ilişkilidir @tr
label: sorozati száma a következő: @hu
label: له رقم تسلسلي @ar
label: 有序列号 @zh-hans
sub property of: has numeric designation of musical resource
inverse of: is serial number of
definition: Bir kaynağı, aynı başlığı paylaşan veya aynı başlığı ve aynı temsili performans aracını paylaşan bir dizi müzik kaynağını gösteren bir besteci veya referans kaynağı tarafından belirlenen müzik kaynağının sayısal belirteciyle ilişkilendirir. @tr
definition: Hozzákapcsol egy forrást egy zenei forrás számjelzéséhez, amelyet egy zeneszerző vagy egy irodalomjegyzékben szereplő forrás rendelt hozzá, amely az olyan zenei források sorrendjét jelöli, amelyek azonos címűek, vagy azonos a címük és a jellegzetes az előadásmédiumuk. @hu
definition: Liittää aineiston musiikkiteoksen numeeriseen määritteeseen, joka on säveltäjän antama tai tietolähteestä otettu. Määrite ilmaisee saman nimekkeen tai saman nimekkeen ja saman edustavan esityskokoonpanon jakavien musiikkiaineistoten järjestystä. @fi
definition: Relaciona un recurs amb un nomen que és una designació numèrica d’un recurs musical que és assignada per un compositor o una font de referència que indica una seqüència de recursos musicals que comparteixen el mateix títol o que comparteixen el mateix títol i el mateix repartiment d’execució representatiu. @ca
definition: Relaterer en ressource til en numerisk betegnelse for en musikressource, som er tildelt af en komponist eller en referencekilde, som indikerer en sekvens af musikressourcer, som deler samme titel eller deler samme titel og den samme repræsentative besætning. @da
definition: Relates a resource to a nomen that is a numeric designation of musical resource that is assigned by a composer or a reference source that indicates a sequence of musical resources that share the same title or that share the same title and the same representative medium of performance.
definition: Setzt eine Ressource in Beziehung zu einer numerischen Bezeichnung einer Musikressource, die von einer Komponistin/einem Komponisten vergeben oder aus einem Nachschlagewerk entnommen wird und auf eine Folge von Musikressourcen hinweist, die den gleichen Titel oder den gleichen Titel und die gleiche repräsentative Besetzung haben. @de
definition: يربط بين مصدر وتسمية رقمية لمصدر موسيقي يخصص من جانب ملحن أو مصدر مرجعي يشير إلى تسلسل المصادر الموسيقية التي تشترك في نفس العنوان أو التي تشترك في نفس العنوان ونفس وسيلة الأداء الممثلة. @ar
definition: 将一种资源与作为由作曲者或参考信息源分配、表示有同样题名或者同样题名和同样表演表现媒介的音乐资源序列的音乐资源的数字标识的一个命名关联起来。 @zh-hans

has opus number
lexical alias: opusNumber.en
status: Published
type: Property
label: har opusnummer @da
label: hat Opus-Nummer @de
label: heeft opusnummer @nl
label: opus numarası ile ilişkilidir @tr
label: opusnumero aineistolle @fi
label: opusszáma a következő: @hu
label: له رقم قطعة موسيقية @ar
label: 有作品编号 @zh-hans
sub property of: has numeric designation of musical resource
inverse of: is opus number of
definition: Bir kaynağı, bir bestecinin kronolojik beste sırasını gösteren bir kaynak listesinden belirlenen müzikal kaynağın sayısal belirteciyle ilişkilendirir. @tr
definition: Hozzákapcsol egy forrást egy zenei forrás számjelzéséhez, amelyet egy zeneszerző forrásainak a komponálás kronológiai sorrendjét jelölő jegyzékéből rendeltek hozzá. @hu
definition: Liittää aineiston musiikkiteoksen numeeriseen määritteeseen, joka on sävellykset aikajärjestyksessä esittävästä säveltäjän aineistoluettelosta otettu numerointi. @fi
definition: Relaciona un recurs amb un nomen que és una designació numèrica d’un recurs musical que s’assigna a partir d’una llista de recursos d’un compositor que indica l’ordre cronològic de composició. @ca
definition: Relaterer en ressource til en numersik betengelse for en musikressource, tildelt fra en liste af ressourcer af en komponist, som indikerer den kronoligiske rækkefølge af kompositionen. @da
definition: Relates a resource to a nomen that is a numeric designation of musical resource assigned from a list of resources of a composer indicating the chronological order of composition.
definition: Setzt eine Ressource in Beziehung zu einer numerische Bezeichnung einer Musikressource, die von einer Komponistin/einem Komponisten oder einem Verlag vergeben wird oder gemäß einem Nachschlagewerk oder Werkverzeichnis verwendet wird. Sie gibt meist Aufschluss über die chronologische Reihenfolge der Komposition innerhalb eines Gesamtwerks. @de
definition: يربط بين مصدر وتسمية رقمية لمصدر موسيقي مخصص من قائمة مصادر لمؤلف موسيقى تشير إلى ترتيب زمنى للقطع الموسيقية. @ar
definition: 将一种资源与作为根据作曲者资源列表分配、表示作曲时间顺序的音乐资源的一个数字标识的一个命名关联起来。 @zh-hans

has note on agent
lexical alias: noteOnAgent.en
status: Published
type: Property
label: har note om agent @da
label: hat Anmerkung zum Akteur @de
label: heeft noot bij actor @nl
label: huomautus toimijasta @fi
label: temsilciye hakkında not ile ilişkilidir @tr
label: ágensre vonatkozó megjegyzése a következő: @hu
label: له تبصرة عن وكيل @ar
label: 有关于行为者的附注 @zh-hans
sub property of: has note on entity
definition: Bir temsilciyi, bir temsilcinin bir veya daha fazla özelliğinin yapılandırılmamış geniş tanımıyla ilişkilendirir. @tr
definition: Hozzákapcsol egy ágenst az ágens egy vagy több ismérvének átfogó strukturálatlan leírásához. @hu
definition: Liittää toimijan laajaan rakenteistamattomaan kuvailuun toimijan yhdestä tai useammasta attribuutista. @fi
definition: Relaterer en agent til en bred ustruktureret beskrivelse af en eller flere attibuter til en agent. @da
definition: Relates an agent to a broad unstructured description of one or more attributes of an agent.
definition: Setzt einen Akteur in Beziehung zu einer umfassenden, unstrukturierten Beschreibung eines Merkmals oder mehrerer Merkmale eines Akteurs. @de
definition: يربط بين وكيل ووصف مستفيض غير محدد لواحدة أو أكثر من سمات وكيل @ar
definition: 将一个行为者与一个行为者的一个或多个属性的宽泛的、非结构化的描述关联起来。 @zh-hans

is title proper of
lexical alias: titleProperOf.en
status: Published
type: Property
label: er hovedtitel af @da
label: főcíme a következőnek: @hu
label: is hoofdtitel van @nl
label: ist Haupttitel von @de
label: päänimeke aineistolle @fi
label: uygun başlık @tr
label: هو عنوان مناسب لـ @ar
label: 是……的正题名 @zh-hans
inverse of: has title proper
definition: Bir ismi, bir kaynağın asıl ismi olan, yani normalde bir kaynağı isimlendirirken kullanılan bir başlığa sahip kaynakla ilişkilendirir. @tr
definition: Hozzákapcsol egy noment egy forrás fő megnevezéséhez, azaz a forrás általánosan használt címéhez. @hu
definition: Liittää nomenin aineistoon, jolla on ensisijainen aineiston nimi eli aineiston nimeämisessä normaalisti käytetty nimeke. @fi
definition: Relaterer et nomen til en ressource, som har et hovednavn på en ressource, dvs. en titel som man normalt bruger når man navngiver en ressource. @da
definition: Relates a nomen to a resource that has a chief name of a resource, that is, a title normally used when naming a resource.
definition: Setzt ein Nomen in Beziehung zu einer Ressource, die über einen Hauptnamen, das heißt einem Titel, der normalerweise bei der Benennung einer Ressource verwendet wird, verfügt. @de
definition: تسمية ومصدر له اسم بارز (اسم رئيسي)، وهذا يعني استخدام عنوان يستخدم عادةً عند تسمية مصدر. @ar
definition: 将一个命名与有一个主要名称（亦即命名一种资源所通常使用的一个题名）的一种资源关联起来。 @zh-hans
scope note: Alternatif bir başlık, asıl başlığın bir parçası olarak ele alınır. @tr
scope note: An alternative title is treated as part of the title proper.
scope note: Az alternatív címet a főcím részeként kezelik. @hu
scope note: Ein Alternativtitel wird als Teil eines Haupttitels behandelt. @de
scope note: En alternativ titel behandles som en del af hovedtitlen. @da
scope note: Vaihtoehtoista nimekettä pidetään päänimekkeen osana. @fi
scope note: يتم التعامل مع العنوان البديل كجزء من العنوان نفسه. @ar
scope note: 交替题名被处理为正题名的部分。 @zh-hans

is title of series of
has subproperty: is title proper of subseries of (Deprecated)
has subproperty: is parallel title of series of
lexical alias: titleOfSeriesOf.en
status: Published
type: Property
label: er serietitel af @da
label: is reekstitel van @nl
label: ist Titel einer Reihe von @de
label: sarjan nimeke aineistolle @fi
label: serisinin başlığıdır @tr
label: sorozati címe a következőnek: @hu
label: هو عنوان لسلسلة لـ @ar
label: 是……的丛编的题名 @zh-hans
sub property of: is title of resource of
inverse of: has title of series
definition: Bir ismi, kaynağın ait olduğu bir diziyi tanımlayan bir başlığa sahip kaynakla ilişkilendirir. @tr
definition: Hozzákapcsol egy noment egy forráshoz, amelynek van egy olyan címe, amely azonosítja azt a sorozatot, amelyhez a forrás tartozik. @hu
definition: Liittää nomenin aineistoon, jolla on nimeke, joka ilmaisee, mihin sarjaan aineisto kuuluu. @fi
definition: Relaterer et navn til en ressource, som har en titel, der identificerer en serie som en ressource tilhører. @da
definition: Relates a nomen to a resource that has a title that identifies a series to which a resource belongs.
definition: Setzt ein Nomen in Beziehung zu einer Ressource, die über einen Titel verfügt, der die Reihe identifiziert, zu der eine Ressource gehört. @de
definition: يربط تسمية بمصدر له عنوان يحدد سلسلة تنتمي إليها مصدر. @ar
definition: 将一个命名与有识别一种资源所属于的一种丛编的题名的一资源关联起来。 @zh-hans

is title proper of subseries of (Deprecated)
lexical alias: titleProperOfSubseriesOf.en
status: Deprecated
type: Property
sub property of: is title of series of
inverse of: has title proper of subseries (Deprecated)

is thematic index number of
lexical alias: thematicIndexNumberOf.en
status: Published
type: Property
label: er tematisk indeksnummer af @da
label: is thematisch indexnummer van @nl
label: ist Werkverzeichnisnummer von @de
label: konu ile ilgili dizin numarasıdır @tr
label: temaattisen aineistoluettelon numero aineistolle @fi
label: tematikus indexszáma a következőnek: @hu
label: هو رقم كشاف موضوعى لـ @ar
label: 是……的主题索引号 @zh-hans
sub property of: is numeric designation of musical resource of
inverse of: has thematic index number
definition: Bir ismi, bir bestecinin genellikle kronolojik sıraya veya kategorilere göre düzenlenmiş, her bir beste veya büyük bestelerin her bir bölümü için tema verilen bir kaynak listesinden atanan sayısal bir tanımlayıcı olan kaynak olan bir müzikal kaynakla ilişkilendirir. @tr
definition: Hozzákapcsol egy noment egy zenei forráshoz, amely rendelkezik egy zeneszerző forrásainak a komponálás kronológiai sorrendjének vagy kategóriák szerint rendezett jegyzékéből hozzárendelt forrásazonosítóval, egy számjelzéssel, amely minden zeneművet vagy a nagyobb zeneművek egyes szakaszait témával látja el. @hu
definition: Liittää nomenin musiikkiaineistoon, jolla on säveltäjän aineistoluettelosta otettu numeerinen määrite. Aineistoluettelo on tavallisesti järjestetty aikajärjestykseen tai kategorioittain sisältäen teeman jokaisesta sävellyksestä tai laajan sävellyksen jokaisesta osasta. @fi
definition: Relaterer et nomen til en musikressource, som har en identifikator for ressource, der er en numerisk betegnelse tildelt fra en liste af ressourcer af en komponist, normalt arrangerede i kronologisk rækkefølge eller efter kategorier, med temaet angivet for enhever komposition eller for enhver del af en stor komposition. @da
definition: Relates a nomen to a musical resource that has an identifier for resource that is a numeric designation assigned from a list of resources of a composer, usually arranged in chronological order or by categories, with the theme given for each composition or for each section of large compositions.
definition: Setzt ein Nomen in Beziehung zu einer Musikressource, die über einen Identifikator für eine Ressource in Form einer numerischen Bezeichnung aus einem Ressourcenverzeichnis einer Komponistin/eines Komponisten verfügt, das in einer chronologischen Reihenfolge oder nach Kategorien angeordnet ist. Zusätzlich können darin Notenzitate in Form von Incipits oder thematischem Material für jede Komposition oder für jede Passage längerer Kompositionen aufgeführt sein. @de
definition: يربط تسمية بمصدر موسيقي له معرف لمصدر عبارة عن تسمية رقمية مخصصة من قائمة مصادر المؤلف، وعادةً ما يتم ترتيبها بترتيب زمني أو حسب الفئات، مع تحديد الموضوع لكل تلحين أو لكل قسم من المقطوعات الكبيرة. @ar
definition: 将一个命名与有根据作曲者资源列表分配、通常按年代顺序或类别顺序排列、并有作为每个谱曲或更大谱曲每个部分的主题的资源之数字标识的一个资源标识的一种音乐资源关联起来。 @zh-hans

is serial number of
lexical alias: serialNumberOf.en
status: Published
type: Property
label: er serienummer af @da
label: is serienummer van @nl
label: ist Opus-Nummer von @de
label: järjestysnumero aineistossa @fi
label: seri numarasıdır @tr
label: sorozatszáma a következőnek: @hu
label: هو رقم مسلسل لـ @ar
label: 是……的序列号 @zh-hans
sub property of: is numeric designation of musical resource of
inverse of: has serial number
definition: Bir ismi, aynı başlığı paylaşan veya aynı başlığı ve aynı temsili icra ortamını paylaşan bir dizi müzikal kaynağı gösteren bir besteci veya referans kaynağı tarafından atanmış sayısal bir müzikal kaynak tanımına sahip bir müzikal kaynakla ilişkilendirir. @tr
definition: Hozzákapcsol egy noment egy zenei forráshoz, amely rendelkezik egy zeneszerző vagy egy irodalomjegyzékben szereplő forrás által hozzárendelt forrásazonosítóval, amely egy számjelzéssel az olyan zenei források sorrendjét jelöli, amelyek azonos címűek, vagy azonos mind a címük mind a jellegzetes előadásmédiumuk. @hu
definition: Liittää nomenin musiikkiaineistoon, jolla on säveltäjän aineistoluettelosta tai tietolähteestä otettu järjestysnumero. Määrite ilmaisee saman nimekkeen tai saman nimekkeen ja saman edustavan esityskokoonpanon jakavien musiikkiaineistoten järjestystä. @fi
definition: Relaterer et nomen til en musikressource, som har en numerisk betegnelse af en musikressource, tildelt af en komponist eller af en referencekilde, som indikerer en sekvens af musikressourcer, som deler samme titel eller deler samme titel og den samme repræsentative besætning. @da
definition: Relates a nomen to a musical resource that has a numeric designation of musical resource assigned by a composer or a reference source that indicates a sequence of musical resources that share the same title or that share the same title and the same representative medium of performance.
definition: Setzt ein Nomen in Beziehung zu einer Musikressource, die über eine numerische Bezeichnung einer Musikressource verfügt, die von einer Komponistin/einem Komponisten vergeben oder aus einem Nachschlagewerk entnommen wird und auf eine Folge von Musikressourcen hinweist, die den gleichen Titel oder den gleichen Titel und die gleiche repräsentative Besetzung haben. @de
definition: يربط تسمية بمصدر موسيقي له تسمية رقمية لمصدر موسيقي يخصص من جانب ملحن أو مصدر مرجعي يشير إلى تسلسل المصادر الموسيقية التي تشترك في نفس العنوان أو التي تشترك في نفس العنوان ونفس وسيلة الأداء الممثلة. @ar
definition: 将一个命名与有由作曲者或参考信息源分配、表示有同样题名或者同样题名和同样表演表现媒介的音乐资源序列的音乐资源的一个数字标识的一种音乐资源关联起来。 @zh-hans

is opus number of
lexical alias: opusNumberOf.en
status: Published
type: Property
label: er opusnummer af @da
label: is opusnummer van @nl
label: ist Opus-Nummer von @de
label: opus numarasıdır @tr
label: opusnumero aineistossa @fi
label: opusszáma a következőnek: @hu
label: هو رقم قطعة موسيقية لـ @ar
label: 是……的作品号 @zh-hans
sub property of: is numeric designation of musical resource of
inverse of: has opus number
definition: Bir ismi, bir bestecinin kronolojik kompozisyon sırasını gösteren kaynaklar listesinden atanan sayısal bir atama olan kaynak için bir tanımlayıcıya sahip bir müzik kaynağıyla ilişkilendirir. @tr
definition: Hozzákapcsol egy noment egy zenei forráshoz, amely rendelkezik egy a zeneszerző forrásainak jegyzékéből vett olyan forrásazonosítóval, amely egy számjelzéssel jelzi a kompozíció kronológiai sorrendjét. @hu
definition: Liittää nomenin musiikkiaineistoon, jolla on säveltäjän aineistoluettelosta otettu numeerinen, sävellyksen kronologisen järjestyksen kertova tunniste. @fi
definition: Relaterer et nomen til en musikressource, som har en identifikator for ressource, der er en numerisk betegnelse tildelt fra en liste af ressourcer af en komponist der indikerer den kronoligiske rækkefølge af kompositionen. @da
definition: Relates a nomen to a musical resource that has an identifier for resource that is a numeric designation assigned from a list of resources of a composer indicating chronological order of composition.
definition: Setzt ein Nomen in Beziehung zu einer Musikressource, die über einen Identifikator für eine Ressource verfügt, der von einer Komponistin/einem Komponisten oder einem Verlag vergeben wird oder gemäß einem Nachschlagewerk oder Werkverzeichnis verwendet wird. Er gibt meist Aufschluss über die chronologische Reihenfolge der Komposition innerhalb eines Gesamtwerks. @de
definition: يربط تسمية بمصدر موسيقي له معرف لمصدر عبارة عن تسمية رقمية مخصصة من قائمة مصادر لمؤلف موسيقى تشير إلى ترتيب زمنى للقطع الموسيقية. @ar
definition: 将一个命名与有根据作曲者资源列表分配、表示作曲时间顺序的一个数字标识作为一个资源标识的一种音乐资源关联起来。 @zh-hans

is numeric designation of musical resource of
has subproperty: is thematic index number of
has subproperty: is serial number of
has subproperty: is opus number of
lexical alias: numericDesignationOfMusicalResourceOf.en
status: Published
type: Property
label: er numerisk betegnelse af musikressource af @da
label: is numerieke aanduiding van muziek-resource van @nl
label: ist numerische Bezeichnung einer Musikressource von @de
label: müzikal kaynağının sayısal tanımlamasıdır @tr
label: numeerinen määrite @fi
label: számjelzése a következő zenei forrásnak: @hu
label: هو تسمية رقمية لمصدر موسيقي لـ @ar
label: 是……的音乐资源的数字标识 @zh-hans
inverse of: has numeric designation of musical resource
definition: Bir ismi, bir besteci, yayıncı veya müzikolog tarafından bir müzik kaynağına atanan bir seri numarası, opus numarası veya tematik dizin numarası olan bir kaynak tanımlayıcısına sahip bir müzik kaynağıyla ilişkilendirir. @tr
definition: Hozzákapcsol egy noment egy zenei forráshoz, amely rendelkezik egy olyan forrásazonosítóval, amely egy zeneszerzőtől, kiadótól vagy egy zenetudóstól származó, a zenei forrást jelölő sorozati szám, opusszám vagy egy tematikus indexszám. @hu
definition: Liittää nomenin musiikkiaineistoon, jolla on tunnisteena säveltäjän, julkaisijan tai musiikkitieteilijän sarjanumero, opusnumero tai temaattisen teosluettelon numero. @fi
definition: Relaterer et nomen til en musikressource der har en identifikator for ressource, som er et serienummer, opusnummer, eller tematisk indeksnummer, tildelt til en musikressource af en komponist, udgiver, eller musikforsker. @da
definition: Relates a nomen to a musical resource that has an identifier for resource that is a serial number, opus number, or thematic index number assigned to a musical resource by a composer, publisher, or a musicologist.
definition: Setzt ein Nomen in Beziehung zu einer Musikressource, die über einen Identifikator für eine Ressource verfügt, der eine laufende Nummer, eine Opus-Nummer oder eine Werkverzeichnisnummer darstellt, die einer Musikressource durch eine Komponistin/einen Komponisten, einen Verlag oder eine Musikwissenschaftlerin/einen Musikwissenschaftler zugewiesen wird. @de
definition: يربط تسمية بمصدر موسيقي له معرف لمصدر عبارة عن عن رقم مسلسل، رقم قطعة موسيقية، رقم كشاف موضوعى مخصص لمصدر موسيقى من جانب ملحن، ناشر، أو عالم موسيقى. @ar
definition: 将一个命名与有一个资源标识符（即作曲者、出版者或者音乐学家分配的序列号、作品号或主题索引号）的一种音乐资源关联起来。 @zh-hans

is address of agent of (Deprecated)
lexical alias: addressOfAgentOf.en
status: Deprecated
type: Property
inverse of: has address of agent

is place of birth of
lexical alias: placeOfBirthOf.en
status: Published
type: Property
label: doğum yeridir @tr
label: er fødested af @da
label: is geboorteplaats van @nl
label: ist Geburtsort von @de
label: születési helye a következőnek: @hu
label: toimijan syntymäpaikka @fi
label: هو مكان الميلاد لـ @ar
label: 是……的出生地点 @zh-hans
sub property of: has related agent of place
inverse of: has place of birth
definition: Bir yeri, o yerde doğmuş olan bir temsilciyle ilişkilendirir. @tr
definition: Hozzákapcsol egy helyet egy ágenshez, aki azon a helyen született. @hu
definition: Liittää paikan toimijaan, joka on syntynyt paikassa. @fi
definition: Relaterer et sted til en agent, som var født et sted. @da
definition: Relates a place to an agent who was born in a place.
definition: Setzt ein Geografikum in Beziehung zu einem Akteur, der an einem Ort geboren wurde. @de
definition: يربط بين مكان ووكيل وُلد في مكان. @ar
definition: 将一个地点与在一个地点出生的一个行为者关联起来。 @zh-hans

is place of capture of
lexical alias: placeOfCaptureOf.en
status: Published
type: Property
label: aineiston tallennuspaikka @fi
label: er optagelsessted af @da
label: is plaats van vastleggen van @nl
label: ist Aufzeichnungsort von @de
label: kayıt yeridir @tr
label: rögzítési helye a következőnek: @hu
label: هو مكان التقاط لـ @ar
label: 是……的摄录的地点 @zh-hans
sub property of: has related resource of place
inverse of: has place of capture
definition: Bir yeri, bir yerde kaydedilmiş, filme alınmış vb. içeriği olan bir kaynakla ilişkilendirir. @tr
definition: Hozzákapcsol egy helyet egy forráshoz, amelynek tartalmát egy bizonyos helyen rögzítették, filmezték stb. @hu
definition: Liittää paikan aineistoon, jonka sisältö on äänitetty, kuvattu tms. paikassa. @fi
definition: Relaterer et sted til en ressource, som har indhold indspillet, filmet etc. på et sted. @da
definition: Relates a place to a resource that has content recorded, filmed, etc. in a place.
definition: Setzt ein Geografikum in Beziehung zu einer Ressource, die über Inhalt verfügt, der an einem Ort aufgenommen, gefilmt und so weiter wird. @de
definition: يربط مكان بمصدر له محتوى مُسجل، مصور...إلخ، في مكان. @ar
definition: 将一个地点与有在一个地点录制、摄影等的内容的一种资源关联起来。 @zh-hans

is place of death of
lexical alias: placeOfDeathOf.en
status: Published
type: Property
label: er dødssted af @da
label: halálozási helye a következőnek: @hu
label: is sterfplaats van @nl
label: ist Sterbeort von @de
label: toimijan kuolinpaikka @fi
label: ölüm yeridir @tr
label: هو مكان وفاة لـ @ar
label: 是……的去世地点 @zh-hans
sub property of: has related agent of place
inverse of: has place of death
definition: Bir yeri, o yerde ölmüş olan bir temsilciyle ilişkilendirir. @tr
definition: Hozzákapcsol egy helyet egy ágenshez, aki azon a helyen halt meg. @hu
definition: Liittää paikan toimijaan, joka on kuollut paikassa. @fi
definition: Relaterer et sted til en agent, som døde et sted. @da
definition: Relates a place to an agent who died in a place.
definition: Setzt ein Geografikum in Beziehung zu einem Akteur, der an einem Ort gestorben ist. @de
definition: يربط بين مكان ووكيل توفي في مكان. @ar
definition: 将一个地点与在一个地点去世的一个行为者关联起来。 @zh-hans

is place of distribution of
lexical alias: placeOfDistributionOf.en
status: Published
type: Property
label: aineiston jakelupaikka @fi
label: dağıtım yeridir @tr
label: er distributionssted af @da
label: is plaats van distributie van @nl
label: ist Vertriebsort von @de
label: terjesztési helye a következőnek: @hu
label: هو مكان توزيع لـ @ar
label: 是……的发行的地点 @zh-hans
sub property of: has related resource of place
inverse of: has place of distribution
definition: Bir yeri, bir yerden dağıtılan yayınlanmış bir kaynak olan bir kaynakla ilişkilendirir. @tr
definition: Hozzákapcsol egy helyet egy kiadott forráshoz, amelyet egy bizonyos helyen terjesztenek. @hu
definition: Liittää paikan julkaistuun aineistoon, jota jaellaan paikasta käsin. @fi
definition: Relaterer et sted til en ressource, som er en udgivet ressourse, der er distribueret fra et sted. @da
definition: Relates a place to a resource that is a published resource that is distributed from a place.
definition: Setzt ein Geografikum in Beziehung zu einer veröffentlichten Ressource, die an einem Ort vertrieben wird. @de
definition: يربط مكان بمصدر عبارة عن مصدر منشور ووُزع من مكان. @ar
definition: 将一个地点与作为一种出版资源从一个地点发行的一种资源关联起来。 @zh-hans

is place of manufacture of
lexical alias: placeOfManufactureOf.en
status: Published
type: Property
label: aineiston valmistuspaikka @fi
label: er fremstillingssted af @da
label: gyártási helye a következőnek: @hu
label: is plaats van vervaardiging van @nl
label: ist Herstellungsort von @de
label: üretim yeridir @tr
label: هو مكان تصنيع لـ @ar
label: 是……的生产的地点 @zh-hans
sub property of: has related resource of place
inverse of: has place of manufacture
definition: Bir yeri, bir yerde basılmış, çoğaltılmış, basılmış vb. yayınlanmış bir kaynak olan kaynakla ilişkilendirir. @tr
definition: Hozzákapcsol egy helyet egy kiadott forráshoz, amelyet egy bizonyos helyen nyomtattak, sokszoroztak, öntöttek, stb. @hu
definition: Liittää paikan julkaistuun aineistoon, joka on painettu, monistettu, valettu kirjainten osalta tms. paikassa. @fi
definition: Relaterer et sted til en ressource, som er en udgivet ressourse, der er trykt, dupliceret, støbt, etc. et sted. @da
definition: Relates a place to a resource that is a published resource that is printed, duplicated, cast, etc. in a place.
definition: Setzt ein Geografikum in Beziehung zu einer veröffentlichten Ressource, die an einem Ort gedruckt, vervielfältigt, gegossen und so weiter wird. @de
definition: يربط مكان بمصدر عبارة عن مصدر منشور طُبع، ونُسخ، وبُث...إلخ، في مكان. @ar
definition: 将一个地点与作为一种出版资源在一个地点印刷、复制、铸造等的一种资源关联起来。 @zh-hans

is place of origin of resource of
lexical alias: placeOfOriginOfResourceOf.en
status: Published
type: Property
label: aineiston alkuperään liittyvä paikka @fi
label: er oprindelsessted for ressourcen af @da
label: is plaats van herkomst van resource van @nl
label: ist Ursprungsort einer Ressource von @de
label: kaynağının menşei yeridir @tr
label: származási helye a következő forrásnak: @hu
label: هو مكان لمنشأ مصدر لـ @ar
label: 是……的资源的原地点 @zh-hans
sub property of: has related resource of place
inverse of: has place of origin of resource
definition: Bir yeri, bir yerle bağlantılı olan bir kaynakla ilişkilendirir. @tr
definition: Hozzákapcsol egy helyet egy forráshoz, amely arról a helyről származik. @hu
definition: Liittää paikan aineistoon, joka on saanut alkunsa paikassa. @fi
definition: Relaterer et sted til en ressource, som har oprindelse fra et sted. @da
definition: Relates a place to a resource which originated from a place.
definition: Setzt ein Geografikum in Beziehung zu einer Ressource, die aus einem Geografikum stammt. @de
definition: يربط مكان بمصدر نشأ من مكان @ar
definition: 将一个地点与起源于一个地点的一种资源关联起来。 @zh-hans

is place of production of
lexical alias: placeOfProductionOf.en
status: Published
type: Property
label: aineiston tuotantopaikka @fi
label: előállítási helye a következőnek: @hu
label: er produktionssted af @da
label: is plaats van productie van @nl
label: ist Entstehungsort von @de
label: yapım yeridir @tr
label: هو مكان إنتاج @ar
label: 是……的制作的地点 @zh-hans
sub property of: has related resource of place
inverse of: has place of production
definition: Bir yeri, bir yerde yazılı olan, imal edilen, yapılan vb. yayınlanmamış bir kaynakla ilişkilendirir. @tr
definition: Hozzákapcsol egy helyet egy kiadatlan forráshoz, amelyet egy bizonyos helyen írtak, készítettek, szerkesztettek stb. @hu
definition: Liittää paikan julkaisemattomaan aineistoon, joka on kaiverrettu, valmistettu, koottu tms. paikassa. @fi
definition: Relaterer et sted til en ressource, som er en ikke udgivet ressource, der er indskrevet, fremstillet, konstrueret, etc. et sted. @da
definition: Relates a place to a resource that is an unpublished resource that is inscribed, fabricated, constructed, etc. in a place.
definition: Setzt ein Geografikum in Beziehung zu einer unveröffentlichten Ressource, die an einem Ort beschriftet, fabriziert, konstruiert und so weiter wird. @de
definition: يربط مكان بمصدر عبارة عن مصدر غير منشور تم تأليفه، تجميعه، إنتاجه في مكان. @ar
definition: 将一个地点与作为一种非出版资源在一个地点镌刻、制造、构建等的一种资源关联起来。 @zh-hans

is place of publication of
lexical alias: placeOfPublicationOf.en
status: Published
type: Property
label: aineiston kustannuspaikka @fi
label: er publiceringssted af @da
label: is plaats van publicatie van @nl
label: ist Erscheinungsort von @de
label: közzétételi helye a következőnek: @hu
label: yayın yeridir @tr
label: هو مكان نشر لـ @ar
label: 是……的出版的地点 @zh-hans
sub property of: has related resource of place
inverse of: has place of publication
definition: Bir yeri, bir yerde yayınlanan, piyasaya sürülen veya çıkarılan yayınlanmış bir kaynak olan kaynakla ilişkilendirir. @tr
definition: Hozzákapcsol egy helyet egy kiadott forráshoz, amelyet egy bizonyos helyen adtak ki, bocsájtottak ki vagy jelentettek meg. @hu
definition: Liittää paikan julkaistuun aineistoon, joka on kustannettu, julkaistu, ilmestynyt tms. paikassa. @fi
definition: Relaterer et sted til en ressource, som er en udgiven ressource, der er publiceret, frigivet, eller udgivet et sted. @da
definition: Relates a place to a resource that is a published resource that is published, released, or issued in a place.
definition: Setzt ein Geografikum in Beziehung zu einer veröffentlichten Ressource, die an einem Ort veröffentlicht, freigegeben oder herausgegeben wird. @de
definition: يربط مكان بمصدر عبارة عن مصدر منشور تم نشره، بثه، أو إصداره في مكان. @ar
definition: 将一个地点与作为一种出版资源在一个地点出版、发布或发行等的一种资源关联起来。 @zh-hans

is place of residence of
lexical alias: placeOfResidenceOf.en
status: Published
type: Property
label: asuinpaikka toimijalle @fi
label: er opholdsted af @da
label: ikamet yeridir @tr
label: is verblijfplaats van @nl
label: ist Wohnort von @de
label: lakóhelye a következőnek: @hu
label: هو مكان إقامة لـ @ar
label: 是……的居住地点 @zh-hans
sub property of: has related agent of place
inverse of: has place of residence
definition: Bir yeri, o yerde ikamet eden veya ikamet etmiş olan ya da o yerle doğum, ölüm veya ikamet dışında bir ilişkisi olan bir temsilciyle ilişkilendirir. @tr
definition: Hozzákapcsol egy helyet egy ágenshez, amelynek az a jelenlegi vagy volt lakhelye, vagy születésén, halálán vagy lakóhelyén kívül más módon kapcsolódik hozzá. @hu
definition: Liittää paikan toimijaan, joka asuu tai on asunut paikassa tai on muuten kuin syntymän, kuoleman tai oleskelun kautta suhteessa paikkaan. @fi
definition: Relaterer et sted til en agent, som bor eller har boet, eller er knyttet på anden måde end gennem fødsel, død, eller boende med et sted. @da
definition: Relates a place to an agent who resides or has resided in, or is associated other than birth, death, or residence with a place.
definition: Setzt ein Geografikum in Beziehung zu einem Akteur, der in diesem Geografikum wohnt oder gewohnt hat oder aus anderen Gründen als Geburt, Tod oder Wohnsitz mit diesem in Verbindung steht. @de
definition: يربط بين مكان ووكيل يُقيم أو أقام، أو مرتبط بمكان ما بخلاف الولادة أو الوفاة أو الإقامة. @ar
definition: 将一个地点与在一个地点居住或居住过或者和出生、去世、或居住以外相关的一个地点的一个行为者关联起来。 @zh-hans

is date associated with agent of (Deprecated)
has subproperty: is date of birth of
has subproperty: is date of conference of
has subproperty: is date of death of
has subproperty: is date of establishment of
has subproperty: is date of termination of
has subproperty: is period of activity of agent of
lexical alias: dateAssociatedWithAgentOf.en
status: Deprecated
type: Property
sub property of: has related agent of timespan
inverse of: has date associated with agent (Deprecated)
definition: Relates a timespan to an agent who has a significant association with a timespan. (Deprecated)

is date of birth of
lexical alias: dateOfBirthOf.en
status: Published
type: Property
label: doğum tarihidir @tr
label: er fødested af @da
label: is geboortedatum van @nl
label: ist Geburtsdatum von @de
label: születési időpontja a következőnek: @hu
label: toimijan syntymäaika @fi
label: هو تاريخ ميلاد لـ @ar
label: 是……的出生日期 @zh-hans
sub property of: is date associated with agent of (Deprecated)
inverse of: has date of birth
definition: Bir zaman aralığını, bir zaman aralığı sırasında doğmuş bir temsilciyle ilişkilendirir. @tr
definition: Hozzákapcsol egy időtartamot egy ágenshez, aki egy időtartam alatt született. @hu
definition: Liittää ajanjakson toimijaan, joka on syntynyt ajanjakson aikana. @fi
definition: Relaterer et tidsforløb til en agent, som var født i løbet af et tidforløb. @da
definition: Relates a timespan to an agent who was born during a timespan.
definition: Setzt einen Zeitraum in Beziehung zu einem Akteur, der in einem Zeitraum geboren wurde. @de
definition: يربط بين فترة زمنية ووكيل وُلد خلال فترة زمنية. @ar
definition: 将一个时间段与在一个时间段出生的一个行为者关联起来。 @zh-hans

is date of capture of
lexical alias: dateOfCaptureOf.en
status: Published
type: Property
label: aineiston tallennusaika @fi
label: er optagelsessted af @da
label: is datum van vastleggen van @nl
label: ist Aufzeichnungsdatum von @de
label: kaydının tarihidir @tr
label: rögzítési időpontja a következőnek: @hu
label: هو تاريخ التقاط لـ @ar
label: 是……的摄录日期 @zh-hans
sub property of: has related resource of timespan
inverse of: has date of capture
definition: Bir zaman aralığını, bir zaman aralığı boyunca kaydedilen, filme alınan vb. bir kaynakla ilişkilendirir. @tr
definition: Hozzákapcsol egy időtartamot egy forráshoz, amelyet egy időtartam alatt rögzítettek, vettek filmre, stb. @hu
definition: Liittää ajanjakson aineistoon, jonka sisältö on äänitetty, kuvattu tms. paikassa. @fi
definition: Relaterer et tidsforløb til en resource, somer indspillet, filmet, etc. i løbet af et tidforløb. @da
definition: Relates a timespan to a resource that is recorded, filmed, etc., during a timespan.
definition: Setzt einen Zeitraum in Beziehung zu einer Ressource, die in einem Zeitraum aufgenommen, verfilmt und so weiter wird. @de
definition: يربط بين فترة زمنية ومصدر مُسجل، مصور...إلخ، خلال فترة زمنية. @ar
definition: 将一个时间段与在一个时间段录制、摄影等的一种资源关联起来。 @zh-hans

is date of conference of
lexical alias: dateOfConferenceOf.en
status: Published
type: Property
label: er dato for konference af @da
label: időpontja a következő konferenciának: @hu
label: is datum van conferentie van @nl
label: ist Datum einer Konferenz von @de
label: konferansının tarihidir @tr
label: konferenssin ajankohta @fi
label: هو تاريخ مؤتمر لـ @ar
label: 是……的会议的日期 @zh-hans
sub property of: is date associated with agent of (Deprecated)
inverse of: has date of conference
definition: Bir zaman aralığını, bir zaman aralığında düzenlenen bir kaynağa olanak sağlayan bir konferans, sergi veya başka bir etkinlikle ilişkilendirir. @tr
definition: Hozzákapcsol egy időtartamot egy konferenciához, kiállításhoz vagy más eseményhez, ami egy forrás létrejöttét eredményezi egy időtartam alatt. @hu
definition: Liittää ajanjakson ajanjakson aikana pidettyyn konferenssiin, näyttelyyn tai muuhun tapahtumaan, jonka seurauksena sntyy aineisto. @fi
definition: Relaterer et tidsforløb til en konference, udstilling eller andet event, der giver ophav til en ressource, som afholdes i løbet af et tidsforløb. @da
definition: Relates a timespan to a conference, exhibition, or other event that gives rise to a resource that is held during a timespan.
definition: Setzt einen Zeitraum in Beziehung zu einer Konferenz, Ausstellung oder eine andere formal benannte und einberufene Veranstaltung, aus der eine Ressource hervorgeht und die in einem Zeitraum stattfindet. @de
definition: يربط بين فترة زمنية ومؤتمر، معرض، أو حدث آخر أسفر عن مصدر انعقد خلال فترة زمنية. @ar
definition: 将一个时间段与在一个时间段中举行并导致一种资源的一次会议、展览或其他活动关联起来。 @zh-hans

is date of death of
lexical alias: dateOfDeathOf.en
status: Published
type: Property
label: er dødsdato af @da
label: halálozási időpontja a következőnek: @hu
label: is sterfdatum van @nl
label: ist Sterbedatum von @de
label: toimjan kuolinaika @fi
label: ölüm tarihidir @tr
label: هو تاريخ وفاة لـ @ar
label: 是……的死亡日期 @zh-hans
sub property of: is date associated with agent of (Deprecated)
inverse of: has date of death
definition: Bir zaman aralığını, bir zaman aralığı sırasında ölen bir temsilciyle ilişkilendirir. @tr
definition: Hozzákapcsol egy időtartamot egy ágenshez, aki egy időtartam alatt hunyt el. @hu
definition: Liittää ajanjakson toimijaan, joka on kuollut ajanjakson aikana. @fi
definition: Relaterer et tidsforløb til en agent, som døde under et tidsforløb. @da
definition: Relates a timespan to an agent who died during a timespan.
definition: Setzt einen Zeitraum in Beziehung zu einem Akteur, der in einem Zeitraum gestorben ist. @de
definition: يربط بين فترة زمنية ووكيل توفي خلال فترة زمنية. @ar
definition: 将一个时间段与在一个时间段死亡的一个行为者关联起来。 @zh-hans

is date of distribution of
lexical alias: dateOfDistributionOf.en
status: Published
type: Property
label: aineiston jakeluaika @fi
label: dağıtım tarihidir @tr
label: er distributionsdato af @da
label: is datum van distributie van @nl
label: ist Vertriebsdatum von @de
label: terjesztési időpontja a következőnek: @hu
label: هو تاريخ توزيع لـ @ar
label: 是……的发行的日期 @zh-hans
sub property of: has related resource of timespan
inverse of: has date of distribution
definition: Bir zaman aralığını, bir zaman aralığı boyunca dağıtılan yayınlanmış bir kaynak olan bir kaynakla ilişkilendirir. @tr
definition: Hozzákapcsol egy időtartamot egy kiadott forráshoz, amelyet egy időtartam alatt terjesztettek. @hu
definition: Liittää ajanjakson julkaistuun aineistoon, jota jaellaan ajanjakson aikana. @fi
definition: Relaterer et tidsforløb til en ressource, som er en udgiven ressource, der er distribueret i løbet af et tidsforløb. @da
definition: Relates a timespan to a resource that is a published resource that is distributed during a timespan.
definition: Setzt einen Zeitraum in Beziehung zu einer veröffentlichten Ressource, die in einem Zeitraum vertrieben wird. @de
definition: يربط بين فترة زمنية ومصدر عبارة عن مصدر منشور تم توزيعه خلال فترة زمنية. @ar
definition: 将一个时间段与作为一种出版资源在一个时间段内被发行的一种资源关联起来。 @zh-hans

is date of establishment of
lexical alias: dateOfEstablishmentOf.en
status: Published
type: Property
label: alapítási időpontja a következőnek: @hu
label: er dato for etablering af @da
label: is datum van oprichting van @nl
label: ist Gründungsdatum von @de
label: kuruluşunun tarihidir @tr
label: yhteistoimijan perustamisaika @fi
label: هو تاريخ إنشاء لـ @ar
label: 是……的成立的日期 @zh-hans
sub property of: is date associated with agent of (Deprecated)
definition: Bir zaman aralığını, bir zaman aralığı sırasında tesis edilen veya kurulan bir temsilciyle ilişkilendirir. @tr
definition: Hozzákapcsol egy időtartamot egy ágenshez, amelyet egy időtartam alatt alapítottak vagy létesítettek. @hu
definition: Liittää ajanjakson toimijaan, joka on perustettu ajanjakson aikana. @fi
definition: Relaterer et tidsforløb til en agent, som er etableret eller grundlagt i løbet af et tidsforløb. @da
definition: Relates a timespan to an agent who is established or founded during a timespan.
definition: Setzt einen Zeitraum in Beziehung zu einem Akteur, der in einem Zeitraum eingeführt oder gegründet wurde. @de
definition: يربط بين فترة زمنية ووكيل أُنشئ أو تأسس خلال فترة زمنية. @ar
definition: 将一个时间段与在一个时间段中成立或创办的一个行为者关联起来。 @zh-hans

is date of manufacture of
lexical alias: dateOfManufactureOf.en
status: Published
type: Property
label: aineiston valmistusaika @fi
label: er fremstillingsdato af @da
label: gyártási időpontja a következőnek: @hu
label: is datum van vervaardiging van @nl
label: ist Herstellungsdatum von @de
label: üretim tarihidir @tr
label: له تاريخ تصنيع لـ @ar
label: 是……的生产日期 @zh-hans
sub property of: has related resource of timespan
inverse of: has date of manufacture
definition: Bir zaman aralığını, bir zaman aralığı boyunca basılan, çoğaltılan, yayınlanan vb. yayınlanmış bir kaynak olan bir kaynakla ilişkilendirir. @tr
definition: Hozzákapcsol egy időtartamot egy kiadott forráshoz, amelyet egy időtartam alatt nyomtattak, sokszorosítottak, öntöttek, stb. @hu
definition: Liittää ajanjakson julkaistuun aineistoon, joka on painettu, monistettu, valettu kirjasinten osalta tms. ajanjakson aikana. @fi
definition: Relaterer et tidsforløb til en ressource, som er en udgiven ressource, der er trykt, duplicert, støbt etc. i løbet af et tidsforløb. @da
definition: Relates a timespan to a resource that is a published resource that is printed, duplicated, cast, etc., during a timespan.
definition: Setzt einen Zeitraum in Beziehung zu einer veröffentlichten Ressource, die in einem Zeitraum gedruckt, vervielfältigt, gegossen und so weiter wird. @de
definition: يربط بين فترة زمنية ومصدر عبارة عن مصدر منشور طُبع، ونسخ، وبث...إلخ، خلال فترة زمنية. @ar
definition: 将一个时间段与作为一种出版资源并在一个时间段被印刷、复制、铸造等的一种资源关联起来。 @zh-hans

is date of production of
lexical alias: dateOfProductionOf.en
status: Published
type: Property
label: aineiston tuotantoaika @fi
label: er produktionsdato af @da
label: is datum van productie van @nl
label: ist Entstehungsdatum von @de
label: létrehozási időpontja a következőnek: @hu
label: yapım tarihidir @tr
label: هو تاريخ إنتاج لـ @ar
label: 是……的制作日期 @zh-hans
sub property of: has related resource of timespan
inverse of: has date of production
definition: Bir zaman aralığını, bir zaman aralığında yazılmış, üretilmiş, oluşturulmuş, vb. yayınlanmamış bir kaynak olan kaynakla ilişkilendirir. @tr
definition: Hozzákapcsol egy időtartamot egy kiadatlan forráshoz, amelyet egy időtartam alatt írtak, készítettek, szerkesztettek stb. @hu
definition: Liittää ajanjakson julkaisemattomaan aineistoon, joka on kaiverrettu, valmistettu, koottu tms. ajanjakson aikana. @fi
definition: Relaterer et tidsforløb til en ressource, som er en ikke publiceret ressource, der er indskrevet, fremstillet, konstrueret etc. i løbet af et tidsforløb. @da
definition: Relates a timespan to a resource that is an unpublished resource that is inscribed, fabricated, constructed, etc., during a timespan.
definition: Setzt einen Zeitraum in Beziehung zu einer unveröffentlichten Ressource, die in einem Zeitraum beschriftet, fabriziert, konstruiert und so weiter wird. @de
definition: يربط بين فترة زمنية ومصدر عبارة عن مصدر غير منشور تم تأليفه، تجميعه، إنتاجه...إلخ، خلال فترة زمنية. @ar
definition: 将一个时间段与作为一种非出版资源并在一个时间段镌刻、制造、构建等的一种资源关联起来。 @zh-hans

is date of publication of
lexical alias: dateOfPublicationOf.en
status: Published
type: Property
label: aineiston julkaisuaika @fi
label: er publiceringsdato af @da
label: is datum van publicatie van @nl
label: ist Erscheinungsdatum von @de
label: kiadási időpontja a következőnek: @hu
label: yayınlanma tarihidir @tr
label: هو تاريخ نشر لـ @ar
label: 是……的出版日期 @zh-hans
sub property of: has related resource of timespan
inverse of: has date of publication
definition: Bir zaman aralığını, bir zaman aralığı boyunca yayınlanan, piyasaya sürülen veyayayınlanmış bir biçimde piyasaya çıkarılan bir kaynakla ilişkilendirir. @tr
definition: Hozzákapcsol egy időtartamot egy kiadott forráshoz, amelyet egy időtartam alatt publikált formában kiadtak, kibocsájtottak vagy megjelentettek. @hu
definition: Liittää ajanjakson aineistoon, joka on kustannettu, julkaistu tai ilmestynyt ajanjakson aikana. @fi
definition: Relaterer et tidsforløb til en ressource, som er publiceret, frigivet,eller udgivet i publiceret form i løbet af et tidsforløb. @da
definition: Relates a timespan to a resource that is published, released, or issued in a published form during a timespan.
definition: Setzt einen Zeitraum in Beziehung zu einer Ressource, die in einem Zeitraum in veröffentlichter Form veröffentlicht, freigeschaltet oder herausgegeben wird. @de
definition: يربط بين فترة زمنية ومصدر تم نشره، بثه، أو إصداره في شكل منشور خلال فترة زمنية. @ar
definition: 将一个时间段与在一个时间段以出版形式被出版、发布或发行的一种资源关联起来。 @zh-hans

is date of resource of
lexical alias: dateOfResourceOf.en
status: Published
type: Property
label: a következő forráshoz kapcsolódó időpont @hu
label: aineiston ajankohta @fi
label: er dato for ressource af @da
label: is datum van resource van @nl
label: ist Datum einer Ressource von @de
label: kaynağının tarihidir @tr
label: هو تاريخ مصدر لـ @ar
label: 是……的资源的日期 @zh-hans
sub property of: has related resource of timespan
inverse of: has date of resource
definition: Bir zaman aralığını, en erken bir zaman aralığıyla bağlantılı olan bir kaynakla ilişkilendirir. @tr
definition: Hozzákapcsol egy időtartamot egy korábbi időtartamhoz kapcsolódó forráshoz. @hu
definition: Liittää ajanjakson aineistoon, johon ajanjakso aikaisintaan liittyy. @fi
definition: Relaterer et tidsforløb til en ressource, der er knyttet til et tidligste tidsforløb. @da
definition: Relates a timespan to a resource associated with an earliest timespan.
definition: Setzt einen Zeitraum in Beziehung zu einer Ressource, die mit dem frühesten Zeitraum in Verbindung steht. @de
definition: يربط بين فترة زمنية ومصدر مرتبط بأقرب فترة زمنية. @ar
definition: 将一个时间段与和一个最早时间段有关的一种资源关联起来。 @zh-hans

is date of termination of
lexical alias: dateOfTerminationOf.en
status: Published
type: Property
label: er ophørsdato af @da
label: is datum van opheffing van @nl
label: ist Auflösungsdatum von @de
label: megszűnési időpontja a következőnek: @hu
label: sonlanma tarihidir @tr
label: yhteistoimijan lakkauttamisajankohta @fi
label: هو تاريخ توقف لـ @ar
label: 是……的终止的日期 @zh-hans
sub property of: is date associated with agent of (Deprecated)
inverse of: has date of termination
definition: Bir zaman aralığını, bir zaman aralığı sırasında sonlandırılan veya feshedilen bir temsilciyle ilişkilendirir. @tr
definition: Hozzákapcsol egy időtartamot egy ágenshez, amelyet egy időtartam alatt szüntettek meg vagy oszlattak fel. @hu
definition: Liittää ajanjakson yhteistoimijaan, joka on lakkautettu tai hajotettu ajanjakson aikana. @fi
definition: Relaterer et tidsforløb til en agent, som er ved at ophøre eller opløses i løbet af et tidsforløb. @da
definition: Relates a timespan to an agent who is terminated or dissolved during a timespan.
definition: Setzt einen Zeitraum in Beziehung zu einem Akteur, der in einem Zeitraum aufgehoben oder aufgelöst wurde. @de
definition: يربط بين فترة زمنية ووكيل توقف أو حُلَّ خلال فترة زمنية. @ar
definition: 将一个时间段与在一个时间段中终止或解散的一个行为者关联起来。 @zh-hans

is date of usage of
lexical alias: dateOfUsageOf.en
status: Published
type: Property
label: entiteetin käyttöajankohta @fi
label: er dato for brug af @da
label: használati időpontja a következőnek: @hu
label: is datum van gebruik van @nl
label: ist Verwendungsdatum von @de
label: kullanım tarihidir @tr
label: هو تاريخ استخدام لـ @ar
label: 是……的使用日期 @zh-hans
inverse of: has date of usage
definition: Bir zaman aralığını, bir zaman aralığı boyunca kullanılan bir varlığın unvanıyla ilişkilendirir. @tr
definition: Hozzákapcsol egy időtartamot egy időtartam alatt használt entitás megnevezéséhez. @hu
definition: Liittää ajanjakson ajanjakson aikana käytössä olleen entiteetin nimitykseen. @fi
definition: Relaciona un interval de temps amb un nomen que és una apel·lació d’una entitat usada durant un interval de temps. @ca
definition: Relaterer et tidsforløb til en benævnelse på en entitet brugt i løbet af et tidsforløb. @da
definition: Relates a timespan to a nomen that is an appellation of an entity used during a timespan.
definition: Setzt einen Zeitraum in Beziehung zu einer Bezeichnung für eine Entität, die in einem Zeitraum verwendet wird. @de
definition: يربط بين فترة زمنية وتسمية لكيان مستخدم خلال فترة زمنية @ar
definition: 将一个时间段与用于一个时间段并作为一个实体之称谓的一个命名关联起来。 @zh-hans

has place associated with resource (Deprecated)
lexical alias: placeAssociatedWithResource.en
status: Deprecated
type: Property
sub property of: has related place of resource
inverse of: is place associated with resource of (Deprecated)
definition: Relates a resource to a significant location associated with an agent, or a place where an agent resides or has resided or has some connection. (Deprecated)

is plate number for notated music of
lexical alias: plateNumberForNotatedMusicOf.en
status: Published
type: Property
label: er pladenummer for noteret musik af @da
label: is plaatnummer voor bladmuziek van @nl
label: ist Druckplattennummer für Noten von @de
label: notaya alınmış müziğinin plaka numarasıdır @tr
label: nuottiaineiston laatan numero @fi
label: zenei műjegyzéki lemezszáma a következőnek: @hu
label: هو رقم لوحة لمدونة موسيقية لـ @ar
label: 是……的乐谱的版号 @zh-hans
sub property of: is identifier for resource of
inverse of: has plate number for notated music
definition: A zenei műjegyzéki lemezszám néha magába foglal kezdőbetűket, rövidítéseket vagy a kiadót megnevező szavakat. Get failed: 404 Connection aborted on request @hu
definition: Bir ismi, basım sürecinde kullanılan baskı kalıbını belirtmek için bir yayıncı tarafından atanan, müzik notası için bir yayıncı numarası dışında bir kaynak tanımlayıcısına sahip bir notaya alınmış müzik kaynağıyla ilişkilendirir. @tr
definition: Liittää nomenin musiikkiaineistoon, jonka tunniste ei ole kustantajan nuottiaineistolle antama numero vaan nuottiaineiston laatan numero. Nuottiaineiston laatan numero ilmaisee, mitä ilmaisee, painolaattaa on käytetty painamisprosessissa. @fi
definition: Relaterer et nomen til en noteret musikressource, som har en ressourceidentifkator anden end et editionsnummer for noteret musik, tildelt af en udgiver for at angive den trykplade der blev brugt i trykprocessen. @da
definition: Relates a nomen to a notated music resource that has an identifier for resource other than a publisher number for notated music, assigned by a publisher to indicate the printing plate used in the printing process.
definition: Setzt ein Nomen in Beziehung zu einer Noten-Ressource, die über einen Identifikator für eine Ressource verfügt, der von einem Verlag zugewiesen wird, um die im Druckprozess verwendete Druckplatte anzugeben, und bei dem es sich nicht um die Noten-Bestellnummer handelt. @de
definition: يربط بين تسمية ومدونة موسيقية لها معرف لمصدر بخلاف رقم ناشر خاص بمدونة موسيقيه، التى يخصصها ناشر لتحديد اللوحات المطبوعة المستخدمة في عملية الطباعة. @ar
definition: 将一个命名与有出版者分配以表示印刷过程中所用印版的除乐谱出版者编号以外的一个资源标识符的一种乐谱资源关联起来。 @zh-hans
scope note: A plate number for notated music sometimes includes initials, abbreviations, or words identifying the publisher. It is sometimes followed by a number corresponding to the number of pages or plates or a number corresponding to an individual page or plate.
scope note: Eine Druckplattennummer für Noten enthält manchmal Initialen, Abkürzungen oder Wörter, die den Verlag identifizieren. Ihr folgt manchmal eine Zahl, die der Zahl der Seiten oder Platten entspricht oder eine Zahl, die einer einzelnen Seite oder Platte entspricht. @de
scope note: Et pladenummer for musik indeholder sommetider initialer, forkortelser eller ord som idenficerer udgiveren. Det er nogen gange efterfulgt af et tal der svarer til antallet af sider eller plader, eller et tal der svarer til en individuel side eller plade. @da
scope note: Hozzákapcsol egy noment egy zeneilejegyzés-forráshoz, amelynek a forrásazonosítója eltér a kiadói műjegyzékszámtól, amellyel a kiadó a nyomtatás során használt nyomólemezt jelöli. @hu
scope note: Notaları yazılan müziğin plak numarası kimi zaman baş harfleri, kısaltmaları veya yayımcıyı tanımlanan sözcükleri içerir. Bazen ardına sayfa veya plak sayısına karşılık gelen bir numara ya da münferit sayfa veya plağa karşılık gelen bir numara gelir. @tr
scope note: Nuottiaineiston laattanumero sisältää joskus kustantajaa identifioivia alkukirjaimia, lyhenteitä tai sanoja. Numeron perässä voi olla vastaavien sivujen tai laattojen numerot tai yksittäisten sivujen ja laattojen numerot. @fi
scope note: يتضمن رقم لوحة لموسيقى مدونة أحيانًا استهلاليات، إختصارات، أو كلمات التى تُعرّف بالناشر.تُتبع أحيانًا برقم يشير إلى رقم الصفحات أو اللوحات أو رقم يشير إلى صفحة أو لوحة واحدة. @ar
scope note: 乐谱的版号有时候包括标识出版社的首字母缩写、缩略语或单词。乐谱的版号有时候后接对应于页数或版数的一个数字或者对应于一个个别页或版的一个数字。 @zh-hans

is publisher number for notated music of
lexical alias: publisherNumberForNotatedMusicOf.en
status: Published
type: Property
label: er editionsnummer for noteret musik @da
label: is uitgeversnummer voor bladmuziek van @nl
label: ist Noten-Bestellnummer von @de
label: kiadói műjegyzékszáma a következőnek: @hu
label: kustantajan nuottiaineistolle antama numero @fi
label: notaya alınmış müziğinin yayıncı numarasıdır @tr
label: هو رقم ناشر لموسيقى مدونة @ar
label: 是……的乐谱的出版者编号 @zh-hans
sub property of: is identifier for resource of
inverse of: has publisher number for notated music
definition: Bir kaynağı, bir yayıncı tarafından müzik notası haline getirilmiş kaynağına verilen bir numaralandırma belirteciyle ilişkilendirir. @tr
definition: Hozzákapcsol egy forrást egy kiadó által egy zenei lejegyzésnek adott számozásjelöléshez. @hu
definition: Liittää musiikkiaineiston kustantajan nuottiaineistolle antamaan tunnisteeseen. @fi
definition: Relaterer en ressource til en nummerangivelse tildelt to en noteret musikressource af en udgiver. @da
definition: Relates a resource to a numbering designation assigned to a notated music resource by a publisher.
definition: Setzt eine Ressource in Beziehung zu einer Bezeichnung einer Zählung, die einer notierten Musikressource vom Verlag zugewiesen wird. @de
definition: يربط بين مصدر وترقيم محدد خصصه ناشر لمصدر موسيقى مدونة. @ar
definition: 将一种资源与由出版者分配给一种乐谱资源的一个编号标识关联起来。 @zh-hans
scope note: A szám általában a címoldalon, a borítón vagy a zenei lejegyzés első oldalán jelenik meg, és néha magába foglal kezdőbetűket, rövidítéseket vagy a kiadót megnevező szavakat. @hu
scope note: Die Nummer erscheint normalerweise nur auf der Titelseite, der Einbanddecke oder der ersten Seite von Musikalien und enthält manchmal Initialen, Abkürzungen oder Wörter, die den Verlag identifizieren. @de
scope note: Numero esiintyy yleensä jokaisen sivun alalaidassa ja joskus nimiösivulla. Numero voi sisältää kustantajaa identifioivia alkukirjainlyhenteitä, sanalyhenteitä tai sanoja. @fi
scope note: Nummeret optræder normalt kun på titelsiden, omslaget, den første musikside, og indeholder nogen gange initialer, forkortelser g ord der identificerer udgiveren. @da
scope note: Sayı normalde yalnızca başlık sayfasında, kapakta veya müziğin ilk sayfasında görünür ve ara sıra baş harfler, kısaltmalar veya yayıncıyı tanımlayan sözcükler içerir. @tr
scope note: The number normally appears only on the title page, the cover, or the first page of music, and sometimes includes initials, abbreviations, or words identifying the publisher.
scope note: يظهر الرقم عادة فقط على صفحة العنوان، الغلاف، أو الصفحة الأولى من الموسيقى، ويشمل أحيانًا على الاستهلاليات، أو الإختصارات، أو الكلمات التى تعرف بالناشر. @ar
scope note: 该编号通常出现在题名页、封面、或乐谱的第一页上，有时候包括标识出版者的首字母缩写、缩略语或词。 @zh-hans

is period of activity of agent of
lexical alias: periodOfActivityOfAgentOf.en
status: Published
type: Property
label: er aktivitetsperiode af agent af @da
label: is actieve periode van actor van @nl
label: ist Wirkungszeitraum eines Akteurs von @de
label: temsilcisinin faaliyet dönemidir @tr
label: tevékenységi időszaka a következő ágensnek: @hu
label: toimijan toiminta-aika @fi
label: هي فترة لنشاط وكيل لـ @ar
label: 是……的行为者的活跃期 @zh-hans
sub property of: is date associated with agent of (Deprecated)
inverse of: has period of activity of agent
definition: Bir zaman aralığını, bir zaman aralığı boyunca birincil çalışma alanında aktif olan bir temsilciyle ilişkilendirir. @tr
definition: Hozzákapcsol egy időtartamot egy ágenshez, amely fő működési területén egy időtartam alatt aktív. @hu
definition: Liittää ajanjakson toimijaan, joka on ollut aktiivinen ensisijaisella toiminta-alallaan ajanjakson aikana. @fi
definition: Relaterer et tidsforløb til en agent, som er virksom indenfor sit primære virksomhedsområde under et tidforløb. @da
definition: Relates a timespan to an agent who is active in its primary field of endeavour during a timespan.
definition: Setzt einen Zeitraum in Beziehung zu einem Akteur, der in einem Zeitraum in seinem primären Tätigkeitsfeld aktiv ist. @de
definition: تربط بين فترة زمنية ووكيل نشط في مجال عمله الأساسي خلال فترة زمنية. @ar
definition: 将一个时间段与在一个时间段中活跃于其主要努力领域的一个行为者关联起来。 @zh-hans

is epoch of
lexical alias: epochOf.en
status: Published
type: Property
label: epookki aineistossa @fi
label: epoğudur @tr
label: er epoke af @da
label: is tijdperk van @nl
label: ist Epoche von @de
label: korszaka a következőnek: @hu
label: له مُدّة زمنية @ar
label: 是……的历元 @zh-hans
inverse of: has epoch
definition: Bir zaman aralığını, bir cisim için konum veya bir yörünge için yönelim ölçümlerini ifade eden bir kaynakla ilişkilendirir. @tr
definition: Hozzákapcsol egy időtartamot egy forráshoz, amely egy test mérési pozíciójára vagy egy keringési pálya orientációjára utal. @hu
definition: Liittää ajanjakson aineistoon, johon tähtitaivaan kohteiden sijaintien ja ratojen suuntien mittajärjestelmä viittaa. @fi
definition: Relaterer et tidsforløb til en ressource der refererer til målinger af position for et legeme eller retning for en bane. @da
definition: Relates a timespan to a resource that refers to measurements of position for a body or orientation for an orbit.
definition: Setzt einen Zeitraum in Beziehung zu einer Ressource, die Positionsmessungen für einen Körper oder eine Orientierung für eine Umlaufbahn referenziert. @de
definition: يربط بين فترة زمنية ومصدر يُحال إليه قياسات وضع لجسم أو لتوجه مداري. @ar
definition: 将一个时间段与提及物体位置或运行轨道方位之测量的一种资源关联起来。 @zh-hans

is equinox of
lexical alias: equinoxOf.en
status: Published
type: Property
label: ekinoksudur @tr
label: er jævndøgn for @da
label: is equinox van @nl
label: ist Äquinoktium von @de
label: napéjegyenlősége a következőnek: @hu
label: tasauspiste aineistossa @fi
label: هو اعتدال لـ @ar
label: 是……的二分点 @zh-hans
inverse of: has equinox
definition: Bir zaman aralığını, güneşin sapmasının 0° olduğu anda ekliptik ve gök ekvatorunun kesişme noktasını kullanan bir kaynakla ilişkilendirir. @tr
definition: Hozzákapcsol egy időtartamot egy forráshoz, amely a nappálya és az egyenlítő metszéspontját használja, amit a nap akkor foglal el, amikor a deklinációja 0°. @hu
definition: Liittää ajanjakson aineistoon, joka käyttää ekliptikan ja taivaanekvaattorin leikkauspistettä, jossa aurinko on, kun sen deklinaatio on 0°. @fi
definition: Relaterer et tidsforløb til en ressource, som bruger et skæringspunkt mellem ekliptika og himlens ækvator, hvor solen befinder sig, når dens deklination er 0°. @da
definition: Relates a timespan to a resource that uses a point of intersection of the ecliptic and the celestial equator, occupied by the sun when its declination is 0°.
definition: Setzt einen Zeitraum in Beziehung zu einer Ressource, die einen von zwei Kreuzungspunkten der Sonnenbahn und des Himmelsäquators verwendet, die von der Sonne überquert werden, wenn ihre Deklination 0° beträgt. @de
definition: يربط بين فترة زمنية ومصدر يستخدم نقطة تقاطع مسار الشمس مع خط الاستواء عندما يكون انحرافها صفر "0". @ar
definition: 将一个时间段与使用当太阳的赤纬角度为0时其所占黄道和天赤道的一个交叉点的一种资源关联起来。 @zh-hans

is place associated with agent of (Deprecated)
lexical alias: placeAssociatedWithAgentOf.en
status: Deprecated
type: Property
sub property of: has related agent of place
inverse of: has place associated with agent (Deprecated)
definition: Relates a place to an agent who is associated with a place. (Deprecated)

is place associated with resource of (Deprecated)
lexical alias: placeAssociatedWithResourceOf.en
status: Deprecated
type: Property
sub property of: has related resource of place
inverse of: has place associated with resource (Deprecated)
definition: Relates a place to a resource that is associated with a place. (Deprecated)

has material
has subproperty: has applied material
has subproperty: has base material
lexical alias: material.en
status: Published
type: Property
label: anyaga a következő: @hu
label: har materiale @da
label: hat Material @de
label: heeft materiaal @nl
label: materiaali aineistossa @fi
label: materyal ile ilişkilidir @tr
label: له مادة @ar
label: 有材料 @zh-hans
definition: Bir kaynağı, bir kaynağı oluşturmak için kullanılan fiziksel veya kimyasal bir maddeyle ilişkilendirir. @tr
definition: Hozzákapcsol egy forrást egy olyan fizikai vagy kémiai anyaghoz, amelyet egy forrás létrehozásához használnak. @hu
definition: Liittää aineiston fyysiseen tai kemialliseen aineeseen, jota on käytetty aineiston luomisessa. @fi
definition: Relaterer en ressource til et fysisk eller kemisk stof, som er påført en manifestations basismateriale. @da
definition: Relates a resource to a physical or chemical substance that is used to create a resource.
definition: Setzt eine Ressource in Beziehung zu einer physischen oder chemischen Substanz, die zur Erstellung einer Ressource verwendet wird. @de
definition: يربط بين مصدر ومادة فيزيائية أو كيميائية مستخدمة في إنشاء مصدر. @ar
definition: 将一种资源与被用于创建一种资源的一种物理或化学物质关联起来。 @zh-hans

is prominent member of agent of
lexical alias: prominentMemberOfFamilyOf.en
status: Published
type: Property
label: er fremtrædende medlem af agant af @da
label: is prominent lid van actor van @nl
label: ist bedeutendes Akteurmitglied von @de
label: kiemelkedő tagja a következő ágensnek: @hu
label: temsilcisinin seçkin üyesidir @tr
label: toimijan tunnettu jäsen @fi
label: هو عضو بارز لوكيل لـ @ar
label: 是……的行为者的著名成员 @zh-hans
inverse of: has prominent member of agent
definition: Bir temsilciyi, üye olarak tanınmış bir bireye sahip olan bir temsilciyle ilişkilendirir. @tr
definition: Hozzákapcsol egy ágenst egy ágenshez, amelynek tagja egy jól ismert egyén. @hu
definition: Liittää toimijan tunnettuun toimijaan, jolla on jäsenenään tunnettu toimija @fi
definition: Relaterer en agent til en agent der har et velkendt individ som medlem. @da
definition: Relates an agent to an agent who has a well-known individual as a member.
definition: Setzt einen Akteur in Beziehung zu einem Akteur, der ein bekanntes Individuum als Mitglied hat. @de
definition: يربط بين وكيل ووكيل له فرد مشهور كعضو. @ar
definition: 将一个行为者与有一个著名个体作为其成员的一个行为者关联起来。 @zh-hans

is place of conference of
lexical alias: placeOfConferenceOf.en
status: Published
type: Property
label: er sted for konference for @da
label: is plaats van conferentie van @nl
label: ist Ort einer Konferenz von @de
label: konferansının yeridir @tr
label: konferenciahelyszíne a következőnek: @hu
label: konferenssin paikka @fi
label: هو مكان لمؤتمر لـ @ar
label: 是……的会议的地点 @zh-hans
sub property of: has related agent of place
inverse of: has place of conference
definition: Bir yeri, bir kaynağa yol açan ve bir yerde düzenlenen bir konferans, sergi veya resmi olarak adlandırılmış ve toplanmış diğer etkinliklerle ilişkilendirir. @tr
definition: Hozzákapcsol egy helyet egy konferenciához, kiállításhoz vagy más hivatalos névvel rendelkező és szervezett eseményhez, amely egy forrás létrejöttét eredményezi és egy helyen tartanak. @hu
definition: Liittää paikan paikassa pidettyyn konferenssiin, näyttelyyn tai muuhun tapahtumaan, jonka seurauksena sntyy aineisto. @fi
definition: Relaterer et sted til en konference, udstilling, eller anden formelt navngivet og indkaldt begivenhed, der giver ophav til en ressource og der afholdes et sted. @da
definition: Relates a place to a conference, exhibition, or other formally named and convened event that gives rise to a resource and that is held in a place.
definition: Setzt ein Geografikum in Beziehung zu einer Konferenz, einer Ausstellung oder einer anderen formal benannten und einberufenen Veranstaltung, aus der eine Ressource hervorgeht. @de
definition: يربط بين مكان ومؤتمر، معرض، أو أي حدث آخر سُمي وعُقد رسميًا وأسفر عن مصدر وعُقد في مكان ما. @ar
definition: 将一个地点与作为一个导致一种资源产生并在一个地点举行的一次会议、展览或其他正式命名并举办的活动关联起来。 @zh-hans

has beginning
lexical alias: beginning.en
status: Published
type: Property
label: ajanjakson alku @fi
label: başlangıç ile ilişkilidir @tr
label: har begyndelse @da
label: hat Anfang @de
label: heeft begin @nl
label: kezdete a következő: @hu
label: له بداية @ar
label: 有开始 @zh-hans
inverse of: is beginning of
definition: Bir zaman aralığını, zaman aralığının başladığı zaman olan bir zaman aralığıyla ilişkilendirir. @tr
definition: Hozzákapcsol egy időtartamot ahhoz az időponthoz, amikor az időtartam kezdődik. @hu
definition: Liittää ajanjakson ajanjaksoon, joka on ajanjakson alkamisaika. @fi
definition: Relaterer et tidsforløb til et tidsforløb, der der det tidspunkt hvor et tidsforløb starter. @da
definition: Relates a timespan to a timespan that is the time at which a timespan starts.
definition: Setzt einen Zeitraum in Beziehung zu einem Zeitraum, bei dem es sich um den Zeitpunkt handelt, an dem ein Zeitraum beginnt. @de
definition: يربط بين فترة زمنية وزمن حيث تبدأ فيه فترة زمنية. @ar
definition: 将一个时间段与作为一个时间段开始时间的一个时间段关联起来。 @zh-hans
scope note: A time may be represented at different levels of granularity by a calendrical timespan.
scope note: Aika voidaan esittää kalenterin ajanjakson eri tarkkustasoilla. @fi
scope note: Ein Zeitpunkt kann durch einen kalendarischen Zeitraum auf verschiedenen Ebenen der Granularität dargestellt werden. @de
scope note: Et tidspunkt kan repræsenteres på forskellige granularitetsniveauer ved et kalendrisk tidsrum. @da
scope note: Különböző szintű részletességgel, naptári időtartammal ábrázolt idő. @hu
scope note: Zaman, takvimsel bir zaman aralığı ile farklı ayrıntı düzeylerinde temsil edilebilir. @tr
scope note: يمكن تمثيل الوقت عند مستويات مختلفة من التجميع بواسطة فترة زمنية تقويمية. @ar
scope note: 一个时间可以用日历时间段的不同颗粒度层级表示。 @zh-hans

is country associated with agent of
lexical alias: countryAssociatedWithAgent.en
status: Published
type: Property
label: er land tilknyttet agent af @da
label: is land geassocieerd met actor van @nl
label: ist Land, das mit einem Akteur in Verbindung steht von @de
label: kapcsolódó országa a következő ágensnek: @hu
label: temsilcisinin ülkesi ile ilişkilidir @tr
label: toimijaan liittyvä maa @fi
label: هي بلد مرتبط بوكيل لـ @ar
label: 是和……的行为者有关的国家 @zh-hans
inverse of: has country associated with agent
definition: Bir yeri, bir ülke ile özdeşleşmiş bir temsilciyle ilişkilendirir. @tr
definition: Hozzákapcsol egy helyet egy ágenshez, amelyet egy országgal azonosítanak. @hu
definition: Liittää paikan toimijaan, joka yhdistetään tiettyyn maahan. @fi
definition: Relaterer et sted til en agent, som er identificeret med et land. @da
definition: Relates a place to an agent who is identified with a country.
definition: Setzt ein Geografikum in Beziehung zu einem Akteur, der mit einem Land identifiziert wird. @de
definition: يربط بين مكان ووكيل يُستدل به على بلد. @ar
definition: 将一个地点与被一个国家标识的一个行为者关联起来。 @zh-hans

has ending
lexical alias: ending.en
status: Published
type: Property
label: ajanjakson loppu @fi
label: befejezése a következő: @hu
label: bitiş ile ilişkilidir @tr
label: har slutning @da
label: hat Ende @de
label: heeft einde @nl
label: له نهاية @ar
label: 有结束 @zh-hans
inverse of: is ending of
definition: Bir zaman aralığını, zaman aralığının bittiği zaman olan bir zaman aralığyla ilişkilendirir. @tr
definition: Hozzákapcsol egy időpontot egy időponthoz, amikor az időtartam befejeződik. @hu
definition: Liittää ajanjakson ajanjaksoon, joka on ajanjakson päättymisaika. @fi
definition: Relaterer et tidsforløb til et tidsforløb, der der det tidspunkt hvor et tidsforløb stopper. @da
definition: Relates a timespan to a timespan that is the time at which a timespan finishes.
definition: Setzt einen Zeitraum in Beziehung zu einem Zeitraum, bei dem es sich um den Zeitpunkt handelt, an dem ein Zeitraum endet. @de
definition: يربط بين فترة زمنية وزمن حيث تنتهي فيه فترة زمنية. @ar
definition: 将一个时间段与作为一个时间段结束时间的一个时间段关联起来。 @zh-hans
scope note: A time may be represented at different levels of granularity by a calendrical timespan.
scope note: Aika voidaan esittää kalenterin ajanjakson eri tarkkuustasoilla. @fi
scope note: Ein Zeitpunkt kann durch einen kalendarischen Zeitraum auf verschiedenen Ebenen der Granularität dargestellt werden. @de
scope note: Et tidspunkt kan repræsenteres på forskellige granularitetsniveauer ved et kalendrisk tidsrum. @da
scope note: Különböző szintű részletességgel, naptári időtartammal ábrázolt idő. @hu
scope note: Zaman, takvimsel bir zaman aralığı ile farklı ayrıntı düzeylerinde temsil edilebilir. @tr
scope note: يمكن تمثيل الوقت عند مستويات مختلفة من التجميع بواسطة فترة زمنية تقويمية. @ar
scope note: 一个时间可以用日历时间段的不同颗粒度层级表示。 @zh-hans

is part of place
lexical alias: partOfPlace.en
status: Published
type: Property
label: er del af sted @da
label: is deel van plaats @nl
label: ist Teil von Geografikum @de
label: paikan osa @fi
label: része a következő helynek: @hu
label: yerin bir bileşenidir @tr
label: هو جزء من مكان @ar
label: 是地点的部分 @zh-hans
sub property of: has related place of place
inverse of: has part place
definition: Bir yeri başka bir yeri içeren bir yer ile ilişkilendirir. @tr
definition: Hozzákapcsol egy helyet egy olyan helyhez, amely magában foglal egy másik helyet. @hu
definition: Liittää paikan paikkaan, joka sisältää toisen paikan. @fi
definition: Relaterer et sted til et sted der omfatter et andet sted. @da
definition: Relates a place to a place that encompasses another place.
definition: Setzt ein Geografikum in Beziehung zu einem Geografikum, das ein anderes Geografikum umschließt. @de
definition: يربط بين مكان ومكان يشتمل على مكان آخر. @ar
definition: 将一个地点与包含另一个地点的一个地点关联起来。 @zh-hans

is part of timespan
lexical alias: partOfTimespan.en
status: Published
type: Property
label: ajanjakson osa @fi
label: er del af tidsforløb @da
label: is deel van tijdspanne @nl
label: ist Teil von (Zeitraum) @de
label: része a következő időtartamnak: @hu
label: zaman aralığının bir bileşenidir @tr
label: هو جزء من فترة زمنية @ar
label: 是时间段的部分 @zh-hans
sub property of: has related timespan of timespan
inverse of: has part timespan
definition: Bir zaman aralığını, bileşen olarak başka bir zaman aralığına sahip olan bir zaman aralığıyla ilişkilendirir. @tr
definition: Hozzákapcsol egy időtartamot egy időtartamhoz, amelynek egy másik időtartam alkotóelemként a része. @hu
definition: Liittää ajanjakson ajanjaksoon, jonka itsenäisenä osana on toinen ajanjakso. @fi
definition: Relaterer et tidsforløb, der har et andet tidsforløb som kompnent. @da
definition: Relates a timespan to a timespan that has another timespan as a component.
definition: Setzt einen Zeitraum in Beziehung zu einem Zeitraum, der einen anderen Zeitraum als Bestandteil enthält. @de
definition: يربط بين فترة زمنية وفترة زمنية لها فترة زمنية أخرى كعنصر. @ar
definition: 将一个时间段与有另一个时间段作为其组成部分的一个时间段关联起来。 @zh-hans

has part place
lexical alias: partPlace.en
status: Published
type: Property
label: har sted for del @da
label: hat Teil-Geografikum @de
label: heeft deel plaats @nl
label: paikan osa @fi
label: részhelye a következő: @hu
label: yer bileşeni ile ilişkilidir @tr
label: له جزء مكان @ar
label: 有部分地点 @zh-hans
sub property of: has related place of place
inverse of: is part of place
definition: Bir yeri, başka bir yerin içinde bulunan bir yer ile ilişkilendirir. @tr
definition: Hozzákapcsol egy helyet egy helyhez, amely egy másik helyen belül található. @hu
definition: Liittää paikan paikkaan, joka sijaitsee toisen paikan sisällä. @fi
definition: Relaterer et sted til et sted, der er placeret inden for et andet sted. @da
definition: Relates a place to a place that is located within another place.
definition: Setzt ein Geografikum in Beziehung zu einem Geografikum, das von einem anderen Geografikum umschlossen ist. @de
definition: يربط بين مكان ومكان يقع داخل مكان آخر. @ar
definition: 将一个地点与位于另一个地点内部的一个地点关联起来。 @zh-hans

has part timespan
lexical alias: partTimespan.en
status: Published
type: Property
label: ajanjakson osa @fi
label: har tidsforløb for del @da
label: hat Teil-Zeitraum @de
label: heeft deel tijdspanne @nl
label: időtartamrésze a következő: @hu
label: zaman aralığı bileşeni ile ilişkilidir @tr
label: له جزء من فترة زمنية @ar
label: 有部分时间段 @zh-hans
sub property of: has related timespan of timespan
inverse of: is part of timespan
definition: Bir zaman aralığını, başka bir zaman aralığının bileşeni olan bir zaman aralığıyla ilişkilendirir. @tr
definition: Hozzákapcsol egy időtartamot egy időtartamhoz, amely egy másik időtartam alkotóeleme. @hu
definition: Liittää ajanjakson ajanjaksoon, joka on toisen ajanjakson itsenäinen osa. @fi
definition: Relaterer et tidsforløb til et tidsforløb, der er en komponent af et andet tidsforløb. @da
definition: Relates a timespan to a timespan that is a component of another timespan.
definition: Setzt einen Zeitraum in Beziehung zu einem Zeitraum, der ein Bestandteil von einem anderen Zeitraum ist. @de
definition: يربط بين فترة زمنية وفترة زمنية التي هي عنصر عن فترة زمنية أخرى. @ar
definition: 将一个时间段与作为另一个时间段的组成部分的一个时间段关联起来。 @zh-hans

has binding of resource
lexical alias: bindingOfResource.en
status: Published
type: Property
label: forrás kötése a következő: @hu
label: har indbinding af ressource @da
label: hat Einband einer Ressource @de
label: heeft bindwijze van resource @nl
label: kaynağın ciltlenmesi ile ilişkilidir @tr
label: sidos aineistona @fi
label: له تجليد لمصدر @ar
label: 有资源的装订 @zh-hans
sub property of: aineistoon liittyvä aineisto
inverse of: is binding of resource of
definition: Bir kaynağı, kaynağın bağlantısı olan bir kaynakla ilişkilendirir. @tr
definition: Hozzákapcsol egy forrást egy forráshoz, amely egy forrás kötése. @hu
definition: Liittää aineiston aineistoon, joka on aineiston sidos. @fi
definition: Relaterer en ressource til en ressource, der er en indbinding af en ressource. @da
definition: Relates a resource to a resource that is a binding of a resource.
definition: Setzt eine Ressource in Beziehung zu einer Ressource, bei der es sich um den Einband einer Ressource handelt. @de
definition: يربط بين مصدر ومصدر هو تجليد لمصدر. @ar
definition: 将一种资源与作为一种资源的装订的一种资源关联起来。 @zh-hans

is binding of resource of
lexical alias: bindingOfResourceOf.en
status: Published
type: Property
label: aineiston sidos @fi
label: er indbinding af ressource af @da
label: is bindwijze van resource van @nl
label: ist Einband einer Ressource von @de
label: kaynağının ciltleyicisidir @tr
label: kötése a következő forrásnak: @hu
label: هو تجليد مصدر لـ @ar
label: 是……的资源的装订 @zh-hans
sub property of: aineistoon liittyvä aineisto
inverse of: has binding of resource
definition: Bir kaynağı, bağlı olduğu bir kaynakla ilişkilendirir. @tr
definition: Hozzákapcsol egy forrást egy forráshoz, amely maga a kötés. @hu
definition: Liittää aineiston aineistoon, joka on sidottu. @fi
definition: Relaterer en ressourece til en ressource, der er indbundet. @da
definition: Relates a resource to a resource that is bound.
definition: Setzt eine Ressource in Beziehung zu einer gebundenen Ressource. @de
definition: يربط بين مصدر ومصدر تم تجليده. @ar
definition: 将一种资源与一种被装订的资源关联起来。 @zh-hans

has type of binding
lexical alias: typeOfBinding.en
status: Published
type: Property
label: aineiston sidostyyppi @fi
label: ciltleme türü ile ilişkilidir @tr
label: har type af indbinding @da
label: hat Bindeart @de
label: heeft bindwijze @nl
label: kötéstípusa a következő: @hu
label: له نوع تجيلد @ar
label: 有装订类型 @zh-hans
definition: Bir kaynağı, yayınlanmış veya yayınlanmamış bir kaynağı bağlamak için kullanılan bir yöntemle ilişkilendirir. @tr
definition: Hozzákapcsol egy forrást egy módszerhez, amelyet kiadott vagy kiadatlan forrás kötéséhez használnak. @hu
definition: Liittää aineiston menetelmään, jolla julkaistu tai julkaisematon aineisto on sidottu. @fi
definition: Relaterer en ressource til en metode brugt til at indbinde en udgiven eller ikke udgiven ressource. @da
definition: Relates a resource to a method used to bind a published or unpublished resource.
definition: Setzt eine Ressource in Beziehung zu einer Methode, die verwendet wird, um eine veröffentlichte oder unveröffentlichte Ressource zu binden. @de
definition: يربط بين مصدر وطريقة مستخدمة لتجليد مصدر منشور أو غير منشور. @ar
definition: 将一种资源与用于装订一种出版或非出版资源的方法关联起来。 @zh-hans

has related agent of resource
has subproperty: has platemaker
has subproperty: has papermaker
has subproperty: has modifier
lexical alias: relatedAgentOfResource.en
status: Published
type: Property
label: aineistoon liittyvä toimija @fi
label: forrás kapcsolódó ágense a következő: @hu
label: har relateret agent for ressource @da
label: hat mit Ressource in Beziehung stehenden Akteur @de
label: heeft gerelateerde actor van resource @nl
label: kaynağın ilgili temsilcisi ile ilişkilidir @tr
label: له وكيل مرتبط بمصدر @ar
label: 有资源的相关行为者 @zh-hans
sub property of: has related entity of resource
inverse of: has related resource of agent
definition: Bir kaynağı, kaynakla bağlantılı olan bir temsilci ile ilişkilendirir. @tr
definition: Hozzákapcsol egy forrást egy ágenshez, amelyet egy forráshoz társítanak. @hu
definition: Liittää aineiston toimijaan, joka liittyy aineistoon. @fi
definition: Relaterer en ressource til en agent, der er knyttet til en ressource. @da
definition: Relates a resource to an agent who is associated with a resource.
definition: Setzt eine Ressource in Beziehung zu einem Akteur, der mit einer Ressource in Verbindung steht. @de
definition: يربط مصدر بوكيل مرتبط بمصدر. @ar
definition: 将一种资源与和一种资源有关的一个行为者关联起来。 @zh-hans

has related resource of agent
has subproperty: is platemaker of
has subproperty: is papermaker of
has subproperty: is modifier of
lexical alias: relatedResourceOfAgent.en
status: Published
type: Property
label: har relateret ressource til agent @da
label: hat mit Akteur in Beziehung stehende Ressource @de
label: heeft gerelateerde resource van actor @nl
label: temsilcinin ilgili kaynağı ile ilişkilidir @tr
label: toimijaan liittyvä aineisto @fi
label: ágens kapcsolódó forrása a következő: @hu
label: له مصدر مرتبط بوكيل @ar
label: 有行为者的相关资源 @zh-hans
sub property of: has related entity of entity
inverse of: has related agent of resource
definition: Bir temsilciyi, temsilciyle bağlantılı olan bir kaynakla ilişkilendirir. @tr
definition: Hozzákapcsol egy ágenst egy forráshoz, amelyet egy ágenshez társítanak. @hu
definition: Liittää toimijan aineistoon, joka liittyy toimijaan. @fi
definition: Relaterer en agent til en ressource, der er knyttet til en agent. @da
definition: Relates an agent to resource that is associated with an agent.
definition: Setzt einen Akteur in Beziehung zu einer Ressource, die mit einem Akteur in Verbindung steht. @de
definition: يربط بين وكيل ومصدر مرتبط بوكيل. @ar
definition: 将一个行为者与和一个行为者有关的一种资源关联起来。 @zh-hans

has related agent of timespan
has subproperty: is date associated with agent of (Deprecated)
lexical alias: relatedAgentOfTimespan.en
status: Published
type: Property
label: ajanjaksoon liittyvä toimija @fi
label: har relateret agent til tidsforløb @da
label: hat mit Zeitraum in Beziehung stehenden Akteur @de
label: heeft gerelateerde actor van tijdspanne @nl
label: időtartam kapcsolódó ágense a következő: @hu
label: zaman aralığının ilgili temsilcisi ile ilişkilidir @tr
label: له وكيل مرتبط بفترة زمنية @ar
label: 有时间段的相关行为者 @zh-hans
sub property of: has related entity of timespan
inverse of: has related timespan of agent
definition: Bir zaman aralığını, zaman aralığıyla bağlantılı olan bir temsilciyle ilişkilendirir. @tr
definition: Hozzákapcsol egy időtartamot egy ágenshez, amelyet egy időtartamhoz társítanak. @hu
definition: Liittää ajanjakson toimijaan, joka liittyy ajanjaksoon. @fi
definition: Relaterer et tidsforløb til en agent, der er knyttet til et tidsforløb. @da
definition: Relates a timespan to an agent who is associated with a timespan.
definition: Setzt einen Zeitraum in Beziehung zu einem Akteur, der mit einem Zeitraum in Verbindung steht. @de
definition: يربط بين فترة زمنية ووكيل مرتبط بفترة زمنية. @ar
definition: 将一个时间段与和一个时间段有关的一个行为者关联起来。 @zh-hans

has related agent of place
has subproperty: is place of birth of
has subproperty: is place of death of
has subproperty: is place of residence of
has subproperty: is place associated with agent of (Deprecated)
has subproperty: is place of conference of
lexical alias: relatedAgentOfPlace.en
status: Published
type: Property
label: har agent relateret til sted @da
label: hat mit Geografikum in Beziehung stehenden Akteur @de
label: heeft gerelateerde actor van plaats @nl
label: hely kapcsolódó ágense a következő: @hu
label: paikkaan liittyvä toimija @fi
label: yerin ilgili temsilcisi ile ilişkilidir @tr
label: له وكيل مرتبط بمكان @ar
label: 有地点的相关行为者 @zh-hans
sub property of: has related entity of place
inverse of: has related place of agent
definition: Bir yeri, yerle bağlantılı olan bir temsilciyle ilişkilendirir. @tr
definition: Hozzákapcsol egy helyet egy ágenshez, amelyet egy helyhez társítanak. @hu
definition: Liittää paikkaan toimijan, joka liittyy paikkaan. @fi
definition: Relaterer et sted til en agent, der er knyttet til et sted. @da
definition: Relates a place to an agent who is associated with a place.
definition: Setzt ein Geografikum in Beziehung zu einem Akteur, der mit einem Geografikum in Verbindung steht. @de
definition: يربط بين مكان ووكيل مرتبط بمكان. @ar
definition: 将一个地点与和一个地点有关的一个行为者关联起来。 @zh-hans

has related resource of timespan
has subproperty: is date of capture of
has subproperty: is date of distribution of
has subproperty: is date of manufacture of
has subproperty: is date of production of
has subproperty: is date of publication of
has subproperty: is date of resource of
lexical alias: relatedResourceOfTimespan.en
status: Published
type: Property
label: ajanjaksoon liittyvä aineisto @fi
label: har relateret ressource for tidsforløb @da
label: hat mit Zeitraum in Beziehung stehende Ressource @de
label: heeft gerelateerde resource van tijdspanne @nl
label: időtartam kapcsolódó forrása a következő: @hu
label: zaman aralığının ilgili kaynağı ile ilişkilidir @tr
label: له مصدر مرتبط بفترة زمنية @ar
label: 有时间段的相关资源 @zh-hans
sub property of: has related entity of timespan
inverse of: has related timespan of resource
definition: Bir zaman aralığını, bir zaman aralığyla bağlantılı olan bir kaynakla ilişkilendirir. @tr
definition: Hozzákapcsol egy időtartamot egy forráshoz, amelyet egy időtartamhoz társítanak. @hu
definition: Liittää ajanjakson aineistoon, joka liittyy ajanjaksoon. @fi
definition: Relaterer et tidsforløb til en ressource, der er knyttet til et tidsforløb. @da
definition: Relates a timespan to a resource that is associated with a timespan.
definition: Setzt einen Zeitraum in Beziehung zu einer Ressource, die mit einem Zeitraum in Verbindung steht. @de
definition: يربط بين فترة زمنية ومصدر مرتبط بفترة زمنية. @ar
definition: 将一个时间段与和一个时间段有关的一种资源关联起来。 @zh-hans

has related resource of place
has subproperty: is place of capture of
has subproperty: is place of distribution of
has subproperty: is place of manufacture of
has subproperty: is place of origin of resource of
has subproperty: is place of production of
has subproperty: is place of publication of
has subproperty: is place associated with resource of (Deprecated)
has subproperty: is coordinates of cartographic content of
has subproperty: is place of resource of
has subproperty: has location of collection
has subproperty: has location of resource
lexical alias: relatedResourceOfPlace.en
status: Published
type: Property
label: har relateret ressource for sted @da
label: hat mit Geografikum in Beziehung stehende Ressource @de
label: heeft gerelateerde resource van plaats @nl
label: hely kapcsolódó forrása a következő: @hu
label: paikkaan liittyvä aineisto @fi
label: yerin ilgili kaynağı ile ilişkilidir @tr
label: له مصدر مرتبط بمكان @ar
label: 有地点的相关资源 @zh-hans
sub property of: has related entity of place
inverse of: has related place of resource
definition: Bir yeri, bir yerle bağlantılı olan kaynakla ilişkilendirir. @tr
definition: Hozzákapcsol egy helyet egy forráshoz, amelyet egy helyhez társítanak. @hu
definition: Liittää paikan aineistoon, joka liittyy paikkaan. @fi
definition: Relaciona un lloc amb un recurs que s’associa amb un lloc. @ca
definition: Relaterer et sted til en ressource, der er knyttet til et sted. @da
definition: Relates a place to a resource that is associated with a place.
definition: Setzt ein Geografikum in Beziehung zu einer Ressource, die mit einem Geografikum in Verbindung steht. @de
definition: يربط مكان بمصدر مرتبط بمكان. @ar
definition: 将一个地点与和一个地点有关的一种资源关联起来。 @zh-hans

has related place of resource
has subproperty: has place of distribution
has subproperty: has place of production
has subproperty: has place of manufacture
has subproperty: has place of publication
has subproperty: has place of origin of resource
has subproperty: has place of capture
has subproperty: has place associated with resource (Deprecated)
has subproperty: has place of resource
has subproperty: is location of collection of
has subproperty: is location of resource of
lexical alias: relatedPlaceOfResource.en
status: Published
type: Property
label: aineistoon liittyvä paikka @fi
label: forrás kapcsolódó helye a következő: @hu
label: har relateret sted for ressource @da
label: hat mit Ressource in Beziehung stehendes Geografikum @de
label: heeft gerelateerde plaats van resource @nl
label: kaynağın ilgili yeri ile ilişkilidir @tr
label: له مكان مرتبط بمصدر @ar
label: 有资源的相关地点 @zh-hans
sub property of: has related entity of resource
inverse of: has related resource of place
definition: Bir kaynağı, kaynakla bağlantılı bir yerle ilişkilendirir. @tr
definition: Hozzákapcsol egy forrást egy helyhez, amelyet egy forráshoz társítanak. @hu
definition: Liittää aineiston paikkaan, joka liittyy aineistoon. @fi
definition: Relaterer en ressource til et sted, der er knyttet til en ressource. @da
definition: Relates a resource to a place that is associated with a resource.
definition: Setzt eine Ressource in Beziehung zu einem Geografikum, das mit einer Ressource in Verbindung steht. @de
definition: يربط بين مصدر ومكان مرتبط بمصدر. @ar
definition: 将一种资源与和一种资源有关的一个地点关联起来。 @zh-hans

has related place of timespan
lexical alias: relatedPlaceOfTimespan.en
status: Published
type: Property
label: ajanjaksoon liittyvä paikka @fi
label: har relateret sted for tidsforløb @da
label: hat mit Zeitraum in Beziehung stehendes Geografikum @de
label: heeft gerelateerde plaats van tijdspanne @nl
label: időtartam kapcsolódó helye a következő: @hu
label: zaman aralığının ilgili yeri ile ilişkilidir @tr
label: له مكان مرتبط بفترة زمنية @ar
label: 有时间段的关联地点 @zh-hans
sub property of: has related entity of timespan
inverse of: has related timespan of place
definition: Bir zaman aralığını, zaman aralığıyla bağlantılı olan bir yerle ilişkilendirir. @tr
definition: Hozákapcsol egy időtartamot egy helyhez, amelyet egy időtartamhoz társítanak. @hu
definition: Liittää ajanjakson paikkaan, joka liittyy ajanjaksoon. @fi
definition: Relaterer et tidsforløb til et sted, der er knyttet til et tidsforløb. @da
definition: Relates a timespan to a place that is associated with a timespan.
definition: Setzt einen Zeitraum in Beziehung zu einem Geografikum, das mit einem Zeitraum in Verbindung steht. @de
definition: يربط بين فترة زمنية ومكان مرتبط بفترة زمنية. @ar
definition: 将一个时间段与和一个时间段有关的一个地点关联起来。 @zh-hans

has related place of place
has subproperty: is part of place
has subproperty: has part place
lexical alias: relatedPlaceOfPlace.en
status: Published
type: Property
label: har relateret sted for sted @da
label: hat mit Geografikum in Beziehung stehendes Geografikum @de
label: heeft gerelateerde plaats van plaats @nl
label: hely kapcsolódó helye a következő: @hu
label: paikkaan liittyvä paikka @fi
label: yerin ilgili yeri ile ilişkilidir @tr
label: له مكان مرتبط بمكان @ar
label: 有地点的关联地点 @zh-hans
sub property of: has related entity of place
definition: Bir yeri, bir yerle bağlantılı olan bir yer ile ilişkilendirir. @tr
definition: Hozzákapcsol egy helyet egy helyhez, amelyet egy helyhez társítanak. @hu
definition: Liittää paikan paikkaan, joka liittyy paikkaan. @fi
definition: Relaterer et sted til et sted, der er knyttet til et sted. @da
definition: Relates a place to a place that is associated with a place.
definition: Setzt ein Geografikum in Beziehung zu einem Geografikum, das mit einem Geografikum in Verbindung steht. @de
definition: يربط بين مكان ومكان مرتبط بمكان. @ar
definition: 将一个地点与和一个地点有关的一个地点关联起来。 @zh-hans

has related timespan of timespan
has subproperty: is part of timespan
has subproperty: has part timespan
lexical alias: relatedTimespanOfTimespan.en
status: Published
type: Property
label: ajanjaksoon liittyvä ajanjakso @fi
label: har relateret tidsforløb for tidsforløb @da
label: hat mit Zeitraum in Beziehung stehenden Zeitraum @de
label: heeft gerelateerde tijdspanne van tijdspanne @nl
label: időtartam kapcsolódó időtartama a következő: @hu
label: zaman aralığının ilgili zaman aralığı ile ilişkilidir @tr
label: له فترة زمنية مرتبطة بفترة زمنية @ar
label: 有时间段的关联时间段 @zh-hans
sub property of: has related entity of timespan
definition: Bir zaman aralığını, zaman aralığıyla bağlantılı olan bir zaman aralığıyla ilişkilendirir. @tr
definition: Hozzákapcsol egy időtartamot egy időtartamhoz, amelyet egy időtartamhoz társítanak. @hu
definition: Liittää ajanjakson ajanjaksoon, joka liittyy ajanjaksoon. @fi
definition: Relaterer et tidsforløb til et tidsforløb, der er knyttet til et tidsforløb. @da
definition: Relates a timespan to a timespan that is associated with a timespan.
definition: Setzt einen Zeitraum in Beziehung mit einem Zeitraum, der mit einem Zeitraum in Verbindung steht. @de
definition: يربط بين فترة زمنية وفترة زمنية مرتبطة بفترة زمنية. @ar
definition: 将一个时间段与和一个时间段有关的一个时间段关联起来。 @zh-hans

has related place of agent
has subproperty: has place governed
has subproperty: has place of conference
has subproperty: has place associated with agent (Deprecated)
has subproperty: has place of residence
has subproperty: has place of death
has subproperty: has place of birth
lexical alias: relatedPlaceOfAgent.en
status: Published
type: Property
label: har relateret sted for agent @da
label: hat mit Akteur in Beziehung stehendes Geografikum @de
label: heeft gerelateerde plaats van actor @nl
label: temsilcinin ilgili yeri ile ilişkilidir @tr
label: toimijaan liittyvä paikka @fi
label: ágens kapcsolódó helye a következő: @hu
label: له مكان مرتبط بوكيل @ar
label: 有行为者的关联地点 @zh-hans
sub property of: has related entity of entity
inverse of: has related agent of place
definition: Bir temsilciyi, temsilciyle bağlantılı olan bir yerle ile ilişkilendirir. @tr
definition: Hozzákapcsol egy ágenst egy helyhez, amelyet egy ágenshez társítanak. @hu
definition: Liittää toimijan paikkaan, joka liittyy toimijaan. @fi
definition: Relaterer en agent til et sted, der er knyttet til en agent. @da
definition: Relates an agent to a place that is associated with an agent.
definition: Setzt einen Akteur in Beziehung zu einem Geografikum, das mit einem Akteur in Verbindung steht. @de
definition: يربط بين وكيل ومكان مرتبط بوكيل @ar
definition: 将一个行为者与和一个行为者有关的一个地点关联起来。 @zh-hans

has related timespan of place
lexical alias: relatedTimespanOfPlace.en
status: Published
type: Property
label: har relateret tidsforløb for sted @da
label: hat mit Geografikum in Beziehung stehenden Zeitraum @de
label: heeft gerelateerde tijdspanne van plaats @nl
label: hely kapcsolódó időtartama a következő: @hu
label: paikkaan liittyvä ajanjakso @fi
label: yerin ilgili zaman aralığı ile ilişkilidir @tr
label: له فترة زمنية مرتبطة بمكان @ar
label: 有地点的关联时间段 @zh-hans
sub property of: has related entity of place
inverse of: has related place of timespan
definition: Bir yeri, bir yerle bağlantılı olan bir zaman aralığıyla ilişkilendirir. @tr
definition: Hozzákapcsol egy helyet egy időtartamhoz, amelyet egy helyhez társítanak. @hu
definition: Liittää paikan ajanjaksoon, joka liittyy paikkaan. @fi
definition: Relaterer et sted til et tidsforløb, der er knyttet til et sted. @da
definition: Relates a place to a timespan that is associated with a place.
definition: Setzt ein Geografikum in Beziehung zu einem Zeitraum, der mit einem Geografikum in Verbindung steht. @de
definition: يربط بين مكان وفترة زمنية مرتبطة بمكان. @ar
definition: 将一个地点与和一个地点有关的一个时间段关联起来。 @zh-hans

has related timespan of resource
has subproperty: has date of distribution
has subproperty: has date of production
has subproperty: has date of manufacture
has subproperty: has date of publication
has subproperty: has date associated with agent (Deprecated)
has subproperty: has date of resource
lexical alias: relatedTimespanOfResource.en
status: Published
type: Property
label: aineistoon liittyvä ajanjakso @fi
label: forrás kapcsolódó időtartama a következő: @hu
label: har relateret tidsforløb for ressource @da
label: hat mit Ressource in Beziehung stehenden Zeitraum @de
label: heeft gerelateerde tijdspanne van resource @nl
label: kaynağın ilgili zaman aralığı ile ilişkilidir @tr
label: له فترة زمنية مرتبطة بمصدر @ar
label: 有资源的关联时间段 @zh-hans
sub property of: has related entity of resource
inverse of: has related resource of timespan
definition: Bir kaynağı, kaynakla bağlantılı bir zaman aralığıyla ilişkilendirir. @tr
definition: Hozzákapcsol egy forrást egy időtartamhoz, amelyet egy forráshoz társítanak. @hu
definition: Liittää aineiston ajanjaksoon, joka liittyy aineistoon. @fi
definition: Relaterer en ressource til et tidsforløb, der er knyttet til en ressource. @da
definition: Relates a resource to a timespan that is associated with a resource.
definition: Setzt eine Ressource in Beziehung zu einem Zeitraum, der mit einer Ressource in Verbindung steht. @de
definition: يربط بين مصدر وفترة زمنية مرتبطة بمصدر. @ar
definition: 将一种资源与和一种资源有关的一个时间段关联起来。 @zh-hans

has related timespan of agent
lexical alias: relatedTimespanOfAgent.en
status: Published
type: Property
label: har relateret tidsforløb for agent @da
label: hat mit Akteur in Beziehung stehenden Zeitraum @de
label: heeft gerelateerde tijdspanne van actor @nl
label: temsilcinin ilgili zaman aralığı ile ilişkilidir @tr
label: toimijaan liittyvä ajanjakso @fi
label: ágens kapcsolódó időtartama a következő: @hu
label: له فترة زمنية مرتبطة بوكيل @ar
label: 有行为者的关联时间段 @zh-hans
sub property of: has related entity of entity
inverse of: has related agent of timespan
definition: Bir temsilciyi, temsilciyle bağlantılı olan bir zaman aralığıyla ilişkilendirir. @tr
definition: Hozzákapcsol egy ágenst egy időtartamhoz, amelyet egy ágenshez társítanak. @hu
definition: Liittää toimijan ajanjaksoon, joka liittyy toimijaan. @fi
definition: Relaterer en agent til et tidsforløb, der er knyttet til en agent. @da
definition: Relates an agent to a timespan that is associated with an agent.
definition: Setzt einen Akteur in Beziehung zu einem Zeitraum, der mit einem Akteur in Verbindung steht. @de
definition: يربط بين وكيل وفترة زمنية مرتبطة بوكيل. @ar
definition: 将一个行为者与和一个行为者有关的一个时间段关联起来。 @zh-hans

has related nomen of agent
lexical alias: relatedNomenOfAgent.en
status: Published
type: Property
label: har relateret nomen for agent @da
label: hat mit Akteur in Beziehung stehendes Nomen @de
label: heeft gerelateerde nomen van actor @nl
label: temsilcinin ilgili ismi ile ile ilişkilidir @tr
label: toimijaan liittyvä nomen @fi
label: ágens kapcsolódó nomenje a következő: @hu
label: له تسمية مرتبطة بوكيل @ar
label: 有行为者的关联命名。 @zh-hans
sub property of: has related entity of agent
inverse of: has related agent of nomen
definition: Bir temsilciyi, temsilciyle bağlantılı olan bir isimle ilişkilendirir. @tr
definition: Hozzákapcsol egy ágenst egy nomenhez, amelyet egy ágenshez társítanak. @hu
definition: Liittää toimijan nomeniin, joka liittyy toimijaan. @fi
definition: Relaciona un agent amb un nomen que s’associa amb un agent. @ca
definition: Relaterer en agent til et nomen der er knyttet til en agent. @da
definition: Relates an agent to a nomen that is associated with an agent.
definition: Setzt einen Akteur in Beziehung zu einem Nomen, das mit einem Akteur in Verbindung steht. @de
definition: يربط بين وكيل وتسمية مرتبطة بوكيل @ar
definition: 将一个行为者与和一个行为者有关的一个命名关联起来。 @zh-hans

has related nomen of resource
has subproperty: has key title
has subproperty: has name of agent of resource
lexical alias: relatedNomenOfResource.en
status: Published
type: Property
label: aineistoon liittyvä nomen @fi
label: forrás kapcsolódó nomenje a következő: @hu
label: har relateret nomen for ressource @da
label: hat mit Ressource in Beziehung stehendes Nomen @de
label: heeft gerelateerde nomen van resource @nl
label: kaynağın ilgili ismi ile ilişkilidir @tr
label: له تسمية مرتبطة بمصدر @ar
label: 有资源的关联命名 @zh-hans
sub property of: has related entity of resource
inverse of: has related resource of nomen
definition: Bir kaynağı, kaynakla bağlantılı olan bir isimle ilişkilendirir. @tr
definition: Hozzákapcsol egy forrást egy nomenhez, amelyet egy forráshoz társítanak. @hu
definition: Liittää aineiston nomeniin, joka liittyy aineistoon. @fi
definition: Relaterer en ressource til et nomen, som er knyttet til en ressource. @da
definition: Relates a resource to a nomen that is associated with a resource.
definition: Setzt eine Ressource in Beziehung zu einem Nomen, das mit einer Ressource in Verbindung steht. @de
definition: يربط بين مصدر وتسمية مرتبطة بمصدر. @ar
definition: 将一种资源与和一种资源有关的一个命名关联起来。 @zh-hans

has related nomen of timespan
lexical alias: relatedNomenOfTimespan.en
status: Published
type: Property
label: ajanjaksoon liittyvä nomen @fi
label: har relateret @da
label: hat mit Zeitraum in Beziehung stehendes Nomen @de
label: heeft gerelateerde nomen van tijdspanne @nl
label: időtartam kapcsolódó nomenje a következő: @hu
label: zaman aralığının ilgili ismi ile ilişkilidir @tr
label: له تسمية مرتبطة بفترة زمنية @ar
label: 有时间段的关联命名。 @zh-hans
sub property of: has related entity of timespan
inverse of: has related timespan of nomen
definition: Bir zaman aralığını, zaman aralığıyla bağlantılı olan bir isimle ilişkilendirir. @tr
definition: Hozzákapcsol egy időtartamot egy nomenhez, amelyet egy időtartamhoz társítanak. @hu
definition: Nomen, joka liittyy ajanjaksoon. @fi
definition: Relaterer et tidsforløb til et nomen, som er knyttet til et tidsforløb. @da
definition: Relates a timespan to a nomen that is associated with a timespan.
definition: Setzt einen Zeitraum in Beziehung zu einem Nomen, das mit einem Zeitraum in Verbindung steht. @de
definition: يربط بين فترة زمنية وتسمية مرتبطة بفترة زمنية. @ar
definition: 将一个时间段与和一个时间段有关的一个命名关联起来。 @zh-hans

has related nomen of place
lexical alias: relatedNomenOfPlace.en
status: Published
type: Property
label: har relateret nomen til sted @da
label: hat mit Geografikum in Beziehung stehendes Nomen @de
label: heeft gerelateerde nomen van plaats @nl
label: hely kapcsolódó nomenje a következő: @hu
label: paikkaan liittyvä nomen @fi
label: yerin ilgili ismi ile ilişkilidir @tr
label: له تسمية مرتبطة بمكان @ar
label: 有地点的关联命名 @zh-hans
sub property of: has related entity of place
inverse of: has related place of nomen
definition: Bir yeri, yerle bağlantılı olan bir isimle ilişkilendirir. @tr
definition: Hozzákapcsol egy helyet egy nomenhez, amelyet egy helyhez társítanak. @hu
definition: Liittää paikan nomeniin, joka liittyy paikkaan. @fi
definition: Relaterer et sted til et nomen, som er knyttet til et sted. @da
definition: Relates a place to a nomen that is associated with a place.
definition: Setzt ein Geografikum in Beziehung zu einem Nomen, das mit einem Geografikum in Verbindung steht. @de
definition: يربط بين مكان وتسمية مرتبطة بمكان. @ar
definition: 将一个地点与和一个地点有关的一个命名关联起来。 @zh-hans

has related nomen of nomen
lexical alias: relatedNomenOfNomen.en
status: Published
type: Property
label: har relateret nomen til nomen @da
label: hat mit Nomen in Beziehung stehendes Nomen @de
label: heeft gerelateerde nomen van nomen @nl
label: ismin ilgili ismi ile ilişkilidir @tr
label: nomen kapcsolódó nomenje a következő: @hu
label: nomeniin liittyvä nomen @fi
label: له تسمية مرتبطة بتسمية @ar
label: 有命名的关联命名 @zh-hans
sub property of: has related entity of nomen
definition: Bir ismi, isimle bağlantılı olan bir isimle ilişkilendirir. @tr
definition: Hozzákapcsol egy noment egy nomenhez, amelyet egy nomenhez társítanak. @hu
definition: Liittää nomenin nomeniin, joka liittyy nomeniin. @fi
definition: Relaterer et nomen til et nomen, som er knyttet til et nomen. @da
definition: Relates a nomen to a nomen that is associated with a nomen.
definition: Setzt ein Nomen in Beziehung zu einem Nomen, das mit einem Nomen in Verbindung steht. @de
definition: يربط بين تسمية وتسمية مرتبطة بتسمية @ar
definition: 将一个命名与和一个命名有关的一个命名关联起来。 @zh-hans

has related agent of nomen
lexical alias: relatedAgentOfNomen.en
status: Published
type: Property
label: har relateret agent for nomen @da
label: hat mit Nomen in Beziehung stehenden Akteur @de
label: heeft gerelateerde actor van nomen @nl
label: ismin ilgili temsilcisi ile ilişkilidir @tr
label: nomen kapcsolódó ágense a következő: @hu
label: nomeniin liittyvä toimija @fi
label: له وكيل مرتبط بتسمية @ar
label: 有命名的关联行为者 @zh-hans
sub property of: has related entity of nomen
inverse of: has related nomen of agent
definition: Bir ismi, isimle bağlantılı olan bir temsilciyle ilişkilendirir. @tr
definition: Hozzákapcsol egy noment egy ágenshez, amelyet egy nomenhez társítanak. @hu
definition: Liittää nomenin toimijaan, joka liittyy nomeniin. @fi
definition: Relaterer et nomen til en agent, der er knyttet til et nomen. @da
definition: Relates a nomen to an agent who is associated with a nomen.
definition: Setzt ein Nomen in Beziehung zu einem Akteur, der mit einem Nomen in Verbindung steht. @de
definition: يربط بين تسمية ووكيل مرتبط بتسمية. @ar
definition: 将一个命名与和一个命名有关的一个行为者关联起来。 @zh-hans

has related place of nomen
lexical alias: relatedPlaceOfNomen.en
status: Published
type: Property
label: har relateret sted for nomen @da
label: hat mit Nomen in Beziehung stehendes Geografikum @de
label: heeft gerelateerde plaats van nomen @nl
label: ismin ilgili yeri ile ilişkilidir @tr
label: nomen kapcsolódó helye a következő: @hu
label: nomeniin liittyvä paikka @fi
label: له مكان مرتبط بتسمية @ar
label: 有命名的关联地点 @zh-hans
sub property of: has related entity of nomen
inverse of: has related nomen of place
definition: Bir ismi, isimle bağlantılı olan bir yerle ilişkilendirir. @tr
definition: Hozzákapcsol egy noment egy helyhez, amelyet egy nomenhez társítanak. @hu
definition: Liittää nomenin paikkaan, joka liittyy nomeniin. @fi
definition: Relaterer et nomen til et sted der er knyttet til et nomen. @da
definition: Relates a nomen to a place that is associated with a nomen.
definition: Setzt ein Nomen in Beziehung zu einem Geografikum, das mit einem Nomen in Verbindung steht. @de
definition: يربط بين تسمية ومكان مرتبط بتسمية. @ar
definition: 将一个地点与和一个命名有关的一个地点关联起来。 @zh-hans

has related timespan of nomen
lexical alias: relatedTimespanOfNomen.en
status: Published
type: Property
label: har relateret tidsforløb for nomen @da
label: hat mit Nomen in Beziehung stehenden Zeitraum @de
label: heeft gerelateerde tijdspanne van nomen @nl
label: ismin ilgili zaman aralığı ile ilişkilidir @tr
label: nomen kapcsolódó időtartama a következő: @hu
label: nomeniin liittyvä ajanjakso @fi
label: له فترة زمنية مرتبطة بتسمية @ar
label: 有命名的关联时间段 @zh-hans
sub property of: has related entity of nomen
inverse of: has related nomen of timespan
definition: Bir ismi, isimle bağlantılı olan bir zaman aralığıyla ilişkilendirir. @tr
definition: Hozzákapcsol egy noment egy időtartamhoz, amelyet egy nomenhez társítanak. @hu
definition: Liittää nomenin ajanjaksoon, joka liittyy nomeniin. @fi
definition: Relaterer et nomen til et tidsforløb, der er knyttet til et nomen. @da
definition: Relates a nomen to a timespan that is associated with a nomen.
definition: Setzt ein Nomen in Beziehung zu einem Zeitraum, der mit einem Nomen in Verbindung steht. @de
definition: ييربط تسمية بفترة زمنية مرتبطة بتسمية @ar
definition: 将一个命名与和一个命名有关的一个时间段关联起来。 @zh-hans

has related resource of nomen
has subproperty: is key title of
has subproperty: is name of agent of resource of
has subproperty: is numbering within sequence of
has subproperty: is first alphanumeric designation of sequence of
has subproperty: is first chronological designation of sequence of
has subproperty: is last alphanumeric designation of sequence of
has subproperty: is last chronological designation of sequence of
lexical alias: relatedResourceOfNomen.en
status: Published
type: Property
label: har relateret ressource for nomen @da
label: hat mit Nomen in Beziehung stehende Ressource @de
label: heeft gerelateerde resource van nomen @nl
label: ismin ilgili kaynağı ile ilişkilidir @tr
label: nomen kapcsolódó forrása a következő: @hu
label: nomeniin liittyvä aineisto @fi
label: له مصدر مرتبط بتسمية @ar
label: 有命名的关联资源 @zh-hans
sub property of: has related entity of nomen
inverse of: has related nomen of resource
definition: Bir ismi, isimle bağlantılı olan bir kaynakla ilişkilendirir. @tr
definition: Hozzákapcsol egy noment egy forráshoz, amelyet egy nomenhez társítanak. @hu
definition: Liittää nomenin aineistoon, joka liittyy nomeniin. @fi
definition: Relaciona un nomen amb un recurs que s’associa amb un nomen. @ca
definition: Relaterer et nomen til en ressource, der er knyttet til et nomen. @da
definition: Relates a nomen to a resource that is associated with a nomen.
definition: Setzt ein Nomen in Beziehung zu einer Ressource, die mit einem Nomen in Verbindung steht. @de
definition: يربط تسمية بمصدر مرتبط بتسمية. @ar
definition: 将一个命名与和一个命名有关的一种资源关联起来。 @zh-hans

has modifier
lexical alias: modifier.en
status: Published
type: Property
label: aineiston muokkaaja @fi
label: düzenleyici ile ilişkilidir @tr
label: har tilpasser @da
label: hat Bearbeiterin/Bearbeiter @de
label: heeft aanpasser @nl
label: módosítója a következő: @hu
label: له مُعدل @ar
label: 有修改者 @zh-hans
sub property of: has related agent of resource
inverse of: is modifier of
definition: Bir kaynağı, yeni bir kaynak oluşturmadan kaynakta düzenleme yapan bir temsilci ile ilişkilendirir. @tr
definition: Hozzákapcsol egy forrást egy ágenshez, amely új forrás létrehozása nélkül idéz elő változást. @hu
definition: Liittää aineiston toimijaan, joka tekee muutoksia aineistoon luomatta uutta aineistoa. @fi
definition: Relaterer en ressource til en agent, der laver ændringer til en ressource, uden at skabe en ny ressource. @da
definition: Relates a resource to an agent who makes changes to a resource without creating a new resource.
definition: Setzt eine Ressource in Beziehung zu einem Akteur, der Änderungen an einer Ressource vornimmt, ohne eine neue Ressource zu erstellen. @de
definition: يربط مصدر بوكيل يقوم بإجراء تغييرات على مصدر دون إنشاء مصدر جديد. @ar
definition: 将一种资源与对一种资源作修改而不创建一种新资源的一个行为者关联起来。 @zh-hans

is modifier of
lexical alias: modifierOf.en
status: Published
type: Property
label: aineiston muokkaaja (toimija) @fi
label: düzenleyicisidir @tr
label: er tilpasser af @da
label: is aanpasser van @nl
label: ist Bearbeiterin/Bearbeiter von @de
label: módosítója a következőnek: @hu
label: هو مُعدل لـ @ar
label: 是……的修改者 @zh-hans
sub property of: has related resource of agent
inverse of: has modifier
definition: Bir temsilciyi, yeni bir kaynak oluşturmadan bir temsilci tarafından değiştirilen bir kaynakla ilişkilendirir. @tr
definition: Hozzákapcsol egy ágenst egy forráshoz, amelyet az ágens új forrás létrehozása nélkül változtat meg. @hu
definition: Liittää toimijan aineistoon, johon toimija tekee muutoksia luomatta uutta aineistoa. @fi
definition: Relaterer en agent til en ressource, der der blevet ændret af en agent, uden at skabe en ny ressource. @da
definition: Relates an agent to a resource that is changed by an agent without creating a new resource.
definition: Setzt einen Akteur in Beziehung zu einer Ressource, die von einem Akteur verändert wird, ohne eine neue Ressource zu erstellen. @de
definition: يربط بين وكيل ومصدر قام وكيل بإجراء تغييرات به دون إنشاء مصدر جديد. @ar
definition: 将一个行为者与被一个行为者改变而不创建一种新资源的一种资源关联起来。 @zh-hans

has related entity of agent
has subproperty: has related agent of agent
has subproperty: has related nomen of agent
lexical alias: relatedEntityOfAgent.en
status: Published
type: Property
label: har relateret entitet for agent @da
label: hat mit Akteur in Beziehung stehende Entität @de
label: heeft gerelateerde entiteit van actor @nl
label: temsilcinin ilgili varlığı ile ilişkilidir @tr
label: toimijaan liittyvä entiteetti @fi
label: ágens kapcsolódó entitása a következő: @hu
label: له كيان مرتبط بوكيل @ar
label: 有行为者的关联实体 @zh-hans
sub property of: has related entity of entity
inverse of: has related agent of entity
definition: Bir temsilciyi, temsilciyle bağlantılı olan bir varlıkla ilişkilendirir. @tr
definition: Hozzákapcsol egy ágenst egy entitáshoz, amelyet egy ágenshez társítanak. @hu
definition: Liittää toimijan entiteettiin, joka liittyy toimijaan. @fi
definition: Relaterer en agent til en entitet, der er knyttet til en agent. @da
definition: Relates an agent to an entity that is associated with an agent.
definition: Setzt einen Akteur in Beziehung zu einer Entität, die mit einem Akteur in Verbindung steht. @de
definition: يربط بين وكيل وكيان مرتبط بوكيل. @ar
definition: 将一个行为者与和一个行为者有关的一个实体关联起来。 @zh-hans

has related entity of resource
has subproperty: aineistoon liittyvä aineisto
has subproperty: has related agent of resource
has subproperty: has related place of resource
has subproperty: has related timespan of resource
has subproperty: has related nomen of resource
lexical alias: relatedEntityOfResource.en
status: Published
type: Property
label: aineistoon liittyvä entiteetti @fi
label: forrás kapcsolódó entitása a következő: @hu
label: har relateret entiet for ressource @da
label: hat mit Ressource in Beziehung stehende Entität @de
label: heeft gerelateerde entiteit van resource @nl
label: kaynağın ilgili varlığı ile ilişkilidir @tr
label: له كيان مرتبط بمصدر @ar
label: 有资源的关联实体 @zh-hans
sub property of: has related entity of entity
inverse of: has related resource of entity
definition: Bir kaynağı, bir kaynakla bağlantılı olan bir varlıkla ilişkilendirir. @tr
definition: Hozzákapcsol egy forrást egy entitáshoz, amelyet egy forráshoz társítanak. @hu
definition: Liittää aineiston entiteettiin, joka liittyy aineistoon. @fi
definition: Relaterer en ressource til en entitet, der er knyttet til en ressource. @da
definition: Relates a resource to an entity that is associated with a resource.
definition: Setzt eine Ressource in Beziehung zu einer Entität, die mit einer Ressource in Verbindung steht. @de
definition: يربط بين مصدر وكيان مرتبط بمصدر. @ar
definition: 将一种资源与和一种资源有关的一个实体关联起来。 @zh-hans

has related entity of timespan
has subproperty: has related agent of timespan
has subproperty: has related resource of timespan
has subproperty: has related place of timespan
has subproperty: has related timespan of timespan
has subproperty: has related nomen of timespan
lexical alias: relatedEntityOfTimespan.en
status: Published
type: Property
label: ajanjaksoon liittyvä entiteetti @fi
label: har relateret entitet for tidsforløb @da
label: hat mit Zeitraum in Beziehung stehende Entität @de
label: heeft gerelateerde entiteit van tijdspanne @nl
label: időtartam kapcsolódó entitása a következő: @hu
label: zaman aralığının ilgili varlığı ile ilişkilidir @tr
label: له كيان مرتبط بفترة زمنية @ar
label: 有时间段的关联实体 @zh-hans
sub property of: has related entity of entity
inverse of: has related timespan of entity
definition: Bir zaman aralığını, bir zaman aralığıyla bağlantılı olan bir varlıkla ilişkilendirir. @tr
definition: Hozzákapcsol egy időtartamot egy entitáshoz, amelyet egy időtartamhoz társítanak. @hu
definition: Liittää ajanjakson entiteettiin, joka liittyy ajanjaksoon. @fi
definition: Relaterer et tidsforløb til en entitet, der er knyttet til et tidsforløb. @da
definition: Relates a timespan to an entity that is associated with a timespan.
definition: Setzt einen Zeitraum in Beziehung zu einer Entität, die mit einem Zeitraum in Verbindung steht. @de
definition: يربط بين فترة زمنية وكيان مرتبط بفترة زمنية @ar
definition: 将一个时间段与和一个时间段有关的一个实体关联起来。 @zh-hans

has related entity of place
has subproperty: has related agent of place
has subproperty: has related resource of place
has subproperty: has related place of place
has subproperty: has related timespan of place
has subproperty: has related nomen of place
lexical alias: relatedEntityOfPlace.en
status: Published
type: Property
label: har relateret entitet for sted @da
label: hat mit Geografikum in Beziehung stehende Entität @de
label: heeft gerelateerde entiteit van plaats @nl
label: hely kapcsolódó entitása a következő: @hu
label: paikkaan liittyvä entiteetti @fi
label: yerin ilgili varlığı ile ilişkilidir @tr
label: له كيان متعلق بمكان @ar
label: 有地点的关联实体 @zh-hans
sub property of: has related entity of entity
inverse of: has related place of entity
definition: Bir yeri, yerle bağlantılı olan bir varlıkla ilişkilendirir. @tr
definition: Hozzákapcsol egy helyet egy entitáshoz, amelyet egy helyhez társítanak. @hu
definition: Liittää paikan entiteettiin, joka liittyy paikkaan. @fi
definition: Relaterer et sted til en entitet, der er knyttet til et sted. @da
definition: Relates a place to an entity that is associated with a place.
definition: Setzt ein Geografikum in Beziehung zu einer Entität, die mit einem Geografikum in Verbindung steht. @de
definition: يربط بين مكان وكيان مرتبط بمكان. @ar
definition: 将一个地点与和一个地点有关的一个实体关联起来。 @zh-hans

has related entity of nomen
has subproperty: has related nomen of nomen
has subproperty: has related agent of nomen
has subproperty: has related place of nomen
has subproperty: has related timespan of nomen
has subproperty: has related resource of nomen
lexical alias: relatedEntityOfNomen.en
status: Published
type: Property
label: har relateret entitet for nomen @da
label: hat mit Nomen in Beziehung stehende Entität @de
label: heeft gerelateerde entiteit van nomen @nl
label: ismin ilgili varlığı ile ilişkilidir @tr
label: nomen kapcsolódó entitása a következő: @hu
label: nomeniin liittyvä entiteetti @fi
label: له كيان متعلق بتسمية @ar
label: 有命名的关联实体 @zh-hans
sub property of: has related entity of entity
inverse of: has related nomen of entity
definition: Bir ismi, isimle bağlantılı olan bir varlıkla ilişkilendirir. @tr
definition: Hozzákapcsol egy noment egy entitáshoz, amelyet egy nomenhez társítanak. @hu
definition: Liittää nomenin entiteettiin, joka liittyy nomeniin. @fi
definition: Relaterer et nomen til en entitet, der er knyttet til et nomen. @da
definition: Relates a nomen to an entity that is associated with a nomen.
definition: Setzt ein Nomen in Beziehung zu einer Entität, die mit einem Nomen in Verbindung steht. @de
definition: يربط بين تسمية وكيان مرتبط بتسمية @ar
definition: 将一个命名与和一个命名有关的一个实体关联起来。 @zh-hans

has related entity of entity
has subproperty: has related resource of agent
has subproperty: has related place of agent
has subproperty: has related timespan of agent
has subproperty: has related entity of agent
has subproperty: has related entity of resource
has subproperty: has related entity of timespan
has subproperty: has related entity of place
has subproperty: has related entity of nomen
has subproperty: has related agent of entity
has subproperty: has related place of entity
has subproperty: has related timespan of entity
has subproperty: has related resource of entity
has subproperty: has related nomen of entity
lexical alias: relatedEntityOfEntity.en
status: Published
type: Property
label: entiteettiin liittyvä entiteetti @fi
label: entitás kapcsolódó entitása a következő: @hu
label: har relateret entitet for entitet @da
label: hat mit Entität in Beziehung stehende Entität @de
label: heeft gerelateerde entiteit van entiteit @nl
label: varlığın ilgili varlığı ile ilişkilidir @tr
label: له كيان مرتبط بكيان @ar
label: 有实体的关联实体 @zh-hans
definition: Bir varlığı, varlıkla bağlantılı olan bir varlıkla ilişkilendirir. @tr
definition: Hozzákapcsol egy entitást egy entitáshoz, amelyet egy entitáshoz társítanak. @hu
definition: Liittää entiteetin entiteettiin, joka liittyy entiteettiin. @fi
definition: Relaterer en entitet til en entiet, der er knyttet til en entitet. @da
definition: Relates an entity to an entity that is associated with an entity.
definition: Setzt eine Entität in Beziehung zu einer Entität, die mit eine Entität in Verbindung steht. @de
definition: يربط بين كيان وكيان مرتبط بكيان. @ar
definition: 将一个实体与和一个实体有关的一个实体关联起来。 @zh-hans

has related agent of entity
lexical alias: relatedAgentOfEntity.en
status: Published
type: Property
label: entiteettiin liittyvä toimija @fi
label: entitás kapcsolódó ágense a következő: @hu
label: har relateret agent for entitet @da
label: hat mit Entität in Beziehung stehenden Akteur @de
label: heeft gerelateerde actor van entiteit @nl
label: varlığın ilgili temsilcisi ile ilişkilidir @tr
label: له وكيل مرتبط بكيان @ar
label: 有实体的关联行为者 @zh-hans
sub property of: has related entity of entity
inverse of: has related entity of agent
definition: Bir varlığı, varlıkla bağlantılı olan bir temsilciyle ilişkilendirir. @tr
definition: Hozzákapcsol egy entitást egy ágenshez, amelyet egy entitáshoz társítanak. @hu
definition: Liittää entiteetin toimijaan, joka liittyy entiteettiin. @fi
definition: Relaterer en entitet til en agent, der er knyttet til en entiet. @da
definition: Relates an entity to an agent who is associated with an entity.
definition: Setzt eine Entität in Beziehung zu einem Akteur, der mit einer Entität in Verbindung steht. @de
definition: يربط بين كيان ووكيل مرتبط بكيان. @ar
definition: 将一个实体与和一个实体有关的一个行为者关联起来。 @zh-hans

has related place of entity
lexical alias: relatedPlaceOfEntity.en
status: Published
type: Property
label: entiteettiin liittyvä paikka @fi
label: entitás kapcsolódó helye a következő: @hu
label: har relateret sted for entitet @da
label: hat mit Entität in Beziehung stehendes Geografikum @de
label: heeft gerelateerde plaats van entiteit @nl
label: varlığın ilgili yeri ile ilişkilidir @tr
label: له مكان مرتبط بكيان @ar
label: 有实体的关联地点 @zh-hans
sub property of: has related entity of entity
inverse of: has related entity of place
definition: Bir varlığı, varlıkla bağlantılı olan bir yerle ilişkilendirir. @tr
definition: Hozzákapcsol egy entitást egy helyhez, amelyet egy entitáshoz társítanak. @hu
definition: Liittää entiteetin paikkaan, joka liittyy entiteettiin. @fi
definition: Relaterer en entiet til et sted, der er knyttet til en entitet. @da
definition: Relates an entity to a place that is associated with an entity.
definition: Setzt eine Entität in Beziehung zu einem Geografikum, das mit einer Entität in Verbindung steht. @de
definition: يربط بين كيان ومكان مرتبط بكيان. @ar
definition: 将一个实体与和一个实体有关的一个地点关联起来。 @zh-hans

has related timespan of entity
lexical alias: relatedTimespanOfEntity.en
status: Published
type: Property
label: entiteettiin liittyvä ajanjakso @fi
label: entitás kapcsolódó időtartama a következő: @hu
label: har relateret tidsforløb for entitet @da
label: hat mit Entität in Beziehung stehenden Zeitraum @de
label: heeft gerelateerde tijdspanne van entiteit @nl
label: varlığın ilgili zaman aralığı ile ilişkilidir @tr
label: له فترة زمنية مرتبطة بكيان @ar
label: 有实体的关联时间段 @zh-hans
sub property of: has related entity of entity
inverse of: has related entity of timespan
definition: Bir varlığı, varlıkla bağlantılı olan bir zaman aralığıyla ilişkilendirir. @tr
definition: Hozzákapcsol egy entitást egy időtartamhoz, amelyet egy entitáshoz társítanak. @hu
definition: Liittää entiteetin ajanjaksoon, joka liittyy entiteettiin. @fi
definition: Relaterer en entitet til et tidsforløb, der er knyttet til en entitet. @da
definition: Relates an entity to a timespan that is associated with an entity.
definition: Setzt eine Entität in Beziehung zu einem Zeitraum, der mit einer Entität in Verbindung steht. @de
definition: يربط بين كيان وفترة زمنية مرتبطة بكيان. @ar
definition: 将一个实体与和一个实体有关的一个时间段关联起来。 @zh-hans

has related resource of entity
lexical alias: relatedResourceOfEntity.en
status: Published
type: Property
label: entiteettiin liittyvä aineisto @fi
label: entitás kapcsolódó forrása a következő: @hu
label: har relateret ressource for entitet @da
label: hat mit Entität in Beziehung stehende Ressource @de
label: heeft gerelateerde resource van entiteit @nl
label: varlığın ilgili kaynağı ile ilişkilidir @tr
label: له مصدر مرتبط بكيان @ar
label: 有实体的关联资源 @zh-hans
sub property of: has related entity of entity
inverse of: has related entity of resource
definition: Bir varlığı, varlıkla bağlantılı olan bir kaynakla ilişkilendirir. @tr
definition: Hozzákapcsol egy entitást egy forráshoz, amelyet egy entitáshoz társítanak. @hu
definition: Liittää entiteetin aineistoon, joka liittyy entiteettiin. @fi
definition: Relaterer en entitet til en ressource, der er knyttet til en entitet. @da
definition: Relates an entity to a resource that is associated with an entity.
definition: Setzt eine Entität in Beziehung zu einer Ressource, die mit einer Entität in Verbindung steht. @de
definition: يربط بين كيان ومصدر مرتبط بكيان. @ar
definition: 将一个身体与和一个实体有关的一种资源关联起来。 @zh-hans

has related nomen of entity
lexical alias: relatedNomenOfEntity.en
status: Published
type: Property
label: entiteettiin liittyvä nomen @fi
label: entitás kapcsolódó nomene a következő: @hu
label: har relateret nomen for entitet @da
label: hat mit Entität in Beziehung stehendes Nomen @de
label: heeft gerelateerde nomen van entiteit @nl
label: varlığın ilgili ismi ile ilişkilidir @tr
label: له تسمية مرتبطة بكيان @ar
label: 有实体的关联命名 @zh-hans
sub property of: has related entity of entity
inverse of: has related entity of nomen
definition: Bir varlığı, varlıkla bağlantılı olan bir isimle ilişkilendirir. @tr
definition: Hozzákapcsol egy entitást egy nomenhez, amelyet egy entitáshoz társítanak. @hu
definition: Liittää entiteetin nomeniin, joka liittyy entiteettiin. @fi
definition: Relaterer en entiet til et nomen, som er knyttet til en entitet. @da
definition: Relates an entity to a nomen that is associated with an entity.
definition: Setzt eine Entität in Beziehung zu einem Nomen, das mit einer Entität in Verbindung steht. @de
definition: يربط بين كيان وتسمية مرتبطة بكيان. @ar
definition: 将一个实体与和一个实体有关的一个命名关联起来。 @zh-hans

has medium of performance of choreographic content
lexical alias: mediumOfPerformanceOfChoreographicContent.en
status: Published
type: Property
label: aineiston koreografisen sisällön esityskokoonpano @fi
label: har besætning for koreografisk indehold @da
label: hat Besetzung für choreografischen Inhalt @de
label: heeft uitvoeringsmedium van choreografische content @nl
label: koreografik içeriğin performans ortamı ile ilişkilidir @tr
label: koreográfiai tartalom előadásmédiuma a következő: @hu
label: له وسيط أداء محتوى الرقصات @ar
label: 有编舞内容的表演媒介 @zh-hans
definition: Bir kaynağı, koreografik veya müzikal olmayan dramatik içerikli bir performansa katılan veya katılması amaçlanan bir sanatçı türü veya sanatçı grubuyla ilişkilendirir. @tr
definition: Hozzákapcsol egy forrást egy koreográfiai vagy nem zenei drámai tartalom előadásában részt vevő vagy részt venni szándékozó előadói típushoz vagy előadói csoporthoz. @hu
definition: Koreografiseen tai ei-musiikilliseen draamasisältöön osallistuvan tai osallistuvaksi tarkoitetun esittäjän tai esittäjien ryhmän tyyppi. @fi
definition: Relaterer en ressource til en type af performer eller gruppe af performere, der deltager, eller havde til hensigt at deltage, i en performance med koreografisk eller ikke-musikalsk indhold. @da
definition: Relates a resource to a type of performer or group of performers participating, or intended to participate, in a performance of choreographic or non-musical dramatic content.
definition: Setzt eine Ressource in Beziehung zu einer Kategorisierung der Ausführenden/des Ausführenden oder einer Gruppe von Ausführenden, die an einer Darbietung eines choreografischen oder nicht musikalischen, dramatischen Inhalts teilnehmen oder teilnehmen sollen. @de
definition: يربط بين مصدر ونوع من فناني الأداء أو مجموعة من المؤدين يشاركون، أو يعتزمون المشاركة، في أداء محتوى درامي راقص أو محتوى درامي غير موسيقي. @ar
definition: 将一种资源与在编舞或非音乐戏剧内容的一种表演中参与或计划参与的表演者或表演者群体的类型关联起来。 @zh-hans

is lyrics for
lexical alias: lyricsFor.en
status: Published
type: Property
label: dalszöveg a következőhöz: @hu
label: er sangekster for @da
label: is liedteksten voor @nl
label: ist Lyrics für @de
label: sanoitettu aineisto @fi
label: sözleridir @tr
label: هي كلمات أغنية لـ @ar
label: 是……的歌词 @zh-hans
sub property of: is text for resource
definition: Bir kaynağı, metinsel bir kaynakla tamamlanan bir müzik kaynağıyla ilişkilendirir. @tr
definition: Hozzákapcsol egy forrást egy zenei forráshoz, amelyet egy szöveges forrás egészít ki. @hu
definition: Relaterer en ressource til en musikressource, der er suppleret med en tekstressource. @da
definition: Relates a resource to a musical resource that is complemented by a textual resource.
definition: Setzt eine Ressource in Beziehung zu einer Musikressource, die durch eine textliche Ressource vervollständigt wird. @de
definition: liittää aineiston musiikkiaineistoon, jota on täydennetty tekstiaineistolla. @fi
definition: يربط بين مصدر ومصدر موسيقي يكمله مصدر نصي. @ar
definition: 将一种资源与被一种文字资源补充的一种音乐资源关联起来。 @zh-hans

has lyrics
lexical alias: lyrics.en
status: Published
type: Property
label: aineiston sanoitus @fi
label: dalszövege a következő: @hu
label: har sangtekster @da
label: hat Lyrics @de
label: heeft liedteksten @nl
label: sözler ile ilişkilidir @tr
label: له كلمات أغنية @ar
label: 有歌词 @zh-hans
sub property of: has text resource
inverse of: is lyrics for
definition: Bir kaynağı, bir müzik kaynağını tamamlayan metinsel kaynak olan bir kaynakla ilişkilendirir. @tr
definition: Hozzákapcsol egy forrást egy szöveges forráshoz, amelyet egy zenei forrás egészít ki. @hu
definition: Relaterer en ressource til en ressource, der er en tekstressource, der er suppleret med en tekstressource. @da
definition: Relates a resource to a resource that is a textual resource that complements a musical resource.
definition: Setzt eine Ressource in Beziehung zu einer textlichen Ressource, die ein Musikwerk ergänzt. @de
definition: liittää aineiston aineistoon, joka on musiikkiaineistoa täydentävä tekstiaineisto. @fi
definition: يربط بين مصدر ومصدر عبارة عن مصدر نصي يكمل مصدر موسيقي. @ar
definition: 将一种资源与作为一种文字资源并补充一种音乐资源的一种资源关联起来。 @zh-hans

has text resource
has subproperty: has lyrics
lexical alias: textResource.en
status: Published
type: Property
label: har tekstressource @da
label: heeft tekst-resource @nl
label: ist Textressource @de
label: metin kaynağı ile ilişkilidir @tr
label: szöveges forrása a következő: @hu
label: tekstiaineisto @fi
label: له مصدر نصي @ar
label: 有文本资源 @zh-hans
sub property of: is complemented by
definition: Bir kaynağı, bir kaynağı tamamlayan metinsel kaynak olan bir kaynakla ilişkilendirir. @tr
definition: Hozzákapcsol egy forrást egy szöveges forráshoz, amelyet egy forrás egészít ki. @hu
definition: Relaciona un recurs amb un recurs que és un recurs textual que complementa un recurs. @ca
definition: Relaterer en ressource til en ressource, der er en tekstressource, der supplerer en ressource. @da
definition: Relates a resource to a resource that is a textual resource that complements a resource.
definition: Setzt eine Ressource in Beziehung zu einer textlichen Ressource, das eine Ressource ergänzt. @de
definition: liittää aineiston aineistoon, joka on toista aineistoa täydentävä tekstiaineisto. @fi
definition: يربط بين مصدر ومصدر عبارة عن مصدر نصي يكمل مصدر. @ar
definition: 将一种资源与作为一种文字资源并补充一种资源的一种资源关联起来。 @zh-hans

is text for resource
has subproperty: is lyrics for
lexical alias: textForResource.en
status: Published
type: Property
label: er tekstressource @da
label: is tekst voor resource @nl
label: ist Text für Ressource @de
label: kaynak için metindir @tr
label: szöveg a következő forráshoz: @hu
label: tekstiaineisto @fi
label: هو نص لمصدر @ar
label: 是资源的文本 @zh-hans
sub property of: is complemented by
inverse of: has text resource
definition: Bir kaynağı, metinsel bir kaynak olan bir kaynak tarafından tamamlanan bir kaynakla ilişkilendirir. @tr
definition: Hozzákapcsol egy forrást egy forráshoz, amelyet egy szöveges forrás egészít ki. @hu
definition: Relaterer en ressource til en ressource, der er suppleret med en ressource, der er en tekstressource. @da
definition: Relates a resource to a resource that is complemented by a resource that is a textual resource.
definition: Setzt eine Ressource in Beziehung zu einer Ressource, die durch eine textliche Ressource vervollständigt wird. @de
definition: liittää aineiston aineistoon, jota on täydennetty tekstiaineistolla. @fi
definition: يربط بين مصدر ومصدر الذي يكمله مصدر عبارة عن مصدر نصي. @ar
definition: 将一种资源与被一种资源补充并是一种文字资源的一种资源关联起来。 @zh-hans

has spoken word resource
lexical alias: spokenWordResource.en
status: Published
type: Property
label: beszédben kifejezett forrása a következő: @hu
label: har ressource, der er talet ord @da
label: hat gesprochenes Wort (Ressource) @de
label: heeft gesproken woord-resource @nl
label: puheaineisto @fi
label: sözlü kaynak ile ilişkilidir @tr
label: له مصدر كلمات منطوفة @ar
label: 有口语资源 @zh-hans
sub property of: is complemented by
definition: Bir kaynağı, bir kaynağı tamamlayan vokal kaynak olan bir kaynakla ilişkilendirir. @tr
definition: Hozzákapcsol egy forrást egy élőszavas forráshoz, amelyet egy forrás egészít ki. @hu
definition: Liittää aineiston puheääniaineistoon, joka täydentää toista aineistoa. @fi
definition: Relaterer en ressource til en ressource, der er en vokal ressourde og som supplerer en ressource. @da
definition: Relates a resource to a resource that is a vocal resource and that complements a resource.
definition: Setzt eine Ressource in Beziehung zu einer gesprochenen Ressource, die eine Ressource ergänzt. @de
definition: يربط بين مصدر ومصدر عبارة عن مصدر منطوق ويكمل مصدرًا. @ar
definition: 将一种资源与作为一种人声资源并补充一种资源的一种资源关联起来。 @zh-hans

has sounds
lexical alias: sounds.en
status: Published
type: Property
label: hangjai a következők: @hu
label: har lyd @da
label: hat Töne @de
label: heeft geluiden @nl
label: sesler ile ilişkilidir @tr
label: ääniaineisto @fi
label: له أصوات @ar
label: 有声音 @zh-hans
sub property of: is complemented by
definition: Bir kaynağı, ses olarak gerçekleştirilen ve bir kaynağı tamamlayan bir kaynakla ilişkilendirir. @tr
definition: Hozzákapcsol egy forrást egy forráshoz, amely a forrást kiegészítő hangban fejeződik ki. @hu
definition: Liittää aineiston toista aineistoa täydentävään aineistoon, joka on toteutettu äänenä. @fi
definition: Relaterer en ressource til en ressource, der er realiseret som lyd og som supplerer en ressource. @da
definition: Relates a resource to a resource that is realized as sound and that complements a resource.
definition: Setzt eine Ressource in Beziehung zu einer Ressource aus Tönen, die eine Ressource ergänzt. @de
definition: يربط بين مصدر ومصدر يتم تحقيقه على أنه صوت ويكمل مصدر. @ar
definition: 将一种资源与被实现为声音并补充一种资源的一种资源关联起来。 @zh-hans

is spoken word for resource
lexical alias: spokenWordForResource.en
status: Published
type: Property
label: beszéd a következő forráshoz: @hu
label: er talet lyd for ressource @da
label: is gesproken woord voor resource @nl
label: ist gesprochenes Wort für (Ressource) @de
label: kaynak için sözlü eserdir @tr
label: puheaineisto @fi
label: هي كلمة منطوقة لمصدر @ar
label: 是资源的口语 @zh-hans
sub property of: is complemented by
inverse of: has spoken word resource
definition: Bir kaynağı, sesli bir kaynakla tamamlanan bir kaynakla ilişkilendirir. @tr
definition: Hozzákapcsol egy forrást egy forráshoz, amelyet egy élőszavas forrás egészít ki. @hu
definition: Liittää aineiston puheaineistolla täydennettyyn aineistoon. @fi
definition: Relaterer en ressource til en ressource, der er suppleret med en vokal ressource. @da
definition: Relates a resource to a resource that is complemented by a vocal resource.
definition: Setzt eine Ressource in Beziehung zu einer Ressource, die durch eine gesprochene Ressource vervollständigt wird. @de
definition: يربط بين مصدر ومصدر يكمله مصدر منطوق. @ar
definition: 将一种资源与被一种人声资源补充的一种资源关联起来。 @zh-hans

is sounds for
lexical alias: soundsFor.en
status: Published
type: Property
label: er lyde for @da
label: hangok a következőhöz: @hu
label: is geluiden voor @nl
label: için seslerdir @tr
label: sind Töne für @de
label: ääniaineisto @fi
label: هي أصوات لـ @ar
label: 是……的声音 @zh-hans
sub property of: is complemented by
inverse of: has sounds
definition: Bir kaynağı, ses olarak gerçekleştirilen bir kaynak tarafından tamamlanan bir kaynakla ilişkilendirir. @tr
definition: Hozzákapcsol egy forrást egy forráshoz, amelyet egy hangként kifejezett forrás egészít ki. @hu
definition: Liittää aineiston äänenä toteutetulla aineistolla täydennettyyn aineistoon. @fi
definition: Relaterer en ressource til en ressource, der er suppleret med en ressource, som er realiseret som lyd. @da
definition: Relates a resource to a resource that is complemented by a resource that is realized as sound.
definition: Setzt eine Ressource in Beziehung zu einer Ressource, die durch eine Ressource aus Tönen vervollständigt wird. @de
definition: يربط بين مصدر ومصدر يُكمله مصدر يتم تحقيقه على أنه صوت. @ar
definition: 将一种资源与被一种资源补充并被实现为声音的一种资源关联起来。 @zh-hans

has transformation by extension plan
has subproperty: has sequential version
has subproperty: has serialized version
has subproperty: has static version
lexical alias: transformationByExtensionPlan.en
status: Published
type: Property
label: genişletme planına göre dönüşüm ile ilişkilidir @tr
label: har omdannelse ved udvidelsesplan @da
label: hat Transformation hinsichtlich des Erweiterungsplans @de
label: heeft transformatie door extensieplan @nl
label: közlési terv változása miatti átalakítása a következő: @hu
label: laajennussuunnitelmalla muutettu aineisto @fi
label: له تحول وفق خطة توسع @ar
label: 有通过扩充计划的转换 @zh-hans
sub property of: has transformation by policy
definition: Bir kaynağı, kaynağın genişletme planını değiştirerek oluşturulan bir kaynakla ilişkilendirir. @tr
definition: Hozzákapcsol egy forrást egy forráshoz, amely egy forrás közlési tervének megváltozása következtében jött létre. @hu
definition: Liittää aineiston aineistoon, joka on luotu muuttamalla aineiston laajennussuunnitelmaa. @fi
definition: Relaterer en ressource til en ressource der er skabt ved at ændre udvidelsesplanen for en ressource. @da
definition: Relates a resource to a resource that is created by changing the extension plan of a resource.
definition: Setzt eine Ressource in Beziehung zu einer Ressource, die aufgrund einer Änderung des Erweiterungsplans einer Ressource erstellt wird. @de
definition: يربط بين مصدر ومصدر تم إنشاؤه عن طريق تغيير خطة توسع لمصدر. @ar
definition: 将一种资源与通过改变一种资源的扩充计划而创建的一种资源关联起来。 @zh-hans

is transformation by extension plan of
has subproperty: is sequential version of
has subproperty: is serialized version of
has subproperty: is static version of
lexical alias: transformationByExtensionPlanOf.en
status: Published
type: Property
label: a közlési terv változása miatti átalakítása a következőnek: @hu
label: er omdannelse ved udvidelsesplan for @da
label: genişletme planının değişimidir @tr
label: is transformatie door extensieplan van @nl
label: ist Transformation hinsichtlich des Erweiterungsplans von @de
label: laajennussuunnitelman muutos aineistossa @fi
label: هو تحول وفق خطة توسع @ar
label: 是通过……的扩充计划的转换 @zh-hans
sub property of: is transformation by policy of
inverse of: has transformation by extension plan
definition: Bir kaynağı, bir kaynak oluşturmak için değiştirilen bir genişletme planına sahip bir kaynakla ilişkilendirir. @tr
definition: Hozzákapcsol egy forrást egy forráshoz, amelynek a közlési terve megváltozott egy forrás létrejövetele érdekében. @hu
definition: Liittää aineiston aineistoon, jolla on aineiston luomista varten muutettu laajennussuunnitelma. @fi
definition: Relaterer en ressource til en ressource, der har en udvidelsesplan, som ændres for at skabe en ressourece. @da
definition: Relates a resource to a resource that has an extension plan that is changed to create a resource.
definition: Setzt eine Ressource in Beziehung zu einer Ressource, deren Erweiterungsplan geändert wird, um eine Ressource zu erstellen. @de
definition: يربط بين مصدر ومصدر يحتوي على خطة توسع تم تغييرها لإنشاء مصدر. @ar
definition: 将一种资源与有一种扩充计划并被改变以创建一种资源的一种资源关联起来。 @zh-hans

has sequential version
lexical alias: sequentialVersion.en
status: Published
type: Property
label: har sekventiel version @da
label: hat fortlaufende Version @de
label: heeft sequentiële versie @nl
label: peräkkäinen versio (aineisto) @fi
label: sonraki sürüm ile ilişkilidir @tr
label: szekvenciális változata a következő: @hu
label: له إصدارة متتالية @ar
label: 有序列版本 @zh-hans
sub property of: has transformation by extension plan
definition: Bir kaynağı, bir kaynağın genişletme planını birleşimden ardışığa değiştirerek oluşturulan bir kaynakla ilişkilendirir. @tr
definition: Hozzákapcsol egy forrást egy forráshoz, amely egy forrás közlési tervének integrálóról folyamatossá való változásával jött létre. @hu
definition: Liittää aineiston aineistoon, joka on luotu vaihtamalla laajennussuunnitelma päivittyvästä peräkkäisesti ilmestyväksi. @fi
definition: Relaterer en ressource til en ressource, der er skabt ved at ændre udvidelsesplanen for en ressource fra integrerende til fortløbende. @da
definition: Relates a resource to a resource that is created by changing the extension plan of a resource from integrating to successive.
definition: Setzt eine Ressource in Beziehung zu einer Ressource, die durch Änderung des Erweiterungsplans einer Ressource von integrierend auf sukzessiv erstellt wird. @de
definition: يربط بين مصدر ومصدر تم إنشاؤه عن طريق تغيير خطة توسع المصدر من متكامل إلى متتالي. @ar
definition: 将一种资源与通过将一种资源的扩充计划从集成性改变为相继性而被创建的一种资源关联起来。 @zh-hans

is sequential version of
lexical alias: sequentialVersionOf.en
status: Published
type: Property
label: er sekventiel version af @da
label: is sequentiële versie van @nl
label: ist fortlaufende Version von @de
label: peräkkäinen versio (aineisto) @fi
label: szekvenciális változata a következőnek: @hu
label: sıralı sürümüdür @tr
label: هو إصدارة متتالية لـ @ar
label: 是……的序列版本 @zh-hans
sub property of: is transformation by extension plan of
inverse of: has sequential version
definition: Bir kaynağı, bir kaynak oluşturmak için ardışıktan birleştirmeye değiştirilen bir genişletme planına sahip bir kaynakla ilişkilendirir. @tr
definition: Hozzákapcsol egy forrást egy forráshoz, amelynek a közlési terve folyamatosról integrálóvá változott egy forrás létrejövetele érdekében. @hu
definition: Liittää aineiston aineistoon, jolla on aineiston luomista varten peräkkäisesti ilmestyvästä päivittyväksi muutettu laajennussuunnitelma. @fi
definition: Relaterer en ressource til en ressource, som har en udvidelsesplan, der er ændret fra fortløbende til integrerende for at skabe en ressource. @da
definition: Relates a resource to a resource that has an extension plan that is changed from successive to integrating to create a resource.
definition: Setzt eine Ressource in Beziehung zu einer Ressource, deren Erweiterungsplan von sukzessiv auf integrierend geändert wird, um eine Ressource zu erstellen. @de
definition: يربط بين مصدر ومصدر له خطة توسع تم تغييرها من متتالي إلى متكامل لإنشاء مصدر. @ar
definition: 将一种资源与有扩充计划并被改变为从相继性到集成性以创建一种资源的一种资源关联起来。 @zh-hans

has serialized version
lexical alias: serializedVersion.en
status: Published
type: Property
label: har serialiseret version @da
label: hat Fortsetzungs-Version @de
label: heeft seriële versie @nl
label: sarjaversio (aineisto) @fi
label: serileştirilmiş sürüm ile ilişkilidir @tr
label: sorozati változata a következő: @hu
label: له إصدارة متسلسلة @ar
label: 有序列化的版本 @zh-hans
sub property of: has transformation by extension plan
definition: Bir kaynağı, bir kaynağın genişletme planını durağandan ardışığa değiştirerek oluşturulan bir kaynakla ilişkilendirir. @tr
definition: Hozzákapcsol egy forrást egy forráshoz, amely egy forrás közlési tervének statikusról folyamatossá való változásával jött létre. @hu
definition: Liittää aineiston aineistoon, joka on luotu vaihtamalla laajennussuunnitelma staattisesta peräkkäisesti ilmestyväksi. @fi
definition: Relaterer en ressource til en ressource der er skabt ved at ændre udvidelsesplanen for en ressource fra statisk til fortløbende. @da
definition: Relates a resource to a resource that is created by changing the extension plan of a resource from static to successive.
definition: Setzt eine Ressource in Beziehung zu einer Ressource, die durch Änderung des Erweiterungsplans einer Ressource von statisch auf sukzessiv erstellt wird. @de
definition: يربط بين مصدر ومصدر تم إنشاؤه عن طريق تغيير خطة توسع المصدر من ثابت إلى متتالي. @ar
definition: 将一种资源与通过将一种资源的扩充计划从静态到相继性变化而被创建的一种资源关联起来。 @zh-hans

has static version
lexical alias: staticVersion.en
status: Published
type: Property
label: aineiston staattinen versio @fi
label: durağan sürüm ile ilişkilidir @tr
label: har statisk version @da
label: hat statische Version @de
label: heeft statische versie @nl
label: statikus változata a következő: @hu
label: له إصدارة ثابتة @ar
label: 有静态版本 @zh-hans
sub property of: has transformation by extension plan
definition: Bir kaynağı, bir kaynağın genişletme planını birleşimden durağana değiştirerek oluşturulan bir kaynakla ilişkilendirir. @tr
definition: Hozzákapcsol egy forrást egy forráshoz, amely egy forrás közlési tervének integrálóról statikussá való változásával jött létre. @hu
definition: Liittää aineiston aineistoon, joka on luotu vaihtamalla päivittyvä laajennussuunnitelma staattiseksi laajennussuunnitelmaksi. @fi
definition: Relaterer en ressource til en ressource, som er skabt ved at ændre udvidelsesplanen for en ressource fra integrerende til statisk. @da
definition: Relates a resource to a resource that is created by changing the extension plan of a resource from integrating to static.
definition: Setzt eine Ressource in Beziehung zu einer Ressource, die durch Änderung des Erweiterungsplans einer Ressource von integrierend auf statisch erstellt wird. @de
definition: يربط بين مصدر ومصدر تم إنشاؤه عن طريق تغيير خطة توسع المصدر من تكامل إلى ثابت. @ar
definition: 将一种资源与通过将一种资源的扩充计划从集成性到静态变化而被创建的一种资源关联起来。 @zh-hans

has transformation by audience
has subproperty: has language version
has subproperty: has regional version
has subproperty: has carrier version
lexical alias: transformationByAudience.en
status: Published
type: Property
label: aineiston kohdeyleisön muutos @fi
label: har omdannelse ved publikum @da
label: hat Transformation hinsichtlich der Zielgruppe @de
label: hedef kitleye göre dönüşüm ile ilişkilidir @tr
label: heeft transformatie door doelgroep @nl
label: közönség miatti átalakítása a következő: @hu
label: له تحول وفق الجمهور @ar
label: 有按受众的转换 @zh-hans
sub property of: has transformation
definition: Bir kaynağı, bir kaynağın kitlesini değiştirerek oluşturulan bir kaynakla ilişkilendirir. @tr
definition: Hozzákapcsol egy forrást egy forráshoz, amely egy forrás közönségének megváltozása következtében jött létre. @hu
definition: Liittää aineiston aineistoon, joka on luotu muuttamalla aineiston kohderyhmää. @fi
definition: Relaterer en ressourcce til en ressource, der er skabt ved at ændre publikum for en ressource. @da
definition: Relates a resource to a resource that is created by changing the audience of a resource.
definition: Setzt eine Ressource in Beziehung zu einer Ressource, die aufgrund einer Änderung der Zielgruppe einer Ressource erstellt wird. @de
definition: يربط بين مصدر ومصدر تم إنشاؤه عن طريق تغيير جمهور لمصدر. @ar
definition: 将一种资源与通过改变一种资源的受众而被创建的一种资源关联起来。 @zh-hans

is transformation by audience of
has subproperty: is language version of
has subproperty: is regional version of
has subproperty: is carrier version of
lexical alias: transformationByAudienceOf.en
status: Published
type: Property
label: a közönség miatti átalakítása a következőnek: @hu
label: aineiston muuttunut kohdeyleisö @fi
label: er omdannelse ved publikum af @da
label: is transformatie door doelgroep van @nl
label: ist Transformation hinsichtlich der Zielgruppe von @de
label: izleyicisinin değişimidir @tr
label: هو تحول وفق الجمهور لـ @ar
label: 是……的按受众的转换 @zh-hans
sub property of: is transformation of
inverse of: has transformation by audience
definition: Bir kaynağı, bir kaynak oluşturmak için değiştirilen bir kitleye sahip bir kaynakla ilişkilendirir. @tr
definition: Hozzákapcsol egy forrást egy forráshoz, amelynek a közönsége megváltozott egy forrás létrejövetele érdekében. @hu
definition: Liittää aineiston aineistoon, jolla on uuden aineiston luomiseksi muutettu kohderyhmä. @fi
definition: Relaterer en ressource til en ressource, der har et putlikum, som ændres for at skabe en ressource. @da
definition: Relates a resource to a resource that has an audience that is changed to create a resource.
definition: Setzt eine Ressource in Beziehung zu einer Ressource, deren Zielgruppe geändert wird, um eine Ressource zu erstellen. @de
definition: يربط بين مصدر ومصدر له جمهور تم تغييره لإنشاء مصدر. @ar
definition: 将一种资源与有受众并被改变以创建一种资源的一种资源关联起来。 @zh-hans

has language version
lexical alias: languageVersion.en
status: Published
type: Property
label: dil uyarlaması ile ilişkilidir @tr
label: har sproglig version @da
label: hat Sprachversion @de
label: heeft taalversie @nl
label: kieliversio @fi
label: nyelvi változata a következő: @hu
label: له إصدارة لغة @ar
label: 有语言版本 @zh-hans
sub property of: has transformation by audience
definition: Bir kaynağı, bir kaynağın dil kitlesini değiştirerek oluşturulan bir kaynakla ilişkilendirir. @tr
definition: Hozzákapcsol egy forrást egy forráshoz, amely egy forrásközönség nyelvének megváltozása következtében jött létre. @hu
definition: Liittää aineiston aineistoon, joka on luotu muuttamalla aineiston kieliyleisöä. @fi
definition: Relaterer en ressource til en ressource, som er skabt ved at ændre det sproglige publikum for en ressource. @da
definition: Relates a resource to a resource that is created by changing the language audience of a resource.
definition: Setzt eine Ressource in Beziehung zu einer Ressource, die durch Änderung der sprachlichen Zielgruppe einer Ressource erstellt wird. @de
definition: يربط بين مصدر ومصدر تم إنشاؤه عن طريق تغيير جمهور لغة لمصدر. @ar
definition: 将一种资源与通过改变一种资源的语言受众而被创建的一种资源关联起来。 @zh-hans

has regional version
lexical alias: regionalVersion.en
status: Published
type: Property
label: aineiston alueellinen versio @fi
label: bölgesel sürüm ile ilişkilidir @tr
label: har regional version @da
label: hat Regionalversion @de
label: heeft regionale versie @nl
label: regionális változata a következő: @hu
label: له إصدارة إقليمية @ar
label: 有地区版本 @zh-hans
sub property of: has transformation by audience
definition: Bir kaynağı, bir kaynağın bölgesel kitlesini değiştirerek oluşturulan bir kaynakla ilişkilendirir. @tr
definition: Hozzákapcsol egy forrást egy forráshoz, amely egy forrás regionális közönségének megváltozása következtében jött létre. @hu
definition: Liittää aineiston alueellista kohdeyleisöä muuttamalla luotuun versioon. @fi
definition: Relaterer en ressource til en ressource, der er skabt ved at ændre det regionale publikum for en ressource. @da
definition: Relates a resource to a resource that is created by changing the regional audience of a resource.
definition: Setzt eine Ressource in Beziehung zu einer Ressource, die durch Änderung der regionalen Zielgruppe einer Ressource geschaffen wird. @de
definition: يربط بين مصدر ومصدر تم إنشاؤه عن طريق تغيير الجمهور الإقليمي لمصدر. @ar
definition: 将一种资源与通过改变一种资源的地区受众而创建的一种资源关联起来。 @zh-hans

has carrier version
lexical alias: carrierVersion.en
status: Published
type: Property
label: aineiston tallenneversio @fi
label: har bærerversion @da
label: hat Datenträgerversion @de
label: heeft dragerversie @nl
label: hordozóváltozata a következő: @hu
label: taşıyıcı sürümü ile ilişkilidir @tr
label: له إصدارة ناقل @ar
label: 有载体版本 @zh-hans
sub property of: has transformation by audience
definition: Bir kaynağı, bir kaynağın taşıyıcısı değiştirilerek oluşturulan bir kaynakla ilişkilendirir. @tr
definition: Hozzákapcsol egy forrást egy forráshoz, amely egy forrás hordozójának megváltozása következtében jött létre. @hu
definition: Liittää aineiston tallennetta muuttamalla luotuun versioon. @fi
definition: Relaterer en ressource til en ressource, der er skabt ved at ændre en ressources bærere. @da
definition: Relates a resource to a resource that is created by changing the carrier of a resource.
definition: Setzt eine Ressource in Beziehung zu einer Ressource, die durch Änderung des Datenträgers einer Ressource geschaffen wird. @de
definition: يربط بين مصدر ومصدر تم إنشاؤه عن طريق تغيير ناقل لمصدر. @ar
definition: 将一种资源与通过改变一种资源的载体而创建的一种资源关联起来。 @zh-hans

is language version of
lexical alias: languageVersionOf.en
status: Published
type: Property
label: aineiston kieliversio @fi
label: dil uyarlamasıdır @tr
label: er sprogversion af @da
label: is taalversie van @nl
label: ist Sprachversion von @de
label: nyelvi változata a következőnek: @hu
label: هو إصدارة لغة لـ @ar
label: 是……的语言版本 @zh-hans
sub property of: is transformation by audience of
inverse of: has language version
definition: Bir kaynağı, bir kaynak oluşturmak için değiştirilen bir kitlenin diline sahip kaynakla ilişkilendirir. @tr
definition: Hozzákapcsol egy forrást egy forráshoz, amely közönségének a nyelve megváltozott egy forrás létrejövetele érdekében. @hu
definition: Liittää aineiston aineistoon, jolla on aineiston luomiseksi muutettu kieliyleisö. @fi
definition: Relaterer en ressource til en ressource, som har et sprogligt publikum, der ændres for at skabe en ressource. @da
definition: Relates a resource to a resource that has a language audience that is changed to create a resource.
definition: Setzt eine Ressource in Beziehung zu einer Ressource, deren sprachlichen Zielgruppe geändert wird, um eine Ressource zu schaffen. @de
definition: يربط بين مصدر ومصدر له جمهور لغة تم تغييره لإنشاء مصدر. @ar
definition: 将一种资源与有语言受众并被改变以创建一种资源的一种资源关联起来。 @zh-hans

is regional version of
lexical alias: regionalVersionOf.en
status: Published
type: Property
label: aineiston alueellinen versio @fi
label: bölgesel sürümüdür @tr
label: er regional version af @da
label: is regionale versie van @nl
label: ist Regionalversion von @de
label: regionális változata a következőnek: @hu
label: هو إصدارة إقليمية لـ @ar
label: 是……的地区版本 @zh-hans
sub property of: is transformation by audience of
inverse of: has regional version
definition: Bir kaynağı, bir kaynak oluşturmak için değiştirilen yerel bir kitleyi içeren kaynakla ilişkilendirir. @tr
definition: Hozzákapcsol egy forrást egy forráshoz, amelynek regionális közönsége megváltozott egy forrás létrejövetele érdekében. @hu
definition: Liittää aineiston alueellista yleisöä muuttamalla luotuun versioon. @fi
definition: Relaterer en ressource til en ressource, som har et regionalt publikum, der ændres for at skabe en ressource. @da
definition: Relates a resource to a resource that has a regional audience that is changed to create a resource.
definition: Setzt eine Ressource in Beziehung zu einer Ressource, deren regionale Zielgruppe geändert wird, um eine Ressource zu schaffen. @de
definition: يربط بين مصدر ومصدر له جمهور إقليمي تم تغييره لإنشاء مصدر. @ar
definition: 将一种资源与有地区受众并被改变以创建一种资源的一种资源关联起来。 @zh-hans

is carrier version of
lexical alias: carrierVersionOf.en
status: Published
type: Property
label: er bærerversion af @da
label: hordozóváltozata a következőnek: @hu
label: is dragerversie van @nl
label: ist Datenträgerversion von @de
label: tallenneversio (aineisto) @fi
label: taşıyıcı sürümüdür @tr
label: هو إصدارة ناقل لـ @ar
label: 是……的载体版本 @zh-hans
sub property of: is transformation by audience of
inverse of: has carrier version
definition: Bir kaynağı, bir kaynak oluşturmak için değiştirilen bir taşıyıcıya sahip bir kaynakla ilişkilendirir. @tr
definition: Hozzákapcsol egy forrást egy forráshoz, amelynek a hordozója megváltozott egy forrás létrejövetele érdekében. @hu
definition: Liittää aineiston tallennemuotoa muuttamalla luotuun versioon. @fi
definition: Relaterer en ressource til en ressource, som har en bærer, der ændres for at skabe en ressurce. @da
definition: Relates a resource to a resource that has a carrier that is changed to create a resource.
definition: Setzt eine Ressource in Beziehung zu einer Ressource, deren Datenträger geändert wird, um eine Ressource zu schaffen. @de
definition: يربط بين مصدر ومصدر به ناقل تم تغييره لإنشاء مصدر. @ar
definition: 将一种资源与有载体并被改变以创建一种资源的一种资源关联起来。 @zh-hans

has transformation by policy
has subproperty: has transformation by extension plan
lexical alias: transformationByPolicy.en
status: Published
type: Property
label: har omdannelse ved policy @da
label: hat Transformation hinsichtlich der Vorgehensweise @de
label: heeft transformatie door beleid @nl
label: ilkeye göre dönüşüm ile ilişkilidir @tr
label: szerkesztési elvek szerinti átalakítása a következő: @hu
label: toimituksellisella käytännöllä muutettu aineisto @fi
label: له تحول وفق سياسة @ar
label: 有按政策的转换 @zh-hans
sub property of: has transformation
definition: Bir kaynağı, kapsamı veya içerik politikası değiştirilerek oluşturulan bir kaynakla ilişkilendirir. @tr
definition: Hozzákapcsol egy forrást egy forráshoz, amely egy forrás alkalmazási területének vagy szerkesztési elveinek a megváltoztatásával jött létre. @hu
definition: Liittää aineiston aineistoon, joka on luotu muuttamalla aineiston alaa tai toimituksellista käytäntöä. @fi
definition: Relaterer en ressource til en ressource, som er skabt ved at ændre formålet eller udgivelsespolicyn for en ressourece. @da
definition: Relates a resource to a resource that is created by changing the scope or editorial policy of a resource.
definition: Setzt eine Ressource in Beziehung zu einer Ressource, die aufgrund einer Änderung des Geltungsbereichs oder der redaktionellen Vorgehensweise einer Ressource erstellt wird. @de
definition: يربط بين مصدر ومصدر تم إنشاؤه عن طريق تغيير المجال أو السياسة التحريرية لمصدر. @ar
definition: 将一种资源与通过改变一种资源的范围或编辑政策而被创建的一种资源关联起来。 @zh-hans

is transformation by policy of
has subproperty: is transformation by extension plan of
lexical alias: transformationByPolicyOf.en
status: Published
type: Property
label: er omdannelse ved policy af @da
label: ilkesel değişimdir @tr
label: is transformatie door beleid van @nl
label: ist Transformation hinsichtlich der Vorgehensweise von @de
label: szerkesztési elvek szerinti átalakítása a következőnek: @hu
label: toimituksellisella käytännöllä muutettu aineisto @fi
label: هو تحول وفق سياسة لـ @ar
label: 是……的按政策的转换 @zh-hans
sub property of: is transformation of
inverse of: has transformation by policy
definition: Bir kaynağı, bir kaynak oluşturmak için değiştirilen bir politikaya sahip bir kaynakla ilişkilendirir. @tr
definition: Hozzákapcsol egy forrást egy forráshoz, amelynek a szerkesztési elvei megváltoztak egy forrás létrejövetele érdekében. @hu
definition: Liittää aineiston aineistoon, jolla on aineiston luomiseksi muutettu toimituksellinen käytäntö. @fi
definition: Relaterer en ressource til en ressource, som har en policy der er ændret for at skabe en ressource. @da
definition: Relates a resource to a resource that has a policy that is changed to create a resource.
definition: Setzt eine Ressource in Beziehung zu einer Ressource, deren Verfahrensweise geändert wird, um eine Ressource zu schaffen. @de
definition: يربط بين مصدر ومصدر له سياسة تم تغييرها لإنشاء مصدر. @ar
definition: 将一种资源与有政策并被改变以创建一种资源的一种资源关联起来。 @zh-hans

has transformation
has subproperty: has transformation by audience
has subproperty: has transformation by policy
has subproperty: has transformation by style
has subproperty: has transformation by genre
lexical alias: transformation.en
status: Published
type: Property
label: aineiston muutos @fi
label: dönüşüm ile ilişkilidir @tr
label: har omdannelse @da
label: hat Transformation @de
label: heeft transformatie @nl
label: átalakítása a következő: @hu
label: له تحول @ar
label: 有转换 @zh-hans
sub property of: aineistoon liittyvä aineisto
definition: Bir kaynağı, bir kaynağın kapsamını veya yayın politikasını, türünü veya edebi biçimini, hedef kitlesini veya biçimini değiştirerek oluşturulan bir kaynakla ilişkilendirir. @tr
definition: Hozzákapcsol egy forrást egy forráshoz, amely egy forrás alkalmazási területének vagy szerkesztési elveinek, a műfajának vagy műnemének, a célközönségének vagy a stílusának megváltoztatásával jött létre. @hu
definition: Liittää aineiston aineistoon, joka on luotu muuttamalla aineiston laajuutta tai toimituksellista käytäntöä, genreä tai kirjallista muotoa, kohdeyleisöä tai tyyliä. @fi
definition: Relaterer en ressource til en ressurce, som er skabt ved at ændre formål eller udgivelsespolicy, emne eller literær form, målpublikum, eller stil af ressource. @da
definition: Relates a resource to a resource that is created by changing the scope or editorial policy, the genre or literary form, the target audience, or the style of a resource.
definition: Setzt eine Ressource in Beziehung zu einer Ressource, die durch eine Änderung des Geltungsbereichs, der redaktionelle Vorgehensweise, des Genres oder der literarischen Form, der Zielgruppe oder des Stils einer Ressource erstellt wird. @de
definition: يربط بين مصدر ومصدر تم إنشاؤه عن طريق تغيير المجال أو السياسة التحريرية، النوع أو الشكل الأدبي، الجمهور المستهدف، أو أسلوب مصدر. @ar
definition: 将一种资源与通过改变一种资源的范围或编辑政策、体裁或文学形式、目标受众或风格而被创建的一种资源关联起来。 @zh-hans

is transformation of
has subproperty: is transformation by audience of
has subproperty: is transformation by policy of
has subproperty: is transformation by style of
has subproperty: is transformation by genre of
lexical alias: transformationOf.en
status: Published
type: Property
label: değişimi @tr
label: er omdannelse af @da
label: is transformatie van @nl
label: ist Transformation von @de
label: muutettu aineisto @fi
label: átalakítása a következőnek: @hu
label: هو تحول لـ @ar
label: 是……的转换 @zh-hans
sub property of: aineistoon liittyvä aineisto
inverse of: has transformation
definition: Bir kaynağı, bir kaynak oluşturmak için değiştirilen bir kapsam veya yayın politikası, tür veya edebi biçim, hedef kitle veya biçime sahip bir kaynakla ilişkilendirir. @tr
definition: Hozzákapcsol egy forrást egy forráshoz, amelynek alkalmazási területe vagy szerkesztési elvei, a műfaja vagy műneme, a célközönsége vagy a stílusa megváltoztak egy forrás létrejövetele érdekében. @hu
definition: Liittää aineiston aineistoon, jonka laajuutta tai toimituksellista käytäntöä, genreä tai kirjallista muotoa, kohdeyleisöä tai tyyliä on muutettu uuden aineiston luomiseksi. @fi
definition: Relaterer en ressource til en ressource, som har et formål eller redaktionel policy, genre eller litterær form, målgruppe, eller stil, der ændres for at skabe en ressource. @da
definition: Relates a resource to a resource that has a scope or editorial policy, genre or literary form, target audience, or style that is changed to create a resource.
definition: Setzt eine Ressource in Beziehung zu einer Ressource, deren Geltungsbereich, redaktionelle Vorgehensweise, Genre oder literarische Form, Zielgruppe oder Stil geändert wird, um eine Ressource zu erstellen. @de
definition: يربط بين مصدر ومصدر له مجال أو سياسة تحريرية، نوع أو شكل أدبي، جمهور مستهدف، أو أسلوب تم تغييره لإنشاء مصدر. @ar
definition: 将一种资源与有范围或编辑政策、体裁或文学形式、目标受众或风格并被改变以创建一种资源的一种资源关联起来。 @zh-hans

has transformation by style
lexical alias: transformationByStyle.en
status: Published
type: Property
label: biçime göre dönüşüm ile ilişkilidir @tr
label: har omdannelse ved stil @da
label: hat Transformation hinsichtlich des Stils @de
label: heeft transformatie door stijl @nl
label: muutettu aineiston tyyli @fi
label: stílus szerinti átalakítása a következő: @hu
label: له تحول وفق أسلوب @ar
label: 有按风格的转换 @zh-hans
sub property of: has transformation
definition: Bir kaynağı, bir kaynağın biçimi değiştirilerek oluşturulan bir kaynakla ilişkilendirir. @tr
definition: Hozzákapcsol egy forrást egy forráshoz, amely egy forrás stílusának megváltozása következtében jött létre. @hu
definition: Liittää aineiston aineistoon, joka on luotu muuttamalla aineiston tyyliä. @fi
definition: Relaterer en ressource til en ressource, som er skabt ved at ændre en ressources stil. @da
definition: Relates a resource to a resource that is created by changing the style of a resource.
definition: Setzt eine Ressource in Beziehung zu einer Ressource, die aufgrund einer Änderung des Stils einer Ressource erstellt wird. @de
definition: يربط بين مصدر ومصدر تم إنشاؤه عن طريق تغيير أسلوب مصدر. @ar
definition: 将一种资源与通过改变一种资源的风格而被创建的一种资源关联起来。 @zh-hans

is transformation by style of
lexical alias: transformationByStyleOf.en
status: Published
type: Property
label: biçeme göre değişimidir @tr
label: er omdannelse ved stil af @da
label: is transformatie door stijl van @nl
label: ist Transformation hinsichtlich des Stil von @de
label: stílus szerinti átalakítása a következőnek: @hu
label: tyylin muutos aineistolle @fi
label: هو تحول وفق أسلوب لـ @ar
label: 是……的按风格的转换 @zh-hans
sub property of: is transformation of
inverse of: has transformation by style
definition: Bir kaynağı, bir kaynak oluşturmak için değiştirilen bir biçime sahip bir kaynakla ilişkilendirir. @tr
definition: Hozzákapcsol egy forrást egy forráshoz, amelynek a stílusa megváltozott egy forrás létrejövetele érdekében. @hu
definition: Liittää aineiston aineistoon, jonka tyyliä on muutettu uuden aineiston luomiseksi. @fi
definition: Relaterer en ressourece til en ressource, som har en stil, der er ændret for at skabe en ressource. @da
definition: Relates a resource to a resource that has a style that is changed to create a resource.
definition: Setzt eine Ressource in Beziehung zu einer Ressource, deren Stil geändert wird, um eine Ressource zu schaffen. @de
definition: يربط بين مصدر ومصدر له نمط تم تغييره لإنشاء مصدر. @ar
definition: 将一种资源与有风格并被改变以创建一种资源的一种资源关联起来。 @zh-hans

has transformation by genre
lexical alias: transformationByGenre.en
status: Published
type: Property
label: har omdannelse ved genre @da
label: hat Transformation hinsichtlich des Genres @de
label: heeft transformatie door genre @nl
label: muutettu aineiston genre @fi
label: műfaj szerinti átalakítása a következő: @hu
label: türe göre dönüşüm ile ilişkilidir @tr
label: له تحول وفق النَوع @ar
label: 有按体裁的转换 @zh-hans
sub property of: has transformation
definition: Bir kaynağı, türü veya edebi biçimi değiştirilerek oluşturulan bir kaynakla ilişkilendirir. @tr
definition: Hozzákapcsol egy forrást egy forráshoz, amely egy forrás műfajának vagy műnemének a megváltoztatásával jött létre. @hu
definition: Liittää aineiston aineistoon, joka on luotu muuttamalla aineiston tyyliä. @fi
definition: Relaterer en ressource til en ressource, som er skabt ved at ændre en ressources genre eller litterære form. @da
definition: Relates a resource to a resource that is created by changing the genre or literary form of a resource.
definition: يربط بين مصدر ومصدر تم إنشاؤه عن طريق تغيير النوع أو الشكل الأدبي لمصدر. @ar
definition: 将一种资源与通过改变一种资源的体裁或文学形式而被创建的一种资源关联起来。 @zh-hans

is transformation by genre of
lexical alias: transformationByGenreOf.en
status: Published
type: Property
label: er omdannelse ved genre af @da
label: genren muutos aineistolle @fi
label: is transformatie door genre van @nl
label: ist Transformation hinsichtlich des Genres von @de
label: műfaj szerinti átalakítása a következőnek: @hu
label: türüne göre değişimidir @tr
label: هو تحول وفق النَوع لـ @ar
label: 是……的按体裁的转换 @zh-hans
sub property of: is transformation of
inverse of: has transformation by genre
definition: Bir kaynağı, bir kaynak oluşturmak için değiştirilen bir türe sahip bir kaynakla ilişkilendirir. @tr
definition: Hozzákapcsol egy forrást egy forráshoz, amelynek a műfaja megváltozott egy forrás létrejövetele érdekében. @hu
definition: Liittää aineiston aineistoon, jonka genreä on muutettu uuden aineiston luomiseksi. @fi
definition: Relaterer en ressource til en ressource, som har en genre, der er ændret for at skabe en ressource. @da
definition: Relates a resource to a resource that has a genre that is changed to create a resource.
definition: Setzt eine Ressource in Beziehung zu einer Ressource, deren Genre geändert wird, um eine Ressource zu schaffen. @de
definition: يربط بين مصدر ومصدر له نَوع تم تغييره لإنشاء مصدر. @ar
definition: 将一种资源与有体裁并被改变以创建一种资源的一种资源关联起来。 @zh-hans

is serialized version of
lexical alias: serializedVersionOf.en
status: Published
type: Property
label: er serialiseret version af @da
label: is seriële versie van @nl
label: ist Fortsetzungs-Version von @de
label: sarjaversio aineistosta @fi
label: serileştirilmiş sürümüdür @tr
label: sorozati változata a következőnek: @hu
label: هو إصدارة متسلسلة لـ @ar
label: 是……的序列化的版本 @zh-hans
sub property of: is transformation by extension plan of
inverse of: has serialized version
definition: Bir kaynağı, bir kaynak oluşturmak için ardışıktan durağana değiştirilen bir genişletme planına sahip kaynakla ilişkilendirir. @tr
definition: Hozzákapcsol egy forrást egy forráshoz, amelynek a közlési terve folyamatosról statikussá változott egy forrás létrejövetele érdekében. @hu
definition: Liittää aineiston aineistoon, jolla on laajennussuunnitelma, joka on muutettu peräkkäisestä staattiseksi aineiston luomiseksi. @fi
definition: Relaterer en ressource til en ressource, som har en udvidelsesplan, der er ændret fra fortløbende til statisk for at skabe en ressource. @da
definition: Relates a resource to a resource that has an extension plan that is changed from successive to static to create a resource.
definition: Setzt eine Ressource in Beziehung zu einer Ressource, deren Erweiterungsplan von sukzessiv auf statisch geändert wird, um eine Ressource zu erstellen. @de
definition: يربط بين مصدر ومصدر له خطة توسع تم تغييرها من متتالي إلى ثابت لإنشاء مصدر. @ar
definition: 将一种资源与有扩充计划并被改变为从相继性到静态以创建一种资源的一种资源关联起来。 @zh-hans

is static version of
lexical alias: staticVersionOf.en
status: Published
type: Property
label: er statisk version af @da
label: is statische versie van @nl
label: ist statische Version von @de
label: sabit sürümüdür @tr
label: staattinen versio @fi
label: statikus változata a következőnek: @hu
label: هو إصدارة ثابثة لـ @ar
label: 是……的静态版本 @zh-hans
sub property of: is transformation by extension plan of
inverse of: has static version
definition: Bir kaynağı, bir kaynak oluşturmak için durağandan birleşime değiştirilen bir genişletme planına sahip bir kaynakla ilişkilendirir. @tr
definition: Hozzákapcsol egy forrást egy forráshoz, amelynek a közlési terve statikusról integrálóvá változott egy forrás létrejövetele érdekében. @hu
definition: Liittää aineiston aineistoon, jonka laajennussuunnitelma on vaihdettu päivittyvästä staattiseksi. @fi
definition: Relaterer en ressource til en ressource, som har en udvidelsesplan, der ændret fra fortløbende til integrerende for at skabe en ressource. @da
definition: Relates a resource to a resource that has an extension plan that is changed from static to integrated to create a resource.
definition: Setzt eine Ressource in Beziehung zu einer Ressource, deren Erweiterungsplan von statisch auf integrierend geändert wird, um eine Ressource zu erstellen. @de
definition: يربط بين مصدر ومصدر يحتوي على خطة تمديد تم تغييرها من ثابت إلى تكامل لإنشاء مصدر. @ar
definition: 将一种资源与有扩充计划并被改变为从静态到集成性以创建一种资源的一种资源关联起来。 @zh-hans

is reviser of
lexical alias: reviserOf.en
status: Published
type: Property
label: aineiston tarkastaja (toimija) @fi
label: er reviderer af @da
label: gözden geçirilmişidir @tr
label: is herziener van @nl
label: ist Überarbeiterin/Überarbeiter von @de
label: átdolgozója a következőnek: @hu
label: هو مُراجع لـ @ar
label: 是……的修订者 @zh-hans
definition: Bir temsilciyi, içerikte değişiklik yapan temsilcinin katkısını içeren bir kaynakla ilişkilendirir. @tr
definition: Hozzákapcsol egy ágenst egy forráshoz, amely magában foglalja egy ágens közreműködését a tartalom megváltoztatásában. @hu
definition: Liittää toimijan aineistoon, jossa toimija on osallisena tekemällä muutoksia aineiston sisältöön. @fi
definition: Relaterer en agent til en ressource, som omfatter et bidrag af en agent ved at lave ændringer til indholdet. @da
definition: Relates an agent to a resource that includes a contribution by an agent of making changes to the content.
definition: Setzt einen Akteur in Beziehung zu eine Ressource, zu der ein Akteur beiträgt, indem er am Inhalt Veränderungen vornimmt. @de
definition: يربط بين مصدر ومصدر يتضمن إسهام وكيل في إجراء تغييرات المحتوى. @ar
definition: 将一个行为者与包括对内容作改动的一个行为者的贡献的一种资源关联起来。 @zh-hans

is contributor agent to amalgamation of
lexical alias: contributorAgentToAmalgamationOf.en
status: Published
type: Property
label: Akteur als Beiträgerin/Beiträger zu einer Verschmelzung von @de
label: aineiston yhdistymään osallinen toimija @fi
label: birleşimine katkıda bulunan temsilcidir @tr
label: er agent som er bidragsyder til sammensmæltning af @da
label: is bijdrager-actor aan amalgamering van @nl
label: közreműködő ágense a következő vegyes tartalomnak: @hu
label: هو وكيل مساهم في دمج لـ @ar
label: 是……的融合体的贡献者行为者 @zh-hans
definition: Bir temsilciyi, bir temsilcinin içerik türlerinin kesintisiz bir birleşimine yaptığı katkıyı içeren bir kaynakla ilişkilendirir. @tr
definition: Hozzákapcsol egy ágenst egy forráshoz, amely magában foglalja egy ágens közreműködését a tartalom fajtáinak szabad keverésében. @hu
definition: Liittää toimijan aineistoon, jossa toimija on osallisena sellaisen aineiston tekemiseen, joka on saumaton yhdistelmä erilaisia sisältöjä. @fi
definition: Relaterer en agent til en ressource, som omfatter et bidrag af en agent til en sømløs blanding af typer af indhold. @da
definition: Relates an agent to a resource that includes a contribution by an agent to a seamless mix of kinds of content
definition: Setzt einen Akteur in Beziehung zu einer Ressource, bei der ein Akteur zu einer nahtlosen Mischung von Inhalten beiträgt. @de
definition: يربط بين وكيل ومصدر يتضمن إسهام وكيل في مزج سلس لأنواع من المحتوى. @ar
definition: 将一个行为者与包括将各种内容无缝融合的一个行为者的贡献的一种资源关联起来。 @zh-hans

is contributor agent to performance of
lexical alias: contributorAgentToPerformanceOf.en
status: Published
type: Property
label: aineiston esitykseen osallinen toimija @fi
label: er agent som er bidragsyder til performance af @da
label: is bijdrager-actor aan uitvoering van @nl
label: ist Akteur als Beiträgerin/Beiträger zu einer Darbietung von @de
label: közreműködő ágense a következő előadásnak: @hu
label: performansına katkıda bulunan temsilcidir @tr
label: هو وكيل مساهم في أداء لـ @ar
label: 是……的表演的贡献者行为者 @zh-hans
definition: Bir temsilciyi, bir temsilcinin bir performansa katkısını içeren bir kaynakla ilişkilendirir. @tr
definition: Hozzákapcsol egy ágenst egy forráshoz, amely magában foglalja az ágens közreműködését egy előadásban. @hu
definition: Liittää toimijan aineistoon, jossa toimija on osallisena sellaisen aineiston tekemisessä, joka on esitys. @fi
definition: Relaterer en agent til en ressource, som omfatter et bidrag af en agent til en performance. @da
definition: Relates an agent to a resource that includes a contribution by an agent to a performance.
definition: Setzt einen Akteur in Beziehung zu einer Ressource, bei der ein Akteur zu einer Darbietung beiträgt @de
definition: يربط بين وكيل ومصدر يتضمن إسهام وكيل في أداء. @ar
definition: 将一个行为者与包括一个行为者对一个表演之贡献的一种资源关联起来。 @zh-hans

is editor of text of (Deprecated)
lexical alias: editorOfTextOf.en
status: Deprecated
type: Property
definition: Relates an agent to a resource that includes a contribution by an agent of amending text created by other agents in order to meet publication standards such as consistency, clarity, and style. (Deprecated)

is contributor agent to aggregate of
lexical alias: contributorAgentToAggregateOf.en
status: Published
type: Property
label: aggregaattiaineistoon osallinen toimija @fi
label: er agent som er bidragsyder til samling af @da
label: is bijdrager-actor aan aggregaat van @nl
label: ist Akteur als Beiträgerin/Beiträger zu einem Aggregat von @de
label: közreműködő ágense a következő aggregátumnak: @hu
label: toplanmasına katkıda bulunan temsilcidir @tr
label: هو وكيل مساهم في تجميعة لـ @ar
label: 是……的合集的贡献者行为者 @zh-hans
definition: Bir temsilciyi, bir temsilcinin katkısını içeren toplayıcı bir kaynakla ilişkilendirir. @tr
definition: Hozzákapcsol egy ágenst egy aggregátum forráshoz, amely magában foglalja az ágens közreműködését. @hu
definition: Liittää toimijan aineistoon, jossa toimija on osallisena sellaisen aineiston tekemisessä, joka on aggregaatti. @fi
definition: Relaterer en agent til en ressource, som er en samling, der omfatter et bidrag af en agent. @da
definition: Relates an agent to a resource that is an aggregate that includes a contribution by an agent.
definition: Setzt einen Akteur in Beziehung zu einem Aggregat (Ressource), das einen Beitrag eines Akteurs enthält. @de
definition: يربط بين وكيل ومصدر عبارة عن تجميعة تتضمن إسهام وكيل. @ar
definition: 将一个行为者与作为一种合集并包括一个行为者之贡献的一种资源关联起来。 @zh-hans

has reviser
lexical alias: reviser.en
status: Published
type: Property
label: aineiston tarkastaja @fi
label: gözden geçiren ile ilişkilidir @tr
label: har reviderere @da
label: hat Überarbeiterin/Überarbeiter @de
label: heeft herziener @nl
label: átdolgozója a következő: @hu
label: له مُراجع @ar
label: 有修订者 @zh-hans
definition: Bir kaynağı, içerikte değişiklik yaparak bir kaynağa katkıda bulunan bir temsilci ile ilişkilendirir. @tr
definition: Hozzákapcsol egy forrást egy ágenshez, amely a tartalom megváltoztatásával hozzájárul a forráshoz. @hu
definition: Liittää aineiston toimijaan, joka on aineistossa osallisena tekemällä muokkauksia aineiston sisältöön. @fi
definition: Relaterer en ressource til en agent, som bidrager til en ressource ved at lave ændringer til indholdet. @da
definition: Relates a resource to an agent who contributes to a resource by making changes to the content.
definition: Setzt eine Ressource in Beziehung zu einem Akteur, der zu einer Ressource beiträgt, indem er am Inhalt Veränderungen vornimmt. @de
definition: يربط مصدر بوكيل يُساهم في مصدر من خلال إجراء تغييرات في المحتوى. @ar
definition: 将一种资源与通过对内容作改动而对一种资源出贡献的一个行为者关联起来。 @zh-hans

has contributor agent to amalgamation
lexical alias: contributorAgentToAmalgamation.en
status: Published
type: Property
label: birleşmeye katkıda bulunan temsilci ile ilişkilidir @tr
label: har agent, som er bidragsyder til sammensmæltning @da
label: hat Beiträgerin/Beiträger zu einer Verschmelzung @de
label: heeft bijdrager-actor aan amalgamering @nl
label: vegyes tartalom közreműködő ágense a következő: @hu
label: yhdistymään osallinen toimija aineistossa @fi
label: له وكيل مساهم في دمج @ar
label: 有融合体的贡献者行为者 @zh-hans
inverse of: is contributor agent to amalgamation of
definition: Bir kaynağı, içerik türlerinin kesintisiz bir karışımı olan bir kaynağa katkıda bulunan bir temsilci ile ilişkilendirir. @tr
definition: Hozzákapcsol egy forrást egy ágenshez, amely egy olyan forráshoz járul hozzá, amely egy tartalom fajtáinak szabad keveréke. @hu
definition: Liittää aineiston toimijaan, joka osallistuu sellaisen aineiston tekemiseen, joka on saumaton yhdistelmä erilaisia sisältöjä. @fi
definition: Relaterer en ressource til en agent, som bidrager til en ressource, der er en sømløs blandning af ityper af indhold. @da
definition: Relates a resource to an agent who contributes to a resource that is a seamless mix of kinds of content.
definition: Setzt eine Ressource in Beziehung zu einem Akteur, der zu einer Ressource, die eine nahtlose Mischung von Inhalten darstellt, beiträgt. @de
definition: يربط مصدر بوكيل يُساهم في مصدر من خلال مزج سلس لأنواع من المحتوى. @ar
definition: 将一种资源与对作为各种内容无缝融合的一种资源作出贡献的一个行为者关联起来。 @zh-hans

has contributor agent to performance
lexical alias: contributorAgentToPerformanceContent.en
status: Published
type: Property
label: előadás közreműködő ágense a következő: @hu
label: esitykseen osallinen toimija aineistossa @fi
label: har agent, som er bidragsyder til performance @da
label: hat Beiträgerin/Beiträger zu einer Darbietung @de
label: heeft bijdrager-actor aan uitvoering @nl
label: performansa katkıda bulunan temsilci ile ilişkilidir @tr
label: له وكيل مساهم في أداء @ar
label: 有表演的贡献者行为者 @zh-hans
inverse of: is contributor agent to performance of
definition: Bir kaynağı, performans olan bir kaynağa katkıda bulunan bir temsilci ile ilişkilendirir. @tr
definition: Hozzákapcsol egy forrást egy ágenshez, amely hozzájárul egy forráshoz, amely egy előadás. @hu
definition: Liittää aineiston toimijaan, joka osallistuu sellaisen aineiston tekemiseen, joka on esitys. @fi
definition: Relaterer en ressource til en agent, wom bidrager til en ressource, der er en performance. @da
definition: Relates a resource to an agent who contributes to a resource that is a performance.
definition: Setzt eine Ressource in Beziehung zu einem Akteur, der zu einer Darbietung beiträgt. @de
definition: يربط مصدر بوكيل يساهم في مصدر عبارة عن أداء. @ar
definition: 将一种资源与对作为一种表演的一种资源作出贡献的一个行为者关联起来。 @zh-hans

has editor
lexical alias: editor.en
status: Published
type: Property
label: aineiston toimittaja @fi
label: editör ile ilişkilidir @tr
label: har udgiver @da
label: hat Herausgeberin/Herausgeber @de
label: heeft redacteur @nl
label: szerkesztője a következő: @hu
label: له محرر @ar
label: 有编者 @zh-hans
inverse of: is editor of text of (Deprecated)
definition: Bir kaynağı, tutarlılık, açıklık ve biçim gibi yayın standartlarını karşılamak için diğer temsilciler tarafından oluşturulan metni değiştirerek bir kaynağa katkıda bulunan bir temsilci ile ilişkilendirir. @tr
definition: Hozzákapcsol egy forrást egy ágenshez, amely hozzájárul egy forráshoz más ágensek által létrehozott szöveg módosításával, hogy az megfeleljen olyan publikációs szabályoknak, mint a következetesség, az egyértelműség és a stílus. @hu
definition: Liittää aineiston toimijaan, joka osallistuu aineiston tekemiseen tarkistamalla muiden toimijoiden luomaa sisältöä julkaisu- tai muiden käyttöstandardien saavuttamiseksi. @fi
definition: Relaterer en ressource til en agent, som bidrager til en ressource ved at ændre tekst skabt af andre agenter for at opfylde publikationsstandarder, som fx konsistens, klarhed og stil. @da
definition: Relates a resource to an agent who contributes to a resource by amending text created by other agents in order to meet publication standards such as consistency, clarity, and style,
definition: Setzt eine Ressource in Beziehung zu einem Akteur, der zu einer Ressource beiträgt, indem er Text verändert, der von anderen Akteuren erstellt wurde, um Publikationsstandards wie Konsistenz, Klarheit und Stil zu erfüllen. @de
definition: يربط مصدر بوكيل يُساهم في مصدر من خلال تعديل النص الذي تم إنشاؤه بواسطة وكلاء آخرين من أجل تلبية معايير النشر مثل الاتساق، الوضوح، والأسلوب. @ar
definition: 将一种资源与通过修正其他行为者创作的内容以满足出版标准（例如一致、清晰、风格）对一种资源作出贡献的一个行为者关联起来。 @zh-hans

has contributor agent to aggregate
lexical alias: contributorAgentToAggregatedContent.en
status: Published
type: Property
label: aggregaattiin osallinen toimija @fi
label: aggregátum közreműködő ágense a következő: @hu
label: har agent, som er bidragsyder til samling @da
label: hat Beiträgerin/Beiträger zu einem Aggregat @de
label: heeft bijdrager-actor aan aggregaat @nl
label: toplamaya katkıda bulunan temsilci ile ilişkilidir @tr
label: له كيل مساهم في تجميعة @ar
label: 有合集的贡献者行为者 @zh-hans
inverse of: is contributor agent to aggregate of
definition: Bir kaynağı, bir topluluk tarafından somutlaştırılan bir kaynak oluşturmaktan sorumlu olan temsilci ile ilişkilendirir. @tr
definition: Hozzákapcsol egy forrást egy ágenshez, amely egy aggregátumban megtestesülő forrást hoz létre. @hu
definition: Liittää aineiston toimijaan, joka vastaa aggregaattiin sisältyvän aineiston luomisesta. @fi
definition: Relaterer en ressource til en agent, som er ansvarlig for at skabe en ressource der er indeholdt i en samling. @da
definition: Relates a resource to an agent who is responsible for creating a resource that is embodied by an aggregate.
definition: Setzt eine Ressource in Beziehung zu einem Akteur, der für die Schaffung einer Ressource verantwortlich ist, die durch ein Aggregat verkörpert wird. @de
definition: يربط مصدر بوكيل مسؤول عن إنشاء مصدر يتجسد في تجميعية. @ar
definition: 将一种资源与负责创建被一种合集具体化的一种资源的一个行为者关联起来。 @zh-hans

aggregates
lexical alias: aggregates.en
status: Published
type: Property
label: Aggregate @de
label: aggregeert @nl
label: aggregoiva aineisto @fi
label: aggregálja @hu
label: samlinger @da
label: toplama @tr
label: متجمعات @ar
label: 合集 @zh-hans
definition: Bir kaynağı, toplayıcı bir kaynağın planının bir parçası olarak seçilen bir kaynakla ilişkilendirir. @tr
definition: Hozzákapcsol egy forrást egy forráshoz, amelyet egy aggregáló forrás tervének részeként választanak. @hu
definition: Liittää aineiston aineistoon, joka on valittu aggregoivan aineiston suunnitelmaan. @fi
definition: Relaterer en ressource til en ressource, som er valgt som en del af en plan for en samlende ressource. @da
definition: Relates a resource to a resource that is chosen as part of the plan of an aggregating resource.
definition: Setzt eine Ressource in Beziehung zu einer Ressource, die als Teil des Konzepts einer aggregierenden Ressource ausgewählt wird. @de
definition: يربط بين مصدر ومصدر تم اختياره كجزء من خطة تجميع مصدر. @ar
definition: 将一种资源与被选为一种合集性资源的计划之部分的一种资源关联起来。 @zh-hans

is aggregated by
lexical alias: aggregatedBy.en
status: Published
type: Property
label: aggregoitu aineisto @fi
label: aggregáltja a következőnek: @hu
label: er samlet af @da
label: is geaggregeerd door @nl
label: ist aggregiert von @de
label: tarafından toplanmıştır @tr
label: هو مُجَمَّع بواسطة @ar
label: 被……编制合集 @zh-hans
inverse of: aggregates
definition: Bir kaynağı, toplu bir kaynağın planının bir parçası olarak bir kaynağı toplayan bir kaynakla ilişkilendirir. @tr
definition: Hozzákapcsol egy forrást egy forráshoz, amely aggregál egy olyan forrást, amely az aggregáló forrás tervének a része. @hu
definition: Liittää aineiston aineistoon, joka aggregoi aineiston osaksi aggregoivan aineiston suunnitelmaa. @fi
definition: Relaterer en ressource til en ressource, som samler en ressource som en del af en samlende ressource. @da
definition: Relates a resource to a resource that aggregates a resource as part of the plan of an aggregating resource.
definition: Setzt eine Ressource in Beziehung zu einer Ressource, die eine Ressource als Teil des Konzepts einer aggregierenden Ressource aggregiert. @de
definition: يربط بين مصدر ومصدر يقوم بتجميع مصدر كجزء تجميع مصدر. @ar
definition: 将一种资源与把一种资源编制合集作为一种合集性资源的计划之部分的一种资源关联起来。 @zh-hans

has interactivity mode
lexical alias: interactivityMode.en
status: Published
type: Property
label: etkileşim modu ile ilişkilidir @tr
label: har interaktivitetstilstand @da
label: hat Interaktivitätsmodus @de
label: heeft interactiviteitsmodus @nl
label: interaktivitás módja a következő: @hu
label: vuorovaikutteisuuden aste aineistossa @fi
label: له أسلوب تفاعلي @ar
label: 有互动模式 @zh-hans
definition: Bir kaynağı, kullanıcı tarafından gerçekleştirilen eylemlere yanıt veren bir içerik kapasitesiyle ilişkilendirir. @tr
definition: Hozzákapcsol egy forrást a tartalom olyan adottságához, amely által képes válaszolni a felhasználó által végrehajtott műveletekre. @hu
definition: Liittää aineiston sisällön kykyyn vastata käyttäjän suorittamiin toimintoihin. @fi
definition: Relaterer en ressource til en kapacitet af indhold der svarer til handlinger udført af brugeren. @da
definition: Relates a resource to a capacity of content to respond to actions performed by the user.
definition: Setzt eine Ressource in Beziehung zu einer Fähigkeit von Inhalten, auf von Benutzenden ausgeführte Aktionen zu reagieren. @de
definition: يربط بين مصدر وقدرة المحتوى على الاستجابة للإجراءات التي يقوم بها المستخدم. @ar
definition: 将一种资源与内容对使用者的行动作出响应的能力关联起来。 @zh-hans

is aggregator of
has subproperty: is compiler of
lexical alias: aggregatorOf.en
status: Published
type: Property
label: aggregaattori (toimija) aineistossa @fi
label: aggregátora a következőnek: @hu
label: er samler af @da
label: is aggregator van @nl
label: ist Aggregator von @de
label: toplayıcısıdır @tr
label: هو مجمع لـ @ar
label: 是……的合集编者 @zh-hans
sub property of: is court reporter of
definition: Bir temsilciyi diğer kaynakları seçerek ve düzenleyerek toplamakla görevli bir temsilcinin sorumluluğunu içeren bir kaynakla ilişkilendirir. @tr
definition: Hozzákapcsol egy ágenst egy forráshoz, amelyhez hozzátartozik egy ágens felelőssége a más források kiválasztásával és elrendezésével járó aggregálásért. @hu
definition: Liittää toimijan aineistoon, jossa toimija vastaa aggregoivan teoksen luomisesta valitsemalla ja järjestämällä muita aineistoja. @fi
definition: Relaterer en agent til en ressource, som involverer et ansvar af at være agent for en samling ved at udvælge og ordne andre ressourcer. @da
definition: Relates an agent to a resource that involves a responsibility of an agent for aggregation by selecting and arranging other resources.
definition: Setzt einen Akteur in Beziehung zu einer Ressource, bei der ein Akteur für die Aggregation verantwortlich ist, indem er andere Ressourcen auswählt und zusammenstellt. @de
definition: يربط بين وكيل ومصدر ينطوي على مسؤولية وكيل عن اختيار وترتيب مصادر أخرى. @ar
definition: 将一个行为者与涉及把其他资源选择和整理后编制合集的一个行为者的责任的一种资源关联起来。 @zh-hans

has aggregator
has subproperty: has compiler
lexical alias: aggregator.en
status: Published
type: Property
label: aggregátora a következő: @hu
label: aineiston aggregaattori @fi
label: har samler @da
label: hat Aggregator @de
label: heeft aggregator @nl
label: toplayıcı ile ilişkilidir @tr
label: له مجمع @ar
label: 有合集编者 @zh-hans
sub property of: has creator
inverse of: is aggregator of
definition: Bir kaynağı, diğer kaynakları seçerek ve düzenleyerek bir toplama kaynağı oluşturmaktan sorumlu olan bir temsilci ile ilişkilendirir. @tr
definition: Hozzákapcsol egy forrást egy ágenshez, amely felelős egy aggregáló forrás létrehozásáért, más források kiválasztása és elrendezése révén. @hu
definition: Liittää aineiston toimijaan, joka vastaa aggregoivan teoksen luomisesta valitsemalla ja järjestämällä muita aineistoja. @fi
definition: Relaterer en ressource til en agent, som er ansvarlig for at skabe en samlende ressource, ved at udvælge og ordne andre ressourcer. @da
definition: Relates a resource to an agent who is responsible for creating an aggregating resource by selecting and arranging other resources.
definition: Setzt eine Ressource in Beziehung zu einem Akteur, der für die Erstellung einer aggregierenden Ressource verantwortlich ist, indem er andere Ressourcen auswählt und zusammenstellt. @de
definition: يربط مصدر بوكيل مسؤول عن إنشاء مصدر مجمع عن طريق اختيار وترتيب مصادر أخرى. @ar
definition: 将一种资源与负责把其他资源选择和整理后创建一种合集性资源的一个行为者关联起来。 @zh-hans

has criminal defendant
lexical alias: criminalDefendant.en
status: Published
type: Property
label: büntetőeljárás vádlottja a következő: @hu
label: har sagsøgt @da
label: hat Angeklagte/Angeklagten in einem Strafverfahren @de
label: heeft criminele verdachte @nl
label: sanık ile ilişkilidir @tr
label: vastaaja rikosoikeudessa @fi
label: له مُدَّعَى عليه جنائيًا @ar
label: 有刑事被告 @zh-hans
sub property of: has defendant
definition: Bir kaynağı, ceza davasında suçlanan bir temsilci ile ilişkilendirir. @tr
definition: Hozzákapcsol egy forrást egy ágenshez, akit egy büntetőeljárásban vádolnak. @hu
definition: Liittää aineiston toimijaan, joka on syytettynä rikosprosessissa. @fi
definition: Relaterer en ressource til en agent, som er sagsøgt i en straffesag. @da
definition: Relates a resource to an agent who is accused in a criminal proceeding.
definition: Setzt eine Ressource in Beziehung zu einem Akteur, der in einem Strafverfahren angeklagt ist. @de
definition: يربط مصدر بوكيل متهم في دعوى جنائية. @ar
definition: 将一种资源与在一项刑事诉讼中被指控的一个行为者关联起来。 @zh-hans

is criminal defendant of
lexical alias: criminalDefendantOf.en
status: Published
type: Property
label: bűnvádi eljárás alperese a következőnek: @hu
label: er sagsøgt af @da
label: is criminele verdachte van @nl
label: ist Angeklagte/Angeklagter in einem Strafverfahren von @de
label: sanığıdır @tr
label: toimija vastaajana rikosoikeudessa @fi
label: هو مُدَّعَى عليه جنائيًا @ar
label: 是……的刑事被告 @zh-hans
sub property of: is defendant of
inverse of: has criminal defendant
definition: Bir temsilciyi, bir ceza davasında suçlanmaya ilişkin bir temsilcinin sorumluluğunu içeren bir kaynakla ilişkilendirir. @tr
definition: Hozzákapcsol egy ágenst egy forráshoz, amelyhez hozzátartozik annak felelőssége, hogy egy ágenst egy büntetőeljárásban megvádolnak. @hu
definition: Liittää toimijan aineistoon, johon liittyy toimijan asema rikosprosessin syytettynä. @fi
definition: Relaterer en agent til en ressource, som involverer et agentansvar af at være sagsøgt i en straffesag. @da
definition: Relates an agent to a resource that involves a responsibility of an agent for being accused in a criminal proceeding.
definition: Setzt einen Akteur in Beziehung zu einer Ressource, die mit einer Verantwortung verbunden ist, als Akteur in einem Strafverfahren angeklagt zu sein. @de
definition: يربط بين وكيل ومصدر ينطوي على مسؤولية وكيل عن اتهامه في دعوى جنائية. @ar
definition: 将一个行为者与涉及在一项刑事诉讼中被指控的一个行为者的责任的一种资源关联起来。 @zh-hans

has civil defendant
lexical alias: civilDefendant.en
status: Published
type: Property
label: har civilretligt sagsøgt @da
label: hat Beklagte/Beklagten in einem Zivilverfahren @de
label: heeft burgerlijke verweerder @nl
label: polgári eljárás vádlottja a következő: @hu
label: sivil davalı ile ilişkilidir @tr
label: vastaaja siviilioikeudessa @fi
label: له مُدَّعَى عليه مدنيًا @ar
label: 有民事被告 @zh-hans
sub property of: has defendant
definition: Bir kaynağı, bir hukuk davasında dava edilen temsilci ile ilişkilendirir. @tr
definition: Hozzákapcsol egy forrást egy ágenshez, akit egy polgári eljárásban perbe fognak. @hu
definition: Liittää aineiston toimijaan, joka on syytettynä siviilioikeusprosessissa. @fi
definition: Relaterer en ressource til en agent, som er sagsøgt i en civilretlig sag. @da
definition: Relates a resource to an agent who is sued in a civil proceeding.
definition: Setzt eine Ressource in Beziehung zu einem Akteur, der in einem Zivilverfahren verklagt wird. @de
definition: يربط مصدر بوكيل رُفعت ضده دعوى مدنية. @ar
definition: 将一种资源与在一项民事诉讼中被指控的一个行为者关联起来。 @zh-hans

is civil defendant of
lexical alias: civilDefendantOf.en
status: Published
type: Property
label: er civilretligt sagsøgt af @da
label: hukuki davalısıdır @tr
label: is burgerlijke verweerder van @nl
label: ist Beklagte/Beklagter in einem Zivilverfahren von @de
label: polgári eljárás alperese a következőnek: @hu
label: toimija vastaajana siviilioikeudessa @fi
label: هو مُدَّعَى عليه مدنيًا لـ @ar
label: 是……的民事被告 @zh-hans
sub property of: is defendant of
inverse of: has civil defendant
definition: Bir temsilciyi, bir hukuk davasında dava edilmeye ilişkin bir temsilcinin sorumluluğunu içeren bir kaynakla ilişkilendirir. @tr
definition: Hozzákapcsol egy ágenst egy forráshoz, amelyhez hozzátartozik annak felelőssége, hogy egy ágenst egy polgári jogi eljárásban beperelnek. @hu
definition: Liittää toimijan aineistoon, johon liittyy toimijan asema siviilioikeusprosessin syytettynä. @fi
definition: Relaterer en agent til en ressource, som involverer et agentansvar af at være sagsøgt i en civilretlig sag. @da
definition: Relates an agent to a resource that involves a responsibility of an agent for being sued in a civil proceeding.
definition: Setzt einen Akteur in Beziehung zu einer Ressource, die mit einer Verantwortung verbunden ist, als Akteur in einem Zivilverfahren verklagt zu werden. @de
definition: يربط بين وكيل ومصدر ينطوي على مسؤولية وكيل عن مقاضاته في دعوى مدنية. @ar
definition: 将一个行为者与涉及在一项民事诉讼中被控告的一个行为者的责任的一种资源关联起来。 @zh-hans

has academic supervisor
lexical alias: academicSupervisor.en
status: Published
type: Property
label: akademik danışman ile ilişkilidir @tr
label: akateeminen ohjaaja (toimija) aineistossa @fi
label: har akademisk vejleder @da
label: hat akademische Betreuerin/akademischen Betreuer @de
label: heeft academische begeleider @nl
label: tudományos témavezetője a következő: @hu
label: له مُشرف أكاديمي @ar
label: 有学术主管 @zh-hans
definition: Hozzákapcsol egy forrást egy ágenshez, amely felelős bármilyen tudományos tevékenység felügyeletéért, amelynek eredménye egy forrás, szakdolgozatokat, kutatást és projekteket is beleértve. @hu
definition: Liittää aineiston toimijaan, joka vastaa kaikenlaisen aineistoon johtavan akateemisen toiminnan valvonnasta, mukaan lukien tutkielmat, tutkimukset ja projektit. @fi
definition: Relaterer en ressource til en agent, som er ansvarlig for at føre tilsyn med akademisk aktivitet af enhver art, der resulterer i en ressource, herunder afhandlinger, forskning og projekter. @da
definition: Relates a resource to an agent who is responsible for overseeing academic activity of any kind that results in a resource, including theses, research, and projects.
definition: Setzt eine Ressource in Beziehung zu einem Akteur, der akademische Tätigkeiten jeglicher Art betreut, die zu einer Ressource führen. Darunter fallen Hochschulschriften, Forschungen und Projekte. @de
definition: Tezler, araştırmalar ve projeler de dahil olmak üzere bir kaynağı, kaynakla sonuçlanan her türlü akademik faaliyeti denetlemekten sorumlu olan bir temsilci ile ilişkilendirir. @tr
definition: يربط مصدر بوكيل مسؤول عن الإشراف على نشاط أكاديمي من أي نوع يسفر عن مصدر، ويشمل ذلك الأطروحات والبحوث والمشاريع. @ar
definition: 将一种资源与负责导致一种资源的各种学术活动（包括论文、研究和项目）之监督的一个行为者关联起来。 @zh-hans

has extension plan
lexical alias: extensionPlan.en
status: Published
type: Property
label: aineiston laajennussuunnitelma @fi
label: genişletme planı ile ilişkilidir @tr
label: har udvidelsesplan @da
label: hat Erweiterungsplan @de
label: heeft extensieplan @nl
label: közzétételi terve a következő: @hu
label: له خطة توسع @ar
label: 有扩充计划 @zh-hans
definition: Bir kaynağı, bir kaynağın içeriğini genişletme hedefini yansıtan bir sınıflandırmayla ilişkilendirir. @tr
definition: Hozzákapcsol egy forrást egy kategorizáláshoz, amely tükröz egy forrás tartalmának közzétételére vonatkozó szándékot. @hu
definition: Liitää aineiston kategorisointiin, joka ilmaisee aikomuksen laajentaa aineiston sisältöä. @fi
definition: Relaterer en ressource til en kategorisering, som afspejler en hensigt om at udvide indholdet af en ressource. @da
definition: Relates a resource to a categorization reflecting an intention to extend the content of a resource.
definition: Setzt eine Ressource in Beziehung zu einer Kategorisierung der Absicht, ob beziehungsweise wie der Inhalt einer Ressource erweitert werden soll. @de
definition: يربط بين مصدر وفئة تعكس نية لتوسيع محتوى مصدر. @ar
definition: 将一种资源与反映扩充一种资源之内容的意向的一种类别关联起来。 @zh-hans

has research supervisor
lexical alias: researchSupervisor.en
status: Published
type: Property
label: araştırma danışmanı ile ilişkilidir @tr
label: har forskningsvejleder @da
label: hat Betreuerin/Betreuer von Forschungstätigkeiten @de
label: heeft onderzoeksbegeleider @nl
label: kutatás témavezetője a következő: @hu
label: tutkimuksen ohjaaja aineistossa @fi
label: له مشرف بحث @ar
label: 有研究主管 @zh-hans
inverse of: is research supervisor of
definition: Bir kaynağı, bir kaynakla sonuçlanan araştırmaya danışmanlık yapmaktan veya denetlemekten sorumlu olan bir akademik danışmanla ilişkilendirir. @tr
definition: Hozzákapcsol eggy forrást egy témavezetőhöz, aki egy olyan kutatás tanácsadója és témavezetője, amely egy forrást eredményez. @hu
definition: Liittää toimijan akateemiseen ohjaajaan, joka vastaa aineistoon johtavan tutkimuksen valvomisesta tai tutkimuksessa neuvomisesta. @fi
definition: Relaterer en ressource til en akademisk vejleder, som er ansvarlig for at rådgive @da
definition: Relates a resource to an academic supervisor who is responsible for advising or supervising research that results in a resource.
definition: Setzt eine Ressource in Beziehung zu einer akademischen Betreuerin/einem akademischen Betreuer, die/der Forschungstätigkeiten beaufsichtigt oder betreut, die zu einer Ressource führen. @de
definition: يربط مصدر بمشرف أكاديمي مسؤول عن تقديم المشورة أو الإشراف على الأبحاث التي تؤدي إلى مصدر. @ar
definition: 将一种资源与负责为导致一种作品的研究作咨询和监督的一个学术主管关联起来。 @zh-hans

has scope of validity
lexical alias: scopeOfValidity.en
status: Published
type: Property
label: aineiston voimassaoloaika @fi
label: geçerlilik kapsamı ile ilişkilidir @tr
label: har gyldighedsomfang @da
label: hat Gültigkeitsbereich @de
label: heeft scope van validiteit @nl
label: érvényes alkalmazási területe a következő: @hu
label: له نطاق صلاحية @ar
label: 有适用范围 @zh-hans
definition: Bir kaynağı, bir üst veri kaynağının değerinin geçerli olduğu bir kaynak aralığının yapılandırılmamış veya yapılandırılmış bir tanımıyla ilişkilendirir. @tr
definition: Hozzákapcsol egy forrást egy forrástartomány struktúrálatlan vagy struktúrált leírásához, amelyre érvényes egy metaadatforrás értéke. @hu
definition: Liittää aineiston rakenteistettuun tai rakenteistamattomaan kuvaukseen aineistojen aikavälistä, jonka ajan metatietoaineiston arvo on voimassa. @fi
definition: Relaterer en ressource til en ustruktureret eller struktureret beskrivelse af en række ressourcer, for hvilke værdien af en metadataressource er gyldig. @da
definition: Relates a resource to an unstructured or structured description of a range of resources for which the value of a metadata resource is valid.
definition: Setzt eine Ressource in Beziehung zu einer unstrukturierten oder strukturierten Beschreibung eines breiten Spektrums von Ressourcen, für die der Wert einer Metadatenressource gültig ist. @de
definition: يربط بين مصدر ووصف غير مهيكل أو مهيكل لمجموعة من الأعمال التي تكون قيمة مصدر الميتاداتا صالحة لها. @ar
definition: 将一种资源与一种元数据资源的取值对其有效的资源范围的非结构化或结构化描述关联起来。 @zh-hans

has recording source
lexical alias: recordingSource.en
status: Published
type: Property
label: har optagelsesressource @da
label: hat Aufnahmequelle @de
label: heeft bron van overname @nl
label: kayıt kaynağı ile ilişkilidir @tr
label: merkinnän lähde @fi
label: rögzítési forrása a következő: @hu
label: له مصدر تسجيل @ar
label: 有记录信息源 @zh-hans
definition: Bir kaynağı, açıklanan bir kaynaktan yazıya aktarılan yapılandırılmamış bir tanım olan üst veri kaynağı için bir bilgi kaynağıyla ilişkilendirir. @tr
definition: Hozzákapcsol egy forrást egy metaadatforrás adatforrásához, amely egy forrás leírásából átírt, struktúrálatlan leírás. @hu
definition: Liittää aineiston metatietoaineiston tietolähteeseen, joka on kuvailtavasta aineistosta transkriboitu rakenteistamaton kuvailu. @fi
definition: Relaterer en ressource til en informationskilde for en metadataressource, der er en ustruktureret beskrivelse transkiberet fra en ressource, der beskrives. @da
definition: Relates a resource to a source of information for a metadata resource that is an unstructured description transcribed from a resource being described.
definition: Setzt eine Ressource in Beziehung zu einer Informationsquelle für eine Metadatenressource, bei der es sich um eine unstrukturierte Beschreibung handelt, die aus einer beschriebenen Ressource transkribiert ist. @de
definition: يربط بين مصدر ومصدر معلومات لمصدر ميتاداتا الذي يعد وصفًا غير مهيكل يتم نسخه من مصدر يتم وصفها. @ar
definition: 将一种资源与一种元数据资源（即转录自被描述资源的非结构化描述）的一个信息源关联起来。 @zh-hans

has source consulted
lexical alias: sourceConsulted.en
status: Published
type: Property
label: başvurulan kaynak ile ilişkilidir @tr
label: felhasznált forrása a következő: @hu
label: har konsulteret kilde @da
label: hat konsultierte Quelle @de
label: heeft geraadpleegde bron @nl
label: käytetty lähde @fi
label: له مصدر استشارة @ar
label: 有被查阅的信息源 @zh-hans
inverse of: is source consulted of
definition: Bir kaynağı, içinde bir üst veri kaynağı için bilgi bulunan bir kaynakla ilişkilendirir. @tr
definition: Hozzákapcsol egy forrást egy forráshoz, amelyben egy metaadatforrást alátámasztó bizonyíték található. @hu
definition: Liittää aineiston aineistoon, jossa on todiste metatietoaineistolle. @fi
definition: Relaterer en ressource til en ressource i hvilken der er evidens for en metadataressource. @da
definition: Relates a resource to a resource in which there is evidence for a metadata resource.
definition: Setzt eine Ressource in Beziehung zu einer Ressource, die Hinweise auf eine Metadatenressource enthält. @de
definition: يربط بين مصدر ومصدر يوجد فيه دليل على مصدر الميتاداتا. @ar
definition: 将一种资源与其中有元数据资源之证据的一种资源关联起来。 @zh-hans

has project supervisor
lexical alias: projectSupervisor.en
status: Published
type: Property
label: har projektvejleder @da
label: hat Projektbetreuerin/Projektbetreuer @de
label: heeft projectbegeleider @nl
label: proje danışmanı ile ilişkilidir @tr
label: projekt témavezetője a következő: @hu
label: projektin ohjaaja aineistossa @fi
label: له مشرف مشروع @ar
label: 有项目主管 @zh-hans
inverse of: is project supervisor of
definition: Bir kaynağı, bir öğrenci tarafından üstlenilen ve bir kaynakla sonuçlanan bir projeye danışmanlık yapmaktan veya denetlemekten sorumlu olan bir akademik danışmanla ilişkilendirir. @tr
definition: Hozzákapcsol egy forrást egy témavezetőhöz, aki egy olyan hallgató által vállalt projekt tanácsadója és témavezetője, amely egy forrást eredményez. @hu
definition: Liittää aineiston akateemiseen ohjaajaan, joka vastaa neuvonnasta tai valvonnasta opiskelijan projektissa, jonka tuloksena on aineisto. @fi
definition: Relaciona un recurs amb un agent que és un supervisor acadèmic que és responsable d’assessorar o supervisar un projecte emprès per un estudiant que dona com a resultat un recurs. @ca
definition: Relaterer en ressource til en akademisk vejleder, som er ansvarlig for at rådgive eller vejlede et projekt, der udføres af en student, og som resulterer i en ressource. @da
definition: Relates a resource to an agent who is an academic supervisor who is responsible for advising or supervising a project undertaken by a student that results in a resource.
definition: Setzt eine Ressource in Beziehung zu einer akademischen Betreuerin/einem akademischen Betreuer, die/der für die Betreuung und Aufsicht eines Projekts einer Studentin/eines Studenten verantwortlich ist, das zu einer Ressource führt. @de
definition: يربط مصدر بمشرف أكاديمي يكون مسؤولاً عن تقديم المشورة أو الإشراف على مشروع يقوم به الطالب وينتج عنه مصدر. @ar
definition: 将一种资源与负责为导致一种资源的学生所做的项目作咨询和监督的作为学术主管的一个行为者关联起来。 @zh-hans

is research supervisor of
lexical alias: researchSupervisorOf.en
status: Published
type: Property
label: araştırma danışmanıdır @tr
label: er forskningsvejleder af @da
label: is onderzoeksbegeleider van @nl
label: ist Betreuerin/Betreuer von Forschungstätigkeiten von @de
label: kutatási témavezetője a következőnek: @hu
label: tutkimuksen ohjaaja aineistossa @fi
label: هو مشرف بحث لـ @ar
label: 是……的研究主管 @zh-hans
inverse of: has research supervisor
definition: Bir temsilciyi, bir kaynakla sonuçlanan araştırmanın akademik danışmanı olarak sorumluluk içeren bir kaynakla ilişkilendirir. @tr
definition: Hozzákapcsol egy ágenst egy forráshoz, amely magában foglalja egy tudományos témavezető a felelősségét egy kutatásért, amely egy művet eredményez. @hu
definition: Liittää toimijan aineistoon, jossa akateeminen ohjaaja vastaa tutkimuksesta, jonka tuloksena on aineisto. @fi
definition: Relaterer en agent til en ressource, som involverer en akademisk forskningsvejleder, og som resulterer i en ressource. @da
definition: Relates an agent to a resource that involves a responsibility as an academic supervisor of research that results in a resource.
definition: Setzt einen Akteur in Beziehung zu einer Ressource, bei der eine akademische Betreuerin/ein akademischer Betreuer dafür verantwortlich ist, die Forschungstätigkeiten zu beaufsichtigen oder zu betreuen, die zu einer Ressource führen. @de
definition: يربط بين وكيل ومصدر ينطوي على تحمل المسؤولية بصفته مُشرف أكاديمي على الأبحاث التي تؤدي إلى مصدر. @ar
definition: 将一个行为者与涉及导致一种资源的一项研究的学术主管之责任的一种资源关联起来。 @zh-hans

is project supervisor of
lexical alias: projectSupervisorOf.en
status: Published
type: Property
label: er projektvejleder af @da
label: is projectbegeleider van @nl
label: ist Projektbetreuerin/Projektbetreuer von @de
label: proje danışmanıdır @tr
label: projektin ohjaaja aineistossa @fi
label: projektvezetője a következőnek: @hu
label: هو مشرف مشروع لـ @ar
label: 是……的项目主管 @zh-hans
inverse of: has project supervisor
definition: Bir temsilciyi, bir kaynakla sonuçlanan bir öğrencinin üstlendiği projenin akademik danışmanı olarak sorumluluk içeren bir kaynakla ilişkilendirir. @tr
definition: Hozzákapcsol egy ágenst egy forráshoz, amely magában foglalja egy projekt tudományos témavezetőjének a felelősségét, amely egy diák által készített művet eredményez. @hu
definition: Liittää toimijan aineistoon, jossa toimija akateemisena ohjaajana vastaa opiskelijan projektista, jonka tuloksena on aineisto. @fi
definition: Relaterer en agent til en ressource, som involverer et ansvar som akademisk vejleder af et projekt, der udføres af en strudent, og som resulterer i en ressource. @da
definition: Relates an agent to a resource that involves a responsibility as an academic supervisor of a project undertaken by a student that results in a resource.
definition: Setzt einen Akteur in Beziehung zu einer Ressource, bei der eine akademische Betreuerin/ein akademischer Betreuer dafür verantwortlich ist, ein Projekt einer Studentin/eines Studenten zu beaufsichtigen oder zu betreuen, das zu einer Ressource führt. @de
definition: يربط بين وكيل ومصدر ينطوي على تحمل المسؤولية بصفته مشرف أكاديمي على مشروع ينفذه طالب يُسفر عن مصدر. @ar
definition: 将一个行为者与涉及导致一种资源的学生所做的项目的学术主管之责任的一种资源关联起来。 @zh-hans

has groove pitch
lexical alias: groovePitch.en
status: Published
type: Property
label: barázdamagassága a következő: @hu
label: har rilledybde @da
label: hat Rillenabstand @de
label: heeft groefpitch @nl
label: oluk aralığı ile ilişkilidir @tr
label: urajako aineistossa @fi
label: له مسار أسطوانة @ar
label: 有槽纹间距 @zh-hans
sub property of: has groove characteristic
definition: Bir kaynağı, bir analog silindirin oluk aralığıyla ilişkilendirir. @tr
definition: Hozzákapcsol egy forrást egy analóg henger barázdamagasságához. @hu
definition: Liittää aineiston äänilieriön urajakoon. @fi
definition: Relaterer en ressource til en rilledybde i en analog cylinder. @da
definition: Relates a resource to a groove pitch of an analog cylinder.
definition: Setzt eine Ressource in Beziehung zu einem Abstand zwischen den Rillen eines Phonographenzylinders. @de
definition: يربط بين مصدر ومسارات مفحورة على اسطوانة تناظرية. @ar
definition: 将一种资源与模拟筒的纹槽间距关联起来。 @zh-hans

has groove width
lexical alias: grooveWidth.en
status: Published
type: Property
label: barázdaszélessége a következő: @hu
label: har rillebredde @da
label: hat Rillenbreite @de
label: heeft groefwijdte @nl
label: oluk genişliği ile ilişkilidir @tr
label: uran leveys aineistossa @fi
label: له عرض مسار قرص @ar
label: 有槽纹宽度 @zh-hans
sub property of: has groove characteristic
definition: Bir kaynağı, bir analog diskin oluk genişliğiyle ilişkilendirir. @tr
definition: Hozzákapcsol egy forrást egy analóg lemez barázdaszélességéhez. @hu
definition: Liittää aineiston analogisen levyn uran leveyteen. @fi
definition: Relaterer en ressource til en rillebredde på en analog disc. @da
definition: Relates a resource to a groove width of an analog disc.
definition: Setzt eine Ressource in Beziehung zu einer Breite der Rillen auf einer Schallplatte. @de
definition: يربط بين مصدر وعرض المسار لقرص تناظري. @ar
definition: 将一种资源与模拟盘的槽纹宽度关联起来。 @zh-hans

is source consulted of
lexical alias: sourceConsultedOf.en
status: Published
type: Property
label: başvuru kaynağıdır @tr
label: er kilde konsulteret af @da
label: felhasznált forrása a következőnek: @hu
label: is bron geraadpleegd van @nl
label: ist konsultierte Quelle von @de
label: käytetty lähde metatietoaineistossa @fi
label: هو مصدر استشارة لـ @ar
label: 是……的被查阅的信息源 @zh-hans
inverse of: has source consulted
definition: Bir kaynağı, kaynağın kanıt sağladığı bir üstveri kaynağı olan bir kaynakla ilişkilendirir. @tr
definition: Hozzákapcsol egy forrást egy olyan metaadatforráshoz, amelyhez egy forrás bizonyítékot szolgáltat. @hu
definition: Liittää aineiston metatietoaineistoon, jonka todisteena aineisto on. @fi
definition: Relaterer en ressource til en ressource, som er en metadataressource, som en ressource giver evidens for. @da
definition: Relates a resource to a resource that is a metadata resource for which a resource provides evidence.
definition: Setzt eine Ressource in Beziehung zu einer Metadatenressource, für die eine Ressource den Nachweis erbringt. @de
definition: يربط بين مصدر ومصدر هو عبارة عن مصدر ميتاداتا حيث يعطي مصدر حجة أو برهانًا له. @ar
definition: 将一种资源与作为一种元数据资源而且一种资源提供其证据的一种资源关联起来。 @zh-hans

is copyright date of
lexical alias: copyrightDateOf.en
status: Published
type: Property
label: aineiston copyright-vuosi @fi
label: copyright éve a következőnek: @hu
label: er copyrightdato for @da
label: is copyrightdatum van @nl
label: ist Copyright-Datum von @de
label: telif tarihidir @tr
label: هو تاريخ حقوق نشر لـ @ar
label: 是……的版权日期 @zh-hans
inverse of: has copyright date
definition: Bir zaman aralığını, bir zaman aralığı boyunca telif hakkı veya benzer bir sistem kapsamında koruma talebiyle bağlantılı olan bir kaynakla ilişkilendirir. @tr
definition: Hozzákapcsol egy időtartamot egy forráshoz, amelyet a copyright vagy egy hasonló szabályrendszer alapján egy időtartam alatt támasztott védelmi igényhez társítanak. @hu
definition: Liittää ajanjakson aineistoon, johon liittyy copyright-säädösten tai vastaavien säädösten alainen copyright-suojaus ajanjakson aikana. @fi
definition: Relaterer et tidsforløb til en ressource, som er forbundet med et krav om beskyttelse under ophavsret eller en lignende ordning under et tidsforløb. @da
definition: Relates a timespan to a resource that is associated with a claim of protection under copyright or a similar regime during a timespan.
definition: Setzt einen Zeitraum in Beziehung zu einer Ressource, die mit einem Schutzanspruch nach dem Urheberrecht oder einem ähnlichen Regelwerk während eines Zeitraums in Verbindung steht. @de
definition: يربط بين فترة زمنية ومصدر مرتبط بطلب حماية تحت حقوق نشر أو نظام مشابه خلال فترة زمنية. @ar
definition: 将一个时间段与和在一个时间段中根据版权或类似管理制度的保护声明有关的一种资源关联起来。 @zh-hans

is duration of (Deprecated)
lexical alias: durationOf.en
status: Deprecated
type: Property
label: kesto @fi
inverse of: has duration
definition: Liittää ajanjakson aineistoon, jolla on soittoaika, esitysaika, toistoaika tai muu kestoaika. @fi
definition: Relates a timespan to a resource that has an extent of resource that is a playing time, performance time, running time, or other timespan. (Deprecated)

is year degree granted of
lexical alias: yearDegreeGrantedOf.en
status: Published
type: Property
label: derecesinin verildiği yıldır @tr
label: er årstal for tildelning af grad af @da
label: is jaar graad toegekend van @nl
label: ist Jahr, in dem ein akademischer Grad verliehen wird von @de
label: oppiarvon myöntämisvuosi @fi
label: évben fokozatott kapott a következő: @hu
label: هو عام منح درجة لـ @ar
label: 是……的学位授予年 @zh-hans
inverse of: has year degree granted
definition: Bir zaman aralığını, bir zaman aralığında derece veren bir kurum veya fakülte tarafından verilen bir akademik derece olan bir kaynakla ilişkilendirir. @tr
definition: Hozzákapcsol egy időtartamot egy forráshoz, amely egy tudományos fokozat, amelyet egy időtartam alatt egy adományozó intézmény vagy kar adott. @hu
definition: Liittää ajanjakson aineistoon, joka on opinnäyte, joka liittyy laitoksen tai tiedekunnan ajanjakson aikana myöntämään akateemiseen oppiarvoon. @fi
definition: Relaterer et tidsforløb til en ressource, som er en akademisk grad, tildelt af en gradtildelende institution eller fakultet under et tidsforløb. @da
definition: Relates a timespan to a resource that is an academic degree conferred by a granting institution or faculty during a timespan.
definition: Setzt einen Zeitraum in Beziehung zu einer Hochschulschrift, für die in einem Zeitraum ein akademischer Grad von einer Institution oder Fakultät verliehen wird. @de
definition: يربط بين فترة زمنية ومصدر هو عبارة عن درجة أكاديمية مُنحت بواسطة معهد أو كلية مانحة خلال فترة زمنية. @ar
definition: 将一个时间段与作为一种和在一个时间段内由授予机构或授予院系授予之学位的一种资源关联起来。 @zh-hans

is abbreviated title of
lexical alias: abbreviatedTitleOf.en
status: Published
type: Property
label: aineiston lyhennetty nimeke @fi
label: er forkortet titel af @da
label: is afgekorte titel van @nl
label: ist Kurztitel von @de
label: kısaltımış başlığıdır @tr
label: rövidített címe a következőnek: @hu
label: هو عنوان مختصر لـ @ar
label: 是……的缩略题名 @zh-hans
inverse of: has abbreviated title
definition: Bir ismi, dizin oluşturma veya tanımlama amacıyla kısaltılmış kaynak başlığına sahip bir kaynakla ilişkilendirir. @tr
definition: Hozzákapcsol egy noment egy forráshoz, amelynek címét indexelés vagy azonosítás céljából rövidítették. @hu
definition: Liittää nomenin aineistoon, jolla on indeksointia tai tunnistamista varten lyhennetty nimeke. @fi
definition: Relaterer ett nomen til en ressource, som har en ressourcetitel, der er blevet forkortet med henblik på indeksering eller identifikation. @da
definition: Relates a nomen to a resource that has a title of resource that has been abbreviated for purposes of indexing or identification.
definition: Setzt ein Nomen in Beziehung zu einer Ressource, die einen Titel einer Manifestation hat, der zum Zwecke der Indexierung oder der Identifizierung gekürzt wurde. @de
definition: يربط تسمية بمصدر له عنوان مصدر تم اختصاره لغرض التكشيف أو التعريف. @ar
definition: 将一个命名与有用于索引或标识目的被缩略的资源题名的一种资源关联起来。 @zh-hans

is alternate identity of
lexical alias: alternateIdentityOf.en
status: Published
type: Property
label: alternatif kimliğidir @tr
label: alternatív identitása a következőnek: @hu
label: er alternativ identitet til @da
label: is alternatieve identiteit van @nl
label: ist andere Identität von @de
label: toinen identiteetti @fi
label: هي هوية بديلة لشخص لـ @ar
label: 是……的交替身份 @zh-hans
definition: Bir ismi, takma isim veya başka bir varsayılan kimlik olan bir temsilci unvanına sahip bir temsilciyle ilişkilendirir. @tr
definition: Hozzákapcsol egy noment egy ágenshez, amelynek olyan ágensmegnevezése van, amely álnév vagy más feltételezett identitás. @hu
definition: Liittää nomenin toimijaan, jonka nimitys on pseudonyymi tai muu omaksuttu identiteetti. @fi
definition: Relaterer et nomen til en agent, som har en benævnelse for agent, der er et pseudonym eller anden antaget identitet. @da
definition: Relates a nomen to an agent who has an appellation of agent that is a pseudonym or other assumed identity.
definition: Setzt ein Nomen in Beziehung zu einem Akteur, der über eine Bezeichnung für einen Akteur verfügt, bei der es sich um ein Pseudonym oder eine andere angenommene Identität handelt. @de
definition: يربط بين تسمية ووكيل له تسمية وكيل عبارة عن اسم مستعار أو أي هوية مفترضة أخرى. @ar
definition: 将一个命名与有化名或其他假定身份作为行为者称谓的一个行为者关联起来。 @zh-hans

is real identity of
lexical alias: realIdentityOf.en
status: Published
type: Property
label: er reel identitet af @da
label: gerçek kimliğidir @tr
label: is echte identiteit van @nl
label: ist wirkliche Identität von @de
label: todellinen identiteetti @fi
label: valódi identitása a következőnek: @hu
label: هي هوية حقيقية لـ @ar
label: 是……的真实身份 @zh-hans
definition: Bir ismi, gerçek bir kimlik olan temsilci sıfatına sahip bir temsilciyle ilişkilendirir. @tr
definition: Hozzákapcsol egy noment egy ágenshez, amelynek van egy olyan megnevezése az ágens számára, amely a valódi identitása. @hu
definition: Liittää nomenin toimijaan, jonka nimitys on todellinen identiteetti. @fi
definition: Relaterer et nomen til en agent, som har en benævnelse for agent, der er en reel identitet. @da
definition: Relates a nomen to an agent who has an appellation of agent that is a real identity.
definition: Setzt ein Nomen in Beziehung zu einem Akteur, der über eine Bezeichnung für einen Akteur verfügt, bei der es sich um eine wirkliche Identität handelt. @de
definition: يربط بين تسمية ووكيل له تسمية وكيل عبارة عن هوية حقيقية. @ar
definition: 将一个命名与有真实身份作为行为者称谓的一个行为者关联起来。 @zh-hans

has part nomen
lexical alias: partNomen.en
status: Published
type: Property
label: har delnomen @da
label: hat Teil-Nomen @de
label: heeft deel nomen @nl
label: isim bileşeni ile ilişkilidir @tr
label: nomenin osa @fi
label: résznomenje a következő: @hu
label: لها تسمية جزئية @ar
label: 有部分命名 @zh-hans
inverse of: is part of nomen
definition: Bir ismi, başka bir ismin ayrı bir parçası olan bir isimle ilişkilendirir. @tr
definition: Hozzákapcsol egy noment egy nomenhez, amely egy másik nomen elkülöníthető alkotóeleme. @hu
definition: Liittää nomenin nomeniin, joka on itsenäinen osa toista nomenia. @fi
definition: Relaterer et nomen til et nomen der er en diskret komponent af et andet nomen. @da
definition: Relates a nomen to a nomen that is a discrete component of another nomen.
definition: Setzt ein Nomen in Beziehung zu einem Nomen, das ein eigenständiger Bestandteil eines anderen Nomens ist. @de
definition: يربط بين تسمية وتسمية هي جزء منفصل من تسمية آخرى. @ar
definition: 将一个命名与作为另一个命名之独立组成部分的一个命名关联起来。 @zh-hans

is part of nomen
lexical alias: partOfNomen.en
status: Published
type: Property
label: er del af nomen @da
label: is deel van nomen @nl
label: ismin bir bileşenidir @tr
label: ist Teil von (Nomen) @de
label: nomenin osa @fi
label: résznomene a következőnek: @hu
label: هي تسمية جزئية @ar
label: 是命名的部分 @zh-hans
inverse of: has part nomen
definition: Bir ismi, farklı bir unsur olarak başka bir ismi olan isimle ilişkilendirir. @tr
definition: Hozzákapcsol egy noment egy nomenhez, amelynek van egy másik nomenje, mint elkülöníthető alkotóelem. @hu
definition: Liittää nomenin nomeniin, jonka itsenäinen osa toinen nomen on. @fi
definition: Relaterer et nomen til et nomen, som har et andet nomen som diskret komponent. @da
definition: Relates a nomen to a nomen that has another nomen as a discrete component.
definition: Setzt ein Nomen in Beziehung zu einem Nomen, das ein anderes Nomen als einzelnen Bestandteil enthält. @de
definition: يربط بين تسمية وتسمية لها تسمية أخرى كجزء منفصل. @ar
definition: 将一个命名与有另一个命名作为独立组成部分的一个命名关联起来。 @zh-hans

is parallel title proper of
lexical alias: parallelTitleProperOf.en
status: Published
type: Property
label: er parallel hovedtitel på @da
label: is parallelle hoofdtitel van @nl
label: ist Paralleltitel von @de
label: paralel başlığıdır @tr
label: párhuzamos főcíme a következőnek: @hu
label: rinnakkainen päänimeke @fi
label: هو عنوان موزاي مُوَافِق لـ @ar
label: 是……的并列正题名 @zh-hans
inverse of: has parallel title proper
definition: Bir ismi, başka bir dilde veya yazıda uygun bir başlığı olan bir kaynakla ilişkilendirir. @tr
definition: Hozzákapcsol egy noment egy forráshoz, amelynek más nyelven vagy írásrendszerben is van főcíme. @hu
definition: Liittää nomenin aineistoon, jonka päänimeke on toisella kielellä tai kirjoitusjärjestelmällä. @fi
definition: Relaterer et nomen til en ressource, som har en hovedtitel på et andet sprog eller skriftsystem. @da
definition: Relates a nomen to a resource that has a title proper in another language or script.
definition: Setzt ein Nomen in Beziehung zu einer Ressource, die einen Haupttitel in einer anderen Sprache oder einer anderen Schrift hat. @de
definition: يربط تسمية بمصدر له عنوان مُوَافِق بلغة أخرى أو نص آخر. @ar
definition: 将一个命名与有用另一种语言或文字的正题名的一种资源关联起来。 @zh-hans

is ISSN of
lexical alias: issnOf.en
status: Published
type: Property
label: ISSN @fi
label: ISSN'idir @tr
label: ISSN-je a következőnek: @hu
label: er ISSN for @da
label: is ISSN van @nl
label: ist ISSN von @de
label: هو ترقيم دولي موحد للدوريات لـ @ar
label: 是……的国际标准连续出版物号 @zh-hans
inverse of: has ISSN
definition: Bir ismi, ISSN kayıt ajansı tarafından atanmış bir tanımlayıcıya sahip bir kaynakla ilişkilendirir. @tr
definition: Hozzákapcsol egy noment egy forráshoz, amelynek rendelkezik egy ISSN regisztrációs ügynökség által jegyzett azonosítóval. @hu
definition: Liittää nomenin aineistoon, jolla on ISSN-rekisteröintiyksikön antama tunniste. @fi
definition: Relaterer et nomen til en ressource, som har en identifikator tildelt af et ISSN registreringsbureau. @da
definition: Relates a nomen to a resource that has an identifier assigned by an ISSN registration agency.
definition: Setzt ein Nomen in Beziehung zu einer Ressource, die über einen Identifikator verfügt, der von einem ISSN-Zentrum vergeben wird. @de
definition: يربط تسمية بمصدر له مُعرّف خُصص لسلسلة من قبل وكالة تسجيل الترقيم الدولي الموحد للدوريات @ar
definition: 将一个命名与被一个国际标准连续出版物号注册机构分配一个标识符的一种资源关联起来。 @zh-hans

is key title of
lexical alias: keyTitleOf.en
status: Published
type: Property
label: ana başlığıdır @tr
label: avainnimeke aineistolle @fi
label: er nøgletitel på @da
label: is key title van @nl
label: ist Key Title von @de
label: kulcscíme a következőnek: @hu
label: هو عنوان مفتاحى لـ @ar
label: 有……的识别题名 @zh-hans
sub property of: has related resource of nomen
inverse of: has key title
definition: Bir ismi, ISSN kayıt ajansı tarafından atanan bir kaynak başlığına sahip bir kaynakla ilişkilendirir. @tr
definition: Hozzákapcsol egy noment egy forráshoz, amely rendelkezik egy olyan forráshoz tartozó címmel, amelyet egy ISSN regisztrációs ügynökség jegyez. @hu
definition: Liittää aineiston ISSN-rekisteröintiyksikön antamaan aineiston nimekkeeseen. @fi
definition: Relaterer et nomen til en ressource, som har en ressourcetitel, der er tildelt af et ISSN registreringsbureau. @da
definition: Relates a nomen to a resource that has a title of resource that is assigned by an ISSN registration agency.
definition: Setzt ein Nomen in Beziehung zu einer Ressource, die über einen Titel für eine Ressource verfügt, der von einem ISSN-Zentrum vergeben wird. @de
definition: يربط تسمية بمصدر له عنوان مصدر خصصته وكالة تسجيل الترقيم الدولي الموحد للدوريات @ar
definition: 将一个命名与有被国际标准连续出版物号一个注册机构分配之资源的一个题名的一种资源关联起来。 @zh-hans

has context of use
lexical alias: contextOfUse.en
status: Published
type: Property
label: har kontekst for brug @da
label: használati környezete a következő: @hu
label: hat Verwendungskontext @de
label: heeft context van gebruik @nl
label: kullanım bağlamı ile ilişkilidir @tr
label: käyttökonteksti aineistolle @fi
label: له سياق للاستخدام @ar
label: 有使用语境 @zh-hans
definition: Bir ismi, bir varlığın adının kullanıldığı koşul veya durumla ilişkilendirir. @tr
definition: Hozzákapcsol egy noment egy körülményhez vagy szituációhoz, amelyben egy entitás megnevezését használják. @hu
definition: Liittää nomenin olosuhteeseen tai tilanteeseen, jossa entiteetin nimitystä käytetään. @fi
definition: Relaterer et nomen til de omstændigheder eller situationer, hvor en betegnelse for en entitet bruges. @da
definition: Relates a nomen to the circumstances or situation in which an appellation of an entity is used.
definition: Setzt ein Nomen in Beziehung zu den Umständen oder der Situation, in denen/der eine Bezeichnung für eine Entität verwendet wird. @de
definition: يربط بين تسمية وظروف أو موقف تم فيه استخدام تسمية لكيان. @ar
definition: 将一个命名与一个命名被使用的环境和情况关联起来。 @zh-hans

has date of usage (Deprecated)
lexical alias: dateOfUsage.en
status: Deprecated
type: Property
definition: Relates a nomen to a date or range of dates that is associated with the use of an appellation of an entity. (Deprecated)

has derivation
lexical alias: derivation.en
status: Published
type: Property
label: har afledning @da
label: hat Ableitung @de
label: heeft afleiding @nl
label: johdos @fi
label: leágazása a következő: @hu
label: türetim ile ilişkilidir @tr
label: له اشتقاق @ar
label: 有衍生命名 @zh-hans
definition: Bir ismi, başka bir isimi kaynak alan bir isimle ilişkilendirir. @tr
definition: Hozzákapcsol egy noment egy nomenhez, amely egy másik nomenen alapul. @hu
definition: Liittää nomenin nomeniin, joka perustuu toiseen nomeniin. @fi
definition: Relaterer et nomen til et nomen der er baseret på et andet nomen. @da
definition: Relates a nomen to a nomen that is based on another nomen.
definition: Setzt ein Nomen in Beziehung zu einem Nomen, das auf einem anderen Nomen basiert. @de
definition: يربط بين تسمية وتسمية مبنية على تسمية آخرى. @ar
definition: 将一个命名与基于另一个命名的一个命名关联起来。 @zh-hans

is derivation of
lexical alias: derivationOf.en
status: Published
type: Property
label: er afledning af @da
label: is afgeleid van @nl
label: ist Ableitung von @de
label: johdos nomenista @fi
label: leágazása a következőnek: @hu
label: türevidir @tr
label: هو اشتقاق لـ @ar
label: 是……的衍生命名 @zh-hans
definition: Bir ismi, başka bir isime kaynak olan bir isimle ilişkilendirir. @tr
definition: Hozzákapcsol egy noment egy nomenhez, amelyet egy másik nomen alapjaként használnak. @hu
definition: Liittää nomenin nomeniin, johon toinen johdos perustuu. @fi
definition: Relaterer et nomen til et nomen, som bruges som grundlag for et andet nomen. @da
definition: Relates a nomen to a nomen that is used as the basis of another nomen.
definition: Setzt ein Nomen in Beziehung zu einem Nomen, das als Grundlage für ein anderes Nomen verwendet wird. @de
definition: يربط تسمية بتسمية استخدمت كأساس لتسمية أخرى. @ar
definition: 将一个命名与被用作另一个命名之基础的一个命名关联起来。 @zh-hans

is equivalent to
lexical alias: equivalentTo.en
status: Published
type: Property
label: egyenértékű a következővel: @hu
label: er tilsvarende til @da
label: eşdeğeridir @tr
label: is equivalent aan @nl
label: ist äquivalent zu @de
label: vastaava nomen @fi
label: هو مُكَافِئ لـ @ar
label: 是等同于…… @zh-hans
definition: Bir ismi, başka bir isimle aynı varlığın adı olan bir isimle ilişkilendirir. @tr
definition: Hozzákapcsol egy noment egy nomenhez, amely ugyanannak az entitásnak a megnevezése, ami a másik nomen. @hu
definition: Liittää nomenin nomeniin, joka on saman entiteetin nimitys kuin toinen nomen. @fi
definition: Relaterer et nomen til et nomen, som er en benævnelse af den samme entitet som et andet nomen. @da
definition: Relates a nomen to a nomen that is an appellation of the same entity as another nomen.
definition: Setzt ein Nomen in Beziehung zu einem Nomen, das eine Bezeichnung für dieselbe Entität ist wie ein anderes Nomen. @de
definition: يربط تسمية بتسمية عبارة عن اسم لكيان نفسه كتسمية أخرى. @ar
definition: 将一个命名与和另一个命名一样作为同一个实体的一个称谓的一个命名关联起来。 @zh-hans

is contributor agent of computer content of
lexical alias: contributorAgentOfComputerContentOf.en
status: Published
type: Property
label: bilgisayar içeriğinin katkıda bulunan temsilcisidir @tr
label: digitaaliseen sisältöön osallinen toimija aineistossa @fi
label: er agent, som er bidragsyder for computerindhold af. @da
label: is bijdrager-actor van computercontent van @nl
label: ist Akteur ist Beiträgerin/Beiträger von Computer Content von @de
label: közreműködő ágense a következő számítógépes tartalomnak: @hu
label: هو وكيل مساهم في محتوى حاسب آلي لـ @ar
label: 是……的计算机内容贡献者行为者 @zh-hans
definition: Bir temsilciyi, bir temsilci tarafından oluşturulan bilgisayar içeriğini somutlaştıran toplayıcı bir kaynakla ilişkilendirir. @tr
definition: Hozzákapcsol egy ágenst egy aggregátum forráshoz, amely egy ágens által létrehozott számítógépes tartalmat testesít meg. @hu
definition: Liittää toimijan aineistoon, joka on aggregaatti, joka sisältää toimjan luoman digitaalisen sisällön. @fi
definition: Relaterer en agent til en ressource, som er en samling, der omfatter computerindhold, der er skabt af en agent. @da
definition: Relates an agent to a resource that is an aggregate that embodies computer content created by an agent.
definition: Setzt einen Akteur in Beziehung zu einer Ressource, bei der es sich um ein Aggregat handelt, das von einem Akteur erschaffenen Computer Content verkörpert. @de
definition: يربط بين وكيل ومصدر عبارة عن تجميعة تجسد محتوى حاسب آلي أنشأه وكيل. @ar
definition: 将一个行为者与作为一种合集、把一个行为者所创作的一种计算机内容具体化的一种资源关联起来。 @zh-hans

is contributor agent of moving image of
lexical alias: contributorAgentOfMovingImageOf.en
status: Published
type: Property
label: er agent, som er bidragsyder for levende billeder af. @da
label: hareketli görüntüsünün katkıda bulunan temsilcisidir @tr
label: is bijdrager-actor van bewegend beeld van @nl
label: ist Akteur als Beiträgerin/Beiträger von einem Bewegtbild von @de
label: közreműködő ágense a következő mozgóképnek: @hu
label: liikkuvaan kuvaan osallinen toimija aineistossa @fi
label: هو وكيل مساهم في صور متحركة لـ @ar
label: 是……的动态图像的贡献者行为者 @zh-hans
definition: Bir temsilciyi, bir temsilci tarafından oluşturulan hareketli bir görüntü kaynağını somutlaştıran toplayıcı kaynakla ilişkilendirir. @tr
definition: Hozzákapcsol egy ágenst egy aggregátum forráshoz, amely egy ágens által létrehozott mozgóképforrást testesít meg. @hu
definition: Liittää toimijan aineistoon, joka on aggregaatti, joka sisältää toimijan luoman liikkuvan kuvan aineiston. @fi
definition: Relaterer en agent til en ressource, som er en samling, der omfatter en ressource med levende billeder, der er skabt af en agent. @da
definition: Relates an agent to a resource that is an aggregate that embodies a moving image resource created by an agent.
definition: Setzt einen Akteur in Beziehung zu einer Ressource, bei der es sich um ein Aggregat handelt, das eine von einem Akteur erschaffene Bewegtbildressource verkörpert. @de
definition: يربط بين وكيل ومصدر عبارة عن تجميعة تجسد مصدر صور متحركة أنشأه وكيل. @ar
definition: 将一个行为者与作为一种合集、把一个行为者所创作的一种动态图像资源具体化的一种资源关联起来。 @zh-hans

is contributor agent of object of
lexical alias: contributorAgentOfObjectOf.en
status: Published
type: Property
label: er agent, som er bidragsyder for objekt af @da
label: esineeseen osallinen toimija aineistossa @fi
label: is bijdrager-actor van object van @nl
label: ist Akteur als Beiträgerin/Beiträger von einem Gegenstand von @de
label: közreműködő ágense a következő objektumnak: @hu
label: nesnesinin katkıda bulunan temsilcisidir @tr
label: هو وكيل مساهم في كائن لـ @ar
label: 是……的物体的贡献者行为者 @zh-hans
definition: Bir temsilciyi, bir temsilci tarafından oluşturulan bir nesne kaynağını somutlaştıran toplayıcı bir kaynakla ilişkilendirir. @tr
definition: Hozzákapcsol egy ágenst egy aggregátum forráshoz, amely egy ágens által létrehozott objektumforrást testesít meg. @hu
definition: Liittää toimijan aineistoon, joka on toimijan luoman esineaineiston sisältävä aggregaatti. @fi
definition: Relaterer en agent til en ressourece, som er en samling, der omfatter en ressource, der er et objekt, der er skabt af en agent. @da
definition: Relates an agent to a resource that is an aggregate that embodies an object resource created by an agent.
definition: Setzt einen Akteur in Beziehung zu einer Ressource, bei der es sich um ein Aggregat handelt, das eine von einem Akteur erschaffene gegenständliche Ressource verkörpert. @de
definition: يربط بين مصدر ومصدر عبارة عن تجميعة تجسد مصدرًا كائنًا أنشأه وكيل. @ar
definition: 将一个行为者与作为一种合集、把一个行为者所创作的一种物体资源具体化的一种资源关联起来。 @zh-hans

is contributor agent of speech of
lexical alias: contributorAgentOfSpeechOf.en
status: Published
type: Property
label: Liittää aineiston toimijaan, joka on osallinen aggregaattiin luomalla aggregaattiin sisältyvän liikkuvan puheaineiston. @fi
label: er agent, som er bidragsyder til tale af @da
label: is bijdrager-actor van spraak van @nl
label: ist Akteur als Beiträgerin/Beiträger von einer Rede von @de
label: konuşmasının katkıda bulunan temsilcisidir @tr
label: közreműködő ágense a következő beszédnek: @hu
label: هو وكيل مساهم في حديث لـ @ar
label: 是……的讲话的贡献者行为者 @zh-hans
definition: Bir temsilciyi, bir temsilci tarafından oluşturulan sözlü bir kaynağı somutlaştıran toplayıcı bir kaynakla ilişkilendirir. @tr
definition: Hozzákapcsol egy ágenst egy aggregátum forráshoz, amely egy ágens által létrehozott beszélt forrást testesít meg. @hu
definition: Liittää toimijan aineistoon, joka on toimijan luoman puheaineiston sisältävä aggregaatti. @fi
definition: Relaterer en agent til en ressource, som er en samling, der omfatter en ressource med talt ord, der er skabt af en agent. @da
definition: Relates an agent to a resource that is an aggregate that embodies a spoken word resource created by an agent.
definition: Setzt einen Akteur in Beziehung zu einer Ressource, bei der es sich um ein Aggregat handelt, das eine von einem Akteur erschaffene gesprochene Ressource verkörpert. @de
definition: يربط بين وكيل ومصدر عبارة عن تجميعة تجسد مصدرًا بكلمات منطوقة أنشأه وكيل. @ar
definition: 将一个行为者与作为一种合集、把一个行为者所创作的一种口语资源具体化的一种资源关联起来。 @zh-hans

is contributor agent of music of
lexical alias: contributorAgentOfMusicOf.en
status: Published
type: Property
label: er agent, som er bidragsyder til musik af @da
label: is bijdrager-actor van muziek van @nl
label: ist Akteur als Beiträgerin/Beiträger einer Musik von @de
label: közreműködő ágense a következő zenének: @hu
label: musiikkiin osallinen toimija aineistossa @fi
label: müziğinin katkıda bulunan temsilcisidir @tr
label: هو وكيل مساهم في موسيقى لـ @ar
label: 是……的音乐的贡献者行为者 @zh-hans
definition: Bir temsilciyi, bir temsilci tarafından oluşturulan müzikal bir kaynağı somutlaştıran toplayıcı bir kaynakla ilişkilendirir. @tr
definition: Hozzákapcsol egy ágenst egy aggregátum forráshoz, amely egy ágens által létrehozott zenei forrást testesít meg. @hu
definition: Liittää toimijan aineistoon, joka on toimijan luoman musiikkiaineiston sisältävä aggregaatti. @fi
definition: Relaterer en agent til en ressource, som er en samling, der omfatter en musikressource, der er skabt af en agent. @da
definition: Relates an agent to a resource that is an aggregate that embodies a musical resource created by an agent.
definition: Setzt einen Akteur in Beziehung zu einer Ressource, bei der es sich um ein Aggregat handelt, das eine von einem Akteur erschaffene Musikressource verkörpert. @de
definition: يربط بين وكيل ومصدر عبارة عن تجميعة تجسد مصدرًا موسيقيًا ألفه وكيل. @ar
definition: 将一个行为者与作为一种合集、把一个行为者所创作的一种音乐资源具体化的一种资源关联起来。 @zh-hans

is contributor agent of cartography of
lexical alias: contributorAgentOfCartographyOf.en
status: Published
type: Property
label: er agent, som er bidragsyder til karotgrafi af @da
label: is bijdrager-actor van cartografie van @nl
label: ist Akteur als Beiträgerin/Beiträger einer Kartografie von @de
label: kartografiaan osallinen toimija aineistossa @fi
label: kartografisinin katkıda bulunan temsilcisidir @tr
label: közreműködő ágense a következő kartográfiának: @hu
label: هو وكيل مساهم في رسم خرائط لـ @ar
label: 是……的地图绘制的贡献者行为者 @zh-hans
definition: Bir temsilciyi, bir temsilci tarafından oluşturulan kartografik bir kaynağı somutlaştıran toplayıcı bir kaynakla ilişkilendirir. @tr
definition: Hozzákapcsol egy ágenst egy aggregátum forráshoz, amely egy ágens által létrehozott kartográfiai forrást testesít meg. @hu
definition: Liittää toimijan aineistoon, joka on toimijan luoman kartografisen aineiston sisältävä aggregaatti. @fi
definition: Relaterer en agent til en ressource, som er en samling, der omfatter en kartografisk ressource, der er skabt af en agent. @da
definition: Relates an agent to a resource that is an aggregate that embodies a cartographic resource created by an agent.
definition: Setzt einen Akteur in Beziehung zu einer Ressource, bei der es sich um ein Aggregat handelt, das eine von einem Akteur erschaffene kartografische Ressource verkörpert. @de
definition: يربط بين وكيل ومصدر عبارة عن تجميعة تجسد مصدرًا رسم خرائطي أنشأه وكيل. @ar
definition: 将一个行为者与作为一种合集、把一个行为者所创作的一种地图资源具体化的一种资源关联起来。 @zh-hans

is contributor agent of choreography of
lexical alias: contributorAgentOfChoreographyOf.en
status: Published
type: Property
label: er agent, som er bidragsyder til koreografi af @da
label: is bijdrager-actor van choreografie van @nl
label: ist Akteur als Beiträgerin/Beiträger einer Choreografie von @de
label: koreografiaan osallinen toimija aineistossa @fi
label: koreografisinin katkıda bulunan temsilcisidir @tr
label: közreműködő ágense a következő koreográfiának: @hu
label: هو وكيل مساهم في فن تصميم الرقصات لـ @ar
label: 是……的编舞的贡献者行为者 @zh-hans
definition: Bir temsilciyi, bir temsilci tarafından oluşturulan koreografik bir kaynağı somutlaştıran toplayıcı bir kaynakla ilişkilendirir. @tr
definition: Hozzákapcsol egy ágenst egy aggregátum forráshoz, amely egy ágens által létrehozott koreografikus forrást testesít meg. @hu
definition: Liittää toimijan aineistoon, joka on toimijan luoman koreografisen aineiston sisältävä aggregaatti @fi
definition: Relaterer en agent til en ressource, som er en samling, der omfatter en koreografisk ressource, der er skabt af en agent. @da
definition: Relates an agent to a resource that is an aggregate that embodies a choreographic resource created by an agent.
definition: Setzt einen Akteur in Beziehung zu einer Ressource, bei der es sich um ein Aggregat handelt, das eine von einem Akteur erschaffene choreografische Ressource verkörpert. @de
definition: يربط بين وكيل ومصدر عبارة عن تجميعة تجسد مصدرًا راقص أنشأه وكيل @ar
definition: 将一个行为者与作为一种合集、把一个行为者所创作的一种编舞资源具体化的一种资源关联起来。 @zh-hans

is contributor agent of text of
lexical alias: contributorAgentOfTextOf.en
status: Published
type: Property
label: er agent, som er bidragsyder til tekst af @da
label: is bijdrager-actor van tekst van @nl
label: ist Akteur als Beiträgerin/Beiträger von ergänzendem Text von @de
label: közreműködő ágense a következő szövegnek: @hu
label: metninin katkıda bulunan temsilcisidir @tr
label: tekstiin osallinen toimija aineistossa @fi
label: هو وكيل مساهم في نص لـ @ar
label: 是……的文本的贡献者行为者 @zh-hans
definition: Bir temsilciyi, bir temsilci tarafından oluşturulan metinsel bir kaynağı somutlaştıran toplayıcı bir kaynakla ilişkilendirir. @tr
definition: Hozzákapcsol egy ágenst egy aggregátum forráshoz, amely egy ágens által létrehozott szöveges forrást testesít meg. @hu
definition: Liittää toimijan aineistoon, joka on toimijan luoman tekstiaineiston sisältävä aggregaatti. @fi
definition: Relaterer en agent til en ressource, som er en samling, der omfatter en tekstressource, der er skabt af en agent. @da
definition: Relates an agent to a resource that is an aggregate that embodies a textual resource created by an agent.
definition: Setzt einen Akteur in Beziehung zu einer Ressource, bei der es sich um ein Aggregat handelt, das eine von einem Akteur erschaffene textliche Ressource verkörpert. @de
definition: يربط بين وكيل ومصدر عبارة عن تجميعية تجسد مصدر نصي أنشأه وكيل. @ar
definition: 将一个行为者与作为一种合集、把一个行为者所创作的一种文字资源具体化的一种资源关联起来。 @zh-hans

has contributor agent of cartography
lexical alias: contributorAgentOfCartography.en
status: Published
type: Property
label: har agent, som er bidragsyder til kartografi @da
label: hat Beiträgerin/Beiträger einer Kartografie @de
label: heeft bijdrager-actor van cartografie @nl
label: kartografiaan osallinen toimija aineistossa @fi
label: kartografiye katkıda bulunan temsilci ile ilişkilidir @tr
label: kartográfia közreműködő ágense a következő: @hu
label: له وكيل مساهم برسم خرائط @ar
label: 有地图绘制贡献者行为者 @zh-hans
definition: Bir kaynağı, bir topluluk tarafından somutlaştırılan bir kartografik kaynak oluşturan topluluğa katkıda bulunan bir temsilci ile ilişkilendirir. @tr
definition: Hozzákapcsol egy forrást egy ágenshez, amely aggregátum közreműködőjeként olyan kartográfiai forrást hoz létre, amely egy aggregátumban testesül meg. @hu
definition: Liittää aineiston toimijaan, joka on osallinen aggregaattiin luomalla aggregaattiin sisältyvän kartografisen aineiston @fi
definition: Relaterer en ressource til en agent, som er bidragsyder til en samling, der skaber en kartografisk ressource, der er omfattet af et aggregat. @da
definition: Relates a resource to an agent who is a contributor to aggregate who creates a cartographic resource that is embodied by an aggregate.
definition: Setzt eine Ressource in Beziehung zu einer Beiträgerin/einem Beiträger zu einem Aggregat, die/der eine kartografische Ressource erstellt, die durch ein Aggregat verkörpert wird. @de
definition: يربط مصدر بوكيل مُساهم في التجميع الذي ينشأ عنه مصدر خرائطي تجسده تجميعية. @ar
definition: 将一种资源与作为合集的一个贡献者并创建被一种合集具体化的一种地图资源的一个行为者关联起来。 @zh-hans

has contributor agent of choreography
lexical alias: contributorAgentOfChoreography.en
status: Published
type: Property
label: har agent, som er bidragsyder til koreografi @da
label: hat Beiträgerin/Beiträger einer Choreografie @de
label: heeft bijdrager-actor van choreografie @nl
label: koreografiaan osallinen toimija aineistossa @fi
label: koreografiye katkıda bulunan temsilci ile ilişkilidir @tr
label: koreográfia közreműködő ágense a következő: @hu
label: له وكيل مساهم بتصميم رقصات @ar
label: 有编舞贡献者行为者 @zh-hans
definition: Bir kaynağı, bir topluluk tarafından somutlaştırılan bir koreografik kaynak oluşturan topluluğa katkıda bulunan bir temsilci ile ilişkilendirir. @tr
definition: Hozzákapcsol egy forrást egy ágenshez, amely aggregátum közreműködőjeként olyan koreografikus forrást hoz létre, amely egy aggregátumban testesül meg. @hu
definition: Liittää aineiston toimijaan, joka on osallinen aggregaattiin luomalla aggregaattiin sisältyvän koreografisen aineiston. @fi
definition: Relaterer en ressource til en agent, som er bidragsyder til en samling, der skaber en koreografisk ressource, der er omfattet af et aggregat. @da
definition: Relates a resource to an agent who is a contributor to aggregate who creates a choreographic resource that is embodied by an aggregate.
definition: Setzt eine Ressource in Beziehung zu einer Beiträgerin/einem Beiträger zu einem Aggregat, die/der eine choreografische Ressource erstellt, die durch ein Aggregat verkörpert wird. @de
definition: يربط مصدر بوكيل مُساهم في التجميع الذي ينشأ عنه مصدر تصميم الرقصات تجسده تجميعية. @ar
definition: 将一种资源与作为合集的一个贡献者并创建被一种合集具体化的一种编舞资源的一个行为者关联起来。 @zh-hans

has contributor agent of computer content
lexical alias: contributorAgentOfComputerContent.en
status: Published
type: Property
label: bilgisayar içeriğine katkıda bulunan temsilci ile ilişkilidir @tr
label: digitaaliseen sisältöön osallinen toimija aineistossa @fi
label: har agent, som er bidragsyder til computerindhold @da
label: hat Beiträgerin/Beiträger von Computer Content @de
label: heeft bijdrager-actor van computercontent @nl
label: számítógépes tartalom közreműködő ágense a következő: @hu
label: له وكيل مساهم بمحتوى كمبيوتر @ar
label: 有计算机内容贡献者行为者 @zh-hans
definition: Bir kaynağı, bir topluluk tarafından somutlaştırılan bir bir bilgisayar içeriği oluşturan topluluğa katkıda bulunan bir temsilci ile ilişkilendirir. @tr
definition: Egy megjelenési formát hozzákapcsol egy ágenshez, amely aggregátum közreműködőjeként olyan számítógépes tartalmat hoz létre, amely egy aggregátumban testesül meg. @hu
definition: Relaterer en ressource til en agent, som er bidragsyder til en samling, der skaber computerindhold, der er omfattet af en samling. @da
definition: Relates a resource to an agent who is a contributor to aggregate who creates computer content that is embodied by an aggregate.
definition: Setzt eine Ressource in Beziehung zu einer Beiträgerin/einem Beiträger zu einem Aggregat, die/der Computer Content erstellt, der durch ein Aggregat verkörpert wird. @de
definition: digitaaliseen sisältöön osallinen toimija aineistossa @fi
definition: يربط مصدر بوكيل مُساهم في التجميع الذي ينشأ عنه مصدر كمبيوتر تجسده تجميعية. @ar
definition: 将一种资源与作为合集的一个贡献者并创建被一种合集具体化的一种计算机内容的一个行为者关联起来。 @zh-hans

has contributor agent of moving image
lexical alias: contributorAgentOfMovingImage.en
status: Published
type: Property
label: har agent, som er bidragsyder til levende billeder @da
label: hareketli görüntüye katkıda bulunan temsilci ile ilişkilidir @tr
label: hat Beiträgerin/Beiträger von einem Bewegtbild @de
label: heeft bijdrager-actor van bewegend beeld @nl
label: liikkuvaan kuvaan osallinen toimija aineistossa @fi
label: mozgókép közreműködő ágense a következő: @hu
label: له وكيل مساهم بصور متحركة @ar
label: 有动态图像的贡献者行为者 @zh-hans
definition: Bir kaynağı, bir topluluk tarafından somutlaştırılan bir hareketli görüntü oluşturan topluluğa katkıda bulunan bir temsilci ile ilişkilendirir. @tr
definition: Hozzákapcsol egy forrást egy ágenshez, amely aggregátum közreműködőjeként olyan mozgóképforrást hoz létre, amely egy aggregátumban testesül meg. @hu
definition: Liittää aineiston toimijaan, joka osallistuu aggregaattiin luomalla aggregaattiin sisältyvän liikkuvan kuvan aineiston. @fi
definition: Relaterer en ressource til en agent, som er bidragsyder til en samling, der skaber en ressource med levende billeder, der omfattes af en samling. @da
definition: Relates a resource to an agent who is a contributor to aggregate who creates a moving image resource that is embodied by an aggregate.
definition: Setzt eine Ressource in Beziehung zu einer Beiträgerin/einem Beiträger zu einem Aggregat, die/der eine Bewegtbildressource erstellt, die durch ein Aggregat verkörpert wird. @de
definition: يربط مصدر بوكيل مُساهم في التجميع الذي ينشأ عنه مصدر من صور متحركة تجسده تجميعية. @ar
definition: 将一种资源与作为合集的一个贡献者并创建被一种合集具体化的一种动态图像资源的一个行为者关联起来。 @zh-hans

has contributor agent of music
lexical alias: contributorAgentOfMusic.en
status: Published
type: Property
label: har agent, som er bidragsyder til musik @da
label: hat Beiträgerin/Beiträger einer Musik @de
label: heeft bijdrager-actor van muziek @nl
label: musiikkiin osaallinen toimija aineistossa @fi
label: müziğe katkıda bulunan temsilci ile ilişkilidir @tr
label: zene közreműködő ágense a következő: @hu
label: له وكيل مساهم بموسيقى @ar
label: 有音乐的贡献者行为者 @zh-hans
definition: Bir kaynağı, bir topluluk tarafından somutlaştırılan bir müzikal kaynak oluşturan topluluğa katkıda bulunan bir temsilci ile ilişkilendirir. @tr
definition: Hozzákapcsol egy forrást egy ágenshez, amely aggregátum közreműködőjeként olyan zenei forrást hoz létre, amely egy aggregátumban testesül meg. @hu
definition: Liittää aineiston toimijaan, joka osallistuu aggregaattiin luomalla aggregaattiin sisältyvän musiikkiaineiston @fi
definition: Relaterer en ressource til en agent, som er bidragsyder til en samling, der skaber en musikressource, der er omfattet af en samling. @da
definition: Relates a resource to an agent who is a contributor to aggregate who creates a musical resource that is embodied by an aggregate.
definition: Setzt eine Ressource in Beziehung zu einer Beiträgerin/einem Beiträger zu einem Aggregat, die/der eine Musikressource erstellt, die durch ein Aggregat verkörpert wird. @de
definition: يربط مصدر بوكيل مُساهم في التجميع الذي ينشأ عنه مصدر موسيقي تجسده تجميعية. @ar
definition: 将一种资源与作为合集的一个贡献者并创建被一种合集具体化的一种音乐资源的一个行为者关联起来。 @zh-hans

has contributor agent of object
lexical alias: contributorAgentOfObject.en
status: Published
type: Property
label: esineeseen osallinen toimija aineistossa @fi
label: har agent, som er bidragsyder til objekt @da
label: hat Beiträgerin/Beiträger von einem Gegenstand @de
label: heeft bijdrager-actor van object @nl
label: nesneye katkıda bulunan temsilci ile ilişkilidir @tr
label: objektum közreműködő ágense a következő: @hu
label: له وكيل مساهم بكائن @ar
label: 有物体的贡献者行为者 @zh-hans
definition: Bir kaynağı, bir topluluk tarafından somutlaştırılan bir nesne kaynağı oluşturan topluluğa katkıda bulunan bir temsilciile ilişkilendirir. @tr
definition: Hozzákapcsol egy forrást egy ágenshez, amely aggregátum közreműködőjeként olyan objektumforrást hoz létre, amely egy aggregátumban testesül meg. @hu
definition: Liittää aineiston toimijaan, joka osallistuu aggregaattiin luomalla aggregaattiin sisältyvän esineaineiston. @fi
definition: Relaterer en ressource til en agent, som er bidragsyder til en samling, der skaber en ressource, som er et objekt, der er omfattet af en samling @da
definition: Relates a resource to an agent who is a contributor to aggregate who creates an object resource that is embodied by an aggregate.
definition: Setzt eine Ressource in Beziehung zu einer Beiträgerin/einem Beiträger zu einem Aggregat (Akteur), die/der eine gegenständliche Ressource erstellt, die durch ein Aggregat verkörpert wird. @de
definition: يربط مصدر بوكيل مُساهم في التجميع الذي ينشأ عنه مصدر كائن تجسده تجميعية. @ar
definition: 将一种资源与作为合集的一个贡献者并创建被一种合集具体化的一种物体资源的一个行为者关联起来。 @zh-hans

has contributor agent of speech
lexical alias: contributorAgentOfSpeech.en
status: Published
type: Property
label: beszéd közreműködő ágense a következő: @hu
label: har agent, som er bidragsyder til tale @da
label: hat Beiträgerin/Beiträger von einer Rede @de
label: heeft bijdrager-actor van spraak @nl
label: konuşmaya katkıda bulunan temsilci ile ilişkilidir @tr
label: puheeseen osallinen toimija aineistossa @fi
label: له وكيل مساهم بحديث @ar
label: 有讲话的贡献者行为者 @zh-hans
definition: Bir kaynağı, bir topluluk tarafından somutlaştırılan bir söylenen söz kaynağı oluşturan topluluğa katkıda bulunan bir temsilci ile ilişkilendirir. @tr
definition: Hozzákapcsol egy forrást egy ágenshez, amely aggregátum közreműködőjeként olyan beszélt forrást hoz létre, amely egy aggregátumban testesül meg. @hu
definition: Liittää aineiston toimijaan, joka on osallinen aggregaattiin luomalla aggregaattiin sisältyvän puheaineiston. @fi
definition: Relaterer en ressource til en agent, som er bidragsyder til en samling, der skaber en ressource med talet ord, der er omfattet af en samling. @da
definition: Relates a resource to an agent who is a contributor to aggregate who creates a spoken word resource that is embodied by an aggregate.
definition: Setzt eine Ressource in Beziehung zu einer Beiträgerin/einem Beiträger zu einem Aggregat (Akteur), die/der eine gesprochene Ressource erstellt, die durch ein Aggregat verkörpert wird. @de
definition: يربط مصدر بوكيل مُساهم في التجميع الذي ينشأ عنه مصدر من كلمات منطوقة تجسده تجميعية. @ar
definition: 将一种资源与作为合集的一个贡献者并创建被一种合集具体化的一种口语资源的一个行为者关联起来。 @zh-hans

has contributor agent of text
lexical alias: contributorAgentOfText.en
status: Published
type: Property
label: har agent, som er bidragsyder til tekst @da
label: hat Beiträgerin/Beiträger von ergänzendem Text @de
label: heeft bijdrager-actor van tekst @nl
label: metne katkıda bulunan temsilci ile ilişkilidir @tr
label: szöveg közreműködő ágense a következő: @hu
label: tekstiin osallinen toimija aineistossa @fi
label: له وكيل مساهم بنص @ar
label: 有文本的贡献者行为者 @zh-hans
definition: Bir kaynağı, bir topluluk tarafından somutlaştırılan bir metin kaynağı oluşturan topluluğa katkıda bulunan bir temsilci ile ilişkilendirir. @tr
definition: Hozzákapcsol egy forrást egy ágenshez, amely aggregátum közreműködőjeként olyan szöveges forrást hoz létre, amely egy aggregátumban testesül meg. @hu
definition: Liittää aineiston toimijaan, joka on osallinen aggregaattiin luomalla aggregaattiin sisältyvän tekstiaineiston. @fi
definition: Relaterer en ressource til en agent, som er bidragsyder til en samling, der skaber en tekstressource, der er omfattet af en samling. @da
definition: Relates a resource to an agent who is a contributor to aggregate who creates a textual resource that is embodied by an aggregate.
definition: Setzt eine Ressource in Beziehung zu einer Beiträgerin/einem Beiträger zu einem Aggregat, die/der eine textliche Ressource erstellt, die durch ein Aggregat verkörpert wird. @de
definition: يربط مصدر بوكيل مُساهم في التجميع الذي ينشأ عنه مصدر نصي تجسده تجميعية. @ar
definition: 将一种资源与作为合集的一个贡献者并创建被一种合集具体化的一种文字作品的一个行为者关联起来。 @zh-hans

has resource copyright statement
lexical alias: resourceCopyrightStatement.en
status: Published
type: Property
label: aineiston copyright-merkintö @fi
label: forrás szerzői jogra vonatkozó közlése a következő: @hu
label: har copyrightoplysning for ressource @da
label: hat Copyright-Angabe einer Manifestation @de
label: heeft resource-copyrightvermelding @nl
label: kaynak telif hakkı bildirimi ile ilişkilidir @tr
label: له بيان حقوق نشر لمصدر @ar
label: 有资源版权说明 @zh-hans
definition: Bir kaynağı, telif hakkı veya benzer bir düzenleme kapsamında koruma talebiyle ilişkilendirilen bir tarih hakkındaki kaynak bildirimiyle ilişkilendirir. @tr
definition: Hozzákapcsol egy forrást egy időpontot jelölő forrásközléshez, amely a szerzői jog vagy egy hasonló szabályrendszer alapján támasztott védettségi követeléshez kapcsolódik. @hu
definition: Liittää aineiston aineistomerkintöön, joka kertoo copyright-säädöksen tai vastaavien säädösten alaiseen copyright-suojaukseen liittyvän ajankohdan. @fi
definition: Relaterer en ressource til en oplysning om ressource om et tidspunkt, som er knyttet til et krav om beskyttelse under copyright eller en lignende ordning. @da
definition: Relates a resource to a resource statement about a date that is associated with a claim of protection under copyright or a similar regime.
definition: Setzt eine Ressource in Beziehung zu einer Ressourcenangabe zu einem Datum, das mit einem Schutzanspruch nach dem Urheberrecht oder einem ähnlichen Regelwerk in Verbindung steht. @de
definition: يربط بين مصدر وبيان مصدر حول تاريخ مرتبط بالحماية تحت حقوق النشر أو أي نظام مشابه. @ar
definition: 将一种资源与关于版权或其他类似管理体系下和保护声明有关的一个日期的一个资源说明关联起来。 @zh-hans
scope note: A copyright date includes a phonogram date that is associated with a claim of protection for an audio recording.
scope note: A szerzői jogra vonatkozó időpontok magukban foglalnak hangfelvételek védettségi követelésével társított időpontokat is. @hu
scope note: Copyright-vuodet käsittävät phonogram-vuodet, jotka liittyvät äänitallenteiden copyright-suojaukseen. @fi
scope note: Darunter fallen Phonogramm-Daten, das heißt Datumsangaben, die mit einem Schutzanspruch für Audioaufnahmen in Verbindung stehen. @de
scope note: Et copyrightdato omfatter et fonogramdato, som er knyttet til et krav om beskyttelse af en lydindspelning. @da
scope note: Telif hakkı tarihi, bir ses kaydı için koruma talebiyle ilişkili olan bir fonogram tarihini içerir. @tr
scope note: تاريخ حقوق النشر يشمل تاريخ التسجيل الصوتي المرتبط بإعلان الحماية الخاص بالتسجيل الصوتي. @ar
scope note: 版权日期包括与录音保护声明有关的录音版权日期 @zh-hans

has resource designation of sequence statement
lexical alias: resourceDesignationOfSequenceStatement.en
status: Published
type: Property
label: aineiston merkintö numerointijakson määritteestä @fi
label: har oplysning om rækkefølge for ressource @da
label: hat Ressourcenangabe zur Bezeichnung einer fortlaufenden Ressource @de
label: heeft resource-aanduiding van volgorde-vermelding @nl
label: kaynak sıralandırma bildirimi ile ilişkilidir @tr
label: sorrendiségre vonatkozó forrásmegjelölése a következő: @hu
label: له تسمية مصدر لبيان تسلسل @ar
label: 有序列说明的资源标识 @zh-hans
definition: Bir kaynağı, artzamanlı bir kaynağın bir parçasının, sayısının veya yinelemesinin bir kaynak dizisinin belirlenmesi hakkındaki bir kaynak bildirimiyle ilişkilendirir. @tr
definition: Hozzákapcsol egy forrást egy diakronikus forrás egy részének, számának vagy iterációjának sorrendiség-jelöléséről szóló forrásközléshez. @hu
definition: Liittää aineiston aineistomerkintöön diakronisen aineiston yksittäisten osien tai iteraatioiden tai teoksen yksittäisten osien tai numeroiden numerointijaksosta. @fi
definition: Relaterer en ressource til en ressourceoplysning om en betegnelse for rækkefølge af en ressource af en del, udgave eller iteration af en diakronisk ressource. @da
definition: Relates a resource to a resource statement about the designation of a sequence of a resource of a part, issue, or iteration of a diachronic resource.
definition: Setzt eine Ressource in Beziehung zu einer Ressourcenangabe, die die Bezeichnung einer Folge von Ressourcen in Teilen, Ausgaben oder Iterationen enthält. @de
definition: يربط بين مصدر وبيان مصدر حول تسمية تسلسل مصدر لجزء، إصدار، أو تكرار لمصدر غير متزامن. @ar
definition: 将一种资源与关于一种历时资源的部分、期或更新后整体的资源的序列之标识的一个资源说明关联起来。 @zh-hans

has resource dissertation statement
lexical alias: resourceDissertationStatement.en
status: Published
type: Property
label: aineiston väitöskirjamerkintö @fi
label: forrás disszertációra vonatkozó közlése a következő: @hu
label: har oplysning om afhandling for ressource @da
label: hat Hochschulschriftenvermerk einer Ressource @de
label: heeft resource-proefschriftvermelding @nl
label: kaynak tez bildirimi ile ilişkilidir @tr
label: له بيان أطروحة لمصدر @ar
label: 有资源学位论文说明 @zh-hans
definition: Bir kaynağı, tez ve diğer bitirme tezi bilgileriyle ilgili bir kaynak bildirimiyle ilişkilendirir. @tr
definition: Hozzákapcsol egy forrást egy szakdolgozatról vagy disszertációról szóló információ forrásközléséhez. @hu
definition: Liittää aineiston aineistomerkintöön opinnäytteen tai väitöskirjan tiedoista. @fi
definition: Relaterer en ressource til en ressourceoplysning om en disputats og andre oplysninger om afhandlingen. @da
definition: Relates a resource to a resource statement about thesis and other dissertation information.
definition: Setzt eine Ressource in Beziehung zu einer Ressourcenangabe, die Angaben zum Hochschulschriftenvermerk enthält. @de
definition: يربط بين مصدر وبيان مصدر حول بيانات مرتبطة بأطروحة والمعلومات الأخرى عن الرسائل. @ar
definition: 将一种资源与关于毕业论文或其他学位论文信息的一个资源说明关联起来。 @zh-hans

has resource distribution statement
lexical alias: resourceDistributionStatement.en
status: Published
type: Property
label: aineiston jakelumerkintö @fi
label: forrás terjesztésre vonatkozó közlése a következő: @hu
label: har oplysning om distribution for ressource @da
label: hat Vertriebsangabe einer Ressource @de
label: heeft resource-distributievermelding @nl
label: kaynak dağıtım bildirimi ile ilişkilidir @tr
label: له بيان توزيع مصدر @ar
label: 有资源发行说明 @zh-hans
definition: Bir kaynağı, yayımlanmış bir kaynağın dağıtımıyla ilgili veriler hakkındaki bir kaynak bildirimiyle ilişkilendirir. @tr
definition: Hozzákapcsol egy forrást egy kiadott forrás terjesztésével kapcsolatos adatokról szóló forrásközléshez. @hu
definition: Liittää aineiston aineistomerkintöön julkaistun aineiston jakeluun liittyvistä tiedoista. @fi
definition: Relaterer en ressource til en ressourceoplysning om data, der relaterer til distibution af en udgiven ressource. @da
definition: Relates a resource to a resource statement about data relating to the distribution of a published resource.
definition: Setzt eine Ressource in Beziehung zu einer Ressourcenangabe, die Daten zum Vertrieb einer veröffentlichten Ressource enthält. @de
definition: يربط بين مصدر وبيان مصدر حول بيانات متعلقة بتوزيع مصدر منشور. @ar
definition: 将一种资源与关于和一种出版资源的发行有关的数据的一个资源说明关联起来。 @zh-hans

has resource edition statement
lexical alias: resourceEditionStatement.en
status: Published
type: Property
label: aineiston painosmerkintö @fi
label: forrás kiadásra vonatkozó közlése a következő: @hu
label: har oplysning om udgave for ressource @da
label: hat Ausgabevermerk einer Ressource @de
label: heeft resource-editievermelding @nl
label: kaynak sürüm bildirimi ile ilişkilidir @tr
label: له بيان طبعة لمصدر @ar
label: 有资源版本说明 @zh-hans
definition: Bir kaynağı, kaynağın ait olduğu sürüm hakkındaki bir kaynak bildirimiyle ilişkilendirir. @tr
definition: Hozzákapcsol egy forrást a forrás kiadásáról szóló forrásközléshez. @hu
definition: Liittää aineiston aineistomerkintöön painoksesta, johon aineisto kuuluu. @fi
definition: Relaterer en ressource til en ressourceoplysning om en udgave, som en ressource tilhører. @da
definition: Relates a resource to a resource statement about an edition to which a resource belongs.
definition: Setzt eine Ressource in Beziehung zu einer Ressourcenangabe über eine Ausgabe, zu der eine Ressource gehört. @de
definition: يربط بين مصدر وبيان مصدر حول طبعة التي ينتمي إليها مصدر. @ar
definition: 将一种资源与关于一种资源所属于的一个版本的一个资源说明关联起来。 @zh-hans

has resource frequency statement
lexical alias: resourceFrequencyStatement.en
status: Published
type: Property
label: aineiston ilmestymistiheysmerkintö @fi
label: forrás gyakoriságra vonatkozó közlése a következő: @hu
label: har oplysning om hyppighed for ressource @da
label: hat Angabe zur Erscheinungsfrequenz einer Ressource @de
label: heeft resource-frequentievermelding @nl
label: kaynağın yayın sıklığı bildirimi ile ilişkilidir @tr
label: له بيان تتابع لمصدر @ar
label: 有资源频率说明 @zh-hans
definition: Bir kaynağı, artzamanlı bir kaynağın parçalarının, sayılarının veya yinelemelerinin kaynaklarının verildiği bir aralık hakkındaki bir kaynak bildirimiyle ilişkilendirir. @tr
definition: Hozzákapcsol egy forrást egy időközről szóló forrásközléshez, amely alatt egy diakronikus forrás részeit, számait, iterációit kiadják. @hu
definition: Liittää aineiston aineistomerkintöön tiheydestä, jolla diakronisen aineiston osat, numerot tai iteraatiot ilmestyvät. @fi
definition: Relaterer en ressource til en oplysning om ressource om et interval, hvori ressourcerne for dele, udgaver eller iterationer af en diakronisk ressouce udgives. @da
definition: Relates a resource to a resource statement about an interval at which the resources of parts, issues, or iterations of a diachronic resource are issued.
definition: Setzt eine Ressource in Beziehung zu einer Ressourcenangabe die angibt, in welchem Intervall die Ressourcen von Teilen, Ausgaben oder Iterationen einer diachronen Ressource erscheinen. @de
definition: يربط بين مصدر وبيان مصدر حول الفترة الزمنية التي وفقًا لها يتم إصدار مصادر أجزاء، أعداد، أو تكرارات لمصدر ممتد زمنيًاً. @ar
definition: 将一种资源与关于一种历时资源的部分、期或更新后的整体的资源发行的时间间隔的资源说明关联起来。 @zh-hans

has resource identifier statement
lexical alias: resourceIdentifierStatement.en
status: Published
type: Property
label: aineiston tunnistemerkintö @fi
label: forrás azonosítóra vonatkozó közlése a következő: @hu
label: har identfikatoroplysning for ressource @da
label: hat Angaben zum Identifikator einer Ressource @de
label: heeft resource-identificatievermelding @nl
label: kaynak tanımlayıcısının bildirimi ile ilişkilidir @tr
label: له بيان معرف مصدر @ar
label: 有资源标识符说明 @zh-hans
definition: Bir kaynağı, bir kaynağı tanımlamak için kullanılan, genellikle doğal dil ve sosyal adlandırma kurallarından bağımsız olarak, bir kod, sayı veya başka bir dizi hakkındaki bir kaynak bildirimiyle ilişkilendirir. @tr
definition: Hozzákapcsol egy forrást egy kód-, szám-, vagy más típusú karakterláncból álló forrásközléshez, amely általában független a természetes nyelvektől és társadalmi névkonvencióktól, és egy forrás azonosítására használják. @hu
definition: Liittää aineiston aineistomerkintöön koodista, numerosta tai muusta merkkijonosta, joka on luonnollisesta kielestä ja kielen sosiaalisista konventioista riippumaton aineiston tunnistamiskeino. @fi
definition: Relaterer en ressource til en oplysning om ressource om en kode, et nummer, eller en anden streng, normalt uafhængig af naturligt sprog og sociale navnekonventioner, der bruges til at identificere en ressource. @da
definition: Relates a resource to a resource statement about a code, number, or other string, usually independent of natural language and social naming conventions, used to identify a resource.
definition: Setzt eine Ressource in Beziehung zu einer Ressourcenangabe über einen Code, eine Nummer oder eine andere Zeichenkette, der/die normalerweise nicht in natürlicher Sprache und unabhängig von den sozialen Benennungskonventionen ist und zur Identifizierung einer Ressource verwendet wird. @de
definition: يربط بين مصدر وبيان مصدر حول رمز، رقم، أو سلسلة تمثيلات أخرى، عادة ما تكون مستقلة عن اللغة الطبيعية وعن التسميات المتعارف عليها اجتماعيًا، المستخدمة في تحديد هوية مصدر. @ar
definition: 将一种资源与关于通常独立于自然语言和社会命名惯例、用以标识一种资源的代码、数字或其他串的一个资源说明关联起来。 @zh-hans

has resource manufacture statement
lexical alias: resourceManufactureStatement.en
status: Published
type: Property
label: aineiston valmistusmerkintö @fi
label: forrás gyártásra vonatkozó közlése a következő: @hu
label: har oplysning om producent for ressource @da
label: hat Herstellungsangabe einer Ressource @de
label: heeft resource-vervaardigingsvermelding @nl
label: kaynak üreticisi bildirimi ile ilişkilidir @tr
label: له بيان تصنيع لمصدر @ar
label: 有资源生产说明 @zh-hans
definition: Bir kaynağı, yayınlanmış bir kaynağın yazdırılması, çoğaltılması, yayınlanması vb. ile ilgili veriler hakkındaki bir kaynak bildirimiyle ilişkilendirir. @tr
definition: Hozzákapcsol egy forrást egy kiadott forrás nyomtatásával, sokszorosításával, öntésével stb. kapcsolatos adatokról szóló forrásközléshez. @hu
definition: Liittää aineiston aineistomerkintöön julkaistun aineiston painamiseen, monistamiseen, kirjasinten valamiseen tai muuhun valmistustapaan liittyvistä tiedoista. @fi
definition: Relaterer en ressource til en oplysning om ressource om data vedrørende trykning, duplikering, støbning etc. af en udgiven ressource. @da
definition: Relates a resource to a resource statement about data relating to the printing, duplicating, casting, etc., of a published resource.
definition: Setzt eine Ressource in Beziehung zu einer Ressourcenangabe, die Daten zum Druck, zur Vervielfältigung, zum Guss und so weiter einer veröffentlichten Ressource enthält. @de
definition: يربط بين مصدر وبيان مصدر حول البيانات المتعلقة بطباعة، نسخ، طَرَح...إلخ، مصدر منشور. @ar
definition: 将一种资源与关于和一种出版资源的印刷、复制、铸造或其他生产方法有关的数据的一个资源说明关联起来。 @zh-hans

has resource production statement
lexical alias: resourceProductionStatement.en
status: Published
type: Property
label: aineiston tuotantomerkintö @fi
label: forrás előállításra vonatkozó közlése a következő: @hu
label: har oplysning om produktion for ressource @da
label: hat Entstehungsangabe einer Ressource @de
label: heeft resource-productievermelding @nl
label: kaynak yapım bildirimi ile ilişkilidir @tr
label: له بيان إنتاج لمصدر @ar
label: 有资源制作说明 @zh-hans
definition: Bir kaynağı, yayınlanmamış bir kaynağın yazımı, üretimi, yapımı vb. ile ilgili veriler hakkındaki bir kaynak bildirimiyle ilişkilendirir. @tr
definition: Hozzákapcsol egy forrást egy kiadatlan forrás írásával, összeállításával, készítésével stb. kapcsolatos adatokról szóló forrásközléshez. @hu
definition: Liittää aineiston aineistomerkintöön julkaisemattoman aineiston kaivertamiseen, valmistamiseen, kokoamiseen tai muuhun tuotantotapaan liittyvistä tiedoista. @fi
definition: Relaterer en ressource til en oplysning om ressource om data vedrørende indskrift, fremstilling, konstruktion etc. af en ikke udgiven ressource. @da
definition: Relates a resource to a resource statement about data relating to the inscription, fabrication, construction, etc., of an unpublished resource.
definition: Setzt eine Ressource in Beziehung zu einer Ressourcenangabe, die Daten zu der Beschriftung, der Fabrikation, der Konstruktion und so weiter einer unveröffentlichten Ressource enthält. @de
definition: يربط بين مصدر وبيان مصدر حول البيانات المتعلقة بتسجيل، تصنيع، إنشاء...إلخ، مصدر غير منشور. @ar
definition: 将一种资源与关于和一种非出版资源的镌刻、制造、构建或其他制作方法有关的数据的一个资源说明关联起来。 @zh-hans

has resource publication statement
lexical alias: resourcePublicationStatement.en
status: Published
type: Property
label: aineiston julkaisumerkintö @fi
label: forrás kiadásra vonatkozó közlése a következő: @hu
label: har oplysning om publicering for ressource @da
label: hat Veröffentlichungsangabe einer Ressource @de
label: heeft resource-publicatievermelding @nl
label: kaynak yayınlama bildirimi ile ilişkilidir @tr
label: له بيان نشر لمصدر @ar
label: 有资源出版说明 @zh-hans
definition: Bir kaynağı, bir kaynağın yayınlanması, basılması veya piyasaya sürülmesiyle ilgili bir kaynak bildirimiyle ilişkilendirir. @tr
definition: Hozzákapcsol egy forrást egy forrás kiadásához, kibocsájtásához vagy megjelentetéséhez szóló forrásközléshez. @hu
definition: Liittää aineiston aineistomerkintöön aineiston kustantamiseen, julkaisemiseen, ilmestymiseen tms. liittyvistä tiedoista. @fi
definition: Relaterer en ressource til en oplysning om en ressource om publicering, frigivelse eller udgivelse af en ressource. @da
definition: Relates a resource to a resource statement about the publication, release, or issuing of a resource.
definition: Setzt eine Ressource in Beziehung zu einer Ressourcenangabe, die Informationen über die Veröffentlichung, das Release oder die Herausgabe einer Ressource enthält. @de
definition: يربط بين مصدر وبيان مصدر حول نشر، تحرير، أو إصدار مصدر. @ar
definition: 将一种资源与关于一种资源出版、发布或发行的一个资源说明关联起来。 @zh-hans

has resource regional encoding statement
lexical alias: resourceRegionalEncodingStatement.en
status: Published
type: Property
label: aineistomerkintö aluekoodista @fi
label: forrás regionális kódolásra vonatkozó közlése a következő: @hu
label: har oplysning om regional kodning for ressource @da
label: hat Angabe zum Regionalcode einer Ressource @de
label: heeft resource-regiocoderingsvermelding @nl
label: kaynak bölgesel kodlama bildirimi ile ilişkilidir @tr
label: له بيان أكواد مناطق لمصدر @ar
label: 有资源地区编码说明 @zh-hans
definition: Bir kaynağı, bir videodisk veya video oyunu taşıyıcısının kodlandığı dünyanın bir veya daha fazla bölgesi için bir tanımlaması hakkındaki bir kaynak bildirimiyle ilişkilendirir ve oynatmanın kodunu çözmek için yapılandırılmış bir cihazla sınırlı olduğunu belirtir. @tr
definition: Hozzákapcsol egy forrást egy forrásközléshez, amely vegy videolemez vagy videojáték-hordozó kódolásáról szól, a világ egy vagy több régiójának jelölésével, és azt jelzi, hogy a lejátszás egy dekódolásra konfigurált eszközre korlátozódik. @hu
definition: Liittää aineiston aineistomerkintöön määritteestä, jolla identifioidaan videolevyn tai videopelitallenteen käyttöalue ja estetään niiden käyttäminen toisella alueella myydyllä soittimella. @fi
definition: Relaterer en ressource til en oplysning om ressource om en betegnelse for en eller flere regioner i verden, som en videodisk eller video spillekonsol er blevet kodet til, hvilket indikerer, at afspilning er begrænset til en enhed, der der konfigureret til at afkode den. @da
definition: Relates a resource to a resource statement about a designation for one or more regions of the world for which a videodisc or video game carrier has been encoded, indicating that playback is restricted to a device configured to decode it.
definition: Setzt eine Ressource in Beziehung zu einer Ressourcenangabe, die die Region(en) der Welt angibt, für die eine Videodisk oder ein Videospiel-Datenträger kodiert ist, und der verhindert, dass die Disk von einem Wiedergabegerät, das in einer anderen Region verkauft wurde, abgespielt werden kann. @de
definition: يربط بين مصدر وبيان مصدر حول تسمية منطقة أو أكثر من العالم التي تم تشفير حامل قرص الفيديو أو ألعاب الفيديو وفقًا له، ويوضح أن التشغيل مقيد بجهاز معد لفك الكود. @ar
definition: 将一种资源与关于视盘或视频游戏载体被编码后表示对设置解码回放的设备限制的世界上一个或多个地区的标识的一个资源说明关联起来。 @zh-hans

has resource series statement
lexical alias: resourceSeriesStatement.en
status: Published
type: Property
label: aineiston sarjamerkintö @fi
label: forrás sorozatra vonatkozó közlése a következő: @hu
label: har oplysning om serie for ressource @da
label: hat Gesamttitelangabe einer Ressource @de
label: heeft resource-reeksvermelding @nl
label: kaynak serisi bildirimi ile ilişkilidir @tr
label: له بيان سلسلة لمصدر @ar
label: 有资源丛编说明 @zh-hans
definition: Bir kaynağı, bir kaynağın ait olduğu bir seri ve seri içindeki bir sıra hakkındaki bir kaynak bildirimiyle ilişkilendirir. @tr
definition: Hozzákapcsol egy forrást egy forrás sorozatáról és a sorozaton belüli számozásáról szóló forrásközléshez. @hu
definition: Liittää aineiston aineistomerkintöön aineistoon liittyvästä sarjasta ja aineiston numeroinnista sarjassa. @fi
definition: Relaterer en ressource til en oplysning om ressource om en serie, som en ressource tilhører og en rækkefølge indenfor denne serie. @da
definition: Relates a resource to a resource statement about a series to which a resource belongs and a sequence within the series.
definition: Setzt eine Ressource in Beziehung zu einer Ressourcenangabe, die Informationen über eine Reihe enthält, zu der eine Ressource gehört und zu deren Reihenfolge innerhalb der Reihe. @de
definition: يربط بين مصدر وبيان مصدر حول سلسلة ينتمي إليها مصدر وتسلسل داخل السلسلة. @ar
definition: 将一种资源与关于一种资源所属于的一种丛编以及在丛编内的序列的一个资源说明关联起来。 @zh-hans

has resource statement
lexical alias: resourceStatement.en
status: Published
type: Property
label: aineistomerkintö @fi
label: forrásközlése a következő: @hu
label: har oplysning om ressource @da
label: hat Ressourcenangabe @de
label: heeft resourcevermelding @nl
label: kaynak bildirimi ile ilişkilidir @tr
label: له بيان مصدر @ar
label: 有资源说明 @zh-hans
definition: Bir kaynağı, bir kaynakla ilişkilendirilmiş bir seri ve seri içindeki bir kaynağın numaralandırılması hakkındaki bir kaynak bildirimiyle ilişkilendirir. @tr
definition: Hozzákapcsol egy forrást egy forráshoz társított sorozatról és a forrás sorozaton belüli számozásáról szóló forrásközléshez. @hu
definition: Liittää aineiston aineistomerkintöön liittyvästä sarjasta ja aineiston numeroinnista sarjassa. @fi
definition: Relaciona un recurs amb una menció de recurs que figura en un recurs i que es considera significativa perquè els usuaris entenguin com el recurs es representa a si mateix. @ca
definition: Relaterer en ressource til en oplysning om ressource om en serie, der er knyttet til en ressource og nummrering af en ressource indenfor denne serie. @da
definition: Relates a resource to a resource statement appearing in a resource and deemed to be significant for users to understand how the resource represents itself.
definition: Setzt eine Ressource in Beziehung zu einer Ressourcenangabe, die Informationen über eine Reihe enthält, mit der eine Ressource in Verbindung steht und die eine Zählung einer Ressource innerhalb der Reihe aufweist. @de
definition: يربط بين مصدر وبيان مصدر حول سلسلة مرتبطة بمصدر وترقيم مصدر داخل السلسلة. @ar
definition: 将一种资源与在一种资源中出现并被认为对使用者理解该资源呈现方式重要的一个说明关联起来。 @zh-hans
scope note: Aineiston sarjamerkintö sisältää jonkin tai kaikki näistä: sarjan nimeke, sarjan muu nimeketieto, sarjaan liittyvä vastuullisuusmerkintö, ISSN, sarjanumerointi. @fi
scope note: Egy sorozati forrásközlés magában foglalja a sorozat bármely vagy összes főcímét, egy sorozat egyébcím-információját, a sorozattal kapcsolatos felelősségi közlést, ISSN-t és sorrendiséget jelző számozást. @hu
scope note: Kaynak dizisi bildirimi, dizinin herhangi bir veya tüm başlığını, dizinin diğer başlık bilgilerini, diziyle ilgili sorumluluk bildirimini, ISSN'yi veya dizi içindeki numaralandırmayı içerir. @tr

has resource title and responsibility statement
lexical alias: resourceTitleAndResponsibilityStatement.en
status: Published
type: Property
label: aineiston nimeke- ja vastuullisuusmerkintö @fi
label: forrás címre és szerzőségre vonatkozó közlése a következő: @hu
label: har oplysning om ressourcetitel og ophav @da
label: hat Titel und Verantwortlichkeitsangabe einer Ressource @de
label: heeft resource-titel en verantwoordelijkheidsvermelding @nl
label: kaynak başlığı ve sorumluluk bildirimi ile ilişkilidir @tr
label: له بيان عنوان ومسؤولية لمصدر @ar
label: 有资源题名和责任说明 @zh-hans
definition: Bir kaynağı, bir kaynak adı ve kaynağı oluşturan ya da kaynağın içeriğine katkıda bulunan temsilci hakkındaki bir kaynak bildirimiyle ilişkilendirir. @tr
definition: Hozzákapcsol egy forrást egy a forrás megnevezéséről és a forrás tartalmát létrehozó vagy ahhoz hozzájáruló ágensről szóló forrásközléshez. @hu
definition: Liittää aineiston aineistomerkintöön aineiston nimekkeistä ja aineistoon sisältyvän aineiston sisältöön vaikuttavien toimijoiden nimistä. @fi
definition: Relaterer en ressource til en oplysning om ressource om et navn på en ressource og den agent der har skabt eller bidraget til ressourcens indhold. @da
definition: Relates a resource to a resource statement about a name of a resource and the agent creating or contributing to the content of the resource.
definition: Setzt eine Ressource in Beziehung zu einer Ressourcenangabe, die einen Namen einer Ressource und den Akteur enthält, der den Inhalt der Ressource erstellt oder dazu beigetragen hat. @de
definition: يربط بين مصدر وبيان مصدر حول اسم المصدر والوكيل الذي ينشئ محتوى مصدر أو يساهم فيه. @ar
definition: 将一种资源与关于一种资源的名称以及对一种资源之内容的创建或有贡献的一个行为者的名称的一个资源说明关联起来。 @zh-hans
scope note: A resource title and responsibility statement includes any kind of title or statement of responsibility that is associated with the content of the resource, but does not include a title or statement of responsibility that is associated with an edition, revision or series that is related to the resource.
scope note: Aineiston nimeke- ja vastuullisuusmerkintö sisältää kaikenlaiset nimekkeet (ml. päänimekkeen, nimekkeen varianttimuodot ja muun nimeketiedon) sekä kaikenlaiset aineiston sisältöön liittyvät vastuullisuusmerkinnöt. aineiston nimeke- ja vastuullisuusmerkintö ei sisällä sarjaan liittyviä nimekkeitä eikä sarjasta vastuussa olevien toimijoiden nimiä. @fi
scope note: Darunter fallen alle Arten von Titeln (Haupttitel, abweichende Titel und Titelzusätze) oder Verantwortlichkeitsangaben, die mit dem Inhalt der Ressource in Beziehung stehen. Darunter fallen keine Titel oder Verantwortlichkeitsangaben von in Beziehung stehenden Ausgaben, Überarbeitungen oder Reihen, die mit der Ressource in Verbindung stehen. @de
scope note: Egy forrás cím- és szerzőségi közlése magában foglal bármilyen címet és felelősségi közlést, amelyeket a forrás tartalmához társítanak, de nem foglalja magában a forrás kiadáshoz, átdolgozáshoz vagy sorozathoz társított címét és felelősségi közlését. @hu
scope note: En oplysning om ressourcetitel og ophav omfatter enhver form for titel eller ophavsangivelse, som er knyttet til ressourcens indhold, men omfatter ikke en titel eller ophavsanivelse, som er knyttet til en udgave, serierevistion, der er relateret til ressourcen. @da
scope note: Kaynak başlığı ve sorumluluk bildirimi, kaynağın içeriğiyle bağlantılı olan her türlü başlığı veya sorumluluk bildirimini içerir, ancak kaynakla bağlantılı olan bir baskı, revizyon veya diziyle ilişkili bir başlığı veya sorumluluk bildirimini içermez. @tr
scope note: يتضمن بيان عنوان ومسؤولية لمصدر على أي نوع من العناوين أو بيان المسؤولية المرتبط بمحتوى المصدر، ولكن لا يتضمن عنوانًا أو بيان مسؤولية مرتبطًا بإصدار، مراجعة أو سلسلة مرتبطة بالمصدر. @ar
scope note: 资源题名和责任说明包括与该资源的内容有关的任何类型的题名或责任说明，但不包括与该资源所关联的版本、修订或丛编的题名或责任说明。 @zh-hans

has font point size
lexical alias: fontPointSize.en
status: Published
type: Property
label: aineiston kirjasimen pistekoko @fi
label: betűmérete a következő: @hu
label: har skrifttypes punktstørrelse @da
label: hat Punktgröße der Schrift @de
label: heeft puntgrootte font @nl
label: yazı tipi punto boyutu ile ilişkilidir @tr
label: له حجم خط @ar
label: 有字体点大小 @zh-hans
definition: Bir kaynağı, bir kaynaktaki karakterleri ve sembolleri temsil etmek için kullanılan türün punto boyutuyla ilişkilendirir. @tr
definition: Hozzákapcsol egy forrást egy típus pontméretéhez, amelyet egy forrás karaktereinek és szimbólumainak ábrázolására használnak. @hu
definition: Liittää aineiston aineistossa esiintyvien merkkien ja symbolien pistekokoon. @fi
definition: Relaterer en ressource til en punktstørrelse af den skrifttype der er brugt for at repræsentere bogstæverne og symbolerne i en ressource. @da
definition: Relates a resource to a point size of the type used to represent the characters and symbols in a resource.
definition: Setzt eine Ressource in Beziehung zu einer Punktgröße der Schrift, die zur Darstellung der Zeichen und Symbole in einer Ressource verwendet wird. @de
definition: يربط بين مصدر وحجم الخط المستخدم في طباعة التمثيلات والرموز في مصدر. @ar
definition: 将一种资源与在一种资源中用于表示字符和符号的字型的点大小关联起来。 @zh-hans

has designation of version
lexical alias: designationOfVersion.en
status: Published
type: Property
label: aineiston version määrite @fi
label: har betegnelse for version @da
label: hat Ausgabebezeichnung @de
label: heeft aanduiding van versie @nl
label: sürüm ile ilişkilidir @tr
label: verziójelölése a következő: @hu
label: له تسمية لنسخة @ar
label: 有版本标识 @zh-hans
definition: Bir kaynağı başka bir kaynaktan ayıran bir kelime veya ifadeyle ilişkilendirir. @tr
definition: Hozzákapcsol egy forrást egy olyan szóhoz vagy kifejezéshez, amely megkülönböztet egy forrást egyik másiktól. @hu
definition: Liittää aineiston sanaan tai ilmaukseen, joka erottaa aineiston toisesta aineistosta. @fi
definition: Relaterer en ressource til et ord eller en frase, som adskiller en ressource fra en anden ressource. @da
definition: Relates a resource to a word or phrase that distinguishes a resource from another resource.
definition: Setzt eine Ressource in Beziehung zu einem Wort oder einer Phrase, die dazu dient, eine Ressource von einer anderen Ressource zu unterscheiden. @de
definition: يربط بين مصدر وكلمة أو عبارة تميز مصدر عن مصدر آخر. @ar
definition: 将一种资源与区分一种资源和另一种资源的一个词或短语关联起来。 @zh-hans

has scheme of nomen
lexical alias: schemeOfNomen.en
status: Published
type: Property
label: har skema for nomen @da
label: hat Schema eines Nomens @de
label: heeft schema van nomen @nl
label: isim şeması ile ilişkilidir @tr
label: nomen sémája a következő: @hu
label: nomenin järjestelmä @fi
label: له خطة لتسمية @ar
label: 有命名的体系 @zh-hans
definition: Bir ismi, içinde bir unvanın oluşturulduğu bir şema ile ilişkilendirir. @tr
definition: Hozzákapcsol egy noment egy sémához, amelyben egy megnevezés testet ölt. @hu
definition: Liittää nomenin järjestelmään, jossa nimitys on luotu. @fi
definition: Relaciona un nomen amb un esquema en el qual s’estableix un nomen. @ca
definition: Relaterer et nomen til et skema, hvori der er etabelerat en appellation. @da
definition: Relates a nomen to a scheme in which a nomen is established.
definition: Setzt ein Nomen in Beziehung zu einem Schema, in dem eine Bezeichnung festgelegt ist. @de
definition: يربط بين تسمية وخطة يتكون من خلالها إنشاء التسمية. @ar
definition: 将一个命名与命名在其中建立的一个体系关联起来。 @zh-hans
scope note: A séma lehet egy érték, vagy szótárkódolási séma, vagy egy szintaxis kódolási sémája. @hu
scope note: Das Schema kann entweder ein Value oder Vocabulary Encoding Scheme oder ein Syntax Encoding Scheme sein. @de
scope note: Järjestelmä voi olla arvojen, sanaston tai syntaksin merkintäjärjestelmä. @fi
scope note: Skemaet kan være et værdi eller et vokabularkodningsskema, eller et syntakskodningsskema. @da
scope note: The scheme can be a value or vocabulary encoding scheme or a syntax encoding scheme.
scope note: Şema bir değer veya kelime kodlama şeması veya bir sözdizimi kodlama şeması olabilir. @tr
scope note: يمكن أن تكون الخطة عبارة عن قيمة أو خطة ترميز مصطلحات او خطة ترميز بناء جملة. @ar
scope note: 该体系可以是值或词表编码体系或者串编码体系 @zh-hans

has script of nomen
lexical alias: scriptOfNomen.en
status: Published
type: Property
label: har skriftsystem for nomen @da
label: hat Schrift eines Nomens @de
label: heeft schrift van nomen @nl
label: ismin yazı sistemi ile ilişkilidir @tr
label: nomen írásrendszere a következő: @hu
label: nomenin kirjoitusjärjestelmä @fi
label: له نص لتسمية @ar
label: 有命名的文字 @zh-hans
definition: Bir ismi, bir unvanın oluşturulduğu bir dizi karakter veya sembolle ilişkilendirir. @tr
definition: Hozzákapcsol egy noment egy karakter- vagy szimbólumkészlethez, amellyel egy megnevezést megformáznak. @hu
definition: Liittää nomenin merkkien ja symbolien joukkoon, josta nimitys muodostetaan. @fi
definition: Relaterer et nomen til et set af tegn eller sympoler, som en appellation er dannet med. @da
definition: Relates a nomen to a set of characters or symbols with which an appellation is formed.
definition: Setzt ein Nomen in Beziehung zu einem Satz von Zeichen oder Symbolen, mit denen eine Bezeichnung gebildet wird. @de
definition: يربط بين تسمية ومجموعة من تمثيلات أو رموز تتكون من خلالها التسمية. @ar
definition: 将一个命名与用以形成一个称谓的一个字符或符号的集合关联起来。 @zh-hans

is fingerprint of
lexical alias: fingerprintOf.en
status: Published
type: Property
label: er fingeraftryk af @da
label: is vingerafdruk van @nl
label: ist Fingerabdruck von @de
label: parmak izidir @tr
label: sormenjälkitunniste @fi
label: ujjlenyomata a következőnek: @hu
label: هي بصمة لـ @ar
label: 是……的指纹 @zh-hans
inverse of: has fingerprint
definition: Bir ismi, yayın tarihi veya başka bir öğe ile birleştirilmiş bir kaynakta belirtilen konumlardan bir grup karakterden oluşan kaynak için tanımlayıcıya sahip bir kaynakla ilişkilendirir. @tr
definition: Hozzákapcsol egy noment egy forráshoz, amely rendelkezik olyan forrásazonosítóval, amely a forrás meghatározott helyeiről származó karakterek csoportjából áll, kombinálva a kiadás időpontjával vagy más elemmel. @hu
definition: Liittää nomenin aineistoon, jonka tunniste muodostuu aineiston tietyistä kohdista poimittujen merkkien yhdistämisestä julkaisuaikaan tai muihin elementteihin. @fi
definition: Relaterer et nomen til en ressource, som har en identifikator for ressource, der består af en gruppe tegn fra specificerede steder i en ressource kombineret med en udgivelsesdato eller et andet element. @da
definition: Relates a nomen to a resource that has an identifier for resource that consists of a group of characters from specified locations in a resource combined with a date of publication or other element.
definition: Setzt ein Nomen in Beziehung zu einer Ressource, die über einen Identifikator für eine Ressource verfügt, der aus einer Kombination von einer Gruppe von Zeichen von bestimmten Stellen einer Ressource und einem Veröffentlichungsdatum oder einem anderen Element besteht. @de
definition: يربط تسمية بمصدر له مُعرِّف لمصدر يتضمن مجموعة تمثيلات من مواقع محددة فى مصدر مدمجة مع تاريخ نشر أو عنصر آخر. @ar
definition: 将一个命名与有由资源中取自特定位置的一组字符与出版日期或其他元素结合而组成的资源的一个标识符的一种资源关联起来。 @zh-hans

has reference source
lexical alias: referenceSource.en
status: Published
type: Property
label: felhasznált forrása a következő: @hu
label: har referfencekilde @da
label: hat Nachschlagewerk @de
label: heeft naslagwerk @nl
label: referans kaynağı ile ilişkilidir @tr
label: tietolähde @fi
label: له مصدر مرجعي @ar
label: 有参考信息源 @zh-hans
inverse of: is reference source of
definition: Bir ismi, bir ismin kullanımına dair ipucu sağlayan bir kaynakla ilişkilendirir. @tr
definition: Hozzákapcsol egy noment egy forráshoz, amelyben bizonyíték van egy nomen használatára. @hu
definition: Liittää nomenin aineistoon, joka antaa todisteen nomenin käytöstä. @fi
definition: Relaterer et nomen til en ressource, som giver evidens for brugen af et nomen. @da
definition: Relates a nomen to a resource which provides evidence for the use of a nomen.
definition: Setzt ein Nomen in Beziehung zu einer Quelle, in der die Verwendung eines Nomens nachgewiesen wird. @de
definition: يربط بين تسمية ومرجع يقدم دليل على استخدام تسمية. @ar
definition: 将一个命名与为一个命名的使用提供证据的一种资源关联起来。 @zh-hans

has status of identification
lexical alias: statusOfIdentification.en
status: Published
type: Property
label: azonosítás státusza a következő: @hu
label: har status af identifikation @da
label: hat Status einer Identifikation @de
label: heeft status van identificatie @nl
label: tanımlama durumu ile ilişkilidir @tr
label: tunnistamistaso @fi
label: لها حالة للتعريف @ar
label: 有识别状态 @zh-hans
definition: Bir ismi, bir varlığın isminin kimlik doğrulama seviyesinin bir göstergesi ile ilişkilendirir. @tr
definition: Hozzákapcsol egy noment egy entitás nomenjének hitelesítési szintjére vonatkozó jelzéshez. @hu
definition: Liittää nomenin ilmaukseen entiteetin nomenin oikeaksi todistamisen tasosta. @fi
definition: Relaterer et nomen til en indikation af et autentificeringsniveau for en enheds nomen. @da
definition: Relates a nomen to an indication of a level of authentication of the nomen of an entity.
definition: Setzt ein Nomen in Beziehung zu einer Angabe über einen Grad der Authentifizierung des Nomens einer Entität. @de
definition: يربط بين تسمية ومؤشر لمستوى التَصدِيق لتسمية كيان. @ar
definition: 将一个命名与一个实体的命名的认证级别的指示关联起来。 @zh-hans

has colour
lexical alias: colour.en
status: Published
type: Property
label: a színe a következő: @hu
label: aineiston väri @fi
label: har farve @da
label: hat Farbe @de
label: heeft kleur @nl
label: renk ile ilişkilidir @tr
label: له لون @ar
label: 有颜色 @zh-hans
definition: Bir kaynağı, kaynağın görsel içeriğinin tonunu yansıtan bir sınıflandırmayla ilişkilendirir. @tr
definition: Hozzákapcsol egy forrást egy forrás vizuális tartalmának színárnyalatát tükröző kategorizáláshoz. @hu
definition: Liittää aineiston kategorisointiin, joka ilmaisee aineiston visuaalisen sisällön värisävyn. @fi
definition: Relaterer en ressouree til en kategorisering, som afspejler en nyance af det visuelle indhold af en ressource. @da
definition: Relates a resource to a categorization reflecting a hue of the visual content of a resource.
definition: Setzt eine Ressource in Beziehung zu einer Kategorisierung, die einen Farbton des bildlichen Inhalts einer Expression widerspiegelt. @de
definition: يربط بين مصدر وفئة تعكس تدرجًا للمحتوى المرئي لمصدر. @ar
definition: 将一种资源与反映一种资源的视觉内容的色调的一个分类关联起来。 @zh-hans

has access point for agent
lexical alias: accessPointForAgent.en
status: Published
type: Property
label: hakutieto toimijalle @fi
label: har søgeindgang for agent @da
label: hat Sucheinstieg für einen Akteur @de
label: heeft ingang voor actor @nl
label: hozzáférési pontja ágenshez a következő: @hu
label: temsilci için erişim noktası ile ilişkilidir @tr
label: له نقطة إتاحة لوكيل @ar
label: 有行为者的检索点 @zh-hans
sub property of: has access point for entity
inverse of: is access point for agent of
definition: Bir temsilciyi, bir kelime kodlama şemasından alınan veya bir dize kodlama şeması kullanılarak oluşturulan doğal dildeki bir temsilci unvanıyla ilişkilendirir. @tr
definition: Hozzákapcsol egy ágenst egy ágens olyan természetes nyelvű megnevezéséhez, amely egy szótárkódolási sémából származik, vagy egy karakterlánc-kódolási séma használatával szerkesztett. @hu
definition: Liittää toimijan luonnollisen kielen mukaiseen nimitykseen, joka on otettu jostakin sanaston merkintäjärjestelmästä tai muodostettu jotakin merkkijonon merkintäjärjestelmää käyttäen. @fi
definition: Relaciona un agent amb un nomen que és una apel·lació d’agent en llenguatge natural que s’obté d’un esquema de codificació de vocabulari o s’elabora usant un esquema de codificació de cadenes. @ca
definition: Relaterer en agent til en benævnelse på agent på naturligt sprog, der er hentet fra et vokabularkodningsskema eller er konstrueret ved brug af et strengkodningsskema. @da
definition: Relates an agent to a nomen that is an appellation of agent in natural language that is taken from a vocabulary encoding scheme or is constructed using a string encoding scheme.
definition: Setzt einen Akteur in Beziehung zu einer Bezeichnung für einen Akteur in natürlicher Sprache, die einem Vocabulary Encoding Scheme entnommen oder mit einem String Encoding Scheme konstruiert wird. @de
definition: يربط بين وكيل وتسمية لوكيل في اللغة الطبيعية المأخوذة من مخطط ترميز مفردات أو أنشئت باستخدام خطة ترميز سلسلة تمثيلات. @ar
definition: 将一个行为者与作为一个行为者的称谓、取自一个词表编码体系或者用一个串编码体系构建、用自然语言的一个命名关联起来。 @zh-hans

is access point for agent of
lexical alias: accessPointForAgentOf.en
status: Published
type: Property
label: er søgindgang for agent af @da
label: hakutieto toimijalle @fi
label: hozzáférési pont a következő ágenshez: @hu
label: is ingang voor actor van @nl
label: ist Sucheinstieg für einen Akteur von @de
label: temsilcisi için erişim noktasıdır @tr
label: هو نقطة إتاحة لوكيل لـ @ar
label: 是……的行为者的检索点 @zh-hans
sub property of: is access point for entity of
inverse of: has access point for agent
definition: Bir ismi, kelime kodlama şemasından alınan veya bir dizi kodlama şeması kullanılarak oluşturulan yerel dilde bir unvana sahip olan temsilciyle ilişkilendirir. @tr
definition: Hozzákapcsol egy noment egy ágenshez, amelynek természetes nyelvű megnevezése egy szótárkódolási sémából származik, vagy egy karakterlánc-kódolási séma használatával szerkesztett. @hu
definition: Liittää nomenin toimijaan, jonka luonnollisen kielen mukainen nimitys on otettu jostakin sanaston merkintäjärjestelmästä tai muodostettu jotakin merkkijonon merkintäjärjestelmää käyttäen. @fi
definition: Relaterer et nomen til en agent, der har en benævnelse på sted´på naturligt sprog, der er hentet fra et vokabularkodningsskema eller er konstrueret ved brug af et strengkodningsskema. @da
definition: Relates a nomen to an agent who has an appellation in natural language that is taken from a vocabulary encoding scheme or is constructed using a string encoding scheme.
definition: Setzt ein Nomen in Beziehung zu einem Akteur, der eine Bezeichnung in natürlicher Sprache hat, die einem Vocabulary Encoding Scheme entnommen oder mit einem String Encoding Scheme konstruiert wird. @de
definition: يربط بين تسمية ووكيل له تسمية في اللغة الطبيعية المأخوذة من مخطط ترميز مفردات أو أنشئت باستخدام خطة ترميز سلسلة تمثيلات. @ar
definition: 将一个命名与有取自一个词表编码体系或者用一个串编码体系构建、用自然语言的一个称谓的一个行为者关联起来。 @zh-hans

has access point for place
lexical alias: accessPointForPlace.en
status: Published
type: Property
label: hakutieto paikalle @fi
label: har søgeindgang for sted @da
label: hat Sucheinstieg für ein Geografikum @de
label: heeft ingang voor plaats @nl
label: hozzáférési pontja helyhez a következő: @hu
label: yer için erişim noktası ile ilişkilidir @tr
label: له نقطة وصول لمكان @ar
label: 有地点的检索点 @zh-hans
sub property of: has access point for entity
inverse of: is access point for place of
definition: Bir yeri, bir kelime kodlama şemasından alınan veya bir dize kodlama şeması kullanılarak oluşturulan yerel dildeki bir yer adıyla ilişkilendirir. @tr
definition: Hozzákapcsol egy helyet egy hely szótárkódolási sémából vett vagy karakterlánc-kódolási séma felhasználásával konstruált természetes nyelvi megnevezéséhez. @hu
definition: Liitää paikan luonnollisella kielellä olevaan paikan nimitykseen, joka on otettu jostakin sanaston merkintäjärjestelmästä tai muodostettu jotakin merkkijonon merkintäjärjestelmää käyttäen. @fi
definition: Relaciona un lloc amb un nomen que és una apel·lació de lloc en llenguatge natural que s’obté d’un esquema de codificació de vocabulari o s’elabora usant un esquema de codificació de cadenes. @ca
definition: Relaterer et sted til en benævnelse for sted på naturligt sprog, der er hentet fra et vokabularkodningsskema eller er konstrueret ved brug af et strengkodningsskema. @da
definition: Relates a place to a nomen that is an appellation of place in natural language that is taken from a vocabulary encoding scheme or is constructed using a string encoding scheme.
definition: Setzt ein Geografikum in Beziehung zu einer Bezeichnung für ein Geografikum in natürlicher Sprache, die einem Vocabulary Encoding Scheme entnommen oder mit einem String Encoding Scheme konstruiert wird. @de
definition: يربط بين مكان وتسمية لمكان في اللغة الطبيعية المأخوذة من مخطط ترميز مفردات أو أنشئت باستخدام خطة ترميز سلسلة تمثيلات. @ar
definition: 将一个地点与作为一个地点的称谓、取自一个词表编码体系或者用一个串编码体系构建、用自然语言的一个命名关联起来。 @zh-hans

is access point for place of
lexical alias: accessPointForPlaceOf.en
status: Published
type: Property
label: er søgeindgang for sted af @da
label: hakutieto paikalle @fi
label: hozzáférési pont a következő helyhez: @hu
label: is ingang voor plaats van @nl
label: ist Sucheinstieg für ein Geografikum von @de
label: yeri için erişim noktasıdır @tr
label: هي نقطة وصول لمكان لـ @ar
label: 有……的地点的检索点 @zh-hans
sub property of: is access point for entity of
inverse of: has access point for place
definition: Bir ismi, bir kelime kodlama şemasından alınan veya bir dize kodlama şeması kullanılarak oluşturulan yerel dilde bir adı olan bir yerle ilişkilendirir. @tr
definition: Hozzákapcsol egy noment egy helyhez, amelynek természetes nyelvű megnevezése egy szótárkódolási sémából származik, vagy egy karakterlánc-kódolási séma használatával szerkesztett. @hu
definition: Liittää nomenin paikkaan, jonka luonnollisen kielen mukainen nimitys on otettu jostakin sanaston merkintäjärjestelmästä tai muodostettu jotakin merkkijonon merkintäjärjestelmää käyttäen. @fi
definition: Relaterer et nomen til et sted, der har en benævngelse på naturligt sprog, der er hentet fra et vokabularkodningsskema eller er konstrueret ved brug af et strengkodningsskema. @da
definition: Relates a nomen to a place that has an appellation in natural language that is taken from a vocabulary encoding scheme or is constructed using a string encoding scheme.
definition: Setzt ein Nomen in Beziehung zu einem Geografikum, das eine Bezeichnung in natürlicher Sprache hat, die einem Vocabulary Encoding Scheme entnommen oder mit einem String Encoding Scheme konstruiert wird. @de
definition: يربط بين تسمية ومكان له اسم في لغة طبيعية مأخوذة من خطة ترميز مفردات أو مبنية باستخدام خطة ترميز سلسلة تمثيلات. @ar
definition: 将一个命名与有取自一个词表编码体系或者用一个串编码体系构建、用自然语言的一个称谓的一个地点关联起来。 @zh-hans

has access point for resource
lexical alias: accessPointForResource.en
status: Published
type: Property
label: hakutieto aineistolle @fi
label: har søgeindgang for ressource @da
label: hat Sucheinstieg für eine Ressource @de
label: heeft ingang voor resource @nl
label: hozzáférési pont forráshoz a következő: @hu
label: kaynak için erişim noktası ile ilişkilidir @tr
label: له نقطة وصول لمصدر @ar
label: 有资源的检索点 @zh-hans
sub property of: has access point for entity
inverse of: is access point for resource of
definition: Bir kaynağı, bir kelime kodlama şemasından alınan veya bir dizi kodlama şeması kullanılarak oluşturulan doğal dildeki bir kaynak unvanıyla ilişkilendirir. @tr
definition: Hozzákapcsol egy forrást egy forrás, szótárkódolási sémából vett vagy karakterlánc-kódolási séma felhasználásával konstruált, természetes nyelvi megnevezéséhez. @hu
definition: Liitää aineiston luonnollisella kielellä olevaan aineiston nimitykseen, joka on otettu jostakin sanaston merkintäjärjestelmästä tai muodostettu jotakin merkkijonon merkintäjärjestelmää käyttäen. @fi
definition: Relaciona un recurs amb un nomen que és una apel·lació de recurs en llenguatge natural que s’obté d’un esquema de codificació de vocabulari o s’elabora usant un esquema de codificació de cadenes. @ca
definition: Relaterer en ressource til en ressourcebenævnelse på naturligt sprog, der er hentet fra et vokabularkodningsskema eller er konstrueret ved brug af et strengkodningsskema. @da
definition: Relates a resource to a nomen that is an appellation of resource in natural language that is taken from a vocabulary encoding scheme or is constructed using a string encoding scheme.
definition: Setzt eine Ressource in Beziehung zu einer Bezeichnung für eine Ressource in natürlicher Sprache, die einem Vocabulary Encoding Scheme entnommen oder mit einem String Encoding Scheme konstruiert wird. @de
definition: يربط بين مصدر وتسمية مصدر في لغة طبيعية مأخوذة من خطة ترميز مفردات أو مبنية باستخدام خطة ترميز سلسلة تمثيلات. @ar
definition: 将一种资源与作为一种资源的称谓、取自一个词表编码体系或者用一个串编码体系构建、用自然语言的一个命名关联起来。 @zh-hans

is access point for resource of
lexical alias: accessPointForResourceOf.en
status: Published
type: Property
label: er søgeindgang for ressource af @da
label: hakutieto aineistolle @fi
label: hozzáférési pont a következő forráshoz: @hu
label: is ingang voor resource van @nl
label: ist Sucheinstieg für eine Ressource von @de
label: kaynağı için erişim noktasıdır @tr
label: هي نقطة وصول لمصدر لـ @ar
label: 是……的资源的检索点 @zh-hans
sub property of: is access point for entity of
inverse of: has access point for resource
definition: Bir ismi, bir kelime kodlama şemasından alınan veya bir dize kodlama şeması kullanılarak oluşturulan yerel dildeki bir kaynak adlandırmasıyla ilişkilendirir. @tr
definition: Hozzákapcsol egy noment egy forráshoz, amelynek természetes nyelvű megnevezése egy szótárkódolási sémából származik, vagy egy karakterlánc-kódolási séma használatával szerkesztett. @hu
definition: Liittää nomenin aineistoon, jonka luonnollisen kielen mukainen nimitys on otettu jostakin sanaston merkintäjärjestelmästä tai muodostettu jotakin merkkijonon merkintäjärjestelmää käyttäen. @fi
definition: Relaterer et nomen til en ressource, der har en benævnelse på naturligt sprog, der er hentet fra et vokabularkodningsskema eller er konstrueret ved brug af en strengkodningsskema. @da
definition: Relates a nomen to a resource that has an appellation in natural language that is taken from a vocabulary encoding scheme or is constructed using a string encoding scheme.
definition: Setzt ein Nomen in Beziehung zu einer Ressource, die eine Bezeichnung in natürlicher Sprache hat, die einem Vocabulary Encoding Scheme entnommen oder mit einem String Encoding Scheme konstruiert wird. @de
definition: يربط تسمية بمصدر له اسم في لغة طبيعية مأخوذ من خطة ترميز مفردات أو مبنية باستخدام خطة ترميز سلسلة تمثيلات. @ar
definition: 将一个命名与有取自一个词表编码体系或者用一个串编码体系构建、用自然语言的一个称谓的一种资源关联起来。 @zh-hans

has access point for timespan
lexical alias: accessPointForTimespan.en
status: Published
type: Property
label: hakutieto ajanjaksolle @fi
label: har søgeindgang for tidsforløb @da
label: hat Sucheinstieg für einen Zeitraum @de
label: heeft ingang voor tijdspanne @nl
label: hozzáférési pontja időtartamhoz a következő: @hu
label: zaman aralığı için erişim noktası ile ilişkilidir @tr
label: له نقطة وصول لفترة زمنية لـ @ar
label: 有时间段的检索点 @zh-hans
sub property of: has access point for entity
inverse of: is access point for timespan of
definition: Bir zaman aralığını, bir kelime kodlama şemasından alınan veya bir dizi kodlama şeması kullanılarak oluşturulan doğal dildeki bir zaman aralığının unvanıyla ilişkilendirir. @tr
definition: Hozzákapcsol egy időtartamot egy időtartam szótárkódolási sémából vett vagy karakterlánc-kódolási séma felhasználásával konstruált természetes nyelvi megnevezéshez. @hu
definition: Liittää ajanjakson luonnollisen kielen mukaiseen ajanjakson nimitykseen, joka on otettu jostakin sanaston merkintäjärjestelmästä tai muodostettu jotakin merkkijonon merkintäjärjestelmää käyttäen. @fi
definition: Relaciona un interval de temps amb un nomen que és una apel·lació d’interval de temps en llenguatge natural que s’obté d’un esquema de codificació de vocabulari o s’elabora usant un esquema de codificació de cadenes. @ca
definition: Relaterer et tidsforløb til en benævnelse på tidsforløb på naturligt sprog, der er hentet fra et vokabularkodninggskema eller er konstrueret ved brug af et strengkodningsskema. @da
definition: Relates a timespan to a nomen that is an appellation of timespan in natural language that is taken from a vocabulary encoding scheme or is constructed using a string encoding scheme.
definition: Setzt einen Zeitraum in Beziehung zu einer Bezeichnung für einen Zeitraum in natürlicher Sprache, die einem Vocabulary Encoding Scheme entnommen oder mit einem String Encoding Scheme konstruiert wird. @de
definition: يربط بين فترة زمنية وتسمية لفترة زمنية في لغة طبيعية مأخوذة من خطة ترميز مفردات أو مبنية باستخدام خطة ترميز سلسلة تمثيلات. @ar
definition: 将一个时间段与取自一个词表编码体系或者用一个串编码体系构建的一个时间段用自然语言的称谓的一个命名关联起来。 @zh-hans

is access point for timespan of
lexical alias: accessPointForTimespanOf.en
status: Published
type: Property
label: er søgeindgang for tidsforløb af @da
label: hakutieto ajanjaksolle @fi
label: hozzáférési pont a következő időtartamhoz: @hu
label: is ingang voor tijdspanne van @nl
label: ist Sucheinstieg für einen Zeitraum von @de
label: zaman aralığı için erişim noktasıdır @tr
label: هي نقطة وصول لفترة زمنية لـ @ar
label: 是……的时间段的检索点 @zh-hans
sub property of: is access point for entity of
inverse of: has access point for timespan
definition: Bir ismi, bir kelime kodlama şemasından alınan veya bir dize kodlama şeması kullanılarak oluşturulan yerel dildeki bir zaman aralığı adlandırmasıyla ilişkilendirir. @tr
definition: Hozzákapcsol egy noment egy időtartamhoz, amelynek természetes nyelvű megnevezése egy szótárkódolási sémából származik, vagy egy karakterlánc-kódolási séma használatával szerkesztett. @hu
definition: Liittää nomenin ajanjaksoon, jonka luonnollisen kielen mukainen nimitys on otettu jostakin sanaston merkintäjärjestelmästä tai muodostettu jotakin merkkijonon merkintäjärjestelmää käyttäen. @fi
definition: Relaterer et nomen til et tidsforløb, der har en benævnelse på naturligt sprog, der er hentet fra et vokabularkodningsskema eller er konstrueret ved at brue et strengkodningsskema. @da
definition: Relates a nomen to a timespan that has an appellation in natural language that is taken from a vocabulary encoding scheme or is constructed using a string encoding scheme.
definition: Setzt ein Nomen in Beziehung zu einem Zeitraum, der eine Bezeichnung in natürlicher Sprache hat, die einem Vocabulary Encoding Scheme entnommen oder mit einem String Encoding Scheme konstruiert wird. @de
definition: ييربط تسمية بفترة زمنية لها اسم في لغة طبيعية مأخوذة من خطة ترميز مفردات أو مبنية باستخدام خطة ترميز سلسلة تمثيلات. @ar
definition: 将一个命名与有取自一个词表编码体系或者用一个串编码体系构建、用自然语言的一个称谓的一个时间段关联起来。 @zh-hans

has authorized access point for agent
lexical alias: authorizedAccessPointForAgent.en
status: Published
type: Property
label: auktorisoitu hakutieto toimijalle @fi
label: autorizált hozzáférési pont ágenshez a következő: @hu
label: har autoriseret søgeindgang for agent @da
label: hat normierten Sucheinstieg für einen Akteur @de
label: heeft geautoriseerde ingang voor actor @nl
label: temsilci için yetkili erişim noktası ile ilişkilidir @tr
label: له نقطة اتاحة مقننة لوكيل @ar
label: 有行为者的规范检索点 @zh-hans
sub property of: has authorized access point for entity
inverse of: is authorized access point for agent of
definition: Bir temsilciyi, belirli bir kelime kodlama şemasında tercih edilmek üzere seçilen temsilcinin erişim noktasıyla ilişkilendirir. @tr
definition: Hozzákapcsol egy ágenst egy ágens hozzáférési pontjához, amelyet egy adott szótárkódolási sémából választanak ki előnyben részesítettként. @hu
definition: Liittää toimijan hakutietoon, joka on valittu toimijalle ensisijaiseksi tietyssä sanaston merkintäjärjestelmässä. @fi
definition: Relaterer en agent til en søgeindgang for agent, der er valgt som foretrukken i et særskit vokabularkodningsskema. @da
definition: Relates an agent to an access point for agent that is selected for preference in a specific vocabulary encoding scheme.
definition: Setzt einen Akteur in Beziehung zu einem Sucheinstieg für einen Akteur, der in einem bestimmten Vocabulary Encoding Scheme als Vorzugsform bestimmt wird. @de
definition: يربط بين وكيل ونقطة إتاحة لوكيل اُختيرت نقطة اتاحة مقننة مُفضلة في خطة ترميز مفردات محددة. @ar
definition: 将一个行为者与在一个特定的词表编码体系中被首选的一个行为者检索点关联起来。 @zh-hans

has authorized access point for place
lexical alias: authorizedAccessPointForPlace.en
status: Published
type: Property
label: auktorisoitu hakutieto paikalle @fi
label: autorizált hozzáférési pont helyhez a következő: @hu
label: har autoriseret søgeindgang for sted @da
label: hat normierten Sucheinstieg für ein Geografikum @de
label: heeft geautoriseerde ingang voor plaats @nl
label: yer için yetkili erişim noktası ile ilişkilidir @tr
label: له نقطة إتاحة مقننة لمكان @ar
label: 有地点的规范检索点 @zh-hans
sub property of: has authorized access point for entity
inverse of: is authorized access point for place of
definition: Bir yeri, belirli bir kelime kodlama şemasında tercih edilmek üzere seçilen yer için yetkili erişim noktasıyla ilişkilendirir. @tr
definition: Hozzákapcsol egy helyet egy hely hozzáférési pontjához, amelyet egy adott szótárkódolási sémából választanak ki előnyben részesítettként. @hu
definition: Liittää paikan hakutietoon, joka on valittu paikalle ensisijaiseksi tietyssä sanaston merkintäjärjestelmässä. @fi
definition: Relaterer et sted til en søgeindgang for sted, der er valgt som foretrukken i et særskilt vokabularkodningsskema. @da
definition: Relates a place to an access point for place that is selected for preference in a specific vocabulary encoding scheme.
definition: Setzt ein Geografikum in Beziehung zu einem Sucheinstieg für ein Geografikum, der in einem bestimmten Vocabulary Encoding Scheme als Vorzugsform bestimmt wird. @de
definition: يربط بين مكان ونقطة إتاحة لمكان اُختيرت نقطة اتاحة مقننة مُفضلة في خطة ترميز مفردات محددة. @ar
definition: 将一个地点与在一个特定的词表编码体系中被首选的一个地点检索点关联起来。 @zh-hans

has authorized access point for resource
lexical alias: authorizedAccessPointForResource.en
status: Published
type: Property
label: auktorisoitu hakutieto toimijalle @fi
label: autorizált hozzáférési pont forráshoz a következő: @hu
label: har autoriseret søgeindgang for ressource @da
label: hat normierten Sucheinstieg für eine Ressource @de
label: heeft geautoriseerde ingang voor resource @nl
label: kaynak için yetkili erişim noktası ile ilişkilidir @tr
label: له نقطة إتاحة مقننة لمصدر @ar
label: 有资源的规范检索点 @zh-hans
sub property of: has authorized access point for entity
inverse of: is authorized access point for resource of
definition: Bir kaynağı, belirli bir kelime kodlama şemasında tercih edilmek üzere seçilmiş kaynağın erişim noktası ile ilişkilendirir. @tr
definition: Hozzákapcsol egy forrást egy forrás hozzáférési pontjához, amelyet egy adott szótárkódolási sémából választanak ki előnyben részesítettként. @hu
definition: Liittää aineiston hakutietoon, joka on valittu aineistolle ensisijaiseksi tietyssä sanaston merkintäjärjestelmässä. @fi
definition: Relaterer en ressource til en søgeindgang for ressource, der er valgt som foretrukken i et særskilt vokabularkodningsskema. @da
definition: Relates a resource to an access point for resource that is selected for preference in a specific vocabulary encoding scheme.
definition: Setzt eine Ressource in Beziehung zu einem Sucheinstieg für eine Ressource, der in einem bestimmten Vocabulary Encoding Scheme als Vorzugsform bestimmt wird. @de
definition: يربط بين مصدر ونقطة إتاحة لمصدر اُختيرت نقطة اتاحة مقننة مُفضلة في خطة ترميز مفردات محددة. @ar
definition: 将一种资源与在一个特定的词表编码体系中被首选的一个资源检索点关联起来。 @zh-hans

has authorized access point for timespan
lexical alias: authorizedAccessPointForTimespan.en
status: Published
type: Property
label: ajanjakson auktorisoitu hakutieto @fi
label: autorizált hozzáférési pont időtartamhoz a következő: @hu
label: har autoriseret søgeindgang for tidsforløb @da
label: hat normierten Sucheinstieg für einen Zeitraum @de
label: heeft geautoriseerde ingang voor tijdspanne @nl
label: zaman aralığı için yetkili erişim noktası ile ilişkilidir @tr
label: له نقطة إتاحة مقننة لفترة زمنية @ar
label: 有时间段的规范检索点 @zh-hans
sub property of: has authorized access point for entity
inverse of: is authorized access point for timespan of
definition: Bir zaman aralığını, belirli bir kelime kodlama şemasında tercih için seçilmeyen bir zaman aralığı için erişim noktasıyla ilişkilendirir. @tr
definition: Hozzákapcsol egy időtartamot egy időtartam hozzáférési pontjához, amelyet egy adott szótárkódolási sémából választanak ki előnyben részesítettként. @hu
definition: Liittää ajanjakson hakutietoon, joka on valittu ajanjaksolle ensisiaiseksi tietyssä sanaston merkintäjärjestelmässä. @fi
definition: Relaterer et tidsforløb for en søgeindgang til et tidsforløb, der er valgt som foretrukken i et særskilt vokabularkodingsskema. @da
definition: Relates a timespan to an access point for timespan that is selected for preference in a specific vocabulary encoding scheme.
definition: Setzt einen Zeitraum in Beziehung zu einem Sucheinstieg für einen Zeitraum, der in einem bestimmten Vocabulary Encoding Scheme als Vorzugsform bestimmt wird. @de
definition: يربط بين فترة زمنية ونقطة إتاحة لفترة زمنية اُختيرت نقطة اتاحة مقننة مُفضلة في خطة ترميز مفردات محددة. @ar
definition: 将一个时间段与在一个特定的词表编码体系中被首选的一个时间段检索点关联起来。 @zh-hans

is authorized access point for agent of
lexical alias: authorizedAccessPointForAgentOf.en
status: Published
type: Property
label: auktorisoitu hakutieto toimijalle @fi
label: autorizált hozzáférési pont a következő ágenshez: @hu
label: er autoriseret søgeindgang for agent af @da
label: is geautoriseerde ingang voor actor van @nl
label: ist normierter Sucheinstieg für einen Akteur von @de
label: temsilcisi için yetkili erişim noktasıdır @tr
label: هي نقطة إتاحة مقننة لوكيل لـ @ar
label: 是……的行为者的规范检索点 @zh-hans
sub property of: is authorized access point for entity of
inverse of: has authorized access point for agent
definition: Bir ismi, belirli bir kelime kodlama şemasında tercih edilen temsilci için erişim noktası olan bir temsilciyle ilişkilendirir. @tr
definition: Hozzákapcsol egy noment egy ágenshez, amelynek van egy előnyben részesített hozzáférési pontja az ágenshez, amelyet egy adott szótárkódolási sémából választanak ki. @hu
definition: Liittää nomenin toimijaan, jolla on tietyssä sanaston merkintäjärjestelmässä ensisijaiseksi valittu toimijan hakutieto. @fi
definition: Relaterer et nomen til en agent, der har en søgeindgang for agent, der er valgt som foretrukken i et særskilt vokabularkodningsskema. @da
definition: Relates a nomen to an agent who has an access point for agent that is selected for preference in a specific vocabulary encoding scheme.
definition: Setzt ein Nomen in Beziehung zu einem Akteur, der über einen Sucheinstieg für einen Akteur verfügt, der in einem bestimmten Vocabulary Encoding Scheme als Vorzugsform bestimmt wird. @de
definition: يربط بين اسم ووكيل لديه نقطة وصول لوكيل اختيرت نقطة اتاحة مقننة مُفضلة فى خطة ترميز مفردات. @ar
definition: 将一个命名与有在一个特定的词表编码体系中被首选的行为者检索点的一个行为者关联起来。 @zh-hans

is authorized access point for place of
lexical alias: authorizedAccessPointForPlaceOf.en
status: Published
type: Property
label: auktorisoitu hakutieto paikalle @fi
label: autorizált hozzáférési pont a következő helyhez: @hu
label: er autoriseret søgeindgang for sted af @da
label: is geautoriseerde ingang voor plaats van @nl
label: ist normierter Sucheinstieg für ein Geografikum von @de
label: yeri için erişim noktasıdır @tr
label: هي نقطة إتاحة مقننة لمكان لـ @ar
label: 是……的地点的规范检索点 @zh-hans
sub property of: is authorized access point for entity of
inverse of: has authorized access point for place
definition: Bir ismi, belirli bir kelime kodlama şemasında tercih edilen yer için erişim noktası olan bir yerle ilişkilendirir. @tr
definition: Hozzákapcsol egy noment egy helyhez, amelynek van egy előnyben részesített hozzáférési pontja a helyhez, amelyet egy adott szótárkódolási sémából választanak ki. @hu
definition: Liittää nomenin paikkaan, jolla on tietyssä sanaston merkintäjärjestelmässä ensisijaiseksi valittu paikan hakutieto. @fi
definition: Relaterer et nomen til et sted, der har en søgeindgang for sted, der er valgt som foretrukken i et særskilt vokabularkodningsskema. @da
definition: Relates a nomen to a place that has an access point for place that is selected for preference in a specific vocabulary encoding scheme.
definition: Setzt ein Nomen in Beziehung zu einem Geografikum, das über einen Sucheinstieg für ein Geografikum verfügt, der in einem bestimmten Vocabulary Encoding Scheme als Vorzugsform bestimmt wird. @de
definition: يربط بين اسم ومكان لديه نقطة وصول لمكان اختيرت نقطة اتاحة مقننة مُفضلة فى خطة ترميز مفردات. @ar
definition: 将一个命名与有在一个特定的词表编码体系中被首选的地点检索点的一个地点关联起来。 @zh-hans

is authorized access point for resource of
lexical alias: authorizedAccessPointForResourceOf.en
status: Published
type: Property
label: auktorisoitu hakutieto aineistolle @fi
label: autorizált hozzáférési pont a következő forráshoz: @hu
label: er autoriseret søgeindgang for ressource af @da
label: is geautoriseerde ingang voor resource van @nl
label: ist normierter Sucheinstieg für eine Ressource von @de
label: kaynağı için yetkili erişim noktasıdır @tr
label: هي نقطة إتاحة مقننة لمصدر لـ @ar
label: 是……的资源的规范检索点 @zh-hans
sub property of: is authorized access point for entity of
inverse of: has authorized access point for resource
definition: Bir ismi, belirli bir kelime kodlama şemasında tercih edilen kaynak için erişim noktası olan bir kaynakla ilişkilendirir. @tr
definition: Hozzákapcsol egy noment egy forráshoz, amelynek van egy olyan előnyben részesített hozzáférési pontja a forráshoz, amelyet egy adott szótárkódolási sémából választanak ki. @hu
definition: Liittää nomenin aineistoon, jolla on tietyssä sanaston merkintäjärjestelmässä ensisijaiseksi valittu aineiston hakutieto. @fi
definition: Relaterer et nomen til en ressource, der har en søgeindgang for ressource, der er valgt som foretrukken i et særskilt vokabularkodningsskema. @da
definition: Relates a nomen to a resource that has an access point for resource that is selected for preference in a specific vocabulary encoding scheme.
definition: Setzt ein Nomen in Beziehung zu einer Ressource, die über einen Sucheinstieg für eine Ressource verfügt, der in einem bestimmten Vocabulary Encoding Scheme als Vorzugsform bestimmt wird. @de
definition: يربط بين اسم ومصدر لديه نقطة وصول لمصدر اختيرت نقطة اتاحة مقننة مُفضلة فى خطة ترميز مفردات. @ar
definition: 将一个命名与有在一个特定的词表编码体系中被首选的资源检索点的一种资源关联起来。 @zh-hans

is authorized access point for timespan of
lexical alias: authorizedAccessPointForTimespanOf.en
status: Published
type: Property
label: auktorisoitu hakutieto ajanjaksolle @fi
label: autorizált hozzáférési pont a következő időtartamhoz: @hu
label: er autoriseret søgeindgang for tidsforløb af @da
label: is geautoriseerde ingang voor tijdspanne van @nl
label: ist normierter Sucheinstieg für einen Zeitraum von @de
label: zaman aralığı için yetkili erişim noktasıdır @tr
label: هي نقطة إتاحة مقننة لفترة زمنية لـ @ar
label: 是……的时间段的规范检索点 @zh-hans
sub property of: is authorized access point for entity of
inverse of: has authorized access point for timespan
definition: Bir ismi, belirli bir kelime kodlama şemasında tercih edilen zaman aralığı için erişim noktası olan bir zaman aralığıyla ilişkilendirir. @tr
definition: Hozzákapcsol egy noment egy időtartamhoz, amelynek van egy előnyben részesített hozzáférési pontja az időtartamhoz, amelyet egy adott szótárkódolási sémából választanak ki. @hu
definition: Liittää nomenin ajanjaksoon, jolla on tietyssä sanaston merkintäjärjestelmässässä ensisijaiseksi valittu ajanjakson hakutieto. @fi
definition: Relaterer et nomen til et tidsforløb, der har en søgeindgang, der er valgt som foretrukken i et særskilt vokabularkodningsskema. @da
definition: Relates a nomen to a timespan that has an access point for timespan that is selected for preference in a specific vocabulary encoding scheme.
definition: Setzt ein Nomen in Beziehung zu einem Zeitraum, der über einen Sucheinstieg für einen Zeitraum verfügt, der in einem bestimmten Vocabulary Encoding Scheme als Vorzugsform bestimmt wird. @de
definition: يربط بين اسم وفترة زمنية لديها نقطة وصول لفترة زمنية اختيرت نقطة اتاحة مقننة مُفضلة فى خطة ترميز مفردات. @ar
definition: 将一个命名与有在一个特定的词表编码体系中被首选的时间段检索点的一个时间段关联起来。 @zh-hans

has identifier for place
lexical alias: identifierForPlace.en
status: Published
type: Property
label: azonosító helyhez a következő: @hu
label: har identfikator for sted @da
label: hat Identifikator für ein Geografikum @de
label: heeft identificatie voor plaats @nl
label: paikan tunniste @fi
label: yerin tanımlayıcısı ile ilişkilidir @tr
label: له مُعرف لمكان @ar
label: 有地点的标识符 @zh-hans
sub property of: has identifier for entity
inverse of: is identifier for place of
definition: Bir yeri tanımlamak için kullanılan, genellikle yerel dil ve sosyal adlandırma kurallarından bağımsız bir kod, sayı veya başka bir diziden oluşan bir yer adı ile ilişkilendirir. @tr
definition: Hozzákapcsol egy helyet egy hely megnevezéséhez, amely egy kód-, szám-, vagy más típusú karakterláncból áll, amely általában független a természetes nyelvektől és társadalmi névkonvencióktól, és egy forrás azonosítására használják. @hu
definition: Liittää paikan paikan nimitykseen, joka koostuu paikan identifiointiin käytettävästä koodista, luvusta tai muusta,tavallisesti luonnollisesta kielestä ja yleisistä nimeämiskäytännöistä riippumattomasta, merkkijonosta. @fi
definition: Relaciona un lloc amb un nomen que és una apel·lació de lloc que consisteix en un codi, un número o una altra cadena, normalment independent del llenguatge natural i de les convencions lingüístiques socials, usat per identificar un lloc. @ca
definition: Relaterer et sted til en benævnelse for stedm der bestor af kode, nummer, eller anden streng, normalt uafhængigt af naturligt sprog og sociale navngivningskonventioner, brugt for at identificere et sted. @da
definition: Relates a place to a nomen that is an appellation of place that consists of a code, number, or other string, usually independent of natural language and social naming conventions, used to identify a place.
definition: Setzt ein Geografikum in Beziehung zu einer Bezeichnung für ein Geografikum, die aus einem Code, einer Nummer oder einer anderen Zeichenkette besteht, der/die normalerweise nicht in natürlicher Sprache und unabhängig von den sozialen Benennungskonventionen ist und zur Identifizierung eines Geografikums verwendet wird. @de
definition: يربط بين مكان وتسمية لمكان تتكون من رمز، رقم، أو سلسلة تمثيلات أخرى، عادة ما تكون مستقلة عن اللغة الطبيعية وعن التسميات المتعارف عليها اجتماعيًا، المستخدمة في تحديد هوية مكان. @ar
definition: 将一个地点与作为一个由代码、数字、或其他字符串构成、通常独立于自然语言和社会命名惯例、用以标识一个地点的一个地点称谓的命名关联起来。 @zh-hans
scope note: A kódolt karakterlánc általában független a természetes nyelvektől és társadalmi névkonvencióktól. @hu
scope note: Den kodede streng er normalt uafhængig af naturligt sprog og sociale navngivningskonventioner. @da
scope note: Die kodierte Zeichenkette ist normalerweise nicht in natürlicher Sprache und unabhängig von den sozialen Benennungskonventionen. @de
scope note: Kodlanmış dizi genellikle doğal dilden ve sosyal adlandırma kurallarından bağımsızdır. @tr
scope note: Merkkijono on yleensä riippumaton luonnollisesta kielestä ja yleisistä nimeämiskäytännöistä. @fi
scope note: The coded string is usually independent of natural language and social naming conventions.
scope note: عادة ما تكون سلسلة التمثيلات المرمزة مستقلة عن اللغة الطبيعية وعن التسميات المتعارف عليها اجتماعيًا. @ar
scope note: 编码串通常独立于自然语言和社会命名惯例。 @zh-hans

has identifier for timespan
lexical alias: identifierForTimespan.en
status: Published
type: Property
label: ajanjakson tunniste @fi
label: azonosító időtartamhoz a következő: @hu
label: har identifikator for tidsforløb @da
label: hat Identifikator für einen Zeitraum @de
label: heeft identificatie voor tijdspanne @nl
label: zaman aralığının tanımlayıcısı ile ilişkilidir @tr
label: له مُعرف لفترة زمنية @ar
label: 有时间段的标识符 @zh-hans
sub property of: has identifier for entity
inverse of: is identifier for timespan of
definition: Bir zaman aralığını, bir zaman aralığını tanımlamak için kullanılan, genellikle doğal dil ve sosyal adlandırma kurallarından bağımsız bir kod, sayı veya başka bir diziyi içeren bir zaman aralığı unvanıyla ilişkilendirir. @tr
definition: Hozzákapcsol egy időtartamot egy időtartam megnevezéséhez, amely kódból, számból vagy egyéb karakterláncból áll, általában a természetes nyelvtől és társadalmi elnevezési konvencióktól független, egy időtartam azonosítására használják. @hu
definition: Liittää ajanjakson ajanjakson nimitykseen, joka koostuu paikan identifiointiin käytettävästä koodista, luvusta tai muusta, tavallisesti luonnollisesta kielestä ja yleisistä nimeämiskäytännöistä riippumattomasta, merkkijonosta. @fi
definition: Relaciona un interval de temps amb un nomen que és una apel·lació d’interval de temps que consisteix en un codi, un número o qualsevol altra cadena, normalment independent del llenguatge natural i de les convencions lingüístiques socials, usada per identificar una obra. @ca
definition: Relaterer et tidsforløb til en benævnelse på tidsforløb, der består af kode, nummer, eller anden streng, normalt uafhængigt af naturligt sprog og sociale navngivningskonventioner, brugt for at identificere et tidsforløb. @da
definition: Relates a timespan to a nomen that is an appellation of timespan that consists of a code, number, or other string, usually independent of natural language and social naming conventions, used to identify a timespan.
definition: Setzt einen Zeitraum in Beziehung zu einer Bezeichnung für einen Zeitraum, die aus einem Code, einer Nummer oder einer anderen Zeichenkette besteht, der/die normalerweise nicht in natürlicher Sprache und unabhängig von den sozialen Benennungskonventionen ist und zur Identifizierung eines Zeitraums verwendet wird. @de
definition: يربط بين فترة زمنية وتسمية لفترة زمنية تتكون من رمز، رقم، أو سلسلة تمثيلات أخرى، عادة ما تكون مستقلة عن اللغة الطبيعية وعن التسميات المتعارف عليها اجتماعيًا، المستخدمة في تحديد هوية فترة زمنية. @ar
definition: 将一个时间段与由代码、数字或其他串组成、通常独立于自然语言和社会命名惯例、用于标识一个时间段的作为一个时间段称谓的一个命名关联起来。 @zh-hans
scope note: A kódolt karakterlánc általában független a természetes nyelvektől és társadalmi névkonvencióktól. @hu
scope note: Den kodede streng er normalt uafhængig af naturligt sprog og sociale navngivningskonventioner. @da
scope note: Die kodierte Zeichenkette ist normalerweise nicht in natürlicher Sprache und unabhängig von den sozialen Benennungskonventionen. @de
scope note: Kodlanmış dizi genellikle doğal dilden ve sosyal adlandırma kurallarından bağımsızdır. @tr
scope note: Merkkijono on yleensä riippumaton luonnollisesta kielestä ja yleisistä nimeämiskäytännöistä. @fi
scope note: The coded string is usually independent of natural language and social naming conventions.
scope note: عادة ما تكون سلسلة التمثيلات المرمزة مستقلة عن اللغة الطبيعية وعن التسميات المتعارف عليها اجتماعيًا. @ar
scope note: 编码串通常独立于自然语言和社会命名惯例。 @zh-hans

is identifier for place of
lexical alias: identifierForPlaceOf.en
status: Published
type: Property
label: azonosítója a következő helynek: @hu
label: er identifikator for sted af @da
label: is identificatie voor plaats van @nl
label: ist Identifikator für ein Geografikum von @de
label: paikan tunniste @fi
label: yerinin tanımlayıcısıdır @tr
label: هو مُعرف لمكان لـ @ar
label: 是……的地点的标识符 @zh-hans
sub property of: is identifier for entity of
inverse of: has identifier for place
definition: Bir ismi, kelime kodlama şemasından alınmış referans kodu olan bir yerle ilişkilendirir. @tr
definition: Hozzákapcsol egy noment egy helyhez, amelynek van egy szótárkódolási sémából származó hivatkozási kódja. @hu
definition: Liittää nomenin paikkaan, jolla on sanaston merkintäjärjestelmästä otettu viitekoodi. @fi
definition: Relaterer et nomen til et sted der har en referencekode, der er hentet fra et vokabularkodningsskema. @da
definition: Relates a nomen to a place that has a reference code taken from a vocabulary encoding scheme.
definition: Setzt ein Nomen in Beziehung zu einem Geografikum, das über einen Referenzcode verfügt, der aus einem Vocabulary Encoding Scheme entnommen wird. @de
definition: يربط بين تسمية ومكان له رمز إحالة مأخوذ من خطة ترميز مفردات. @ar
definition: 将一个命名与有一个取自一个词表编码体系的指称代码的一个地点关联起来。 @zh-hans
scope note: A kódolt karakterlánc általában független a természetes nyelvektől és társadalmi névkonvencióktól. @hu
scope note: Den kodede streng er normalt uafhængig af naturligt sprog og sociale navngivningskonventioner. @da
scope note: Die kodierte Zeichenkette ist normalerweise nicht in natürlicher Sprache und unabhängig von den sozialen Benennungskonventionen. @de
scope note: Kodlanmış dizi genellikle doğal dilden ve sosyal adlandırma kurallarından bağımsızdır. @tr
scope note: Merkkijono on yleensä riippumaton luonnollisesta kielestä ja yleisistä nimeämiskäytännöistä. @fi
scope note: The coded string is usually independent of natural language and social naming conventions.
scope note: عادة ما تكون سلسلة التمثيلات المرمزة مستقلة عن اللغة الطبيعية وعن التسميات المتعارف عليها اجتماعيًا. @ar
scope note: 编码串通常独立于自然语言和社会命名惯例。 @zh-hans

is identifier for timespan of
lexical alias: identifierForTimespanOf.en
status: Published
type: Property
label: ajanjakson tunniste @fi
label: azonosítója a következő időtartamnak: @hu
label: er identifikator for tidsforløb af @da
label: is ingang voor tijdspanne van @nl
label: ist Identifikator für einen Zeitraum von @de
label: zaman aralığının tanımlayıcısıdır @tr
label: هو مُعرف لفترة زمنية لـ @ar
label: 是……的时间段的标识符 @zh-hans
sub property of: is identifier for entity of
inverse of: has identifier for timespan
definition: Bir ismi, kelime kodlama şemasından alınmış referans kodu olan bir zaman aralığıyla ilişkilendirir. @tr
definition: Hozzákapcsol egy noment egy időtartamhoz, amelynek van egy szótárkódolási sémából származó hivatkozási kódja. @hu
definition: Liittää nomenin ajanjaksoon, jolla on sanaston merkintäjärjestelmästä otettu viitekoodi. @fi
definition: Relaterer et nomen til et tidsforløb, der har en referencekode, der er hentet fra et vokabularkodningsskema. @da
definition: Relates a nomen to a timespan that has a reference code taken from a vocabulary encoding scheme.
definition: Setzt ein Nomen in Beziehung zu einem Zeitraum, der über einen Referenzcode verfügt, der aus einem Vocabulary Encoding Scheme entnommen wird. @de
definition: ييربط تسمية بفترة زمنية لها رمز إحالة مأخوذ من خطة ترميز مفردات. @ar
definition: 将一个命名与有一个取自一个词表编码体系的指称代码的一个时间段关联起来。 @zh-hans
scope note: A kódolt karakterlánc általában független a természetes nyelvektől és társadalmi névkonvencióktól. @hu
scope note: Den kodede streng er normalt uafhængig af naturligt sprog og sociale navngivningskonventioner. @da
scope note: Die kodierte Zeichenkette ist normalerweise nicht in natürlicher Sprache und unabhängig von den sozialen Benennungskonventionen. @de
scope note: Kodlanmış dizi genellikle doğal dilden ve sosyal adlandırma kurallarından bağımsızdır. @tr
scope note: Merkkijono on yleensä riippumaton luonnollisesta kielestä ja yleisistä nimeämiskäytännöistä. @fi
scope note: The coded string is usually independent of natural language and social naming conventions.
scope note: عادة ما تكون سلسلة التمثيلات المرمزة مستقلة عن اللغة الطبيعية وعن التسميات المتعارف عليها اجتماعيًا. @ar
scope note: 编码串通常独立于自然语言和社会命名惯例。 @zh-hans

is variant access point for agent of
lexical alias: variantAccessPointForAgentOf.en
status: Published
type: Property
label: er variantsøgeindgang for agent af @da
label: hozzáférésipont-variánsa a következő ágensnek: @hu
label: is variant ingang voor actor van @nl
label: ist zusätzlicher Sucheinstieg für einen Akteur von @de
label: temsilci için farklı erişim noktası @tr
label: varianttihakutieto toimijalle @fi
label: هي نقطة إتاحة مختلفة لوكيل لـ @ar
label: 是……的行为者的变异检索点 @zh-hans
sub property of: is variant name of entity of
inverse of: has variant access point for agent
definition: Bir ismi, belirli bir kelime kodlama şemasında tercih edilmemiş bir temsilci için erişim noktasına sahip olan bir temsilciyle lişkilendirir. @tr
definition: Hozzákapcsol egy noment egy ágenshez, amelynek van egy olyan hozzáférési pontja ágens számára, amelyet egy adott szótárkódolási sémában nem részesítenek előnyben. @hu
definition: Liittää nomenin toimijaan, jolla on toimijan hakutieto, jota ei ole valittu ensisijaiseksi tietyssä sanaston merkintäjärjestelmässä. @fi
definition: Relaterer et nomen til en agent, der har en søgeindgang for agent, der ikke er valgt som foretrukken i et særskilt vokabularkodningsskema. @da
definition: Relates a nomen to an agent who has an access point for agent that is not selected for preference in a specific vocabulary encoding scheme.
definition: Setzt ein Nomen in Beziehung zu einem Akteur, der über einen Sucheinstieg für einen Akteur verfügt, der in einem bestimmten Vocabulary Encoding Scheme nicht als Vorzugsform bestimmt wird. @de
definition: يربط بين تسمية ووكيل له نقطة إتاحة لوكيل لم يتم اختياره كنقطة إتاحة مختلفة مفضلة في خطة ترميز مفردات محددة. @ar
definition: 将一个命名与有在一个特定的词表编码体系中未被首选的行为者检索点的一个行为者关联起来。 @zh-hans

is variant access point for place of
lexical alias: variantAccessPointForPlaceOf.en
status: Published
type: Property
label: er variantsøgeindgang for sted af @da
label: hozzáférésipont-variánsa a következő helynek: @hu
label: is variant ingang voor plaats van @nl
label: ist zusätzlicher Sucheinstieg für ein Geografikum von @de
label: varianttihakutieto paikalle @fi
label: yer için farklı erişim noktası @tr
label: هي نقطة إتاحة مختلفة لمكان لـ @ar
label: 是……的地点的变异检索点 @zh-hans
sub property of: is variant name of entity of
inverse of: has variant access point for place
definition: Bir ismi, belirli bir kelime kodlama şemasında tercih edilmeyen varlık için erişim noktası olan bir yerle ilişkilendirir. @tr
definition: Hozzákapcsol egy noment egy helyhez, amelynek van egy olyan hozzáférési pontja entitás számára, amelyet egy adott szótárkódolási sémában nem részesítenek előnyben. @hu
definition: Liittää nomenin toimijaan, jolla on entiteetin hakutieto, jota ei ole valittu ensisijaiseksi tietyssä sanaston merkintäjärjestelmässä. @fi
definition: Relaterer et nomen til et sted der har en søgeindgang for sted, der ikke er valgt som foretrukket i et særskilt vokabularkodningsskema. @da
definition: Relates a nomen to a place that has an access point for entity that is not selected for preference in a specific vocabulary encoding scheme.
definition: Setzt ein Nomen in Beziehung zu einem Geografikum, das über einen Sucheinstieg für eine Entität verfügt, der in einem bestimmten Vocabulary Encoding Scheme nicht als Vorzugsform bestimmt wird. @de
definition: يربط بين تسمية ومكان له نقطة إتاحة لكيان لم يتم اختياره كنقطة إتاحة مختلفة مفضلة في خطة ترميز مفردات محددة. @ar
definition: 将一个命名与有在一个特定的词表编码体系中未被首选的实体检索点的一个地点关联起来。 @zh-hans

is variant access point for resource of
lexical alias: variantAccessPointForResourceOf.en
status: Published
type: Property
label: er variantsøgeindgang for ressource af @da
label: hozzáférésipont-változat a következő forráshoz: @hu
label: is variant ingang voor resource van @nl
label: ist zusätzlicher Sucheinstieg für eine Ressource von @de
label: kaynak için farklı erişim noktasıdır @tr
label: varianttihakutieto aineistolle @fi
label: هي نقطة إتاحة مختلفة لمصدر لـ @ar
label: 是……的资源的变异检索点 @zh-hans
sub property of: is variant name of entity of
inverse of: has variant access point for resource
definition: Bir ismi, belirli bir kelime kodlama şemasında tercih edilmeyen bir kaynak için erişim noktası olan bir kaynakla ilişkilendirir. @tr
definition: Hozzákapcsol egy noment egy forráshoz, amelynek van egy olyan hozzáférési pontja forrás számára, amelyet egy adott szótárkódolási sémában nem részesítenek előnyben. @hu
definition: Liittää nomenin aineistoon, jolla on aineiston hakutieto, jota ei ole valittu ensisijaiseksi tietyssä sanaston merkintäjärjestelmässä. @fi
definition: Relaterer et nomen til en ressource, der har en søgeindgang for ressource, der ikke er valgt som foretrukken i et særskilt vokabularkodningsskema. @da
definition: Relates a nomen to a resource that has an access point for resource that is not selected for preference in a specific vocabulary encoding scheme.
definition: Setzt ein Nomen in Beziehung zu einer Ressource, die über einen Sucheinstieg für eine Ressource verfügt, der in einem bestimmten Vocabulary Encoding Scheme nicht als Vorzugsform bestimmt wird. @de
definition: يربط تسمية بمصدر له نقطة إتاحة لمصدر لم يتم اختياره كنقطة إتاحة مختلفة مفضلة في خطة ترميز مفردات محددة. @ar
definition: 将一个命名与有在一个特定的词表编码体系中未被首选的资源检索点的一种资源关联起来。 @zh-hans

is variant access point for timespan of
lexical alias: variantAccessPointForTimespanOf.en
status: Published
type: Property
label: er variantsøgeindgagng for tidsforløb af @da
label: hozzáférésipont-változata a következő időtartamnak: @hu
label: is variant ingang voor tijdspanne van @nl
label: ist zusätzlicher Sucheinstieg für einen Zeitraum von @de
label: varianttihakutieto ajanjaksolle @fi
label: zaman aralığı için farklı erişim noktasıdır @tr
label: هي نقطة إتاحة مختلفة لفترة زمنية لـ @ar
label: 是……的时间段的变异检索点 @zh-hans
sub property of: is variant name of entity of
inverse of: has variant access point for timespan
definition: Bir ismi, belirli bir kelime kodlama şemasında tercih edilmeyen bir zaman aralığı için erişim noktası olan bir zaman aralığıyla ilişkilendirir. @tr
definition: Hozzákapcsol egy noment egy időtartamhoz, amelynek van egy olyan hozzáférési pontja időtartam számára, amelyet egy adott szótárkódolási sémában nem részesítenek előnyben. @hu
definition: Liittää nomenin ajanjaksoon, jolla on ajanjakson hakutieto, jota ei ole valittu ensisijaiseksi tietyssä sanaston merkintäjärjestelmässä. @fi
definition: Relaterer et nomen til et tidsforløb, der har en søgeindgang fro tidsforløb, der ikke er valgt som foretrukket i et særskilt vokabularkodningsskema. @da
definition: Relates a nomen to a timespan that has an access point for timespan that is not selected for preference in a specific vocabulary encoding scheme.
definition: Setzt ein Nomen in Beziehung zu einem Zeitraum, der über einen Sucheinstieg für einen Zeitraum verfügt, der in einem bestimmten Vocabulary Encoding Scheme nicht als Vorzugsform bestimmt wird. @de
definition: ييربط تسمية بفترة زمنية لها نقطة إتاحة لفترة زمنية لم يتم اختيارها كنقطة إتاحة مختلفة مفضلة في خطة ترميز مفردات محددة. @ar
definition: 将一个命名与有在一个特定的词表编码体系中未被首选的时间段检索点的一个时间段关联起来。 @zh-hans

has variant access point for agent
lexical alias: variantAccessPointForAgent.en
status: Published
type: Property
label: har variantsøgeindgang for agent @da
label: hat zusätzlichen Sucheinstieg für einen Akteur @de
label: heeft variant ingang voor actor @nl
label: hozzáférésipont-változata ágenshez a következő: @hu
label: temsilci için alternatif erişim noktası ile ilişkilidir @tr
label: varianttihakutieto toimijalle @fi
label: له نقطة إتاحة مختلفة لوكيل @ar
label: 有行为者的变异检索点 @zh-hans
sub property of: has variant access point for entity
inverse of: is variant access point for agent of
definition: Bir temsilciyi, belirli bir kelime kodlama şemasında tercih edilmek üzere seçilmeyen temsilcinin erişim noktasıyla ilişkilendirir. @tr
definition: Hozzákapcsol egy ágenst egy ágens hozzáférési pontjához, amely egy adott szótárkódolási sémában nem részesítenek előnyben. @hu
definition: Liittää toimijan toimijan hakutietoon, jota ei ole valittu ensisijaiseksi tietyssä sanaston merkintäjärjestelmässä @fi
definition: Relaterer en agent til en søgeindgang for agent, der ikke er valgt som foretrukken i et særskit vokabularkodningsskema. @da
definition: Relates an agent to an access point for agent that is not selected for preference in a specific vocabulary encoding scheme.
definition: Setzt einen Akteur in Beziehung zu einem Sucheinstieg für einen Akteur, der in einem bestimmten Vocabulary Encoding Scheme nicht als Vorzugsform bestimmt wird. @de
definition: يربط بين وكيل ونقطة إتاحة لوكيل لم يتم اختيارها كنقطة إتاحة مختلفة مفضلة في خطة ترميز مفردات محددة. @ar
definition: 将一个行为者与没有在一个特定的词表编码体系中被首选的一个行为者的检索点关联起来。 @zh-hans

has variant access point for place
lexical alias: variantAccessPointForPlace.en
status: Published
type: Property
label: har variantsøgeindgang for sted @da
label: hat zusätzlichen Sucheinstieg für ein Geografikum @de
label: heeft variant ingang voor plaats @nl
label: hozzáférésipont-változat helyhez a következő: @hu
label: varianttihakutieto paikalle @fi
label: yer için alternatif erişim noktası ile ilişkilidir @tr
label: له نقطة إتاحة مختلفة لمكان @ar
label: 有地点的变异检索点 @zh-hans
sub property of: has variant access point for entity
inverse of: is variant access point for place of
definition: Bir yeri, belirli bir kelime kodlama şemasında tercih edilmeyen yerin erişim noktası ile ilişkilendirir. @tr
definition: Hozzákapcsol egy ágenst egy hely hozzáférési pontjához, amelyet egy adott szótárkódolási sémában nem részesítenek előnyben. @hu
definition: Liittää paikan paikan hakutietoon, jota ei ole valittu ensisijaiseksi tietyssä sanaston merkintäjärjestelmässä @fi
definition: Relaciona un lloc amb un punt d’accés de lloc que no se selecciona com a preferent en un esquema de codificació de vocabulari específic. @ca
definition: Relaterer en agent til en søgeindgang for sted, der ikke er valgt som foretrukket i et særskilt vokabularkodningsskema. @da
definition: Relates a place to an access point for place that is not selected for preference in a specific vocabulary encoding scheme.
definition: Setzt ein Geografikum in Beziehung zu einem Sucheinstieg für ein Geografikum, der in einem bestimmten Vocabulary Encoding Scheme nicht als Vorzugsform bestimmt wird. @de
definition: يربط بين وكيل ونقطة إتاحة لمكان لم يتم اختيارها كنقطة إتاحة مختلفة مفضلة في خطة ترميز مفردات محددة. @ar
definition: 将一个地点与没有在一个特定的词表编码体系中被首选的一个地点的检索点关联起来。 @zh-hans

has variant access point for resource
lexical alias: variantAccessPointForResource.en
status: Published
type: Property
label: har variantsøgeindgang for ressource @da
label: hat zusätzlichen Sucheinstieg für eine Ressource @de
label: heeft variant ingang voor resource @nl
label: hozzáférésipont-változat forráshoz a következő: @hu
label: kaynak için alternatif erişim noktası ile ilişkilidir @tr
label: varianttihakutieto aineistolle @fi
label: له نقطة إتاحة مختلفة لمصدر @ar
label: 有资源的变异检索点 @zh-hans
sub property of: has variant access point for entity
inverse of: is variant access point for resource of
definition: Bir kaynağı, belirli bir kelime kodlama şemasında tercih edilmek üzere seçilmemiş kaynağın erişim noktası ile ilişkilendirir. @tr
definition: Hozzákapcsol egy forrást egy forrás hozzáférési pontjához, amelyet egy adott szótárkódolási sémában nem részesítenek előnyben. @hu
definition: Liittää aineiston aineiston hakutietoon, jota ei ole valittu ensisijaiseksi tietyssä sanaston merkintäjärjestelmässä @fi
definition: Relaterer en ressource til en søgeindgang for ressource, der ikke er valgt som foretrukken i et særskilt vokabularkodningsskema. @da
definition: Relates a resource to an access point for resource that is not selected for preference in a specific vocabulary encoding scheme.
definition: Setzt eine Ressource in Beziehung zu einem Sucheinstieg für eine Ressource, der in einem bestimmten Vocabulary Encoding Scheme nicht als Vorzugsform bestimmt wird. @de
definition: يربط بين مصدر ونقطة إتاحة لمصدر لم يتم اختيارها كنقطة إتاحة مختلفة مفضلة في خطة ترميز مفردات محددة. @ar
definition: 将一种资源与没有在一个特定的词表编码体系中被首选的一个资源的检索点关联起来。 @zh-hans

has variant access point for timespan
lexical alias: variantAccessPointForTimespan.en
status: Published
type: Property
label: har variantsøgeindgang for tidsforløb @da
label: hat zusätzlichen Sucheinstieg für einen Zeitraum @de
label: heeft variant ingang voor tijdspanne @nl
label: hozzáférésipont-változat időtartamhoz a következő: @hu
label: varianttihakutieto ajanjaksolle @fi
label: zaman aralığı için alternatif erişim noktası ile ilişkilidir @tr
label: له نقطة إتاحة مختلفة لفترة زمنية @ar
label: 有时间段的变异检索点 @zh-hans
sub property of: has variant access point for entity
inverse of: is variant access point for timespan of
definition: Bir zaman aralığını, belirli bir kelime kodlama şemasında tercih için seçilen bir zaman aralığını erişim noktası ile ilişkilendirir. @tr
definition: Hozzákapcsol egy időtartamot egy időtartam hozzáférési pontjához, amelyet egy adott szótárkódolási sémában nem részesítenek előnyben. @hu
definition: Liittää ajanjakson ajanjakson hakutietoon, jota ei ole valittu ensisijaiseksi tietyssä sanaston merkintäjärjestelmässä. @fi
definition: Relaterer et tidsforløb for en søgeindgang til et tidsforløb, der ikke er valgt som foretrukket i et særskilt vokabularkodingsskema. @da
definition: Relates a timespan to an access point for timespan that is not selected for preference in a specific vocabulary encoding scheme.
definition: Setzt einen Zeitraum in Beziehung zu einem Sucheinstieg für einen Zeitraum, der in einem bestimmten Vocabulary Encoding Scheme nicht als Vorzugsform bestimmt wird. @de
definition: يربط بين فترة زمنية ونقطة إتاحة لفترة زمنية لم يتم اختيارها كنقطة إتاحة مختلفة مفضلة في خطة ترميز مفردات محددة. @ar
definition: 将一个时间段与没有在一个特定的词表编码体系中被首选的一个时间段的检索点关联起来。 @zh-hans

is reference source of
lexical alias: referenceSourceOf.en
status: Published
type: Property
label: er referencekilde af @da
label: irodalomjegyzékben szereplő forrása a következőnek: @hu
label: is naslagwerk van @nl
label: ist Nachschlagewerk von @de
label: referans kaynağıdır @tr
label: tietolähde @fi
label: هو مصدر مرجعي لـ @ar
label: 是……的参考信息源 @zh-hans
inverse of: has reference source
definition: Bir kaynağı, bir kaynak tarafından kullanıldığının kanıtını sunan bir isimle ilişkilendirir. @tr
definition: Hozzákapcsol egy forrást egy nomenhez, amelynek használatát egy forrás bizonyítja. @hu
definition: Liittää aineiston nomeniin, jonka käytöstä aineisto on todiste. @fi
definition: Relaterer en ressource til et nomen, hvor evidens for brug gives af en ressource. @da
definition: Relates a resource to a nomen for which evidence of use is provided by a resource.
definition: Setzt eine Ressource in Beziehung zu einem Nomen, für das ein Verwendungsnachweis durch eine Ressource zur Verfügung gestellt wird. @de
definition: يربط بين مصدر وتسمية يتم تقديم دليل على استخدامها بواسطة مصدر. @ar
definition: 将一种资源与由一种资源提供其使用证据的一个命名关联起来。 @zh-hans

is coordinates of cartographic content of
has subproperty: is longitude and latitude of
has subproperty: is strings of coordinate pairs of
has subproperty: is right ascension and declination of
lexical alias: coordinatesOfCartographicContentOf.en
status: Published
type: Property
label: er koordinater af kartografisk indhold af @da
label: is coördinaten van cartografische content van @nl
label: kartografik içeriğinin koordinatlarıdır @tr
label: kartografisen aineiston koordinaatit @fi
label: kartográfiai tartalom koordinátái a következőnek: @hu
label: sind Koordinaten von kartografischem Inhalt von @de
label: هو إحداثيات لمحتوى خرائطى لـ @ar
label: 是……的地图内容的坐标 @zh-hans
sub property of: has related resource of place
inverse of: has coordinates of cartographic content
definition: Bir yeri, sınırlarını veya konumunu belirlemek için matematiksel bir sistem kullanılarak tanımlanan bir kapsama alanına sahip kartografik kaynak olan bir kaynakla ilişkilendirir. @tr
definition: Hozzákapcsol egy helyet egy kartográfiai forráshoz, amely az általa lefedett területet matematikai módszert használva ír le, hogy meghatározza a határát vagy a helyzetét. @hu
definition: Liittää paikan aineistoon, joka on kartografinen aineisto, jonka kattama alue on kuvailtu käyttäen matemaattista järjestelmää rajojen ja sijainnin identifioimiseksi. @fi
definition: Relaterer et sted til en ressource, der er en kartografisk ressource, som lokaliserer et område ved at bruge et matematisk system for at identificere dets grænser eller lokation. @da
definition: Relates a place to a resource that is a cartographic resource that has an area of coverage that is described using a mathematical system to identify its boundaries or location.
definition: Setzt ein Gebiet in Beziehung zu einer Ressource, die über einen Abdeckungsbereich einer kartografischen Ressource verfügt, der mit Hilfe eines mathematischen Systems beschrieben wird, um seine Grenzen oder Lage zu identifizieren. @de
definition: يربط مكان بمصدر عبارة عن مصدر خرائطي له منطقة تغطية موصوفة باستخدام نظام رياضي لتحديد حدوده أو موقعه. @ar
definition: 将一个地点与作为一种地图资源、有覆盖范围、并被使用一个数学体系描述以标识其边界或位置的一种资源关联起来。 @zh-hans

is fuller form of name of
lexical alias: fullerFormOfNameOf.en
status: Published
type: Property
label: er mere fuldstændig navneform på @da
label: is meer volledige vorm van naam van @nl
label: isminin tam halidir @tr
label: ist vollständigere Namensform von @de
label: nimen täydellisempi muoto @fi
label: teljesebb névformája a következőnek: @hu
label: هو شكل كامل لاسم لـ @ar
label: 是……的名称的较完整形式 @zh-hans
sub property of: is name of agent of
inverse of: has fuller form of name
definition: Bir ismi, bir ismin veya ismin bir kısmının baş harf, kısaltma veya kısaltılmış ya da başka bir şekilde değiştirilmiş bir formla temsil eden tam bir forma sahip temsilciyle ilişkilendirir. @tr
definition: Hozzákapcsol egy noment egy ágenshez, amelynek van egy teljesebb névformája, vagy nevének egy részét egy kezdőbetű, rövidítés vagy rövidített, illetve más módosító forma reprezentálja. @hu
definition: Liittää toimijan nomeniin, jolla on nimi tai nimet, jotka sisältävät nimen alkukirjaimilla esitetyn, lyhenteellä lyhennetyn osan tai muuten muokatun nimen täydellisemmän nimenmuodon. @fi
definition: Relaterer et nomen til en agent, som har en mere fuldstændig navneform eller del af navn repræsenteret af et initial, en forkortelse, eller er forkortet eller modificeret på anden måde. @da
definition: Relates a nomen to an agent who has a fuller form of a name or part of a name represented by an initial, abbreviation, or shortened or otherwise modified form.
definition: Setzt ein Nomen in Beziehung zu einem Akteur, der über eine vollständigere Namensform oder einen Teil eines Namens verfügt, der nur durch eine Initiale, eine Abkürzung oder sonst irgendwie gekürzte oder anderweitig veränderte Form dargestellt wird. @de
definition: يربط بين تسمية ووكيل له شكل كامل للإسم أو جزء من اسم يُعبر عنه بحروف أولية، اختصار، أو بطريقة أخرى أو بأي شكل مختصر أو معدل. @ar
definition: 将一个命名与有用首字母缩写、缩略语、缩短或其他修改形式表示的一个名称或一个名称的部分的较完整的形式的一个行为者关联起来。 @zh-hans

is given name of
lexical alias: givenNameOf.en
status: Published
type: Property
label: adıdır @tr
label: er fornavn på @da
label: etunimi @fi
label: is voornaam van @nl
label: ist Vorname von @de
label: utóneve a következőnek: @hu
label: هو اسم أول لـ @ar
label: 是……的名 @zh-hans
sub property of: is name of agent of
inverse of: has given name
definition: Bir ismi, soyadına ek olarak veya onun yerine doğumda veya daha sonraki bir zamanda verilen bir ad kullanan bir temsilciyle ilişkilendirir. @tr
definition: Hozzákapcsol egy noment egy ágenshez, aki születésekor kapott utónevét használja, vagy később vette fel, vagy a vezetékneve helyett használja. @hu
definition: Liittää toimijan nomeniin, joka käyttää toimijalle syntymässä tai myöhempänä ajankohtana sukunimen lisäksi tai sen sijaan annettua nimeä. @fi
definition: Relaterer et nomen til en agent, som bruger et navn givet ved fødslen eller senere udover, eller i stedet for, et efternavn. @da
definition: Relates a nomen to an agent who uses a name given at birth or at some later point in addition to, or instead of, a surname.
definition: Setzt ein Nomen in Beziehung zu einem Akteur, der einen Namen verwendet, der ihm bei der Geburt oder zu einem späteren Zeitpunkt, zusätzlich oder anstatt eines Nachnamens, gegeben wird. @de
definition: يربط بين تسمية ووكيل يستخدم اسم سُمي به عند الولادة أو بعد ذلك إضافة إلى، أو بدلًا من، اسم عائلة. @ar
definition: 将一个命名与使用出生时或以后某个时间点被赋予的姓以外或取代姓的一个名的一个行为者关联起来。 @zh-hans

has intended audience of nomen
lexical alias: intendedAudienceOfNomen.en
status: Published
type: Property
label: har tiltænkt målgruppe for nomen @da
label: hat Zielgruppe eines Nomens @de
label: heeft beoogd publiek van nomen @nl
label: ismin hedef kitlesi ile ilişkilidir @tr
label: nomen célközönsége a következő: @hu
label: nomenin kohderyhmä @fi
label: له جمهور مستهدف بتسمية @ar
label: 有命名的目标受众 @zh-hans
definition: Bir ismi, ismin amaçlandığı bir kullanıcı sınıfı ile ilişkilendirir. @tr
definition: Hozzákapcsol egy noment egy olyan használói osztályhoz, amelynek a noment szánják. @hu
definition: Liittää nomenin käyttäjäkuntaan, jolle nomen on suunnattu. @fi
definition: Relaterer et nomen til en klasse af brugere som et nomen er tiltænkt. @da
definition: Relates a nomen to a class of users for which a nomen is intended.
definition: Setzt ein Nomen in Beziehung zu einer Gruppe von Benutzenden, für die ein Nomen gedacht ist. @de
definition: يربط بين تسمية وفئة المستخدمين الموجهة إليهم التسمية. @ar
definition: 将一个命名与一个命名的目标使用者的类关联起来。 @zh-hans

has language of nomen
lexical alias: languageOfNomen.en
status: Published
type: Property
label: har sprog for nomen @da
label: hat Sprache eines Nomens @de
label: heeft taal van nomen @nl
label: ismin dili ile ilişkilidir @tr
label: nomen nyelve a következő: @hu
label: nomenin kieli @fi
label: له لغة لتسمية @ar
label: 有命名的语言 @zh-hans
definition: Bir ismi bir ünvan dili ile ilişkilendirir. @tr
definition: Hozzákapcsol egy noment egy megnevezés nyelvéhez. @hu
definition: Liittää nomenin nimityksen kieleen. @fi
definition: Relaciona un nomen amb una llengua d’un nomen. @ca
definition: Relaterer et nomen til et sprog for en benævnelse. @da
definition: Relates a nomen to a language of a nomen.
definition: Setzt ein Nomen in Beziehung zu einer Sprache von einer Bezeichnung. @de
definition: يربط بين تسمية ولغة اسم. @ar
definition: 将一个命名与一个命名的一种语言关联起来。 @zh-hans

is surname of
lexical alias: surnameOf.en
status: Published
type: Property
label: er efternavn på @da
label: is achternaam van @nl
label: ist Nachname von @de
label: soyadıdır @tr
label: sukunimi @fi
label: vezetékneve a következőnek: @hu
label: هو اسم عائلة لـ @ar
label: 是……的姓 @zh-hans
sub property of: is name of agent of
inverse of: has surname
definition: Bir ismi, soyadını kullanan bir temsilciyle ilişkilendirir. @tr
definition: Hozzákapcsol egy noment egy ágenshez, aki családnevet használ. @hu
definition: Liittää nomenin toimijaan, joka käyttää suvun nimeä. @fi
definition: Relaterer et nomen til en agent, som bruger et famillienavn @da
definition: Relates a nomen to an agent who uses a family name.
definition: Setzt ein Nomen in Beziehung zu einem Akteur, der einen Familiennamen verwendet. @de
definition: يربط بين تسمية ووكيل يستخدم اسم عائلة. @ar
definition: 将一个命名与使用家族名的一个行为者关联起来。 @zh-hans

is parallel title of series of
lexical alias: parallelTitleOfSeriesOf.en
status: Published
type: Property
label: er parallel serietitel på @da
label: is parallelle reekstitel van @nl
label: ist Paralleltitel einer Reihe von @de
label: párhuzamos sorozati címe a következőnek: @hu
label: sarjan rinnakkainen nimeke @fi
label: serisinin paralel başlığıdır @tr
label: هو عنوان موازِ لسلسلة لـ @ar
label: 是……的并列丛编题名 @zh-hans
sub property of: is title of series of
inverse of: has parallel title of series
definition: Bir ismi,farklı bir dilde ya da metinde seri başlığı olan bir kaynakla ilişilendirir. @tr
definition: Hozzákapcsol egy noment egy forráshoz, amelynek van egy sorozatcíme más nyelven vagy írásrendszerben. @hu
definition: Liittää nomenin aineistoon, jolla on sarjan nimeke toisella kielellä tai kirjoitusjärjestelmällä. @fi
definition: Relaterer et nomen til en ressource, der har en serietitel på et andet sprog eller på en anden skrift. @da
definition: Relates a nomen to a resource that has a title of series in another language or script.
definition: Setzt ein Nomen in Beziehung zu einer Ressource, die einen Titel einer Reihe hat, der in einer anderen Sprache oder einer anderen Schrift vorliegt. @de
definition: يربط تسمية بمصدر له عنوان سلسلة في لغة أخرى أو نص أخر. @ar
definition: 将一个命名与有用另一种语言或文字的丛编题名的一种资源关联起来。 @zh-hans

is longitude and latitude of
lexical alias: longitudeAndLatitudeOf.en
status: Published
type: Property
label: enlemi ve boylamıdır @tr
label: er længdegrad og breddegrad af @da
label: hosszúsági és szélességi foka a következőnek: @hu
label: is lengtegraad en breedtegraad van @nl
label: ist Längengrad und Breitengrad von @de
label: pituus- ja leveysasteet @fi
label: هو خط الطول وخط العرض لـ @ar
label: 是……的经度和纬度 @zh-hans
sub property of: is coordinates of cartographic content of
inverse of: has longitude and latitude
definition: Bir yeri, en batı ve en doğu sınırlarının boylamı ve en kuzey ve en güney sınırlarının enlemi kullanılarak tanımlanan bir kapsama alanına sahip kartografik kaynak olan bir kaynakla ilişkilendirir. @tr
definition: Hozzákapcsol egy helyet egy kartográfiai forráshoz, amely egy terület elhelyezkedésének meghatározásához legnyugatibb és legkeletibb határainak hosszúsági, valamint a legészakibb és legdélibb határainak szélességi fokát használja. @hu
definition: Liittää paikan aineistoon, joka on kartografinen aineisto, jonka kattama alue indentifioidaan käyttämällä läntisimmän ja itäisimmän rajan pituusastetta sekä pohjoisimman ja eteläisimmän rajan leveysastetta. @fi
definition: Relaterer et sted til en ressource, der er en kartografisk ressource, som har et dækningsområde, der er identificeret ved hjælp af længdegraden på de vestligste og østligste grænser og breddegraden på de nordligste og sydligste grænser. @da
definition: Relates a place to a resource that is a cartographic resource that has an area of coverage that is identified using longitude of the westernmost and easternmost boundaries and latitude of the northernmost and southernmost boundaries.
definition: Setzt ein Gebiet in Beziehung zu einer kartografischen Ressource, deren Abdeckungsbereich anhand des Längengrads der westlichsten und östlichsten Grenze sowie des Breitengrads der nördlichsten und südlichsten Grenze identifiziert wird. @de
definition: يربط مكان بمصدر له مصدر خرائطي يحدد منطقة باستخدام خط الطول لأقصى الحدود الغربية والشرقية وخط العرض لأقصى الحدود الشمالية والجنوبية. @ar
definition: 将一个地点与作为地图资源、有覆盖范围、用最西和最东边界的经度以及最北和最南边界的纬度标识的一种资源关联起来。 @zh-hans

has location
lexical alias: location.en
status: Published
type: Property
label: elhelyezkedése a következő: @hu
label: har lokation @da
label: hat Standort @de
label: heeft locatie @nl
label: konum ile ilişkilidir @tr
label: sijainti @fi
label: له موقع @ar
label: 有位置 @zh-hans
definition: Bir yeri, o yerin fiziksel bölgesinin sınırlandırılmasıyla ilişkilendirir. @tr
definition: Hozzákapcsol egy helyet a hely fizikai területének lehatárolásához. @hu
definition: Liittää paikan paikan fyysisen alueen rajaukseen. @fi
definition: Relaterer et sted til en afgrænsning af stedets fysiske territorium. @da
definition: Relates a place to a delimitation of the physical territory of the place.
definition: Setzt ein Geografikum in Beziehung zu einer Abgrenzung des physischen Gebiets eines Geografikums. @de
definition: يربط بين مكان وترسيم حدود الأراضي الطبيعية لمكان. @ar
definition: 将一个地点与一个地点的物理区域的界定关联起来。 @zh-hans

is strings of coordinate pairs of
lexical alias: stringsOfCoordinatePairsOf.en
status: Published
type: Property
label: er strenge af koordinatpar for @da
label: is tekenreeksen van coördinatenparen van @nl
label: koordinaattiparit @fi
label: koordinat çiftlerinin dizileridir @tr
label: koordinátapár-láncai a következőnek: @hu
label: sind Reihen von Koordinatenpaaren von @de
label: هو خطوط إحداثيات مزدوجة لـ @ar
label: 是……的坐标对串 @zh-hans
sub property of: is coordinates of cartographic content of
inverse of: has strings of coordinate pairs
definition: Bir yeri, her bir köşe için koordinatlar kullanılarak bir çokgenle tanımlanan bir kapsama alanına sahip bir kartografik kaynak olan bir kaynakla ilişkilendirir. @tr
definition: Hozzákapcsol egy helyet egy kartográfiai forráshoz, amely egy pontos terület azonosításához a poligon csúcsainak koordinátáit használja. @hu
definition: Liittää paikan aineistoon, joka on kartografinen aineisto, jonka kattama alue identifioidaan polygonein käyttämällä monikulmion jokaisen kärjen koordinaatteja. @fi
definition: Relaciona un lloc amb un recurs que és un recurs cartogràfic que té una àrea de cobertura que s’identifica per un polígon mitjançant les coordenades de cada vèrtex. @ca
definition: Relaterer et sted til en ressource, som er en kartografisk ressource, der har et dækningsområde, der identificeres af en polygon ved hjælp af koordinater for hvert toppunkt. @da
definition: Relates a place to a resource that is a cartographic resource that has an area of coverage that is identified by a polygon using coordinates for each vertex.
definition: Setzt ein Gebiet in Beziehung zu einer kartografischen Ressource, deren Abdeckungsbereich durch ein Vieleck mit Koordinaten für jeden Eckpunkt identifiziert wird. @de
definition: يربط مكان بمصدر عبارة عن مصدر خرائطي يحدد بدقة منطقة معينة باستخدام إحداثيات لكل قمة مضلع. @ar
definition: 将一个地点与作为地图资源、有通过使用每个角的坐标表示的多边形标识的覆盖范围的一种资源关联起来。 @zh-hans

is right ascension and declination of
lexical alias: rightAscensionAndDeclinationOf.en
status: Published
type: Property
label: Rektaszension und Deklination von @de
label: er rektascension og deklination for @da
label: is rechte klimming en declinatie van @nl
label: rektaskensio ja deklinaatio @fi
label: rektaszcenziója és deklinációja a következőnek: @hu
label: yükseliş ve düşüş @tr
label: هو صعود مستقيم وانحراف لـ @ar
label: 是……的赤经和赤纬 @zh-hans
sub property of: is coordinates of cartographic content of
inverse of: has right ascension and declination
definition: Bir yeri, kaynağın kapsamı olan ve yükseliş ve sapma açıları kullanılarak tanımlanan bir gök cisminin yerini belirleyen kartografik kaynak olan bir kaynakla ilişkilendirir. @tr
definition: Hozzákapcsol egy helyet egy kartográfiai forráshoz, amely rektaszcenzió és deklináció szögei segítségével határozza meg a forrás által lefedett égitestek helyzetét az égbolton. @hu
definition: Liittää paikan aineistoon, joka on kartografinen aineisto, joka määrittää taivaankappaleen sijainnin ja teoksen sisällöllisen kattavuuden käyttämällä rektaskension ja deklinaation kulmamittoja. @fi
definition: Relaterer et sted til en ressource, som er en kartografisk ressource, der lokaliserer et himmellegeme, der er dækning for ressourcen, og som er identificeret ved hjælp af vinklerne for rekstascension og deklination. @da
definition: Relates a place to a resource that is a cartographic resource that locates a celestial body that is the coverage of the resource and is identified using the angles of right ascension and declination.
definition: Setzt einen Ort in Beziehung zu einer kartografischen Ressource, die einen Himmelskörpers verortet, der Gegenstand der Ressource ist und anhand der Winkel der Rektaszension und der Deklination identifiziert wird. @de
definition: يربط مكان بمصدر عبارة عن مصدر خرائطي يحدد جرم سماوي عبارة عن تغطية المصدر ويتم تحديده باستخدام زوايا الصعود المستقيم والانحراف. @ar
definition: 将一个地点与作为地图资源、定位作为作品覆盖范围并用赤经和赤纬的角度标识的天体的一种资源关联起来。 @zh-hans

has instructor (Deprecated)
lexical alias: instructor.en
status: Deprecated
type: Property
label: har instruktør @da
label: hat Ausbilderin/Ausbilder @de
label: heeft instructeur @nl
label: oktatója a következő: @hu
label: opettaja @fi
label: له محاضر @ar
sub property of: has performer
definition: Hozzákapcsol egy forrást egy előadó ágenshez, aki hozzájárul egy forráshoz azzal, hogy tanít vagy szemléltetést tart. @hu
definition: Liittää aineiston toimijaan, joka on aineistossa osallisena opettamalla tai antamalla havaintoesityksen. @fi
definition: Relaterer en ressource til en agent, som er performer, der bidrager til en ressource, ved at undervise eller give en demonstration. @da
definition: Relates a resource to an agent who is a performer who contributes to a resource by teaching or providing a demonstration. (Deprecated)
definition: Setzt eine Ressource in Beziehung zu einer Ausführenden/einem Ausführenden, die/der zu einer Ressource beiträgt, indem sie/er unterrichtet oder etwas demonstriert. @de
definition: يربط بين مصدرووكيل مؤدِ يساهم في مصدر عن طريق التدريس أو تقديم عرض توضيحي. @ar

has name of agent of resource
lexical alias: nameOfAgentOfResource.en
status: Published
type: Property
label: forrás ágensének neve a következő: @hu
label: har navn på agent for ressource @da
label: hat Namen eines Akteurs einer Ressource @de
label: heeft naam van actor van resource @nl
label: kaynak temsilcisinin adı ile ilişkilidir @tr
label: toimijan nimi @fi
label: له اسم وكيل لمصدر @ar
label: 有资源的行为者的名称 @zh-hans
sub property of: has related nomen of resource
inverse of: is name of agent of resource of
definition: Bir kaynağı, yayınlanmış bir kaynağı dağıtmaktan, basmaktan, çoğaltmaktan, yayınlamaktan, piyasaya sürmekten, çıkarmaktan vb. veya yayınlanmamış bir kaynağı yazmaktan, üretmekten, yapmaktan vb. sorumlu olan bir aracının adı olan bir isimle ilişkilendirir. @tr
definition: Hozzákapcsol egy forrást egy nomenhez, amely egy olyan ágens neve, amely felelős egy kiadott forrás terjesztéséért, nyomtatásáért, sokszorosításáért, öntéséért, kiadásáért, kibocsájtásáért, megjelentetéséért stb., vagy egy kiadatlan forrás írásáért, összeállításáért, készítéséért, stb. @hu
definition: Liittää aineiston nomeniin, joka on painetun aineiston jakelusta, painamisesta, monistamisesta, julkaisemisesta jne. vastaavan toimijan nimi tai julkaisemattoman aineiston kirjoittamisesta, valmistamisesta, rakentamisesta jne. vastaavan toimijan nimi. @fi
definition: Relates a resource to a nomen that is a name of an agent who is responsible for distributing, printing, duplicating, casting, publishing, releasing, issuing, etc., a published resource, or inscribing, fabricating, constructing, etc., an unpublished resource.
definition: Setzt eine Ressource in Beziehung zu einem Namen eines Akteurs, der für den Vertrieb, den Druck, die Vervielfältigung, den Guss, das Veröffentlichen, das Release, die Herausgabe und so weiter einer veröffentlichten Ressource oder der für das Gravieren, Fabrizieren, Konstruieren und so weiter einer unveröffentlichten Ressource verantwortlich ist. @de
definition: يربط بين مصدر واسم وكيل مسؤول عن توزيع، طباعة، نسخ، صب، نشر، تحرير، إصدار...إلخ، مصدرًا منشور، أو تسجيل، تصنيع، إنشاء...إلخ، مصدرًا غير منشور. @ar
definition: 将一种资源与作为负责一种出版资源的经销、印刷、复制、铸造、出版、发布、发行等、或者一种非出版资源的镌刻、制造、构造等的一个行为者的名称的一个命名关联起来。 @zh-hans

is name of agent of resource of
lexical alias: nameOfAgentOfResourceOf.en
status: Published
type: Property
label: is naam van actor van resource van @nl
label: ist Name eines Akteurs einer Ressource von @de
label: kaynağının temsilcisinin adıdır @tr
label: toimijan nimi @fi
label: ágensneve a következő forrásnak: @hu
label: هو اسم وكيل لمصدر لـ @ar
label: 是……的资源的行为者的名称 @zh-hans
sub property of: has related resource of nomen
inverse of: has name of agent of resource
definition: Bir ismi, dağıtım, basım, çoğaltma, yayınlama, piyasaya sürme, ihraç etme vb. işlemlerden veya yazım, üretim, yapım vb. işlemlerden sorumlu bir aracı ismi olan bir kaynakla ilişkilendirir. @tr
definition: Hozzákapcsol egy noment egy forráshoz, amelyhez hozzátartozik egy olyan ágensnek a neve, amely felelős a terjesztésért, nyomtatásért, sokszorosításért, öntéséért, kiadásért, kibocsájtásért, megjelentetésért stb., vagy írásáért, összeállításért, készítéséért, stb. @hu
definition: Liittää nomenin aineistoon, jolla on painetun aineiston jakelusta, painamisesta, monistamisesta, julkaisemisesta jne. vastaavan toimijan nimi tai julkaisemattoman aineiston kirjoittamisesta, valmistamisesta, rakentamisesta jne. vastaavan toimijan nimi. @fi
definition: Relates a nomen to a resource that has a name of agent who is responsible for distribution, printing, duplication, casting, publication, release, issue, etc., or inscription, fabrication, construction, etc.
definition: Setzt ein Nomen in Beziehung zu einer Ressource, die über einen Namen eines Akteurs verfügt, der für den Vertrieb, den Druck, die Vervielfältigung, den Guss, das Veröffentlichen, das Release, die Herausgabe und so weiter oder für das Gravieren, Fabrizieren, Konstruieren und so weiter verantwortlich ist. @de
definition: يربط تسمية بمصدر له اسم وكيل مسؤول عن التوزيع، الطباعة، النسخ، الصب، النشر، التحرير، الإصدار...إلخ، أو التسجيل، أو التصنيع، أو الإنشاء...إلخ. @ar
definition: 将一个命名与有负责发行、印刷、复制、铸造、出版、发布、经销等或者镌刻、制造、构建等的行为者的名称的一种资源关联起来。 @zh-hans

has place of resource
lexical alias: placeOfResource.en
status: Published
type: Property
label: aineiston paikka @fi
label: forrás helye a következő: @hu
label: hat Ort einer Ressource @de
label: heeft plaats van resource @nl
label: kaynak yeri ile ilişkilidir @tr
label: له مكان لمصدر @ar
label: 有资源的地点 @zh-hans
sub property of: has related place of resource
inverse of: is place of resource of
definition: Bir kaynağı, yayınlanmış bir kaynağın dağıtımı, basımı, çoğaltılması, yayınlanması, piyasaya sürülmesi veya çıkarılması vb. ile veya yayınlanmamış bir kaynağın yazımı, üretimi, yapımı vb. ile ilişkili bir yerle ilişkilendirir. @tr
definition: Hozzákapcsol egy forrást egy helyhez, amely egy kiadott forrás terjesztéséhez, nyomtatásához, sokszorosításához, öntéséhez, kiadásához, kibocsájtásához, megjelentetéséhez stb., vagy egy kiadatlan forrás írásához, összeállításához, készítéséhez stb. kapcsolódik. @hu
definition: Liittää aineiston paikkaan, jossa julkaistu aineisto on kustannettu, julkaistu, ilmestynyt, painettu, monistettu, valettu kirjasinten osalta tai jaettu. Liittää aineiston paikkaan, jossa julkaisematon aineisto on kaiverrettu, valmistettu, koottu tai muuten tuotettu. @fi
definition: Relates a resource to a place that is associated with the distribution, printing, duplicating, casting, publication, release, or issuing, etc., of a published resource, or the inscription, fabrication, construction, etc., of an unpublished resource.
definition: Setzt eine Ressource in Beziehung zu einem Geografikum, das mit dem Vertrieb, dem Druck, der Vervielfältigung, dem Guss, der Veröffentlichung, dem Release oder der Herausgabe und so weiter einer veröffentlichten Ressource oder mit der Beschriftung, der Fabrikation, der Konstruktion und so weiter einer unveröffentlichten Ressource in Verbindung steht. @de
definition: يربط بين مصدر ومكان مرتبط بطباعة، نسخ، صب، نشر، تحرير، إصدار...إلخ، مصدرًا منشورًا، أو تسجيل، تصنيع، إنشاء...إلخ، مصدرًا غير منشور. @ar
definition: 将一种资源与和一种出版资源的经销、印刷、复制、铸造、出版、发布或发行有关的一个地点、或者和一种非出版资源的镌刻、制造、构造或其他方式制作有关的一个地点关联起来。 @zh-hans

is place of resource of
lexical alias: placeOfResourceOf.en
status: Published
type: Property
label: aineiston paikka @fi
label: helye a következő forrásnak: @hu
label: is plaats van resource van @nl
label: ist Ort einer Ressource von @de
label: kaynağının yeridir @tr
label: هو مكان لمصدر لـ @ar
label: 是……的资源的地点 @zh-hans
sub property of: has related resource of place
inverse of: has place of resource
definition: Bir yeri, dağıtılan, basılan, çoğaltılan, yayınlanan, piyasaya sürülen veya çıkarılan, vb. yayınlanmış bir kaynak veya bir yere yazılan, üretilen, yapılan, vb. yayınlanmamış bir kaynak olan bir kaynakla ilişkilendirir. @tr
definition: Hozzákapcsol egy helyet egy kiadott forráshoz, amelyet terjesztenek, nyomtatnak, sokszorosítanak, öntenek, kiadnak, kibocsájtanak vagy megjelentetnek stb. vagy kiadatlan forráshoz, amelyet bejegyeznek, gyártanak, összeállítanak stb. egy helyen. @hu
definition: Liittää paikan aineistoon, joka on kustannettu, julkaistu, ilmestynyt, painettu, monistettu, valettu kirjasinten osalta tai jaettu. Liittää aineiston paikkaan, jossa julkaisematon aineisto on kaiverrettu, valmistettu, koottu tai muuten tuotettu. @fi
definition: Relates a place to a resource that is a published resource that is distributed, printed, duplicated, cast, published, released, or issued, etc., or an unpublished resource that is inscribed, fabricated, constructed, etc., in a place.
definition: Setzt ein Geografikum in Beziehung zu einer veröffentlichten Ressource, die an einem Geografikum vertrieben, gedruckt, vervielfältigt, gegossen, veröffentlicht, freigegeben oder herausgegeben und so weiter wird oder zu einer unveröffentlichte Ressource, die an einem Geografikum beschriftet, fabriziert, konstruiert und so weiter wird. @de
definition: يربط مكان بمصدر يُعد مصدرًا منشورًا يتم توزيعه، طباعته، نسخه، صبه، نشره، تحريره، أو إصداره...إلخ، أو يعد مصدرًا غير مطبوع يتم تسجيله أو تصنيعه أو إنشائه...إلخ، في مكان ما. @ar
definition: 将一个地点与作为一种出版资源在一个地点被发行、印刷、复制、铸造、出版、发布或经销等、或者一种非出版资源在一个地点被镌刻、制造、构造等的一种资源关联起来。 @zh-hans

is beginning of
lexical alias: beginningOf.en
status: Published
type: Property
label: ajanjakson alku @fi
label: başlangıcıdır @tr
label: is begin van @nl
label: ist Anfang von @de
label: kezdete a következőnek: @hu
label: هو بداية لـ @ar
label: 是—…的开始 @zh-hans
inverse of: has beginning
definition: Bir zaman aralığını, zaman aralığı olan zamanda başlayan bir zaman aralığı ile ilişkilendirir. @tr
definition: Hozzákapcsol egy időtartamot egy időtartamhoz, amely akkor keződik, amikor az egy időtartam. @hu
definition: Liittää ajanjakson ajanjakson ajankohtaan, josta ajanjakso alkaa. @fi
definition: Relates a timespan to a timespan that starts at the time that is a timespan.
definition: Setzt einen Zeitraum in Beziehung zu einem Zeitraum, der zu diesem Zeitpunkt beginnt. Auch dieser wird als Zeitraum bezeichnet. @de
definition: يربط بين فترة زمنية وفترة زمنية تبدأ في وقت هو فترة زمنية. @ar
definition: 将一个时间段与开始于作为一个时间段的时间的一个时间段关联起来。 @zh-hans

is ending of
lexical alias: endingOf.en
status: Published
type: Property
label: ajanjakson loppu @fi
label: bitişidir @tr
label: is einde van @nl
label: ist Ende von @de
label: vége a következőnek: @hu
label: هو نهاية لـ @ar
label: 是……的结束 @zh-hans
inverse of: has ending
definition: Bir zaman aralığını, zaman aralığı olan zamanda biten bir zaman aralığı ile ilişkilendirir. @tr
definition: Hozzákapcsol egy időtartamot egy időtartamhoz, amely akkor végződik, amikor az egy időtartam. @hu
definition: Liittää ajanjakson ajanjakson ajankohtaan, johon ajanjakso loppuu. @fi
definition: Relates a timespan to a timespan that finishes at the time that is a timespan.
definition: Setzt einen Zeitraum in Beziehung zu einem Zeitraum, der zu diesem Zeitpunkt endet. Auch dieser wird als Zeitraum bezeichnet. @de
definition: يربط بين فترة زمنية وفترة زمنية تنتهي في وقت هو فترة زمنية. @ar
definition: 将一个时间段与结束于作为一个时间段的时间的一个时间段关联起来。 @zh-hans

is numbering within sequence of
lexical alias: numberingWithinSequenceOf.en
status: Published
type: Property
label: is nummering binnen volgorde van @nl
label: ist Zählung innerhalb einer Reihe von @de
label: numerointijakson sisäinen numerointi @fi
label: sorrendiséget jelző számozása a következőnek: @hu
label: sırası içinde numaralandırılmıştır @tr
label: له ترقيم داخل تسلسل لـ @ar
label: 是在……的序列中的编号 @zh-hans
sub property of: has related resource of nomen
inverse of: has numbering within sequence
definition: Bir ismi, daha büyük bir kaynağın bağımsız parçaları veya daha büyük bir kaynağın parçaları veya konuları dizisindeki konumunu tanımlayan tanıma olan bir kaynakla ilişkilendirir. @tr
definition: Hozzákapcsol egy noment egy forráshoz, amelynek megjelölése azonosítja annak elhelyezkedését az egyedi részek sorrendiségében egy nagyobb mű részeként vagy részegységeként. @hu
definition: Liittää nomenin aineistoon, jonka määrite identifioi sen sijainnin laajemman aineiston yksittäisten osien tai laajemman aineiston osien tai numeroiden jaksossa. @fi
definition: Relates a nomen to a resource that has a designation that identifies its position in a sequence of individual parts of a larger resource or parts or issues of a larger resource.
definition: Setzt ein Nomen in Beziehung zu einer Ressource, die über eine Bezeichnung verfügt, die ihre Position in einer Reihe einzelner Teile einer größeren Ressource oder Teilen oder Ausgaben einer größeren Ressource identifiziert. @de
definition: يربط تسمية بمصدر له تسميه تحدد موقعه داخل تسلسل أجزاء فردية من مصدر أكبر، أو أجزاء أو إصدارات لمصدر أكبر. @ar
definition: 将一个命名与有标识其在一种较大资源中的个别部分或者一种较大资源中的部分或期的序列中的位置的一个标识的一种资源关联起来。 @zh-hans

is first alphanumeric designation of alternative sequence of
lexical alias: firstAlphanumericDesignationOfAlternativeSequenceOf.en
status: Published
type: Property
label: alfanumerikus kezdőjelölése a következő alternatív sorrendiségének: @hu
label: alternatif sırasının ilk alfanümerik tanımlanmasıdır @tr
label: is eerste alfanumerieke aanduiding van alternatieve volgorde van @nl
label: ist alternative alphanumerische Bezeichnung der ersten Ausgabe oder des ersten Teils einer Folge von @de
label: vaihtoehtoisen numerointijakson ensimmäinen numero- tai kirjainmäärite @fi
label: هو تسمية أبجدية رقمية أولى لتسلسل بديل لـ @ar
label: 是……的交替序列的第一个字母数字标识 @zh-hans
sub property of: is first alphanumeric designation of sequence of
inverse of: has first alphanumeric designation of alternative sequence
definition: Bir ismi, daha büyük bir kaynağın bağımsız parçaları veya daha büyük bir kaynağın parçaları veya konuları sırasındaki konumunu tanımlayan bir belirteç olan bir kaynakla ilişkilendirir. @tr
definition: Hozzákapcsol egy noment egy forráshoz, amelynek megjelölése számok vagy alfabetikus karakterek formájában jelzi az elsőséget a részek vagy iterációk konkurens számozási sorrendjében. @hu
definition: Liittää nomeniin aineistoon, jolla on numeroista tai kirjaimista muodostuva määrite, joka on aineiston osien tai iteraatioiden rinnakkaisen numerointijakson ensimmäinen määrite. @fi
definition: Relates a nomen to a resource that has a designation in the form of numbers or alphabetic characters that is used to indicate the first in a concurrent sequence of numbering of parts or iterations.
definition: Setzt ein Nomen in Beziehung zu einer Ressource, die über eine Bezeichnung in Form von Nummern oder Buchstaben verfügt, die verwendet wird, um in einer alternativen Zählfolge der Ausgaben oder Iterationen auf die erste hinzuweisen. @de
definition: يربط تسمية بمصدر له تسمية على شكل أرقام أو حروف هجائية مستخدمة لتشير إلى أول تسلسل رقمي متزامن للأجزاء أو الأعداد. @ar
definition: 将一个命名与有以数字或字母字符形式标识用于标识部分或更新后整体的并存编号序列中第一个的一种资源关联起来。 @zh-hans

is first alphanumeric designation of sequence of
has subproperty: is first alphanumeric designation of alternative sequence of
lexical alias: firstAlphanumericDesignationOfSequenceOf.en
status: Published
type: Property
label: alfanumerikus kezdőjelölése a következő sorrendiségének: @hu
label: is eerste alfanumerieke aanduiding van volgorde van @nl
label: ist alphanumerische Bezeichnung der ersten Ausgabe einer fortlaufenden Ressource von @de
label: numerointijakson ensimmäinen numero- tai kirjainmäärite @fi
label: sırasının ilk alfanümerik tanımlanmasıdır @tr
label: هو تسمية أبجدية رقمية أولى لتسلسل لـ @ar
label: 是……的序列的第一个字母数字标识 @zh-hans
sub property of: has related resource of nomen
inverse of: has first alphanumeric designation of sequence
definition: Bir ismi, parçaların veya yinelemelerin bir numaralandırma dizisindeki ilkini belirtmek için kullanılan sayılar veya alfabetik karakterler biçiminde tanımlaması olan bir kaynakla ilişkilendirir. @tr
definition: Hozzákapcsol egy noment egy forráshoz, amelynek megjelölése számok vagy alfabetikus karakterek formájában jelzi az elsőséget a részek vagy iterációk számozási sorrendjében. @hu
definition: Liittää nomeniin aineistoon, jolla on numeroista tai kirjaimista muodostuva määrite, joka on aineiston osien tai iteraatioiden numerointijakson ensimmäinen määrite. @fi
definition: Relates a nomen to a resource that has a designation in the form of numbers or alphabetic characters that is used to indicate the first in a sequence of numbering of parts or iterations.
definition: Setzt ein Nomen in Beziehung zu einer Ressource, die über eine Bezeichnung in Form von Nummern oder Buchstaben verfügt, die verwendet wird, um in einer Zählfolge der Ausgaben auf die erste hinzuweisen. @de
definition: يربط تسمية بمصدر له تسمية على شكل أرقام أو حروف هجائية مستخدمة لتشير إلى أول تسلسل رقمي للأجزاء أو الأعداد. @ar
definition: 将一个命名与有以数字或字母字符形式标识用于标识部分或更新后整体的编号序列中第一个的一种资源关联起来。 @zh-hans

is first chronological designation of alternative sequence of
lexical alias: firstChronologicalDesignationOfAlternativeSequenceOf.en
status: Published
type: Property
label: alternatif sırasının ilk kronolojik tanımlanmasıdır @tr
label: is eerste chronologische aanduiding van alternatieve volgorde van @nl
label: ist alternative chronologische Bezeichnung einer ersten Ausgabe einer fortlaufenden Ressource von @de
label: kronológiai kezdőjelölése a következő alternatív sorrendiségének: @hu
label: vaihtoehtoisen numerointijakson ensimmäinen aikamäärite @fi
label: هو تسمية زمنية أولى لتسلسل بديل لـ @ar
label: 是……的交替序列的第一个年代标识 @zh-hans
sub property of: is first chronological designation of sequence of
inverse of: has first chronological designation of alternative sequence
definition: Bir isim, parçaların veya yinelemelerin eşzamanlı bir numaralandırma dizisinde ilkini belirtmek için kullanılan bir tarih veya başka bir zaman aralığı şeklinde bir tanıma sahip bir kaynakla ilişkilendirir. @tr
definition: Hozzákapcsol egy noment egy forráshoz, amelynek megjelölése dátum vagy más időtartam formájában jelzi az elsőséget a részek vagy iterációk konkurens számozási sorrendjében. @hu
definition: Liittää nomenin aineistoon, jolla on päivämäärästä tai muusta ajanjaksosta muodostuva määrite, joka on aineiston osien tai iteraatioiden rinnakkaisen numerointijakson ensimmäinen määrite. @fi
definition: Relates a nomen to a resource that has a designation in the form of a date or other timespan that is used to indicate the first in a concurrent sequence of numbering of parts or iterations.
definition: Setzt ein Nomen in Beziehung zu einer Ressource, die über eine Bezeichnung in Form eines Datums oder eines anderen Zeitraums verfügt, die verwendet wird, um in einer alternativen Zählfolge der Ausgaben auf die erste hinzuweisen. @de
definition: يربط تسمية بمصدر له تسمية على شكل تاريخ أو فترة زمنية أخرى مستخدمة لتشير إلى أول تسلسل رقمي متزامن الأجزاء أو الأعداد. @ar
definition: 将一个命名与有以日期或其他时间段形式标识用于标识部分或更新后整体的并存编号序列中第一个的一种资源关联起来 @zh-hans

is first chronological designation of sequence of
has subproperty: is first chronological designation of alternative sequence of
lexical alias: firstChronologicalDesignationOfSequenceOf.en
status: Published
type: Property
label: is eerste chronologische aanduiding van volgorde van @nl
label: ist chronologische Bezeichnung der ersten Ausgabe einer fortlaufenden Ressource von @de
label: kronológiai kezdőjelölése a következő sorrendiségének: @hu
label: numerointijakson ensimmäinen aikamäärite @fi
label: sırasının ilk kronolojik tanımlanmasıdır @tr
label: هو تسمية زمنية أولى لتسلسل لـ @ar
label: 是……的序列的第一个年代标识 @zh-hans
sub property of: has related resource of nomen
inverse of: has first chronological designation of sequence
definition: Bir ismi, parçaların veya yinelemelerin numaralandırılması dizisinde ilkini belirtmek için kullanılan bir tarih veya başka bir zaman aralığı şeklinde bir tanıma sahip bir kaynakla ilişkilendirir. @tr
definition: Hozzákapcsol egy noment egy forráshoz, amelynek megjelölése dátum vagy más időtartam formájában jelzi az elsőséget a részek vagy iterációk számozási sorrendjében. @hu
definition: Liittää nomenin aineistoon, jolla on päivämäärästä tai muusta ajanjaksosta muodostuva määrite, joka on aineiston osien tai iteraatioiden numerointijakson ensimmäinen määrite. @fi
definition: Relates a nomen to a resource that has a designation in the form of a date or other timespan that is used to indicate the first in a sequence of numbering of parts or iterations.
definition: Setzt ein Nomen in Beziehung zu einer Ressource, die über eine Bezeichnung in Form eines Datums oder eines anderen Zeitraums verfügt, die verwendet wird, um in einer Zählfolge der Ausgaben auf die erste hinzuweisen. @de
definition: يربط تسمية بمصدر له تسمية على شكل تاريخ أو فترة زمنية أخرى مستخدمة لتشير إلى أول تسلسل رقمي للأجزاء أو الأعداد. @ar
definition: 将一个命名与有以日期或其他时间段形式标识用于标识部分或更新后整体的编号序列中第一个的一种资源关联起来。 @zh-hans

is last alphanumeric designation of alternative sequence of
lexical alias: lastAlphanumericDesignationOfAlternativeSequenceOf.en
status: Published
type: Property
label: alfanumerikus zárójelölése a következő alternatív sorrendiségének: @hu
label: alternatif sırasının son alfanümerik tanımlanmasıdır @tr
label: is laatste alfanumerieke aanduiding van alternatieve volgorde van @nl
label: ist alternative alphanumerische Bezeichnung der letzten Ausgabe einer fortlaufenden Ressource von @de
label: vaihtoehtoisen numerointijakson viimeinen numero- tai kirjainmäärite @fi
label: هو تسمية أبجدية رقمية أخيرة لتسلسل بديل لـ @ar
label: 是……的交替序列的最后一个字母数字标识 @zh-hans
sub property of: is last alphanumeric designation of sequence of
inverse of: has last alphanumeric designation of alternative sequence
definition: Bir isimi, parçaların veya yinelemelerin eşzamanlı bir numaralandırma dizisinin sonuncusunu belirtmek için kullanılan sayılar veya alfabetik karakterler biçiminde bir tanıma sahip bir kaynakla ilişkilendirir. @tr
definition: Hozzákapcsol egy noment egy forráshoz, amelynek megjelölése számok vagy alfabetikus karakterek formájában jelzi az utolsót a részek vagy iterációk konkurens számozási sorrendjében. @hu
definition: Liittää nomeniin aineistoon, jolla on numeroista tai kirjaimista muodostuva määrite, joka on aineiston osien tai iteraatioiden rinnakkaisen numerointijakson viimeinen määrite. @fi
definition: Relates a nomen to a resource that has a designation in the form of numbers or alphabetic characters that is used to indicate the last in a concurrent sequence of numbering of parts or iterations.
definition: Setzt ein Nomen in Beziehung zu einer Ressource, die über eine Bezeichnung in Form von Nummern oder Buchstaben verfügt, die verwendet wird, um in einer alternativen Zählfolge der Ausgaben auf die letzte hinzuweisen. @de
definition: يربط تسمية بمصدر له تسمية على شكل أرقام أو حروف هجائية مستخدمة لتشير إلى آخر تسلسل رقمي متزامن للأجزاء أو الأعداد. @ar
definition: 将一个命名与有以数字或字母字符形式标识用于标识部分或更新后整体的并存编号序列中最后一个的一种资源关联起来。 @zh-hans

is last alphanumeric designation of sequence of
has subproperty: is last alphanumeric designation of alternative sequence of
lexical alias: lastAlphanumericDesignationOfSequenceOf.en
status: Published
type: Property
label: is laatste alfanumerieke aanduiding van volgorde van @nl
label: ist alphanumerische Bezeichnung der letzten Ausgabe einer fortlaufenden Ressource von @de
label: numerointijakson viimeinen numero- tai kirjainmäärite @fi
label: sırasının son alfanümerik tanımlanmasıdır @tr
label: záró alfanumerikus megjelölése a következő sorrendiségének: @hu
label: هو تسمية أبجدية رقمية أخيرة لتسلسل لـ @ar
label: 是……的序列的最后一个字母数字标识 @zh-hans
sub property of: has related resource of nomen
inverse of: has last alphanumeric designation of sequence
definition: Bir ismi, parçaların veya yinelemelerin numaralandırılması dizisinin sonuncusunu belirtmek için kullanılan sayılar veya alfabetik karakterler biçiminde bir tanıma sahip bir kaynakla ilişkilendirir. @tr
definition: Hozzákapcsol egy noment egy forráshoz, amelynek megjelölése számok vagy alfabetikus karakterek formájában jelzi az utolsót a részek vagy iterációk számozási sorrendjében. @hu
definition: Liittää nomeniin aineistoon, jolla on numeroista tai kirjaimista muodostuva määrite, joka on aineiston osien tai iteraatioiden numerointijakson viimeinen määrite. @fi
definition: Relates a nomen to a resource that has a designation in the form of numbers or alphabetic characters that is used to indicate the last in a sequence of numbering of parts or iterations.
definition: Setzt ein Nomen in Beziehung zu einer Ressource, die über eine Bezeichnung in Form von Nummern oder Buchstaben verfügt, die verwendet wird, um in einer Zählfolge der Ausgaben auf die letzte hinzuweisen. @de
definition: يربط تسمية بمصدر له تسمية على شكل أرقام أو حروف هجائية مستخدمة لتشير إلى آخر تسلسل رقمي للأجزاء أو الأعداد. @ar
definition: 将一个命名与有以数字或字母字符形式标识用于标识部分或更新后整体的编号序列中最后一个的一种资源关联起来。 @zh-hans

is last chronological designation of alternative sequence of
lexical alias: lastChronologicalDesignationOfAlternativeSequenceOf.en
status: Published
type: Property
label: alternatif sırasının son kronolojik tanımlanmasıdır @tr
label: is laatste chronologische aanduiding van alternatieve volgorde van @nl
label: ist alternative chronologische Bezeichnung der letzten Ausgabe einer fortlaufenden Ressource von @de
label: kronológiai zárójelölése a következő alternatív sorrendiségének: @hu
label: vaihtoehtoisen numerointijakson viimeinen aikamäärite @fi
label: هو تسمية زمنية أخيرة لتسلسل بديل لـ @ar
label: 是……的交替序列的最后一个年代标识 @zh-hans
sub property of: is last chronological designation of sequence of
inverse of: has last chronological designation of alternative sequence
definition: Bir ismi, parçaların veya yinelemelerin eşzamanlı bir numaralandırma dizisinin sonuncusunu belirtmek için kullanılan bir tarih veya başka bir zaman aralığı şeklinde bir tanıma sahip bir kaynakla ilişkilendirir. @tr
definition: Hozzákapcsol egy noment egy forráshoz, amelynek megjelölése dátum vagy más időtartam formájában jelzi az utolsót a részek vagy iterációk konkurens számozási sorrendjében. @hu
definition: Liittää aineistoon nomenin, joka on päivämäärästä tai muusta ajanjaksosta muodostuva määrite, joka on osien tai iteraatioiden rinnakkaisen numerointijakson viimeinen määrite. @fi
definition: Relates a nomen to a resource that has a designation in the form of a date or other timespan that is used to indicate the last in a concurrent sequence of numbering of parts or iterations.
definition: Setzt ein Nomen in Beziehung zu einer Ressource, die über eine Bezeichnung in Form eines Datums oder eines anderen Zeitraums verfügt, die verwendet wird, um in einer alternativen Zählfolge der Ausgaben auf die letzte hinzuweisen. @de
definition: يربط تسمية بمصدر له تسمية على شكل تاريخ أو فترة زمنية أخرى مستخدمة لتشير إلى آخر تسلسل رقمي متزامن للأجزاء أو الأعداد. @ar
definition: 将一个命名与有以日期或其他时间段形式标识用于标识部分或更新后整体的并存编号序列中最后一个的一种资源关联起来。 @zh-hans

is last chronological designation of sequence of
has subproperty: is last chronological designation of alternative sequence of
lexical alias: lastChronologicalDesignationOfSequenceOf.en
status: Published
type: Property
label: is laatste chronologische aanduiding van volgorde van @nl
label: ist chronologische Bezeichnung der letzten Ausgabe einer fortlaufenden Ressource von @de
label: kronológiai zárójelölése a következő sorrendiségének: @hu
label: numerointijakson viimeinen aikamäärite @fi
label: sırasının son kronolojik tanımlanmasıdır @tr
label: هو تسمية زمنية أخيرة لتسلسل لـ @ar
label: 是……的序列的最后一个年代标识 @zh-hans
sub property of: has related resource of nomen
inverse of: has last chronological designation of sequence
definition: Bir ismi, parçaların veya yinelemelerin numaralandırılması dizisinin sonuncusunu belirtmek için kullanılan bir tarih veya başka bir zaman aralığı şeklinde bir tanıma sahip bir kaynakla ilişkilendirir. @tr
definition: Hozzákapcsol egy noment egy forráshoz, amelynek megjelölése dátum vagy más időtartam formájában jelzi az utolsót a részek vagy iterációk számozási sorrendjében. @hu
definition: Liittää nomenin aineistoon, jolla on päivämäärästä tai muusta ajanjaksosta muodostuva määrite, joka on osien tai iteraatioiden rinnakkaisen numerointijakson viimeinen määrite. @fi
definition: Relates a nomen to a resource that has a designation in the form of a date or other timespan that is used to indicate the last in a sequence of numbering of parts or iterations.
definition: Setzt ein Nomen in Beziehung zu einer Ressource, die über eine Bezeichnung in Form eines Datums oder eines anderen Zeitraums verfügt, die verwendet wird, um in einer Zählfolge der Ausgaben auf die letzte hinzuweisen. @de
definition: يربط تسمية بمصدر له تسمية على شكل تاريخ أو فترة زمنية أخرى مستخدمة لتشير إلى آخر تسلسل رقمي للأجزاء أو الأعداد. @ar
definition: 将一个命名与有以日期或其他时间段形式标识用于标识部分或更新后整体的编号序列中最后一个的一种资源关联起来。 @zh-hans

is described with metadata by
has subproperty: has finding aid
lexical alias: describedWithMetadataBy.en
status: Published
type: Property
label: metatiedolla kuvailtu @fi
label: tarafından üstveri ile tanımlanmıştır @tr
label: és descrit amb metadades per @ca
label: 被……用元数据描述 @zh-hans
sub property of: is described by
inverse of: is metadata description of entity
definition: Bir varlığı, bir varlık için bir üstveri kaynağı olan bir kaynakla ilişkilendirir. @tr
definition: Liittää entiteetin aineistoon, joka on entiteetin metatietoaineisto. @fi
definition: Relaciona una entitat amb un recurs que és un recurs de metadades d’una entitat. @ca
definition: Relates an entity to a resource that is a metadata resource for an entity.
definition: 将一个实体与作为一个实体的一种元数据资源的一种资源关联起来。 @zh-hans

is metadata description of entity
lexical alias: metadataDescriptionOfEntity.en
status: Published
type: Property
label: kuvailee metatiedolla @fi
label: varlığın üstveri tanımlamasıdır @tr
label: és descripció de metadades d’entitat @ca
label: 是实体的元数据描述 @zh-hans
sub property of: is description of
inverse of: is described with metadata by
definition: Bir kaynağı, bir üstveri kaynağı tarafından tanımlanan bir varlıkla ilişkilendirir. @tr
definition: Liittää aineiston entiteettiin, joka on kuvailtu metatietoaineistolla. @fi
definition: Relaciona un recurs amb una entitat que és descrita per un recurs de metadades. @ca
definition: Relates a resource to an entity that is described by a metadata resource.
definition: 将一种资源与被一种元数据资源描述的一个实体关联起来。 @zh-hans

has collection accrual method
lexical alias: collectionAccrualMethod.en
status: Published
type: Property
label: kokoelman kartuntamenetelmä @fi
label: koleksiyon sağlama yöntemi ile ilişkilidir @tr
label: té mètode d’acumulació de col·lecció de recursos @ca
label: 有收藏增加方法 @zh-hans
definition: Bir kaynağı, bir koleksiyon kaynağının kaynağına eklenen kaynakların mülkiyetinin devri yöntemiyle ilişkilendirir. @tr
definition: Liittää aineiston aineistojen omistajuuden siirtämisen menetelmään, jolla kartutetaan aineistoja kokoelma-aineistoon. @fi
definition: Relaciona un recurs amb un mètode de transferència de propietat dels recursos que s’afegeixen a un recurs d’un recurs de col·lecció de recursos. @ca
definition: Relates a resource to a method of transfer of ownership of the resources that are added to a resource of a collection resource.
definition: 将一种资源与被增加到一种收藏资源的一种资源中去的资源的所有权转移的方法关联起来。 @zh-hans

has collection accrual policy
lexical alias: collectionAccrualPolicy.en
status: Published
type: Property
label: kokoelma-aineiston kartuttamisen linja @fi
label: koleksiyon sağlama politikası ile ilişkilidir @tr
label: té política d’acumulació de col·lecció de recursos @ca
label: 有收藏增加政策 @zh-hans
definition: Bir kaynağı, bir koleksiyon kaynağının kaynağına eklenen kaynakları seçmeye yönelik bir ilkeyle ilişkilendirir. @tr
definition: Liittää aineiston kokoelma-aineistoon lisättävien aineistojen valitsemisen linjaan. @fi
definition: Relaciona un recurs amb una política de selecció de recursos que s’afegeixen a un recurs d’un recurs de col·lecció de recursos. @ca
definition: Relates a resource to a policy for selecting resources that are added to a resource of a collection resource.
definition: 将一种资源与被增加到一种收藏资源的一种资源中去的资源的选择政策关联起来。 @zh-hans

has subcollection
lexical alias: subcollection.en
status: Published
type: Property
label: alakokoelma @fi
label: alt koleksiyon ile ilişkilidir @tr
label: té subcol·lecció de recursos @ca
label: 有分收藏 @zh-hans
sub property of: has part resource
inverse of: is subcollection of
definition: Bir gösterimi, başka bir koleksiyon çalışmasının bir temsilinin ayrı bir bileşeni olan bir koleksiyon çalışmasının bir temsiliyle ile ilişkilendirir. @tr
definition: Liittää manifestaation kokoelmateoksen manifestaatioon, joka on toisen kokoelmateoksen manifestaation erillinen osa. @fi
definition: Relaciona un recurs amb un recurs d’un recurs de col·lecció de recursos que és un component discret d’un recurs d’un altre recurs de col·lecció de recursos. @ca
definition: Relates a resource to a resource of a collection resource that is a discrete component of a resource of another collection resource.
definition: 将一种资源与作为另一种收藏资源中的一种资源的一个独立组成部分的一种收藏资源中的一种资源关联起来。 @zh-hans

is subcollection of
lexical alias: subcollectionOf.en
status: Published
type: Property
label: alakokoelma @fi
label: alt koleksiyonudur @tr
label: és subcol·lecció de recursos de @ca
label: 是……的分收藏 @zh-hans
sub property of: is part of resource
inverse of: has subcollection
definition: Bir temsili, ayrı bir bileşen olarak başka bir koleksiyon çalışmasının bir temsili olan koleksiyon çalışmasının bir temsil ile ilişkilendirir. @tr
definition: Liittää manifestaation kokoelmateoksen manifestaatioon, johon sisältyy toisen kokoelmateoksen manifestaatio erillisenä osana. @fi
definition: Relaciona un recurs amb un recurs d’un recurs de col·lecció de recursos que té un recurs d’un altre recurs de col·lecció de recursos com un component discret. @ca
definition: Relates a resource to a resource of a collection resource that has a resource of another collection resource as a discrete component.
definition: 将一种资源与有另一种收藏资源中的一种资源作为一个独立组成部分的一种收藏资源的一种资源关联起来。 @zh-hans

has holding
lexical alias: holding.en
status: Published
type: Property
label: aineisto kokelmassa @fi
label: koleksiyonda bulunan kopya ile ilişkilidir @tr
label: té fons @ca
label: 有馆藏 @zh-hans
sub property of: aineistoon liittyvä aineisto
inverse of: is holding of
definition: Bir kaynağı, bir koleksiyon kaynağının kaynağına dahil olan bir kaynakla ilişkilendirir. @tr
definition: Liittää aineiston kokoelma-aineiston osaksi. @fi
definition: Relaciona un recurs amb un recurs que s’inclou en el recurs d’un recurs de col·lecció de recursos. @ca
definition: Relates a resource to a resource that is included in the resource of a collection resource.
definition: 将一种资源与被包括于一种收藏资源的资源中的一种资源关联起来。 @zh-hans

is holding of
lexical alias: holdingOf.en
status: Published
type: Property
label: kokoelma-aineisto @fi
label: koleksiyonda bulunan kopyasıdır @tr
label: és fons de @ca
label: 是……的馆藏 @zh-hans
sub property of: aineistoon liittyvä aineisto
inverse of: has holding
definition: Bir kaynağı, kaynağı içeren bir koleksiyon kaynağının kaynağıyla ilişkilendirir. @tr
definition: Liittää aineiston kokoelma-aineistoon kuuluvaan aineistoon. @fi
definition: Relaciona un recurs amb un recurs d’un recurs de col·lecció de recursos que inclou el recurs. @ca
definition: Relates a resource to a resource of a collection resource that includes the resource.
definition: 将一种资源与包含该资源的一种收藏资源的一种资源关联起来。 @zh-hans

has location of collection
lexical alias: locationOfCollection.en
status: Published
type: Property
label: kokoelman-aineiston sijainti @fi
label: koleksiyonun konumu ile ilişkilidir @tr
label: té localització de col·lecció de recursos @ca
label: 有收藏的位置 @zh-hans
sub property of: has related resource of place
inverse of: is location of collection of
definition: Bir kaynağı, bir koleksiyon kaynağının kaynağının depolandığı bir yerle ilişkilendirir. @tr
definition: Liittää aineiston paikkaan, jossa kokoelma-aineistoa säilytetään. @fi
definition: Relaciona un recurs amb un lloc on s’emmagatzema un recurs de col·lecció de recursos. @ca
definition: Relates a resource to a place where a collection resource is stored.
definition: 将一种资源与一种收藏资源被储存的一个地点关联起来。 @zh-hans

is location of collection of
lexical alias: locationOfCollectionOf.en
status: Published
type: Property
label: kokoelman-aineiston sijainti @fi
label: koleksiyonunun konumudur @tr
label: és localització de col·lecció de recursos de @ca
label: 是……的收藏的地点 @zh-hans
sub property of: has related place of resource
inverse of: has location of collection
definition: Bir yeri, bir yerde saklanan bir koleksiyon kaynağının kaynağıyla ilişkilendirir. @tr
definition: Paikka, jossa kokoelma-aineistoa säilytetään. @fi
definition: Relaciona un lloc amb un recurs d’un recurs de col·lecció de recursos que s’emmagatzema en un lloc. @ca
definition: Relates a place to a resource of a collection resource that is stored in a place.
definition: 将一个地点与被储存于一个地点的一种收藏资源的一种资源关联起来。 @zh-hans

has location of resource
lexical alias: locationOfResource.en
status: Published
type: Property
label: aineiston sijainti @fi
label: kaynağın konumu ile ilişkilidir @tr
label: té localització de recurs @ca
label: 有资源的位置 @zh-hans
sub property of: has related resource of place
inverse of: is location of resource of
definition: Bir kaynağı, bir kaynağın tutulduğu, depolandığı veya erişim için hazır hale getirildiği bir yerle ilişkilendirir. @tr
definition: Liittää aineiston tietyssä paikassa säilytettävään tai saataville asetettavaan aineistoon. @fi
definition: Relaciona un recurs amb un lloc on un recurs es aplegat, emmagatzemat o és fet disponible per a l’accés. @ca
definition: Relates a resource to a place where a resource is held, stored, or made available for access.
definition: 将一种资源与一种资源被收藏、储存或提供存取的一个地点关联起来。 @zh-hans

is location of resource of
lexical alias: locationOfResourceOf.en
status: Published
type: Property
label: aineiston sijainti @fi
label: kaynağının konumudur @tr
label: és localització de recurs de @ca
label: 是……的资源的位置 @zh-hans
sub property of: has related place of resource
inverse of: has location of resource
definition: Bir yeri, bir yerde tutulan, depolanan veya erişime açık hale getirilen bir kaynakla ilişkilendirir. @tr
definition: Liittää paikan säilytettävään tai saataville asetattavaan aineistoon. @fi
definition: Relaciona un lloc amb un recurs que es aplegat, emmagatzemat o és fet disponible per a l’accés en un lloc. @ca
definition: Relates a place to a resource that is held, stored, or made available for access in a place.
definition: 将一个地点与在一个地点收藏、储存或提供获取的一种资源关联起来。 @zh-hans

is on resource with
lexical alias: onResourceWith.en
status: Published
type: Property
label: aineistossa mukana @fi
label: ile aynı kaynakta yer alır @tr
label: és en un recurs amb @ca
label: 在和……同一种资源上 @zh-hans
sub property of: aineistoon liittyvä aineisto
definition: Bir kaynağı, bir kaynakla aynı kaynakta yeniden üretilen bir kaynakla ilişkilendirir. @tr
definition: Liittää aineiston sen osaksi tehtyyn aineistoon. @fi
definition: Relaciona un recurs amb un recurs que es reprodueix en el mateix recurs com un recurs. @ca
definition: Relates a resource to a resource that is reproduced on the same resource as a resource.
definition: 将一种资源与被复制于和一资源的同一种资源上的一种资源关联起来。 @zh-hans

is held with
lexical alias: heldWith.en
status: Published
type: Property
label: ile birlikte tutulur @tr
label: yhdistetty aineistoon @fi
label: és aplegat amb @ca
label: 和……一起收藏 @zh-hans
sub property of: has accompanying resource relationship with (Deprecated)
definition: Bir kaynağı, bir kaynakla aynı koleksiyonda tutulan bir kaynakla ilişkilendirir. @tr
definition: Liittää aineiston saman kokoelman aineistoksi liitettyyn aineistoon. @fi
definition: Relaciona un recurs amb un recurs que és aplegat en la mateixa col·lecció de recursos com un recurs. @ca
definition: Relates a resource to a resource that is held in the same collection as a resource.
definition: 将一资源与和一种资源在同一个收藏中的一种资源关联起来。 @zh-hans

has hierarchic finding aid
lexical alias: hierarchicFindingAid.en
status: Published
type: Property
label: hierarkkinen luettelo @fi
label: hiyerarşik rehber bilgi ile ilişkilidir @tr
label: té instrument de descripció jeràrquic @ca
label: 有分级查询工具 @zh-hans
sub property of: has finding aid
inverse of: is hierarchic finding aid of
definition: Bir kaynağı, bir koleksiyon kaynağı tarafından sahip olunan alt koleksiyonlar ve kaynaklar için bir üstveri seti olan bir kaynakla ilişkilendirir. @tr
definition: Liitää aineiston kokoelma-aineistoon sisältyvien alakokoelmien ja kappaleiden metatietokokonaisuuteen. @fi
definition: Relaciona un recurs amb un recurs que és un conjunt de descripció de metadades per a les subcol·leccions i recursos que són aplegades per un recurs de col·lecció de recursos. @ca
definition: Relates a resource to a resource that is a metadata description set for the sub-collections and resources that are held by a collection resource.
definition: 将一种资源与作为一种收藏资源所收入的分收藏和各种资源的元数据描述集合的一种资源关联起来。 @zh-hans

is hierarchic finding aid of
lexical alias: hierarchicFindingAidOf.en
status: Published
type: Property
label: hierarkkinen luettelo @fi
label: hiyerarşik rehber bilgisidir @tr
label: és instrument de descripció jeràrquic de @ca
label: 是……的分级查询工具 @zh-hans
sub property of: is finding aid of
inverse of: has hierarchic finding aid
definition: Bir kaynağı, sahip olduğu alt koleksiyonlar ve kaynaklar için bir üstveri setine sahip bir koleksiyon kaynağı olan bir kaynakla ilişkilendirir. @tr
definition: Liittää aineiston kokoelma-aineistoon, jolla on siihen kuuluvia alakokoelmia ja aineistoja koskeva metatietokokonaisuus. @fi
definition: Relaciona un recurs amb un recurs que és un recurs de col·lecció de recursos que té un conjunt de descripció de metadades per a les subcol·leccions i recursos que aplega. @ca
definition: Relates a resource to a resource that is a collection resource that has a metadata description set for the sub-collections and resources that it holds.
definition: 将一种资源与作为一种收藏资源并有所收入的分收藏和各种资源的元数据描述集合的一种资源关联起来。 @zh-hans