Work properties
type: Ontology
description: Properties that represent the attribute and relationship elements of the RDA Work entity.
preferred namespace prefix: rdaw
rights: Copyright © 2020 American Library Association, Canadian Federation of Library Associations, and CILIP: Chartered Institute of Library and Information Professionals
licence: deed.en US
creator: RDA Steering Committee
contributor: RSC Technical Working Group
publisher: ALA Digital Reference
type: http://rdaregistry.info/termList/RDALinkedDataWork/1003
issued: 2014-01-18
title: RDA:n teoksen ominaisuudet @fi
description: RDA-elementeistä johdetut ominaisuudet RDA:n teoksen määrittelyjoukossa. @fi
version info: v5.4.6
modified: 2025-07-07

has academic supervisor
status: Published
lexical alias: academicSupervisor.en
definition: Relates a work to a person who is responsible for overseeing academic activity of any kind that results in a work, including theses, research, and projects.
toolkit label: academic supervisor
toolkit definition: A person who is responsible for overseeing academic activity of any kind that results in a work, including theses, research, and projects.
type: Property
domain: C10001
sub property of: has creator person of work
has element type: 2
label: akateeminen ohjaaja @fi
definition: Liittää teoksen henkilöön, joka on vastuussa kaikenlaisen akateemisen toiminnan valvonnasta, joka johtaa teokseen, mukaan lukien tutkielmat, tutkimukset ja projektit. @fi
toolkit label: akateeminen ohjaaja @fi
toolkit definition: Henkilö, joka on vastuussa kaikenlaisen akateemisen toiminnan valvonnasta, joka johtaa teokseen, mukaan lukien tutkielmat, tutkimukset ja projektit. @fi
label: har akademisk veileder @no
definition: Relaterer et verk til en person som er ansvarlig for å føre tilsyn med all akademisk aktivitet som resulterer i et verk, inklusive avhandlinger, forskning og prosjekter. @no
toolkit label: akademisk veileder @no
toolkit definition: En person som er ansvarlig for å føre tilsyn med all akademisk aktivitet som resulterer i et verk, inklusive avhandlinger, forskning og prosjekter. @no
label: heeft academische begeleider @nl
definition: Relateert een werk aan een persoon die verantwoordelijk is voor het toezicht houden op academische activiteiten van elke soort die resulteert in een werk, inclusief dissertaties, onderzoek en projecten. @nl
toolkit label: academische begeleider @nl
toolkit definition: Een persoon die verantwoordelijk is voor het toezicht houden op academische activiteiten van elke soort die resulteert in een werk, inclusief dissertaties, onderzoek en projecten. @nl
label: له مشرف أكاديمي @ar
definition: يربط بين عمل وشخص مسئول عن الإشراف على نشاط أكاديمي من أي نوع ينتج عنه عمل، بما في ذلك الأطروحات، والأبحاث، والمشروعات. @ar
toolkit label: مشرف أكاديمي @ar
toolkit definition: شخص مسئول عن الإشراف على نشاط أكاديمي من أي نوع ينتج عنه عمل، بما في ذلك الأطروحات، والأبحاث، والمشروعات. @ar
label: té com a supervisor acadèmic @ca
definition: Relaciona una obra amb una persona que és responsable de supervisar l’activitat acadèmica de qualsevol classe que dona com a resultat una obra, incloses tesis, recerques i projectes. @ca
toolkit label: supervisor acadèmic @ca
toolkit definition: Persona que és responsable de supervisar l’activitat acadèmica de qualsevol classe que dona com a resultat una obra, incloses tesis, recerques i projectes. @ca
label: har akademisk vejleder @da
definition: Relaterer et værk til en person, som er ansvarlig for at føre tilsyn med akademisk aktivitet af enhver art, som resulterer i et værk, herunder afhandlinger, forskning og projekter. @da
toolkit label: akademisk vejleder @da
toolkit definition: Person, som er ansvarlig for at føre tilsyn med akademisk aktivitet af enhver art, som resulterer i et værk, herunder afhandlinger, forskning og projekter. @da
label: akadeemiline juhendaja @et
definition: Seostab teose isikuga, kes vastutab teoses (sh väitekirjad, uurimused ja projektid) väljenduva ükskõik millist laadi akadeemilise tegevuse ülevaatamise eest. @et
toolkit label: akadeemiline juhendaja @et
toolkit definition: Isik, kes vastutab teoses (sh väitekirjad, uurimused ja projektid) väljenduva ükskõik millist laadi akadeemilise tegevuse ülevaatamise eest. @et
label: hat akademische Betreuerin/akademischen Betreuer @de
definition: Setzt ein Werk in Beziehung zu einer Person, die akademische Tätigkeiten jeglicher Art betreut, die zu einem Werk führen. Darunter fallen Hochschulschriften, Forschungen und Projekte. @de
toolkit label: Akademische Betreuerin/Akademischer Betreuer @de
toolkit definition: Eine Person, die akademische Tätigkeiten jeglicher Art betreut, die zu einem Werk führen. Darunter fallen Hochschulschriften, Forschungen und Projekte. @de
label: ha come supervisore accademico @it
definition: Correla un'opera alla persona responsabile della supervisione su attività accademiche di qualsiasi tipo che producono un'opera, incluse tesi, ricerche e progetti. @it
toolkit label: supervisore accademico @it
toolkit definition: Persona responsabile della supervisione su attività accademiche di qualsiasi tipo, che producono un'opera, incluse tesi, ricerche e progetti. @it
label: a pour superviseur académique @fr
definition: Met une œuvre en relation avec une personne qui est responsable de superviser les activités universitaires de toute nature entraînant la création d’une œuvre, y compris les thèses, les travaux de recherche et les projets. @fr
toolkit label: superviseur académique @fr
toolkit definition: Personne qui est responsable de superviser les activités universitaires de toute nature entraînant la création d’une œuvre, y compris les thèses, les travaux de recherche et les projets. @fr
label: akadēmiskā darba vadītājs @lv
definition: Sasaista darbu ar personu, kura ir atbildīga par jebkāda veida akadēmiskās darbības pārraudzību, ieskaitot promocijas darbus, pētījumus un projektus. @lv
toolkit label: akadēmiskā darba vadītājs @lv
toolkit definition: Persona, kura ir atbildīga par jebkāda veida akadēmiskās darbības pārraudzību, ieskaitot promocijas darbus, pētījumus un projektus. @lv
label: 有学术主管 @zh-hans
definition: 将一种作品与负责导致一种作品的各种学术活动（包括论文、研究和项目）之监督的一个个人关联起来。 @zh-hans
toolkit label: 学术主管 @zh-hans
toolkit definition: 负责导致一种作品的各种学术活动（包括论文、研究和项目）之监督的一个个人 @zh-hans
label: tudományos témavezetője a következő: @hu
definition: Hozzákapcsol egy művet egy személyhez, aki felelős bármilyen tudományos tevékenység felügyeletéért, amelynek eredménye egy mű, beleértve szakdolgozatokat, kutatást és projekteket. @hu
toolkit label: tudományos témavezető: @hu
toolkit definition: Egy személy, aki felelős bármilyen tudományos tevékenység felügyeletéért, amelynek eredménye egy mű, beleértve szakdolgozatokat, kutatást és projekteket. @hu
has subproperty: has project supervisor
has subproperty: has research supervisor
has subproperty: has degree supervisor
has subproperty: P10407
label: akademik danışman ile ilişkilidir @tr
definition: Bir eseri, tez, araştırma ve proje de dahil olmak üzere bir eser ile sonuçlanan her türlü akademik faaliyeti denetlemekle sorumlu olan kişiyle ilişkilendirir. @tr
toolkit label: Akademik danışman @tr
toolkit definition: Tez, araştırma ve proje de dahil olmak üzere bir çalışma ile sonuçlanan her türlü akademik faaliyeti denetlemekle sorumlu olan kişi. @tr

has access point for work
status: Published
sub property of: has appellation of work
type: Property
lexical alias: accessPointForWork.en
definition: Relates a work to a nomen that is an appellation of work in natural language that is taken from a vocabulary encoding scheme or is constructed using a string encoding scheme.
domain: C10001
toolkit label: access point for work
toolkit definition: A nomen that is an appellation of work in natural language that is taken from a vocabulary encoding scheme or is constructed using a string encoding scheme.
has element type: 3
sub property of: P00016
label: teoksen hakutieto @fi
definition: Liittää teoksen nomeniin, joka on luonnollisella kielellä oleva teoksen nimitys, joka on otettu sanaston merkintäjärjestelmästä tai on muodostettu käyttämällä merkkijonon merkintäjärjestelmää. @fi
toolkit label: teoksen hakutieto @fi
toolkit definition: Nomen, joka on luonnollisella kielellä oleva teoksen nimitys, joka on otettu sanaston merkintäjärjestelmästä tai on muodostettu käyttämällä merkkijonon merkintäjärjestelmää. @fi
label: har søkeinngang for verk @no
definition: Relaterer et verk til en betegnelse på verk på et naturlig språk som er hentet fra et kodeskjema for vokabular eller er laget ved bruk av et kodeskjema for syntaks. @no
toolkit label: søkeinngang for verk @no
toolkit definition: En betegnelse på verk på et naturlig språk som er hentet fra et kodeskjema for vokabular eller er laget ved bruk av et kodeskjema for syntaks. @no
label: heeft ingang voor werk @nl
definition: Relateert een werk aan een nomen dat is een benaming voor werk in natuurlijke taal die ontleend is aan een vocabulair coderingsschema of gevormd is volgens een string coderingsschema. @nl
toolkit label: ingang voor werk @nl
toolkit definition: Een nomen dat is een benaming voor werk in natuurlijke taal die ontleend is aan een vocabulair coderingsschema of gevormd is volgens een string coderingsschema. @nl
label: له نقطة وصول لعمل @ar
definition: يربط بين عمل وتسمية عبارة عن اسم تعريفي لعمل باللغة الطبيعية مأخوذ من خطة ترميز مفردات أو تم إنشاؤه باستخدام خطة ترميز سلسلة تمثيلات. @ar
toolkit label: له نقطة وصول لعمل @ar
toolkit definition: تسمية عبارة عن اسم تعريفي لعمل باللغة الطبيعية مأخوذ من خطة ترميز مفردات أو تم إنشاؤه باستخدام خطة ترميز سلسلة تمثيلات. @ar
label: té com a punt d’accés d’obra @ca
definition: Relaciona una obra amb un nomen que és una apel·lació d’obra en llenguatge natural que s’obté d’un esquema de codificació de vocabulari o s’elabora usant un esquema de codificació de cadenes. @ca
toolkit label: punt d’accés d’obra @ca
toolkit definition: Nomen que és una apel·lació d’obra en llenguatge natural que s’obté d’un esquema de codificació de vocabulari o s’elabora usant un esquema de codificació de cadenes. @ca
label: har søgeindgang for værk @da
definition: Relaterer et værk til en benævnelse på værk på normalsprog, som er taget fra et vokabularkodningsskema eller er konstrueret ved hjælp af et strengkodningsskema. @da
toolkit label: søgeindgang for værk @da
toolkit definition: Benævnelse på værk på normalsprog, som er taget fra et vokabularkodningsskema eller er konstrueret ved hjælp af et strengkodningsskema. @da
label: teose otsielement @et
definition: Seostab teose teose nimetusega loomulikus keeles, mis on võetud leksikaalsest märkimissüsteemist või moodustatud stringilise märkimissüsteemi alusel. @et
toolkit label: teose otsielement @et
toolkit definition: Teose nimetus loomulikus keeles, mis on võetud leksikaalsest märkimissüsteemist või moodustatud stringilise märkimissüsteemi alusel. @et
label: hat Sucheinstieg für ein Werk @de
definition: Setzt ein Werk in Beziehung zu einer Bezeichnung für ein Werk in natürlicher Sprache, die einem Vocabulary Encoding Scheme entnommen oder mit einem String Encoding Scheme konstruiert wird. @de
toolkit label: Sucheinstieg für ein Werk @de
toolkit definition: Eine Bezeichnung für ein Werk in natürlicher Sprache, die einem Vocabulary Encoding Scheme entnommen oder mit einem String Encoding Scheme konstruiert wird. @de
label: mű hozzáférési pontja a következő: @hu
definition: Hozzákapcsol egy műveet egy nomenhez, egy mű természetes nyelvű megnevezéséhez, amely egy szótárkódolási sémából származik, vagy egy karakterlánc-kódolási séma használatával szerkesztett. @hu
toolkit label: műhöz tartozó hozzáférési pont @hu
toolkit definition: Egy nomen, egy mű természetes nyelvű megnevezése, amely egy szótárkódolási sémából származik, vagy egy karakterlánc-kódolási séma használatával szerkesztett. @hu
label: ha come punto d'accesso per opera @it
definition: Correla un’opera a una denominazione di opera in linguaggio naturale che è tratta da uno schema di codifica di vocabolario o da uno schema di codifica per stringhe. @it
toolkit label: punto d'accesso per opera @it
toolkit definition: Denominazione di opera in linguaggio naturale che è tratta da uno schema di codifica di vocabolario o da uno schema di codifica per stringhe. @it
label: a pour point d’accès d’une œuvre @fr
definition: Met une œuvre en relation avec un nomen qui est une appellation d’œuvre en langage naturel provenant d’un schéma d’encodage de vocabulaire ou construite à l’aide d’un schéma d’encodage de chaînes. @fr
toolkit label: point d’accès d’une œuvre @fr
toolkit definition: Nomen qui est une appellation d’œuvre en langage naturel provenant d’un schéma d’encodage de vocabulaire ou construite à l’aide d’un schéma d’encodage de chaînes. @fr
label: darba pamatforma @lv
definition: Sasaista darbu ar nomenu, kas ir darba vārds/nosaukums dabiskā valodā, kas ņemts no shēmas kontrolētu vārdnīcu kodēšanai vai tiek konstruēts, izmantojot virknes kodēšanas shēmu. @lv
toolkit label: darba pamatforma @lv
toolkit definition: Darba vārds/nosaukums dabiskā valodā, kas ņemts no shēmas kontrolētu vārdnīcu kodēšanai vai tiek konstruēts, izmantojot virknes kodēšanas shēmu. @lv
label: 有作品的检索点 @zh-hans
definition: 将一种作品与作为一种作品的称谓、取自一个词表编码体系或者用一个串编码体系构建、用自然语言的一个命名关联起来。 @zh-hans
toolkit label: 作品的检索点 @zh-hans
toolkit definition: 作为一种作品的称谓、取自一个词表编码体系或者用一个串编码体系构建、用自然语言的一个命名 @zh-hans
has subproperty: has authorized access point for work
has subproperty: has variant access point for work
has subproperty: P10328
label: eser için erişim noktası ile ilişkilidir @tr
definition: Bir eseri, bir kelime kodlama şemasından alınan veya bir dizge kodlama şeması kullanılarak oluşturulan doğal dilde bir eser unvanı olan bir isimle ilişkilendirir. @tr
toolkit label: Eser için erişim noktası @tr
toolkit definition: Bir kelime kodlama şemasından alınan veya bir dize kodlama şeması kullanılarak oluşturulan doğal dilde bir eser unvanı olan bir isim. @tr

has accompanying work relationship with (Deprecated)
status: Deprecated
type: Property
domain: C10001
sub property of: has related work of work
definition: Relates a work to a work that is an augmentation of, or is augmented by, or is complemented by another work. (Deprecated)
scope note: Accompanying works include supplements, concordances, indexes, catalogues, teacher’s guides, music for a motion picture, etc. (Deprecated)
lexical alias: accompanyingWorkRelationship.en
toolkit label: accompanying work relationship (Deprecated)
toolkit definition: A work that is an augmentation of, or is augmented by, or is complemented by another work. (Deprecated)
toolkit label: relation d’œuvre d’accompagnement @fr
toolkit definition: Œuvre qui constitue une augmentation d’une œuvre ou qui est augmentée ou complétée par une autre œuvre. @fr
toolkit label: relaciones de obra acompañante @es
toolkit definition: Una obra que es un aumento de, o se ve aumentada por, o se complementa con la obra. @es
instruction number: 24.5
label: har ledsaget værkrelation med @da
definition: Relaterer et værk til et værk der er en berigelse af, eller er beriget af, eller er komplementeret af et værk. @da
scope note: Ledsagende værker inkluderer supplerende konkordanser, indekser, kataloger, lærervejledning, musik til en film, etc. @da
toolkit label: ledsaget værkrelation @da
toolkit definition: Værk der er en berigelse af, eller er beriget af, eller er komplementeret af et værk. @da
definition: Met une œuvre en relation avec une œuvre qui constitue une augmentation d’une œuvre ou qui est augmentée ou complétée par une autre œuvre. @fr
label: có mối quan hệ tác phẩm kèm theo với @vi
definition: Liên kết tác phẩm với tác phẩm là gia tăng của, hoặc được gia tăng bởi, hoặc được bổ sung bởi tác phẩm khác. @vi
scope note: Tài liệu kèm theo bao gồm cả phụ lục, sách dẫn, chỉ mục, mục lục, chỉ dẫn giáo viên, âm nhạc cho phim điện ảnh, v.v... @vi
toolkit label: mối quan hệ tác phẩm kèm theo @vi
toolkit definition: Tác phẩm là gia tăng của, hoặc được gia tăng bởi, hoặc được bổ sung bởi tác phẩm khác. @vi
label: hat begleitende Beziehung auf Werkebene @de
definition: Setzt ein Werk mit einem Werk, das eine Erweiterung eines anderen Werks ist oder durch ein anderes Werk erweitert wurde oder von einem anderen Werk vervollständigt wurde, in Beziehung. @de
scope note: Zu begleitenden Werken gehören Beilagen, Konkordanzen, Indices, Kataloge, Lehrerhandbücher, Filmmusik usw. @de
toolkit label: Begleitende Beziehung auf Werkebene @de
toolkit definition: Ein Werk, das eine Erweiterung eines anderen Werks ist oder durch ein anderes Werk erweitert wurde oder von einem anderen Werk vervollständigt wurde. @de
label: a pour relation d’œuvre d’accompagnement @fr
label: teoksen täydennyssuhde @fi
definition: Liittää teoksen teokseen, joka on täydennys- tai lisäosa toiseen teokseen tai jota toinen teos täydentää. @fi
toolkit label: teoksen täydennyssuhde @fi
toolkit definition: Teos, joka on täydennys- tai lisäosa toiseen teokseen tai jota toinen teos täydentää. Täydentäviä teoksia ovat suplementit, konkordanssit, hakemistot, luettelot, opettajan oppaat, elokuvan musiikki tms. @fi
toolkit label: ledsagende verk: relasjonstype @no
toolkit definition: Et verk som er en utvidelse av, eller som utvides av, eller som utfylles av, et annet verk. @no
label: té com a relació d’obra d’acompanyament @ca
definition: Relaciona una obra amb una obra que és una augmentació o és augmentada o és complementada per una altra obra. @ca
scope note: Les obres d’acompanyament inclouen suplements, concordances, índexs, catàlegs, guies del professor, música per a pel·lícules cinematogràfiques, etc. @ca
toolkit label: relació d’obra d’acompanyament @ca
toolkit definition: Obra que és una augmentació o és augmentada o és complementada per una altra obra. @ca
scope note: Les œuvres d’accompagnement comprennent les suppléments, les concordances, les index, les catalogues, les guides de l’enseignant, la musique de film, etc. @fr
has element type: 2
label: έχει συνοδευτική σχέση έργου με @el
definition: Συνδέει ένα έργο με ένα έργο το οποίο συνιστά αύξηση ή είναι επαυξημένο από ή συμπληρώνεται από ένα άλλο έργο. @el
scope note: Τα συνοδευτικά έργα περιλαμβάνουν συμπληρώματα, συμφραστικούς πίνακες λέξεων, ευρετήρια, καταλόγους, οδηγούς για δασκάλους, μουσική για κινηματογραφική ταινία κ.λπ. @el
toolkit label: συνοδευτική σχέση έργου με @el
toolkit definition: Ένα έργο το οποίο συνιστά αύξηση ή είναι επαυξημένο από ή συμπληρώνεται από ένα άλλο έργο. @el
has subproperty: P10228

has addressee agent
status: Published
definition: Relates a work to an agent to whom a work or a portion of a work is addressed.
type: Property
domain: C10001
sub property of: has related agent of work
lexical alias: addresseeAgent.en
toolkit label: addressee agent
toolkit definition: An agent to whom a work or a portion of a work is addressed.
toolkit label: agent destinataire @fr
toolkit definition: Agent à qui une œuvre ou une portion d’œuvre est adressée. @fr
toolkit label: destinatario @es
toolkit definition: Una persona, familia o entidad corporativa a quien va dirigida una obra o parte de ella @es
instruction number: 18.5
label: har agent, som er adressat @da
definition: Relaterer et værk til en agent, som et værk eller en del af et værk er adresseret til. @da
toolkit label: agent, som er adressat @da
toolkit definition: Agent, som et værk eller en del af et værk er adresseret til. @da
definition: Met une œuvre en relation avec un agent à qui une œuvre ou une portion d’œuvre est adressée. @fr
label: có người nhận @vi
definition: Liên kết tác phẩm với tác nhân mà tác phẩm hoặc phầm của tác phẩm được gửi tới. @vi
toolkit label: người nhận @vi
toolkit definition: Tác nhân mà tác phẩm hoặc phầm của tác phẩm được gửi tới. @vi
label: hat Adressatin/Adressaten (Akteur) @de
definition: Setzt ein Werk in Beziehung zu einem Akteur, an den ein Werk oder ein Teil eines Werks adressiert ist. @de
toolkit label: Adressatin/Adressat (Akteur) @de
toolkit definition: Ein Akteur, an den ein Werk oder ein Teil eines Werks adressiert ist. @de
label: a pour agent destinataire @fr
definition: Liittää teoksen toimijaan, jolle teos tai teoksen osa on osoitettu. @fi
toolkit label: vastaanottaja (toimija) @fi
toolkit definition: Toimija, jolle teos tai teoksen osa on osoitettu. @fi
toolkit label: adressat (agent) @no
toolkit definition: En agent som et verk eller en del av et verk er adressert til. @no
label: té com a agent destinatari @ca
definition: Relaciona una obra amb un agent a qui s’adreça una obra o una part d’una obra. @ca
toolkit label: agent destinatari @ca
toolkit definition: Agent a qui s’adreça una obra o una part d’una obra. @ca
has element type: 2
label: έχει αλληλογράφο @el
definition: Συνδέει ένα έργο με έναν φορέα, στον οποίο ένα έργο ή μέρος ενός έργου απευθύνεται. @el
toolkit label: αλληλογράφος @el
toolkit definition: Ένας φορέας, στον οποίο ένα έργο ή μέρος ενός έργου απευθύνεται. @el
label: címzett ágense a következő: @hu
definition: Hozzákapcsol egy művet egy ágenshez, amelynek egy mű vagy egy mű egy részét címezték. @hu
toolkit label: címzett ágens: @hu
toolkit definition: Egy ágens, amelynek egy mű vagy egy mű egy részét címezték. @hu
alternative label: addressee
alternative label: vastaanottaja @fi
label: vastaanottaja (toimija) @fi
label: har adressat (agent) @no
definition: Relaterer et verk til en agent som et verk eller en del av et verk er adressert til. @no
alternative label: adressat @no
label: heeft geadresseerde actor @nl
definition: Relateert een werk aan een actor aan wie een werk of een deel van een werk is gericht. @nl
toolkit label: geadresseerde actor @nl
toolkit definition: Een actor aan wie een werk of een deel van een werk is gericht. @nl
label: له وكيل مرسل إليه @ar
definition: يربط بين عمل ووكيل موجه إليه عمل أو جزء من عمل. @ar
alternative label: مرسل إليه @ar
toolkit label: وكيل مرسل إليه @ar
toolkit definition: وكيل أرسل إليه عمل أو جزء من عمل. @ar
alternative label: destinatari @ca
label: adressaat (tegija) @et
definition: Seostab teose tegijaga, kellele teos või teose osa on adresseeritud. @et
alternative label: adressaat @et
toolkit label: adressaat (tegija) @et
toolkit definition: Tegija, kellele teos või teose osa on adresseeritud. @et
alternative label: címzett: @hu
label: ha come destinatario agente @it
definition: Correla un'opera a un agente a cui è indirizzata un'opera o una sua parte. @it
alternative label: destinatario @it
toolkit label: destinatario agente @it
toolkit definition: Agente a cui è indirizzata un'opera o una sua parte. @it
alternative label: destinataire @fr
label: adresāts (aģents) @lv
definition: Sasaista darbu ar aģentu, kam ir adresēts darbs vai darba daļa. @lv
toolkit label: adresāts (aģents) @lv
toolkit definition: Aģents, kam ir adresēts darbs vai darba daļa. @lv
alternative label: Adressat @de
alternative label: 接受者 @zh-hans
toolkit label: 接受者行为者 @zh-hans

has addressee collective agent
status: Published
lexical alias: addresseeCollectiveAgent.en
definition: Relates a work to a collective agent to whom a work or a portion of a work is addressed.
toolkit label: addressee collective agent
toolkit definition: A collective agent to whom a work or a portion of a work is addressed.
type: Property
domain: C10001
has element type: 2
sub property of: has related collective agent of work
sub property of: has addressee agent
label: vastaanottaja (yhteistoimija) @fi
definition: Liittää teoksen yhteistoimijaan, jolle teos tai teoksen osa on osoitettu. @fi
toolkit label: vastaanottaja (yhteistoimija) @fi
toolkit definition: Yhteistoimija, jolle teos tai teoksen osa on osoitettu. @fi
label: har adressat (kollektiv agent) @no
definition: Relaterer et verk til en kollektiv agent som et verk eller en del av et verk er adressert til. @no
toolkit label: adressat (kollektiv agent) @no
toolkit definition: En kollektiv agent som et verk eller en del av et verk er adressert til. @no
label: heeft geadresseerde collectieve actor @nl
definition: Relateert een werk aan een collectieve actor aan wie een werk of een deel van een werk is gericht. @nl
toolkit label: geadresseerde collectieve actor @nl
toolkit definition: Een collectieve actor aan wie een werk of een deel van een werk is gericht. @nl
label: له وكيل جماعي مرسل إليه @ar
definition: يربط بين عمل ووكيل جماعي مرسل إليه عمل أو جزء من عمل. @ar
toolkit label: وكيل جماعي مرسل إليه @ar
toolkit definition: وكيل جماعي مرسل إليه عمل أو جزء من عمل. @ar
label: té com a agent col·lectiu destinatari @ca
definition: Relaciona una obra amb un agent col·lectiu a qui s’adreça una obra o una part d’una obra. @ca
toolkit label: agent col·lectiu destinatari @ca
toolkit definition: Agent col·lectiu a qui s’adreça una obra o una part d’una obra. @ca
label: har kollektiv agent, som er adressat @da
definition: Relaterer et værk til en kollektiv agent, som et værk eller en del af et værk er adresseret til. @da
toolkit label: kollektiv agent, som er adressat @da
toolkit definition: Kollektiv agent, som et værk eller en del af et værk er adresseret til. @da
label: adressaat (kollektiiv) @et
definition: Seostab teose kollektiiviga, kellele teos või teose osa on adresseeritud. @et
toolkit label: adressaat (kollektiiv) @et
toolkit definition: Kollektiiv, kellele teos või teose osa on adresseeritud. @et
label: hat Adressatin/Adressaten (Gemeinschaftlicher Akteur) @de
definition: Setzt ein Werk in Beziehung zu einem gemeinschaftlichen Akteur, an den ein Werk oder ein Teil eines Werks adressiert ist. @de
toolkit label: Adressatin/Adressat (Gemeinschaftlicher Akteur) @de
toolkit definition: Ein gemeinschaftlicher Akteur, an den ein Werk oder ein Teil eines Werks adressiert ist. @de
label: címzett kollektív ágense a következő: @hu
definition: Hozzákapcsol egy művet egy kollektív ágenshez, amelynek egy művet vagy egy mű egy részét címezték. @hu
toolkit label: címzett kollektív ágense: @hu
toolkit definition: Egy kollektív ágens, amelynek egy művet vagy egy mű egy részét címezték. @hu
label: ha come destinatario agente collettivo @it
definition: Correla un'opera a un agente collettivo al quale un'opera o parte di opera è destinata. @it
toolkit label: destinatario agente collettivo @it
toolkit definition: Agente collettivo al quale un'opera o parte di opera è destinata. @it
label: a pour agent collectif destinataire @fr
definition: Met une œuvre en relation avec un agent collectif à qui une œuvre ou une portion d’œuvre est adressée. @fr
toolkit label: agent collectif destinataire @fr
toolkit definition: Agent collectif à qui une œuvre ou une portion d’œuvre est adressée. @fr
label: adresāts (grupa) @lv
definition: Sasaista darbu ar grupu, kam adresēts darbs vai darba daļa. @lv
toolkit label: adresāts (grupa) @lv
toolkit definition: Grupa, kam adresēts darbs vai darba daļa. @lv
label: 有接受者集体行为者 @zh-hans
definition: 将一种作品与一种作品或作品的一部分要被其接受的一个集体行为者关联起来。 @zh-hans
toolkit label: 接受者集体行为者 @zh-hans
toolkit definition: 一种作品或作品的一部分要被其接受的一个集体行为者 @zh-hans
has subproperty: has addressee corporate body
has subproperty: has addressee family
has subproperty: P10460
label: muhatap kolektif temsilcisi ile ilişkilidir @tr
definition: Bir eseri, bir eserin veya bir eserib bir kısmının ele alındığı kolektif bir temsilci ile ilişkilendirir. @tr
toolkit label: Muhatap kolektif temsilci @tr
toolkit definition: Bir eserin veya bir eserin bir kısmının ele alındığı kolektif bir temsilci. @tr

has addressee corporate body
status: Published
lexical alias: addresseeCorporateBody.en
definition: Relates a work to a corporate body to whom a work or a portion of a work is addressed.
toolkit label: addressee corporate body
toolkit definition: A corporate body to whom a work or a portion of a work is addressed.
type: Property
domain: C10001
has element type: 2
sub property of: has related corporate body of work
sub property of: has addressee collective agent
label: vastaanottaja (yhteisö) @fi
definition: Liittää teoksen yhteisöön, jolle teos tai teoksen osa on osoitettu. @fi
toolkit label: vastaanottaja (yhteisö) @fi
toolkit definition: Yhteisö, jolle teos tai teoksen osa on osoitettu. @fi
label: har adressat (korporasjon) @no
definition: Relaterer et verk til en korporasjon som et verk eller en del av et verk er adressert til. @no
toolkit label: adressat (korporasjon) @no
toolkit definition: En korporasjon som et verk eller en del av et verk er adressert til. @no
label: heeft geadresseerde corporatie @nl
definition: Relateert een werk aan een corporatie aan wie een werk of een deel van een werk is gericht. @nl
toolkit label: geadresseerde corporatie @nl
toolkit definition: Een corporatie aan wie een werk of een deel van een werk is gericht. @nl
label: له هيئة مرسل إليها @ar
definition: يربط بين عمل وهيئة يرسل إليها عمل أو جزء من عمل. @ar
toolkit label: هيئة مرسل إليها @ar
toolkit definition: هيئة يرسل إليها عمل أو جزء من عمل. @ar
label: té com a entitat corporativa destinatària @ca
definition: Relaciona una obra amb una entitat corporativa a qui s’adreça una obra o una part d’una obra. @ca
toolkit label: entitat corporativa destinatària @ca
toolkit definition: Entitat corporativa a qui s’adreça una obra o una part d’una obra. @ca
label: har korporation, som er adressat @da
definition: Relaterer et værk til en korporation, som et værk eller en del af et værk er adresseret til. @da
toolkit label: korporation, som er adressat @da
toolkit definition: Korporation, som et værk eller en del af et værk er adresseret til. @da
label: adressaat (asutus) @et
definition: Seostab teose asutusega, kellele teos või teose osa on adresseeritud. @et
toolkit label: adressaat (asutus) @et
toolkit definition: Asutus, kellele teos või teose osa on adresseeritud. @et
label: hat Adressatin/Adressaten (Körperschaft) @de
definition: Setzt ein Werk in Beziehung zu einer Körperschaft, an die ein Werk oder ein Teil eines Werks adressiert ist. @de
toolkit label: Adressatin/Adressat (Körperschaft) @de
toolkit definition: Eine Körperschaft, an die ein Werk oder ein Teil eines Werks adressiert ist. @de
label: címzett testülete a következő: @hu
definition: Hozzákapcsol egy művet egy testülethez, amelynek egy művet vagy egy mű egy részét címezték. @hu
toolkit label: címzett testület: @hu
toolkit definition: Egy testület, amelynek egy művet vagy egy mű egy részét címezték. @hu
label: ha come destinatario ente @it
definition: Correla un'opera a un ente al quale un'opera o parte di un'opera è indirizzata. @it
toolkit label: destinatario ente @it
toolkit definition: Ente al quale un'opera o parte di un'opera è indirizzata. @it
label: a pour collectivité destinataire @fr
definition: Met une œuvre en relation avec une collectivité à qui une œuvre ou une portion d’œuvre est adressée. @fr
toolkit label: collectivité destinataire @fr
toolkit definition: Collectivité à qui une œuvre ou une portion d’œuvre est adressée. @fr
label: adresāts (institūcija) @lv
definition: Sasaista darbu ar institūciju, kam adresēts darbs vai darba daļa. @lv
toolkit label: adresāts (institūcija) @lv
toolkit definition: Institūcija, kam adresēts darbs vai darba daļa. @lv
label: 有接受者团体 @zh-hans
definition: 将一种作品与一种作品或作品的一部分要被其接受的一个团体关联起来。 @zh-hans
toolkit label: 接受者团体 @zh-hans
toolkit definition: 一种作品或作品的一部分要被其接受的一个团体 @zh-hans
has subproperty: P10507
label: muhatap tüzel kişisi ile ilişkilidir @tr
definition: Bir eseri, bir eserin veya eserin bir kısmının muhatap olduğu tüzel kişi ile ilişkilendirir. @tr
toolkit label: muhatap tüzel kişi @tr
toolkit definition: Bir eserin veya bir eserin bir kısmının muhatap olduğu tüzel kişilik. @tr

has addressee family
status: Published
lexical alias: addresseeFamily.en
definition: Relates a work to a family to whom a work or a portion of a work is addressed.
toolkit label: addressee family
toolkit definition: A family to whom a work or a portion of a work is addressed.
type: Property
domain: C10001
has element type: 2
sub property of: has related family of work
sub property of: has addressee collective agent
label: vastaanottaja (suku) @fi
definition: Liittää teoksen sukuun, jolle teos tai teoksen osa on osoitettu. @fi
toolkit label: vastaanottaja (suku) @fi
toolkit definition: Suku, jolle teos tai teoksen osa on osoitettu. @fi
label: har adressat (familie) @no
definition: Relaterer et verk til en familie som et verk eller en del av et verk er adressert til. @no
toolkit label: adressat (familie) @no
toolkit definition: En familie som et verk eller en del av et verk er adressert til. @no
label: heeft geadresseerde familie @nl
definition: Relateert een werk aan een familie aan wie een werk of een deel van een werk is gericht. @nl
toolkit label: geadresseerde familie @nl
toolkit definition: Een familie aan wie een werk of een deel van een werk is gericht. @nl
label: له عائلة مرسل إليها @ar
definition: يربط بين عمل وعائلة يرسل إليها عمل أو جزء من عمل. @ar
toolkit label: عائلة مرسل إليها @ar
toolkit definition: عائلة يرسل إليها عمل أو جزء من عمل. @ar
label: té com a família destinatària @ca
definition: Relaciona una obra amb una família a qui s’adreça una obra o una part d’una obra. @ca
toolkit label: família destinatària @ca
toolkit definition: Família a qui s’adreça una obra o una part d’una obra. @ca
label: har familie, som er adressat @da
definition: Relaterer et værk til en familie, som et værk eller en del af et værk er adresseret til. @da
toolkit label: familie, som er adressat @da
toolkit definition: Familie, som et værk eller en del af et værk er adresseret til. @da
label: adressaat (perekond) @et
definition: Seostab teose perekonnaga, kellele teos või teose osa on adresseeritud. @et
toolkit label: adressaat (perekond) @et
toolkit definition: Perekond, kellele teos või teose osa on adresseeritud. @et
label: hat Adressatin/Adressaten (Familie) @de
definition: Setzt ein Werk in Beziehung zu einer Familie, an die ein Werk oder ein Teil eines Werks adressiert ist. @de
toolkit label: Adressatin/Adressat (Familie) @de
toolkit definition: Eine Familie, an die ein Werk oder ein Teil eines Werks adressiert ist. @de
label: címzett családja a következő: @hu
definition: Hozzákapcsol egy művet egy családhoz, amelynek egy művet vagy egy mű egy részét címezték. @hu
toolkit label: címzett család: @hu
toolkit definition: Egy család, amelynek egy művet vagy egy mű egy részét címezték. @hu
label: ha come destinatario famiglia @it
definition: Correla un'opera a una famiglia alla quale un'opera o parte di un'opera è indirizzata. @it
toolkit label: destinatario famiglia @it
toolkit definition: Famiglia alla quale un'opera o parte di un'opera è indirizzata. @it
label: a pour famille destinataire @fr
definition: Met une œuvre en relation avec une famille à qui une œuvre ou une portion d’œuvre est adressée. @fr
toolkit label: famille destinataire @fr
toolkit definition: Famille à qui une œuvre ou une portion d’œuvre est adressée. @fr
label: adresāts (dzimta/ģimene) @lv
definition: Sasaista darbu ar dzimtu/ģimeni, kam adresēts darbs vai darba daļa. @lv
toolkit label: adresāts (dzimta/ģimene) @lv
toolkit definition: Dzimta/ģimene, kam adresēts darbs vai darba daļa. @lv
label: 有接受者家族 @zh-hans
definition: 将一种作品与一种作品或作品的一部分要被其接受的一个家族关联起来。 @zh-hans
toolkit label: 接受者家族 @zh-hans
toolkit definition: 一种作品或作品的一部分要被其接受的一个家族 @zh-hans
has subproperty: P10554
label: muhatap ailesi ile ilişkilidir @tr
definition: Bir eseri, bir eserin veya eserin bir bölümünün muhatap olduğu bir aileyle ilişkilendirir. @tr
toolkit label: muhatap aile @tr
toolkit definition: Bir eserin veya eserin bir kısmının muhatap olduğu aile. @tr

has addressee person
status: Published
lexical alias: addresseePerson.en
definition: Relates a work to a person to whom a work or a portion of a work is addressed.
toolkit label: addressee person
toolkit definition: A person to whom a work or a portion of a work is addressed.
type: Property
domain: C10001
has element type: 2
sub property of: has related person of work
sub property of: has addressee agent
label: vastaanottaja (henkilö) @fi
definition: Liittää teoksen henkilöön, jolle teos tai teoksen osa on osoitettu. @fi
toolkit label: vastaanottaja (henkilö) @fi
toolkit definition: Henkilö, jolle teos tai teoksen osa on osoitettu. @fi
label: har adressat (person) @no
definition: Relaterer et verk til en person som et verk eller en del av et verk er adressert til. @no
toolkit label: adressat (person) @no
toolkit definition: En person som et verk eller en del av et verk er adressert til. @no
label: heeft geadresseerde persoon @nl
definition: Relateert een werk aan een persoon aan wie een werk of een deel van een werk is gericht. @nl
toolkit label: geadresseerde persoon @nl
toolkit definition: Een persoon aan wie een werk of een deel van een werk is gericht. @nl
label: له شخص مرسل إليه @ar
definition: يربط بين عمل وشخص يوجه إليه عمل أو جزء منه. @ar
toolkit label: شخص مرسل إليه @ar
toolkit definition: شخص يوجه إليه عمل أو جزء منه. @ar
label: té com a persona destinatària @ca
definition: Relaciona una obra amb una persona a qui s’adreça una obra o part d’una obra. @ca
toolkit label: persona destinatària @ca
toolkit definition: Persona a qui s’adreça una obra o part d’una obra. @ca
label: har person, som er adressat @da
definition: Relaterer et værk til en person, som et værk eller en del af et værk er adresseret til. @da
toolkit label: person, som er adressat @da
toolkit definition: Person, som et værk eller en del af et værk er adresseret til. @da
label: adressaat (isik) @et
definition: Seostab teose isikuga, kellele teos või teose osa on adresseeritud. @et
toolkit label: adressaat (isik) @et
toolkit definition: Isik, kellele teos või teose osa on adresseeritud. @et
label: hat Adressatin/Adressaten (Person) @de
definition: Setzt ein Werk in Beziehung zu einer Person, an die ein Werk oder ein Teil eines Werks adressiert ist. @de
toolkit label: Adressatin/Adressat (Person) @de
toolkit definition: Eine Person, an die ein Werk oder einen Teil eines Werks adressiert ist. @de
label: címzett személye a következő: @hu
definition: Hozzákapcsol egy művet egy személyhez, akinek egy művet vagy egy mű egy részét címeztek. @hu
toolkit label: címzett személy: @hu
toolkit definition: Egy személy, akinek egy művet vagy egy mű egy részét címeztek. @hu
label: ha come destinatario persona @it
definition: Correla un'opera a una persona alla quale un'opera o parte di un'opera è indirizzata. @it
toolkit label: destinatario persona @it
toolkit definition: Persona alla quale un'opera o parte di un'opera è indirizzata. @it
label: a pour personne destinataire @fr
definition: Met une œuvre en relation avec une personne à qui une œuvre ou une portion d’œuvre est adressée. @fr
toolkit label: personne destinataire @fr
toolkit definition: Personne à qui une œuvre ou une portion d’œuvre est adressée. @fr
label: adresāts (persona) @lv
definition: Sasaista darbu ar personu, kurai adresēts darbs vai darba daļa. @lv
toolkit label: adresāts (persona) @lv
toolkit definition: Persona, kurai adresēts darbs vai darba daļa. @lv
label: 有接受者个人 @zh-hans
definition: 将一种作品与一种作品或作品的一部分要被其接受的一个个人关联起来。 @zh-hans
toolkit label: 接受者个人 @zh-hans
toolkit definition: 一种作品或作品的一部分要被其接受的一个个人 @zh-hans
has subproperty: P10413
label: muhatap kişi ile ilişkilidir @tr
definition: Bir eseri, bir eserin veya eserin bir kısmının muhatap olduğu kişi ile ilişkilendirir. @tr
toolkit label: Muhatap kişi @tr
toolkit definition: Bir eser ya da bir eserin bölümünün kendisine hitaben yazıldığı kişi @tr

has granting institution or faculty (Deprecated)
status: Deprecated
definition: Relates a work to a corporate body that is an institution or faculty conferring an academic degree on a candidate.(Deprecated)
type: Property
domain: C10001
lexical alias: grantingInstitutionOrFaculty.en
instruction number: 7.9.3
toolkit label: granting institution or faculty (Deprecated)
toolkit definition: A corporate body that is an institution or faculty conferring an academic degree on a candidate. (Deprecated)
toolkit label: institution ou faculté conférant un diplôme universitaire @fr
toolkit definition: Institution ou faculté qui confère un diplôme universitaire à un candidat. @fr
toolkit label: institución o facultad otorgante @es
toolkit definition: Una institución o facultad que confiere un grado académico a un candidato. @es
label: har tildelende institution eller fakultet @da
definition: Relaterer et værk til en institution eller et fakultet, der tildeler en kandidat en akademisk grad. @da
toolkit label: tildelende institution eller fakultet @da
toolkit definition: Institution eller fakultet, der tildeler en kandidat en akademisk grad. @da
definition: Met une œuvre en relation avec une institution ou une faculté qui confère un diplôme universitaire à un candidat. @fr
label: có học viện hoặc khoa chấp nhận @vi
definition: Liên kết tác phẩm với học viện hoặc khoa trao văn bằng học thuật cho ứng viên. @vi
toolkit label: học viện hoặc khoa chấp nhận @vi
toolkit definition: Học viện hoặc khoa trao văn bằng học thuật cho ứng viên. @vi
label: hat verleihende Institution oder Fakultät @de
definition: Setzt ein Werk mit einer Institution oder Fakultät, die einem Kandidaten einen akademischen Grad verleiht, in Beziehung. @de
toolkit label: Verleihende Institution oder Fakultät @de
toolkit definition: Eine Institution oder Fakultät, die einem Kandidaten einen akademischen Grad verleiht. @de
label: a pour institution ou faculté conférant un diplôme universitaire @fr
label: oppiarvon myöntävä laitos tai tiedekunta @fi
definition: Liittää teoksen laitokseen tai tiedekuntaan, joka myöntää akateemisen oppiarvon. @fi
toolkit label: oppiarvon myöntävä laitos tai tiedekunta @fi
toolkit definition: Laitos tai tiedekunta, joka myöntää akateemisen oppiarvon. @fi
toolkit label: tildelende institusjon eller fakultet @no
toolkit definition: En institusjon eller et fakultet som tildeler en akademisk grad til en kandidat. @no
label: té com a institució o facultat que concedeix un títol acadèmic @ca
definition: Relaciona una obra amb una institució o facultat que concedeix un títol acadèmic a un candidat. @ca
toolkit label: institució o facultat que concedeix un títol acadèmic @ca
toolkit definition: Institució o facultat que concedeix un títol acadèmic a un candidat. @ca
sub property of: has related agent of work
has element type: 2
label: έχει ίδρυμα χορήγησης ή διδακτικό προσωπικό @el
definition: Συνδέει ένα έργο με ένα ίδρυμα ή διδακτικό προσωπικό που απονέμει ένα ανώτερου εκπαιδευτικού επιπέδου πτυχίο σε έναν υποψήφιο. @el
toolkit label: ίδρυμα χορήγησης ή διδακτικό προσωπικό @el
toolkit definition: Ένα ίδρυμα ή διδακτικό προσωπικό που απονέμει ένα ανώτερου εκπαιδευτικού επιπέδου πτυχίο σε έναν υποψήφιο. @el
label: van adományozó intézménye vagy kara @hu
definition: Egy művet hozzákapcsol egy intézményhez vagy karhoz, amely tudományos fokozatot adományoz egy jelöltnek. @hu
toolkit label: adományozó intézmény vagy kar @hu
toolkit definition: Egy intézmény vagy kar, amely tudományos fokozatot adományoz egy jelöltnek. @hu
has subproperty: P10208

has aggregator agent
status: Published
lexical alias: aggregatorAgent.en
definition: Relates a work to an agent who is responsible for creating an aggregating work by selecting and arranging expressions of other works.
toolkit label: aggregator agent
toolkit definition: An agent who is responsible for creating an aggregating work by selecting and arranging expressions of other works.
type: Property
domain: C10001
sub property of: has creator agent of work
has element type: 2
alternative label: aggregator
label: aggregaattori (toimija) @fi
definition: Liittää teoksen toimijaan, joka on vastuussa aggregoivan teoksen luomisesta valitsemalla ja järjestämällä muiden teosten ekspressioita. @fi
alternative label: aggregaattori @fi
toolkit label: aggregaattori (toimija) @fi
toolkit definition: Toimija, joka on vastuussa aggregoivan teoksen luomisesta valitsemalla ja järjestämällä muiden teosten ekspressioita. @fi
label: har aggregator (agent) @no
definition: Relaterer et verk til en agent som er ansvarlig for å skape et aggregerende verk ved å velge ut og arrangere uttrykk av andre verk. @no
toolkit label: aggregator (agent) @no
toolkit definition: En agent som er ansvarlig for å skape et aggregerende verk ved å velge ut og arrangere uttrykk av andre verk. @no
label: heeft aggregator-actor @nl
definition: Relateert een werk aan een actor die verantwoordelijk is voor het creëren van een aggregaatwerk door middel van selectie en arrangeren van expressies van andere werken. @nl
toolkit label: aggregator-actor @nl
toolkit definition: Een actor die verantwoordelijk is voor het creëren van een aggregaatwerk door middel van selectie en arrangeren van expressies van andere werken. @nl
label: له وكيل مجمع @ar
definition: يربط بين عمل ووكيل مسئول عن إنشاء عمل مجمع عن طريق اختيار تعبيرات أعمال أخرى وترتيبها. @ar
alternative label: مجمع @ar
toolkit label: وكيل مجمع @ar
toolkit definition: وكيل مسئول عن إنشاء عمل مجمع عن طريق اختيار تعبيرات أعمال أخرى وترتيبها. @ar
label: té com a agent agregador @ca
definition: Relaciona una obra amb un agent que és responsable de la creació d’una obra agregadora mitjançant la selecció i l’arranjament d’expressions d’altres obres. @ca
alternative label: agregador @ca
toolkit label: agent agregador @ca
toolkit definition: Agent que és responsable de la creació d’una obra agregadora mitjançant la selecció i l’arranjament d’expressions d’altres obres. @ca
label: har agent, som er samler @da
definition: Relaterer et værk til en agent, som er ansvarlig for at skabe et aggregerende værk ved at udvælge og arrangere udtryk af andre værk. @da
toolkit label: agent, som er samler @da
toolkit definition: Agent, som er ansvarlig for at skabe et aggregerende værk ved at udvælge og arrangere udtryk af andre værk. @da
label: liitja (tegija) @et
definition: Seostab teose tegijaga, kes vastutab liitva teose loomise eest, valides ja korrastades teiste teoste väljendused. @et
alternative label: liitja @et
toolkit label: liitja (tegija) @et
toolkit definition: Tegija, kes vastutab liitva teose loomise eest, valides ja korrastades teiste teoste väljendused. @et
label: hat Aggregatorin/Aggregator (Akteur) @de
definition: Setzt ein Werk in Beziehung zu einem Akteur, der für die Erstellung eines aggregierenden Werks verantwortlich ist, indem er Expressionen von anderen Werken auswählt und zusammenstellt. @de
toolkit label: Aggregatorin/Aggregator (Akteur) @de
toolkit definition: Ein Akteur, der für die Erstellung eines aggregierenden Werks verantwortlich ist, indem er Expressionen von anderen Werken auswählt und zusammenstellt. @de
label: aggregátor ágense a következő: @hu
definition: Hozzákapcsol egy művet egy ágenshez, amely felelős egy aggregáló mű létrehozásáért, más művek kifejezési formáinak kiválasztása és elrendezése révén. @hu
alternative label: aggregátor: @hu
toolkit label: aggregátor ágens: @hu
toolkit definition: Egy ágens, amely felelős egy aggregáló mű létrehozásáért, más művek kifejezési formáinak kiválasztása és elrendezése révén. @hu
label: ha come aggregatore agente @it
definition: Correla un'opera all'agente responsabile della creazione di un'opera aggregata attraverso la selezione e l'organizzazione di espressioni di altre opere. @it
toolkit label: aggregatore agente @it
toolkit definition: Agente responsabile per la creazione di un'opera aggregata attraverso la selezione e l'organizzazione di espressioni di altre opere. @it
label: a pour agent agrégateur @fr
definition: Met une œuvre en relation avec un agent qui est responsable de la création d’une œuvre agrégatrice par la sélection et l’arrangement d’expressions d’autres œuvres. @fr
alternative label: agrégateur @fr
toolkit label: agent agrégateur @fr
toolkit definition: Agent qui est responsable de la création d’une œuvre agrégatrice par la sélection et l’arrangement d’expressions d’autres œuvres. @fr
label: apkopotājs (aģents) @lv
definition: Sasaista darbu ar aģentu, kas ir atbildīgs par darba-apkopojumu radīšanu, atlasot un sakārtojot citu darbu izteiksmes. @lv
toolkit label: apkopotājs (aģents) @lv
toolkit definition: Aģents, kas ir atbildīgs par darba-apkopojumu radīšanu, atlasot un sakārtojot citu darbu izteiksmes @lv
alternative label: 合集编者 @zh-hans
label: 有合集编者行为者 @zh-hans
definition: 将一种作品与负责把其他作品的内容表达选择和整理后创建一种合集性作品的一个行为者关联起来。 @zh-hans
toolkit label: 合集编者行为者 @zh-hans
toolkit definition: 负责把其他作品的内容表达选择和整理后创建一种合集性作品的一个行为者 @zh-hans
has subproperty: has aggregator collective agent
has subproperty: has aggregator person
has subproperty: has compiler agent
has subproperty: P10393
alternative label: Toplayıcı @tr
label: toplayıcı temsilci ile ilişkilidir @tr
definition: Bir eseri, diğer eserlerin anlatımlarını seçerek ve düzenleyerek toplu bir eser yapmaktan sorumlu olan bir temsilciyle ilişkilendirir. @tr
toolkit label: Toplayıcı temsilci @tr
toolkit definition: Diğer eserlerin ifadelerini seçerek ve düzenleyerek toplu çalışma oluşturmaktan sorumlu olan bir temsilci. @tr

has aggregator collective agent
status: Published
lexical alias: aggregatorCollectiveAgent.en
definition: Relates a work to a collective agent who is responsible for creating an aggregating work by selecting and arranging expressions of other works.
toolkit label: aggregator collective agent
toolkit definition: A collective agent who is responsible for creating an aggregating work by selecting and arranging expressions of other works.
type: Property
domain: C10001
has element type: 2
sub property of: has creator collective agent of work
sub property of: has aggregator agent
label: aggregaattori (yhteistoimija) @fi
definition: Liittää teoksen yhteistoimijaan, joka on vastuussa aggregoivan teoksen luomisesta valitsemalla ja järjestämällä muiden teosten ekspressioita. @fi
toolkit label: aggregaattori (yhteistoimija) @fi
toolkit definition: Yhteistoimija, joka on vastuussa aggregoivan teoksen luomisesta valitsemalla ja järjestämällä muiden teosten ekspressioita. @fi
label: har aggregator (kollektiv agent) @no
definition: Relaterer et verk til en kollektiv agent som er ansvarlig for å skape et aggregerende verk ved å velge ut og arrangere uttrykk av andre verk. @no
toolkit label: aggregator (kollektiv agent) @no
toolkit definition: En kollektiv agent som er ansvarlig for å skape et aggregerende verk ved å velge ut og arrangere uttrykk av andre verk. @no
label: heeft aggregator-collectieve actor @nl
definition: Relateert een werk aan een collectieve actor die verantwoordelijk is voor het creëren van een aggregaatwerk door middel van selectie en arrangeren van expressies van andere werken. @nl
toolkit label: aggregator-collectieve actor @nl
toolkit definition: Een collectieve actor die verantwoordelijk is voor het creëren van een aggregaatwerk door middel van selectie en arrangeren van expressies van andere werken. @nl
label: له وكيل جماعي مجمع @ar
definition: يربط بين عمل ووكيل جماعي مسئول عن إنشاء عمل مجمع عن طريق اختيار تعبيرات أعمال أخرى وترتيبها. @ar
toolkit label: وكيل جماعي مجمع @ar
toolkit definition: وكيل جماعي مسئول عن إنشاء عمل مجمع عن طريق اختيار تعبيرات أعمال أخرى وترتيبها. @ar
label: té com a agent col·lectiu agregador @ca
definition: Relaciona una obra amb un agent col·lectiu que és responsable de la creació d’una obra agregadora mitjançant la selecció i l’arranjament d’expressions d’altres obres. @ca
toolkit label: agent col·lectiu agregador @ca
toolkit definition: Agent col·lectiu que és responsable de la creació d’una obra agregadora mitjançant la selecció i l’arranjament d’expressions d’altres obres. @ca
label: har kollektiv agent, som er samler @da
definition: Relaterer et værk til en kollektiv agent, som er ansvarlig for at skabe et aggregerende værk ved at udvælge og arrangere udtryk af andre værk. @da
toolkit label: kollektiv agent, som er samler @da
toolkit definition: Kollektiv agent, som er ansvarlig for at skabe et aggregerende værk ved at udvælge og arrangere udtryk af andre værk. @da
label: liitja (kollektiiv) @et
definition: Seostab teose kollektiiviga, kes vastutab liitva teose loomise eest, valides ja korrastades teiste teoste väljendused. @et
toolkit label: liitja (kollektiiv) @et
toolkit definition: Kollektiiv, kes vastutab liitva teose loomise eest, valides ja korrastades teiste teoste väljendused. @et
label: hat Aggregatorin/Aggregator (Gemeinschaftlicher Akteur) @de
definition: Setzt ein Werk in Beziehung zu einem gemeinschaftlichen Akteur, der für die Schaffung eines aggregierenden Werks verantwortlich ist, indem er Expressionen anderer Werke auswählt und zusammenstellt. @de
toolkit label: Aggregatorin/Aggregator (Gemeinschaftlicher Akteur) @de
toolkit definition: Ein gemeinschaftlicher Akteur, der für die Schaffung eines aggregierenden Werks verantwortlich ist, indem er Expressionen anderer Werke auswählt und zusammenstellt. @de
label: aggregátor kollektív ágense a következő: @hu
definition: Hozzákapcsol egy művet egy kollektív ágenshez, amely felelős egy aggregáló mű létrehozásáért, más művek kifejezési formáinak kiválasztása és elrendezése révén. @hu
toolkit label: aggregátor kollektív ágens: @hu
toolkit definition: Egy kollektív ágens, amely felelős egy aggregáló mű létrehozásáért, más művek kifejezési formáinak kiválasztása és elrendezése révén. @hu
label: ha come aggregatore agente collettivo @it
definition: Correla un'opera all'agente collettivo responsabile della creazione di un'opera tramite la selezione e l'organizzazione di espressioni di altre opere. @it
toolkit label: aggregatore agente collettivo @it
toolkit definition: Agente collettivo responsabile della creazione di un'opera, tramite la selezione e l'organizzazione di espressioni di altre opere. @it
label: a pour agent collectif agrégateur @fr
definition: Met une œuvre en relation avec un agent collectif qui est responsable de la création d’une œuvre agrégatrice par la sélection et l’arrangement d’expressions d’autres œuvres. @fr
toolkit label: agent collectif agrégateur @fr
toolkit definition: Agent collectif qui est responsable de la création d’une œuvre agrégatrice par la sélection et l’arrangement d’expressions d’autres œuvres. @fr
label: apkopotājs (grupa) @lv
definition: Sasaista darbu ar grupu, kas ir atbildīga par darba-apkopojuma radīšanu, atlasot un sakārtojot citu darbu izteiksmes. @lv
toolkit label: apkopotājs (grupa) @lv
toolkit definition: Grupa, kas ir atbildīga par darba-apkopojuma radīšanu, atlasot un sakārtojot citu darbu izteiksmes @lv
label: 有合集编者集体行为者 @zh-hans
definition: 将一种作品与负责把其他作品的内容表达选择和整理后创建一种合集性作品的一个集体行为者关联起来。 @zh-hans
toolkit label: 合集者集体行为者 @zh-hans
toolkit definition: 负责把其他作品的内容表达选择和整理后创建一种合集性作品的一个集体行为者 @zh-hans
has subproperty: has aggregator corporate body
has subproperty: has aggregator family
has subproperty: has compiler collective agent
has subproperty: P10495
label: toplayıcı kolektif temsilci ile ilişkilidir @tr
definition: Bir eseri, diğer eserlerin anlatımlarını seçerek ve düzenleyerek toplu bir eser yapmaktan sorumlu olan kolektif bir temsilci ile ilişkilendirir. @tr
toolkit label: Toplayıcı kolektif temsilci @tr
toolkit definition: Diğer çalışmaların ifadelerini seçerek ve düzenleyerek birleştirme çalışması oluşturmaktan sorumlu kolektif bir temsilci @tr

has aggregator corporate body
status: Published
lexical alias: aggregatorCorporateBody.en
definition: Relates a work to a corporate body who is responsible for creating an aggregating work by selecting and arranging expressions of other works.
toolkit label: aggregator corporate body
toolkit definition: A corporate body who is responsible for creating an aggregating work by selecting and arranging expressions of other works.
type: Property
domain: C10001
has element type: 2
sub property of: has creator corporate body of work
sub property of: has aggregator collective agent
label: aggregaattori (yhteisö) @fi
definition: Liittää teoksen yhteisöön, joka on vastuussa aggregoivan teoksen luomisesta valitsemalla ja järjestämällä muiden teosten ekspressioita. @fi
toolkit label: aggregaattori (yhteisö) @fi
toolkit definition: Yhteisö, joka on vastuussa aggregoivan teoksen luomisesta valitsemalla ja järjestämällä muiden teosten ekspressioita. @fi
label: har aggregator (korporasjon) @no
definition: Relaterer et verk til en korporasjon som er ansvarlig for å skape et aggregerende verk ved å velge ut og arrangere uttrykk av andre verk. @no
toolkit label: aggregator (korporasjon) @no
toolkit definition: En korporasjon som er ansvarlig for å skape et aggregerende verk ved å velge ut og arrangere uttrykk av andre verk. @no
label: heeft aggregator-corporatie @nl
definition: Relateert een werk aan een corporatie die verantwoordelijk is voor het creëren van een aggregaatwerk door middel van selectie en arrangeren van expressies van andere werken. @nl
toolkit label: aggregator-corporatie @nl
toolkit definition: Een corporatie die verantwoordelijk is voor het creëren van een aggregaatwerk door middel van selectie en arrangeren van expressies van andere werken. @nl
label: له هيئة مجمعة @ar
definition: يربط بين عمل وهيئة مسئولة عن إنشاء عمل مجمع عن طريق اختيار تعبيرات أعمال الأخرى وترتيبها. @ar
toolkit label: هيئة مجمعة @ar
toolkit definition: هيئة مسئولة عن إنشاء عمل مجمع عن طريق اختيار تعبيرات أعمال أخرى وترتيبها. @ar
label: té com a entitat corporativa agregadora @ca
definition: Relaciona una obra amb una entitat corporativa que és responsable de la creació d’una obra agregadora mitjançant la selecció i l’arranjament d’expressions d’altres obres. @ca
toolkit label: entitat corporativa agregadora @ca
toolkit definition: Entitat corporativa que és responsable de la creació d’una obra agregadora mitjançant la selecció i l’arranjament d’expressions d’altres obres. @ca
label: har korporation, som er samler @da
definition: Relaterer et værk til en korporation, som er ansvarlig for at skabe et aggregerende værk ved at udvælge og arrangere udtryk af andre værk. @da
toolkit label: korporation, som er samler @da
toolkit definition: Korporation, som er ansvarlig for at skabe et aggregerende værk ved at udvælge og arrangere udtryk af andre værk. @da
label: liitja (asutus) @et
definition: Seostab teose asutusega, kes vastutab liitva teose loomise eest, valides ja korrastades teiste teoste väljendused. @et
toolkit label: liitja (asutus) @et
toolkit definition: Asutus, kes vastutab liitva teose loomise eest, valides ja korrastades teiste teoste väljendused. @et
label: hat Aggregatorin/Aggregator (Körperschaft) @de
definition: Setzt ein Werk in Beziehung zu einer Körperschaft, die für die Schaffung eines aggregierenden Werks verantwortlich ist, indem sie Expressionen anderer Werke auswählt und zusammenstellt. @de
toolkit label: Aggregatorin/Aggregator (Körperschaft) @de
toolkit definition: Eine Körperschaft, die für die Schaffung eines aggregierenden Werks verantwortlich ist, indem sie Expressionen anderer Werke auswählt und zusammenstellt. @de
label: aggregátor testülete a következő: @hu
definition: Hozzákapcsol egy művet egy testülethez, amely felelős egy aggregáló mű létrehozásáért, más művek kifejezési formáinak kiválasztása és elrendezése révén. @hu
toolkit label: aggregátor testület: @hu
toolkit definition: Egy testület, amely felelős egy aggregáló mű létrehozásáért, más művek kifejezési formáinak kiválasztása és elrendezése révén. @hu
label: ha come aggregatore ente @it
definition: Correla un'opera a un ente responsabile della creazione di un'opera tramite la selezione e l'organizzazione di espressioni di altre opere. @it
toolkit label: aggregatore ente @it
toolkit definition: Ente responsabile della creazione di un'opera tramite la selezione e l'organizzazione di espressioni di altre opere. @it
label: a pour collectivité agrégatrice @fr
definition: Met une œuvre en relation avec une collectivité qui est responsable de la création d’une œuvre agrégatrice par la sélection et l’arrangement d’expressions d’autres œuvres. @fr
toolkit label: collectivité agrégatrice @fr
toolkit definition: Collectivité qui est responsable de la création d’une œuvre agrégatrice par la sélection et l’arrangement d’expressions d’autres œuvres. @fr
label: apkopotājs (institūcija) @lv
definition: Sasaista darbu ar institūciju, kas ir atbildīga par darba-apkopojuma radīšanu, atlasot un sakārtojot citu darbu izteiksmes. @lv
toolkit label: apkopotājs (institūcija) @lv
toolkit definition: Institūcija, kas ir atbildīga par darba-apkopojuma radīšanu, atlasot un sakārtojot citu darbu izteiksmes @lv
label: 有合集编者团体 @zh-hans
definition: 将一种作品与负责把其他作品的内容表达选择和整理后创建一种合集性作品的一个团体关联起来。 @zh-hans
toolkit label: 合集编者团体 @zh-hans
toolkit definition: 负责把其他作品的内容表达选择和整理后创建一种合集性作品的一个团体 @zh-hans
has subproperty: has compiler corporate body
has subproperty: P10542
label: toplayıcı tüzel kişi ile ilişkilidir @tr
definition: Bir eseri, başka eserlerin anlatımlarını seçerek ve düzenleyerek toplama bir eser oluşturmaktan sorumlu olan tüzel kişi ile ilişkilendirir. @tr
toolkit label: Toplayıcı tüzel kişi @tr
toolkit definition: Diğer işlerin anlatımlarını seçip düzenleyerek toplu bir eser meydana getirmekle yükümlü olan tüzel kişi. @tr

has aggregator family
status: Published
lexical alias: aggregatorFamily.en
definition: Relates a work to a family who is responsible for creating an aggregating work by selecting and arranging expressions of other works.
toolkit label: aggregator family
toolkit definition: A family who is responsible for creating an aggregating work by selecting and arranging expressions of other works.
type: Property
domain: C10001
has element type: 2
sub property of: has creator family of work
sub property of: has aggregator collective agent
label: aggregaattori (suku) @fi
definition: Liittää teoksen sukuun, joka on vastuussa aggregoivan teoksen luomisesta valitsemalla ja järjestämällä muiden teosten ekspressioita. @fi
toolkit label: aggregaattori (suku) @fi
toolkit definition: Suku, joka on vastuussa aggregoivan teoksen luomisesta valitsemalla ja järjestämällä muiden teosten ekspressioita. @fi
label: har aggregator (familie) @no
definition: Relaterer et verk til en familie som er ansvarlig for å skape et aggregerende verk ved å velge ut og arrangere uttrykk av andre verk. @no
toolkit label: aggregator (familie) @no
toolkit definition: En familie som er ansvarlig for å skape et aggregerende verk ved å velge ut og arrangere uttrykk av andre verk. @no
label: heeft aggregator-familie @nl
definition: Relateert een werk aan een familie die verantwoordelijk is voor het creëren van een aggregaatwerk door middel van selectie en arrangeren van expressies van andere werken. @nl
toolkit label: aggregator-familie @nl
toolkit definition: Een familie die verantwoordelijk is voor het creëren van een aggregaatwerk door middel van selectie en arrangeren van expressies van andere werken. @nl
label: له عائلة مجمعة @ar
definition: يربط بين عمل وعائلة مسئولة عن إنشاء عمل مجمع عن طريق اختيار تعبيرات أعمال أخرى وترتيبها. @ar
toolkit label: عائلة مجمعة @ar
toolkit definition: عائلة مسؤولة عن إنشاء عمل مجمع عن طريق اختيار تعبيرات أعمال أخرى وترتيبها. @ar
label: té com a família agregadora @ca
definition: Relaciona una obra amb una família que és responsable de la creació d’una obra agregadora mitjançant la selecció i l’arranjament d’expressions d’altres obres. @ca
toolkit label: família agregadora @ca
toolkit definition: Família que és responsable de la creació d’una obra agregadora mitjançant la selecció i l’arranjament d’expressions d’altres obres. @ca
label: har familie, som er samler @da
definition: Relaterer et værk til en familie, som er ansvarlig for at skabe et aggregerende værk ved at udvælge og arrangere udtryk af andre værk. @da
toolkit label: familie, som er samler @da
toolkit definition: Familie, som er ansvarlig for at skabe et aggregerende værk ved at udvælge og arrangere udtryk af andre værk. @da
label: liitja (perekond) @et
definition: Seostab teose perekonnaga, kes vastutab liitva teose loomise eest, valides ja korrastades teiste teoste väljendused. @et
toolkit label: liitja (perekond) @et
toolkit definition: Perekond, kes vastutab liitva teose loomise eest, valides ja korrastades teiste teoste väljendused. @et
label: hat Aggregatorin/Aggregator (Familie) @de
definition: Setzt ein Werk in Beziehung zu einer Familie, die für die Schaffung eines aggregierenden Werks verantwortlich ist, indem sie Expressionen anderer Werke auswählt und zusammenstellt. @de
toolkit label: Aggregatorin/Aggregator (Familie) @de
toolkit definition: Eine Familie, die für die Schaffung eines aggregierenden Werks verantwortlich ist, indem sie Expressionen anderer Werke auswählt und zusammenstellt. @de
label: aggregátor családja a következő: @hu
definition: Hozzákapcsol egy művet egy családhoz, amely felelős egy aggregáló mű létrehozásáért, más művek kifejezési formáinak kiválasztása és elrendezése révén. @hu
toolkit label: aggregátor család: @hu
toolkit definition: Egy család, amely felelős egy aggregáló mű létrehozásáért, más művek kifejezési formáinak kiválasztása és elrendezése révén. @hu
label: ha come aggregatore famiglia @it
definition: Correla un'opera alla famiglia responsabile della creazione di un'opera tramite la selezione e l'organizzazione di espressioni di altre opere. @it
toolkit label: aggregatore famiglia @it
toolkit definition: Famiglia responsabile della creazione di un'opera tramite la selezione e l'organizzazione di espressioni di altre opere. @it
label: a pour famille agrégatrice @fr
definition: Met une œuvre en relation avec une famille qui est responsable de la création d’une œuvre agrégatrice par la sélection et l’arrangement d’expressions d’autres œuvres. @fr
toolkit label: famille agrégatrice @fr
toolkit definition: Famille qui est responsable de la création d’une œuvre agrégatrice par la sélection et l’arrangement d’expressions d’autres œuvres. @fr
label: apkopotājs (dzimta/ģimene) @lv
definition: Sasaista darbu ar dzimtu/ģimeni, kas ir atbildīga par darba-apkopojuma radīšanu, atlasot un sakārtojot citu darbu izteiksmes. @lv
toolkit label: apkopotājs (dzimta/ģimene) @lv
toolkit definition: Dzimta/ģimene, kas ir atbildīga par darba-apkopojuma radīšanu, atlasot un sakārtojot citu darbu izteiksmes @lv
label: 有合集编者家族 @zh-hans
definition: 将一种作品与负责把其他作品的内容表达选择和整理后创建一种合集性作品的一个家族关联起来。 @zh-hans
toolkit label: 合集编者家族 @zh-hans
toolkit definition: 负责把其他作品的内容表达选择和整理后创建一种合集性作品的一个家族 @zh-hans
has subproperty: has compiler family
has subproperty: P10589
label: toplayıcı aile ile ilişkilidir @tr
definition: Bir eseri, başka eserlerin anlatımlarını seçerek ve düzenleyerek toplama bir eser oluşturmaktan sorumlu olan aileyle ilişkilendirir. @tr
toolkit label: Toplayıcı aile @tr
toolkit definition: Diğer eserlerin anlatımlarını seçip düzenleyerek bütünleştirici bir eser oluşturmaktan sorumlu bir aile. @tr

has aggregator person
status: Published
lexical alias: aggregatorPerson.en
definition: Relates a work to a person who is responsible for creating an aggregating work by selecting and arranging expressions of other works.
toolkit label: aggregator person
toolkit definition: A person who is responsible for creating an aggregating work by selecting and arranging expressions of other works.
type: Property
domain: C10001
has element type: 2
sub property of: has creator person of work
sub property of: has aggregator agent
label: aggregaattori (henkilö) @fi
definition: Liittää teoksen henkilöön, joka on vastuussa aggregoivan teoksen luomisesta valitsemalla ja järjestämällä muiden teosten ekspressioita. @fi
toolkit label: aggregaattori (henkilö) @fi
toolkit definition: Henkilö, joka on vastuussa aggregoivan teoksen luomisesta valitsemalla ja järjestämällä muiden teosten ekspressioita. @fi
label: har aggregator (person) @no
definition: Relaterer et verk til en person som er ansvarlig for å skape et aggregerende verk ved å velge ut og arrangere uttrykk av andre verk. @no
toolkit label: aggregator (person) @no
toolkit definition: En person som er ansvarlig for å skape et aggregerende verk ved å velge ut og arrangere uttrykk av andre verk. @no
label: heeft aggregator-persoon @nl
definition: Relateert een werk aan een persoon die verantwoordelijk is voor het creëren van een aggregaatwerk door middel van selectie en arrangeren van expressies van andere werken. @nl
toolkit label: aggregator-persoon @nl
toolkit definition: Een persoon die verantwoordelijk is voor het creëren van een aggregaatwerk door middel van selectie en arrangeren van expressies van andere werken. @nl
label: له شخص مجمِّع @ar
definition: يربط بين عمل وشخص مسئول عن إنشاء عمل مجمِّع عن طريق اختيار تعبيرات الأعمال الأخرى وترتيبها. @ar
toolkit label: شخص مجمِّع @ar
toolkit definition: شخص يكون مسئولاً عن إنشاء عمل مجمِّع عن طريق اختيار تعبيرات الأعمال الأخرى وترتيبها. @ar
label: té com a persona agregadora @ca
definition: Relaciona una obra amb una persona que és responsable de la creació d’una obra agregadora mitjançant la selecció i l’arranjament d’expressions d’altres obres. @ca
toolkit label: persona agregadora @ca
toolkit definition: Persona que és responsable de la creació d’una obra agregadora mitjançant la selecció i l’arranjament d’expressions d’altres obres. @ca
label: har person, som er samler @da
definition: Relaterer et værk til en person, som er ansvarlig for at skabe et aggregerende værk ved at udvælge og arrangere udtryk af andre værk. @da
toolkit label: person, som er samler @da
toolkit definition: Person, som er ansvarlig for at skabe et aggregerende værk ved at udvælge og arrangere udtryk af andre værk. @da
label: liitja (isik) @et
definition: Seostab teose isikuga, kes vastutab liitva teose loomise eest, valides ja korrastades teiste teoste väljendused. @et
toolkit label: liitja (isik) @et
toolkit definition: Isik, kes vastutab liitva teose loomise eest, valides ja korrastades teiste teoste väljendused. @et
label: hat Aggregatorin/Aggregator (Person) @de
definition: Setzt ein Werk in Beziehung zu einer Familie, die für die Schaffung eines aggregierenden Werks verantwortlich ist, indem sie Expressionen anderer Werke auswählt und zusammenstellt. @de
toolkit label: Aggregatorin/Aggregator (Person) @de
toolkit definition: Eine Familie, die für die Schaffung eines aggregierenden Werks verantwortlich ist, indem sie Expressionen anderer Werke auswählt und zusammenstellt. @de
label: aggregátor személye a következő: @hu
definition: Hozzákapcsol egy művet egy személyhez, aki felelős egy aggregáló mű létrehozásáért, más művek kifejezési formáinak kiválasztása és elrendezése révén. @hu
toolkit label: aggregátor személy: @hu
toolkit definition: Egy személy, aki felelős egy aggregáló mű létrehozásáért, más művek kifejezési formáinak kiválasztása és elrendezése révén. @hu
label: ha come aggregatore persona @it
definition: Correla un'opera alla persona responsabile della creazione di un'opera tramite la selezione e l'organizzazione di espressioni di altre opere. @it
toolkit label: aggregatore persona @it
toolkit definition: Persona responsabile della creazione di un'opera tramite la selezione e l'organizzazione di espressioni di altre opere. @it
label: a pour personne agrégatrice @fr
definition: Met une œuvre en relation avec une personne qui est responsable de la création d’une œuvre agrégatrice par la sélection et l’arrangement d’expressions d’autres œuvres. @fr
toolkit label: personne agrégatrice @fr
toolkit definition: Personne qui est responsable de la création d’une œuvre agrégatrice par la sélection et l’arrangement d’expressions d’autres œuvres. @fr
label: apkopotājs (persona) @lv
definition: Sasaista darbu ar personu, kura ir atbildīga par darba-apkopojuma radīšanu, atlasot un sakārtojot citu darbu izteiksmes. @lv
toolkit label: apkopotājs (persona) @lv
toolkit definition: Persona, kura ir atbildīga par darba-apkopojuma radīšanu, atlasot un sakārtojot citu darbu izteiksmes @lv
label: 有合集编者个人 @zh-hans
definition: 将一种作品与负责把其他作品的内容表达选择和整理后创建一种合集性作品的一个个人关联起来。 @zh-hans
toolkit label: 合集编者个人 @zh-hans
toolkit definition: 负责把其他作品的内容表达选择和整理后创建一种合集性作品的一个个人 @zh-hans
has subproperty: has compiler person
has subproperty: P10448
label: toplayıcı kişi ile ilişkilidir @tr
definition: Bir eseri, diğer eserlerin anlatımlarını ifadelerini seçerek ve düzenleyerek toplu bir eser oluşturmaktan sorumlu olan bir kişiyle ilişkilendirir. @tr
toolkit label: Toplayıcı kişi @tr
toolkit definition: Diğer eserlerin anlatımlarını seçerek ve düzenleyerek bir bütünleme eseri oluşturmakla sorumlu olan kişi. @tr

has defendant person
status: Published
type: Property
lexical alias: defendantPerson.en
definition: Relates a work to a person who is accused in a criminal proceeding or sued in a civil proceeding.
domain: C10001
toolkit label: defendant person
toolkit definition: A person who is accused in a criminal proceeding or sued in a civil proceeding.
toolkit label: personne défenderesse @fr
toolkit definition: Personne qui est accusée dans une poursuite criminelle ou contre laquelle une poursuite civile est intentée. @fr
sub property of: has creator person of work
toolkit label: persona acusada @es
toolkit definition: Una persona que es acusada en un proceso penal o demandada en un proceso civil. @es
instruction number: 18.5
label: har sagsøgt person @da
definition: Relaterer et værk til en person, som er anklaget i en straffesag eller sagsøgt i en civilsag. @da
toolkit label: sagsøgt person @da
toolkit definition: Person, som er anklaget i en straffesag eller sagsøgt i en civilsag. @da
definition: Met une œuvre en relation avec une personne qui est accusée dans une poursuite criminelle ou contre laquelle une poursuite civile est intentée. @fr
label: có cá nhân bị đơn @vi
definition: Liên kết tác phẩm với cá nhân bị buộc tội trong vụ kiện hình sự hoặc bị kiện trong vụ kiện dân sự. @vi
toolkit label: cá nhân bị đơn @vi
toolkit definition: Cá nhân bị buộc tội trong vụ kiện hình sự hoặc bị kiện trong vụ kiện dân sự. @vi
label: hat Angeklagte/Angeklagten/Beklagte/Beklagten (Person) @de
definition: Setzt ein Werk in Beziehung zu einer Person, die in einem Strafverfahren angeklagt oder in einem Zivilverfahren verklagt ist. @de
toolkit label: Angeklagte/Angeklagter/Beklagte/Beklagter (Person) @de
toolkit definition: Eine Person, die in einem Strafverfahren angeklagt oder in einem Zivilverfahren verklagt ist. @de
label: a pour personne défenderesse @fr
definition: Liittää teoksen henkilöön, joka on syytettynä rikosprosessissa tai jota vastaan on nostettu kanne. @fi
toolkit label: henkilövastaaja @fi
toolkit definition: Henkilö, joka on syytettynä rikosprosessissa tai jota vastaan on nostettu kanne. @fi
toolkit label: saksøkt person @no
toolkit definition: En person som er tiltalt i en straffesak eller saksøkt i en sivilrettslig sak. @no
label: té com a persona acusada @ca
definition: Relaciona una obra amb una persona que és acusada en un procés penal o demandada en un procés civil. @ca
toolkit definition: Persona que és acusada en un procés penal o demandada en un procés civil. @ca
has element type: 2
label: έχει εναγόμενο φυσικό πρόσωπο @el
definition: Συνδέει ένα έργο με ένα φυσικό πρόσωπο, το οποίο έχει κατηγορηθεί σε μία ποινική διαδικασία ή έχει ασκηθεί αγωγή εναντίον του στο πλαίσιο αστικής διαδικασίας. @el
toolkit label: εναγόμενο φυσικό πρόσωπο @el
toolkit definition: Ένα φυσικό πρόσωπο, το οποίο έχει κατηγορηθεί σε μία ποινική διαδικασία ή έχει ασκηθεί αγωγή εναντίον του στο πλαίσιο αστικής διαδικασίας. @el
label: alperes személye a következő: @hu
definition: Hozzákapcsol egy művet egy személyhez, akit büntetőjogi eljárásban vádolnak, vagy polgári jogi eljárásban perelnek. @hu
toolkit label: alperes személy: @hu
toolkit definition: Egy személy, aki büntetőjogi eljárásban vádolnak, vagy polgári jogi eljárásban perelnek. @hu
label: henkilövastaaja @fi
label: har saksøkt person @no
definition: Relaterer et verk til en person som er tiltalt i en straffesak eller saksøkt i en sivilrettslig sak. @no
label: heeft verweerder-persoon @nl
definition: Relateert een werk aan een persoon die beschuldigd wordt in een strafproces of gedaagd wordt in een civielrechtelijke procedure. @nl
toolkit label: verweerder-persoon @nl
toolkit definition: Een persoon die beschuldigd wordt in een strafproces of gedaagd wordt in een civielrechtelijke procedure. @nl
label: له شخص مدعى عليه @ar
definition: يربط بين عمل وشخص متهم في دعوى جنائية أو يحاكم في دعوى مدنية. @ar
toolkit label: له شخص مدعى عليه @ar
toolkit definition: شخص متهم في دعوى جنائية أو يحاكم في دعوى مدنية. @ar
label: kostja (isik) @et
definition: Seostab teose isikuga, kelle vastu on esitatud süüdistus kriminaalkohtumenetluses või hagi tsiviilkohtumenetluses. @et
toolkit label: kostja (isik) @et
toolkit definition: Isik, kelle vastu on esitatud süüdistus kriminaalkohtumenetluses või hagi tsiviilkohtumenetluses. @et
label: ha come imputato persona @it
definition: Correla un’opera a una persona accusata in un procedimento penale o citata in un procedimento civile. @it
toolkit label: imputato persona @it
toolkit definition: Persona accusata in un procedimento penale o citata in un procedimento civile. @it
label: atbildētājs (persona) @lv
definition: Sasaista darbu ar personu, kura ir apzūdzēta kriminālprocesā vai iesūdzēta civilprocesā. @lv
toolkit label: atbildētājs (persona) @lv
toolkit definition: Persona, kura ir apzūdzēta kriminālprocesā vai iesūdzēta civilprocesā. @lv
label: 有被告个人 @zh-hans
definition: 将一种作品与在刑事或民事诉讼中被控告的一个个人关联起来。 @zh-hans
toolkit label: 被告个人 @zh-hans
toolkit definition: 在刑事或民事诉讼中被控告的一个个人 @zh-hans
has subproperty: has civil defendant person
has subproperty: has criminal defendant person
has subproperty: P10286
label: davalı kişisi ile ilişkilidir @tr
definition: Bir eseri, bir ceza davasında suçlanan veya bir hukuk davasında dava edilen kişiyle ilişkilendirir. @tr
toolkit label: sanık kişi @tr
toolkit definition: Bir ceza davasında suçlanan veya bir hukuk davasında dava edilen kişi. @tr

has appellee person
status: Published
definition: Relates a work to a person against whom an appeal is taken on a decision of a lower court recorded in a legal work of a higher court.
type: Property
domain: C10001
sub property of: has creator person of work
lexical alias: appelleePerson.en
toolkit label: appellee person
toolkit definition: A person against whom an appeal is taken on a decision of a lower court recorded in a legal work of a higher court.
toolkit label: personne intimée @fr
toolkit definition: Personne contre laquelle a été formé un appel d’une décision d’un tribunal inférieur enregistrée dans une œuvre juridique d’un tribunal supérieur. @fr
toolkit label: persona apelada @es
toolkit definition: Una persona contra la cual se hace una apelación sobre una decisión de una corte menor registrada en una obra jurídica de una corte superior. @es
instruction number: 18.5
label: har person, som er indstævnte @da
definition: Relaterer et værk til en person mod hvem der appelleres en afgørelse, truffet af en lavere retsinstans, som er registreret i et juridisk værk fra en højere retsinstans. @da
toolkit label: person, som er indstævnte @da
toolkit definition: Person mod hvem der appelleres en afgørelse, truffet af en lavere retsinstans, som er registreret i et juridisk værk fra en højere retsinstans. @da
definition: Met une œuvre en relation avec une personne contre laquelle a été formé un appel d’une décision d’un tribunal inférieur enregistrée dans une œuvre juridique d’un tribunal supérieur. @fr
label: có cá nhân bị kháng cáo @vi
definition: Liên kết tác phẩm với cá nhân kháng cáo quyết định của toà án cấp thấp hơn được ghi trong tác phẩm luật pháp của toà án cấp cao hơn. @vi
toolkit label: cá nhân bị kháng cáo @vi
toolkit definition: Cá nhân kháng cáo quyết định của toà án cấp thấp hơn được ghi trong tác phẩm luật pháp của toà án cấp cao hơn. @vi
label: hat Berufungsbeklagte/Berufungsbeklagten/Revisionsbeklagte/Revisionsbeklagten (Person) @de
definition: Setzt ein Werk in Beziehung zu einer Person, gegen die Rechtsmittel (Berufung/Revision) gegen ein Gerichtsurteil einer unteren Instanz, das in einem juristischen Werk einer höheren Instanz erfasst ist, eingelegt werden. @de
toolkit label: Berufungsbeklagte/Berufungsbeklagter/Revisionsbeklagte/Revisionsbeklagter (Person) @de
toolkit definition: Eine Person, gegen die Rechtsmittel (Berufung/Revision) gegen ein Gerichtsurteil einer unteren Instanz, das in einem juristischen Werk einer höheren Instanz erfasst ist, eingelegt werden. @de
label: a pour personne intimée @fr
definition: Liittää teoksen henkilöön, jota vastaan muutoksenhaku alemman oikeusasteen päätökseen kohdistuu. @fi
toolkit label: henkilö muutoksenhakijan vastapuolena @fi
toolkit definition: Henkilö, jota vastaan muutoksenhaku alemman oikeusasteen päätökseen kohdistuu. @fi
toolkit label: appellee (person) @no
toolkit definition: En person som er gjenstand for en anke mot en avgjørelse fra en lavere rettsinstans som er registrert i et juridisk verk fra en høyere rettsinstans. @no
label: té com a persona apel·lada @ca
definition: Relaciona una obra amb una persona contra la qual es recorre una decisió d’un tribunal inferior enregistrada en una obra legal d’un tribunal superior. @ca
toolkit label: persona apel·lada @ca
toolkit definition: Persona contra la qual es recorre una decisió d’un tribunal inferior enregistrada en una obra legal d’un tribunal superior. @ca
has element type: 2
label: έχει εφεσίβλητο/αναιρεσίβλητο φυσικό πρόσωπο @el
definition: Συνδέει ένα έργο με ένα φυσικό πρόσωπο, που ασκεί έφεση εναντίον μίας απόφασης κατώτερου δικαστηρίου για μεταβίβαση της υπόθεσης σε ανώτερο δικαστήριο. @el
toolkit label: εφεσίβλητο/αναιρεσίβλητο φυσικό πρόσωπο @el
toolkit definition: Ένα φυσικό πρόσωπο, που ασκεί έφεση εναντίον μίας απόφασης κατώτερου δικαστηρίου για μεταβίβαση της υπόθεσης σε ανώτερο δικαστήριο. @el
label: fellebező alperes személye a következő: @hu
definition: Hozzákapcsol egy művet egy személyhez, aki ellen fellebbezést nyújtanak be egy magasabb fokú bíróság jogi művében rögzített alacsonyabb fokú bírósági döntéssel kapcsolatban. @hu
toolkit label: fellebező alperes személy: @hu
toolkit definition: Egy személy, aki ellen fellebbezést nyújtanak be egy magasabb fokú bíróság jogi művében rögzített alacsonyabb fokú bírósági döntéssel kapcsolatban. @hu
label: henkilö muutoksenhakijan vastapuolena @fi
label: har appellee (person) @no
definition: Relaterer et verk til en person som er gjenstand for en anke mot en avgjørelse fra en lavere rettsinstans som er registrert i et juridisk verk fra en høyere rettsinstans. @no
label: heeft gedaagde-persoon @nl
definition: Relateert een werk aan een persoon waartegen een beroep wordt aangetekend over een oordeel van een lager gerechtshof vastgelegd in een juridisch werk van een hoger gerechtshof. @nl
toolkit label: gedaagde-persoon @nl
toolkit definition: Een persoon waartegen een beroep wordt aangetekend over een oordeel van een lager gerechtshof vastgelegd in een juridisch werk van een hoger gerechtshof. @nl
label: له شخص مستأنف ضده @ar
definition: يربط بين عمل وشخص مستأنَف ضده حكم صادر عن محكمة دنيا ومسجل في عمل قانوني لمحكمة عليا. @ar
toolkit label: شخص مستأنف ضده @ar
toolkit definition: شخص مستأنَف ضده حكم صادر عن محكمة دنيا ومسجل في عمل قانوني لمحكمة عليا. @ar
label: vastustaja (isik) @et
definition: Seostab teose isikuga, kelle vastu on esitatud alama astme kohtu otsuse peale apellatsioon, mis on dokumenteeritud kõrgema astme kohtu juriidilises teoses. @et
toolkit label: vastustaja (isik) @et
toolkit definition: Isik, kelle vastu on esitatud alama astme kohtu otsuse peale apellatsioon, mis on dokumenteeritud kõrgema astme kohtu juriidilises teoses. @et
label: ha come appellato persona @it
definition: Correla un’opera a una persona contro cui ha luogo un appello su decisione di un tribunale ordinario, registrata in un'opera giuridica di un tribunale superiore. @it
toolkit label: appellato persona @it
toolkit definition: Persona contro cui ha luogo un appello su decisione di un tribunale ordinario, registrata in un'opera giuridica di un tribunale superiore. @it
label: atbildētājpersona @lv
definition: Sasaista darbu ar personu, pret kuru iesniegta apelācija un pieņemts zemākas instances tiesas spriedums, kas reģistrēts darbā augstāka līmeņa tiesā. @lv
toolkit label: atbildētājpersona @lv
toolkit definition: Persona, pret kuru iesniegta apelācija un pieņemts zemākas instances tiesas spriedums, kas reģistrēts darbā augstāka līmeņa tiesā. @lv
label: 有被上诉者个人 @zh-hans
definition: 将一种作品与在上级法院的一种法律作品中记录下级法院起诉该个人之决定的一个个人关联起来。 @zh-hans
toolkit label: 被上诉者个人 @zh-hans
toolkit definition: 在上级法院的一种法律作品中记录下级法院起诉该个人之决定的一个个人 @zh-hans
has subproperty: P10035
label: temyiz edilen kişi ile ilişkilidir @tr
definition: Bir eseri, üst mahkemenin yasal eserinde kaydedilen bir alt mahkeme kararına karşı temyiz başvurusunda bulunulan kişi ile ilişkilendirir. @tr
toolkit label: temyiz edilen kişi @tr
toolkit definition: Daha yüksek bir mahkemenin yasal bir çalışmasında kaydedilen daha düşük bir mahkemenin kararına karşı temyiz başvurusunda bulunulan kişi. @tr

has defendant corporate body
status: Published
type: Property
lexical alias: defendantCorporateBody.en
definition: Relates a work to a corporate body who is accused in a criminal proceeding or sued in a civil proceeding.
domain: C10001
toolkit label: defendant corporate body
toolkit definition: A corporate body who is accused in a criminal proceeding or sued in a civil proceeding.
toolkit label: collectivité défenderesse @fr
toolkit definition: Collectivité qui est accusée dans une poursuite criminelle ou contre laquelle une poursuite civile est intentée. @fr
sub property of: has creator corporate body of work
toolkit label: entidad corporativa acusada @es
toolkit definition: Una entidad corporativa que es acusada en un proceso penal o demandada en un proceso civil. @es
instruction number: 18.5
label: har sagsøgt korporation @da
definition: Relaterer et værk til en korporation, som er ansvarlig for at være anklaget i en straffesag eller sagsøgt i en civilsag. @da
toolkit label: sagsøgt korporation @da
toolkit definition: Korporation, som er ansvarlig for at være anklaget i en straffesag eller sagsøgt i en civilsag. @da
definition: Met une œuvre en relation avec une collectivité qui est accusée dans une poursuite criminelle ou contre laquelle une poursuite civile est intentée. @fr
label: có tập thể bị đơn @vi
definition: Liên kết tác phẩm với tập thể bị buộc tội trong vụ kiện hình sự hoặc bị kiện trong vụ kiện dân sự. @vi
toolkit label: tập thể bị đơn @vi
toolkit definition: Tập thể bị buộc tội trong vụ kiện hình sự hoặc bị kiện trong vụ kiện dân sự. @vi
label: hat Angeklagte/Angeklagten/Beklagte/Beklagten (Körperschaft) @de
definition: Setzt ein Werk in Beziehung zu einer Körperschaft, die in einem Strafverfahren angeklagt oder in einem Zivilverfahren verklagt ist. @de
toolkit label: Angeklagte/Angeklagter/Beklagte/Beklagter (Körperschaft) @de
toolkit definition: Eine Körperschaft, die in einem Strafverfahren angeklagt oder in einem Zivilverfahren verklagt ist. @de
label: a pour collectivité défenderesse @fr
definition: Liittää teoksen yhteisöön, joka on syytettynä rikosprosessissa tai jota vastaan on nostettu kanne. @fi
toolkit label: yhteisövastaaja @fi
toolkit definition: Yhteisö, joka on syytettynä rikosprosessissa tai jota vastaan on nostettu kanne. @fi
toolkit label: saksøkt korporasjon @no
toolkit definition: En korporasjon som er ansvarlig for å bli tiltalt i en straffesak eller saksøkt i en sivilrettslig sak. @no
label: té com a entitat corporativa acusada @ca
definition: Relaciona una obra amb una entitat corporativa que és acusada en un procés penal o demandada en un procés civil. @ca
toolkit label: entitat corporativa acusada @ca
toolkit definition: Entitat corporativa que és acusada en un procés penal o demandada en un procés civil. @ca
has element type: 2
label: έχει εναγόμενο συλλογικό όργανο @el
definition: Συνδέει ένα έργο με ένα συλλογικό όργανο, το οποίο έχει κατηγορηθεί σε μία ποινική διαδικασία ή έχει ασκηθεί αγωγή εναντίον του στο πλαίσιο αστικής διαδικασίας. @el
toolkit label: εναγόμενο συλλογικό όργανο @el
toolkit definition: Ένα συλλογικό όργανο, το οποίο έχει κατηγορηθεί σε μία ποινική διαδικασία ή έχει ασκηθεί αγωγή εναντίον του στο πλαίσιο αστικής διαδικασίας. @el
label: alperes testülete a következő: @hu
definition: Hozzákapcsol egy művet egy testülethez, amelyet büntetőjogi eljárásban vádolnak, vagy polgári jogi eljárásban perelnek. @hu
toolkit label: alperes testület: @hu
toolkit definition: Egy testület, amelyet büntetőjogi eljárásban vádolnak, vagy polgári jogi eljárásban perelnek. @hu
label: yhteisövastaaja @fi
label: har saksøkt korporasjon @no
definition: Relaterer et verk til en korporasjon som er ansvarlig for å bli tiltalt i en straffesak eller saksøkt i en sivilrettslig sak. @no
label: heeft verweerder-corporatie @nl
definition: Relateert een werk aan een corporatie die beschuldigd is in een strafproces of gedaagd wordt in een civielrechtelijke procedure. @nl
toolkit label: verweerder-corporatie @nl
toolkit definition: Een corporatie die is beschuldigd in een strafproces of gedaagd wordt in een civielrechtelijke procedure. @nl
label: kostja (asutus) @et
definition: Seostab teose asutusega, kelle vastu on esitatud süüdistus kriminaalkohtumenetluses või hagi tsiviilkohtumenetluses. @et
toolkit label: kostja (asutus) @et
toolkit definition: Asutus, kelle vastu on esitatud süüdistus kriminaalkohtumenetluses või hagi tsiviilkohtumenetluses. @et
label: ha come imputato ente @it
definition: Correla un'opera a un agente responsabile per la creazione di un nuovo dispositivo o procedimento. @it
toolkit label: imputato ente @it
toolkit definition: Ente che è responsabile per essere accusato in un procedimento penale o citato in un procedimento civile. @it
label: atbildētājs (institūcija) @lv
definition: Sasaista darbu ar institūciju, pret kuru celta prasība kriminālprocesā vai sūdzība civilprocesā. @lv
toolkit label: atbildētājs (institūcija) @lv
toolkit definition: Institūcija, pret kuru celta prasība kriminālprocesā vai sūdzība civilprocesā. @lv
label: له هيئة مدعى عليها @ar
definition: يربط بين عمل وهيئة متهمة في دعوى جنائية أو تحاكم في دعوى مدنية. @ar
toolkit label: له هيئة مدعى عليها @ar
toolkit definition: هيئة متهمة في دعوى جنائية أو تحاكم في دعوى مدنية. @ar
label: 有被告团体 @zh-hans
definition: 将一种作品与在刑事或民事诉讼中被控告的一个团体关联起来。 @zh-hans
toolkit label: 被告团体 @zh-hans
toolkit definition: 在刑事或民事诉讼中被控告的一个团体 @zh-hans
has subproperty: has civil defendant corporate body
has subproperty: has criminal defendant corporate body
has subproperty: P10285
label: davalı tüzel kişisi ile ilişkilidir @tr
definition: Bir eseri, bir ceza davasında suçlanan veya bir hukuk davasında dava edilen bir tüzel kişi ile ilişkilendirir. @tr
toolkit label: sanık tüzel kişi @tr
toolkit definition: Bir ceza davasında suçlanan veya bir hukuk davasında dava edilen bir tüzel kişi. @tr

has appellee corporate body
status: Published
definition: Relates a work to a corporate body against whom an appeal is taken on a decision of a lower court recorded in a legal work of a higher court.
type: Property
domain: C10001
sub property of: has creator corporate body of work
lexical alias: appelleeCorporateBody.en
toolkit label: appellee corporate body
toolkit definition: A corporate body against whom an appeal is taken on a decision of a lower court recorded in a legal work of a higher court.
toolkit label: collectivité intimée @fr
toolkit definition: Collectivité contre laquelle a été formé un appel d’une décision d’un tribunal inférieur enregistrée dans une œuvre juridique d’un tribunal supérieur. @fr
toolkit label: entidad corporativa apelada @es
toolkit definition: Una entidad corporativa contra la cual se hace una apelación sobre una decisión de una corte menor registrada en una obra jurídica de una corte superior. @es
instruction number: 18.5
label: har korporation, som er indstævnte @da
definition: Relaterer et værk til en korporation mod hvilken der appelleres en afgørelse, truffet af en lavere retsinstans, som er registreret i et juridisk værk fra en højere retsinstans. @da
toolkit label: korporation, som er indstævnte @da
toolkit definition: Korporation mod hvilken der appelleres en afgørelse, truffet af en lavere retsinstans, som er registreret i et juridisk værk fra en højere retsinstans. @da
definition: Met une œuvre en relation avec une collectivité contre laquelle a été formé un appel d’une décision d’un tribunal inférieur enregistrée dans une œuvre juridique d’un tribunal supérieur. @fr
label: có tập thể bị kháng cáo @vi
definition: Liên kết tác phẩm với tập thể chống lại người đưa ra kháng cáo trên quyết định của toà án cấp thấp hơn trong tác phẩm luật pháp của toà án cấp cao hơn. @vi
toolkit label: tập thể bị kháng cáo @vi
toolkit definition: Tập thể chống lại người đưa ra kháng cáo trên quyết định của toà án cấp thấp hơn trong tác phẩm luật pháp của toà án cấp cao hơn. @vi
label: hat Berufungsbeklagte/Berufungsbeklagten/Revisionsbeklagte/Revisionsbeklagten (Körperschaft) @de
definition: Setzt ein Werk in Beziehung zu einer Körperschaft, gegen die Rechtsmittel (Berufung/Revision) gegen ein Gerichtsurteil einer unteren Instanz, das in einem juristischen Werk einer höheren Instanz erfasst ist, eingelegt werden. @de
toolkit label: Berufungsbeklagte/Berufungsbeklagter/Revisionsbeklagte/Revisionsbeklagter (Körperschaft) @de
toolkit definition: Eine Körperschaft, gegen die Rechtsmittel (Berufung/Revision) gegen ein Gerichtsurteil einer unteren Instanz, das in einem juristischen Werk einer höheren Instanz erfasst ist, eingelegt werden. @de
label: a pour collectivité intimée @fr
definition: Liittää teoksen yhteisöön, jota vastaan muutoksenhaku alemman oikeusasteen päätökseen kohdistuu. @fi
toolkit label: yhteisö muutoksenhakijan vastapuolena @fi
toolkit definition: Yhteisö, jota vastaan muutoksenhaku alemman oikeusasteen päätökseen kohdistuu. @fi
toolkit label: appellee (korporasjon) @no
toolkit definition: En korporasjon som anker en avgjørelse fra en lavere rettsinstans som er registrert i et juridisk verk fra en høyere rettsinstans. @no
label: té com a entitat corporativa apel·lada @ca
definition: Relaciona una obra amb una entitat corporativa contra la qual es recorre una decisió d’un tribunal inferior enregistrada en una obra legal d’un tribunal superior. @ca
toolkit label: entitat corporativa apel·lada @ca
toolkit definition: Entitat corporativa contra la qual es recorre una decisió d’un tribunal inferior enregistrada en una obra legal d’un tribunal superior. @ca
has element type: 2
label: είναι εφεσίβλητο/αναιρεσίβλητο συλλογικό όργανο @el
definition: Συνδέει ένα έργο με ένα συλλογικό όργανο εναντίον του οποίου ασκείται έφεση εναντίον απόφασης κατώτερου δικαστηρίου, που καταχωρίστηκε στα πρακτικά ενός ανωτέρου δικαστηρίου. @el
toolkit label: εφεσίβλητο/αναιρεσίβλητο συλλογικό όργανο @el
toolkit definition: Ένα συλλογικό όργανο εναντίον του οποίου ασκείται έφεση εναντίον απόφασης κατώτερου δικαστηρίου, που καταχωρίστηκε στα πρακτικά ενός ανωτέρου δικαστηρίου. @el
label: fellebezési alperes testülete a következő: @hu
definition: Hozzákapcsol egy művet egy testülethez, amely ellen fellebbezést nyújtanak be egy magasabb fokú bíróság jogi művében rögzített alacsonyabb fokú bírósági döntéssel kapcsolatban. @hu
toolkit label: fellebezési alperes testület: @hu
toolkit definition: Egy testület, amely ellen fellebbezést nyújtanak be egy magasabb fokú bíróság jogi művében rögzített alacsonyabb fokú bírósági döntéssel kapcsolatban. @hu
label: yhteisö muutoksenhakijan vastapuolena @fi
label: har appellee (korporasjon) @no
definition: Relaterer et verk til en korporasjon som anker en avgjørelse fra en lavere rettsinstans som er registrert i et juridisk verk fra en høyere rettsinstans. @no
label: heeft gedaagde-corporatie @nl
definition: Relateert een werk aan een corporatie waartegen een beroep wordt aangetekend over een oordeel van een lager gerechtshof vastgelegd in een juridisch werk van een hoger gerechtshof. @nl
toolkit label: gedaagde-corporatie @nl
toolkit definition: Een corporatie waartegen een beroep wordt aangetekend over een oordeel van een lager gerechtshof vastgelegd in een juridisch werk van een hoger gerechtshof. @nl
label: له هيئة مستأنف ضدها @ar
definition: يربط بين عمل وهيئة مستأنف ضدها بحكم صادر عن محكمة دنيا ومسجل في عمل قانوني لمحكمة عليا. @ar
toolkit label: هيئة مستأنف ضدها @ar
toolkit definition: هيئة مستأنف ضدها بحكم صادر عن محكمة دنيا ومسجّل في عمل قانوني لمحكمة عليا. @ar
label: vastustaja (asutus) @et
definition: Seostab teose asutusega, kelle vastu on esitatud alama astme kohtu otsuse peale apellatsioon, mis on dokumenteeritud kõrgema astme kohtu juriidilises teoses. @et
toolkit label: vastustaja (asutus) @et
toolkit definition: Asutus, kelle vastu on esitatud alama astme kohtu otsuse peale apellatsioon, mis on dokumenteeritud kõrgema astme kohtu juriidilises teoses. @et
label: ha come ente appellato @it
definition: Correla un’opera a un ente contro cui ha luogo un appello su decisione di un tribunale ordinario, registrato in un'opera giuridica di un tribunale superiore. @it
toolkit label: ente appellato @it
toolkit definition: Ente contro cui ha luogo un appello su decisione di un tribunale ordinario, registrato in un'opera giuridica di un tribunale superiore. @it
label: atbildētājinstitūcija @lv
definition: Sasaista darbu ar institūciju, pret kuru ceļ apsūdzību par nodarījuma izdarīšanu un uztur apsūdzību tiesā. @lv
toolkit label: atbildētājinstitūcija @lv
toolkit definition: Institūcija, pret kuru ceļ apsūdzību par nodarījuma izdarīšanu un uztur apsūdzību tiesā. @lv
label: 有被上诉者团体 @zh-hans
definition: 将一种作品与在上级法院的一种法律作品中记录下级法院起诉该团体之决定的一个团体关联起来。 @zh-hans
toolkit label: 被上诉者团体 @zh-hans
toolkit definition: 在上级法院的一种法律作品中记录下级法院起诉该团体之决定的一个团体 @zh-hans
has subproperty: P10005
label: temyiz edilen tüzel kişi ile ilişkilidir @tr
definition: Bir eseri, üst mahkemenin yasal eserinde kaydedilen bir alt mahkeme kararına karşı temyiz başvurusunda bulunulan tüzel kişi ile ilişkilendirir. @tr
toolkit label: temyiz edilen tüzel kişi @tr
toolkit definition: Bir üst mahkemenin yasal bir çalışmasında kaydedilen bir alt mahkeme kararına karşı temyiz başvurusunda bulunulan tüzel kişilik. @tr

has subseries
status: Published
definition: Relates a work to a work that is a successive aggregating work that is inspired by the overall editorial policy, scope, and style of another successive aggregating work.
type: Property
domain: C10001
sub property of: is inspiration for
lexical alias: subseries.en
toolkit label: subseries
toolkit definition: A work that is a successive aggregating work that is inspired by the overall editorial policy, scope, and style of another successive aggregating work.
toolkit label: sous-collection @fr
toolkit definition: Œuvre agrégatrice successive qui s’inspire de la politique éditoriale globale, de la portée et du style d’une autre œuvre agrégatrice successive. @fr
toolkit label: subserie @es
toolkit definition: Una serie u obra en varias partes que aparece constantemente en conjunto con otra serie generalmente más amplia; el título de la obra más amplia aparece en todos los números o partes de la subserie. @es
instruction number: 24.5
label: har underserie @da
definition: Relaterer et værk til et værk, som er et påfølgende aggregerende værk, som er inspireret af den overgribende redaktionelle retningslinje, rækkevidde og stil fra et andet fortløbende aggregerende værk. @da
toolkit label: underserie @da
toolkit definition: Værk, som er et påfølgende aggregerende værk, som er inspireret af den overgribende redaktionelle retningslinje, rækkevidde og stil fra et andet påfølgende aggregerende værk. @da
definition: Met une œuvre en relation avec une œuvre agrégatrice successive qui s’inspire de la politique éditoriale globale, de la portée et du style d’une autre œuvre agrégatrice successive. @fr
label: có tiểu tùng thư @vi
definition: Liên kết tác phẩm với ấn phẩm nhiều kỳ hoặc tác phẩm nhiều phần xuất hiện thường kỳ trong tác phẩm lớn hơn; nhan đề của tác phẩm lớn hơn xuất hiện trên tất cả các số hoặc phần của tiểu tùng thư. @vi
toolkit label: tiểu tùng thư @vi
toolkit definition: Ấn phẩm nhiều kỳ hoặc tác phẩm nhiều phần xuất hiện thường kỳ trong tác phẩm lớn hơn; nhan đề của tác phẩm lớn hơn xuất hiện trên tất cả các số hoặc phần của tiểu tùng thư. @vi
label: hat Unterreihe @de
definition: Setzt ein Werk in Beziehung zu einem sukzessiven, aggregierenden Werk, das an die allgemeine redaktionelle Vorgehensweise, den Geltungsbereich und den Stil eines anderen sukzessiven, aggregierenden Werks angelehnt ist. @de
toolkit label: Unterreihe @de
toolkit definition: Ein sukzessives, aggregierendes Werk, das an die allgemeine redaktionelle Vorgehensweise, den Geltungsbereich und den Stil eines anderen sukzessiven, aggregierenden Werks angelehnt ist. @de
label: a pour sous-collection @fr
definition: Liittää teoksen teokseen, joka on peräkkäisesti ilmestyvä aggregoiva teos, johon vaikuttaa toisen peräkkäisesti ilmestyvän aggregoivan teoksen yleinen toimituslinja, toiminta-ala ja tyyli. @fi
toolkit label: alasarja @fi
toolkit definition: Teos, joka on peräkkäisesti ilmestyvä aggregoiva teos, johon vaikuttaa toisen peräkkäisesti ilmestyvän aggregoivan teoksen yleinen toimituslinja, toiminta-ala ja tyyli. @fi
toolkit definition: Et verk som er et påfølgende aggregert verk som er inspirert av den samlede redaksjonelle politikken, omfanget og stilen fra et annet påfølgende aggregert verk. @no
label: té com a subcol·lecció @ca
definition: Relaciona una obra amb una obra que és una obra agregadora successiva que s’inspira en la política editorial general, l’abast i l’estil d’una altra obra agregadora successiva. @ca
toolkit label: subcol·lecció @ca
toolkit definition: Obra que és una obra agregadora successiva que s’inspira en la política editorial general, l’abast i l’estil d’una altra obra agregadora successiva. @ca
has element type: 2
label: είναι υποσειρά @el
definition: Συνδέει ένα έργο με ένα περιοδικό ή ένα πολυμερές έργο το οποίο συστηματικά εμφανίζεται σε ένα μεγαλύτερο έργο; ο τίτλος ενός μεγαλύτερου έργου εμφανίζεται σε όλα τα τεύχη ή μέρη μιας υποσειράς. @el
toolkit label: υποσειρά @el
toolkit definition: Ένα περιοδικό ή ένα πολυμερές έργο το οποίο συστηματικά εμφανίζεται σε ένα μεγαλύτερο έργο; ο τίτλος ενός μεγαλύτερου έργου εμφανίζεται σε όλα τα τεύχη ή μέρη μιας υποσειράς. @el
label: alsorozata a következő: @hu
definition: Hozzákapcsol egy művet egy folyamatos aggregáló műhöz, amelyre egy másik folyamatos aggregáló mű szerkesztési elve, tárgyköre és stílusa volt hatással. @hu
toolkit label: alsorozat @hu
label: alasarja @fi
definition: Relaterer et verk til et verk som er et påfølgende aggregert verk som er inspirert av den samlede redaksjonelle politikken, omfanget og stilen fra et annet påfølgende aggregert verk. @no
label: heeft onderreeks @nl
definition: Relateert een werk aan een werk dat een successief aggregaatwerk is dat geïnspireerd is door het algehele redactionele beleid, de scope en stijl van een ander successief aggregaatwerk. @nl
toolkit label: onderreeks @nl
toolkit definition: Een werk dat een successief aggregaatwerk is dat geïnspireerd is door het algehele redactionele beleid, de scope en stijl van een ander successief aggregaatwerk. @nl
label: له سلسلة فرعية @ar
definition: يربط عمل بعمل عبارة عن عمل تجميعي متتالٍ مستوحى من السياسة التحريرية الشاملة، والمجال، وأسلوب عمل تجميعي متتالٍ آخر. @ar
toolkit label: سلسلة فرعية @ar
toolkit definition: عمل عبارة عن عمل تجميعي متتالٍ مستوحى من السياسة التحريرية الشاملة، والمجال، وأسلوب عمل تجميعي متتالٍ آخر. @ar
label: allseeria @et
definition: Seostab teose teosega, mis on teise liitva järgteose toimetamispõhimõtetest, haardest ja stiilist suunatud liitev järgteos. @et
toolkit label: allseeria @et
toolkit definition: Teos, mis on teise liitva järgteose toimetamispõhimõtetest, haardest ja stiilist suunatud liitev järgteos. @et
toolkit definition: Egy folyamatos aggregáló mű, amelyre egy másik folyamatos aggregáló mű szerkesztési elve, tárgyköre és stílusa volt hatással. @hu
label: ha come sottoserie @it
definition: Correla un’opera a un’opera aggregante consecutiva che è ispirata dalla politica editoriale complessiva, dall’oggetto e dallo stile di un’altra opera aggregante consecutiva. @it
toolkit label: sottoserie @it
toolkit definition: Opera aggregante consecutiva che è ispirata dalla politica editoriale complessiva, dall’oggetto e dallo stile di un’altra opera aggregante consecutiva. @it
label: apakšsērija @lv
definition: Sasaista darbu ar darbu, kas ir secīgs apkopojošs darbs, kuru iedvesmojusi cita secīga apkopojoša darba vispārējā izdošanas politika, darbības joma un stils. @lv
toolkit label: apakšsērija @lv
toolkit definition: Darbs, kas ir secīgs apkopojošs darbs, kuru iedvesmojusi cita secīga apkopojoša darba vispārējā izdošanas politika, darbības joma un stils. @lv
label: 有分丛编 @zh-hans
definition: 将一种作品与作为一种相继合集性作品并且被另一种相继合集性作品的总体编辑政策、编辑范围和编辑风格启发的一种作品关联起来。 @zh-hans
toolkit label: 分丛编 @zh-hans
toolkit definition: 作为一种相继合集性作品并且被另一种相继合集性作品的总体编辑政策、编辑范围和编辑风格启发的一种作品 @zh-hans
has subproperty: P10080
label: alt seril ile ilişkilidir @tr
definition: Bir eseri, başka bir ardışık toplama eserinin genel yayın politikası, kapsamı ve biçiminden esinlenen, ardışık toplama eseri olan bir eserle ilişkilendirir. @tr
toolkit label: alt dizileri @tr
toolkit definition: Ardışık başka bir çalışmanın genel yayın politikası, kapsamı ve biçiminden esinlenen, ardışık bir toplama eser. @tr

is subseries of
status: Published
definition: Relates a work to a work that is a successive aggregating work that inspires the overall editorial policy, scope, and style of another successive aggregating work.
type: Property
domain: C10001
sub property of: is inspired by
lexical alias: subseriesOf.en
toolkit label: subseries of
toolkit definition: A work that is a successive aggregating work that inspires the overall editorial policy, scope, and style of another successive aggregating work.
toolkit label: sous-collection de @fr
toolkit definition: Œuvre agrégatrice successive qui inspire la politique éditoriale globale, la portée et le style d’une autre œuvre agrégatrice successive. @fr
toolkit label: subserie de (obra) @es
toolkit definition: Una obra en la que la parte aparece en forma consistente; el título de la obra mayor aparece en todas las entregas o partes de la subserie. @es
instruction number: 24.5
label: er underserie af @da
definition: Relaterer et værk til et værk, som er et fortløbende aggregerende værk, som inspirerer den redaktionelle retningslinje, rækkevidde og stil for et andet fortløbende aggregerende værk. @da
toolkit label: underserie af @da
toolkit definition: Værk, som er et fortløbende aggregerende værk, som inspirerer den redaktionelle retningslinje, rækkevidde og stil for et andet fortløbende aggregerende værk. @da
definition: Met une œuvre en relation avec une œuvre agrégatrice successive qui inspire la politique éditoriale globale, la portée et le style d’une autre œuvre agrégatrice successive. @fr
label: là tiểu tùng thư của @vi
definition: Liên kết tác phẩm với tác phẩm mà trong đó phần xuất hiện thường kỳ; nhan đề của tác phẩm lớn hơn xuất hiện trong tất cả các số hoặc phần của tiểu tùng thư @vi
toolkit label: tiểu tùng thư của @vi
toolkit definition: Tác phẩm mà trong đó phần xuất hiện thường kỳ; nhan đề của tác phẩm lớn hơn xuất hiện trong tất cả các số hoặc phần của tiểu tùng thư @vi
label: ist Unterreihe von @de
definition: Setzt ein Werk in Beziehung zu einem sukzessiven, aggregierenden Werk, das die redaktionelle Vorgehensweise, den Geltungsbereich und den Stil eines anderen sukzessiven, aggregierenden Werks beeinflusst. @de
toolkit label: Unterreihe von @de
toolkit definition: Ein sukzessives, aggregierendes Werk, das die redaktionelle Vorgehensweise, den Geltungsbereich und den Stil eines anderen sukzessiven, aggregierenden Werks beeinflusst. @de
label: est une sous-collection de @fr
definition: Liittää teoksen teokseen, joka on peräkkäisesti ilmestyvä aggregoiva teos, joka vaikuttaa toisen peräkkäisesti ilmestyvän aggregoivan teoksen yleiseen toimituslinjaan, toiminta-alaan ja tyyliin. @fi
toolkit label: pääsarja @fi
toolkit definition: Teos, joka on peräkkäisesti ilmestyvä aggregoiva teos, joka vaikuttaa toisen peräkkäisesti ilmestyvän aggregoivan teoksen yleiseen toimituslinjaan, toiminta-alaan ja tyyliin. @fi
toolkit label: underserie av @no
toolkit definition: Et verk som er et påfølgende aggregert verk som er inspirert av den samlede redaksjonelle politikken, omfanget og stilen fra et annet påfølgende aggregert verk. @no
label: és subcol·lecció de @ca
definition: Relaciona una obra amb una obra que és una obra agregadora successiva que inspira la política editorial, l’abast i l’estil d’una altra obra agregadora successiva. @ca
toolkit label: subcol·lecció de @ca
toolkit definition: Obra que és una obra agregadora successiva que inspira la política editorial, l’abast i l’estil d’una altra obra agregadora successiva. @ca
has element type: 2
label: είναι υποσειρά του @el
definition: Συνδέει ένα έργο με ένα έργο στο οποίο εμφανίζεται συστηματικά ένα μέρος; ένας τίτλος ενός μεγαλύτερου έργου εμφανίζεται σε όλα τα τεύχη ή μέρη μιας υποσειράς. @el
toolkit label: υποσειρά του @el
toolkit definition: Ένα έργο στο οποίο εμφανίζεται συστηματικά ένα μέρος; ένας τίτλος ενός μεγαλύτερου έργου εμφανίζεται σε όλα τα τεύχη ή μέρη μιας υποσειράς. @el
label: alsorozata a következőnek: @hu
definition: Hozzákapcsol egy művet egy folyamatos aggregáló műhöz, amely hatással van egy másik folyamatos aggregáló mű szerkesztési elveire, tárgykörére és stílusára. @hu
label: pääsarja @fi
label: er underserie av @no
definition: Relaterer et verk til et verk som er et påfølgende aggregert verk som er inspirert av den samlede redaksjonelle politikken, omfanget og stilen fra et annet påfølgende aggregert verk. @no
label: is onderreeks van @nl
definition: Relateert een werk aan een werk dat een successief aggregaatwerk is dat inspireert het algehele redactioneel beleid, de scope en stijl van een ander successief aggregaatwerk. @nl
toolkit label: onderreeks van @nl
toolkit definition: Een werk dat een successief aggregaatwerk is dat inspireert het algehele redactioneel beleid, de scope en stijl van een ander successief aggregaatwerk. @nl
label: هو سلسلة فرعية لـ @ar
definition: يربط عمل بعمل عبارة عن عمل تجميعي متتالٍ يلهِم السياسة التحريرية، والمجال، والأسلوب لعمل تجميعي متتالٍ آخر. @ar
toolkit label: سلسلة فرعية لـ @ar
toolkit definition: عمل عبارة عن عمل تجميعي متتالٍ يلهِم السياسة التحريرية، والمجال، والأسلوب لعمل تجميعي متتالٍ آخر. @ar
label: allseeria peaseeriale @et
definition: Seostab teose teosega, mis on teise liitva järgteose toimetamispõhimõtteid, käsitlusala ja stiili suunav liitev järgteos. @et
toolkit label: allseeria peaseeriale @et
toolkit definition: Teos, mis on teise liitva järgteose toimetamispõhimõtteid, käsitlusala ja stiili suunav liitev järgteos. @et
toolkit label: alsorozata: @hu
toolkit definition: Egy folyamatos aggregáló mű, amely hatással van egy másik folyamatos aggregáló mű szerkesztési elveire, tárgykörére és stílusára. @hu
label: è sottoserie di @it
definition: Correla un’opera a un’opera aggregante consecutiva che ispira la politica editoriale complessiva, l’oggetto e lo stile di un’altra opera aggregante consecutiva. @it
toolkit label: sottoserie di @it
toolkit definition: Opera aggregante consecutiva che ispira la politica editoriale complessiva, l’oggetto e lo stile di un’altra opera aggregante consecutiva. @it
label: ir sērija @lv
definition: Sasaista darbu ar darbu, kas ir secīgs apkopojošs darbs, kas iedvesmo cita secīga apkopojoša darba izdošanas politiku, darbības jomu un stilu. @lv
toolkit label: sērija @lv
toolkit definition: Darbs, kas ir secīgs apkopojošs darbs, kas iedvesmo cita secīga apkopojoša darba izdošanas politiku, darbības jomu un stilu. @lv
label: 是……的分丛编 @zh-hans
definition: 将一种作品与作为一种相继合集性作品并且启发另一种相继合集性作品的编辑政策、编辑范围和编辑风格的一种作品关联起来。 @zh-hans
toolkit label: ……的分丛编 @zh-hans
toolkit definition: 作为一种相继合集性作品并且启发另一种相继合集性作品的编辑政策、编辑范围和编辑风格的一种作品 @zh-hans
has subproperty: P10101
label: alt serisidir @tr
definition: Bir eseri, başka bir ardışık toplama eserinin yayın politikasına, kapsamına ve biçimine ilham veren ardışık toplama eseri olan bir eserle ilişkilendirir. @tr
toolkit label: alt dizileri @tr
toolkit definition: Ardışık bir toplama çalışmasının yayın politikasını, kapsamını ve biçimini etkileyen, birbirini izleyen bir toplama bir eser. @tr

har appellant
status: Deprecated
type: Property
domain: C10001
sub property of: has other agent associated with work (Deprecated)
lexical alias: appellant.en
toolkit label: appelant @fr
toolkit definition: Personne ou collectivité qui en appelle d’une décision d’un tribunal inférieur enregistrée dans une œuvre juridique d’un tribunal supérieur. @fr
toolkit label: apelante @es
toolkit definition: Una persona o entidad corporativa que apela una decisión de una corte menor registrada en una obra jurídica de una corte superior. @es
instruction number: 18.5
definition: Relaterer et værk af en person eller korporation, der gør indsigelse over en underrets beslutning, der er registreret i et juridisk værk fra en højere retsinstans. @da
toolkit label: appellant @da
toolkit definition: Person eller korporation, der gør indsigelse over en underrets beslutning, der er registreret i et juridisk værk fra en højere retsinstans. @da
definition: Met une œuvre en relation avec une personne ou une collectivité qui en appelle d’une décision d’un tribunal inférieur enregistrée dans une œuvre juridique d’un tribunal supérieur. @fr
label: có bên nguyên kháng @vi
definition: Liên kết tác phẩm với cá nhân hoặc tập thể kháng cáo quyết định của toà án cấp thấp hơn được ghi trong tác phẩm luật pháp của toà án cấp cao hơn. @vi
toolkit label: bên nguyên kháng @vi
toolkit definition: Cá nhân hoặc tập thể kháng cáo quyết định của toà án cấp thấp hơn được ghi trong tác phẩm luật pháp của toà án cấp cao hơn. @vi
label: hat Berufungskläger/Revisionskläger @de
definition: Setzt ein Werk mit einer Person oder einer Körperschaft, die gegen ein Gerichtsurteil einer unteren Instanz, das in einem juristischen Werk einer höheren Instanz erfasst ist, Rechtsmittel (Berufung/Revision) einlegt, in Beziehung. @de
toolkit label: Berufungskläger/Revisionskläger @de
toolkit definition: Eine Person oder eine Körperschaft, die gegen ein Gerichtsurteil einer unteren Instanz, das in einem juristischen Werk einer höheren Instanz erfasst ist, Rechtsmittel (Berufung/Revision) einlegt. @de
label: a pour appelant @fr
label: muutoksenhakija @fi
definition: Liittää teoksen henkilöön tai yhteisöön, joka hakee muutosta alemman oikeusasteen päätökseen @fi
toolkit label: muutoksenhakija @fi
toolkit definition: Henkilö tai yhteisö, joka hakee muutosta alemman oikeusasteen päätökseen @fi
toolkit definition: En person eller korporasjon som anker avgjørelsen til en lavere rettsinstans som er registrert i et juridisk verk fra en høyere rettsinstans. @no
label: té com a apel·lant @ca
definition: Relaciona una obra amb una persona o entitat corporativa que recorre a un tribunal superior perquè esmeni la sentència d’un tribunal inferior. @ca
toolkit label: apel·lant @ca
toolkit definition: Persona o entitat corporativa que recorre a un tribunal superior perquè esmeni la sentència d’un tribunal inferior. @ca
label: έχει εκκαλούντα/αναιρεσείοντα @el
definition: Συνδέει ένα έργο με ένα φυσικό πρόσωπο ή συλλογικό όργανο, που ασκεί έφεση εναντίον απόφασης κατώτερου δικαστηρίου, που καταχωρίστηκε στα πρακτικά ενός ανωτέρου δικαστηρίου. @el
toolkit label: εκκαλών/αναιρεσείων @el
toolkit definition: Ένα φυσικό πρόσωπο ή συλλογικό όργανο, που ασκεί έφεση εναντίον απόφασης κατώτερου δικαστηρίου, που καταχωρίστηκε στα πρακτικά ενός ανώτερου δικαστηρίου. @el

has appellation of work
status: Published
type: Property
lexical alias: appellationOfWork.en
definition: Relates a work to a nomen used within a given scheme or context to refer to a work.
domain: C10001
toolkit label: appellation of work
toolkit definition: A nomen used within a given scheme or context to refer to a work.
sub property of: has related nomen of work
has element type: 3
sub property of: P00017
label: teoksen nimitys @fi
definition: Liittää teoksen nomeniin, jota on käytetty tietyssä järjestelmässä tai kontekstissa viittaamaan teokseen. @fi
toolkit label: teoksen nimitys @fi
toolkit definition: Nomen, jota on käytetty tietyssä järjestelmässä tai kontekstissa viittaamaan teokseen. @fi
label: har betegnelse for verk @no
definition: Relaterer et verk til et nomen som er brukt i et bestemt skjema eller en bestemt sammenheng for å refere til et verk. @no
toolkit label: betegnelse for verk @no
toolkit definition: Et nomen som er brukt i et bestemt skjema eller en bestemt sammenheng for å refere til et verk. @no
label: heeft benaming van werk @nl
definition: Relateert een werk aan een nomen gebruikt binnen een bepaald schema of context om een werk aan te duiden. @nl
toolkit label: benaming van werk @nl
toolkit definition: Een nomen gebruikt binnen een bepaald schema of context om een werk aan te duiden. @nl
label: له اسم تعريفي لعمل @ar
definition: يربط بين عمل وتسمية مستخدمة ضمن خطة معينة أو سياق معين للإشارة إلى عمل. @ar
toolkit label: اسم تعريفي لعمل @ar
toolkit definition: تسمية مستخدمة ضمن خطة معينة أو سياق معين للإشارة إلى عمل. @ar
label: té com a apel·lació d’obra @ca
definition: Relaciona una obra amb un nomen usat en un esquema o un context determinat per referir-se a una obra. @ca
toolkit label: apel·lació d’obra @ca
toolkit definition: Nomen usat en un esquema o un context determinat per referir-se a una obra. @ca
label: har benævnelse på værk @da
definition: Relaterer et værk til et nomen, som anvendes inden for et givet skema eller kontekst for at henvise til et værk. @da
toolkit label: benævnelse på værk @da
toolkit definition: Nomen, som anvendes inden for et givet skema eller kontekst for at henvise til et værk. @da
label: teose nimetus @et
definition: Seostab teose nomen'iga, mida antud süsteemis või kontekstis kasutatakse teosele viitamiseks. @et
toolkit label: teose nimetus @et
toolkit definition: Nomen, mida antud süsteemis või kontekstis kasutatakse teosele viitamiseks. @et
label: hat Bezeichnung für ein Werk @de
definition: Setzt ein Werk in Beziehung zu einem Nomen, das in einem bestimmten Schema oder Kontext verwendet wird, um ein Werk zu referenzieren. @de
toolkit label: Bezeichnung für ein Werk @de
toolkit definition: Ein Nomen, das in einem bestimmten Schema oder Kontext verwendet wird, um ein Werk zu referenzieren. @de
label: mű megnevezése a következő: @hu
definition: Hozzákapcsol egy művet egy nomenhez, amelyet egy adott sémán vagy kontextuson belül használnak egy műre való hivatkozásra. @hu
toolkit label: mű megnevezése: @hu
toolkit definition: Egy nomen, amelyet egy adott sémán vagy kontextuson belül használnak egy műre való hivatkozásra. @hu
label: ha come denominazione dell'opera @it
definition: Correla un’opera a un nomen usato entro un dato schema o contesto per riferirsi a un’opera. @it
toolkit label: denominazione di opera @it
toolkit definition: Nomen usato entro un dato schema o contesto per riferirsi a un’opera. @it
label: a pour appellation d’œuvre @fr
definition: Met une œuvre en relation avec un nomen qui est utilisé à l’intérieur d’un schéma ou d’un contexte donnés pour désigner une œuvre. @fr
toolkit label: appellation d’œuvre @fr
toolkit definition: Nomen qui est utilisé à l’intérieur d’un schéma ou d’un contexte donnés pour désigner une œuvre. @fr
label: darba apzīmējums @lv
definition: Sasaista darbu ar nomenu, kas izmantots konkrētā shēmā vai kontekstā, lai atsauktos uz darbu. @lv
toolkit label: darba apzīmējums @lv
toolkit definition: Nomens, kas izmantots konkrētā shēmā vai kontekstā, lai atsauktos uz darbu. @lv
label: 有作品的称谓 @zh-hans
definition: 将一种作品与在一个指定的体系或语境中用于指一种作品的一个命名关联起来。 @zh-hans
toolkit label: 作品的称谓 @zh-hans
toolkit definition: 在一个指定的体系或语境中用于指一种作品的一个命名 @zh-hans
has subproperty: has access point for work
has subproperty: has appellation of work group
has subproperty: has identifier for work
has subproperty: has title of work
has subproperty: P10329
label: eserin unvanı ile ilişkilidir @tr
definition: Bir eseri, belirli bir şema veya bağlam içinde bir esere atıfta bulunmak için kullanılan bir isimle ilişkilendirir. @tr
toolkit label: eserin unvanı @tr
toolkit definition: Belirli bir şema veya bağlam içinde bir eseri ifade etmek için kullanılan bir isim. @tr

has appellation of work group
status: Published
lexical alias: appellationOfWorkGroup.en
definition: Relates a work to a nomen used within a given scheme or context to refer to a work as a member of a work group.
toolkit label: appellation of work group
toolkit definition: A nomen used within a given scheme or context to refer to a work as a member of a work group.
type: Property
domain: C10001
sub property of: has appellation of work
has element type: 3
label: teosryhmän nimitys @fi
definition: Liittää teoksen nomeniin, jota on käytetty tietyssä järjestelmässä tai kontekstissa viittaamaan teokseen teosryhmän jäsenenä. @fi
toolkit label: teosryhmän nimitys @fi
toolkit definition: Nomen, jota on käytetty tietyssä järjestelmässä tai kontekstissa viittaamaan teokseen teosryhmän jäsenenä. @fi
label: har betegnelse for verksgruppe @no
definition: Relaterer et verk til et nomen som brukes innen et gitt skjema eller sammenheng for å referere til et verk som medlem av en verksgruppe. @no
toolkit label: betegnelse for verksgruppe @no
toolkit definition: Et nomen som brukes innen et gitt skjema eller sammenheng for å referere til et verk som medlem av en verksgruppe. @no
label: heeft benaming van werkgroep @nl
definition: Relateert een werk aan een nomen gebruikt binnen een bepaald schema of context om een werk aan te duiden als lid van een werkgroep. @nl
toolkit label: benaming van werkgroep @nl
toolkit definition: Een nomen gebruikt binnen een bepaald schema of context om een werk aan te duiden als lid van een werkgroep. @nl
label: له اسم تعريفي لمجموعة عمل @ar
definition: يربط بين عمل وتسمية مستخدمة ضمن خطة معينة أو سياق معين للإشارة إلى عمل كعضو في مجموعة عمل. @ar
toolkit label: تسمية لمجموعة عمل @ar
toolkit definition: تسمية مستخدمة ضمن خطة معينة أو سياق معين للإشارة إلى عمل كعضو في مجموعة عمل. @ar
label: té com a apel·lació d’un grup d’obres @ca
definition: Relaciona una obra amb un nomen usat en un esquema o un context determinat per referir-se a una obra com un membre d’un grup d’obres. @ca
toolkit label: apel·lació d’un grup d’obres @ca
toolkit definition: Nomen usat en un esquema o un context determinat per referir-se a una obra com un membre d’un grup d’obres. @ca
label: har benævnelse på værkgruppe @da
definition: Relaterer et værk til et nomen, som anvendes inden for et givet skema eller kontekst for at henvise til et værk, som et medlem af en værkgruppe. @da
toolkit label: benævnelse på værkgruppe @da
toolkit definition: Nomen, som anvendes inden for et givet skema eller kontekst for at henvise til et værk, som et medlem af en værkgruppe. @da
label: teoserühma nimetus @et
definition: Seostab teose nomen'iga, mida antud süsteemis või kontekstis kasutatakse viitamiseks teosele kui teoserühma liikmele. @et
toolkit label: teoserühma nimetus @et
toolkit definition: Nomen, mida antud süsteemis või kontekstis kasutatakse viitamiseks teosele kui teoserühma liikmele. @et
label: hat Bezeichnung einer Werkgruppe @de
definition: Setzt ein Werk in Beziehung zu einem Nomen, das in einem bestimmten Schema oder Kontext verwendet wird, um zu einem Werk als Teil einer Werkgruppe zu referenzieren. @de
toolkit label: Bezeichnung einer Werkgruppe @de
toolkit definition: Ein Nomen, das in einem bestimmten Schema oder Kontext verwendet wird, um zu einem Werk als Teil einer Werkgruppe zu referenzieren. @de
label: mű csoportos megnevezése a következő: @hu
definition: Egy művet hozzákapcsol egy adott sémán vagy kontextuson belül használt nomenhez amely egy műcsoport tagjaként utal egy műre. @hu
toolkit label: műcsoport-megnevezés @hu
toolkit definition: Egy adott sémán vagy kontextuson belül használt nomen, amely egy műcsoport tagjaként utal egy műre. @hu
label: ha come denominazione di gruppo di opere @it
definition: Correla un'opera a un nomen utilizzato nell'ambito di un dato schema o contesto, per riferirsi a un'opera come parte di un gruppo di opere. @it
toolkit label: denominazione di gruppo di opere @it
toolkit definition: Nomen utilizzato nell'ambito di un dato schema o contesto, per riferirsi a un'opera come parte di un gruppo di opere. @it
label: a pour appellation de groupe d’œuvres @fr
definition: Met une œuvre en relation avec un nomen qui est utilisé à l’intérieur d’un schéma ou d’un contexte donnés pour désigner une œuvre en tant que membre d’un groupe d’œuvres. @fr
toolkit label: appellation de groupe d’œuvres @fr
toolkit definition: Nomen qui est utilisé à l’intérieur d’un schéma ou d’un contexte donnés pour désigner une œuvre en tant que membre d’un groupe d’œuvres. @fr
label: darba grupas apzīmējums @lv
definition: Sasaista darbu ar nomenu, kas izmantots konkrētā shēmā vai kontekstā, lai atsauktos uz darbu kā darbu sakopumu. @lv
toolkit label: darba grupas apzīmējums @lv
toolkit definition: Nomens, kas izmantots konkrētā shēmā vai kontekstā, lai atsauktos uz darbu kā darbu sakopumu @lv
label: 有作品群的称谓 @zh-hans
definition: 将一种作品与在一个特定的体系或语境中被用来指称作为一个作品群之一个成员的一种作品的一个命名关联起来。 @zh-hans
toolkit label: 作品群的称谓 @zh-hans
toolkit definition: 在一个特定的体系或语境中被用来指称作为一个作品群之一个成员的一种作品的一个命名 @zh-hans
has subproperty: has authorized access point for work group
has subproperty: has identifier for work group
has subproperty: P10399
label: eser grubunun unvanı ile ilişkilidir @tr
definition: Bir eseri, bir eser grubunun bir üyesi olarak bir esere atıfta bulunmak için belirli bir şema veya bağlam içinde kullanılan isimle ilişkilendirir. @tr
toolkit label: eser grubunun unvanı @tr
toolkit definition: Bir eser grubunun bir üyesi olarak bir esere atıfta bulunmak için belirli bir şema veya bağlam içinde kullanılan bir isim. @tr

har indstævnet
status: Deprecated
type: Property
domain: C10001
sub property of: has other agent associated with work (Deprecated)
lexical alias: appellee.en
toolkit label: intimé @fr
toolkit definition: Personne ou collectivité contre laquelle a été formé un appel d’une décision d’un tribunal inférieur enregistrée dans une œuvre juridique d’un tribunal supérieur. @fr
toolkit label: apelado @es
toolkit definition: Una persona o entidad corporativa contra la cual se hace una apelación sobre una decisión de una corte menor registrada en una obra jurídica de una corte superior. @es
instruction number: 18.5
definition: Relaterer et værk til en person eller korporation, mod hvem der er gjort indsigelse over en underrets beslutning, der er registreret i et juridisk værk fra en højere retsinstans. @da
toolkit label: indstævnet @da
toolkit definition: Person eller korporation, mod hvem der er gjort indsigelse over en underrets beslutning, der er registreret i et juridisk værk fra en højere retsinstans. @da
definition: Met une œuvre en relation avec une personne ou une collectivité contre laquelle a été formé un appel d’une décision d’un tribunal inférieur enregistrée dans une œuvre juridique d’un tribunal supérieur. @fr
label: có bên bị kháng @vi
definition: Liên kết tác phẩm với cá nhân hoặc tập thể chống lại người đưa ra kháng cáo trên quyết định của toà án cấp thấp hơn trong tác phẩm luật pháp của toà án cấp cao hơn. @vi
toolkit label: bên bị kháng @vi
toolkit definition: Cá nhân hoặc tập thể chống lại người đưa ra kháng cáo trên quyết định của toà án cấp thấp hơn trong tác phẩm luật pháp của toà án cấp cao hơn. @vi
label: hat Berufungsbeklagter/Revisionsbeklagter @de
definition: Setzt ein Werk mit einer Person oder eine Körperschaft, gegen die Rechtsmittel (Berufung/Revision) gegen ein Gerichtsurteil einer unteren Instanz, das in einem juristischen Werk einer höheren Instanz erfasst ist, eingelegt werden, in Beziehung. @de
toolkit label: Berufungsbeklagter/Revisionsbeklagter @de
toolkit definition: Eine Person oder eine Körperschaft, gegen die Rechtsmittel (Berufung/Revision) gegen ein Gerichtsurteil einer unteren Instanz, das in einem juristischen Werk einer höheren Instanz erfasst ist, eingelegt werden. @de
label: a pour intimé @fr
label: muutoksenhakijan vastapuolena @fi
definition: Liittää teoksen henkilöön tai yhteisöön, jota vastaan muutoksenhaku alemman oikeusasteen päätökseen kohdistuu @fi
toolkit label: muutoksenhakijan vastapuolena @fi
toolkit definition: Henkilö tai yhteisö, jota vastaan muutoksenhaku alemman oikeusasteen päätökseen kohdistuu @fi
toolkit label: appellee @no
toolkit definition: En person eller korporasjon som anker en avgjørelse fra en lavere rettsinstans som er registrert i et juridisk verk fra en høyere rettsinstans. @no
label: té com a apel·lat @ca
definition: Relaciona una obra amb una persona o entitat corporativa contra la qual es recorre en un tribunal superior perquè esmeni la sentència d’un tribunal inferior. @ca
toolkit label: apel·lat @ca
toolkit definition: Persona o entitat corporativa contra la qual es recorre en un tribunal superior perquè esmeni la sentència d’un tribunal inferior. @ca
label: έχει εφεσίβλητο/αναιρεσίβλητο @el
definition: Συνδέει ένα έργο με ένα φυσικό πρόσωπο ή συλλογικό όργανο εναντίον του οποίου ασκείται έφεση εναντίον απόφασης κατώτερου δικαστηρίου, που καταχωρίστηκε στα πρακτικά ενός ανωτέρου δικαστηρίου. @el
toolkit label: εφεσίβλητος/αναιρεσίβλητος @el
toolkit definition: Ένα φυσικό πρόσωπο ή συλλογικό όργανο εναντίον του οποίου ασκείται έφεση εναντίον απόφασης κατώτερου δικαστηρίου, που καταχωρίστηκε στα πρακτικά ενός ανωτέρου δικαστηρίου. @el

has architect agent
status: Published
definition: Relates a work to an agent who is responsible for creating an architectural design, including a pictorial representation intended to show how a building or other structure will look when completed.
type: Property
domain: C10001
sub property of: has creator agent of work
lexical alias: architectAgent.en
toolkit label: architect agent
toolkit definition: An agent who is responsible for creating an architectural design, including a pictorial representation intended to show how a building or other structure will look when completed.
toolkit label: agent architecte @fr
toolkit definition: Agent qui est responsable de la création d’une conception architecturale, y compris une représentation illustrée conçue pour montrer à quoi ressemblera un bâtiment ou une autre structure une fois la construction terminée. @fr
toolkit label: arquitecto @es
toolkit definition: Una persona, familia o entidad corporativa responsable de la creación de un diseño arquitectónico, incluyendo una representación pictórica. que muestra como se verá un edificio a su terminación. @es
instruction number: 18.5
label: har agent, som er arkitekt @da
definition: Relaterer et værk til en agent, som er ansvarlig for et arkitektonisk design, inkl. en billedrepræsentation, som skal vise, hvordan en bygning eller anden struktur vil se ud, når den er færdig. @da
toolkit label: agent, som er arkitekt @da
toolkit definition: Agent, som er ansvarlig for et arkitektonisk design, inkl. en billedrepræsentation, som skal vise, hvordan en bygning eller anden struktur vil se ud, når den er færdig. @da
definition: Met une œuvre en relation avec un agent qui est responsable de la création d’une conception architecturale, y compris une représentation illustrée conçue pour montrer à quoi ressemblera un bâtiment ou une autre structure une fois la construction terminée. @fr
label: có kiến trúc sư @vi
definition: Liên kết tác phẩm với tác nhân có trách nhiệm tạo lập thiết kế kiến trúc, bao gồm cả trình bày bằng tranh để chỉ ra toà nhà sẽ trông như thế nào khi hoàn thành. @vi
toolkit label: kiến trúc sư @vi
toolkit definition: Tác nhân có trách nhiệm tạo lập thiết kế kiến trúc, bao gồm cả trình bày bằng tranh để chỉ ra toà nhà sẽ trông như thế nào khi hoàn thành. @vi
label: hat Architektin/Architekten (Akteur) @de
definition: Setzt ein Werk in Beziehung zu einem Akteur, der für die Schaffung eines architektonischen Entwurfs verantwortlich ist, einschließlich einer bildlichen Darstellung, die zeigt, wie ein Gebäude oder eine andere Konstruktion nach der Fertigstellung aussehen soll. @de
toolkit label: Architektin/Architekt (Akteur) @de
toolkit definition: Ein Akteur, der für die Schaffung eines architektonischen Entwurfs verantwortlich ist, einschließlich einer bildlichen Darstellung, die zeigt, wie ein Gebäude oder eine andere Konstruktion nach der Fertigstellung aussehen soll. @de
label: a pour agent architecte @fr
definition: Liittää teoksen toimijaan, joka on vastuussa arkkitehtisuunnitelman luomisesta, mukaan lukien kuvaesityksestä, jonka tarkoitus on näyttää, miltä rakennus tai muu rakennelma näyttää valmiina. @fi
toolkit label: arkkitehti (toimija) @fi
toolkit definition: Toimija, joka on vastuussa arkkitehtisuunnitelman luomisesta, mukaan lukien kuvaesityksestä, jonka tarkoitus on näyttää, miltä rakennus tai muu rakennelma näyttää valmiina. @fi
toolkit label: arkitekt (agent) @no
toolkit definition: En agent som er ansvarlig for å skape en arkitektonisk utforming, inkludert en gjengivelse i bildeform som er ment å vise hvordan en bygning eller annen struktur vil se ut når den er ferdig. @no
label: té com a agent arquitecte @ca
definition: Relaciona una obra amb un agent que és responsable de la creació d’un disseny arquitectònic, inclosa una representació il·lustrada concebuda per mostrar com serà un edifici o qualsevol altra estructura una vegada complet. @ca
toolkit label: agent arquitecte @ca
toolkit definition: Agent que és responsable de la creació d’un disseny arquitectònic, inclosa una representació il·lustrada concebuda per mostrar com serà un edifici o qualsevol altra estructura una vegada complet. @ca
has element type: 2
label: έχει αρχιτέκτονα @el
definition: Συνδέει ένα έργο με έναν φορέα, υπεύθυνο για τη δημιουργία ενός αρχιτεκτονικού σχεδίου, περιλαμβανομένης μιας οπτικής αναπαράστασης με στόχο να δείξει π.χ., την όψη του κτηρίου όταν αυτό θα έχει ολοκληρωθεί. @el
toolkit label: αρχιτέκτονας @el
toolkit definition: Ένας φορέας υπεύθυνος για τη δημιουργία ενός αρχιτεκτονικού σχεδίου, περιλαμβανομένης μιας οπτικής αναπαράστασης με στόχο να δείξει π.χ., την όψη του κτηρίου όταν αυτό θα έχει ολοκληρωθεί. @el
label: építész ágense a következő: @hu
definition: Hozzákapcsol egy művet egy ágenshez, amely felelős egy építészeti tervért, beleértve egy képi ábrázolást, melynek célja bemutatni, hogy egy épület stb. az elkészülte után hogyan fog kinézni. @hu
toolkit label: építész ágens: @hu
toolkit definition: Egy ágens, amely felelős egy építészeti tervért, beleértve egy képi ábrázolást, melynek célja bemutatni, hogy egy épület stb. az elkészülte után hogyan fog kinézni. @hu
alternative label: architect
alternative label: arkkitehti @fi
label: arkkitehti (toimija) @fi
label: har arkitekt (agent) @no
definition: Relaterer et verk til en agent som er ansvarlig for å skape en arkitektonisk utforming, inkludert en gjengivelse i bildeform som er ment å vise hvordan en bygning eller annen struktur vil se ut når den er ferdig. @no
alternative label: arkitekt @no
label: heeft architect-actor @nl
definition: Relateert een werk aan een actor die verantwoordelijk is voor het creëren van een architectonisch ontwerp, omvattende een picturale representatie bedoeld te laten zien hoe een gebouw of andere structuur er na voltooiing uit zal zien. @nl
toolkit label: architect-actor @nl
toolkit definition: Een actor die verantwoordelijk is voor het creëren van een architectonisch ontwerp, omvattende een picturale representatie bedoeld te laten zien hoe een gebouw of andere structuur er na voltooiing uit zal zien. @nl
alternative label: arquitecte @ca
label: arhitekt (tegija) @et
definition: Seostab teose tegijaga, kes vastutab arhitektuurse kujunduse loomise eest, k.a pildiline esitus, mis näitab, kuidas ehitis või muu konstruktsioon valmides välja hakkab nägema. @et
alternative label: arhitekt @et
toolkit label: arhitekt (tegija) @et
toolkit definition: Tegija, kes vastutab arhitektuurse kujunduse loomise eest, k.a pildiline esitus, mis näitab, kuidas ehitis või muu konstruktsioon valmides välja hakkab nägema. @et
alternative label: építész: @hu
label: ha come architetto agente @it
definition: Correla un'opera a un agente responsabile della creazione di un progetto architettonico inclusa una rappresentazione visiva destinata a mostrare l'aspetto che avrà una costruzione una volta completata. @it
alternative label: architetto @it
toolkit label: architetto agente @it
toolkit definition: Agente responsabile della creazione di un progetto architettonico inclusa una rappresentazione visiva destinata a mostrare l'aspetto che avrà una costruzione una volta completata. @it
alternative label: architecte @fr
label: arhitekts (aģents) @lv
definition: Sasaista darbu ar aģentu, kas ir atbildīgs par arhitektūras projekta radīšanu, ieskaitot projekta skici, lai parādītu, kā ēka vai cita struktūra izskatīsies, kad tā tiks pabeigta. @lv
toolkit label: arhitekts (aģents) @lv
toolkit definition: Aģents, kas ir atbildīgs par arhitektūras projekta radīšanu, ieskaitot projekta skici, lai parādītu, kā ēka vai cita struktūra izskatīsies, kad tā tiks pabeigta. @lv
label: له وكيل مهندس معماري @ar
definition: يربط بين عمل ووكيل مسئول عن إنشاء تصميم معماري، يتضمن تمثيل تصويري يهدف إلى إظهار كيف سيبدو المبنى أو هيكل آخر عند اكتماله. @ar
toolkit label: وكيل مهندس معماري @ar
toolkit definition: وكيل مسئول عن إنشاء تصميم معماري، يتضمن تمثيل تصويري يهدف إلى إظهار كيف سيبدو المبنى أو هيكل آخر عند اكتماله. @ar
alternative label: مهندس معماري @ar
alternative label: Architekt @de
alternative label: 建筑师 @zh-hans
toolkit label: 建筑师行为者 @zh-hans

has architect collective agent
status: Published
lexical alias: architectCollectiveAgent.en
definition: Relates a work to a collective agent who is responsible for creating an architectural design, including a pictorial representation intended to show how a building or other structure will look when completed.
toolkit label: architect collective agent
toolkit definition: A collective agent who is responsible for creating an architectural design, including a pictorial representation intended to show how a building or other structure will look when completed.
type: Property
domain: C10001
has element type: 2
sub property of: has creator collective agent of work
sub property of: has architect agent
label: arkkitehti (yhteistoimija) @fi
definition: Liittää teoksen yhteistoimijaan, joka on vastuussa arkkitehtisuunnitelman luomisesta, mukaan lukien kuvaesityksestä, jonka tarkoitus on näyttää, miltä rakennus tai muu rakennelma näyttää valmiina. @fi
toolkit label: arkkitehti (yhteistoimija) @fi
toolkit definition: Yhteistoimija, joka on vastuussa arkkitehtisuunnitelman luomisesta, mukaan lukien kuvaesityksestä, jonka tarkoitus on näyttää, miltä rakennus tai muu rakennelma näyttää valmiina. @fi
label: har arkitekt (kollektiv agent) @no
definition: Relaterer et verk til en kollektiv agent som er ansvarlig for å skape en arkitektonisk utforming, inkludert en gjengivelse i bildeform som er ment å vise hvordan en bygning eller annen struktur vil se ut når den er ferdig. @no
toolkit label: arkitekt (kollektiv agent) @no
toolkit definition: En kollektiv agent som er ansvarlig for å skape en arkitektonisk utforming, inkludert en gjengivelse i bildeform som er ment å vise hvordan en bygning eller annen struktur vil se ut når den er ferdig. @no
label: heeft architect-collectieve actor @nl
definition: Relateert een werk aan een collectieve actor die verantwoordelijk is voor het creëren van een architectonisch ontwerp, omvattende een picturale representatie bedoeld te laten zien hoe een gebouw of andere structuur er na voltooiing uit zal zien. @nl
toolkit label: architect-collectieve actor @nl
toolkit definition: Een collectieve actor die verantwoordelijk is voor het creëren van een architectonisch ontwerp, omvattende een picturale representatie bedoeld te laten zien hoe een gebouw of andere structuur er na voltooiing uit zal zien. @nl
label: له وكيل جماعي مهندس معماري @ar
definition: يربط بين عمل ووكيل جماعي مسئول عن إنشاء تصميم معماري، بما في ذلك التمثيل التصويري الذي يهدف إلى إظهار كيف سيبدو المبنى أو هيكل آخر عند اكتماله. @ar
toolkit label: وكيل جماعي مهندس معماري @ar
toolkit definition: وكيل جماعي مسئول عن إنشاء تصميم معماري، بما في ذلك التمثيل التصويري الذي يهدف إلى إظهار كيف سيبدو المبنى أو هيكل آخر عند اكتماله. @ar
label: té com a agent col·lectiu arquitecte @ca
definition: Relaciona una obra amb un agent col·lectiu que és responsable de la creació d’un disseny arquitectònic, inclosa una representació il·lustrada concebuda per mostrar com serà un edifici o qualsevol altra estructura una vegada complet. @ca
toolkit label: agent col·lectiu arquitecte @ca
toolkit definition: Agent col·lectiu que és responsable de la creació d’un disseny arquitectònic, inclosa una representació il·lustrada concebuda per mostrar com serà un edifici o qualsevol altra estructura una vegada complet. @ca
label: har kollektiv agent, som er arkitekt @da
definition: Relaterer et værk til en kollektiv agent, som er ansvarlig for et arkitektonisk design, inkl. en billedrepræsentation, som skal vise, hvordan en bygning eller anden struktur vil se ud, når den er færdig. @da
toolkit label: kollektiv agent, som er arkitekt @da
toolkit definition: Kollektiv agent, som er ansvarlig for et arkitektonisk design, inkl. en billedrepræsentation, som skal vise, hvordan en bygning eller anden struktur vil se ud, når den er færdig. @da
label: arhitekt (kollektiiv) @et
definition: Seostab teose kollektiiviga, kes vastutab arhitektuurse kujunduse loomise eest, k.a pildiline esitus, mis näitab, kuidas ehitis või muu konstruktsioon valmides välja hakkab nägema. @et
toolkit label: arhitekt (kollektiiv) @et
toolkit definition: Kollektiiv, kes vastutab arhitektuurse kujunduse loomise eest, k.a pildiline esitus, mis näitab, kuidas ehitis või muu konstruktsioon valmides välja hakkab nägema. @et
label: hat Architektin/Architekten (Gemeinschaftlicher Akteur) @de
definition: Setzt ein Werk in Beziehung zu einem gemeinschaftlichen Akteur, der für die Schaffung eines architektonischen Entwurfs verantwortlich ist, einschließlich einer bildlichen Darstellung die zeigt, wie ein Gebäude oder eine andere Konstruktion nach der Fertigstellung aussehen soll. @de
toolkit label: Architektin/Architekt (Gemeinschaftlicher Akteur) @de
toolkit definition: Ein gemeinschaftlicher Akteur, der für die Schaffung eines architektonischen Entwurfs verantwortlich ist, einschließlich einer bildlichen Darstellung die zeigt, wie ein Gebäude oder eine andere Konstruktion nach der Fertigstellung aussehen soll. @de
label: építész kollektív ágense a következő: @hu
definition: Hozzákapcsol egy művet egy kollektív ágenshez, amely felelős egy építészeti tervért, beleértve egy képi ábrázolást, melynek célja bemutatni, hogy egy épület stb. az elkészülte után hogyan fog kinézni. @hu
toolkit label: építész kollektív ágens: @hu
toolkit definition: Egy kollektív ágens, amely felelős egy építészeti tervért, beleértve egy képi ábrázolást, melynek célja bemutatni, hogy egy épület stb. az elkészülte után hogyan fog kinézni. @hu
label: ha come architetto agente collettivo @it
definition: Correla un'opera all'agente collettivo responsabile di un progetto architettonico, compresa una rappresentazione visiva destinata a mostrare l'aspetto che avrà una costruzione o altra struttura, una volta completata. @it
toolkit label: architetto agente collettivo @it
toolkit definition: Agente collettivo, responsabile di un progetto architettonico, compresa una rappresentazione visiva destinata a mostrare l'aspetto che avrà una costruzione o altra struttura, una volta completata. @it
label: a pour agent collectif architecte @fr
definition: Met une œuvre en relation avec un agent collectif qui est responsable de la création d’une conception architecturale, y compris une représentation illustrée conçue pour montrer à quoi ressemblera un bâtiment ou une autre structure une fois la construction terminée. @fr
toolkit label: agent collectif architecte @fr
toolkit definition: Agent collectif qui est responsable de la création d’une conception architecturale, y compris une représentation illustrée conçue pour montrer à quoi ressemblera un bâtiment ou une autre structure une fois la construction terminée. @fr
label: arhitekts (grupa) @lv
definition: Sasaista darbu ar grupu, kas ir atbildīga par arhitektūras projekta radīšanu, ieskaitot projekta skici, lai parādītu, kā ēka vai cita struktūra izskatīsies, kad tā tiks pabeigta. @lv
toolkit label: arhitekts (grupa) @lv
toolkit definition: Grupa, kas ir atbildīga par arhitektūras projekta radīšanu, ieskaitot projekta skici, lai parādītu, kā ēka vai cita struktūra izskatīsies, kad tā tiks pabeigta. @lv
label: 有建筑师集体行为者 @zh-hans
definition: 将一种作品与负责创建建筑设计（包括用于展示建筑或其他结构完成之后外观效果的绘画作品）的一个集体行为者关联起来。 @zh-hans
toolkit label: 建筑师集体行为者 @zh-hans
toolkit definition: 负责创建建筑设计（包括用于展示建筑或其他结构完成之后外观效果的绘画作品）的一个集体行为者 @zh-hans
has subproperty: has architect corporate body
has subproperty: has architect family
has subproperty: has landscape architect collective agent
has subproperty: P10485
label: mimar kolektif temsilci ile ilişkilidir @tr
definition: Bir eseri, bir binanın veya diğer bir yapının tamamlandığında nasıl görüneceğini göstermeyi amaçlayan resimsel bir temsil de dahil olmak üzere mimari bir tasarım oluşturmaktan sorumlu olan kolektif bir temsilci ile ilişkilendirir. @tr
toolkit label: mimar kolektif temsilci @tr
toolkit definition: Tamamlanmış halde bir binanın veya diğer bir yapının nasıl görüneceğini göstermek amacıyla yapılan resimsel bir temsili içeren mimari tasarımın oluşturulmasından sorumlu olan bir kolektif temsilci @tr

has architect corporate body
status: Published
lexical alias: architectCorporateBody.en
definition: Relates a work to a corporate body who is responsible for creating an architectural design, including a pictorial representation intended to show how a building or other structure will look when completed.
toolkit label: architect corporate body
toolkit definition: A corporate body who is responsible for creating an architectural design, including a pictorial representation intended to show how a building or other structure will look when completed.
type: Property
domain: C10001
has element type: 2
sub property of: has creator corporate body of work
sub property of: has architect collective agent
label: arkkitehti (yhteisö) @fi
definition: Liittää teoksen yhteisöön, joka on vastuussa arkkitehtisuunnitelman luomisesta, mukaan lukien kuvaesityksestä, jonka tarkoitus on näyttää, miltä rakennus tai muu rakennelma näyttää valmiina. @fi
toolkit label: arkkitehti (yhteisö) @fi
toolkit definition: Yhteisö, joka on vastuussa arkkitehtisuunnitelman luomisesta, mukaan lukien kuvaesityksestä, jonka tarkoitus on näyttää, miltä rakennus tai muu rakennelma näyttää valmiina. @fi
label: har arkitekt (korporasjon) @no
definition: Relaterer et verk til en korporasjon som er ansvarlig for å skape en arkitektonisk utforming, inkludert en gjengivelse i bildeform som er ment å vise hvordan en bygning eller annen struktur vil se ut når den er ferdig. @no
toolkit label: arkitekt (korporasjon) @no
toolkit definition: En korporasjon som er ansvarlig for å skape en arkitektonisk utforming, inkludert en gjengivelse i bildeform som er ment å vise hvordan en bygning eller annen struktur vil se ut når den er ferdig. @no
label: heeft architect-corporatie @nl
definition: Relateert een werk aan een corporatie die verantwoordelijk is voor het creëren van een architectonisch ontwerp, omvattende een picturale representatie bedoeld te laten zien hoe een gebouw of andere structuur er na voltooiing uit zal zien. @nl
toolkit label: architect-corporatie @nl
toolkit definition: Een corporatie die verantwoordelijk is voor het creëren van een architectonisch ontwerp, omvattende een picturale representatie bedoeld te laten zien hoe een gebouw of andere structuur er na voltooiing uit zal zien. @nl
label: له هيئة مهندسة معمارية @ar
definition: يربط بين عمل وهيئة مسئولة عن إنشاء تصميم معماري، بما في ذلك التمثيل التصويري الذي يهدف إلى إظهار كيف سيبدو المبنى أو هيكل آخر عند اكتماله. @ar
toolkit label: هيئة مهندسة معمارية @ar
toolkit definition: هيئة مسئولة عن إنشاء تصميم معماري، بما في ذلك التمثيل التصويري الذي يهدف إلى إظهار كيف سيبدو المبنى أو هيكل آخر عند اكتماله. @ar
label: té com a entitat corporativa arquitecta @ca
definition: Relaciona una obra amb una entitat corporativa que és responsable de la creació d’un disseny arquitectònic, inclosa una representació il·lustrada concebuda per mostrar com serà un edifici o qualsevol altra estructura una vegada complet. @ca
toolkit label: entitat corporativa arquitecta @ca
toolkit definition: Entitat corporativa que és responsable de la creació d’un disseny arquitectònic, inclosa una representació il·lustrada concebuda per mostrar com serà un edifici o qualsevol altra estructura una vegada complet. @ca
label: har korporation, som er arkitekt @da
definition: Relaterer et værk til en korporation, som er ansvarlig for et arkitektonisk design, inkl. en billedrepræsentation, som skal vise, hvordan en bygning eller anden struktur vil se ud, når den er færdig. @da
toolkit label: korporation, som er arkitekt @da
toolkit definition: Korporation, som er ansvarlig for et arkitektonisk design, inkl. en billedrepræsentation, som skal vise, hvordan en bygning eller anden struktur vil se ud, når den er færdig. @da
label: arhitekt (asutus) @et
definition: Seostab teose asutusega, kes vastutab arhitektuurse kujunduse loomise eest, k.a pildiline esitus, mis näitab, kuidas ehitis või muu konstruktsioon valmides välja hakkab nägema. @et
toolkit label: arhitekt (asutus) @et
toolkit definition: Asutus, kes vastutab arhitektuurse kujunduse loomise eest, k.a pildiline esitus, mis näitab, kuidas ehitis või muu konstruktsioon valmides välja hakkab nägema. @et
label: hat Architektin/Architekten (Körperschaft) @de
definition: Setzt ein Werk in Beziehung zu einer Körperschaft, die für die Schaffung eines architektonischen Entwurfs verantwortlich ist, einschließlich einer bildlichen Darstellung die zeigt, wie ein Gebäude oder eine andere Konstruktion nach der Fertigstellung aussehen soll. @de
toolkit label: Architektin/Architekt (Körperschaft) @de
toolkit definition: Eine Körperschaft, die für die Schaffung eines architektonischen Entwurfs verantwortlich ist, einschließlich einer bildlichen Darstellung die zeigt, wie ein Gebäude oder eine andere Konstruktion nach der Fertigstellung aussehen soll. @de
label: építész testülete a következő: @hu
definition: Hozzákapcsol egy művet egy testülethez, amely felelős egy építészeti tervért, beleértve egy képi ábrázolást, melynek célja bemutatni, hogy egy épület stb. az elkészülte után hogyan fog kinézni. @hu
scope note: á @hu
toolkit label: építész testület: @hu
toolkit definition: Egy testület, amely felelős egy építészeti tervért, beleértve egy képi ábrázolást, melynek célja bemutatni, hogy egy épület stb. az elkészülte után hogyan fog kinézni. @hu
label: ha come architetto ente @it
definition: Correla un'opera a un ente responsabile di un progetto architettonico, compresa una rappresentazione visiva destinata a mostrare l'aspetto che avrà una costruzione o altra struttura, una volta completata. @it
toolkit label: architetto ente @it
toolkit definition: Ente responsabile di un progetto architettonico, compresa una rappresentazione visiva destinata a mostrare l'aspetto che avrà una costruzione o altra struttura, una volta completata. @it
label: a pour collectivité architecte @fr
definition: Met une œuvre en relation avec une collectivité qui est responsable de la création d’une conception architecturale, y compris une représentation illustrée conçue pour montrer à quoi ressemblera un bâtiment ou une autre structure une fois la construction terminée. @fr
toolkit label: collectivité architecte @fr
toolkit definition: Collectivité qui est responsable de la création d’une conception architecturale, y compris une représentation illustrée conçue pour montrer à quoi ressemblera un bâtiment ou une autre structure une fois la construction terminée. @fr
label: arhitekts (institūcija) @lv
definition: Sasaista darbu ar institūciju, kas ir atbildīga par arhitektūras projekta radīšanu, ieskaitot projekta skici, lai parādītu, kā ēka vai cita struktūra izskatīsies, kad tā tiks pabeigta. @lv
toolkit label: arhitekts (institūcija) @lv
toolkit definition: Institūcija, kas ir atbildīga par arhitektūras projekta radīšanu, ieskaitot projekta skici, lai parādītu, kā ēka vai cita struktūra izskatīsies, kad tā tiks pabeigta. @lv
label: 有建筑师团体 @zh-hans
definition: 将一种作品与负责创建建筑设计（包括用于展示建筑或其他结构完成之后外观效果的绘画作品）的一个团体关联起来。 @zh-hans
toolkit label: 建筑师团体 @zh-hans
toolkit definition: 负责创建建筑设计（包括用于展示建筑或其他结构完成之后外观效果的绘画作品）的一个团体 @zh-hans
has subproperty: has landscape architect corporate body
has subproperty: P10532
label: mimar tüzel kişi ile ilişkilidir @tr
definition: Bir eseri, bir binanın veya diğer bir yapının tamamlandığında nasıl görüneceğini göstermeyi amaçlayan resimsel bir temsil de dahil olmak üzere mimari bir tasarımın oluşturulmasından sorumlu olan tüzel kişi ile ilişkilendirir. @tr
toolkit label: mimar tüzel kişi @tr
toolkit definition: Bir binanın veya başka bir yapının tamamlandığında nasıl görüneceğini göstermeyi amaçlayan resimli bir sunum da dahil olmak üzere mimari bir tasarım oluşturmaktan sorumlu olan bir tüzel kişi. @tr

has architect family
status: Published
lexical alias: architectFamily.en
definition: Relates a work to a family who is responsible for creating an architectural design, including a pictorial representation intended to show how a building or other structure will look when completed.
toolkit label: architect family
toolkit definition: A family who is responsible for creating an architectural design, including a pictorial representation intended to show how a building or other structure will look when completed.
type: Property
domain: C10001
has element type: 2
sub property of: has creator family of work
sub property of: has architect collective agent
label: arkkitehti (suku) @fi
definition: Liittää teoksen sukuun, joka on vastuussa arkkitehtisuunnitelman luomisesta, mukaan lukien kuvaesityksestä, jonka tarkoitus on näyttää, miltä rakennus tai muu rakennelma näyttää valmiina. @fi
toolkit label: arkkitehti (suku) @fi
toolkit definition: Suku, joka on vastuussa arkkitehtisuunnitelman luomisesta, mukaan lukien kuvaesityksestä, jonka tarkoitus on näyttää, miltä rakennus tai muu rakennelma näyttää valmiina. @fi
label: har arkitekt (familie) @no
definition: Relaterer et verk til en familie som er ansvarlig for å skape en arkitektonisk utforming, inkludert en gjengivelse i bildeform som er ment å vise hvordan en bygning eller annen struktur vil se ut når den er ferdig. @no
toolkit label: arkitekt (familie) @no
toolkit definition: En familie som er ansvarlig for å skape en arkitektonisk utforming, inkludert en gjengivelse i bildeform som er ment å vise hvordan en bygning eller annen struktur vil se ut når den er ferdig. @no
label: heeft architect-familie @nl
definition: Relateert een werk aan een familie die verantwoordelijk is voor het creëren van een architectonisch ontwerp, omvattende een picturale representatie bedoeld te laten zien hoe een gebouw of andere structuur er na voltooiing uit zal zien. @nl
toolkit label: architect-familie @nl
toolkit definition: Een familie die verantwoordelijk is voor het creëren van een architectonisch ontwerp, omvattende een picturale representatie bedoeld te laten zien hoe een gebouw of andere structuur er na voltooiing uit zal zien. @nl
label: له عائلة مهندسة معمارية @ar
definition: يربط بين عمل وعائلة مسئولة عن إنشاء تصميم معماري، بما في ذلك تمثيل تصويري يهدف إلى إظهار كيف سيبدو المبنى أو هيكل آخر عند اكتماله. @ar
toolkit label: عائلة مهندسة معمارية @ar
toolkit definition: عائلة مسئولة عن إنشاء تصميم معماري، بما في ذلك تمثيل تصويري يهدف إلى إظهار كيف سيبدو المبنى أو هيكل آخر عند اكتماله. @ar
label: té com a família arquitecta @ca
definition: Relaciona una obra amb una família que és responsable de la creació d’un disseny arquitectònic, inclosa una representació il·lustrada concebuda per mostrar com serà un edifici o qualsevol altra estructura una vegada complet. @ca
toolkit label: família arquitecta @ca
toolkit definition: Família que és responsable de la creació d’un disseny arquitectònic, inclosa una representació il·lustrada concebuda per mostrar com serà un edifici o qualsevol altra estructura una vegada complet. @ca
label: har familie, som er arkitekt @da
definition: Relaterer et værk til en familie, som er ansvarlig for et arkitektonisk design, inkl. en billedrepræsentation, som skal vise, hvordan en bygning eller anden struktur vil se ud, når den er færdig. @da
toolkit label: familie, som er arkitekt @da
toolkit definition: Familie, som er ansvarlig for et arkitektonisk design, inkl. en billedrepræsentation, som skal vise, hvordan en bygning eller anden struktur vil se ud, når den er færdig. @da
label: arhitekt (perekond) @et
definition: Seostab teose perekonnaga, kes vastutab arhitektuurse kujunduse loomise eest, k.a pildiline esitus, mis näitab, kuidas ehitis või muu konstruktsioon valmides välja hakkab nägema. @et
toolkit label: arhitekt (perekond) @et
toolkit definition: Perekond, kes vastutab arhitektuurse kujunduse loomise eest, k.a pildiline esitus, mis näitab, kuidas ehitis või muu konstruktsioon valmides välja hakkab nägema. @et
label: hat Architektin/Architekten (Familie) @de
definition: Setzt ein Werk in Beziehung zu einer Familie, die für die Schaffung eines architektonischen Entwurfs verantwortlich ist, einschließlich einer bildlichen Darstellung, die zeigt, wie ein Gebäude oder eine andere Konstruktion nach der Fertigstellung aussehen soll. @de
toolkit label: Architektin/Architekt (Familie) @de
toolkit definition: Eine Familie, die für die Schaffung eines architektonischen Entwurfs verantwortlich ist, einschließlich einer bildlichen Darstellung, die zeigt, wie ein Gebäude oder eine andere Konstruktion nach der Fertigstellung aussehen soll. @de
label: építész családja a következő: @hu
definition: Hozzákapcsol egy művet egy családhoz, amely felelős egy építészeti tervért, beleértve egy képi ábrázolást, melynek célja bemutatni, hogy egy épület stb. az elkészülte után hogyan fog kinézni. @hu
toolkit label: építész család. @hu
toolkit definition: Egy család, amely felelős egy építészeti tervért, beleértve egy képi ábrázolást, melynek célja bemutatni, hogy egy épület stb. az elkészülte után hogyan fog kinézni. @hu
label: ha come architetto famiglia @it
definition: Correla un'opera alla famiglia responsabile di un progetto architettonico, compresa una rappresentazione visiva destinata a mostrare l'aspetto che avrà una costruzione o altra struttura, una volta completata. @it
toolkit label: architetto famiglia @it
toolkit definition: Famiglia responsabile di un progetto architettonico, compresa una rappresentazione visiva destinata a mostrare l'aspetto che avrà una costruzione o altra struttura, una volta completata. @it
label: a pour famille architecte @fr
definition: Met une œuvre en relation avec une famille qui est responsable de la création d’une conception architecturale, y compris une représentation illustrée conçue pour montrer à quoi ressemblera un bâtiment ou une autre structure une fois la construction terminée. @fr
toolkit label: famille architecte @fr
toolkit definition: Famille qui est responsable de la création d’une conception architecturale, y compris une représentation illustrée conçue pour montrer à quoi ressemblera un bâtiment ou une autre structure une fois la construction terminée. @fr
label: arhitekts (dzimta/ģimene) @lv
definition: Sasaista darbu ar dzimtu/ģimeni, kas ir atbildīga par arhitektūras projekta radīšanu, ieskaitot projekta skici, lai parādītu, kā ēka vai cita struktūra izskatīsies, kad tā tiks pabeigta. @lv
toolkit label: arhitekts (dzimta/ģimene) @lv
toolkit definition: Dzimta/ģimene, kas ir atbildīga par arhitektūras projekta radīšanu, ieskaitot projekta skici, lai parādītu, kā ēka vai cita struktūra izskatīsies, kad tā tiks pabeigta. @lv
label: 有建筑师家族 @zh-hans
definition: 将一种作品与负责创建建筑设计（包括用于展示建筑或其他结构完成之后外观效果的绘画作品）的一个家族关联起来。 @zh-hans
toolkit label: 建筑师家族 @zh-hans
toolkit definition: 负责创建建筑设计（包括用于展示建筑或其他结构完成之后外观效果的绘画作品）的一个家族 @zh-hans
has subproperty: has landscape architect family
has subproperty: P10579
label: mimar aile ile ilişkilidir @tr
definition: Bir eseri, bir binanın veya diğer bir yapının tamamlandığında nasıl görüneceğini göstermeyi amaçlayan resimli bir temsil de dahil olmak üzere mimari bir tasarımın oluşturulmasından sorumlu olan bir aileyle ilişkilendirir. @tr
toolkit label: mimar aile @tr
toolkit definition: Bir binanın veya başka bir yapının tamamlandığında nasıl görüneceğini göstermeyi amaçlayan resimli bir sunum da dahil olmak üzere mimari bir tasarım oluşturmaktan sorumlu bir aile. @tr

has architect person
status: Published
lexical alias: architectPerson.en
definition: Relates a work to a person who is responsible for creating an architectural design, including a pictorial representation intended to show how a building or other structure will look when completed.
toolkit label: architect person
toolkit definition: A person who is responsible for creating an architectural design, including a pictorial representation intended to show how a building or other structure will look when completed.
type: Property
domain: C10001
has element type: 2
sub property of: has creator person of work
sub property of: has architect agent
label: arkkitehti (henkilö) @fi
definition: Liittää teoksen henkilöön, joka on vastuussa arkkitehtisuunnitelman luomisesta, mukaan lukien kuvaesityksestä, jonka tarkoitus on näyttää, miltä rakennus tai muu rakennelma näyttää valmiina. @fi
toolkit label: arkkitehti (henkilö) @fi
toolkit definition: Henkilö, joka on vastuussa arkkitehtisuunnitelman luomisesta, mukaan lukien kuvaesityksestä, jonka tarkoitus on näyttää, miltä rakennus tai muu rakennelma näyttää valmiina. @fi
label: har arkitekt (person) @no
definition: Relaterer et verk til en person som er ansvarlig for å skape en arkitektonisk utforming, inkludert en gjengivelse i bildeform som er ment å vise hvordan en bygning eller annen struktur vil se ut når den er ferdig. @no
toolkit label: arkitekt (person) @no
toolkit definition: En person som er ansvarlig for å skape en arkitektonisk utforming, inkludert en gjengivelse i bildeform som er ment å vise hvordan en bygning eller annen struktur vil se ut når den er ferdig. @no
label: heeft architect-persoon @nl
definition: Relateert een werk aan een persoon die verantwoordelijk is voor het creëren van een architectonisch ontwerp, omvattende een picturale representatie bedoeld te laten zien hoe een gebouw of andere structuur er na voltooiing uit zal zien. @nl
toolkit label: architect-persoon @nl
toolkit definition: Een persoon die verantwoordelijk is voor het creëren van een architectonisch ontwerp, omvattende een picturale representatie bedoeld te laten zien hoe een gebouw of andere structuur er na voltooiing uit zal zien. @nl
label: له شخص مهندس معماري @ar
definition: يربط بين عمل وشخص مسئول عن إنشاء تصميم معماري، بما في ذلك تمثيل مصور يهدف إلى إظهار كيف سيبدو المبنى أو هيكل آخر عند اكتماله. @ar
toolkit label: شخص مهندس معماري @ar
toolkit definition: شخص مسئول عن إنشاء تصميم معماري، بما في ذلك تمثيل مصور يهدف إلى إظهار كيف سيبدو المبنى أو هيكل آخر عند اكتماله. @ar
label: té com a persona arquitecta @ca
definition: Relaciona una obra amb una persona que és responsable de la creació d’un disseny arquitectònic, inclosa una representació il·lustrada concebuda per mostrar com serà un edifici o qualsevol altra estructura una vegada complet. @ca
toolkit label: persona arquitecta @ca
toolkit definition: Persona que és responsable de la creació d’un disseny arquitectònic, inclosa una representació il·lustrada concebuda per mostrar com serà un edifici o qualsevol altra estructura una vegada complet. @ca
label: har person, som er arkitekt @da
definition: Relaterer et værk til en person, som er ansvarlig for et arkitektonisk design, inkl. en billedrepræsentation, som skal vise, hvordan en bygning eller anden struktur vil se ud, når den er færdig. @da
toolkit label: person, som er arkitekt @da
toolkit definition: Person, som er ansvarlig for et arkitektonisk design, inkl. en billedrepræsentation, som skal vise, hvordan en bygning eller anden struktur vil se ud, når den er færdig. @da
label: arhitekt (isik) @et
definition: Seostab teose isikuga, kes vastutab arhitektuurse kujunduse loomise eest, k.a pildiline esitus, mis näitab, kuidas ehitis või muu konstruktsioon valmides välja hakkab nägema. @et
toolkit label: arhitekt (isik) @et
toolkit definition: Isik, kes vastutab arhitektuurse kujunduse loomise eest, k.a pildiline esitus, mis näitab, kuidas ehitis või muu konstruktsioon valmides välja hakkab nägema. @et
label: hat Architektin/Architekten (Person) @de
definition: Setzt ein Werk in Beziehung zu einer Person, die für die Schaffung eines architektonischen Entwurfs verantwortlich ist, einschließlich einer bildlichen Darstellung, die zeigt, wie ein Gebäude oder eine andere Konstruktion nach der Fertigstellung aussehen soll. @de
toolkit label: Architektin/Architekt (Person) @de
toolkit definition: Eine Person, die für die Schaffung eines architektonischen Entwurfs verantwortlich ist, einschließlich einer bildlichen Darstellung, die zeigt, wie ein Gebäude oder eine andere Konstruktion nach der Fertigstellung aussehen soll. @de
label: ha come architetto persona @it
definition: Correla un'opera alla persona responsabile di un progetto architettonico, inclusa una rappresentazione visiva destinata a mostrare l'aspetto che avrà una costruzione o altra struttura una volta completata. @it
toolkit label: architetto persona @it
toolkit definition: Persona responsabile di un progetto architettonico, inclusa una rappresentazione visiva destinata a mostrare l'aspetto che avrà una costruzione o altra struttura una volta completata. @it
label: a pour personne architecte @fr
definition: Met une œuvre en relation avec une personne qui est responsable de la création d’une conception architecturale, y compris une représentation illustrée conçue pour montrer à quoi ressemblera un bâtiment ou une autre structure une fois la construction terminée. @fr
toolkit label: personne architecte @fr
toolkit definition: Personne qui est responsable de la création d’une conception architecturale, y compris une représentation illustrée conçue pour montrer à quoi ressemblera un bâtiment ou une autre structure une fois la construction terminée. @fr
label: arhitekts (persona) @lv
definition: Sasaista darbu ar personu, kura ir atbildīga par arhitektūras projekta radīšanu, ieskaitot projekta skici, lai parādītu, kā ēka vai cita struktūra izskatīsies, kad tā tiks pabeigta. @lv
toolkit label: arhitekts (persona) @lv
toolkit definition: Persona, kura ir atbildīga par arhitektūras projekta radīšanu, ieskaitot projekta skici, lai parādītu, kā ēka vai cita struktūra izskatīsies, kad tā tiks pabeigta. @lv
label: 有建筑师个人 @zh-hans
definition: 将一种作品与负责创建建筑设计（包括用于展示建筑或其他结构完成之后外观效果的绘画作品）的一个个人关联起来。 @zh-hans
toolkit label: 建筑师个人 @zh-hans
toolkit definition: 负责创建建筑设计（包括用于展示建筑或其他结构完成之后外观效果的绘画作品）的一个个人 @zh-hans
label: építész személye a következő: @hu
definition: Hozzákapcsol egy művet egy személyhez, aki felelős egy építészeti tervért, beleértve egy képi ábrázolást, melynek célja bemutatni, hogy egy épület stb. az elkészülte után hogyan fog kinézni. @hu
toolkit label: építész személy: @hu
toolkit definition: Egy személy, aki felelős egy építészeti tervért, beleértve egy képi ábrázolást, melynek célja bemutatni, hogy egy épület stb. az elkészülte után hogyan fog kinézni. @hu
has subproperty: has landscape architect person
has subproperty: P10438
label: mimar kişi ile ilişkilidir @tr
definition: Bir eseri, bir binanın veya başka bir yapının tamamlandığında nasıl görüneceğini göstermeyi amaçlayan resimli bir temsil de dahil olmak üzere, bir mimari tasarım oluşturmaktan sorumlu olan bir kişiyle ilişkilendirir. @tr
toolkit label: mimar kişi @tr
toolkit definition: Bir binanın veya başka bir yapının tamamlandığında nasıl görüneceğini göstermeyi amaçlayan resimli bir sunum da dahil olmak üzere bir mimari tasarım oluşturmaktan sorumlu olan kişi. @tr

has artist agent
status: Published
definition: Relates a work to an agent who is responsible for creating an original graphic design, drawing, painting, etc.
type: Property
domain: C10001
sub property of: has creator agent of work
lexical alias: artistAgent.en
toolkit label: artist agent
toolkit definition: An agent who is responsible for creating an original graphic design, drawing, painting, etc.
toolkit label: agent artiste @fr
toolkit definition: Agent qui est responsable de la création d’un graphisme, d’une peinture, d’un dessin, etc. original. @fr
toolkit label: artista @es
toolkit definition: Una persona, familia o entidad corporativa responsable de la creación de una obra mediante la concepción, y a menudo la ejecución de un diseño gráfico, un dibujo, una pintura, etc. originales. @es
instruction number: 18.5
label: har agent, som er kunstner @da
definition: Relaterer et værk til en agent, som er ansvarlig for at skabe et originalt grafisk design, -tegning, -maleri etc. @da
toolkit label: agent, som er kunstner @da
toolkit definition: Agent, som er ansvarlig for at skabe et originalt grafisk design, -tegning, -maleri etc. @da
definition: Met une œuvre en relation avec un agent qui est responsable de la création d’un graphisme, d’une peinture, d’un dessin, etc. original. @fr
label: có nghệ sỹ @vi
definition: Liên kết tác phẩm với tác nhân có trách nhiệm tạo lập tác phẩm bằng cách tưởng tượng, và thường thực hiện thiết kế, vẽ, hoạ, v.v...thiết kế đồ hình nguyên gốc. @vi
toolkit label: nghệ sỹ @vi
toolkit definition: Tác nhân có trách nhiệm tạo lập tác phẩm bằng cách tưởng tượng, và thường thực hiện thiết kế, vẽ, hoạ, v.v...thiết kế đồ hình nguyên gốc. @vi
label: hat Künstlerin/Künstler (Akteur) @de
definition: Setzt ein Werk in Beziehung zu einem Akteur, der für die Schaffung einer originalen grafischen Gestaltung, einer Zeichnung, eines Gemäldes und so weiter verantwortlich ist. @de
toolkit label: Künstlerin/Künstler (Akteur) @de
toolkit definition: Ein Akteur, der für die Schaffung einer originalen grafischen Gestaltung, einer Zeichnung, eines Gemäldes und so weiter verantwortlich ist. @de
label: a pour agent artiste @fr
definition: Liittää teoksen toimijaan, joka on vastuussa alkuperäisen graafisen suunnitelman, piirroksen, maalauksen tms. luomisesta. @fi
toolkit label: taiteilija (toimija) @fi
toolkit definition: Toimija, joka on vastuussa alkuperäisen graafisen suunnitelman, piirroksen, maalauksen tms. luomisesta. @fi
toolkit label: kunstner (agent) @no
toolkit definition: En agent som er ansvarlig for å skape et originalt grafisk design, en tegning, et maleri etc. @no
label: té com a agent artista @ca
definition: Relaciona una obra amb un agent que és responsable de la creació d’un disseny gràfic, un dibuix, una pintura, etc., original. @ca
toolkit label: agent artista @ca
toolkit definition: Agent que és responsable de la creació d’un disseny gràfic, un dibuix, una pintura, etc., original. @ca
has element type: 2
label: έχει καλλιτέχνη @el
definition: Συνδέει ένα έργο με έναν φορέα υπεύθυνο για τη δημιουργία ενός έργου μέσω της σύλληψης και συχνά της εφαρμογής ενός πρωτότυπου γραφικού σχεδίου, σκίτσου, πίνακα ζωγραφικής κ.λπ. @el
toolkit label: καλλιτέχνης @el
toolkit definition: Ένας φορέας υπεύθυνος για τη δημιουργία ενός έργου μέσω της σύλληψης και συχνά της εφαρμογής ενός πρωτότυπου γραφικού σχεδίου, σκίτσου, πίνακα ζωγραφικής κ.λπ. @el
label: művész ágense a következő: @hu
definition: Hozzákapcsol egy művet egy ágenshez, amely felelős egy eredeti grafikai terv, rajz, festmény, stb. megalkotásáért. @hu
toolkit label: művész ágens: @hu
toolkit definition: Egy ágens, amely felelős egy eredeti grafikai dizájn vagy minta, rajz, festmény, stb. megalkotásáért. @hu
alternative label: artist
alternative label: taiteilija @fi
label: taiteilija (toimija) @fi
label: har kunstner (agent) @no
definition: Relaterer et verk til en agent som er ansvarlig for å skape et originalt grafisk design, en tegning, et maleri etc. @no
alternative label: kunstner @no
label: heeft kunstenaar-actor @nl
definition: Relateert een werk aan een actor die verantwoordelijk is voor het creëren van een oorspronkelijk grafisch ontwerp, tekening, schilderij etc. @nl
toolkit label: kunstenaar-actor @nl
toolkit definition: Een actor die verantwoordelijk is voor het creëren van een oorspronkelijk grafisch ontwerp, tekening, schilderij etc. @nl
label: له وكيل فنان @ar
definition: يربط بين عمل ووكيل مسئول عن ابتكار تصميم رسومي أصلي، ورسم، ورسم زيتي، إلخ. @ar
alternative label: فنان @ar
toolkit label: وكيل فنان @ar
toolkit definition: وكيل مسئول عن ابتكار تصميم رسومي أصلي، ورسم، ورسم زيتي، إلخ. @ar
alternative label: artista @ca
label: kunstnik (tegija) @et
definition: Seostab teose tegijaga, kes vastutab originaalse graafilise kujunduse, joonistuse, maali vms loomise eest. @et
alternative label: kunstnik @et
toolkit label: kunstnik (tegija) @et
toolkit definition: Tegija, kes vastutab originaalse graafilise kujunduse, joonistuse, maali vms loomise eest. @et
alternative label: művész: @hu
label: ha come artista agente @it
definition: Correla un'opera a un agente responsabile della creazione di un progetto grafico, schizzo, dipinto, etc. originali. @it
toolkit label: artista agente @it
toolkit definition: Agente responsabile della creazione di un progetto grafico, schizzo, dipinto, etc. originali. @it
alternative label: artiste @fr
label: mākslinieks (aģents) @lv
definition: Sasaista darbu ar aģentu, kas ir atbildīgs par darba radīšanu un īstenošanu, izmantojot oriģinālu grafisko dizainu, zīmēšanu, gleznošanu, u.tml. @lv
toolkit label: mākslinieks (aģents) @lv
toolkit definition: Aģents, kas ir atbildīgs par darba radīšanu un īstenošanu, izmantojot oriģinālu grafisko dizainu, zīmēšanu, gleznošanu, u.tml. @lv
alternative label: Künstler @de
alternative label: 美术家 @zh-hans
label: 有美术家行为者 @zh-hans
toolkit label: 美术家行为者 @zh-hans

has artist collective agent
status: Published
lexical alias: artistCollectiveAgent.en
definition: Relates a work to a collective agent who is responsible for creating an original graphic design, drawing, painting, etc.
toolkit label: artist collective agent
toolkit definition: A collective agent who is responsible for creating an original graphic design, drawing, painting, etc.
type: Property
domain: C10001
has element type: 2
sub property of: has creator collective agent of work
sub property of: has artist agent
label: taiteilija (yhteistoimija) @fi
definition: Liittää teoksen yhteistoimijaan, joka on vastuussa alkuperäisen graafisen suunnitelman, piirroksen, maalauksen tms. luomisesta. @fi
toolkit label: taiteilija (yhteistoimija) @fi
toolkit definition: Yhteistoimija, joka on vastuussa alkuperäisen graafisen suunnitelman, piirroksen, maalauksen tms. luomisesta. @fi
label: har kunstner (kollektiv agent) @no
definition: Relaterer et verk til en kollektiv agent som er ansvarlig for å skape et originalt grafisk design, en tegning, et maleri etc. @no
toolkit label: kunstner (kollektiv agent) @no
toolkit definition: En kollektiv agent som er ansvarlig for å skape et originalt grafisk design, en tegning, et maleri etc. @no
label: heeft kunstenaar-collectieve actor @nl
definition: Relateert een werk aan een collectieve actor die verantwoordelijk is het maken van een oorspronkelijk grafisch ontwerp, tekening, schilderij etc. @nl
toolkit label: kunstenaar-collectieve actor @nl
toolkit definition: Een collectieve actor die verantwoordelijk is het maken van een oorspronkelijk grafisch ontwerp, tekening, schilderij etc. @nl
label: له وكيل جماعي فنان @ar
definition: يربط بين عمل ووكيل جماعي مسئول عن إنشاء تصميم رسومي، ورسم، وتصوير زيتي أصلي، إلخ. @ar
toolkit label: وكيل جماعي فنان @ar
toolkit definition: وكيل جماعي مسئول عن إنشاء تصميم رسومي، ورسم، وتصوير زيتي أصلي، إلخ. @ar
label: té com a agent col·lectiu artista @ca
definition: Relaciona una obra amb un agent col·lectiu que és responsable de la creació d’un disseny gràfic, un dibuix, una pintura, etc., original. @ca
toolkit label: agent col·lectiu artista @ca
toolkit definition: Agent col·lectiu que és responsable de la creació d’un disseny gràfic, un dibuix, una pintura, etc., original. @ca
label: har kollektiv agent, som er kunstner @da
definition: Relaterer et værk til en kollektiv agent, som er ansvarlig for at skabe et originalt grafisk design, -tegning, -maleri etc. @da
toolkit label: kollektiv agent, som er kunstner @da
toolkit definition: Kollektiv agent, som er ansvarlig for at skabe et originalt grafisk design, -tegning, -maleri etc. @da
label: kunstnik (kollektiiv) @et
definition: Seostab teose kollektiiviga, kes vastutab originaalse graafilise kujunduse, joonistuse, maali vms loomise eest. @et
toolkit label: kunstnik (kollektiiv) @et
toolkit definition: Kollektiiv, kes vastutab originaalse graafilise kujunduse, joonistuse, maali vms loomise eest. @et
label: hat Künstlerin/Künstler (Gemeinschaftlicher Akteur) @de
definition: Setzt ein Werk in Beziehung zu einem gemeinschaftlichen Akteur, der für die Schaffung einer originalen grafischen Gestaltung, einer Zeichnung, eines Gemäldes und so weiter verantwortlich ist. @de
toolkit label: Künstlerin/Künstler (Gemeinschaftlicher Akteur) @de
toolkit definition: Ein gemeinschaftlicher Akteur, der für die Schaffung einer originalen grafischen Gestaltung, einer Zeichnung, eines Gemäldes und so weiter verantwortlich ist. @de
label: művész kollektív ágense a következő: @hu
definition: Hozzákapcsol egy művet egy kollektív ágenshez, amely felelős egy eredeti grafikai terv, rajz, festmény, stb. megalkotásáért. @hu
toolkit label: művész kollektív ágens: @hu
toolkit definition: Egy kollektív ágens, amely felelős egy eredeti grafikai terv, rajz, festmény, stb. megalkotásáért. @hu
label: ha come artista agente collettivo @it
definition: Correla un'opera all'agente collettivo responsabile della creazione di un progetto grafico, schizzo, dipinto originali, etc. @it
toolkit label: artista agente collettivo @it
toolkit definition: Agente collettivoresponsabile della creazione di un progetto grafico, schizzo, dipinto originali, etc. @it
label: a pour agent collectif artiste @fr
definition: Met une œuvre en relation avec un agent collectif qui est responsable de la création d’un graphisme, d’une peinture, d’un dessin, etc. original. @fr
toolkit label: agent collectif artiste @fr
toolkit definition: Agent collectif qui est responsable de la création d’un graphisme, d’une peinture, d’un dessin, etc. original. @fr
label: mākslinieks (grupa) @lv
definition: Sasaista darbu ar grupu, kas ir atbildīga par darba radīšanu un īstenošanu, izmantojot oriģinālu grafisko dizainu, zīmēšanu, gleznošanu, u.tml. @lv
toolkit label: mākslinieks (grupa) @lv
toolkit definition: Grupa, kas ir atbildīga par darba radīšanu un īstenošanu, izmantojot oriģinālu grafisko dizainu, zīmēšanu, gleznošanu, u.tml. @lv
label: 有美术家集体行为者 @zh-hans
definition: 将一种作品与负责完成原创图形设计、绘图、绘画等的一个集体行为者关联起来。 @zh-hans
toolkit label: 美术家集体行为者 @zh-hans
toolkit definition: 负责完成原创图形设计、绘图、绘画等的一个集体行为者 @zh-hans
has subproperty: has artist corporate body
has subproperty: has artist family
has subproperty: has book artist collective agent
has subproperty: has calligrapher collective agent
has subproperty: has sculptor collective agent
has subproperty: P10498
label: sanatçı kolektif temsilci ile ilişkilidir @tr
definition: Bir eseri, orijinal bir grafik tasarımı, çizimi, resmi vb. oluşturmaktan sorumlu olan kolektif bir temsilci ile ilişkilendirir. @tr
toolkit label: sanatçı kolektif temsilci @tr
toolkit definition: Orijinal grafik tasarımı, çizimi, resim vb. oluşturmakla sorumlu olan bir kolektif temsilci @tr

has artist corporate body
status: Published
lexical alias: artistCorporateBody.en
definition: Relates a work to a corporate body who is responsible for creating an original graphic design, drawing, painting, etc.
toolkit label: artist corporate body
toolkit definition: A corporate body who is responsible for creating an original graphic design, drawing, painting, etc.
type: Property
domain: C10001
has element type: 2
sub property of: has creator corporate body of work
sub property of: has artist collective agent
label: taiteilija (yhteisö) @fi
definition: Liittää teoksen yhteisöön, joka on vastuussa alkuperäisen graafisen suunnitelman, piirroksen, maalauksen tms. luomisesta. @fi
toolkit label: taiteilija (yhteisö) @fi
toolkit definition: Yhteisö, joka on vastuussa alkuperäisen graafisen suunnitelman, piirroksen, maalauksen tms. luomisesta. @fi
label: har kunstner (korporasjon) @no
definition: Relaterer et verk til en korporasjon som er ansvarlig for å skape et originalt grafisk design, en tegning, et maleri etc. @no
toolkit label: kunstner (korporasjon) @no
toolkit definition: En korporasjon som er ansvarlig for å skape et originalt grafisk design, en tegning, et maleri etc. @no
label: heeft kunstenaar-corporatie @nl
definition: Relateert een werk aan een corporatie die verantwoordelijk is het maken van een oorspronkelijk grafisch ontwerp, tekening, schilderij etc. @nl
toolkit label: kunstenaar-corporatie @nl
toolkit definition: Een corporatie die verantwoordelijk is het maken van een oorspronkelijk grafisch ontwerp, tekening, schilderij etc. @nl
label: له هيئة فنانة @ar
definition: يربط بين عمل وهيئة تكون مسئولة عن إنشاء تصميم رسومي، ورسم، وتصوير زيتي أصلي، إلخ. @ar
toolkit label: هيئة فنانة @ar
toolkit definition: هيئة تكون مسئولة عن إنشاء تصميم رسومي، ورسم، وتصوير زيتي أصلي، إلخ. @ar
label: té com a entitat corporativa artista @ca
definition: Relaciona una obra amb una entitat corporativa que és responsable de la creació d’un disseny gràfic, un dibuix, una pintura, etc., original. @ca
toolkit label: entitat corporativa artista @ca
toolkit definition: Entitat corporativa que és responsable de la creació d’un disseny gràfic, un dibuix, una pintura, etc., original. @ca
label: har korporation, som er kunstner @da
definition: Relaterer et værk til en korporation, som er ansvarlig for at skabe et originalt grafisk design, -tegning, -maleri etc. @da
toolkit label: korporation, som er kunstner @da
toolkit definition: Korporation, som er ansvarlig for at skabe et originalt grafisk design, -tegning, -maleri etc. @da
label: kunstnik (asutus) @et
definition: Seostab teose asutusega, kes vastutab originaalse graafilise kujunduse, joonistuse, maali vms loomise eest. @et
toolkit label: kunstnik (asutus) @et
toolkit definition: Asutus, kes vastutab originaalse graafilise kujunduse, joonistuse, maali vms loomise eest. @et
label: hat Künstlerin/Künstler (Körperschaft) @de
definition: Setzt ein Werk in Beziehung zu einer Körperschaft, die für die Schaffung einer originalen grafischen Gestaltung, einer Zeichnung, eines Gemäldes und so weiter verantwortlich ist. @de
toolkit label: Künstlerin/Künstler (Körperschaft) @de
toolkit definition: Eine Körperschaft, die für die Schaffung einer originalen grafischen Gestaltung, einer Zeichnung, eines Gemäldes und so weiter verantwortlich ist. @de
label: művész testülete a következő: @hu
definition: Hozzákapcsol egy művet egy testülethez, amely felelős egy eredeti grafikai terv, rajz, festmény, stb. megalkotásáért. @hu
toolkit label: művész testület: @hu
toolkit definition: Egy testület, amely felelős egy eredeti grafikai terv, rajz, festmény, stb. megalkotásáért. @hu
label: ha come artista ente @it
definition: Correla un'opera a un ente responsabile della creazione di un un progetto grafico, schizzo, dipinto originali, etc. @it
toolkit label: artista ente @it
toolkit definition: Agente collettivo responsabile della creazione di un progetto grafico, schizzo, dipinto originali, etc. @it
label: a pour collectivité artiste @fr
definition: Met une œuvre en relation avec une collectivité qui est responsable de la création d’un graphisme, d’une peinture, d’un dessin, etc. original. @fr
toolkit label: collectivité artiste @fr
toolkit definition: Collectivité qui est responsable de la création d’un graphisme, d’une peinture, d’un dessin, etc. original. @fr
label: mākslinieks (institūcija) @lv
definition: Sasaista darbu ar institūciju, kas ir atbildīga par darba radīšanu un īstenošanu, izmantojot oriģinālu grafisko dizainu, zīmēšanu, gleznošanu, u.tml. @lv
toolkit label: mākslinieks (institūcija) @lv
toolkit definition: Institūcija, kas ir atbildīga par darba radīšanu un īstenošanu, izmantojot oriģinālu grafisko dizainu, zīmēšanu, gleznošanu, u.tml. @lv
label: 有美术家团体 @zh-hans
definition: 将一种作品与负责完成原创图形设计、绘图、绘画等的一个团体关联起来。 @zh-hans
toolkit label: 美术家团体 @zh-hans
toolkit definition: 负责完成原创图形设计、绘图、绘画等的一个团体 @zh-hans
has subproperty: has book artist corporate body
has subproperty: has calligrapher corporate body
has subproperty: has sculptor corporate body
has subproperty: P10545
label: sanatçı tüzel kişi ile ilişkilidir @tr
definition: Bir eseri, orijinal bir grafik tasarımı, çizimi, resmi vb. oluşturmaktan sorumlu tüzel kişi ile ilişkilendirir. @tr
toolkit label: sanatçı tüzel kişisi @tr
toolkit definition: Özgün bir grafik tasarım, çizim, boyama vb. oluşturmaktan sorumlu olan bir tüzel kişi. @tr

has artist family
status: Published
lexical alias: artistFamily.en
definition: Relates a work to a family who is responsible for creating an original graphic design, drawing, painting, etc.
toolkit label: artist family
toolkit definition: A family who is responsible for creating an original graphic design, drawing, painting, etc.
type: Property
domain: C10001
has element type: 2
sub property of: has creator family of work
sub property of: has artist collective agent
label: taiteilija (suku) @fi
definition: Liittää teoksen sukuun, joka on vastuussa alkuperäisen graafisen suunnitelman, piirroksen, maalauksen tms. luomisesta. @fi
toolkit label: taiteilija (suku) @fi
toolkit definition: Suku, joka on vastuussa alkuperäisen graafisen suunnitelman, piirroksen, maalauksen tms. luomisesta. @fi
label: har kunstner (familie) @no
definition: Relaterer et verk til en familie som er ansvarlig for å skape et originalt grafisk design, en tegning, et maleri etc. @no
toolkit label: kunstner (familie) @no
toolkit definition: En familie som er ansvarlig for å skape et originalt grafisk design, en tegning, et maleri etc. @no
label: heeft kunstenaar-familie @nl
definition: Relateert een werk aan een familie die verantwoordelijk is het maken van een oorspronkelijk grafisch ontwerp, tekening, schilderij etc. @nl
toolkit label: kunstenaar-familie @nl
toolkit definition: Een familie die verantwoordelijk is het maken van een oorspronkelijk grafisch ontwerp, tekening, schilderij etc. @nl
label: له عائلة فنانة @ar
definition: يربط بين عمل وعائلة مسؤولة عن إنشاء تصميم رسومي، ورسم، وتصوير زيتي أصلي، إلخ. @ar
toolkit label: عائلة فنانة @ar
toolkit definition: عائلة مسئولة عن إنشاء تصميم رسومي، ورسم، وتصوير زيتي أصلي، إلخ. @ar
label: té com a família artista @ca
definition: Relaciona una obra amb una família que és responsable de la creació d’un disseny gràfic, un dibuix, una pintura, etc., original. @ca
toolkit label: família artista @ca
toolkit definition: Família que és responsable de la creació d’un disseny gràfic, un dibuix, una pintura, etc., original. @ca
label: har familie, som er kunstner @da
definition: Relaterer et værk til en familie, som er ansvarlig for at skabe et originalt grafisk design, -tegning, -maleri etc. @da
toolkit label: familie, som er kunstner @da
toolkit definition: Familie, som er ansvarlig for at skabe et originalt grafisk design, -tegning, -maleri etc. @da
label: kunstnik (perekond) @et
definition: Seostab teose perekonnaga, kes vastutab originaalse graafilise kujunduse, joonistuse, maali vms loomise eest. @et
toolkit label: kunstnik (perekond) @et
toolkit definition: Perekond, kes vastutab originaalse graafilise kujunduse, joonistuse, maali vms loomise eest. @et
label: hat Künstlerin/Künstler (Familie) @de
definition: Setzt ein Werk in Beziehung zu einer Familie, die für die Schaffung einer originalen grafischen Gestaltung, einer Zeichnung, eines Gemäldes und so weiter verantwortlich ist. @de
toolkit label: Künstlerin/Künstler (Familie) @de
toolkit definition: Eine Familie, die für die Schaffung einer originalen grafischen Gestaltung, einer Zeichnung, eines Gemäldes und so weiter verantwortlich ist. @de
label: művész családja a következő: @hu
definition: Hozzákapcsol egy művet egy családhoz, amely felelős egy eredeti grafikai terv, rajz, festmény, stb. megalkotásáért. @hu
toolkit label: művész család: @hu
toolkit definition: Egy család, amely felelős egy eredeti grafikai terv, rajz, festmény, stb. megalkotásáért. @hu
label: ha come artista famiglia @it
definition: Correla un'opera alla famiglia responsabile della creazione di un un progetto grafico, schizzo, dipinto originali, etc. @it
toolkit label: artista famiglia @it
toolkit definition: Famiglia responsabile della creazione di un un progetto grafico, schizzo, dipinto originali, etc. @it
label: a pour famille artiste @fr
definition: Met une œuvre en relation avec une famille qui est responsable de la création d’un graphisme, d’une peinture, d’un dessin, etc. original. @fr
toolkit label: famille artiste @fr
toolkit definition: Famille qui est responsable de la création d’un graphisme, d’une peinture, d’un dessin, etc. original. @fr
label: mākslinieks (dzimta/ģimene) @lv
definition: Sasaista darbu ar dzimtu/ģimeni, kas ir atbildīga par darba radīšanu un īstenošanu, izmantojot oriģinālu grafisko dizainu, zīmēšanu, gleznošanu, u.tml. @lv
toolkit label: mākslinieks (dzimta/ģimene) @lv
toolkit definition: Dzimta/ģimene, kas ir atbildīga par darba radīšanu un īstenošanu, izmantojot oriģinālu grafisko dizainu, zīmēšanu, gleznošanu, u.tml. @lv
label: 有美术家家族 @zh-hans
definition: 将一种作品与负责完成原创图形设计、绘图、绘画等的一个家族关联起来。 @zh-hans
toolkit label: 美术家家族 @zh-hans
toolkit definition: 负责完成原创图形设计、绘图、绘画等的一个家族 @zh-hans
has subproperty: has book artist family
has subproperty: has calligrapher family
has subproperty: has sculptor family
has subproperty: P10592
label: sanatçı aile ile ilişkilidir @tr
definition: Bir eseri, orijinal bir grafik tasarımı, çizimi, resmi vb. oluşturmaktan sorumlu bir aileyle ilişkilendirir. @tr
toolkit label: sanatçı ailesi @tr
toolkit definition: Özgün bir grafik tasarım, çizim, resim vb. oluşturmaktan sorumlu bir aile. @tr

has artist person
status: Published
lexical alias: artistPerson.en
definition: Relates a work to a person who is responsible for creating an original graphic design, drawing, painting, etc.
toolkit label: artist person
toolkit definition: A person who is responsible for creating an original graphic design, drawing, painting, etc.
type: Property
domain: C10001
has element type: 2
sub property of: has creator person of work
sub property of: has artist agent
label: taiteilija (henkilö) @fi
definition: Liittää teoksen henkilöön, joka on vastuussa alkuperäisen graafisen suunnitelman, piirroksen, maalauksen tms. luomisesta. @fi
toolkit label: taiteilija (henkilö) @fi
toolkit definition: Henkilö, joka on vastuussa alkuperäisen graafisen suunnitelman, piirroksen, maalauksen tms. luomisesta. @fi
label: har kunstner (person) @no
definition: Relaterer et verk til en person som er ansvarlig for å skape et originalt grafisk design, en tegning, et maleri etc. @no
toolkit label: kunstner (person) @no
toolkit definition: En person som er ansvarlig for å skape et originalt grafisk design, en tegning, et maleri etc. @no
label: heeft kunstenaar-persoon @nl
definition: Relateert een werk aan een persoon die verantwoordelijk is het maken van een oorspronkelijk grafisch ontwerp, tekening, schilderij etc. @nl
toolkit label: kunstenaar-persoon @nl
toolkit definition: Een persoon die verantwoordelijk is het maken van een oorspronkelijk grafisch ontwerp, tekening, schilderij etc. @nl
label: له شخص فنان @ar
definition: يربط بين عمل وشخص مسئول عن إنشاء تصميم رسومي، أو رسم، أو تصوير زيتي أصلي، إلخ. @ar
toolkit label: شخص فنان @ar
toolkit definition: شخص يكون مسئولاً عن إنشاء تصميم رسومي، أو رسم، أو تصوير زيتي أصلي، إلخ. @ar
label: té com a persona artista @ca
definition: Relaciona una obra amb una persona que és responsable de la creació d’un disseny gràfic, un dibuix, una pintura, etc., original. @ca
toolkit label: persona artista @ca
toolkit definition: Persona que és responsable de la creació d’un disseny gràfic, un dibuix, una pintura, etc., original. @ca
label: har person, som er kunstner @da
definition: Relaterer et værk til en person, som er ansvarlig for at skabe et originalt grafisk design, -tegning, -maleri etc. @da
toolkit label: person, som er kunstner @da
toolkit definition: Person, som er ansvarlig for at skabe et originalt grafisk design, -tegning, -maleri etc. @da
label: kunstnik (isik) @et
definition: Seostab teose isikuga, kes vastutab originaalse graafilise kujunduse, joonistuse, maali vms loomise eest. @et
toolkit label: kunstnik (isik) @et
toolkit definition: Isik, kes vastutab originaalse graafilise kujunduse, joonistuse, maali vms loomise eest. @et
label: hat Künstlerin/Künstler (Person) @de
definition: Setzt ein Werk in Beziehung zu einer Person, die für die Schaffung einer originalen grafischen Gestaltung, einer Zeichnung, eines Gemäldes und so weiter verantwortlich ist. @de
toolkit label: Künstlerin/Künstler (Person) @de
toolkit definition: Eine Person, die für die Schaffung einer originalen grafischen Gestaltung, einer Zeichnung, eines Gemäldes und so weiter verantwortlich ist. @de
label: művész személye a következő: @hu
definition: Hozzákapcsol egy művet egy személyhez, aki felelős egy eredeti grafikai terv, rajz, festmény, stb. megalkotásáért. @hu
toolkit label: művész személy: @hu
toolkit definition: Egy személy, aki felelős egy eredeti grafikai dizájn vagy minta, rajz, festmény, stb. megalkotásáért. @hu
label: ha come artista persona @it
definition: Correla un'opera alla persona responsabile della creazione di un un progetto grafico, schizzo, dipinto originali, etc. @it
toolkit label: artista persona @it
toolkit definition: Persona responsabile della creazione di un un progetto grafico, schizzo, dipinto originali, etc. @it
label: a pour personne artiste @fr
definition: Met une œuvre en relation avec une personne qui est responsable de la création d’un graphisme, d’une peinture, d’un dessin, etc. original. @fr
toolkit label: personne artiste @fr
toolkit definition: Personne qui est responsable de la création d’un graphisme, d’une peinture, d’un dessin, etc. original. @fr
label: mākslinieks (persona) @lv
definition: Sasaista darbu ar personu, kura ir atbildīga par darba radīšanu un īstenošanu, izmantojot oriģinālu grafisko dizainu, zīmēšanu, gleznošanu, u.tml. @lv
toolkit label: mākslinieks (persona) @lv
toolkit definition: Persona, kura ir atbildīga par darba radīšanu un īstenošanu, izmantojot oriģinālu grafisko dizainu, zīmēšanu, gleznošanu, u.tml. @lv
label: 有美术家个人 @zh-hans
definition: 将一种作品与负责完成原创图形设计、绘图、绘画等的一个个人关联起来。 @zh-hans
toolkit label: 美术家个人 @zh-hans
toolkit definition: 负责完成原创图形设计、绘图、绘画等的一个个人 @zh-hans
has subproperty: has book artist person
has subproperty: has calligrapher person
has subproperty: has sculptor person
has subproperty: P10451
label: sanatçı ile ilişkilidir @tr
definition: Bir eseri, özgün bir grafik tasarım, çizim, boyama vb. oluşturmaktan sorumlu olan bir kişiyle ilişkilendirir. @tr
toolkit label: sanatçı @tr
toolkit definition: Özgün bir grafik tasarım, çizim, resim vb. oluşturmaktan sorumlu olan kişi. @tr

has aspect ratio of representative expression
status: Published
type: Property
lexical alias: aspectRatioOfRepresentativeExpression.en
definition: Relates a work to a numerical ratio of the width to the height of a representative expression of a moving image work.
domain: C10001
toolkit label: aspect ratio of representative expression
has element type: 3
toolkit definition: A numerical ratio of the width to the height of a representative expression of a moving image work.
label: edustavan ekspression kuvasuhde @fi
definition: Liittää teoksen liikkuvan kuvan teoksen edustavan ekspression leveyden ja korkeuden väliseen numeeriseen suhteeseen. @fi
toolkit label: edustavan ekspression kuvasuhde @fi
toolkit definition: Liikkuvan kuvan teoksen edustavan ekspression leveyden ja korkeuden välinen numeerinen suhde. @fi
label: har bildesideforhold for representativt uttrykk @no
definition: Relaterer et verk til et tallmessig forhold mellom bredden og høyden til et representativt uttrykk av et verk bestående av levende bilder. @no
toolkit label: bildesideforhold for representativt uttrykk @no
toolkit definition: Et tallmessig forhold mellom bredden og høyden til et representativt uttrykk av et verk bestående av levende bilder. @no
label: heeft aspectratio van representatieve expressie @nl
definition: Relateert een werk aan een numerieke verhouding van de breedte tot de hoogte van een representatieve expressie van een speelfilmwerk. @nl
toolkit label: aspectratio van representatieve expressie @nl
toolkit definition: Een numerieke verhouding van de breedte tot de hoogte van een representatieve expressie van een speelfilmwerk. @nl
label: له نسبة باعية لتعبيرة ممثِلة @ar
definition: يربط بين عمل والنسبة العددية لعرض تعبيرة ممثِلة لعمل صورة متحركة إلى ارتفاعها. @ar
toolkit label: نسبة باعية لتعبيرة ممثِلة @ar
toolkit definition: النسبة العددية لعرض تعبيرة ممثِلة لعمل صورة متحركة إلى ارتفاعها. @ar
label: té com a relació d’aspecte d’una expressió representativa @ca
definition: Relaciona una obra amb una relació numèrica entre l’amplada i l’altura d’una expressió representativa d’una obra d’imatge en moviment. @ca
toolkit label: relació d’aspecte d’una expressió representativa @ca
toolkit definition: Relació numèrica entre l’amplada i l’altura d’una expressió representativa d’una obra d’imatge en moviment. @ca
label: har dimensionsforhold for repræsentativt udtryk @da
definition: Relaterer et værk til et numerisk forhold mellem bredden og højden af et repræsentativt udtryk af et levende billedeværk. @da
toolkit label: dimensionsforhold for repræsentativt udtryk @da
toolkit definition: Numerisk forhold mellem bredden og højden af et repræsentativt udtryk af et levende billedeværk. @da
label: iseloomuliku väljenduse kuvasuhe @et
definition: Seostab teose liikuvast pildist koosneva teose iseloomuliku väljenduse laiuse ja kõrguse arvulise suhtega. @et
toolkit label: iseloomuliku väljenduse kuvasuhe @et
toolkit definition: Liikuvast pildist koosneva teose iseloomuliku väljenduse laiuse ja kõrguse arvuline suhe. @et
label: hat Bildformat einer repräsentativen Expression @de
definition: Setzt ein Werk in Beziehung zu einem Zahlenverhältnis von Breite zu Höhe einer repräsentativen Expression eines Bewegtbildwerks. @de
toolkit label: Bildformat einer repräsentativen Expression @de
toolkit definition: Ein Zahlenverhältnis von Breite zu Höhe einer repräsentativen Expression eines Bewegtbildwerks. @de
label: reprezentatív kifejezési forma képmérataránya a következő: @hu
definition: Hozzákapcsol egy művet egy arányszámhoz, amely egy mozgóképmű reprezentatív kifejezési formájának szélességét viszonyítja annak magasságához. @hu
toolkit label: reprezentatív kifejezési formához tartozó képméretarány @hu
toolkit definition: Egy arányszám, amely egy mozgóképmű reprezentatív kifejezési formájának szélességét viszonyítja annak magasságához. @hu
label: ha come rapporto d'aspetto di espressione rappresentativa @it
definition: Correla un’opera a un rapporto tra l’ampiezza e l’altezza di una espressione rappresentativa di un’opera immagine in movimento. @it
toolkit label: rapporto d'aspetto dell'espressione rappresentativa @it
toolkit definition: Rapporto tra l’ampiezza e l’altezza di una espressione rappresentativa di un’opera immagine in movimento. @it
label: a pour format d’image d’une expression représentative @fr
definition: Met une œuvre en relation avec un rapport numérique entre la largeur et la hauteur d’une expression représentative d’une œuvre d’images animées. @fr
toolkit label: format d’image d’une expression représentative @fr
toolkit definition: Rapport numérique entre la largeur et la hauteur d’une expression représentative d’une œuvre d’images animées. @fr
label: reprezentatīvās izteiksmes attēla proporcija @lv
definition: Sasaista darbu ar kustīgā attēla reprezentatīvās izteiksmes platuma un augstuma skaitlisko attiecību. @lv
toolkit label: reprezentatīvās izteiksmes attēla proporcija @lv
toolkit definition: Kustīgā attēla reprezentatīvās izteiksmes platuma un augstuma skaitliskā attiecība @lv
label: 有代表性内容表达的宽高比 @zh-hans
definition: 将一种作品与一种动态图像作品的一种代表性内容表达的宽度和高度的数字比关联起来。 @zh-hans
toolkit label: 代表性内容表达的宽高比 @zh-hans
toolkit definition: 一种动态图像作品的一种代表性内容表达的宽度和高度的数字比 @zh-hans
has subproperty: P10347
label: temsili anlatımın en boy oranı ile ilişkilidir @tr
definition: Bir eseri, hareketli bir görüntü eserinin temsili bir anlatımının genişliğinin yüksekliğine sayısal oranıyla ilişkilendirir. @tr
toolkit label: temsili anlatımın görüntü oranı @tr
toolkit definition: Hareketli bir görüntü eserinin temsili bir anlatımının genişliğinin yüksekliğine sayısal oranı. @tr

has audio producer agent
status: Published
sub property of: has producer agent
type: Property
lexical alias: audioProducerAgent.en
definition: Relates a work to an agent who is a producer who is responsible for managing most of the business aspects of an audio recording.
domain: C10001
toolkit label: audio producer agent
toolkit definition: An agent who is a producer who is responsible for managing most of the business aspects of an audio recording.
instruction number: 18.5
label: har agent, som er lydproducer @da
definition: Relaterer et værk til en agent, som er en producer, som er ansvarlig for at håndtere de fleste forretningsmæssige aspekter af en lydoptagelse. @da
toolkit label: agent, som er lydproducer @da
toolkit definition: Agent, som er en producer, som er ansvarlig for de fleste forretningsmæssige aspekter af en lydoptagelse. @da
label: có nhà sản xuất audio @vi
definition: Liên kết tác phẩm với nhà sản xuất có trách nhiệm về phần lớn khía cạnh kinh doanh của bản ghi audio. @vi
toolkit label: nhà sản xuất audio @vi
toolkit definition: Nhà sản xuất có trách nhiệm về phần lớn khía cạnh kinh doanh của bản ghi audio. @vi
label: hat Produzentin/Produzenten einer Tonaufnahme (Akteur) @de
definition: Setzt ein Werk in Beziehung zu einer Produzentin/einem Produzenten (Akteur), die/der für die meisten geschäftlichen Aspekte einer Audioaufnahme verantwortlich ist. @de
toolkit label: Produzentin/Produzent einer Tonaufnahme (Akteur) @de
toolkit definition: Eine Produzentin/Ein Produzent (Akteur), die/der für die meisten geschäftlichen Aspekte einer Audioaufnahme verantwortlich ist. @de
definition: Liittää teoksen toimijaan, joka on tuottaja, joka on vastuussa useimpien äänitteen liiketoiminnallisten tehtävien hoitamisesta. @fi
toolkit label: äänituottaja (toimija) @fi
toolkit definition: Toimija, joka on tuottaja, joka on vastuussa useimpien äänitteen liiketoiminnallisten tehtävien hoitamisesta. @fi
toolkit label: lydprodusent (agent) @no
toolkit definition: En agent som er en produsent som er ansvarlig for de fleste forretningsmessige aspektene ved et lydopptak. @no
label: té com a agent productor d’àudio @ca
definition: Relaciona una obra amb un agent que és un productor que és responsable de la gestió de la majoria dels aspectes comercials d’un enregistrament àudio. @ca
toolkit label: agent productor d’àudio @ca
toolkit definition: Agent que és un productor que és responsable de la gestió de la majoria dels aspectes comercials d’un enregistrament àudio. @ca
label: a pour agent producteur audio @fr
definition: Met une œuvre en relation avec un agent producteur qui est responsable de gérer la majeure partie des aspects commerciaux d’un enregistrement audio. @fr
toolkit label: agent producteur audio @fr
toolkit definition: Agent producteur qui est responsable de gérer la majeure partie des aspects commerciaux d’un enregistrement audio. @fr
has element type: 2
label: έχει παραγωγό ήχου @el
definition: Συνδέει ένα έργο με έναν παραγωγό υπεύθυνο για τις περισσότερες επιχειρηματικές πτυχές μιας ηχογράφησης. @el
toolkit label: παραγωγός ήχου @el
toolkit definition: Ένας παραγωγός υπεύθυνος για τις περισσότερες επιχειρηματικές πτυχές μιας ηχογράφησης. @el
label: audioproducer ágense a következő: @hu
definition: Hozzákapcsol egy művet egy producer ágenshez, amely felelős egy hangfelvétel üzleti vonatkozásainak a zöméért. @hu
toolkit label: audioproducer ágens: @hu
toolkit definition: Egy producer ágens, amely felelős egy hangfelvétel üzleti vonatkozásainak a zöméért. @hu
alternative label: audio producer
alternative label: äänituottaja @fi
label: äänituottaja (toimija) @fi
label: har lydprodusent (agent) @no
definition: Relaterer et verk til en agent som er en produsent som er ansvarlig for de fleste forretningsmessige aspektene ved et lydopptak. @no
alternative label: lydprodusent @no
label: heeft geluidsproducent-actor @nl
definition: Relateert een werk aan een actor die verantwoordelijk is voor het merendeel van de zakelijke aspecten van de productie van een geluidsopname. @nl
toolkit label: geluidsproducent-actor @nl
toolkit definition: Een actor die verantwoordelijk is voor het merendeel van de zakelijke aspecten van de productie van een geluidsopname. @nl
label: له وكيل منتج صوت @ar
definition: يربط بين عمل ووكيل يكون منتجًا مسئولاً عن إدارة معظم جوانب العمل في تسجيل صوتي. @ar
alternative label: منتج صوت @ar
toolkit label: وكيل منتج صوت @ar
toolkit definition: وكيل يكون منتجًا مسئولاً عن إدارة معظم جوانب العمل في تسجيل صوتي. @ar
alternative label: productor d’àudio @ca
alternative label: lydproducer @da
label: audioprodutsent (tegija) @et
definition: Seostab teose tegijaga, kes produtsendina vastutab enamiku äriliste aspektide korraldamise eest helisalvestusel. @et
alternative label: audioprodutsent @et
toolkit label: audioprodutsent (tegija) @et
toolkit definition: Tegija, kes produtsendina vastutab enamiku äriliste aspektide korraldamise eest helisalvestusel. @et
alternative label: audioproducer: @hu
label: ha come produttore audio agente @it
definition: Correla un’opera all'agente produttore responsabile per la gestione della maggior parte degli aspetti commerciali di una registrazione audio. @it
alternative label: produttore audio @it
toolkit label: produttore audio agente @it
toolkit definition: Agente produttore responsabile per la gestione della maggior parte degli aspetti commerciali di una registrazione audio. @it
alternative label: producteur audio @fr
label: skaņu ierakstu producents (aģents) @lv
definition: Sasaista darbu ar producentu aģentu, kas ir atbildīgs par skaņu ieraksta biznesa aspektiem. @lv
toolkit label: skaņu ierakstu producents (aģents) @lv
toolkit definition: Producents aģents, kas ir atbildīgs par skaņu ieraksta biznesa aspektiem. @lv
alternative label: Produzent einer Tonaufnahme @de
toolkit label: 音频制作者行为者 @zh-hans
toolkit definition: 作为一个制作者并负责音频录制工作大多数方面商业运作之管理的一个行为者 @zh-hans
has subproperty: has audio producer collective agent

has audio producer collective agent
status: Published
lexical alias: audioProducerCollectiveAgent.en
definition: Relates a work to a collective agent who is a producer who is responsible for managing most of the business aspects of an audio recording.
toolkit label: audio producer collective agent
toolkit definition: A collective agent who is a producer who is responsible for managing most of the business aspects of an audio recording.
type: Property
domain: C10001
has element type: 2
sub property of: has producer collective agent
sub property of: has audio producer agent
label: äänituottaja (yhteistoimija) @fi
definition: Liittää teoksen yhteistoimijaan, joka on tuottaja, joka on vastuussa useimpien äänitteen liiketoiminnallisten tehtävien hoitamisesta. @fi
toolkit label: äänituottaja (yhteistoimija) @fi
toolkit definition: Yhteistoimija, joka on tuottaja, joka on vastuussa useimpien äänitteen liiketoiminnallisten tehtävien hoitamisesta. @fi
label: har lydprodusent (kollektiv agent) @no
definition: Relaterer et verk til en kollektiv agent som er en produsent som er ansvarlig for de fleste forretningsmessige aspektene ved et lydopptak. @no
toolkit label: lydprodusent (kollektiv agent) @no
toolkit definition: En kollektiv agent som er en produsent som er ansvarlig for de fleste forretningsmessige aspektene ved et lydopptak. @no
label: heeft geluidsproducent-collectieve actor @nl
definition: Relateert een werk aan een collectieve actor die verantwoordelijk is voor het merendeel van de zakelijke aspecten van de productie van een geluidsopname. @nl
toolkit label: geluidsproducent-collectieve actor @nl
toolkit definition: Een collectieve actor die verantwoordelijk is voor het merendeel van de zakelijke aspecten van de productie van een geluidsopname. @nl
label: له وكيل جماعي منتج صوت @ar
definition: يربط بين عمل ووكيل جماعي يكون منتجًا مسئولاً عن إدارة معظم جوانب العمل في تسجيل صوتي. @ar
toolkit label: وكيل جماعي منتج صوت @ar
toolkit definition: وكيل جماعي يكون منتجًا مسئولاً عن إدارة معظم جوانب العمل في تسجيل صوتي. @ar
label: té com a agent col·lectiu productor d’àudio @ca
definition: Relaciona una obra amb un agent col·lectiu que és un productor que és responsable de la gestió de la majoria dels aspectes comercials d’un enregistrament àudio. @ca
toolkit label: agent col·lectiu productor d’àudio @ca
toolkit definition: Agent col·lectiu que és un productor que és responsable de la gestió de la majoria dels aspectes comercials d’un enregistrament àudio. @ca
label: har kollektiv agent, som er lydproducer @da
definition: Relaterer et værk til en kollektiv agent, som er en producer, som er ansvarlig for at håndtere de fleste forretningsmæssige aspekter af en lydoptagelse. @da
toolkit label: kollektiv agent, som er lydproducer @da
toolkit definition: Kollektiv agent, som er en producer, som er ansvarlig for at håndtere de fleste forretningsmæssige aspekter af en lydoptagelse. @da
label: audioprodutsent (kollektiiv) @et
definition: Seostab teose kollektiiviga, kes produtsendina vastutab enamiku äriliste aspektide korraldamise eest helisalvestusel. @et
toolkit label: audioprodutsent (kollektiiv) @et
toolkit definition: Kollektiiv, kes produtsendina vastutab enamiku äriliste aspektide korraldamise eest helisalvestusel. @et
label: hat Produzentin/Produzenten einer Tonaufnahme (Gemeinschaftlicher Akteur) @de
definition: Setzt ein Werk in Beziehung zu einer Produzentin/einem Produzenten (Gemeinschaftlicher Akteur), die/der für die meisten geschäftlichen Aspekte einer Audioaufnahme verantwortlich ist. @de
toolkit label: Produzentin/Produzent einer Tonaufnahme (Gemeinschaftlicher Akteur) @de
toolkit definition: Eine Produzentin/Ein Produzent (Gemeinschaftlicher Akteur), die/der für die meisten geschäftlichen Aspekte einer Audioaufnahme verantwortlich ist. @de
label: audioproducer kollektív ágense a következő: @hu
definition: Hozzákapcsol egy művet egy producer kollektív ágenshez, amely felelős egy hangfelvétel üzleti vonatkozásainak a zöméért. @hu
toolkit label: audioproducer kollektív ágens: @hu
toolkit definition: Egy producer kollektív ágens, amely felelős egy hangfelvétel üzleti vonatkozásainak a zöméért. @hu
label: ha come produttore audio agente collettivo @it
definition: Correla un'opera all'agente collettivo produttore responsabile della gestione della maggior parte degli aspetti commerciali di una registrazione audio. @it
toolkit label: produttore audio agente collettivo @it
toolkit definition: Agente collettivo produttore responsabile della gestione della maggior parte degli aspetti commerciali di una registrazione audio. @it
label: a pour agent collectif producteur audio @fr
definition: Met une œuvre en relation avec un agent collectif producteur qui est responsable de gérer la majeure partie des aspects commerciaux d’un enregistrement audio. @fr
toolkit label: agent collectif producteur audio @fr
toolkit definition: Agent collectif producteur qui est responsable de gérer la majeure partie des aspects commerciaux d’un enregistrement audio. @fr
label: skaņu ierakstu producents (grupa) @lv
definition: Sasaista darbu ar grupu, kas ir producents, kas ir atbildīgs par skaņu ieraksta biznesa aspektiem. @lv
toolkit label: skaņu ierakstu producents (grupa) @lv
toolkit definition: Producents grupa, kas ir atbildīgs par skaņu ieraksta biznesa aspektiem. @lv
label: 有音频制作者集体行为者 @zh-hans
definition: 将一种作品与作为一个制作者并负责音频录制工作大多数方面商业运作之管理的一个集体行为者关联起来。 @zh-hans
toolkit label: 音频制作者集体行为者 @zh-hans
toolkit definition: 作为一个制作者并负责音频录制工作大多数方面商业运作之管理的一个集体行为者 @zh-hans
has subproperty: has audio producer corporate body
has subproperty: has audio producer family
has subproperty: P10468
label: ses yapımcısı kolektif temsilcisi ile ilişkilidir @tr
definition: Bir eseri, bir ses kaydının ticari yönlerinin çoğunu yönetmekten sorumlu yapımcı olan kolektif bir temsilci ile ilişkilendirir. @tr
toolkit label: ses yapımcısı kolektif temsilci @tr
toolkit definition: Bir ses kaydının ticari yönlerinin çoğunu yönetmekten sorumlu bir yapımcı olan kolektif bir temsilci. @tr

has audio producer corporate body
status: Published
lexical alias: audioProducerCorporateBody.en
definition: Relates a work to a corporate body who is a producer who is responsible for managing most of the business aspects of an audio recording.
toolkit label: audio producer corporate body
toolkit definition: A corporate body who is a producer who is responsible for managing most of the business aspects of an audio recording.
type: Property
domain: C10001
has element type: 2
sub property of: has producer corporate body
sub property of: has audio producer collective agent
label: äänituottaja (yhteisö) @fi
definition: Liittää teoksen yhteisöön, joka on tuottaja, joka on vastuussa useimpien äänitteen liiketoiminnallisten tehtävien hoitamisesta. @fi
toolkit label: äänituottaja (yhteisö) @fi
toolkit definition: Yhteisö, joka on tuottaja, joka on vastuussa useimpien äänitteen liiketoiminnallisten tehtävien hoitamisesta. @fi
label: har lydprodusent (korporasjon) @no
definition: Relaterer et verk til en korporasjon som er en produsent som er ansvarlig for de fleste forretningsmessige aspektene ved et lydopptak. @no
toolkit label: lydprodusent (korporasjon) @no
toolkit definition: En korporasjon som er en produsent som er ansvarlig for de fleste forretningsmessige aspektene ved et lydopptak. @no
label: heeft geluidsproducent-corporatie @nl
definition: Relateert een werk aan een corporatie die verantwoordelijk is voor het merendeel van de zakelijke aspecten van de productie van een geluidsopname. @nl
toolkit label: geluidsproducent-corporatie @nl
toolkit definition: Een corporatie die verantwoordelijk is voor het merendeel van de zakelijke aspecten van de productie van een geluidsopname. @nl
label: له هيئة منتجة صوت @ar
definition: يربط بين عمل وهيئة تكون منتجة مسئولة عن إدارة معظم جوانب العمل في تسجيل صوتي. @ar
toolkit label: هيئة منتجة صوت @ar
toolkit definition: هيئة تكون منتجة مسئولة عن إدارة معظم جوانب العمل في تسجيل صوتي. @ar
label: té com a entitat corporativa productora d’àudio @ca
definition: Relaciona una obra amb una entitat corporativa que és un productor que és responsable de la gestió de la majoria dels aspectes comercials d’un enregistrament àudio. @ca
toolkit label: entitat corporativa productora d’àudio @ca
toolkit definition: Entitat corporativa que és un productor que és responsable de la gestió de la majoria dels aspectes comercials d’un enregistrament àudio. @ca
label: har korporation, som er lydproducer @da
definition: Relaterer et værk til en korporation, som er en producer, som er ansvarlig for at håndtere de fleste forretningsmæssige aspekter af en lydoptagelse. @da
toolkit label: korporation, som er lydproducer @da
toolkit definition: Korporation, som er en producer, som er ansvarlig for at håndtere de fleste forretningsmæssige aspekter af en lydoptagelse. @da
label: audioprodutsent (asutus) @et
definition: Seostab teose asutusega, kes produtsendina vastutab enamiku äriliste aspektide korraldamise eest helisalvestusel. @et
toolkit label: audioprodutsent (asutus) @et
toolkit definition: Asutus, kes produtsendina vastutab enamiku äriliste aspektide korraldamise eest helisalvestusel. @et
label: hat Produzentin/Produzenten einer Tonaufnahme (Körperschaft) @de
definition: Setzt ein Werk in Beziehung zu einer Produzentin/einem Produzenten (Körperschaft), die/der für die meisten geschäftlichen Aspekte einer Audioaufnahme verantwortlich ist. @de
toolkit label: Produzentin/Produzent einer Tonaufnahme (Körperschaft) @de
toolkit definition: Eine Produzentin/Ein Produzent (Körperschaft), die/der für die meisten geschäftlichen Aspekte einer Audioaufnahme verantwortlich ist. @de
label: audioproducer testülete a következő: @hu
definition: Hozzákapcsol egy művet egy producer testülethez, amely felelős egy hangfelvétel üzleti vonatkozásainak a zöméért. @hu
toolkit label: audioproducer testület: @hu
toolkit definition: Egy producer testület, amely felelős egy hangfelvétel üzleti vonatkozásainak a zöméért. @hu
label: ha come produttore audio ente @it
definition: Correla un'opera a un ente produttore responsabile della gestione della maggior parte degli aspetti commerciali di una registrazione audio. @it
toolkit label: produttore audio ente @it
toolkit definition: Ente produttore responsabile della gestione della maggior parte degli aspetti commerciali di una registrazione audio. @it
label: a pour collectivité productrice audio @fr
definition: Met une œuvre en relation avec une collectivité productrice qui est responsable de gérer la majeure partie des aspects commerciaux d’un enregistrement audio. @fr
toolkit label: collectivité productrice audio @fr
toolkit definition: Collectivité productrice qui est responsable de gérer la majeure partie des aspects commerciaux d’un enregistrement audio. @fr
label: skaņu ierakstu producents (institūcija) @lv
definition: Sasaista darbu ar institūciju, kas ir producents, kas ir atbildīga par skaņu ieraksta biznesa aspektiem. @lv
toolkit label: skaņu ierakstu producents (institūcija) @lv
toolkit definition: Producents institūcija, kas ir atbildīga par skaņu ieraksta biznesa aspektiem. @lv
label: 有音频制作者团体 @zh-hans
definition: 将一种作品与作为一个制作者并负责音频录制工作大多数方面商业运作之管理的一个团体关联起来。 @zh-hans
toolkit label: 音频制作者团体 @zh-hans
toolkit definition: 作为一个制作者并负责音频录制工作大多数方面商业运作之管理的一个团体 @zh-hans
has subproperty: P10515
label: ses yapımcısı tüzel kişisi ile ilişkilidir @tr
definition: Bir eseri, bir ses kaydının ticari yönlerinin çoğunu yönetmekten sorumlu bir yapımcı olan tüzel kişi ile ilişkilendirir. @tr
toolkit label: ses yapımcısı tüzel kişi @tr
toolkit definition: Bir ses kaydının ticari yönlerinin çoğunu yönetmekten sorumlu, yapımcı olan bir tüzel kişi. @tr

has audio producer family
status: Published
lexical alias: audioProducerFamily.en
definition: Relates a work to a family who is a producer who is responsible for managing most of the business aspects of an audio recording.
toolkit label: audio producer family
toolkit definition: A family who is a producer who is responsible for managing most of the business aspects of an audio recording.
type: Property
domain: C10001
has element type: 2
sub property of: has producer family
sub property of: has audio producer collective agent
label: äänituottaja (suku) @fi
definition: Liittää teoksen sukuun, joka on tuottaja, joka on vastuussa useimpien äänitteen liiketoiminnallisten tehtävien hoitamisesta. @fi
toolkit label: äänituottaja (suku) @fi
toolkit definition: Suku, joka on tuottaja, joka on vastuussa useimpien äänitteen liiketoiminnallisten tehtävien hoitamisesta. @fi
label: har lydprodusent (familie) @no
definition: Relaterer et verk til en familie som er en produsent som er ansvarlig for de fleste forretningsmessige aspektene ved et lydopptak. @no
toolkit label: lydprodusent (familie) @no
toolkit definition: En familie som er en produsent som er ansvarlig for de fleste forretningsmessige aspektene ved et lydopptak. @no
label: heeft geluidsproducent-familie @nl
definition: Relateert een werk aan een familie die verantwoordelijk is voor het merendeel van de zakelijke aspecten van de productie van een geluidsopname. @nl
toolkit label: geluidsproducent-familie @nl
toolkit definition: Een familie die verantwoordelijk is voor het merendeel van de zakelijke aspecten van de productie van een geluidsopname. @nl
label: له عائلة منتجة صوت @ar
definition: يربط بين عمل وعائلة تكون منتجة مسئولة عن إدارة معظم جوانب العمل في تسجيل صوتي. @ar
toolkit label: عائلة منتجة صوت @ar
toolkit definition: عائلة تكون منتجة مسئولة عن إدارة معظم جوانب العمل في تسجيل صوتي. @ar
label: té com a família productora d’àudio @ca
definition: Relaciona una obra amb una família que és un productor que és responsable de la gestió de la majoria dels aspectes comercials d’un enregistrament àudio. @ca
toolkit label: família productora d’àudio @ca
toolkit definition: Família que és un productor que és responsable de la gestió de la majoria dels aspectes comercials d’un enregistrament àudio. @ca
label: har familie, som er lydproducer @da
definition: Relaterer et værk til en familie, som er en producer, som er ansvarlig for at håndtere de fleste forretningsmæssige aspekter af en lydoptagelse. @da
toolkit label: familie, som er lydproducer @da
toolkit definition: Familie, som er en producer, som er ansvarlig for at håndtere de fleste forretningsmæssige aspekter af en lydoptagelse. @da
label: audioprodutsent (perekond) @et
definition: Seostab teose perekonnaga, kes produtsendina vastutab enamiku äriliste aspektide korraldamise eest helisalvestusel. @et
toolkit label: audioprodutsent (perekond) @et
toolkit definition: Perekond, kes produtsendina vastutab enamiku äriliste aspektide korraldamise eest helisalvestusel. @et
label: hat Produzentin/Produzenten einer Tonaufnahme (Familie) @de
definition: Setzt ein Werk in Beziehung zu einer Produzentin/einem Produzenten (Familie), die/der für die meisten geschäftlichen Aspekte einer Audioaufnahme verantwortlich ist. @de
toolkit label: Produzentin/Produzent einer Tonaufnahme (Familie) @de
toolkit definition: Eine/Produzentin/Ein Produzent (Familie), die/der für die meisten geschäftlichen Aspekte einer Audioaufnahme verantwortlich ist. @de
label: audióproducer családja a következő: @hu
definition: Hozzákapcsol egy művet egy producer családhoz, amely felelős egy hangfelvétel üzleti vonatkozásainak a zöméért. @hu
toolkit label: audioproducer család: @hu
toolkit definition: Egy producer család, amely felelős egy hangfelvétel üzleti vonatkozásainak a zöméért. @hu
label: ha come produttore audio famiglia @it
definition: Correla un'opera alla famiglia produttore responsabile della gestione della maggior parte degli aspetti commerciali di una registrazione audio. @it
toolkit label: produttore audio famiglia @it
toolkit definition: Famiglia produttore responsabile della gestione della maggior parte degli aspetti commerciali di una registrazione audio. @it
label: a pour famille productrice audio @fr
definition: Met une œuvre en relation avec une famille productrice qui est responsable de gérer la majeure partie des aspects commerciaux d’un enregistrement audio. @fr
toolkit label: famille productrice audio @fr
toolkit definition: Famille productrice qui est responsable de gérer la majeure partie des aspects commerciaux d’un enregistrement audio. @fr
label: skaņu ierakstu producents (dzimta/ģimene) @lv
definition: Sasaista darbu ar dzimtu/ģimeni, kas ir producents, kas ir atbildīga par skaņu ierakstu biznesa aspektiem. @lv
toolkit label: skaņu ierakstu producents (dzimta/ģimene) @lv
toolkit definition: Producents dzimta/ģimene, kas ir atbildīga par skaņu ierakstu biznesa aspektiem. @lv
label: 有音频制作者家族 @zh-hans
definition: 将一种作品与作为一个制作者并负责音频录制工作大多数方面商业运作之管理的一个家族关联起来。 @zh-hans
toolkit label: 音频制作者家族 @zh-hans
toolkit definition: 作为一个制作者并负责音频录制工作大多数方面商业运作之管理的一个家族 @zh-hans
has subproperty: P10562
label: ses yapımcısı ailesi ile ilişkilidir @tr
definition: Bir eseri, bir ses kaydının ticari yönlerinin çoğunu yönetmekten sorumlu olan yapımcı bir aileyle ilişkilendirir. @tr
toolkit label: ses yapımcısı aile @tr
toolkit definition: Bir ses kaydının ticari yönlerinin çoğunu yönetmekten sorumlu bir yapımcı olan bir aile. @tr

has audio producer person
status: Published
lexical alias: audioProducerPerson.en
definition: Relates a work to a person who is a producer who is responsible for managing most of the business aspects of an audio recording.
toolkit label: audio producer person
toolkit definition: A person who is a producer who is responsible for managing most of the business aspects of an audio recording.
type: Property
domain: C10001
has element type: 2
sub property of: has producer person
sub property of: has audio producer agent
label: äänituottaja (henkilö) @fi
definition: Liittää teoksen henkilöön, joka on tuottaja, joka on vastuussa useimpien äänitteen liiketoiminnallisten tehtävien hoitamisesta. @fi
toolkit label: äänituottaja (henkilö) @fi
toolkit definition: Henkilö, joka on tuottaja, joka on vastuussa useimpien äänitteen liiketoiminnallisten tehtävien hoitamisesta. @fi
label: har lydprodusent (person) @no
definition: Relaterer et verk til en person som er en produsent som er ansvarlig for de fleste forretningsmessige aspektene ved et lydopptak. @no
toolkit label: lydprodusent (person) @no
toolkit definition: En person som er en produsent som er ansvarlig for de fleste forretningsmessige aspektene ved et lydopptak. @no
label: heeft geluidsproducent-persoon @nl
definition: Relateert een werk aan een persoon die verantwoordelijk is voor het merendeel van de zakelijke aspecten van de productie van een geluidsopname. @nl
toolkit label: geluidsproducent-persoon @nl
toolkit definition: Een persoon die verantwoordelijk is voor het merendeel van de zakelijke aspecten van de productie van een geluidsopname. @nl
label: له شخص منتج صوت @ar
definition: يربط بين عمل وشخص يكون منتجًا مسئولاً عن إدارة معظم جوانب العمل في تسجيل صوتي. @ar
toolkit label: شخص منتج صوت @ar
toolkit definition: شخص يكون منتجًا مسئولاً عن إدارة معظم جوانب العمل في تسجيل صوتي. @ar
label: té com a persona productora d’àudio @ca
definition: Relaciona una obra amb una persona que és un productor que és responsable de la gestió de la majoria dels aspectes comercials d’un enregistrament àudio. @ca
toolkit label: persona productora d’àudio @ca
toolkit definition: Persona que és un productor que és responsable de la gestió de la majoria dels aspectes comercials d’un enregistrament àudio. @ca
label: har person, som er lydproducer @da
definition: Relaterer et værk til en person, som er en producer, som er ansvarlig for at håndtere de fleste forretningsmæssige aspekter af en lydoptagelse. @da
toolkit label: person, som er lydproducer @da
toolkit definition: Person, som er en producer, som er ansvarlig for at håndtere de fleste forretningsmæssige aspekter af en lydoptagelse. @da
label: audioprodutsent (isik) @et
definition: Seostab teose isikuga, kes produtsendina vastutab enamiku äriliste aspektide korraldamise eest helisalvestusel. @et
toolkit label: audioprodutsent (isik) @et
toolkit definition: Isik, kes produtsendina vastutab enamiku äriliste aspektide korraldamise eest helisalvestusel. @et
label: hat Produzentin/Produzenten einer Tonaufnahme (Person) @de
definition: Setzt ein Werk in Beziehung zu einer Produzentin/einem Produzenten (Person), die/der für die meisten geschäftlichen Aspekte einer Audioaufnahme verantwortlich ist. @de
toolkit label: Produzentin/Produzent einer Tonaufnahme (Person) @de
toolkit definition: Eine Produzentin/Ein Produzent (Person), die/der für die meisten geschäftlichen Aspekte einer Audioaufnahme verantwortlich ist. @de
label: audioproducer személye a következő: @hu
definition: Hozzákapcsol egy művet egy producer személyhez, aki felelős egy hangfelvétel üzleti vonatkozásainak a zöméért. @hu
toolkit label: audioproducer személy: @hu
toolkit definition: Egy producer személy, aki felelős egy hangfelvétel üzleti vonatkozásainak a zöméért. @hu
label: ha come produttore audio persona @it
definition: Correla un'opera alla persona produttore responsabile della gestione della maggior parte degli aspetti commerciali di una registrazione audio. @it
toolkit label: produttore audio persona @it
toolkit definition: Persona produttore responsabile della gestione della maggior parte degli aspetti commerciali di una registrazione audio. @it
label: a pour personne productrice audio @fr
definition: Met une œuvre en relation avec une personne productrice qui est responsable de gérer la majeure partie des aspects commerciaux d’un enregistrement audio. @fr
toolkit label: personne productrice audio @fr
toolkit definition: Personne productrice qui est responsable de gérer la majeure partie des aspects commerciaux d’un enregistrement audio. @fr
label: skaņu ierakstu producents (persona) @lv
definition: Sasaista darbu ar personu, kura ir producents, kas ir atbildīga par skaņu ierakstu biznesa aspektiem. @lv
toolkit label: skaņu ierakstu producents (persona) @lv
toolkit definition: Persona, kura ir producents, kura ir atbildīga par skaņu ierakstu biznesa aspektiem. @lv
label: 有音频制作者个人 @zh-hans
definition: 将一种作品与作为一个制作者并负责音频录制工作大多数方面商业运作之管理的一个个人关联起来。 @zh-hans
toolkit label: 音频制作者个人 @zh-hans
toolkit definition: 作为一个制作者并负责音频录制工作大多数方面商业运作之管理的一个个人 @zh-hans
has subproperty: P10421
label: ses yapımcıs ile ilişkilidir @tr
definition: Bir eseri, bir ses kaydının ticari yönlerinin çoğunu yönetmekten sorumlu yapımcı olan kişiyle ilişkilendirir. @tr
toolkit label: ses yapımcısı @tr
toolkit definition: Bir ses kaydının ticari yönlerinin çoğunu yönetmekten sorumlu olan yapımcı kişi. @tr

has author agent
status: Published
definition: Relates a work to an agent who is responsible for creating a textual work.
type: Property
scope note: Creation of a new work by paraphrasing, rewriting, or adapting works by another creator, if the modification has substantially changed the nature and content of the original or changed the medium of expression, is included.
domain: C10001
sub property of: has creator agent of work
lexical alias: authorAgent.en
toolkit label: author agent
toolkit definition: An agent who is responsible for creating a textual work.
toolkit label: agent auteur @fr
toolkit definition: Agent qui est responsable de la création d’une œuvre textuelle. @fr
toolkit label: autor @es
toolkit definition: Una persona, familia o entidad corporativa responsable de la creación de contenido principalmente textual, independientemente del tipo de medios (por ej., texto impreso, palabra hablada, texto electrónico, texto táctil) o género (por ej., poemas, novelas, guiones, blogs). @es
instruction number: 18.5
label: har agent, som er forfatter @da
definition: Relaterer et værk til en agent, som er ansvarlig for et tekstværk. @da
scope note: Skabelse af et nyt værk ved at parafrasere, omskrive eller bearbejde værker af et andet ophav, hvis modificeringen har medført en væsentlig ændring af originalens karakter og indhold, eller den har ændret udtryksmediet, er omfattet. @da
toolkit label: agent, som er forfatter @da
toolkit definition: Agent, som er ansvarlig for et tekstværk. @da
definition: Met une œuvre en relation avec un agent qui est responsable de la création d’une œuvre textuelle. @fr
label: có tác giả @vi
definition: Liên kết tác phẩm với tác nhân có trách nhiệm tạo lập tác phẩm chủ yếu là nguyên bản trong nội dung, bất kể loại phương tiên và thể loại. @vi
scope note: Sáng tạo tác phẩm mới bằng cách diễn giải, viết lại, hoặc phỏng theo tác phẩm bởi người sáng tạo khác, nếu sửa chữa có thay đổi cơ bản bản chất và nội dung của nguyên gốc hoặc thay đổi phương tiện của biểu hiện, được bao gồm. @vi
toolkit label: tác giả @vi
toolkit definition: Tác nhân có trách nhiệm tạo lập tác phẩm chủ yếu là nguyên bản trong nội dung, bất kể loại phương tiên và thể loại. @vi
label: hat Verfasserin/Verfasser (Akteur) @de
definition: Setzt ein Werk in Beziehung zu einem Akteur, der für die Schaffung eines textlichen Werks verantwortlich ist. @de
scope note: Darunter fällt die Schaffung eines neuen Werks durch Paraphrasieren, Umschreiben oder Adaption von Werken einer anderen geistigen Schöpferin/eines anderen geistigen Schöpfers, wenn die Veränderung die Art und den Inhalt des Originals substanziell verändert hat oder sich das Medium der Expression geändert hat. @de
toolkit label: Verfasserin/Verfasser (Akteur) @de
toolkit definition: Ein Akteur, der für die Schaffung eines textlichen Werks verantwortlich ist. @de
label: a pour agent auteur @fr
definition: Liittää teoksen toimijaan, joka on vastuussa tekstiteoksen luomisesta. @fi
toolkit label: kirjoittaja (toimija) @fi
toolkit definition: Toimija, joka on vastuussa tekstiteoksen luomisesta. @fi
toolkit label: forfatter (agent) @no
toolkit definition: En agent som er ansvarlig for et tekstlig verk. @no
label: té com a agent autor @ca
definition: Relaciona una obra amb un agent que és responsable de la creació d’una obra textual. @ca
scope note: Inclou la creació d’una obra nova parafrasejant, reescrivint o adaptant obres d’un altre creador, si la modificació ha canviat substancialment la natura i el contingut de l’original o si ha canviat el mitjà d’expressió. @ca
toolkit label: agent autor @ca
toolkit definition: Agent que és responsable de la creació d’una obra textual. @ca
scope note: La création d’une nouvelle œuvre en paraphrasant, en réécrivant ou en adaptant les œuvres d’un autre créateur est incluse, si la modification a changé considérablement la nature et le contenu de l’original ou a changé le mode d’expression. @fr
has element type: 2
label: έχει συγγραφέα @el
definition: Συνδέει ένα έργο με έναν φορέα υπεύθυνο για τη δημιουργία ενός έργου κυρίως κειμενικού περιεχομένου, ανεξάρτητα από τον τύπο του μέσου μετάδοσης ή το γένος/είδος. @el
scope note: Περιλαμβάνεται η δημιουργία ενός νέου έργου μέσω της παράφρασης, η επανασυγγραφή ή η προσαρμογή έργων από έναν άλλον δημιουργό, εφόσον η τροποποίηση έχει μεταβάλει ουσιαστικά τη φύση και το περιεχόμενο του πρωτότυπου ή έχει αλλάξει το μέσο της έκφρασης. @el
toolkit label: συγγραφέας @el
toolkit definition: Ένας φορέας υπεύθυνος για τη δημιουργία ενός έργου κυρίως κειμενικού περιεχομένου, ανεξάρτητα από τον τύπο του μέσου μετάδοσης ή το γένος/είδος. @el
label: szerző ágense a következő: @hu
definition: Hozzákapcsol egy művet egy ágenshez, amely felelős egy szöveges mű létrehozásáért. @hu
scope note: szerző ágens: @hu
toolkit label: Egy ágens, amely felelős egy szöveges mű létrehozásáért. @hu
toolkit definition: szerző: @hu
alternative label: author
scope note: Kattaa uuden teoksen luomisen toisen tekijän teoksia mukailemalla, muokkaamalla tai sovittamalla, mikäli muutos on olennaisesti muuttanut alkuperäisen luonnetta ja sisältöä tai muuttanut ilmaisumuotoa. @fi
alternative label: kirjoittaja @fi
label: kirjoittaja (toimija) @fi
label: har forfatter (agent) @no
definition: Relaterer et verk til en agent som er ansvarlig for et tekstlig verk. @no
scope note: Det å skape et nytt verk ved å omskrive eller bearbeide verk av en annen opphaver er inkludert hvis dette i vesentlig grad har endret originalverkets særpreg og innhold, eller hvis mediet for uttrykket er endret. @no
alternative label: forfatter @no
label: heeft auteur-actor @nl
definition: Relateert een werk aan een actor die verantwoordelijk is voor het creëren van een tekstwerk. @nl
scope note: Creatie van een nieuw werk door het parafraseren, herschrijven of bewerken van werken van een andere maker, als de wijziging de aard en content van het origineel substantieel gewijzigd heeft of het medium van expressie gewijzigd heeft, is inbegrepen. @nl
toolkit label: auteur-actor @nl
toolkit definition: Een actor die verantwoordelijk is voor het creëren van een tekstwerk. @nl
label: له وكيل مؤلف @ar
definition: يربط بين عمل ووكيل مسئول عن إنشاء عمل نصي. @ar
scope note: يتم تضمين إنشاء عمل جديد عن طريق إعادة الصياغة، أو إعادة الكتابة، أو تكييف أعمال منشئ آخر، إذا كان التعديل قد غيَّر تغيرا كبيرا طبيعة الأصل ومحتواه أو وسيط التعبيرة. @ar
alternative label: مؤلف @ar
toolkit label: وكيل مؤلف @ar
toolkit definition: وكيل مسئول عن إنشاء عمل نصي. @ar
alternative label: autor @ca
label: tekstteose autor (tegija) @et
definition: Seostab teose tegijaga, kes vastutab tekstteose loomise eest. @et
scope note: Hõlmab ka uue teose loomist, ümber sõnastades, ümber töötades või adapteerides teise autori teoseid, kui teisendamine on originaali olemust ja sisu oluliselt muutnud või muutunud on väljenduse meedium. @et
alternative label: tekstteose autor @et
toolkit label: tekstteose autor (tegija) @et
toolkit definition: Tegija, kes vastutab tekstteose loomise eest. @et

has author collective agent
status: Published
lexical alias: authorCollectiveAgent.en
definition: Relates a work to a collective agent who is responsible for creating a textual work.
toolkit label: author collective agent
toolkit definition: A collective agent who is responsible for creating a textual work.
type: Property
domain: C10001
has element type: 2
sub property of: has creator collective agent of work
sub property of: has author agent
scope note: Creation of a new work by paraphrasing, rewriting, or adapting works by another creator, if the modification has substantially changed the nature and content of the original or changed the medium of expression, is included.
label: kirjoittaja (yhteistoimija) @fi
definition: Liittää teoksen yhteistoimijaan, joka on vastuussa tekstiteoksen luomisesta. @fi
scope note: Kattaa uuden teoksen luomisen toisen tekijän teoksia mukailemalla, muokkaamalla tai sovittamalla, mikäli muutos on olennaisesti muuttanut alkuperäisen luonnetta ja sisältöä tai muuttanut ilmaisumuotoa. @fi
toolkit label: kirjoittaja (yhteistoimija) @fi
toolkit definition: Yhteistoimija, joka on vastuussa tekstiteoksen luomisesta. @fi
label: har forfatter (kollektiv agent) @no
definition: Relaterer et verk til en kollektiv agent som er ansvarlig for et tekstlig verk. @no
scope note: Det å skape et nytt verk ved å omskrive eller bearbeide verk av en annen opphaver er inkludert hvis dette i vesentlig grad har endret originalverkets særpreg og innhold, eller hvis mediet for uttrykket er endret. @no
toolkit label: forfatter (kollektiv agent) @no
toolkit definition: En kollektiv agent som er ansvarlig for et tekstlig verk. @no
label: heeft auteur-collectieve actor @nl
definition: Relateert een werk aan een collectieve actor die verantwoordelijk is voor het creëren een tekstwerk. @nl
scope note: Creatie van een nieuw werk door het parafraseren, herschrijven of bewerken van werken van een andere maker, als de wijziging de aard en content van het origineel substantieel gewijzigd heeft of het medium van expressie gewijzigd heeft, is inbegrepen. @nl
toolkit label: auteur-collectieve actor @nl
toolkit definition: Een collectieve actor die verantwoordelijk is voor het creëren een tekstwerk. @nl
label: له وكيل جماعي مؤلف @ar
definition: يربط بين عمل ووكيل جماعي مسئول عن إنشاء عمل نصي. @ar
scope note: يتم تضمين إنشاء عمل جديد عن طريق إعادة منشئ آخر الصياغة، أو الكتابة، أو تكييفه الأعمال، إذا كان التعديل قد غيّر طبيعة الأصل ومحتواه أو غير وسيلة التعبير تغييرا كبيرا. @ar
toolkit label: وكيل جماعي مؤلف @ar
toolkit definition: وكيل جماعي مسئول عن إنشاء عمل نصي. @ar
label: té com a agent col·lectiu autor @ca
definition: Relaciona una obra amb un agent col·lectiu que és responsable de la creació d’una obra textual. @ca
scope note: Inclou la creació d’una obra nova parafrasejant, reescrivint o adaptant obres d’un altre creador, si la modificació ha canviat substancialment la natura i el contingut de l’original o si ha canviat el mitjà d’expressió. @ca
toolkit label: agent col·lectiu autor @ca
toolkit definition: Agent col·lectiu que és responsable de la creació d’una obra textual. @ca
label: har kollektiv agent, som er forfatter @da
definition: Relaterer et værk til en kollektiv agent, som er ansvarlig for et tekstværk. @da
scope note: Skabelse af et nyt værk ved at parafrasere, omskrive eller bearbejde værker af et andet ophav, hvis modificeringen har medført en væsentlig ændring af originalens karakter og indhold, eller den har ændret udtryksmediet, er omfattet. @da
toolkit label: kollektiv agent, som er forfatter @da
toolkit definition: Kollektiv agent, som er ansvarlig for et tekstværk. @da
label: tekstteose autor (kollektiiv) @et
definition: Seostab teose kollektiiviga, kes vastutab tekstteose loomise eest. @et
scope note: Hõlmab ka uue teose loomist, ümber sõnastades, ümber töötades või adapteerides teise autori teoseid, kui teisendamine on originaali olemust ja sisu oluliselt muutnud või muutunud on väljenduse meedium. @et
toolkit label: tekstteose autor (kollektiiv) @et
toolkit definition: Kollektiiv, kes vastutab tekstteose loomise eest. @et
label: hat Verfasserin/Verfasser (Gemeinschaftlicher Akteur) @de
definition: Setzt ein Werk in Beziehung zu einem gemeinschaftlichen Akteur, der für die Schaffung eines textlichen Werks verantwortlich ist. @de
scope note: Darunter fällt die Schaffung eines neuen Werks durch Paraphrasieren, Umschreiben oder Adaption von Werken einer anderen geistigen Schöpferin/eines anderen geistigen Schöpfers, wenn die Veränderung die Art und den Inhalt des Originals substanziell verändert hat oder sich das Medium der Expression geändert hat. @de
toolkit label: Verfasserin/Verfasser (Gemeinschaftlicher Akteur) @de
toolkit definition: Ein gemeinschaftlicher Akteur, der für die Schaffung eines textlichen Werks verantwortlich ist. @de
label: szerző kollektív ágense a következő: @hu
definition: Hozzákapcsol egy művet egy kollektív ágenshez, amely felelős egy szöveges mű létrehozásáért. @hu
scope note: Beletartozik egy új mű megalkotása egy másik alkotó munkáinak átfogalmazásával, újraírásával vagy adaptálásával, ha a módosítás lényegesen megváltoztatta az eredeti jellegét és tartalmát, vagy a kifejezési forma médiumát. @hu
toolkit label: szerző kollektív ágens: @hu
toolkit definition: Egy kollektív ágens, amely felelős egy szöveges mű létrehozásáért. @hu
label: ha come autore agente collettivo @it
definition: Correla un'opera all'agente collettivo responsabile di un'opera testuale. @it
scope note: E' compresa la creazione di una nuova opera tramite la parafrasi, riscrittura o adattamento di opere di un altro creatore, se la modifica ha cambiato sostanzialmente la natura e contenuto dell'originale, o ha cambiato il mezzo di espressione. @it
toolkit label: autore agente collettivo @it
toolkit definition: Agente collettivo responsabile di un'opera testuale. @it
label: a pour agent collectif auteur @fr
definition: Met une œuvre en relation avec un agent collectif qui est responsable de la création d’une œuvre textuelle. @fr
scope note: La création d’une nouvelle œuvre en paraphrasant, en réécrivant ou en adaptant les œuvres d’un autre créateur est incluse, si la modification a changé considérablement la nature et le contenu de l’original ou a changé le mode d’expression. @fr
toolkit label: agent collectif auteur @fr
toolkit definition: Agent collectif qui est responsable de la création d’une œuvre textuelle. @fr
label: autors (grupa) @lv
definition: Sasaista darbu ar grupu, kas ir atbildīga par tekstuālu darbu. @lv
toolkit label: autors (grupa) @lv
toolkit definition: Grupa, kas ir atbildīga par tekstuālu darbu. @lv
scope note: Ietver arī jauna darba radīšanu, pārfrazējot, pārrakstot vai pielāgojot cita radītāja darbus, ja ir būtiski mainīta pamatdarba būtība, saturs vai izteiksmes nesējs. @lv
label: 有著者集体行为者 @zh-hans
definition: 将一种作品与负责创建一种文字作品的一个集体行为者关联起来。 @zh-hans
toolkit label: 著者集体行为者 @zh-hans
toolkit definition: 负责创建一种文字作品的一个集体行为者 @zh-hans
scope note: 通过演绎、改写或改变另一个创建者的作品所作而成的新作品的创建，如果修改实质性改变了原作的性质和内容或者改变了内容表达的媒介，应被包括在内。 @zh-hans
has subproperty: has author corporate body
has subproperty: has author family
has subproperty: has librettist collective agent

has author corporate body
status: Published
lexical alias: authorCorporateBody.en
definition: Relates a work to a corporate body who is responsible for creating a textual work.
toolkit label: author corporate body
toolkit definition: A corporate body who is responsible for creating a textual work.
type: Property
domain: C10001
has element type: 2
sub property of: has creator corporate body of work
sub property of: has author collective agent
scope note: Creation of a new work by paraphrasing, rewriting, or adapting works by another creator, if the modification has substantially changed the nature and content of the original or changed the medium of expression, is included.
label: kirjoittaja (yhteisö) @fi
definition: Liittää teoksen yhteisöön, joka on vastuussa tekstiteoksen luomisesta. @fi
scope note: Kattaa uuden teoksen luomisen toisen tekijän teoksia mukailemalla, muokkaamalla tai sovittamalla, mikäli muutos on olennaisesti muuttanut alkuperäisen luonnetta ja sisältöä tai muuttanut ilmaisumuotoa. @fi
toolkit label: kirjoittaja (yhteisö) @fi
toolkit definition: Yhteisö, joka on vastuussa tekstiteoksen luomisesta. @fi
label: har forfatter (korporasjon) @no
definition: Relaterer et verk til en korporasjon som er ansvarlig for et tekstlig verk. @no
scope note: Det å skape et nytt verk ved å omskrive eller bearbeide verk av en annen opphaver er inkludert hvis dette i vesentlig grad har endret originalverkets særpreg og innhold, eller hvis mediet for uttrykket er endret. @no
toolkit label: forfatter (korporasjon) @no
toolkit definition: En korporasjon som er ansvarlig for et tekstlig verk. @no
label: heeft auteur-corporatie @nl
definition: Relateert een werk aan een corporatie die verantwoordelijk is voor het creëren van een tekstwerk. @nl
scope note: Creatie van een nieuw werk door het parafraseren, herschrijven of bewerken van werken van een andere maker, als de wijziging de aard en content van het origineel substantieel gewijzigd heeft of het medium van expressie gewijzigd heeft, is inbegrepen. @nl
toolkit label: auteur-corporatie @nl
toolkit definition: Een corporatie die verantwoordelijk is voor het creëren van een tekstwerk. @nl
label: له هيئة مؤلفة @ar
definition: يربط بين عمل وهيئة مسئولة عن إنشاء عمل نصي. @ar
scope note: يتم تضمين إنشاء عمل جديد عن طريق إعادة منشئ آخر الصياغة، أو الكتابة، أو تكييفه الأعمال، إذا كان التعديل قد غيّر طبيعة الأصل ومحتواه أو غير وسيلة التعبير تغييرا كبيرا. @ar
toolkit label: هيئة مؤلفة @ar
toolkit definition: هيئة مسئولة عن إنشاء عمل نصي. @ar
label: té com a entitat corporativa autora @ca
definition: Relaciona una obra amb una entitat corporativa que és responsable de la creació d’una obra textual. @ca
scope note: Inclou la creació d’una obra nova parafrasejant, reescrivint o adaptant obres d’un altre creador, si la modificació ha canviat substancialment la natura i el contingut de l’original o si ha canviat el mitjà d’expressió. @ca
toolkit label: entitat corporativa autora @ca
toolkit definition: Entitat corporativa que és responsable de la creació d’una obra textual. @ca
label: har korporation, som er forfatter @da
definition: Relaterer et værk til en korporation, som er ansvarlig for et tekstværk. @da
scope note: Skabelse af et nyt værk ved at parafrasere, omskrive eller bearbejde værker af et andet ophav, hvis modificeringen har medført en væsentlig ændring af originalens karakter og indhold, eller den har ændret udtryksmediet, er omfattet. @da
toolkit label: korporation, som er forfatter @da
toolkit definition: Korporation, som er ansvarlig for et tekstværk. @da
label: tekstteose autor (asutus) @et
definition: Seostab teose asutusega, kes vastutab tekstteose loomise eest. @et
scope note: Hõlmab ka uue teose loomist, ümber sõnastades, ümber töötades või adapteerides teise autori teoseid, kui teisendamine on originaali olemust ja sisu oluliselt muutnud või muutunud on väljenduse meedium. @et
toolkit label: tekstteose autor (asutus) @et
toolkit definition: Asutus, kes vastutab tekstteose loomise eest. @et
label: hat Verfasserin/Verfasser (Körperschaft) @de
definition: Setzt ein Werk in Beziehung zu einer Körperschaft, die für die Schaffung eines textlichen Werks verantwortlich ist. @de
scope note: Darunter fällt die Schaffung eines neuen Werks durch Paraphrasieren, Umschreiben oder Adaption von Werken einer anderen geistigen Schöpferin/eines anderen geistigen Schöpfers, wenn die Veränderung die Art und den Inhalt des Originals substanziell verändert hat oder sich das Medium der Expression geändert hat. @de
toolkit label: Verfasserin/Verfasser (Körperschaft) @de
toolkit definition: Eine Körperschaft, die für die Schaffung eines textlichen Werks verantwortlich ist. @de
label: szerző testülete a következő: @hu
definition: Hozzákapcsol egy művet egy testülethez, amely felelős egy szöveges mű létrehozásáért. @hu
scope note: Beletartozik egy új mű megalkotása egy másik alkotó munkáinak átfogalmazásával, újraírásával vagy adaptálásával, ha a módosítás lényegesen megváltoztatta az eredeti jellegét és tartalmát, vagy a kifejezési forma médiumát. @hu
toolkit label: szerző testület: @hu
toolkit definition: Egy testület, amely felelős egy szöveges mű létrehozásáért. @hu
label: ha come autore ente @it
definition: Correla un'opera a un ente responsabile di un'opera testuale. @it
scope note: E' compresa la creazione di una nuova opera tramite la parafrasi, riscrittura o adattamento di opere di un altro creatore, se la modifica ha cambiato sostanzialmente la natura e contenuto dell'originale, o ha mutato il mezzo di espressione. @it
toolkit label: autore ente @it
toolkit definition: Ente responsabile di un'opera testuale. @it
label: a pour collectivité autrice @fr
definition: Met une œuvre en relation avec une collectivité qui est responsable de la création d’une œuvre textuelle. @fr
scope note: La création d’une nouvelle œuvre en paraphrasant, en réécrivant ou en adaptant les œuvres d’un autre créateur est incluse, si la modification a changé considérablement la nature et le contenu de l’original ou a changé le mode d’expression. @fr
toolkit label: collectivité autrice @fr
toolkit definition: Collectivité qui est responsable de la création d’une œuvre textuelle. @fr
label: autors (institūcija) @lv
definition: Sasaista darbu ar institūciju, kas ir atbildīga par tekstuālu darbu. @lv
toolkit label: autors (institūcija) @lv
toolkit definition: Institūcija, kas ir atbildīga par tekstuālu darbu. @lv
scope note: Ietver arī jauna darba radīšanu, pārfrazējot, pārrakstot vai pielāgojot cita radītāja darbus, ja ir būtiski mainīta pamatdarba būtība, saturs vai izteiksmes nesējs. @lv
label: 有著者团体 @zh-hans
definition: 将一种作品与负责创建一种文字作品的一个行为者关联起来。 @zh-hans
toolkit label: 著者团体 @zh-hans
toolkit definition: 负责创建一种文字作品的一个团体 @zh-hans
scope note: 通过演绎、改写或改变另一个创建者的作品所作而成的新作品的创建，如果修改实质性改变了原作的性质和内容或者改变了内容表达的媒介，应被包括在内。 @zh-hans
has subproperty: has librettist corporate body
has subproperty: has lyricist corporate body
has subproperty: has rapporteur corporate body

has author family
status: Published
lexical alias: authorFamily.en
definition: Relates a work to a family who is responsible for creating a textual work.
toolkit label: author family
toolkit definition: A family who is responsible for creating a textual work.
type: Property
domain: C10001
has element type: 2
sub property of: has creator family of work
sub property of: has author collective agent
scope note: Creation of a new work by paraphrasing, rewriting, or adapting works by another creator, if the modification has substantially changed the nature and content of the original or changed the medium of expression, is included.
label: kirjoittaja (suku) @fi
definition: Liittää teoksen sukuun, joka on vastuussa tekstiteoksen luomisesta. @fi
scope note: Kattaa uuden teoksen luomisen toisen tekijän teoksia mukailemalla, muokkaamalla tai sovittamalla, mikäli muutos on olennaisesti muuttanut alkuperäisen luonnetta ja sisältöä tai muuttanut ilmaisumuotoa. @fi
toolkit label: kirjoittaja (suku) @fi
toolkit definition: Suku, joka on vastuussa tekstiteoksen luomisesta. @fi
label: har forfatter (familie) @no
definition: Relaterer et verk til en familie som er ansvarlig for et tekstlig verk. @no
scope note: Det å skape et nytt verk ved å omskrive eller bearbeide verk av en annen opphaver er inkludert hvis dette i vesentlig grad har endret originalverkets særpreg og innhold, eller hvis mediet for uttrykket er endret. @no
toolkit label: forfatter (familie) @no
toolkit definition: En familie som er ansvarlig for et tekstlig verk. @no
label: heeft auteur-familie @nl
definition: Relateert een werk aan een familie die verantwoordelijk is voor het creëren van een tekstwerk. @nl
scope note: Creatie van een nieuw werk door het parafraseren, herschrijven of bewerken van werken van een andere maker, als de wijziging de aard en content van het origineel substantieel gewijzigd heeft of het medium van expressie gewijzigd heeft, is inbegrepen. @nl
toolkit label: auteur-familie @nl
toolkit definition: Een familie die verantwoordelijk is voor het creëren van een tekstwerk. @nl
label: له عائلة مؤلفة @ar
definition: يربط بين عمل وعائلة مسئولة عن إنشاء عمل نصي. @ar
scope note: يتم تضمين إنشاء عمل جديد عن طريق إعادة منشئ آخر الصياغة، أو الكتابة، أو تكييفه الأعمال، إذا كان التعديل قد غيّر طبيعة الأصل ومحتواه أو غير وسيلة التعبير تغييرا كبيرا. @ar
toolkit label: عائلة مؤلفة @ar
toolkit definition: عائلة مسئولة عن إنشاء عمل نصي. @ar
label: té com a família autora @ca
definition: Relaciona una obra amb una família que és responsable de la creació d’una obra textual. @ca
scope note: Inclou la creació d’una obra nova parafrasejant, reescrivint o adaptant obres d’un altre creador, si la modificació ha canviat substancialment la natura i el contingut de l’original o si ha canviat el mitjà d’expressió. @ca
toolkit label: família autora @ca
toolkit definition: Família que és responsable de la creació d’una obra textual. @ca
label: har familie, som er forfatter @da
definition: Relaterer et værk til en familie, som er ansvarlig for et tekstværk. @da
scope note: Skabelse af et nyt værk ved at parafrasere, omskrive eller bearbejde værker af et andet ophav, hvis modificeringen har medført en væsentlig ændring af originalens karakter og indhold, eller den har ændret udtryksmediet, er omfattet. @da
toolkit label: familie, som er forfatter @da
toolkit definition: Familie, som er ansvarlig for et tekstværk. @da
label: tekstteose autor (perekond) @et
definition: Seostab teose perekonnaga, kes vastutab tekstteose loomise eest. @et
scope note: Hõlmab ka uue teose loomist, ümber sõnastades, ümber töötades või adapteerides teise autori teoseid, kui teisendamine on originaali olemust ja sisu oluliselt muutnud või muutunud on väljenduse meedium. @et
toolkit label: tekstteose autor (perekond) @et
toolkit definition: Perekond, kes vastutab tekstteose loomise eest. @et
label: hat Verfasserin/Verfasser (Familie) @de
definition: Setzt ein Werk in Beziehung zu einer Familie, die für die Schaffung eines textlichen Werks verantwortlich ist. @de
scope note: Darunter fällt die Schaffung eines neuen Werks durch Paraphrasieren, Umschreiben oder Adaption von Werken einer anderen geistigen Schöpferin/eines anderen geistigen Schöpfers, wenn die Veränderung die Art und den Inhalt des Originals substanziell verändert hat oder sich das Medium der Expression geändert hat. @de
toolkit label: Verfasserin/Verfasser (Familie) @de
toolkit definition: Eine Familie, die für die Schaffung eines textlichen Werks verantwortlich ist. @de
label: szerző családja a következő: @hu
definition: Hozzákapcsol egy művet egy családhoz, amely felelős egy szöveges mű létrehozásáért. @hu
scope note: Beletartozik egy új mű megalkotása egy másik alkotó munkáinak átfogalmazásával, újraírásával vagy adaptálásával, ha a módosítás lényegesen megváltoztatta az eredeti jellegét és tartalmát, vagy a kifejezési forma médiumát. @hu
toolkit label: szerző család: @hu
toolkit definition: Egy család, amely felelős egy szöveges mű létrehozásáért. @hu
label: ha come autore famiglia @it
definition: Correla un'opera alla famiglia responsabile di un'opera testuale. @it
scope note: E' compresa la creazione di una nuova opera tramite la parafrasi, riscrittura o adattamento di opere di un altro creatore, se la modifica ha cambiato sostanzialmente la natura e contenuto dell'originale, o ha mutato il mezzo di espressione. @it
toolkit label: autore famiglia @it
toolkit definition: Famiglia responsabile di un'opera testuale. @it
label: a pour famille autrice @fr
definition: Met une œuvre en relation avec une famille qui est responsable de la création d’une œuvre textuelle. @fr
scope note: La création d’une nouvelle œuvre en paraphrasant, en réécrivant ou en adaptant les œuvres d’un autre créateur est incluse, si la modification a changé considérablement la nature et le contenu de l’original ou a changé le mode d’expression. @fr
toolkit label: famille autrice @fr
toolkit definition: Famille qui est responsable de la création d’une œuvre textuelle. @fr
label: autors (dzimta/ģimene) @lv
definition: Sasaista darbu ar dzimtu/ģimeni, kas ir atbildīga par tekstuālu darbu. @lv
toolkit label: autors (dzimta/ģimene) @lv
toolkit definition: Dzimta/ģimene, kas ir atbildīga par tekstuālu darbu. @lv
scope note: Ietver arī jauna darba radīšanu, pārfrazējot, pārrakstot vai pielāgojot cita radītāja darbus, ja ir būtiski mainīta pamatdarba būtība, saturs vai izteiksmes nesējs. @lv
label: 有著者家族 @zh-hans
definition: 将一种作品与负责创建一种文字作品的一个家族关联起来。 @zh-hans
toolkit label: 著者家族 @zh-hans
toolkit definition: 负责创建一种文字作品的一个家族 @zh-hans
scope note: 通过演绎、改写或改变另一个创建者的作品所作而成的新作品的创建，如果修改实质性改变了原作的性质和内容或者改变了内容表达的媒介，应被包括在内。 @zh-hans
has subproperty: has librettist family
has subproperty: has lyricist family
has subproperty: has rapporteur family

has authorized access point for work
status: Published
sub property of: has access point for work
type: Property
lexical alias: authorizedAccessPointForWork.en
definition: Relates a work to a nomen that is an access point of work that is selected for preference in a specific vocabulary encoding scheme.
domain: C10001
toolkit label: authorized access point for work
toolkit definition: A nomen that is an access point of work that is selected for preference in a specific vocabulary encoding scheme.
has element type: 3
sub property of: P00020
label: teoksen auktorisoitu hakutieto @fi
definition: Liittää teoksen nomeniin, joka on teoksen hakutieto, joka on valittu ensisijaiseksi tietyssä sanaston merkintäjärjestelmässä. @fi
toolkit label: teoksen auktorisoitu hakutieto @fi
toolkit definition: Nomen, joka on teoksen hakutieto, joka on valittu ensisijaiseksi tietyssä sanaston merkintäjärjestelmässä. @fi
label: har autorisert søkeinngang for verk @no
definition: Relaterer et verk til en søkeinngang for verk som er valgt som preferanse i et bestemt kodeskjema for vokabular. @no
toolkit label: autorisert søkeinngang for verk @no
toolkit definition: En søkeinngang for verk som er valgt som preferanse i et bestemt kodeskjema for vokabular. @no
label: heeft geautoriseerde ingang voor werk @nl
definition: Relateert een werk aan een nomen dat is een ingang voor werk die bij voorkeur geselecteerd is in een specifiek vocabulair coderingssysteem. @nl
toolkit label: geautoriseerde ingang voor werk @nl
toolkit definition: Een nomen dat is een ingang voor werk die bij voorkeur geselecteerd is in een specifiek vocabulair coderingssysteem. @nl
label: له نقطة وصول مقننة لعمل @ar
definition: يربط بين عمل وتسمية عبارة عن نقطة وصول لعمل تم اختيارها بتفضيل استخدامها في خطة ترميز مفردات معينة. @ar
toolkit label: له نقطة وصول مقننة لعمل @ar
toolkit definition: تسمية عبارة عن نقطة وصول لعمل تم اختيارها بتفضيل استخدامها في خطة ترميز مفردات معينة. @ar
label: té com a punt d’accés autoritzat d’obra @ca
definition: Relaciona una obra amb un nomen que és un punt d’accés d’obra que se selecciona com a preferent en un esquema de codificació de vocabulari específic. @ca
toolkit label: punt d’accés autoritzat d’obra @ca
toolkit definition: Nomen que és un punt d’accés d’obra que se selecciona com a preferent en un esquema de codificació de vocabulari específic. @ca
label: har autoriseret søgeindgang for værk @da
definition: Relaterer et værk til en søgeindgang for værk, som er valgt som præference i et specifikt vokabularkodningsskema. @da
toolkit label: autoriseret søgeindgang for værk @da
toolkit definition: Søgeindgang for værk, som er valgt som præference i et specifikt vokabularkodningsskema. @da
label: teose normitud otsielement @et
definition: Seostab teose teose otsielemendiga, mis on valitud eelistatuks vastavas leksikaalses märkimissüsteemis. @et
toolkit label: teose normitud otsielement @et
toolkit definition: Teose otsielement, mis on valitud eelistatuks vastavas leksikaalses märkimissüsteemis. @et
label: hat normierten Sucheinstieg für ein Werk @de
definition: Setzt ein Werk in Beziehung zu einem Sucheinstieg für ein Werk, der in einem bestimmten Vocabulary Encoding Scheme als Vorzugsform bestimmt wird. @de
toolkit label: Normierter Sucheinstieg für ein Werk @de
toolkit definition: Ein Sucheinstieg für ein Werk, der in einem bestimmten Vocabulary Encoding Scheme als Vorzugsform bestimmt wird. @de
label: mű autorizált hozzáférési pontja a következő: @hu
definition: Hozzákapcsol egy művet egy nomenhez, amelynek van egy olyan előnyben részesített hozzáférési pontja a műhöz, amelyet egy adott szótárkódolási sémából választanak ki. @hu
toolkit label: mű autorizált hozzáférési pontja: @hu
toolkit definition: Egy nomen, amelynek van egy olyan előnyben részesített hozzáférési pontja a műhöz, amelyet egy adott szótárkódolási sémából választanak ki. @hu
label: ha come punto d'accesso autorizzato per opera @it
definition: Correla un’opera a un punto d’accesso per l’opera che è selezionato come preferito in uno specifico schema di codifica di vocabolario. @it
toolkit label: punto d'accesso autorizzato per opera @it
toolkit definition: Punto d’accesso per l’opera che è selezionato come preferito in uno specifico schema di codifica di vocabolario. @it
label: a pour point d’accès autorisé d’une œuvre @fr
definition: Met une œuvre en relation avec un nomen qui est un point d’accès d’une œuvre faisant l’objet d’un choix privilégié dans un schéma d’encodage de vocabulaire spécifique. @fr
toolkit label: point d’accès autorisé d’une œuvre @fr
toolkit definition: Nomen qui est un point d’accès d’une œuvre faisant l’objet d’un choix privilégié dans un schéma d’encodage de vocabulaire spécifique. @fr
label: darba autoritatīvā pamatforma @lv
definition: Sasaista darbu ar nomenu, kas ir darba pamatforma, kas ir izvēle no konkrētas vārdnīcas. @lv
toolkit label: darba autoritatīvā pamatforma @lv
toolkit definition: Darba pamatforma, kas ir izvēle no konkrētas vārdnīcas. @lv
label: 有作品的规范检索点 @zh-hans
definition: 将一种作品与作为一种作品的检索点、并在一个特定的词表编码体系中被首选的一个命名关联起来。 @zh-hans
toolkit label: 作品的规范检索点 @zh-hans
toolkit definition: 作为一种作品的检索点、并在一个特定的词表编码体系中被首选的一个命名 @zh-hans
has subproperty: has authorized access point for work group
has subproperty: P10331
label: eser için yetkili erişim noktası ile ilişkilidir @tr
definition: Bir eseri, belirli bir kelime kodlama şemasında tercih için seçilen bir eserin erişim noktası olan bir isimle ilişkilendirir. @tr
toolkit label: eser için yetkili erişim noktası @tr
toolkit definition: Belirli bir kelime kodlama şemasında tercih edilmek üzere seçilen bir eserin erişim noktası olan bir isim. @tr

has authorized access point for work group
status: Published
lexical alias: authorizedAccessPointForWorkGroup.en
definition: Relates a work to a nomen that is an authorized access point for work used in a specific vocabulary encoding scheme to identify a work group.
toolkit label: authorized access point for work group
toolkit definition: A nomen that is an authorized access point for work used in a specific vocabulary encoding scheme to identify a work group.
type: Property
domain: C10001
has element type: 3
sub property of: has appellation of work group
label: teosryhmän auktorisoitu hakutieto @fi
definition: Liittää teoksen teoksen nomeniin, joka on hakutieto, joka on valittu ensisijaiseksi tietyssä sanaston merkintäjärjestelmässä teosryhmille. @fi
toolkit label: teosryhmän auktorisoitu hakutieto @fi
toolkit definition: Nomen, joka on teoksen hakutieto, joka on valittu ensisijaiseksi tietyssä sanaston merkintäjärjestelmässä teosryhmille. @fi
label: har autorisert søkeinngang for verksgruppe @no
definition: Relaterer et verk til en søkeinngang for verk som er valgt som preferanse i et bestemt kodeskjema for vokabular for verksgrupper. @no
toolkit label: autorisert søkeinngang for verksgruppe @no
toolkit definition: En søkeinngang for verk som er valgt som preferanse i et bestemt kodeskjema for vokabular for verksgrupper. @no
label: heeft geautoriseerde ingang voor werkgroep @nl
definition: Relateert een werk aan een nomen dat een voorkeursingang voor werk is gebruikt in een specifiek vocabulair coderingssysteem voor de identificatie van een werkgroep. @nl
toolkit label: geautoriseerde ingang voor werkgroep @nl
toolkit definition: Een nomen dat een voorkeursingang voor werk is gebruikt in een specifiek vocabulair coderingssysteem voor de identificatie van een werkgroep. @nl
label: له نقطة وصول مقننة لمجموعة عمل @ar
definition: يربط بين عمل وتسمية عبارة عن نقطة وصول لعمل تم اختيارها بتفضيل استخدامها في خطة ترميز مفردات معينة لمجموعات عمل. @ar
toolkit label: نقطة وصول مقننة لمجموعة عمل @ar
toolkit definition: تسمية عبارة عن نقطة وصول لعمل تم اختيارها بتفضيل استخدامها في خطة ترميز مفردات معينة لمجموعات عمل. @ar
label: té com a punt d’accés autoritzat de grup d’obres @ca
definition: Relaciona una obra amb un nomen que és un punt d’accés autoritzat d’obra que s’usa en un esquema de codificació de vocabulari específic per identificar un grup d’obres. @ca
toolkit label: punt d’accés autoritzat de grup d’obres @ca
toolkit definition: Nomen que és un punt d’accés autoritzat d’obra que s’usa en un esquema de codificació de vocabulari específic per identificar un grup d’obres. @ca
label: har autoriseret søgeindgang for værkgruppe @da
definition: Relaterer et værk til en søgeindgang for værk, som er valgt som præference i et specifikt vokabularkodningsskema for værkgrupper. @da
toolkit label: autoriseret søgeindgang for værkgruppe @da
toolkit definition: Søgeindgang for værk, som er valgt som præference i et specifikt vokabularkodningsskema for værkgrupper. @da
label: teoserühma normitud otsielement @et
definition: Seostab teose teose otsielemendiga, mis on valitud eelistatuks vastavas leksikaalses märkimissüsteemis teoserühmade jaoks. @et
toolkit label: teoserühma normitud otsielement @et
toolkit definition: Teose otsielement, mis on valitud eelistatuks vastavas leksikaalses märkimissüsteemis teoserühmade jaoks. @et
label: hat normierten Sucheinstieg für eine Werkgruppe @de
definition: Setzt ein Werk in Beziehung zu einem Sucheinstieg für ein Werk, der in einem bestimmten Vocabulary Encoding Scheme für Werkgruppen als Vorzugsform bestimmt wird. @de
toolkit label: Normierter Sucheinstieg für eine Werkgruppe @de
toolkit definition: Ein Sucheinstieg für ein Werk, der in einem bestimmten Vocabulary Encoding Scheme für Werkgruppen als Vorzugsform bestimmt wird. @de
label: műcsoport autorizált hozzáférési pontja a következő: @hu
definition: Hozzákapcsol egy művet egy nomenhez, amely egy olyan előnyben részesített hozzáférési pont a műhöz, amelyet egy adott szótárkódolási sémából választanak ki. @hu
toolkit label: műcsoport autorizált hozzáférési pontja: @hu
toolkit definition: Egy nomen, amely egy olyan előnyben részesített hozzáférési pont a műhöz, amelyet egy adott szótárkódolási sémából választanak ki. @hu
label: ha come punto d'accesso autorizzato per gruppo di opere @it
definition: Correla un'opera a un punto d'accesso di opera, scelto come preferito nell'ambito di uno specifico schema di codifica di vocabolario per gruppi di opere. @it
toolkit label: punto d'accesso autorizzato per gruppo di opere @it
toolkit definition: Punto d'accesso di opera, selezionato come preferito nell'ambito di uno specifico schema di codifica di vocabolario per gruppi di opere. @it
label: a pour point d’accès autorisé d’un groupe d’œuvres @fr
definition: Met une œuvre en relation avec un nomen qui est un point d’accès autorisé d’une œuvre utilisé dans un schéma d’encodage de vocabulaire spécifique pour identifier un groupes d’œuvres. @fr
toolkit label: point d’accès autorisé d’un groupe d’œuvres @fr
toolkit definition: Nomen qui est un point d’accès autorisé d’une œuvre utilisé dans un schéma d’encodage de vocabulaire spécifique pour identifier un groupes d’œuvres. @fr
label: autoritatīvā pamatforma darba grupai @lv
definition: Sasaista darbu ar nomenu, kas ir darbs, kuram ir darba pamatforma, kas izvēlēta no konkrētas vārdnīcas. @lv
toolkit label: autoritatīvā pamatforma darba grupai @lv
toolkit definition: Darbs, kuram ir darba pamatforma, kas izvēlēta no konkrētas vārdnīcas. @lv
sub property of: has authorized access point for work
label: 有作品群的规范检索点 @zh-hans
definition: 将一种作品与作为一种作品的检索点、并在一个特定的词表编码体系中被首选用于作品群的一个命名关联起来。 @zh-hans
toolkit label: 作品群的规范检索点 @zh-hans
toolkit definition: 作为一种作品的检索点、并在一个特定的词表编码体系中被首选用于作品群的一个命名 @zh-hans
has subproperty: P10401
label: eser grubu için yetkili erişim noktası ile ilişkilidir @tr
definition: Bir eseri, eser grupları için belirli bir kelime kodlama şemasında tercih için seçilen bir eserin erişim noktası olan bir isimle ilişkilendirir. @tr
toolkit label: eser grubu için yetkili erişim noktası @tr
toolkit definition: Eser grupları için belirli bir kelime kodlama şemasında tercih için seçilen bir eserin erişim noktası olan bir isim. @tr

has author person
status: Published
lexical alias: authorPerson.en
definition: Relates a work to a person who is responsible for creating a textual work.
toolkit label: author person
toolkit definition: A person who is responsible for creating a textual work.
type: Property
domain: C10001
has element type: 2
sub property of: has creator person of work
sub property of: has author agent
scope note: Creation of a new work by paraphrasing, rewriting, or adapting works by another creator, if the modification has substantially changed the nature and content of the original or changed the medium of expression, is included.
label: kirjoittaja (henkilö) @fi
definition: Liittää teoksen henkilöön, joka on vastuussa tekstiteoksen luomisesta. @fi
scope note: Kattaa uuden teoksen luomisen toisen tekijän teoksia mukailemalla, muokkaamalla tai sovittamalla, mikäli muutos on olennaisesti muuttanut alkuperäisen luonnetta ja sisältöä tai muuttanut ilmaisumuotoa. @fi
toolkit label: kirjoittaja (henkilö) @fi
toolkit definition: Henkilö, joka on vastuussa tekstiteoksen luomisesta. @fi
label: har forfatter (person) @no
definition: Relaterer et verk til en person som er ansvarlig for et tekstlig verk. @no
scope note: Det å skape et nytt verk ved å omskrive eller bearbeide verk av en annen opphaver er inkludert hvis dette i vesentlig grad har endret originalverkets særpreg og innhold, eller hvis mediet for uttrykket er endret. @no
toolkit label: forfatter (person) @no
toolkit definition: En person som er ansvarlig for et tekstlig verk. @no
label: heeft auteur-persoon @nl
definition: Relateert een werk aan een persoon die verantwoordelijk is voor het creëren van een tekstwerk. @nl
scope note: Creatie van een nieuw werk door het parafraseren, herschrijven of bewerken van werken van een andere maker, als de wijziging de aard en content van het origineel substantieel gewijzigd heeft of het medium van expressie gewijzigd heeft, is inbegrepen. @nl
toolkit label: auteur-persoon @nl
toolkit definition: Een persoon die verantwoordelijk is voor het creëren van een tekstwerk. @nl
label: له شخص مؤلف @ar
definition: يربط بين عمل وشخص مسئول عن إنشاء عمل نصي. @ar
scope note: يتم تضمين إنشاء عمل جديد عن طريق إعادة منشئ آخر الصياغة، أو الكتابة، أو تكييفه الأعمال، إذا كان التعديل قد غيّر طبيعة الأصل ومحتواه أو غير وسيلة التعبير تغييرا كبيرا. @ar
toolkit label: شخص مؤلف @ar
toolkit definition: شخص مسئول عن إنشاء عمل نصي. @ar
label: té com a persona autora @ca
definition: Relaciona una obra amb una persona que és responsable de la creació d’una obra textual. @ca
scope note: Inclou la creació d’una obra nova parafrasejant, reescrivint o adaptant obres d’un altre creador, si la modificació ha canviat substancialment la natura i el contingut de l’original o si ha canviat el mitjà d’expressió. @ca
toolkit label: persona autora @ca
toolkit definition: Persona que és responsable de la creació d’una obra textual. @ca
label: har person, som er forfatter @da
definition: Relaterer et værk til en person, som er ansvarlig for et tekstværk. @da
scope note: Skabelse af et nyt værk ved at parafrasere, omskrive eller bearbejde værker af et andet ophav, hvis modificeringen har medført en væsentlig ændring af originalens karakter og indhold, eller den har ændret udtryksmediet, er omfattet. @da
toolkit label: person, som er forfatter @da
toolkit definition: Person, som er ansvarlig for et tekstværk. @da
label: tekstteose autor (isik) @et
definition: Seostab teose isikuga, kes vastutab tekstteose loomise eest. @et
scope note: Hõlmab ka uue teose loomist, ümber sõnastades, ümber töötades või adapteerides teise autori teoseid, kui teisendamine on originaali olemust ja sisu oluliselt muutnud või muutunud on väljenduse meedium. @et
toolkit label: tekstteose autor (isik) @et
toolkit definition: Isik, kes vastutab tekstteose loomise eest. @et
label: hat Verfasserin/Verfasser (Person) @de
definition: Setzt ein Werk in Beziehung zu einer Person, die für die Schaffung eines textlichen Werks verantwortlich ist. @de
scope note: Darunter fällt die Schaffung eines neuen Werks durch Paraphrasieren, Umschreiben oder Adaption von Werken einer anderen geistigen Schöpferin/eines anderen geistigen Schöpfers, wenn die Veränderung die Art und den Inhalt des Originals substanziell verändert hat oder sich das Medium der Expression geändert hat. @de
toolkit label: Verfasserin/Verfasser (Person) @de
toolkit definition: Eine Person, die für die Schaffung eines textlichen Werks verantwortlich ist. @de
label: szerző személye a következő: @hu
definition: Hozzákapcsol egy művet egy személyhez, aki felelős egy szöveges mű létrehozásáért. @hu
scope note: Beletartozik egy új mű megalkotása egy másik alkotó munkáinak átfogalmazásával, újraírásával vagy adaptálásával, ha a módosítás lényegesen megváltoztatta az eredeti jellegét és tartalmát, vagy a kifejezési forma médiumát. @hu
toolkit label: szerző személy: @hu
toolkit definition: Egy személy, aki felelős egy szöveges mű létrehozásáért. @hu
label: ha come autore persona @it
definition: Correla un'opera alla persona responsabile di un'opera testuale. @it
scope note: E' compresa la creazione di una nuova opera tramite la parafrasi, riscrittura o adattamento di opere di un altro creatore, se la modifica ha cambiato sostanzialmente la natura e contenuto dell'originale, o ha cambiato il mezzo di espressione. @it
toolkit label: autore persona @it
toolkit definition: Persona responsabile di un'opera testuale. @it
label: a pour personne autrice @fr
definition: Met une œuvre en relation avec une personne qui est responsable de la création d’une œuvre textuelle. @fr
scope note: La création d’une nouvelle œuvre en paraphrasant, en réécrivant ou en adaptant les œuvres d’un autre créateur est incluse, si la modification a changé considérablement la nature et le contenu de l’original ou a changé le mode d’expression. @fr
toolkit label: personne autrice @fr
toolkit definition: Personne qui est responsable de la création d’une œuvre textuelle. @fr
label: autors (persona) @lv
definition: Sasaista darbu ar personu, kura ir atbildīga par tekstuālu darbu. @lv
toolkit label: autors (persona) @lv
toolkit definition: Persona, kura ir atbildīga par tekstuālu darbu. @lv
scope note: Ietver arī jauna darba radīšanu, pārfrazējot, pārrakstot vai pielāgojot cita radītāja darbus, ja ir būtiski mainīta pamatdarba būtība, saturs vai izteiksmes nesējs. @lv
label: 有著者个人 @zh-hans
definition: 将一种作品与负责创建一种文字作品的一个个人关联起来。 @zh-hans
toolkit label: 著者个人 @zh-hans
toolkit definition: 负责创建一种文字作品的一个个人 @zh-hans
scope note: 通过演绎、改写或改变另一个创建者的作品所作而成的新作品的创建，如果修改实质性改变了原作的性质和内容或者改变了内容表达的媒介，应被包括在内。 @zh-hans
has subproperty: has librettist person
has subproperty: has lyricist person
has subproperty: has rapporteur person

is binding of item of
status: Published
lexical alias: bindingOfItemOf.en
definition: Relates a work to an item that is bound.
toolkit label: binding of item of
toolkit definition: An item that is bound.
type: Property
domain: C10001
sub property of: has related item of work
has element type: 2
label: kappaleen sidos kappaleesta @fi
definition: Liittää teoksen kappaleeseen, joka on sidottu. @fi
toolkit label: kappaleen sidos kappaleesta @fi
toolkit definition: Kappale, joka on sidottu. @fi
label: er innbinding av eksemplar for @no
definition: Relaterer et verk til et eksemplar som er innbundet. @no
toolkit label: innbinding av eksemplar for @no
toolkit definition: Et eksemplar som er innbundet. @no
label: is bindwijze van item van @nl
definition: Relateert een werk aan een item dat gebonden is. @nl
toolkit label: binden van item van @nl
toolkit definition: Een item dat gebonden is. @nl
label: هو تجليد لمفردة لـ @ar
definition: يربط بين عمل ومفردة تم تجليدها. @ar
toolkit label: تجليد لمفردة لـ @ar
toolkit definition: مفردة تم تجليدها. @ar
label: és enquadernació d’un ítem de @ca
definition: Relaciona una obra amb un ítem que és enquadernat. @ca
toolkit label: enquadernació d’un ítem de @ca
toolkit definition: Ítem que és enquadernat. @ca
label: er indbinding af eksemplar af @da
definition: Relaterer et værk til et eksemplar, som er indbundet. @da
toolkit label: indbinding af eksemplar af @da
toolkit definition: Eksemplar, som er indbundet. @da
label: köide eksemplarile @et
definition: Seostab teose köidetud eksemplariga. @et
toolkit label: köide eksemplarile @et
toolkit definition: Köidetud eksemplar. @et
label: ist Einband eines Exemplars von @de
definition: Setzt ein Werk in Beziehung zu einem gebundenen Exemplar. @de
toolkit label: Einband eines Exemplars von @de
toolkit definition: Ein gebundenes Exemplar. @de
label: kötése a következő példánynak: @hu
definition: Hozzákapcsol egy művet egy példányhoz, amely maga a kötés. @hu
toolkit label: kötése a következő példánynak: @hu
toolkit definition: Egy példány, amely maga a kötés. @hu
label: è legatura dell'item di @it
definition: Correla un’opera a un item rilegato. @it
toolkit label: legatura dell'item di @it
toolkit definition: Item rilegato. @it
label: est une reliure d’un item de @fr
definition: Met une œuvre en relation avec un item qui est relié. @fr
toolkit label: reliure d’un item de @fr
toolkit definition: Item qui est relié. @fr
label: ir iesietā vienība @lv
definition: Sasaista darbu ar vienību, kas ir iesieta. @lv
toolkit label: iesietā vienība @lv
toolkit definition: Vienība, kas ir iesieta. @lv
label: 是……的单件的装订 @zh-hans
definition: 将一种作品与一个被装订的单件关联起来。 @zh-hans
toolkit label: ……的单件的装订 @zh-hans
toolkit definition: 一个被装订的单件 @zh-hans
has subproperty: P10364
label: kopyasının ciltleyicisidir @tr
definition: Bir eseri, ciltlenmiş bir kopyayla ilişkilendirir. @tr
toolkit label: kopyanın ciltlenmesi @tr
toolkit definition: Ciltli bir kopya. @tr

is binding of manifestation of
status: Published
lexical alias: bindingOfManifestationOf.en
definition: Relates a work to a manifestation that is bound.
toolkit label: binding of manifestation of
toolkit definition: A manifestation that is bound.
type: Property
domain: C10001
sub property of: has related manifestation of work
has element type: 2
label: manifestaation sidos manifestaatiosta @fi
definition: Liittää teoksen manifestaatioon, joka on sidottu. @fi
toolkit label: manifestaation sidos manifestaatiosta @fi
toolkit definition: Manifestaatio, joka on sidottu. @fi
label: er innbinding av manifestasjon for @no
definition: Relaterer et verk til en manifestasjon som er innbundet. @no
toolkit label: innbinding av manifestasjon for @no
toolkit definition: En manifestasjon som er innbundet. @no
label: is bindwijze van manifestatie van @nl
definition: Relateert een werk aan een manifestatie die gebonden is. @nl
toolkit label: binden van manifestatie van @nl
toolkit definition: Een manifestatie die gebonden is. @nl
label: هو تجليد لتجسيدة لـ @ar
definition: يربط بين عمل وتجسيدة تم تجليدها. @ar
toolkit label: تجليد لتجسيدة لـ @ar
toolkit definition: تجسيدة تم تجليدها. @ar
label: és enquadernació d’una manifestació de @ca
definition: Relaciona una obra amb una manifestació que és enquadernada. @ca
toolkit label: enquadernació d’una manifestació de @ca
toolkit definition: Manifestació que és enquadernada. @ca
label: er indbinding af manifestation af @da
definition: Relaterer et værk til en manifestation, som er indbundet. @da
toolkit label: indbinding af manifestation af @da
toolkit definition: Manifestation, som er indbundet. @da
label: köide kehastusele @et
definition: Seostab teose köidetud kehastusega. @et
toolkit label: köide kehastusele @et
toolkit definition: Köidetud kehastus. @et
label: ist Einband einer Manifestation von @de
definition: Setzt ein Werk in Beziehung zu einer gebundenen Manifestation. @de
toolkit label: Einband einer Manifestation von @de
toolkit definition: Eine gebundene Manifestation. @de
label: könyvkötött megjelenési formája a következőnek: @hu
definition: Hozzákapcsol egy művet egy megjelenési formához, amely maga a kötés. @hu
toolkit label: könyvkötött megjelenési forma @hu
toolkit definition: Egy megjelenési forma, amely maga a kötés. @hu
label: è legatura della manifestazione di @it
definition: Correla un’opera a una manifestazione rilegata. @it
toolkit label: legatura della manifestazione di @it
toolkit definition: Manifestazione rilegata. @it
label: est une reliure d’une manifestation de @fr
definition: Met une œuvre en relation avec une manifestation qui est reliée. @fr
toolkit label: reliure d’une manifestation de @fr
toolkit definition: Manifestation qui est reliée. @fr
label: ir iesējums manifestācijai @lv
definition: Sasaista darbu ar manifestāciju, kas ir iesieta. @lv
toolkit label: ir iesējums manifestācijai @lv
toolkit definition: Manifestācija, kas ir iesieta. @lv
label: 是……的载体表现的装订 @zh-hans
definition: 将一种作品与一种被装订的载体表现关联起来。 @zh-hans
toolkit label: ……的载体表现的装订 @zh-hans
toolkit definition: 一种被装订的载体表现 @zh-hans
has subproperty: P10363
label: gösteriminin ciltleyicisidir @tr
definition: Bir eseri, bağlı olduğu bir eserle ilişkilendirir. @tr
toolkit label: gösterimin ciltlenmesi @tr
toolkit definition: Ciltli bir gösterim. @tr

has judge
status: Published
definition: Relates a work to a person who hears and decides on legal matters in court.
type: Property
domain: C10001
sub property of: has creator person of work
lexical alias: judge.en
toolkit label: judge
toolkit definition: A person who hears and decides on legal matters in court.
toolkit label: juge @fr
toolkit definition: Personne qui entend des causes juridiques et rend jugement dans un tribunal. @fr
toolkit label: juez @es
toolkit definition: Una persona que escucha y se pronuncia sobre materias legales en un tribunal. @es
instruction number: 18.5
label: har dommer @da
definition: Relaterer et værk til en person, som hører og afgører juridiske anliggender i retten. @da
toolkit label: dommer @da
toolkit definition: Person, som hører og afgører juridiske anliggender i retten. @da
definition: Met une œuvre en relation avec une personne qui entend des causes juridiques et rend jugement dans un tribunal. @fr
label: có quan toà @vi
definition: Liên kết tác phẩm với cá nhân nghe và quyết định về các vấn đề luật pháp tại toà án. @vi
toolkit label: quan toà @vi
toolkit definition: Cá nhân nghe và quyết định về các vấn đề luật pháp tại toà án. @vi
label: hat Richterin/Richter @de
definition: Setzt ein Werk in Beziehung zu einer Person, die bei Gericht juristische Angelegenheiten anhört und darüber entscheidet. @de
toolkit label: Richterin/Richter @de
toolkit definition: Eine Person, die bei Gericht juristische Angelegenheiten anhört und darüber entscheidet. @de
label: a pour juge @fr
definition: Liittää teoksen henkilöön, joka kuulee ja päättää oikeusasioista tuomioistuimessa. @fi
toolkit label: tuomari @fi
toolkit definition: Henkilö, joka kuulee ja päättää oikeusasioista tuomioistuimessa. @fi
toolkit definition: En person som hører og tar avgjørelser i saker i en rettsinstans. @no
label: té com a jutge @ca
definition: Relaciona una obra amb una persona que escolta i decideix en les causes jurídiques en un tribunal. @ca
toolkit label: jutge @ca
toolkit definition: Persona que escolta i decideix en les causes jurídiques en un tribunal. @ca
has element type: 2
label: έχει κριτή @el
definition: Συνδέει ένα έργο με ένα φυσικό πρόσωπο, το οποίο ακούει και αποφασίζει αναφορικά με ζητήματα νομικής φύσης στο δικαστήριο. @el
toolkit label: κριτής @el
toolkit definition: Ένα φυσικό πρόσωπο, το οποίο ακούει και αποφασίζει αναφορικά με ζητήματα νομικής φύσης στο δικαστήριο. @el
label: bírója a következő: @hu
definition: Hozzákapcsol egy művet egy személyhez, aki jogi ügyekben tárgyalást vezet és ítélkezik a bíróságon. @hu
toolkit label: bíró: @hu
toolkit definition: Egy személy, aki jogi ügyekben tárgyalást vezet és ítélkezik a bíróságon. @hu
label: tuomari @fi
definition: Relaterer et verk til en person som hører og tar avgjørelser i saker i en rettsinstans. @no
label: heeft rechter @nl
definition: Relateert een werk aan een persoon die hoort en oordeelt over juridische zaken in rechtszitting.Een persoon die hoort en oordeelt over juridische zaken in rechtszitting.Een persoon die hoort en oordeelt over juridische zaken in rechtszitting.Een persoon die hoort en oordeelt over juridische zaken in rechtszitting.Een persoon die hoort en oordeelt over juridische zaken in rechtszitting.Een persoon die hoort en oordeelt over juridische zaken in rechtszitting.Een persoon die hoort en oordeelt over juridische zaken in rechtszitting.Een persoon die hoort en oordeelt over juridische zaken in rechtszitting.Een persoon die hoort en oordeelt over juridische zaken in rechtszitting.Een persoon die hoort en oordeelt over juridische zaken in rechtszitting.Een persoon die hoort en oordeelt over juridische zaken in rechtszitting.Een persoon die hoort en oordeelt over juridische zaken in rechtszitting.Een persoon die hoort en oordeelt over juridische zaken in rechtszitting.Een persoon die hoort en oordeelt over juridische zaken in rechtszitting.Een persoon die hoort en oordeelt over juridische zaken in rechtszitting.Een persoon die hoort en oordeelt over juridische zaken in rechtszitting.Een persoon die hoort en oordeelt over juridische zaken in rechtszitting.Een persoon die hoort en oordeelt over juridische zaken in rechtszitting.Een persoon die hoort en oordeelt over juridische zaken in rechtszitting.Een persoon die hoort en oordeelt over juridische zaken in rechtszitting.Een persoon die hoort en oordeelt over juridische zaken in rechtszitting.Een persoon die hoort en oordeelt over juridische zaken in rechtszitting.Een persoon die hoort en oordeelt over juridische zaken in rechtszitting.Een persoon die hoort en oordeelt over juridische zaken in rechtszitting.Een persoon die hoort en oordeelt over juridische zaken in rechtszitting.Een persoon die hoort en oordeelt over juridische zaken in rechtszitting.Een persoon die hoort en oordeelt over juridische zaken in rechtszitting.Een pe… @nl
toolkit label: rechter @nl
toolkit definition: Een persoon die hoort en oordeelt over juridische zaken in rechtszitting.Een persoon die hoort en oordeelt over juridische zaken in rechtszitting.Een persoon die hoort en oordeelt over juridische zaken in rechtszitting.Een persoon die hoort en oordeelt over juridische zaken in rechtszitting.Een persoon die hoort en oordeelt over juridische zaken in rechtszitting.Een persoon die hoort en oordeelt over juridische zaken in rechtszitting.Een persoon die hoort en oordeelt over juridische zaken in rechtszitting.Een persoon die hoort en oordeelt over juridische zaken in rechtszitting.Een persoon die hoort en oordeelt over juridische zaken in rechtszitting.Een persoon die hoort en oordeelt over juridische zaken in rechtszitting.Een persoon die hoort en oordeelt over juridische zaken in rechtszitting.Een persoon die hoort en oordeelt over juridische zaken in rechtszitting.Een persoon die hoort en oordeelt over juridische zaken in rechtszitting.Een persoon die hoort en oordeelt over juridische zaken in rechtszitting.Een persoon die hoort en oordeelt over juridische zaken in rechtszitting.Een persoon die hoort en oordeelt over juridische zaken in rechtszitting.Een persoon die hoort en oordeelt over juridische zaken in rechtszitting.Een persoon die hoort en oordeelt over juridische zaken in rechtszitting.Een persoon die hoort en oordeelt over juridische zaken in rechtszitting.Een persoon die hoort en oordeelt over juridische zaken in rechtszitting.Een persoon die hoort en oordeelt over juridische zaken in rechtszitting.Een persoon die hoort en oordeelt over juridische zaken in rechtszitting.Een persoon die hoort en oordeelt over juridische zaken in rechtszitting.Een persoon die hoort en oordeelt over juridische zaken in rechtszitting.Een persoon die hoort en oordeelt over juridische zaken in rechtszitting.Een persoon die hoort en oordeelt over juridische zaken in rechtszitting.Een persoon die hoort en oordeelt over juridische zaken in rechtszitting.Een persoon die hoort en oord… @nl
label: له قاضي @ar
definition: يربط بين عمل وشخص ينظر في المسائل القانونية ويفصل فيها في محكمة. @ar
toolkit label: قاضي @ar
toolkit definition: شخص ينظر في المسائل القانونية ويفصل فيها في محكمة. @ar
label: kohtunik @et
definition: Seostab teose isikuga, kes kohtus kuulab ära ja otsustab õigusasju. @et
toolkit label: kohtunik @et
toolkit definition: Isik, kes kohtus kuulab ära ja otsustab õigusasju. @et
label: ha come giudice @it
definition: Correla un’opera a una persona che ascolta e decide su questioni giuridiche nell'ambito di un tribunale. @it
toolkit label: giudice @it
toolkit definition: Persona che ascolta e decide su questioni giuridiche nell'ambito di un tribunale. @it
label: tiesnesis @lv
definition: Sasaista darbu ar personu, kura tiesā izskata/uzklausa un lemj juridiskus jautājumus. @lv
toolkit label: tiesnesis @lv
toolkit definition: Persona, kura tiesā izskata/uzklausa un lemj juridiskus jautājumus. @lv
label: 有法官 @zh-hans
definition: 将一种作品与在法院中审理并决定法律事务的一个个人关联起来。 @zh-hans
toolkit label: 法官 @zh-hans
toolkit definition: 在法院中审理并决定法律事务的一个个人 @zh-hans
has subproperty: P10044
label: hâkim ile ilişkilidir @tr
definition: Bir eseri, mahkemede hukuki meseleleri dinleyen ve karara bağlayan kişi ile ilişkilendirir. @tr
toolkit label: Yargıç @tr
toolkit definition: Davayı dinleyip, yasal işlemlere karar veren kişi. @tr

has book artist agent
status: Published
type: Property
lexical alias: bookArtistAgent.en
definition: Relates a work to an agent who is an artist who is responsible for exploiting the book form or altering its physical structure.
domain: C10001
toolkit label: book artist agent
toolkit definition: An agent who is an artist who is responsible for exploiting the book form or altering its physical structure.
toolkit label: agent artiste du livre @fr
toolkit definition: Agent artiste qui est responsable d’exploiter la forme livre ou de modifier sa structure physique. @fr
sub property of: has artist agent
toolkit label: artista del libro @es
toolkit definition: Un artista responsable por la creación de obras de arte que aprovechan la forma del libro o alteran su estructura física como parte del contenido de la obra. @es
instruction number: 18.5
label: har agent, som er bogkunstner @da
definition: Relaterer et værk til en agent, som er en kunstner, som er ansvarlig for at udnytte bogformen eller ændre dens fysiske struktur. @da
toolkit label: agent, som er bogkunstner @da
toolkit definition: Agent, som er en kunstner, som er ansvarlig for at udnytte bogformen eller ændre dens fysiske struktur. @da
definition: Met une œuvre en relation avec un agent artiste qui est responsable d’exploiter la forme livre ou de modifier sa structure physique. @fr
label: có nghệ sỹ sách @vi
definition: Liên kết tác phẩm với nghệ sỹ có trách nhiệm tạo ra tác phẩm nghệ thuật khai thác hình thái sách hoặc thay đổi cấu trúc vật lý như là phần của nội dung. @vi
toolkit label: nghệ sỹ sách @vi
toolkit definition: Nghệ sỹ có trách nhiệm tạo ra tác phẩm nghệ thuật khai thác hình thái sách hoặc thay đổi cấu trúc vật lý như là phần của nội dung. @vi
label: hat Buchkünstlerin/Buchkünstler (Akteur) @de
definition: Setzt ein Werk in Beziehung zu einer Künstlerin/einem Künstler (Akteur), die/der für die Verwertung der Buchform oder für die Veränderung ihrer physischen Struktur verantwortlich ist. @de
toolkit label: Buchkünstlerin/Buchkünstler (Akteur) @de
toolkit definition: Eine Künstlerin/Ein Künstler (Akteur), die/der für die Verwertung der Buchform oder für die Veränderung ihrer physischen Struktur verantwortlich ist. @de
label: a pour agent artiste du livre @fr
definition: Liittää teoksen toimijaan, joka on taiteilija, joka on vastuussa kirjan muodon hyödyntämisestä tai sen fyysisen rakenteen muuttamisesta. @fi
toolkit label: kirjataiteilija (toimija) @fi
toolkit definition: Toimija, joka on taiteilija, joka on vastuussa kirjan muodon hyödyntämisestä tai sen fyysisen rakenteen muuttamisesta. @fi
toolkit label: bokkunstner (agent) @no
toolkit definition: En agent som er en kunstner som er ansvarlig for utnyttelse av bokformatet eller for endring av bokens fysiske struktur. @no
label: té com a agent artista de llibre d’art @ca
definition: Relaciona una obra amb un agent que és un artista que és responsable d’explotar la forma llibre o de modificar la seva estructura física. @ca
toolkit label: agent artista de llibre d’art @ca
toolkit definition: Agent que és un artista que és responsable d’explotar la forma llibre o de modificar la seva estructura física. @ca
has element type: 2
label: έχει βιβλίο καλλιτέχνη @el
definition: Συνδέει ένα έργο με έναν καλλιτέχνη που είναι υπεύθυνος για τη δημιουργία έργων τέχνης που αξιοποιούν τη μορφή του βιβλίου ή μεταβάλλουν τη φυσική του δομή ως μέρος του περιεχομένου. @el
toolkit label: βιβλίο καλλιτέχνη @el
toolkit definition: Ένας καλλιτέχνης που είναι υπεύθυνος για τη δημιουργία έργων τέχνης που αξιοποιούν τη μορφή του βιβλίου ή μεταβάλλουν τη φυσική του δομή ως μέρος του περιεχομένου. @el
label: könyvművész ágense a következő: @hu
definition: Hozzákapcsol egy művet egy művész ágenshez, amely felelős a könyvforma kiaknázásáért vagy fizikai szerkezetének a megváltoztatásáért. @hu
toolkit label: könyvművész ágens: @hu
toolkit definition: Egy művész ágens, amely felelős a könyvforma kiaknázásáért vagy fizikai szerkezetének a megváltoztatásáért. @hu
alternative label: book artist
alternative label: kirjataitelija @fi
label: kirjataiteilija (toimija) @fi
label: har bokkunstner (agent) @no
definition: Relaterer et verk til en agent som er en kunstner som er ansvarlig for utnyttelse av bokformatet eller for endring av bokens fysiske struktur. @no
alternative label: bokkunstner @no
label: heeft boekkunstenaar-actor @nl
definition: Relateert een werk aan een actor die een kunstenaar is die verantwoordelijk is voor het benutten van de vorm van het boek of veranderen van de fysieke structuur. @nl
toolkit label: boekkunstenaar-actor @nl
toolkit definition: Een actor die een kunstenaar is die verantwoordelijk is voor het benutten van de vorm van het boek of veranderen van de fysieke structuur. @nl
label: له وكيل فنان كتب @ar
definition: يربط بين عمل ووكيل يكون فنانًا مسئولاً عن استغلال شكل الكتاب أو تغيير هيكله المادي. @ar
alternative label: فنان كتب @ar
toolkit label: وكيل فنان كتب @ar
toolkit definition: وكيل يكون فنانا مسئولا عن استغلال شكل الكتاب أو تغيير هيكله المادي. @ar
alternative label: artista de llibre d’art @ca
alternative label: bogkunstner @da
label: raamatukunstnik (tegija) @et
definition: Seostab teose tegijaga, kes kunstnikuna vastutab raamatu vormi rakendamise või selle füüsilise struktuuri muutmise eest. @et
alternative label: raamatukunstnik @et
toolkit label: raamatukunstnik (tegija) @et
toolkit definition: Tegija, kes kunstnikuna vastutab raamatu vormi rakendamise või selle füüsilise struktuuri muutmise eest. @et
alternative label: könyvművész: @hu
label: ha come book artist agente @it
definition: Correla un’opera all'agente artista che sfrutta la forma del libro o altera la sua struttura fisica. @it
alternative label: libro d'artista @it
toolkit label: book artist agente @it
toolkit definition: Agente artista che sfrutta la forma del libro o altera la sua struttura fisica. @it
alternative label: artiste du livre @fr
label: grāmatu mākslinieks (aģents) @lv
definition: Sasaista darbu ar aģentu, kas atbild par grāmatas kā mākslas darba radīšanu, izmantojot grāmatu kā formu vai pārveidojot tās fizisko struktūru. @lv
toolkit label: grāmatu mākslinieks (aģents) @lv
toolkit definition: Aģents, kas atbild par grāmatas kā mākslas darba radīšanu, izmantojot grāmatu kā formu vai pārveidojot tās fizisko struktūru. @lv
alternative label: Buchkünstler @de
toolkit label: 图书美术家行为者 @zh-hans

has book artist collective agent
status: Published
lexical alias: bookArtistCollectiveAgent.en
definition: Relates a work to a collective agent who is an artist who is responsible for exploiting the book form or altering its physical structure.
toolkit label: book artist collective agent
toolkit definition: A collective agent who is an artist who is responsible for exploiting the book form or altering its physical structure.
type: Property
domain: C10001
has element type: 2
sub property of: has artist collective agent
sub property of: has book artist agent
label: kirjataiteilija (yhteistoimija) @fi
definition: Liittää teoksen yhteistoimijaan, joka on taiteilija, joka on vastuussa kirjan muodon hyödyntämisestä tai sen fyysisen rakenteen muuttamisesta. @fi
toolkit label: kirjataiteilija (yhteistoimija) @fi
toolkit definition: Yhteistoimija, joka on taiteilija, joka on vastuussa kirjan muodon hyödyntämisestä tai sen fyysisen rakenteen muuttamisesta. @fi
label: har bokkunstner (kollektiv agent) @no
definition: Relaterer et verk til en kollektiv agent som er en kunstner som er ansvarlig for utnyttelse av bokformatet eller for endring av bokens fysiske struktur. @no
toolkit label: bokkunstner (kollektiv agent) @no
toolkit definition: En kollektiv agent som er en kunstner som er ansvarlig for utnyttelse av bokformatet eller for endring av bokens fysiske struktur. @no
label: heeft boekkunstenaar-collectieve actor @nl
definition: Relateert een werk aan een collectieve actor die een kunstenaar is die verantwoordelijk is voor het benutten van de vorm van het boek of veranderen van de fysieke structuur. @nl
toolkit label: boekkunstenaar-collectieve actor @nl
toolkit definition: Een collectieve actor die een kunstenaar is die verantwoordelijk is voor het benutten van de vorm van het boek of veranderen van de fysieke structuur. @nl
label: له وكيل جماعي فنان كتب @ar
definition: يربط بين عمل ووكيل جماعي يكون فنانا مسئولاً عن استغلال شكل الكتاب أو تغيير هيكله المادي. @ar
toolkit label: وكيل جماعي فنان كتب @ar
toolkit definition: وكيل جماعي يكون فنانا مسئولاً عن استغلال شكل الكتاب أو تغيير هيكله المادي. @ar
label: té com a agent col·lectiu artista de llibre d’art @ca
definition: Relaciona una obra amb un agent col·lectiu que és una artista que és responsable d’explotar la forma llibre o de modificar la seva estructura física. @ca
toolkit label: agent col·lectiu artista de llibre d’art @ca
toolkit definition: Agent col·lectiu que és una artista que és responsable d’explotar la forma llibre o de modificar la seva estructura física. @ca
label: har kollektiv agent, som er bogkunstner @da
definition: Relaterer et værk til en kollektiv agent, som er en kunstner, som er ansvarlig for at udnytte bogformen eller ændre dens fysiske struktur. @da
toolkit label: kollektiv agent, som er bogkunstner @da
toolkit definition: Kollektiv agent, som er en kunstner, som er ansvarlig for at udnytte bogformen eller ændre dens fysiske struktur. @da
label: raamatukunstnik (kollektiiv) @et
definition: Seostab teose kollektiiviga, kes kunstnikuna vastutab raamatu vormi rakendamise või selle füüsilise struktuuri muutmise eest. @et
toolkit label: raamatukunstnik (kollektiiv) @et
toolkit definition: Kollektiiv, kes kunstnikuna vastutab raamatu vormi rakendamise või selle füüsilise struktuuri muutmise eest. @et
label: hat Buchkünstlerin/Buchkünstler (Gemeinschaftlicher Akteur) @de
definition: Setzt ein Werk in Beziehung zu einer Künstlerin/einem Künstler (Gemeinschaftlicher Akteur), die/der für die Verwertung der Buchform oder für die Veränderung ihrer physische Struktur verantwortlich ist. @de
toolkit label: Buchkünstlerin/Buchkünstler (Gemeinschaftlicher Akteur) @de
toolkit definition: Eine Künstlerin/Ein Künstler (Gemeinschaftlicher Akteur), die/der für die Verwertung der Buchform oder für die Veränderung ihrer physische Struktur verantwortlich ist. @de
label: könyvművész kollektív ágense a következő: @hu
definition: Hozzákapcsol egy művet egy művész kollektív ágenshez, amely felelős a könyvforma kiaknázásáért vagy fizikai szerkezetének a megváltoztatásáért. @hu
toolkit label: könyvművész kollektív ágens: @hu
toolkit definition: Egy művész kollektív ágens, amely felelős a könyvforma kiaknázásáért vagy fizikai szerkezetének a megváltoztatásáért. @hu
label: ha come book artist agente collettivo @it
definition: Correla un'opera all'agente collettivo artista responsabile di servirsi della forma del libro o di alterare la sua struttura fisica. @it
toolkit label: book artist agente collettivo @it
toolkit definition: Agente collettivo artista responsabile di servirsi della forma del libro o di alterare la sua struttura fisica. @it
label: a pour agent collectif artiste du livre @fr
definition: Met une œuvre en relation avec un agent collectif artiste qui est responsable d’exploiter la forme livre ou de modifier sa structure physique. @fr
toolkit label: agent collectif artiste du livre @fr
toolkit definition: Agent collectif artiste qui est responsable d’exploiter la forme livre ou de modifier sa structure physique. @fr
label: grāmatu mākslinieks (grupa) @lv
definition: Sasaista darbu ar grupu, kas atbild par grāmatas kā mākslas darba radīšanu, izmantojot grāmatu kā formu vai pārveidojot tās fizisko struktūru. @lv
toolkit label: grāmatu mākslinieks (grupa) @lv
toolkit definition: Grupa, kas atbild par grāmatas kā mākslas darba radīšanu, izmantojot grāmatu kā formu vai pārveidojot tās fizisko struktūru. @lv
label: 有图书美术家集体行为者 @zh-hans
definition: 将一种作品与作为一个艺术家负责开发图书外形或改变其物理结构的一个集体行为者关联起来。 @zh-hans
toolkit label: 图书美术家集体行为者 @zh-hans
toolkit definition: 作为一个艺术家负责开发图书外形或改变其物理结构的一个集体行为者 @zh-hans
has subproperty: has book artist corporate body
has subproperty: has book artist family
has subproperty: P10475
label: kitap sanatçısı kolektif temsilcisi ile ilişkilidir @tr
definition: Bir eseri, kitabın biçimini kullanmaktan veya fiziksel yapısını değiştirmekten sorumlu bir sanatçı olan kolektif bir temsilci ile ilişkilendirir. @tr
toolkit label: kitap sanatçısı kolektif temsilcisi @tr
toolkit definition: Kitap formunu kullanmak veya fiziksel yapısını değiştirmekten sorumlu olan bir sanatçı olarak bir kolektif temsilci. @tr

has book artist corporate body
status: Published
lexical alias: bookArtistCorporateBody.en
definition: Relates a work to a corporate body who is an artist who is responsible for exploiting the book form or altering its physical structure.
toolkit label: book artist corporate body
toolkit definition: A corporate body who is an artist who is responsible for exploiting the book form or altering its physical structure.
type: Property
domain: C10001
has element type: 2
sub property of: has artist corporate body
sub property of: has book artist collective agent
label: kirjataiteilija (yhteisö) @fi
definition: Liittää teoksen yhteisöön, joka on taiteilija, joka on vastuussa kirjan muodon hyödyntämisestä tai sen fyysisen rakenteen muuttamisesta. @fi
toolkit label: kirjataiteilija (yhteisö) @fi
toolkit definition: Yhteisö, joka on taiteilija, joka on vastuussa kirjan muodon hyödyntämisestä tai sen fyysisen rakenteen muuttamisesta. @fi
label: har bokkunstner (korporasjon) @no
definition: Relaterer et verk til en korporasjon som er en kunstner som er ansvarlig for utnyttelse av bokformatet eller for endring av bokens fysiske struktur. @no
toolkit label: bokkunstner (korporasjon) @no
toolkit definition: En korporasjon som er en kunstner som er ansvarlig for utnyttelse av bokformatet eller for endring av bokens fysiske struktur. @no
label: heeft boekkunstenaar-corporatie @nl
definition: Relateert een werk aan een corporatie die een kunstenaar is die verantwoordelijk is voor het benutten van de vorm van het boek of veranderen van de fysieke structuur. @nl
toolkit label: boekkunstenaar-corporatie @nl
toolkit definition: Een corporatie die een kunstenaar is die verantwoordelijk is voor het benutten van de vorm van het boek of veranderen van de fysieke structuur. @nl
label: له هيئة فنانة كتب @ar
definition: يربط بين عمل وهيئة تكون فنانة مسئولة عن استغلال شكل الكتاب أو تغيير هيكله المادي. @ar
toolkit label: هيئة فنانة كتب @ar
toolkit definition: هيئة تكون فنانة مسئولة عن استغلال شكل الكتاب أو تغيير هيكله المادي. @ar
label: té com a entitat corporativa artista de llibre d’art @ca
definition: Relaciona una obra amb una entitat corporativa que és una artista que és responsable d’explotar la forma llibre o de modificar la seva estructura física. @ca
toolkit label: entitat corporativa artista de llibre d’art @ca
toolkit definition: Entitat corporativa que és una artista que és responsable d’explotar la forma llibre o de modificar la seva estructura física. @ca
label: har korporation, som er bogkunstner @da
definition: Relaterer et værk til en korporation, som er en kunstner, som er ansvarlig for at udnytte bogformen eller ændre dens fysiske struktur. @da
toolkit label: korporation, som er bogkunstner @da
toolkit definition: Korporation, som er en kunstner, som er ansvarlig for at udnytte bogformen eller ændre dens fysiske struktur. @da
label: raamatukunstnik (asutus) @et
definition: Seostab teose asutusega, kes kunstnikuna vastutab raamatu vormi rakendamise või selle füüsilise struktuuri muutmise eest. @et
toolkit label: raamatukunstnik (asutus) @et
toolkit definition: Asutus, kes kunstnikuna vastutab raamatu vormi rakendamise või selle füüsilise struktuuri muutmise eest. @et
label: hat Buchkünstlerin/Buchkünstler (Körperschaft) @de
definition: Setzt ein Werk in Beziehung zu einer Künstlerin/einem Künstler (Körperschaft), die/der für die Verwertung der Buchform oder für die Veränderung ihrer physische Struktur verantwortlich ist. @de
toolkit label: Buchkünstlerin/Buchkünstler (Körperschaft) @de
toolkit definition: Eine Künstlerin/Ein Künstler (Körperschaft), die/der für die Verwertung der Buchform oder für die Veränderung ihrer physische Struktur verantwortlich ist. @de
label: könyvművész testülete a következő: @hu
definition: Hozzákapcsol egy művet egy művész testülethez, amely felelős a könyvforma kiaknázásáért vagy fizikai szerkezetének a megváltoztatásáért. @hu
toolkit label: könyvművész testület: @hu
toolkit definition: Egy művész testület, amely felelős a könyvforma kiaknázásáért vagy fizikai szerkezetének a megváltoztatásáért. @hu
label: ha come book artist ente @it
definition: Correla un'opera a un ente artista responsabile di servirsi della forma del libro o di alterare la sua struttura fisica. @it
toolkit label: book artist ente @it
toolkit definition: Ente artista responsabile di servirsi della forma del libro o di alterare la sua struttura fisica. @it
label: a pour collectivité artiste du livre @fr
definition: Met une œuvre en relation avec une collectivité artiste qui est responsable d’exploiter la forme livre ou de modifier sa structure physique. @fr
toolkit label: collectivité artiste du livre @fr
toolkit definition: Collectivité artiste qui est responsable d’exploiter la forme livre ou de modifier sa structure physique. @fr
label: grāmatu mākslinieks (institūcija) @lv
definition: Sasaista darbu ar institūciju, kas atbild par grāmatas kā mākslas darbu radīšanu, izmantojot grāmatu kā formu vai pārveidojot tās fizisko struktūru. @lv
toolkit label: grāmatu mākslinieks (institūcija) @lv
toolkit definition: Institūcija, kas atbild par grāmatas kā mākslas darbu radīšanu, izmantojot grāmatu kā formu vai pārveidojot tās fizisko struktūru. @lv
label: 有图书美术家团体 @zh-hans
definition: 将一种作品与作为一个艺术家负责开发图书外形或改变其物理结构的一个团体关联起来。 @zh-hans
toolkit label: 图书美术家团体 @zh-hans
toolkit definition: 作为一个艺术家负责开发图书外形或改变其物理结构的一个团体 @zh-hans
has subproperty: P10522
label: kitap sanatçısı tüzel kişisi ile ilişkilidir @tr
definition: Bir eseri, kitabın biçimini kullanmaktan veya fiziksel yapısını değiştirmekten sorumlu bir sanatçı olan tüzel kişiyle ilişkilendirir. @tr
toolkit label: kitap sanatçısı tüzel kişisi @tr
toolkit definition: Kitap formunu kullanmaktan veya fiziksel yapısını değiştirmekten sorumlu bir sanatçı olan tüzel kişi. @tr

has book artist family
status: Published
lexical alias: bookArtistFamily.en
definition: Relates a work to a family who is an artist who is responsible for exploiting the book form or altering its physical structure.
toolkit label: book artist family
toolkit definition: A family who is an artist who is responsible for exploiting the book form or altering its physical structure.
type: Property
domain: C10001
has element type: 2
sub property of: has artist family
sub property of: has book artist collective agent
label: kirjataiteilija (suku) @fi
definition: Liittää teoksen sukuun, joka on taiteilija, joka on vastuussa kirjan muodon hyödyntämisestä tai sen fyysisen rakenteen muuttamisesta. @fi
toolkit label: kirjataiteilija (suku) @fi
toolkit definition: Suku, joka on taiteilija, joka on vastuussa kirjan muodon hyödyntämisestä tai sen fyysisen rakenteen muuttamisesta. @fi
label: har bokkunstner (familie) @no
definition: Relaterer et verk til en familie som er en kunstner som er ansvarlig for utnyttelse av bokformatet eller for endring av bokens fysiske struktur. @no
toolkit label: bokkunstner (familie) @no
toolkit definition: En familie som er en kunstner som er ansvarlig for utnyttelse av bokformatet eller for endring av bokens fysiske struktur. @no
label: heeft boekkunstenaar-familie @nl
definition: Relateert een werk aan een familie die een kunstenaar is die verantwoordelijk is voor het benutten van de vorm van het boek of veranderen van de fysieke structuur. @nl
toolkit label: boekkunstenaar-familie @nl
toolkit definition: Een familie die een kunstenaar is die verantwoordelijk is voor het benutten van de vorm van het boek of veranderen van de fysieke structuur. @nl
label: له عائلة فنانة كتب @ar
definition: يربط بين عمل وعائلة تكون فنانة مسئولة عن استغلال شكل الكتاب أو تغيير بنيته المادية. @ar
toolkit label: عائلة فنانة كتب @ar
toolkit definition: عائلة تكون فنانة مسئولة عن استغلال شكل الكتاب أو تغيير بنيته المادية. @ar
label: té com a família artista de llibre d’art @ca
definition: Relaciona una obra amb una família que és un artista que és responsable d’explotar la forma llibre o de modificar la seva estructura física. @ca
toolkit label: família artista de llibre d’art @ca
toolkit definition: Família que és un artista que és responsable d’explotar la forma llibre o de modificar la seva estructura física. @ca
label: har familie, som er bogkunstner @da
definition: Relaterer et værk til en familie, som er en kunstner, som er ansvarlig for at udnytte bogformen eller ændre dens fysiske struktur. @da
toolkit label: familie, som er bogkunstner @da
toolkit definition: Familie, som er en kunstner, som er ansvarlig for at udnytte bogformen eller ændre dens fysiske struktur. @da
label: raamatukunstnik (perekond) @et
definition: Seostab teose perekonnaga, kes kunstnikuna vastutab raamatu vormi rakendamise või selle füüsilise struktuuri muutmise eest. @et
toolkit label: raamatukunstnik (perekond) @et
toolkit definition: Perekond, kes kunstnikuna vastutab raamatu vormi rakendamise või selle füüsilise struktuuri muutmise eest. @et
label: hat Buchkünstlerin/Buchkünstler (Familie) @de
definition: Setzt ein Werk in Beziehung zu einer Künstlerin/einem Künstler (Familie), die/der für die Verwertung der Buchform oder für die Veränderung ihrer physischen Struktur verantwortlich ist. @de
toolkit label: Buchkünstlerin/Buchkünstler (Familie) @de
toolkit definition: Eine Künstlerin/Ein Künstler (Familie), die/der für die Verwertung der Buchform oder für die Veränderung ihrer physischen Struktur verantwortlich ist. @de
label: könyvművész családja a következő: @hu
definition: Hozzákapcsol egy művet egy művész családhoz, amely felelős a könyvforma kiaknázásáért vagy fizikai szerkezetének a megváltoztatásáért. @hu
toolkit label: könyvművész család: @hu
toolkit definition: Egy művész család, amely felelős a könyvforma kiaknázásáért vagy fizikai szerkezetének a megváltoztatásáért. @hu
label: ha come book artist famiglia @it
definition: Correla un'opera alla famiglia artista responsabile di servirsi della forma del libro o di alterare la sua struttura fisica. @it
toolkit label: book artist famiglia @it
toolkit definition: Famiglia artista responsabile di servirsi della forma del libro o di alterare la sua struttura fisica. @it
label: a pour famille artiste du livre @fr
definition: Met une œuvre en relation avec une famille artiste qui est responsable d’exploiter la forme livre ou de modifier sa structure physique. @fr
toolkit label: famille artiste du livre @fr
toolkit definition: Famille artiste qui est responsable d’exploiter la forme livre ou de modifier sa structure physique. @fr
label: grāmatu mākslinieks (dzimta/ģimene) @lv
definition: Sasaista darbu ar dzimtu/ģimeni, kas atbild par grāmatas kā mākslas darbu radīšanu, izmantojot grāmatu kā formu vai pārveidojot tās fizisko struktūru. @lv
toolkit label: grāmatu mākslinieks (dzimta/ģimene) @lv
toolkit definition: Dzimta/ģimene, kas atbild par grāmatas kā mākslas darbu radīšanu, izmantojot grāmatu kā formu vai pārveidojot tās fizisko struktūru. @lv
label: 有图书美术家家族 @zh-hans
definition: 将一种作品与作为一个艺术家负责开发图书外形或改变其物理结构的一个家族关联起来。 @zh-hans
toolkit label: 图书美术家家族 @zh-hans
toolkit definition: 作为一个艺术家负责开发图书外形或改变其物理结构的一个家族 @zh-hans
has subproperty: P10569
label: kitap sanatçısı ailesi ile ilişkilidir @tr
definition: Bir eseri, kitabın biçimini kullanmaktan veya fiziksel yapısını değiştirmekten sorumlu sanatçı olan bir aileyle ilişkilendirir. @tr
toolkit label: kitap sanatçısı ailesi @tr
toolkit definition: Kitap formunu kullanmaktan veya fiziksel yapısını değiştirmekten sorumlu sanatçı olan bir aile. @tr

has book artist person
status: Published
lexical alias: bookArtistPerson.en
definition: Relates a work to a person who is an artist who is responsible for exploiting the book form or altering its physical structure.
toolkit label: book artist person
toolkit definition: A person who is an artist who is responsible for exploiting the book form or altering its physical structure.
type: Property
domain: C10001
has element type: 2
sub property of: has artist person
sub property of: has book artist agent
label: kirjataiteilija (henkilö) @fi
definition: Liittää teoksen henkilöön, joka on taiteilija, joka on vastuussa kirjan muodon hyödyntämisestä tai sen fyysisen rakenteen muuttamisesta. @fi
toolkit label: kirjataiteilija (henkilö) @fi
toolkit definition: Henkilö, joka on taiteilija, joka on vastuussa kirjan muodon hyödyntämisestä tai sen fyysisen rakenteen muuttamisesta. @fi
label: har bokkunstner (person) @no
definition: Relaterer et verk til en person som er en kunstner som er ansvarlig for utnyttelse av bokformatet eller for endring av bokens fysiske struktur. @no
toolkit label: bokkunstner (person) @no
toolkit definition: En person som er en kunstner som er ansvarlig for utnyttelse av bokformatet eller for endring av bokens fysiske struktur. @no
label: heeft boekkunstenaar-persoon @nl
definition: Relateert een werk aan een persoon die een kunstenaar is die verantwoordelijk is voor het benutten van de vorm van het boek of veranderen van de fysieke structuur. @nl
toolkit label: boekkunstenaar-persoon @nl
toolkit definition: Een persoon die een kunstenaar is die verantwoordelijk is voor het benutten van de vorm van het boek of veranderen van de fysieke structuur. @nl
label: له شخص فنان كتب @ar
definition: يربط بين عمل وشخص يكون فنانا مسئولاً عن استغلال شكل الكتاب أو تغيير بنيته المادية. @ar
toolkit label: شخص فنان كتب @ar
toolkit definition: شخص يكون فنانا مسئولاً عن استغلال شكل الكتاب أو تغيير بنيته المادية. @ar
label: té com a persona artista de llibre d’art @ca
definition: Relaciona una obra amb una persona que és una artista que és responsable d’explotar la forma llibre o de modificar la seva estructura física. @ca
toolkit label: persona artista de llibre d’art @ca
toolkit definition: Persona que és una artista que és responsable d’explotar la forma llibre o de modificar la seva estructura física. @ca
label: har person, som er bogkunstner @da
definition: Relaterer et værk til en person, som er en kunstner, som er ansvarlig for at udnytte bogformen eller ændre dens fysiske struktur. @da
toolkit label: person, som er bogkunstner @da
toolkit definition: Person, som er en kunstner, som er ansvarlig for at udnytte bogformen eller ændre dens fysiske struktur. @da
label: raamatukunstnik (isik) @et
definition: Seostab teose isikuga, kes kunstnikuna vastutab raamatu vormi rakendamise või selle füüsilise struktuuri muutmise eest. @et
toolkit label: raamatukunstnik (isik) @et
toolkit definition: Isik, kes kunstnikuna vastutab raamatu vormi rakendamise või selle füüsilise struktuuri muutmise eest. @et
label: hat Buchkünstlerin/Buchkünstler (Person) @de
definition: Setzt ein Werk in Beziehung zu einer Künstlerin/einem Künstler (Person), die/der für die Verwertung der Buchform oder für die Veränderung ihrer physischen Struktur verantwortlich ist. @de
toolkit label: Buchkünstlerin/Buchkünstler (Person) @de
toolkit definition: Eine Künstlerin/Ein Künstler (Person), die/der für die Verwertung der Buchform oder für die Veränderung ihrer physischen Struktur verantwortlich ist. @de
label: könyvművész személye a következő: @hu
definition: Hozzákapcsol egy művet egy művész személyhez, aki felelős a könyvforma kiaknázásáért vagy fizikai szerkezetének a megváltoztatásáért. @hu
toolkit label: könyvművész személy: @hu
toolkit definition: Egy művész személy, aki felelős a könyvforma kiaknázásáért vagy fizikai szerkezetének a megváltoztatásáért. @hu
label: ha come book artist persona @it
definition: Correla un'opera alla persona artista responsabile di servirsi della forma del libro o di alterare la sua struttura fisica. @it
toolkit label: book artist persona @it
toolkit definition: Persona artista responsabile di servirsi della forma del libro o di alterare la sua struttura fisica. @it
label: a pour personne artiste du livre @fr
definition: Met une œuvre en relation avec une personne artiste qui est responsable d’exploiter la forme livre ou de modifier sa structure physique. @fr
toolkit label: personne artiste du livre @fr
toolkit definition: Personne artiste qui est responsable d’exploiter la forme livre ou de modifier sa structure physique. @fr
label: grāmatu mākslinieks (persona) @lv
definition: Sasaista darbu ar personu, kura atbild par grāmatas kā mākslas darbu radīšanu, izmantojot grāmatu kā formu vai pārveidojot tās fizisko struktūru. @lv
toolkit label: grāmatu mākslinieks (persona) @lv
toolkit definition: Persona, kura atbild par grāmatas kā mākslas darbu radīšanu, izmantojot grāmatu kā formu vai pārveidojot tās fizisko struktūru. @lv
label: 有图书美术家个人 @zh-hans
definition: 将一种作品与作为一个艺术家负责开发图书外形或改变其物理结构的一个个人关联起来。 @zh-hans
toolkit label: 图书美术家个人 @zh-hans
toolkit definition: 作为一个艺术家负责开发图书外形或改变其物理结构的一个个人 @zh-hans
has subproperty: P10428
label: kitap sanatçısı ile ilişkilidir @tr
definition: Bir eseri, kitabın biçimini kullanmaktan veya fiziksel yapısını değiştirmekten sorumlu sanatçı olan kişiyle ilişkilendirir. @tr
toolkit label: kitap sanatçısı @tr
toolkit definition: Kitabın biçimini kullanmaktan veya fiziksel yapısını değiştirmekten sorumlu sanatçı olan kişi. @tr

has calligrapher agent
status: Published
type: Property
lexical alias: calligrapherAgent.en
definition: Relates a work to an agent who is an artist who is responsible for calligraphy where the focus of interest lies in the aesthetic value of the penmanship or graphic artistry, regardless of whether the same agent is also responsible for the inscribed text.
domain: C10001
toolkit label: calligrapher agent
toolkit definition: An agent who is an artist who is responsible for calligraphy where the focus of interest lies in the aesthetic value of the penmanship or graphic artistry, regardless of whether the same agent is also responsible for the inscribed text.
toolkit label: agent calligraphe @fr
toolkit definition: Agent artiste qui est responsable de la création d’une calligraphie où l’accent est mis sur la valeur esthétique de la calligraphie ou du graphisme, peu importe que le même agent soit aussi responsable du texte calligraphié. @fr
sub property of: has artist agent
toolkit label: calígrafo @es
toolkit definition: Un artista responsable por la creación de una obra de caligrafía en la cual el foco de interés se centra en el valor estético de su escritura artística o gráfica, independiente de si la misma persona, etc., también es la autora del texto. @es
instruction number: 18.5
label: har agent, som er kalligraf @da
definition: Relaterer et værk til en agent, som er en kunstner, som er ansvarlig for kalligrafi, hvor fokus ligger på den æstetiske værdi af skrivekunsten eller den kunstneriske grafiske dygtighed, uagtet om den samme agent også har forfattet den indskrevne tekst. @da
toolkit label: agent, som er kalligraf @da
toolkit definition: Agent, som er en kunstner, som er ansvarlig for kalligrafi, hvor fokus ligger på den æstetiske værdi af skrivekunsten eller den kunstneriske grafiske dygtighed, uagtet om den samme agent også har forfattet den indskrevne tekst. @da
definition: Met une œuvre en relation avec un agent artiste qui est responsable de la création d’une calligraphie où l’accent est mis sur la valeur esthétique de la calligraphie ou du graphisme, peu importe que le même agent soit aussi responsable du texte calligraphié. @fr
label: có người viết chữ đẹp @vi
definition: Liên kết tác phẩm với nghệ sỹ có trách nhiệm tạo ra tác phẩm nghệ thuật viết chữ đẹp nơi mà tập trung của sự chú ý nằm ở giá trị thẩm mỹ của phong cách viết hoặc nghệ thuật đồ hình, không phân biệt có cùng cá nhân, v.v... hay không, cũng là tác giả của văn bản được viết. @vi
toolkit label: người viết chữ đẹp @vi
toolkit definition: Nghệ sỹ có trách nhiệm tạo ra tác phẩm nghệ thuật viết chữ đẹp nơi mà tập trung của sự chú ý nằm ở giá trị thẩm mỹ của phong cách viết hoặc nghệ thuật đồ hình, không phân biệt có cùng cá nhân, v.v... Hay không, cũng là tác giả của văn bản được viết. @vi
label: hat Kalligrafin/Kalligraf (Akteur) @de
definition: Setzt ein Werk in Beziehung zu einer Künstlerin/einem Künstler (Akteur), die/der für die Kalligrafie verantwortlich ist, bei der im Mittelpunkt des Interesses der ästhetische Wert dessen Schreibkunst oder die grafische Kunstfertigkeit liegt, unabhängig davon, ob derselbe Akteur auch für den aufgeschriebenen Text verantwortlich ist. @de
toolkit label: Kalligrafin/Kalligraf (Akteur) @de
toolkit definition: Eine Künstlerin/Ein Künstler (Akteur), die/der für die Kalligrafie verantwortlich ist, bei der im Mittelpunkt des Interesses der ästhetische Wert dessen Schreibkunst oder die grafische Kunstfertigkeit liegt, unabhängig davon, ob derselbe Akteur auch für den aufgeschriebenen Text verantwortlich ist. @de
label: a pour agent calligraphe @fr
definition: Liittää teoksen toimijaan, joka on taiteilija, joka on vastuussa kalligrafiasta, jossa pääpaino on käsin kirjoittamisen tai graafisen taiteen esteettisissä arvoissa, riippumatta siitä, onko sama toimija myös vastuussa kirjoitetusta tekstistä. @fi
toolkit label: kalligrafi (toimija) @fi
toolkit definition: Toimija, joka on taiteilija, joka on vastuussa kalligrafiasta, jossa pääpaino on käsin kirjoittamisen tai graafisen taiteen esteettisissä arvoissa, riippumatta siitä, onko sama toimija myös vastuussa kirjoitetusta tekstistä. @fi
toolkit label: kalligraf (agent) @no
toolkit definition: En agent som er en kunstner som er ansvarlig for kalligrafi der fokus er på den estetiske verdien av pennekunsten eller kunstnerisk dyktighet, uavhengig av om den samme agenten også er ansvarlig for tekstinnholdet. @no
label: té com a agent cal·lígraf @ca
definition: Relaciona una obra amb un agent que és un artista que és responsable de la cal·ligrafia on el centre de l’interès se situa en el valor estètic de la cal·ligrafia o del grafisme, independentment de si el mateix agent és també responsable del text inscrit. @ca
toolkit label: agent cal·lígraf @ca
toolkit definition: Agent que és un artista que és responsable de la cal·ligrafia on el centre de l’interès se situa en el valor estètic de la cal·ligrafia o del grafisme, independentment de si el mateix agent és també responsable del text inscrit. @ca
has element type: 2
label: έχει καλλιγράφο @el
definition: Συνδέει ένα έργο με έναν καλλιτέχνη υπεύθυνο για τη δημιουργία ενός καλλιγραφικού έργου, όπου το ενδιαφέρον εστιάζει στην αισθητική αξία της καλλιγραφίας ή της γραφικής δεξιοτεχνίας, ανεξάρτητα από το αν πρόκειται για το ίδιο φυσικό πρόσωπο κ.λπ., επίση υπεύθυνο για το χαραγμένο κείμενο. @el
toolkit label: καλλιγράφος @el
toolkit definition: Ένας καλλιτέχνης υπεύθυνος για τη δημιουργία ενός καλλιγραφικού έργου, όπου το ενδιαφέρον εστιάζει στην αισθητική αξία της καλλιγραφίας ή της γραφικής δεξιοτεχνίας, ανεξάρτητα από το αν πρόκειται για το ίδιο φυσικό πρόσωπο κ.λπ., επίση υπεύθυνο για το χαραγμένο κείμενο. @el
label: kalligráfus ágense a következő: @hu
definition: Hozzákapcsol egy művet egy művész ágenshez, amely felelős egy kalligráfia megalkotásáért, amelyben a szépírás esztétikai értéke vagy a grafika művészisége áll az érdeklődés fókuszában, tekintet nélkül arra, hogy ugyanaz az ágens a lejegyzett szöveg szerzője is egyben vagy sem. @hu
toolkit label: kalligráfus ágens: @hu
toolkit definition: Egy művész ágens, amely felelős egy kalligráfia megalkotásáért, amelyben a szépírás esztétikai értéke vagy a grafikus művésziség áll az érdeklődés fókuszában, tekintet nélkül arra, hogy ugyanaz az ágens a lejegyzett szöveg szerzője is egyben vagy sem. @hu
alternative label: calligrapher
alternative label: kalligrafi @fi
label: kalligrafi (toimija) @fi
label: har kalligraf (agent) @no
definition: Relaterer et verk til en agent som er en kunstner som er ansvarlig for kalligrafi der fokus er på den estetiske verdien av pennekunsten eller kunstnerisk dyktighet, uavhengig av om den samme agenten også er ansvarlig for tekstinnholdet. @no
alternative label: kalligraf @no
label: heeft kalligraaf-actor @nl
definition: Relateert een werk aan een actor die een kunstenaar is die verantwoordelijk is voor kalligrafie waar de aandacht primair uitgaat naar de esthetische waarde van de schrijfkunst of grafische kunstenaarschap, ongeacht of dezelfde actor ook verantwoordelijk is voor de geschreven tekst. @nl
toolkit label: kalligraaf-actor @nl
toolkit definition: Een actor die een kunstenaar is die verantwoordelijk is voor kalligrafie waar de aandacht primair uitgaat naar de esthetische waarde van de schrijfkunst of grafische kunstenaarschap, ongeacht of dezelfde actor ook verantwoordelijk is voor de geschreven tekst. @nl
label: له وكيل خطاط @ar
definition: يربط بين عمل ووكيل هو فنانً مسئول عن الخط حيث يكمن تركيز الاهتمام في القيمة الجمالية للخط أو فن الرسم، بغض النظر عما إذا كان الوكيل نفسه مسئولاً أيضًا عن النص المكتوب. @ar
alternative label: خطاط @ar
toolkit label: وكيل خطاط @ar
toolkit definition: وكيل يكون فنانا مسئولا عن الخط حيث يكمن تركيز الاهتمام في القيمة الجمالية للخط أو فن الرسم، بغض النظر عما إذا كان الوكيل نفسه مسئولاً أيضًا عن النص المكتوب. @ar
alternative label: cal·lígraf @ca
label: kalligraaf (tegija) @et
definition: Seostab teose tegijaga, kes on ilukirja eest vastutav kunstnik. Ilukirja põhirõhk on kirjakunsti või graafilise kunstnikutöö esteetilisel väärtusel, olenemata sellest, kas sama tegija on vastutav ka kirjutatud teksti eest. @et
alternative label: kalligraaf @et
toolkit label: kalligraaf (tegija) @et
toolkit definition: Tegija, kes on ilukirja eest vastutav kunstnik. Ilukirja põhirõhk on kirjakunsti või graafilise kunstnikutöö esteetilisel väärtusel, olenemata sellest, kas sama tegija on vastutav ka kirjutatud teksti eest. @et
alternative label: kalligráfus: @hu
label: ha come calligrafo agente @it
definition: Correla un’opera all'agente artista responsabile per la calligrafia quando il centro d’interesse risiede nel valore estetico della scrittura o della grafica, indipendentemente dal fatto che lo stesso agente sia anche responsabile per il testo scritto. @it
alternative label: calligrafo @it
toolkit label: calligrafo agente @it
toolkit definition: Agente artista che è responsabile per la calligrafia quando il centro d’interesse risiede nel valore estetico della scrittura o della grafica, indipendentemente dal fatto che lo stesso agente sia anche responsabile per il testo scritto. @it
alternative label: calligraphe @fr
label: kaligrāfs (aģents) @lv
definition: Sasaista darbu ar aģentu mākslinieks, kas ir atbildīgs par kaligrāfiju, kur galvenais ir mākslinieciskā vai grafiskā mākslas vērtība, neatkarīgi no tā, vai tas pats aģents ir atbildīgs arī par ierakstīto tekstu. @lv
toolkit label: kaligrāfs (aģents) @lv
toolkit definition: Aģents mākslinieks, kas ir atbildīgs par kaligrāfiju, kur galvenais ir mākslinieciskā vai grafiskā mākslas vērtība, neatkarīgi no tā, vai tas pats aģents ir atbildīgs arī par ierakstīto tekstu. @lv
alternative label: Kalligraf @de
alternative label: 书法者 @zh-hans
toolkit label: 书法者行为者 @zh-hans

has calligrapher collective agent
status: Published
lexical alias: calligrapherCollectiveAgent.en
definition: Relates a work to a collective agent who is an artist who is responsible for calligraphy where the focus of interest lies in the aesthetic value of the penmanship or graphic artistry, regardless of whether the same collective agent is also responsible for the inscribed text.
toolkit label: calligrapher collective agent
toolkit definition: A collective agent who is an artist who is responsible for calligraphy where the focus of interest lies in the aesthetic value of the penmanship or graphic artistry, regardless of whether the same collective agent is also responsible for the inscribed text.
type: Property
domain: C10001
has element type: 2
sub property of: has artist collective agent
sub property of: has calligrapher agent
label: kalligrafi (yhteistoimija) @fi
definition: Liittää teoksen yhteistoimijaan, joka on taiteilija, joka on vastuussa kalligrafiasta, jossa pääpaino on käsin kirjoittamisen tai graafisen taiteen esteettisissä arvoissa, riippumatta siitä, onko sama yhteistoimija myös vastuussa kirjoitetusta tekstistä. @fi
toolkit label: kalligrafi (yhteistoimija) @fi
toolkit definition: Yhteistoimija, joka on taiteilija, joka on vastuussa kalligrafiasta, jossa pääpaino on käsin kirjoittamisen tai graafisen taiteen esteettisissä arvoissa, riippumatta siitä, onko sama yhteistoimija myös vastuussa kirjoitetusta tekstistä. @fi
label: har kalligraf (kollektiv agent) @no
definition: Relaterer et verk til en kollektiv agent som er en kunstner som er ansvarlig for kalligrafi der fokus er på den estetiske verdien av pennekunsten eller kunstnerisk dyktighet, uavhengig av om den samme agenten også er ansvarlig for tekstinnholdet. @no
toolkit label: kalligraf (kollektiv agent) @no
toolkit definition: En kollektiv agent som er en kunstner som er ansvarlig for kalligrafi der fokus er på den estetiske verdien av pennekunsten eller kunstnerisk dyktighet, uavhengig av om den samme agenten også er ansvarlig for tekstinnholdet. @no
label: heeft kalligraaf-collectieve actor @nl
definition: Relateert een werk aan een collectieve actor die een kunstenaar is die verantwoordelijk is voor kalligrafie waar de aandacht primair uitgaat naar de esthetische waarde van de schrijfkunst of grafische kunstenaarschap, ongeacht of dezelfde collectieve actor ook verantwoordelijk is voor de inscriptie. @nl
toolkit label: kalligraaf-collectieve actor @nl
toolkit definition: Een collectieve actor die een kunstenaar is die verantwoordelijk is voor kalligrafie waar de aandacht primair uitgaat naar de esthetische waarde van de schrijfkunst of grafische kunstenaarschap, ongeacht of dezelfde collectieve actor ook verantwoordelijk is voor de inscriptie. @nl
label: té com a agent col·lectiu cal·lígraf @ca
definition: Relaciona una obra amb un agent col·lectiu que és un artista que és responsable de la cal·ligrafia on el centre de l’interès se situa en el valor estètic de la cal·ligrafia o del grafisme, independentment de si el mateix agent col·lectiu és també responsable del text inscrit. @ca
toolkit label: agent col·lectiu cal·lígraf @ca
toolkit definition: Agent col·lectiu que és un artista que és responsable de la cal·ligrafia on el centre de l’interès se situa en el valor estètic de la cal·ligrafia o del grafisme, independentment de si el mateix agent col·lectiu és també responsable del text inscrit. @ca
label: har kollektiv agent, som er kalligraf @da
definition: Relaterer et værk til en kollektiv agent, som er en kunstner, som er ansvarlig for kalligrafi, hvor fokus ligger på den æstetiske værdi af skrivekunsten eller den kunstneriske grafiske dygtighed, uagtet om den samme person også har forfattet den indskrevne tekst. @da
toolkit label: kollektiv agent, som er kalligraf @da
toolkit definition: Kollektiv agent, som er en kunstner, som er ansvarlig for kalligrafi, hvor fokus ligger på den æstetiske værdi af skrivekunsten eller den kunstneriske grafiske dygtighed, uagtet om den samme person også har forfattet den indskrevne tekst. @da
label: kalligraaf (kollektiiv) @et
definition: Seostab teose kollektiiviga, kes on ilukirja eest vastutav kunstnik. Ilukirja põhirõhk on kirjakunsti või graafilise kunstnikutöö esteetilisel väärtusel, olenemata sellest, kas sama kollektiiv on vastutav ka kirjutatud teksti eest. @et
toolkit label: kalligraaf (kollektiiv) @et
toolkit definition: Kollektiiv, kes on ilukirja eest vastutav kunstnik. Ilukirja põhirõhk on kirjakunsti või graafilise kunstnikutöö esteetilisel väärtusel, olenemata sellest, kas sama kollektiiv on vastutav ka kirjutatud teksti eest. @et
label: hat Kalligrafin/Kalligrafen (Gemeinschaftlicher Akteur) @de
definition: Setzt ein Werk in Beziehung zu einer Künstlerin/einem Künstler (Gemeinschaftlicher Akteur), die/der für die Kalligrafie verantwortlich ist, bei der der ästhetische Wert der Schreibkunst oder die grafische Kunstfertigkeit im Mittelpunkt des Interesses liegt, unabhängig davon, ob derselbe gemeinschaftliche Akteur auch für den aufgeschriebenen Text verantwortlich ist. @de
toolkit label: Kalligrafin/Kalligraf (Gemeinschaftlicher Akteur) @de
toolkit definition: Eine Künstlerin/Ein Künstler (Gemeinschaftlicher Akteur), die/der für die Kalligrafie verantwortlich ist, bei der der ästhetische Wert der Schreibkunst oder die grafische Kunstfertigkeit im Mittelpunkt des Interesses liegt, unabhängig davon, ob derselbe gemeinschaftliche Akteur auch für den aufgeschriebenen Text verantwortlich ist. @de
label: kalligráfus kollektív ágense a következő: @hu
definition: Hozzákapcsol egy művet egy művész kollektív ágenshez, amely felelős egy kalligráfia megalkotásáért, amelyben a szépírás esztétikai értéke vagy a grafika művészisége áll az érdeklődés fókuszában, tekintet nélkül arra, hogy ugyanaz a kollektív ágens a lejegyzett szöveg szerzője is egyben vagy sem. @hu
toolkit label: kalligráfus kollektív ágens: @hu
toolkit definition: Egy művész kollektív ágens, amely felelős egy kalligráfia megalkotásáért, amelyben a szépírás esztétikai értéke vagy a grafika művészisége áll az érdeklődés fókuszában, tekintet nélkül arra, hogy ugyanaz a kollektív ágens a lejegyzett szöveg szerzője is egyben vagy sem. @hu
label: ha come calligrafo agente collettivo @it
definition: Correla un'opera all'agente collettivo che è l'artista responsabile della calligrafia, laddove l'oggetto dell'interesse risiede nel valore estetico della calligrafia o della maestria grafica, a prescindere dal fatto che lo stesso agente collettivo sia anche responsabile del testo inscritto. @it
toolkit label: calligrafo agente collettivo @it
toolkit definition: Agente collettivo che è l'artista responsabile della calligrafia, laddove l'oggetto dell'interesse risiede nel valore estetico della calligrafia o maestria grafica, a prescindere dal fatto che lo stesso agente collettivo sia anche responsabile del testo inscritto. @it
label: a pour agent collectif calligraphe @fr
definition: Met une œuvre en relation avec un agent collectif artiste qui est responsable de la création d’une calligraphie où l’accent est mis sur la valeur esthétique de la calligraphie ou du graphisme, peu importe que le même agent collectif soit aussi responsable du texte calligraphié. @fr
toolkit label: agent collectif calligraphe @fr
toolkit definition: Agent collectif artiste qui est responsable de la création d’une calligraphie où l’accent est mis sur la valeur esthétique de la calligraphie ou du graphisme, peu importe que le même agent collectif soit aussi responsable du texte calligraphié. @fr
label: kaligrāfs (grupa) @lv
definition: Sasaista darbu ar grupu mākslinieks, ir atbildīga par kaligrāfiju, kur galvenais ir mākslinieciskā vai grafiskā mākslas vērtība, neatkarīgi no tā, vai tā pati persona ir atbildīga arī par uzrakstīto tekstu. @lv
toolkit label: kaligrāfs (grupa) @lv
toolkit definition: Grupa mākslinieks, ir atbildīga par kaligrāfiju, kur galvenais ir mākslinieciskā vai grafiskā mākslas vērtība, neatkarīgi no tā, vai tā pati persona ir atbildīga arī par uzrakstīto tekstu. @lv
label: له وكيل جماعي خطاط @ar
definition: يربط بين عمل ووكيل جماعي يكون فنانا مسئولاً عن الخط حيث يكمن تركيز الاهتمام في القيمة الجمالية للخط أو فن الرسم، بغض النظر عن كون الوكيل الجماعي نفسه مسئولاً أيضًا عن النص المدرج. @ar
toolkit label: وكيل جماعي خطاط @ar
toolkit definition: وكيل جماعي خطاط يكون فنانا مسئولاً عن الخط حيث يكمن تركيز الاهتمام في القيمة الجمالية للخط أو فن الرسم، بغض النظر عن كون الوكيل الجماعي نفسه مسئولاً أيضًا عن النص المدرج. @ar
label: 有书法者集体行为者 @zh-hans
definition: 将一种作品与作为一个艺术家负责书法（其中兴趣重点是书法或图形艺术的美学价值，不管同一行为者是否负责题写文字）的一个集体行为者关联起来。 @zh-hans
toolkit label: 书法者集体行为者 @zh-hans
toolkit definition: 作为一个艺术家负责书法（其中兴趣重点是书法或图形艺术的美学价值，不管同一行为者是否负责题写文字）的一个集体行为者 @zh-hans
has subproperty: has calligrapher corporate body
has subproperty: has calligrapher family
has subproperty: P10473
label: kaligraf kolektif temsilci ile ilişkilidir @tr
definition: Bir eseri, aynı temsilcinin yazılı metinden de sorumlu olup olmadığına bakılmaksızın, ilgi odağının hattatlık veya grafik sanatının estetik değerinde olduğu kaligrafiden sorumlu sanatçı olan kolektif bir temsilci ile ilişkilendirir @tr
toolkit label: kaligraf kolektif temsilcisi @tr
toolkit definition: Aynı kolektif temsilcinin yazılı metinden de sorumlu olup olmadığına bakılmaksızın, ilgi odağının hattatlık veya grafik sanatının estetik değerinde olduğu kaligrafiden sorumlu sanatçı olan bir kolektif temsilci. @tr

has calligrapher corporate body
status: Published
lexical alias: calligrapherCorporateBody.en
definition: Relates a work to a corporate body who is an artist who is responsible for calligraphy where the focus of interest lies in the aesthetic value of the penmanship or graphic artistry, regardless of whether the same corporate body is also responsible for the inscribed text.
toolkit label: calligrapher corporate body
toolkit definition: A corporate body who is an artist who is responsible for calligraphy where the focus of interest lies in the aesthetic value of the penmanship or graphic artistry, regardless of whether the same corporate body is also responsible for the inscribed text.
type: Property
domain: C10001
has element type: 2
sub property of: has artist corporate body
sub property of: has calligrapher collective agent
label: kalligrafi (yhteisö) @fi
definition: Liittää teoksen yhteisöön, joka on taiteilija, joka on vastuussa kalligrafiasta, jossa pääpaino on käsin kirjoittamisen tai graafisen taiteen esteettisissä arvoissa, riippumatta siitä, onko sama yhteisö myös vastuussa kirjoitetusta tekstistä. @fi
toolkit label: kalligrafi (yhteisö) @fi
toolkit definition: Yhteisö, joka on taiteilija, joka on vastuussa kalligrafiasta, jossa pääpaino on käsin kirjoittamisen tai graafisen taiteen esteettisissä arvoissa, riippumatta siitä, onko sama yhteisö myös vastuussa kirjoitetusta tekstistä. @fi
label: har kalligraf (korporasjon) @no
definition: Relaterer et verk til en korporasjon som er en kunstner som er ansvarlig for kalligrafi der fokus er på den estetiske verdien av pennekunsten eller kunstnerisk dyktighet, uavhengig av om den samme agenten også er ansvarlig for tekstinnholdet. @no
toolkit label: kalligraf (korporasjon) @no
toolkit definition: En korporasjon som er en kunstner som er ansvarlig for kalligrafi der fokus er på den estetiske verdien av pennekunsten eller kunstnerisk dyktighet, uavhengig av om den samme agenten også er ansvarlig for tekstinnholdet. @no
label: heeft kalligraaf-corporatie @nl
definition: Relateert een werk aan een corporatie die een kunstenaar is die verantwoordelijk is voor kalligrafie waar de aandacht primair uitgaat naar de esthetische waarde van de schrijfkunst of grafische kunstenaarschap, ongeacht of dezelfde corporatie ook verantwoordelijk is voor de inscriptie. @nl
toolkit label: kalligraaf-corporatie @nl
toolkit definition: Een corporatie die een kunstenaar is die verantwoordelijk is voor kalligrafie waar de aandacht primair uitgaat naar de esthetische waarde van de schrijfkunst of grafische kunstenaarschap, ongeacht of dezelfde corporatie ook verantwoordelijk is voor de inscriptie. @nl
label: له هيئة خطاطة @ar
definition: يربط بين عمل وهيئة تكون فنانة مسئولة عن الخط حيث يكمن تركيز الاهتمام في القيمة الجمالية للخط أو فن الرسم، بغض النظر عن كون الهيئة نفسها مسئولة أيضًا عن النص المدرج. @ar
toolkit label: هيئة خطاطة @ar
toolkit definition: هيئة تكون فنانة مسئولة عن الخط حيث يكمن تركيز الاهتمام في القيمة الجمالية للخط أو فن الرسم، بغض النظر عن كون الهيئة نفسها مسئولة أيضًا عن النص المدرج. @ar
label: té com a entitat corporativa cal·lígrafa @ca
definition: Relaciona una obra amb una entitat corporativa que és un artista que és responsable de la cal·ligrafia on el centre de l’interès se situa en el valor estètic de la cal·ligrafia o del grafisme, independentment de si la mateixa entitat corporativa és també responsable del text inscrit. @ca
toolkit label: entitat corporativa cal·lígrafa @ca
toolkit definition: Entitat corporativa que és un artista que és responsable de la cal·ligrafia on el centre de l’interès se situa en el valor estètic de la cal·ligrafia o del grafisme, independentment de si la mateixa entitat corporativa és també responsable del text inscrit. @ca
label: har korporation, som er kalligraf @da
definition: Relaterer et værk til en korporation, som er en kunstner, som er ansvarlig for kalligrafi, hvor fokus ligger på den æstetiske værdi af skrivekunsten eller den kunstneriske grafiske dygtighed, uagtet om den samme person også har forfattet den indskrevne tekst. @da
toolkit label: korporation, som er kalligraf @da
toolkit definition: Korporation, som er en kunstner, som er ansvarlig for kalligrafi, hvor fokus ligger på den æstetiske værdi af skrivekunsten eller den kunstneriske grafiske dygtighed, uagtet om den samme person også har forfattet den indskrevne tekst. @da
label: kalligraaf (asutus) @et
definition: Seostab teose asutusega, kes on ilukirja eest vastutav kunstnik. Ilukirja põhirõhk on kirjakunsti või graafilise kunstnikutöö esteetilisel väärtusel, olenemata sellest, kas sama asutus on vastutav ka kirjutatud teksti eest. @et
toolkit label: kalligraaf (asutus) @et
toolkit definition: Asutus, kes on ilukirja eest vastutav kunstnik. Ilukirja põhirõhk on kirjakunsti või graafilise kunstnikutöö esteetilisel väärtusel, olenemata sellest, kas sama asutus on vastutav ka kirjutatud teksti eest. @et
label: hat Kalligrafin/Kalligrafen (Körperschaft) @de
definition: Setzt ein Werk in Beziehung zu einer Künstlerin/einem Künstler (Körperschaft), die/der für die Kalligrafie verantwortlich ist, bei der der ästhetische Wert der Schreibkunst oder die grafische Kunstfertigkeit im Mittelpunkt des Interesses liegt, unabhängig davon, ob dieselbe Körperschaft auch für den aufgeschriebenen Text verantwortlich ist. @de
toolkit label: Kalligrafin/Kalligraf (Körperschaft) @de
toolkit definition: Eine Künstlerin/Ein Künstler (Körperschaft), die/der für die Kalligrafie verantwortlich ist, bei der der ästhetische Wert der Schreibkunst oder die grafische Kunstfertigkeit im Mittelpunkt des Interesses liegt, unabhängig davon, ob dieselbe Körperschaft auch für den aufgeschriebenen Text verantwortlich ist. @de
label: kalligráfus testülete a következő: @hu
definition: Hozzákapcsol egy művet egy művész testülethez, amely felelős egy kalligráfia megalkotásáért, amelyben a szépírás esztétikai értéke vagy a grafika művészisége áll az érdeklődés fókuszában, tekintet nélkül arra, hogy ugyanaz a testület a lejegyzett szöveg szerzője is egyben vagy sem. @hu
toolkit label: kalligráfus testület: @hu
toolkit definition: Egy művész testület, amely felelős egy kalligráfia megalkotásáért, amelyben a szépírás esztétikai értéke vagy a grafika művészisége áll az érdeklődés fókuszában, tekintet nélkül arra, hogy ugyanaz a testület a lejegyzett szöveg szerzője is egyben vagy sem. @hu
label: ha come calligrafo ente @it
definition: Correla un'opera a un ente responsabile della calligrafia, laddove l'oggetto dell'interesse risiede nel valore estetico della calligrafia o maestria grafica, a prescindere dal fatto che lo stesso ente sia anche responsabile per il testo scritto. @it
toolkit label: calligrafo ente @it
toolkit definition: Ente responsabile della calligrafia, laddove l'oggetto dell'interesse risiede nel valore estetico della calligrafia o maestria grafica, a prescindere dal fatto che lo stesso ente sia anche responsabile per il testo scritto. @it
label: a pour collectivité calligraphe @fr
definition: Met une œuvre en relation avec une collectivité artiste qui est responsable de la création d’une calligraphie où l’accent est mis sur la valeur esthétique de la calligraphie ou du graphisme, peu importe que la même collectivité soit aussi responsable du texte calligraphié. @fr
toolkit label: collectivité calligraphe @fr
toolkit definition: Collectivité artiste qui est responsable de la création d’une calligraphie où l’accent est mis sur la valeur esthétique de la calligraphie ou du graphisme, peu importe que la même collectivité soit aussi responsable du texte calligraphié. @fr
label: kaligrāfs (institūcija) @lv
definition: Sasaista darbu ar institūciju mākslinieks, kas ir atbildīgs par kaligrāfiju, kur galvenais ir mākslinieciskā vai grafiskā mākslas vērtība, neatkarīgi no tā, vai tā pati persona ir atbildīgs arī par ierakstīto tekstu. @lv
toolkit label: kaligrāfs (institūcija) @lv
toolkit definition: Institūcija mākslinieks, kas ir atbildīgs par kaligrāfiju, kur galvenais ir mākslinieciskā vai grafiskā mākslas vērtība, neatkarīgi no tā, vai tā pati persona ir atbildīgs arī par ierakstīto tekstu. @lv
label: 有书法者团体 @zh-hans
definition: 将一种作品与作为一个艺术家负责书法（其中兴趣重点是书法或图形艺术的美学价值，不管同一团体是否负责题写文字）的一个团体关联起来。 @zh-hans
toolkit label: 书法者团体 @zh-hans
toolkit definition: 作为一个艺术家负责书法（其中兴趣重点是书法或图形艺术的美学价值，不管同一团体是否负责题写文字）的一个团体 @zh-hans
has subproperty: P10520
label: kaligraf tüzel kişi ile ilişkilidir @tr
definition: Bir eseri, aynı tüzel kişinin yazılı metinden de sorumlu olup olmadığına bakılmaksızın, ilgi odağının hattatlık veya grafik sanatının estetik değerinde olduğu kaligrafiden sorumlu sanatçı olan tüzel kişi ile ilişkilendirir. @tr
toolkit label: kaligraf tüzel kişisi @tr
toolkit definition: Aynı tüzel kişinin yazılı metinden de sorumlu olup olmadığına bakılmaksızın, ilgi odağının hattatlığın veya grafik sanatının estetik değerinde olduğu kaligrafiden sorumlu sanatçı olan bir tüzel kişi. @tr

has calligrapher family
status: Published
lexical alias: calligrapherFamily.en
definition: Relates a work to a family who is an artist who is responsible for calligraphy where the focus of interest lies in the aesthetic value of the penmanship or graphic artistry, regardless of whether the same family is also responsible for the inscribed text.
toolkit label: calligrapher family
toolkit definition: A family who is an artist who is responsible for calligraphy where the focus of interest lies in the aesthetic value of the penmanship or graphic artistry, regardless of whether the same family is also responsible for the inscribed text.
type: Property
domain: C10001
has element type: 2
sub property of: has artist family
sub property of: has calligrapher collective agent
label: kalligrafi (suku) @fi
definition: Liittää teoksen sukuun, joka on taiteilija, joka on vastuussa kalligrafiasta, jossa pääpaino on käsin kirjoittamisen tai graafisen taiteen esteettisissä arvoissa, riippumatta siitä, onko sama suku myös vastuussa kirjoitetusta tekstistä. @fi
toolkit label: kalligrafi (suku) @fi
toolkit definition: Suku, joka on taiteilija, joka on vastuussa kalligrafiasta, jossa pääpaino on käsin kirjoittamisen tai graafisen taiteen esteettisissä arvoissa, riippumatta siitä, onko sama suku myös vastuussa kirjoitetusta tekstistä. @fi
label: har kalligraf (familie) @no
definition: Relaterer et verk til en familie som er en kunstner som er ansvarlig for kalligrafi der fokus er på den estetiske verdien av pennekunsten eller kunstnerisk dyktighet, uavhengig av om den samme agenten også er ansvarlig for tekstinnholdet. @no
toolkit label: kalligraf (familie) @no
toolkit definition: En familie som er en kunstner som er ansvarlig for kalligrafi der fokus er på den estetiske verdien av pennekunsten eller kunstnerisk dyktighet, uavhengig av om den samme agenten også er ansvarlig for tekstinnholdet. @no
label: heeft kalligraaf-familie @nl
definition: Relateert een werk aan een familie die een kunstenaar is die verantwoordelijk is voor kalligrafie waar de aandacht primair uitgaat naar de esthetische waarde van de schrijfkunst of grafische kunstenaarschap, ongeacht of dezelfde familie ook verantwoordelijk is voor de inscriptie. @nl
toolkit label: kalligraaf-familie @nl
toolkit definition: Een familie die een kunstenaar is die verantwoordelijk is voor kalligrafie waar de aandacht primair uitgaat naar de esthetische waarde van de schrijfkunst of grafische kunstenaarschap, ongeacht of dezelfde familie ook verantwoordelijk is voor de inscriptie. @nl
label: له عائلة خطاطة @ar
definition: يربط بين عمل وعائلة تكون فنانة مسئولة عن الخط حيث يكمن تركيز الاهتمام في القيمة الجمالية للخط أو فن الرسم، بغض النظر عن كون العائلة نفسها مسئولة أيضًا عن النص المدرج. @ar
toolkit label: عائلة خطاطة @ar
toolkit definition: عائلة تكون فنانة مسئولة عن الخط حيث يكمن تركيز الاهتمام في القيمة الجمالية للخط أو فن الرسم، بغض النظر عن كون العائلة نفسها مسئولة أيضًا عن النص المدرج. @ar
label: té com a família cal·lígrafa @ca
definition: Relaciona una obra amb una família que és un artista que és responsable de la cal·ligrafia on el centre de l’interès se situa en el valor estètic de la cal·ligrafia o del grafisme, independentment de si la mateixa família és també responsable del text inscrit. @ca
toolkit label: família cal·lígrafa @ca
toolkit definition: Família que és un artista que és responsable de la cal·ligrafia on el centre de l’interès se situa en el valor estètic de la cal·ligrafia o del grafisme, independentment de si la mateixa família és també responsable del text inscrit. @ca
label: har familie, som er kalligraf @da
definition: Relaterer et værk til en familie, som er en kunstner, som er ansvarlig for kalligrafi, hvor fokus ligger på den æstetiske værdi af skrivekunsten eller den kunstneriske grafiske dygtighed, uagtet om den samme person også har forfattet den indskrevne tekst. @da
toolkit label: familie, som er kalligraf @da
toolkit definition: Familie, som er en kunstner, som er ansvarlig for kalligrafi, hvor fokus ligger på den æstetiske værdi af skrivekunsten eller den kunstneriske grafiske dygtighed, uagtet om den samme person også har forfattet den indskrevne tekst. @da
label: kalligraaf (perekond) @et
definition: Seostab teose perekonnaga, kes on ilukirja eest vastutav kunstnik. Ilukirja põhirõhk on kirjakunsti või graafilise kunstnikutöö esteetilisel väärtusel, olenemata sellest, kas sama perekond on vastutav ka kirjutatud teksti eest. @et
toolkit label: kalligraaf (perekond) @et
toolkit definition: Perekond, kes on ilukirja eest vastutav kunstnik. Ilukirja põhirõhk on kirjakunsti või graafilise kunstnikutöö esteetilisel väärtusel, olenemata sellest, kas sama perekond on vastutav ka kirjutatud teksti eest. @et
label: hat Kalligrafin/Kalligrafen (Familie) @de
definition: Setzt ein Werk in Beziehung zu einer Künstlerin/einem Künstler (Familie), die/der für die Kalligrafie verantwortlich ist, bei der der ästhetische Wert der Schreibkunst oder die grafische Kunstfertigkeit im Mittelpunkt des Interesses liegt, unabhängig davon, ob dieselbe Familie auch für den aufgeschriebenen Text verantwortlich ist. @de
toolkit label: Kalligrafin/Kalligrafen (Familie) @de
toolkit definition: Eine Künstlerin/Ein Künstler (Familie), die/der für die Kalligrafie verantwortlich ist, bei der der ästhetische Wert der Schreibkunst oder die grafische Kunstfertigkeit im Mittelpunkt des Interesses liegt, unabhängig davon, ob dieselbe Familie auch für den aufgeschriebenen Text verantwortlich ist. @de
label: kalligráfus családja a következő: @hu
definition: Hozzákapcsol egy művet egy művész családhoz, amely felelős egy kalligráfia megalkotásáért, amelyben a szépírás esztétikai értéke vagy a grafika művészisége áll az érdeklődés fókuszában, tekintet nélkül arra, hogy ugyanaz a család a lejegyzett szöveg szerzője is egyben vagy sem. @hu
toolkit label: kalligráfus család: @hu
toolkit definition: Egy család, amely felelős egy kalligráfia megalkotásáért, amelyben a szépírás esztétikai értéke vagy a grafika művészisége áll az érdeklődés fókuszában, tekintet nélkül arra, hogy ugyanaz a család a lejegyzett szöveg szerzője is egyben vagy sem. @hu
label: ha come calligrafo famiglia @it
definition: Correla un'opera alla famiglia artista responsabile della calligrafia, laddove l'oggetto dell'interesse risieda nel valore estetico della calligrafia o maestria grafica, a prescindere dal fatto che la stessa famiglia sia anche responsabile per il testo scritto. @it
toolkit label: calligrafo famiglia @it
toolkit definition: Famiglia artista responsabile della calligrafia, laddove l'oggetto dell'interesse risieda nel valore estetico della calligrafia o maestria grafica, a prescindere dal fatto che la stessa famiglia sia anche responsabile per il testo scritto. @it
label: a pour famille calligraphe @fr
definition: Met une œuvre en relation avec une famille artiste qui est responsable de la création d’une calligraphie où l’accent est mis sur la valeur esthétique de la calligraphie ou du graphisme, peu importe que la même famille soit aussi responsable du texte calligraphié. @fr
toolkit label: famille calligraphe @fr
toolkit definition: Famille artiste qui est responsable de la création d’une calligraphie où l’accent est mis sur la valeur esthétique de la calligraphie ou du graphisme, peu importe que la même famille soit aussi responsable du texte calligraphié. @fr
label: kaligrāfs (dzimta/ģimene) @lv
definition: Sasaista darbu ar dzimtu/ģimeni mākslinieks, kas ir atbildīga par kaligrāfiju, kur galvenais ir mākslinieciskā vai grafiskā mākslas vērtība, neatkarīgi no tā, vai tā pati persona ir atbildīga arī par ierakstīto tekstu. @lv
toolkit label: kaligrāfs (dzimta/ģimene) @lv
toolkit definition: Dzimta/ģimene mākslinieks, kas ir atbildīga par kaligrāfiju, kur galvenais ir mākslinieciskā vai grafiskā mākslas vērtība, neatkarīgi no tā, vai tā pati persona ir atbildīga arī par ierakstīto tekstu. @lv
label: 有书法者家族 @zh-hans
definition: 将一种作品与作为一个艺术家负责书法（其中兴趣重点是书法或图形艺术的美学价值，不管同一家族是否负责题写文字）的一个家族关联起来。 @zh-hans
toolkit label: 书法者家族 @zh-hans
toolkit definition: 作为一个艺术家负责书法（其中兴趣重点是书法或图形艺术的美学价值，不管同一家族是否负责题写文字）的一个家族 @zh-hans
has subproperty: P10567
label: kaligraf aile ile ilişkilidir @tr
definition: Bir eseri, aynı ailenin yazılı metinden de sorumlu olup olmadığına bakılmaksızın, ilgi odağının hattatlık veya grafik sanatının estetik değerinde olduğu kaligrafiden sorumlu sanatçı olan bir aileyle ilişkilendirir @tr
toolkit label: kaligraf ailesi @tr
toolkit definition: Estetik değeri kaligrafideki yazı sanatı veya grafik sanatta bulunan ve yazılı metinden bağımsız olarak bu kaligrafiden sorumlu olan bir sanatçı aile. @tr

has calligrapher person
status: Published
lexical alias: calligrapherPerson.en
definition: Relates a work to a person who is an artist who is responsible for calligraphy where the focus of interest lies in the aesthetic value of the penmanship or graphic artistry, regardless of whether the same person is also responsible for the inscribed text.
toolkit label: calligrapher person
toolkit definition: A person who is an artist who is responsible for calligraphy where the focus of interest lies in the aesthetic value of the penmanship or graphic artistry, regardless of whether the same person is also responsible for the inscribed text.
type: Property
domain: C10001
has element type: 2
sub property of: has artist person
sub property of: has calligrapher agent
label: kalligrafi (henkilö) @fi
definition: Liittää teoksen henkilöön, joka on taiteilija, joka on vastuussa kalligrafiasta, jossa pääpaino on käsin kirjoittamisen tai graafisen taiteen esteettisissä arvoissa, riippumatta siitä, onko sama toimija myös vastuussa kirjoitetusta tekstistä. @fi
toolkit label: kalligrafi (henkilö) @fi
toolkit definition: Henkilö, joka on taiteilija, joka on vastuussa kalligrafiasta, jossa pääpaino on käsin kirjoittamisen tai graafisen taiteen esteettisissä arvoissa, riippumatta siitä, onko sama toimija myös vastuussa kirjoitetusta tekstistä. @fi
label: har kalligraf (person) @no
definition: Relaterer et verk til en person som er en kunstner som er ansvarlig for kalligrafi der fokus er på den estetiske verdien av pennekunsten eller kunstnerisk dyktighet, uavhengig av om den samme agenten også er ansvarlig for tekstinnholdet. @no
toolkit label: kalligraf (person) @no
toolkit definition: En person som er en kunstner som er ansvarlig for kalligrafi der fokus er på den estetiske verdien av pennekunsten eller kunstnerisk dyktighet, uavhengig av om den samme agenten også er ansvarlig for tekstinnholdet. @no
label: heeft kalligraaf-persoon @nl
definition: Relateert een werk aan een persoon die een kunstenaar is die verantwoordelijk is voor kalligrafie waar de aandacht primair uitgaat naar de esthetische waarde van de schrijfkunst of grafische kunstenaarschap, ongeacht of dezelfde persoon ook verantwoordelijk is voor de inscriptie. @nl
toolkit label: kalligraaf-persoon @nl
toolkit definition: Een persoon die een kunstenaar is die verantwoordelijk is voor kalligrafie waar de aandacht primair uitgaat naar de esthetische waarde van de schrijfkunst of grafische kunstenaarschap, ongeacht of dezelfde persoon ook verantwoordelijk is voor de inscriptie. @nl
label: له شخص خطاط @ar
definition: يربط بين عمل وشخص يكون فنانا مسئولاً عن فن الخط حيث ينصب تركيز الاهتمام على القيمة الجمالية للخط أو فن الرسم، بغض النظر عن كون الشخص نفسه مسئولاً أيضًا عن النص المدون. @ar
toolkit label: شخص خطاط @ar
toolkit definition: شخص يكون فنانا مسئولاً عن فن الخط حيث ينصب تركيز الاهتمام على القيمة الجمالية للخط أو فن الرسم، بغض النظر عن كون الشخص نفسه مسئولاً أيضًا عن النص المدون. @ar
label: té com a persona cal·lígrafa @ca
definition: Relaciona una obra amb una persona que és un artista que és responsable de la cal·ligrafia on el centre de l’interès se situa en el valor estètic de la cal·ligrafia o del grafisme, independentment de si la mateixa persona és també responsable del text inscrit. @ca
toolkit label: persona cal·lígrafa @ca
toolkit definition: Persona que és un artista que és responsable de la cal·ligrafia on el centre de l’interès se situa en el valor estètic de la cal·ligrafia o del grafisme, independentment de si la mateixa persona és també responsable del text inscrit. @ca
label: har person, som er kalligraf @da
definition: Relaterer et værk til en person, som er en kunstner, som er ansvarlig for kalligrafi, hvor fokus ligger på den æstetiske værdi af skrivekunsten eller den kunstneriske grafiske dygtighed, uagtet om den samme person også har forfattet den indskrevne tekst. @da
toolkit label: person, som er kalligraf @da
toolkit definition: Person, som er en kunstner, som er ansvarlig for kalligrafi, hvor fokus ligger på den æstetiske værdi af skrivekunsten eller den kunstneriske grafiske dygtighed, uagtet om den samme person også har forfattet den indskrevne tekst. @da
label: kalligraaf (isik) @et
definition: Seostab teose isikuga, kes on ilukirja eest vastutav kunstnik. Ilukirja põhirõhk on kirjakunsti või graafilise kunstnikutöö esteetilisel väärtusel, olenemata sellest, kas sama isik on vastutav ka kirjutatud teksti eest. @et
toolkit label: kalligraaf (isik) @et
toolkit definition: Isik, kes on ilukirja eest vastutav kunstnik. Ilukirja põhirõhk on kirjakunsti või graafilise kunstnikutöö esteetilisel väärtusel, olenemata sellest, kas sama isik on vastutav ka kirjutatud teksti eest. @et
label: hat Kalligrafin/Kalligrafen (Person) @de
definition: Setzt ein Werk in Beziehung zu einer Künstlerin/einem Künstler (Person), die/der für die Kalligrafie verantwortlich ist, bei der der ästhetische Wert der Schreibkunst oder die grafische Kunstfertigkeit im Mittelpunkt des Interesses liegt, unabhängig davon, ob dieselbe Person auch für den aufgeschriebenen Text verantwortlich ist. @de
toolkit label: Kalligrafin/Kalligraf (Person) @de
toolkit definition: Eine Künstlerin/Ein Künstler (Person), die/der für die Kalligrafie verantwortlich ist, bei der der ästhetische Wert der Schreibkunst oder die grafische Kunstfertigkeit im Mittelpunkt des Interesses liegt, unabhängig davon, ob dieselbe Person auch für den aufgeschriebenen Text verantwortlich ist. @de
label: kalligráfus személye a következő: @hu
definition: Hozzákapcsol egy művet egy művész személyhez, aki felelős egy kalligráfia megalkotásáért, amelyben a szépírás esztétikai értéke vagy a grafikus művésziség áll az érdeklődés fókuszában, tekintet nélkül arra, hogy ugyanaz a személy a lejegyzett szöveg szerzője is egyben vagy sem. @hu
toolkit label: kalligráfus személy: @hu
toolkit definition: Egy művész személy, aki felelős egy kalligráfia megalkotásáért, amelyben a szépírás esztétikai értéke vagy a grafikus művésziség áll az érdeklődés fókuszában, tekintet nélkül arra, hogy ugyanaz a személy a lejegyzett szöveg szerzője is egyben vagy sem. @hu
label: ha come calligrafo persona @it
definition: Correla un'opera alla persona artista responsabile della calligrafia, laddove l'oggetto dell'interesse risieda nel valore estetico della calligrafia o maestria grafica, a prescindere che la stessa persona sia anche responsabile del testo inscritto. @it
toolkit label: calligrafo persona @it
toolkit definition: Persona artista, responsabile della calligrafia, laddove l'oggetto dell'interesse risieda nel valore estetico della calligrafia o maestria grafica, a prescindere che la stessa persona sia anche responsabile del testo inscritto. @it
label: a pour personne calligraphe @fr
definition: Met une œuvre en relation avec une personne artiste qui est responsable de la création d’une calligraphie où l’accent est mis sur la valeur esthétique de la calligraphie ou du graphisme, peu importe que la même personne soit aussi responsable du texte calligraphié. @fr
toolkit label: personne calligraphe @fr
toolkit definition: Personne artiste qui est responsable de la création d’une calligraphie où l’accent est mis sur la valeur esthétique de la calligraphie ou du graphisme, peu importe que la même personne soit aussi responsable du texte calligraphié. @fr
label: kaligrāfs (persona) @lv
definition: Sasaista darbu ar personu mākslinieks, kas ir atbildīgs par kaligrāfiju, kur galvenais ir mākslinieciskā vai grafiskā mākslas vērtība, neatkarīgi no tā, vai tā pati persona ir atbildīga arī par ierakstīto tekstu. @lv
toolkit label: kaligrāfs (persona) @lv
toolkit definition: Persona mākslinieks, kas ir atbildīgs par kaligrāfiju, kur galvenais ir mākslinieciskā vai grafiskā mākslas vērtība, neatkarīgi no tā, vai tā pati persona ir atbildīga arī par ierakstīto tekstu. @lv
label: 有书法者个人 @zh-hans
definition: 将一种作品与作为一个艺术家负责书法（其中兴趣重点是书法或图形艺术的美学价值，不管同一个人是否负责题写文字）的一个个人关联起来。 @zh-hans
toolkit label: 书法者个人 @zh-hans
toolkit definition: 作为一个艺术家负责书法（其中兴趣重点是书法或图形艺术的美学价值，不管同一个人是否负责题写文字）的一个个人 @zh-hans
has subproperty: P10426
label: kaligraf ile ilişkilidir @tr
definition: Bir eseri aynı kişinin yazılı metinden sorumlu olup olmadığına bakılmaksızın, hattatlığın veya grafik sanatının estetik değerinin ön plana çıktığı, kaligrafiden sorumlu sanatçı olan kişiyle ilişkilendirir. @tr
toolkit label: kaligraf @tr
toolkit definition: Aynı kişinin metin sorumluluğuna bakılmaksızın, hattatlığın veya grafik sanatının estetik değerinin ön plana çıktığı, kaligrafiden sorumlu sanatçı olan kişi. @tr

has carrier version
status: Published
lexical alias: carrierVersion.en
definition: Relates a work to a work that is created by changing the carrier of a work.
toolkit label: carrier version
toolkit definition: A work that is created by changing the carrier of a work.
type: Property
domain: C10001
sub property of: has transformation by audience
has element type: 2
label: tallenneversio @fi
definition: Liittää teoksen teokseen, joka on luotu muuttamalla teoksen tallennetta. @fi
toolkit label: tallenneversio @fi
toolkit definition: Teos, joka on luotu muuttamalla teoksen tallennetta. @fi
label: har bærerversjon @no
definition: Relaterer et verk til et verk som er skapt ved endring av bæreren for et verk. @no
toolkit label: bærerversjon @no
toolkit definition: Et verk som er skapt ved endring av bæreren for et verk. @no
label: heeft dragerversie @nl
definition: Relateert een werk aan een werk dat gecreëerd wordt door het wijzigen van de drager van een werk. @nl
toolkit label: dragerversie @nl
toolkit definition: Een werk dat gecreëerd wordt door het wijzigen van de drager van een werk. @nl
label: له إصدارة ناقل @ar
definition: يربط عمل بعمل يتم إنشاؤه عن طريق تغيير ناقل عمل. @ar
toolkit label: إصدارة ناقل @ar
toolkit definition: عمل يتم إنشاؤه عن طريق تغيير ناقل عمل. @ar
label: té com a versió de suport físic @ca
definition: Relaciona una obra amb una obra que es crea canviant el suport físic d’una obra. @ca
toolkit label: versió de suport físic @ca
toolkit definition: Obra que es crea canviant el suport físic d’una obra. @ca
label: har bærerversion @da
definition: Relaterer et værk til et værk, som er skabt ved at ændre et værks bærer. @da
toolkit label: bærerversion @da
toolkit definition: Værk, som er skabt ved at ændre et værks bærer. @da
label: kandjaversioon @et
definition: Seostab teose teosega, mis on loodud, muutes teose kandjat. @et
toolkit label: kandjaversioon @et
toolkit definition: Teos, mis on loodud, muutes teose kandjat. @et
label: hat Datenträgerversion @de
definition: Setzt ein Werk in Beziehung zu einem Werk, das durch Änderung des Datenträgers eines Werks geschaffen wird. @de
toolkit label: Datenträgerversion @de
toolkit definition: Ein Werk, das durch eine Änderung des Datenträgers eines Werks erstellt wird. @de
label: hordozóváltozata a következő: @hu
definition: Hozzákapcsol egy művet egy műhöz, amely egy mű hordozójának megváltozása következtében jött létre. @hu
toolkit label: hordozóváltozata: @hu
toolkit definition: Egy mű, amely egy mű hordozójának megváltozása következtében jött létre. @hu
label: ha come versione di supporto @it
definition: Correla un'opera a un'opera creata cambiando il supporto di un'opera. @it
toolkit label: versione di supporto @it
toolkit definition: Opera creata modificando il supporto di un'opera. @it
label: a pour version sur support matériel différent @fr
definition: Met une œuvre en relation avec une œuvre qui est créée en modifiant le support matériel d’une œuvre. @fr
toolkit label: version sur support matériel différent @fr
toolkit definition: Œuvre qui est créée en modifiant le support matériel d’une œuvre. @fr
label: nesēja variants @lv
definition: Sasaista darbu ar darbu, kas radīts, mainot darba nesēju. @lv
toolkit label: nesēja variants @lv
toolkit definition: Darbs, kas radīts, mainot darba nesēju. @lv
label: 有载体版本 @zh-hans
definition: 将一种作品与通过改变一种作品的载体而创建的一种作品关联起来。 @zh-hans
toolkit label: 载体版本 @zh-hans
toolkit definition: 通过改变一种作品的载体而创建的一种作品 @zh-hans
has subproperty: P10387
label: taşıyıcı sürümü ile ilişkilidir @tr
definition: Bir eseri, bir eserin taşıyıcısı değiştirilerek oluşturulan eserle ilişkilendirir. @tr
toolkit label: taşıyıcı versiyonu @tr
toolkit definition: Bir eserin taşıyıcısı değiştirilerek oluşturulan bir eser. @tr

is carrier version of
status: Published
lexical alias: carrierVersionOf.en
definition: Relates a work to a work that has a carrier that is changed to create a work.
toolkit label: carrier version of
toolkit definition: A work that has a carrier that is changed to create a work.
type: Property
domain: C10001
sub property of: is transformation by audience of
has element type: 2
label: tallenneversio teoksesta @fi
definition: Liittää teoksen teokseen, jolla on tallenne, jota on muutettu teoksen luomiseksi. @fi
toolkit label: tallenneversio teoksesta @fi
toolkit definition: Teos, jolla on tallenne, jota on muutettu teoksen luomiseksi. @fi
label: er bærerversjon av @no
definition: Relaterer et verk til et verk som har en bærer som er endret for å skape et verk. @no
toolkit label: bærerversjon av @no
toolkit definition: Et verk som har en bærer som er endret for å skape et verk. @no
label: is dragerversie van @nl
definition: Relateert een werk aan een werk dat een drager heeft die gewijzigd wordt om een ander werk te creëren. @nl
toolkit label: dragerversie van @nl
toolkit definition: Een werk dat een drager heeft die gewijzigd wordt om een ander werk te creëren. @nl
label: هو إصدارة ناقل لـ @ar
definition: يربط عمل بعمل له ناقل يتم تغييره لإنشاء عمل. @ar
toolkit label: إصدارة ناقل لـ @ar
toolkit definition: عمل به ناقل تم تغييره لإنشاء عمل. @ar
label: és versió de suport físic de @ca
definition: Relaciona una obra amb una obra que té un suport físic que es canvia per crear una obra. @ca
toolkit label: versió de suport físic de @ca
toolkit definition: Obra que té un suport físic que es canvia per crear una obra. @ca
label: er bærerversion af @da
definition: Relaterer et værk til et værk, som har en bærer, som ændres for at skabe et værk. @da
toolkit label: bærerversion af @da
toolkit definition: Værk, som har en bærer, som ændres for at skabe et værk. @da
label: kandjaversioon teosest @et
definition: Seostab teose teosega, mille kandjat on teose loomiseks muudetud. @et
toolkit label: kandjaversioon teosest @et
toolkit definition: Teos, mille kandjat on teose loomiseks muudetud. @et
label: ist Datenträgerversion von @de
definition: Setzt ein Werk in Beziehung zu einem Werk, dessen Datenträger geändert wird, um ein Werk zu schaffen. @de
toolkit label: Datenträgerversion von @de
toolkit definition: Ein Werk, dessen Datenträger geändert wird, um ein Werk zu schaffen. @de
label: hordozóváltozata a következőnek: @hu
definition: Hozzákapcsol egy művet egy műhöz, amelynek a hordozója megváltozott egy mű létrejövetele érdekében. @hu
toolkit label: hordozóváltozata: @hu
toolkit definition: Egy mű, amelynek a hordozója megváltozott egy mű létrejövetele érdekében. @hu
label: è versione di supporto di @it
definition: Correla un'opera a un'opera che ha un supporto cambiato per creare un'opera. @it
toolkit label: versione di supporto di @it
toolkit definition: Opera che ha un supporto cambiato per creare un'opera. @it
label: est une version sur support matériel différent de @fr
definition: Met une œuvre en relation avec une œuvre dont le support matériel est modifié pour créer une œuvre. @fr
toolkit label: version sur support matériel différent de @fr
toolkit definition: Œuvre dont le support matériel est modifié pour créer une œuvre. @fr
label: ir nesēja variants no @lv
definition: Sasaista darbu ar darbu, kam nesējs ticis mainīts, lai radītu darbu. @lv
toolkit label: nesēja variants no @lv
toolkit definition: Darbs, kam nesējs ticis mainīts, lai radītu darbu. @lv
label: 是……的载体版本 @zh-hans
definition: 将一种作品与有载体并被改变以创建一种作品的一种作品关联起来。 @zh-hans
toolkit label: ……的载体版本 @zh-hans
toolkit definition: 有载体并被改变以创建一种作品的一种作品 @zh-hans
has subproperty: P10390
label: taşıyıcı sürümüdür @tr
definition: Bir eseri, bir eser oluşturmak için değiştirilen bir taşıyıcıya sahip bir eser ile ilişkilendirir. @tr
toolkit label: taşıyıcı versiyonu @tr
toolkit definition: Bir eserin, bir taşıyıcıyı değiştirerek oluşturulduğu bir eser. @tr

has cartographer agent of work
status: Published
definition: Relates a work to an agent who is responsible for creating a cartographic work.
type: Property
domain: C10001
sub property of: has creator agent of work
lexical alias: cartographerAgentOfWork.en
toolkit label: cartographer agent of work
toolkit definition: An agent who is responsible for creating a cartographic work.
toolkit label: agent cartographe d’une œuvre @fr
toolkit definition: Agent qui est responsable de la création d’une œuvre cartographique. @fr
toolkit label: cartógrafo @es
toolkit definition: Una persona, familia o entidad corporativa responsable de la creación de un mapa, atlas, globo u otra obra cartográfica. @es
instruction number: 18.5
label: har agent, som er kartograf for værk @da
definition: Relaterer et værk til en agent, som er ansvarlig for et kartografisk værk. @da
toolkit label: agent, som er kartograf for værk @da
toolkit definition: Agent, som er ansvarlig for et kartografisk værk. @da
definition: Met une œuvre en relation avec un agent qui est responsable de la création d’une œuvre cartographique. @fr
label: có người lập bản đồ @vi
definition: Liên kết tác phẩm với tác nhân có trách nhiệm tạo lập bản đồ, tập bản đồ, quả địa cầu, hoặc tác phẩm bản đồ khác. @vi
toolkit label: người lập bản đồ @vi
toolkit definition: Tác nhân có trách nhiệm tạo lập bản đồ, tập bản đồ, quả địa cầu, hoặc tác phẩm bản đồ khác. @vi
label: hat Kartografin/Kartografen eines Werks (Akteur) @de
definition: Setzt ein Werk in Beziehung zu einem Akteur, der für die Schaffung eines kartografischen Werks verantwortlich ist. @de
toolkit label: Kartografin/Kartograf eines Werks (Akteur) @de
toolkit definition: Ein Akteur, der für die Schaffung eines kartografischen Werks verantwortlich ist. @de
label: a pour agent cartographe d’une œuvre @fr
definition: Liittää teoksen toimijaan, joka on vastuussa kartografisen teoksen luomisesta. @fi
toolkit label: teoksen kartantekijä (toimija) @fi
toolkit definition: Toimija, joka on vastuussa kartografisen teoksen luomisesta. @fi
toolkit label: kartograf for verk (agent) @no
toolkit definition: En agent som er ansvarlig for et kartografisk verk. @no
label: té com a agent cartògraf d’una obra @ca
definition: Relaciona una obra amb un agent que és responsable de la creació d’una obra cartogràfica. @ca
toolkit label: agent cartògraf d’una obra @ca
toolkit definition: Agent que és responsable de la creació d’una obra cartogràfica. @ca
has element type: 2
label: έχει χαρτογράφο @el
definition: Συνδέει ένα έργο με έναν φορέα υπεύθυνο για τη δημιουργία ενός χάρτη, ενός άτλαντα, μιας υδρόγειας σφαίρας ή άλλου χαρτογραφικού έργου. @el
toolkit label: χαρτογράφος @el
toolkit definition: Ένας φορέας υπεύθυνος για τη δημιουργία ενός χάρτη, ενός άτλαντα, μιας υδρόγειας σφαίρας ή άλλου χαρτογραφικού έργου. @el
label: mű térképész ágense a következő: @hu
definition: Hozzákapcsol egy művet egy ágenshez, amely felelős egy kartográfiai mű létrehozásáért. @hu
toolkit label: mű térképész ágense: @hu
toolkit definition: Egy ágens, amely felelős egy kartográfiai mű létrehozásáért. @hu
alternative label: cartographer
alternative label: teoksen kartantekijä @fi
label: teoksen kartantekijä (toimija) @fi
label: har kartograf for verk (agent) @no
definition: Relateter et verk til en agent som er ansvarlig for et kartografisk verk. @no
alternative label: kartograf for verk @no
label: heeft cartograaf-actor van werk @nl
definition: Relateert een werk aan een actor die verantwoordelijk is voor het creëren van een cartografisch werk. @nl
toolkit label: cartograaf-actor van werk @nl
toolkit definition: Een actor die verantwoordelijk is voor het creëren van een cartografisch werk. @nl
label: له وكيل رسام خرائط لعمل @ar
definition: يربط بين عمل ووكيل مسئول عن إنشاء عمل خرائطي. @ar
alternative label: رسام خرائط @ar
toolkit label: وكيل رسام خرائط لعمل @ar
toolkit definition: وكيل مسئول عن إنشاء عمل خرائطي. @ar
alternative label: cartògraf @ca
alternative label: kartograf for værk @da
label: teose kartograaf (tegija) @et
definition: Seostab teose tegijaga, kes vastutab kartograafilise teose loomise eest. @et
alternative label: teose kartograaf @et
toolkit label: teose kartograaf (tegija) @et
toolkit definition: Tegija, kes vastutab kartograafilise teose loomise eest. @et
alternative label: Kartograf @de
alternative label: térképész: @hu
label: ha come cartografo agente di opera @it
definition: Correla un'opera a un agente responsabile di un'opera cartografica. @it
alternative label: cartografo di opera @it
toolkit label: cartografo agente di opera @it
toolkit definition: Agente responsabile della creazione di un'opera cartografica. @it
alternative label: cartographe @fr
label: darba kartogrāfs (aģents) @lv
definition: Sasaista darbu ar aģentu, kas ir atbildīgs par karti, atlantu, globusu vai citu kartogrāfijas materiālu. @lv
toolkit label: darba kartogrāfs (aģents) @lv
toolkit definition: Aģents, kas ir atbildīgs par karti, atlantu, globusu vai citu kartogrāfijas materiālu. @lv
toolkit label: 作品的地图绘制者行为者 @zh-hans

has cartographer collective agent of work
status: Published
lexical alias: cartographerCollectiveAgentOfWork.en
definition: Relates a work to a collective agent who is responsible for creating a cartographic work.
toolkit label: cartographer collective agent of work
toolkit definition: A collective agent who is responsible for creating a cartographic work.
type: Property
domain: C10001
has element type: 2
sub property of: has creator collective agent of work
sub property of: has cartographer agent of work
label: teoksen kartantekijä (yhteistoimija) @fi
definition: Liittää teoksen yhteistoimijaan, joka on vastuussa kartografisen teoksen luomisesta. @fi
toolkit label: teoksen kartantekijä (yhteistoimija) @fi
toolkit definition: Yhteistoimija, joka on vastuussa kartografisen teoksen luomisesta. @fi
label: har kartograf for verk (kollektiv agent) @no
definition: Relaterer et verk til en kollektiv agent som er ansvarlig for et kartografisk verk. @no
toolkit label: kartograf for verk (kollektiv agent) @no
toolkit definition: En kollektiv agent som er ansvarlig for et kartografisk verk. @no
label: heeft cartograaf-collectieve actor van werk @nl
definition: Relateert een werk aan een collectieve actor die verantwoordelijk is voor het creëren van een cartografisch werk. @nl
toolkit label: cartograaf-collectieve actor van werk @nl
toolkit definition: Een collectieve actor die verantwoordelijk is voor het creëren van een cartografisch werk. @nl
label: له وكيل جماعي رسام خرائط لعمل @ar
definition: يربط بين عمل ووكيل جماعي مسئول عن إنشاء عمل خرائطي. @ar
toolkit label: وكيل جماعي رسام خرائط لعمل @ar
toolkit definition: وكيل جماعي مسئول عن إنشاء عمل خرائطي. @ar
label: té com a agent col·lectiu cartògraf d’una obra @ca
definition: Relaciona una obra amb un agent col·lectiu que és responsable de la creació d’una obra cartogràfica. @ca
toolkit label: agent col·lectiu cartògraf d’una obra @ca
toolkit definition: Agent col·lectiu que és responsable de la creació d’una obra cartogràfica. @ca
label: har kollektiv agent, som er kartograf for værk @da
definition: Relaterer et værk til en kollektiv agent, som er ansvarlig for et kartografisk værk. @da
toolkit label: kollektiv agent, som er kartograf for værk @da
toolkit definition: Kollektiv agent, som er ansvarlig for et kartografisk værk. @da
label: teose kartograaf (kollektiiv) @et
definition: Seostab teose kollektiiviga, kes vastutab kartograafilise teose loomise eest. @et
toolkit label: teose kartograaf (kollektiiv) @et
toolkit definition: Kollektiiv, kes vastutab kartograafilise teose loomise eest. @et
label: hat Kartografin/Kartografen eines Werks (Gemeinschaftlicher Akteur) @de
definition: Setzt ein Werk in Beziehung zu einem gemeinschaftlichen Akteur, der für die Schaffung eines kartografischen Werks verantwortlich ist. @de
toolkit label: Kartografin/Kartograf eines Werks (Gemeinschaftlicher Akteur) @de
toolkit definition: Ein gemeinschaftlicher Akteur, der für die Schaffung eines kartografischen Werks verantwortlich ist. @de
label: mű térképész kollektív ágense a következő: @hu
definition: Hozzákapcsol egy művet egy kollektív ágenshez, amely felelős egy kartográfiai mű létrehozásáért. @hu
toolkit label: mű térképész kollektív ágense: @hu
toolkit definition: Egy kollektív ágens, amely felelős egy kartográfiai mű létrehozásáért. @hu
label: ha come cartografo agente collettivo di opera @it
definition: Correla un'opera all'agente collettivo responsabile di un'opera cartografica. @it
toolkit label: cartografo agente collettivo di opera @it
toolkit definition: Agente collettivo responsabile di un'opera cartografica. @it
label: a pour agent collectif cartographe d’une œuvre @fr
definition: Met une œuvre en relation avec un agent collectif qui est responsable de la création d’une œuvre cartographique. @fr
toolkit label: agent collectif cartographe d’une œuvre @fr
toolkit definition: Agent collectif qui est responsable de la création d’une œuvre cartographique. @fr
label: darba kartogrāfs (grupa) @lv
definition: Sasaista darbu ar grupu, kas ir atbildīga par karti, atlantu, globusu vai citu kartogrāfijas materiālu. @lv
toolkit label: darba kartogrāfs (grupa) @lv
toolkit definition: Grupa, kas ir atbildīga par karti, atlantu, globusu vai citu kartogrāfijas materiālu. @lv
label: 有作品的地图绘制者集体行为者 @zh-hans
definition: 将一种作品与负责创建一种地图作品的一个集体行为者关联起来。 @zh-hans
toolkit label: 作品的地图绘制者集体行为者 @zh-hans
toolkit definition: 负责创建一种地图作品的一个集体行为者 @zh-hans
has subproperty: has cartographer corporate body of work
has subproperty: has cartographer family of work
has subproperty: P10482
label: eserin kartograf kolektif temsilcisi ile ilişkilidir @tr
definition: Bir eseri, bir kartografik eser oluşturmaktan sorumlu olan kolektif bir temsilci ile ilişkilendirir. @tr
toolkit label: eserin kartograf kolektif temsilcisi @tr
toolkit definition: Bir harita çalışması oluşturulmasından sorumlu olan kolektif bir temsilci @tr

has cartographer corporate body of work
status: Published
lexical alias: cartographerCorporateBodyOfWork.en
definition: Relates a work to a corporate body who is responsible for creating a cartographic work.
toolkit label: cartographer corporate body of work
toolkit definition: A corporate body who is responsible for creating a cartographic work.
type: Property
domain: C10001
has element type: 2
sub property of: has creator corporate body of work
sub property of: has cartographer collective agent of work
label: teoksen kartantekijä (yhteisö) @fi
definition: Liittää teoksen yhteisöön, joka on vastuussa kartografisen teoksen luomisesta. @fi
toolkit label: teoksen kartantekijä (yhteisö) @fi
toolkit definition: Yhteisö, joka on vastuussa kartografisen teoksen luomisesta. @fi
label: har kartograf (korporasjon) @no
definition: Relaterer et verk til en korporasjon som er ansvarlig for et kartografisk verk. @no
toolkit label: kartograf (korporasjon) @no
toolkit definition: En korporasjon som er ansvarlig for et kartografisk verk. @no
label: heeft cartograaf-corporatie van werk @nl
definition: Relateert een werk aan een corporatie die verantwoordelijk is voor het creëren van een cartografisch werk. @nl
toolkit label: cartograaf-corporatie van werk @nl
toolkit definition: Een corporatie die verantwoordelijk is voor het creëren van een cartografisch werk. @nl
label: له هيئة رسامة خرائط لعمل @ar
definition: يربط بين عمل وهيئة مسئولة عن إنشاء عمل خرائطي. @ar
toolkit label: هيئة رسامة خرائط لعمل @ar
toolkit definition: هيئة مسئولة عن إنشاء عمل خرائطي. @ar
label: té com a entitat corporativa cartògrafa d’una obra @ca
definition: Relaciona una obra amb una entitat corporativa que és responsable de la creació d’una obra cartogràfica. @ca
toolkit label: entitat corporativa cartògrafa d’una obra @ca
toolkit definition: Entitat corporativa que és responsable de la creació d’una obra cartogràfica. @ca
label: har korporation, som er kartograf for værk @da
definition: Relaterer et værk til en korporation, som er ansvarlig for et kartografisk værk. @da
toolkit label: korporation, som er kartograf for værk @da
toolkit definition: Korporation, som er ansvarlig for et kartografisk værk. @da
label: teose kartograaf (asutus) @et
definition: Seostab teose asutusega, kes vastutab kartograafilise teose loomise eest. @et
toolkit label: teose kartograaf (asutus) @et
toolkit definition: Asutus, kes vastutab kartograafilise teose loomise eest. @et
label: hat Kartografin/Kartografen eines Werks (Körperschaft) @de
definition: Setzt ein Werk in Beziehung zu einer Körperschaft, die für die Schaffung eines kartografischen Werks verantwortlich ist. @de
toolkit label: Kartografin/Kartograf eines Werks (Körperschaft) @de
toolkit definition: Eine Körperschaft, die für die Schaffung eines kartografischen Werks verantwortlich ist. @de
label: mű térképész testülete a következő: @hu
definition: Hozzákapcsol egy művet egy testülethez, amely felelős egy kartográfiai mű létrehozásáért. @hu
toolkit label: mű térképész testülete: @hu
toolkit definition: Egy testület, amely felelős egy kartográfiai mű létrehozásáért. @hu
label: ha come cartografo ente di opera @it
definition: Correla un'opera a un ente responsabile di un'opera cartografica. @it
toolkit label: cartografo ente di opera @it
toolkit definition: Ente responsabile di un'opera cartografica. @it
label: a pour collectivité cartographe d’une œuvre @fr
definition: Met une œuvre en relation avec une collectivité qui est responsable de la création d’une œuvre cartographique. @fr
toolkit label: collectivité cartographe d’une œuvre @fr
toolkit definition: Collectivité qui est responsable de la création d’une œuvre cartographique. @fr
label: darba kartogrāfs (institūcija) @lv
definition: Sasaista darbu ar institūciju, kas ir atbildīga par karti, atlantu, globusu vai citu kartogrāfijas materiālu. @lv
toolkit label: darba kartogrāfs (institūcija) @lv
toolkit definition: Institūcija, kas ir atbildīga par karti, atlantu, globusu vai citu kartogrāfijas materiālu. @lv
label: 有作品的地图绘制者团体 @zh-hans
definition: 将一种作品与负责创建一种地图作品的一个团体关联起来。 @zh-hans
toolkit label: 作品的地图绘制者团体 @zh-hans
toolkit definition: 负责创建一种地图作品的一个团体 @zh-hans
has subproperty: P10529
label: eserin kartograf tüzel kişisi ile ilişkilidir @tr
definition: Bir eseri, kartografik bir çalışma oluşturmaktan sorumlu olan tüzel kişi ile ilişkilendirir. @tr
toolkit label: eserin kartograf tüzel kişisi @tr
toolkit definition: Bir kartografik çalışma oluşturmaktan sorumlu olan bir tüzel kişi. @tr

has cartographer family of work
status: Published
lexical alias: cartographerFamilyOfWork.en
definition: Relates a work to a family who is responsible for creating a cartographic work.
toolkit label: cartographer family of work
toolkit definition: A family who is responsible for creating a cartographic work.
type: Property
domain: C10001
has element type: 2
sub property of: has creator family of work
sub property of: has cartographer collective agent of work
label: teoksen kartantekijä (suku) @fi
definition: Liittää teoksen sukuun, joka on vastuussa kartografisen teoksen luomisesta. @fi
toolkit label: teoksen kartantekijä (suku) @fi
toolkit definition: Suku, joka on vastuussa kartografisen teoksen luomisesta. @fi
label: har kartograf (familie) @no
definition: Relaterer et verk til en familie som er ansvarlig for et kartografisk verk. @no
toolkit label: kartograf (familie) @no
toolkit definition: En familie som er ansvarlig for et kartografisk verk. @no
label: heeft cartograaf-familie van werk @nl
definition: Relateert een werk aan een familie die verantwoordelijk is voor het creëren van een cartografisch werk. @nl
toolkit label: cartograaf-familie van werk @nl
toolkit definition: Een familie die verantwoordelijk is voor het creëren van een cartografisch werk. @nl
label: له عائلة رسامة خرائط لعمل @ar
definition: يربط بين عمل وعائلة مسئولة عن إنشاء عمل خرائطي. @ar
toolkit label: عائلة رسامة خرائط لعمل @ar
toolkit definition: عائلة مسئولة عن إنشاء عمل خرائطي. @ar
label: té com a família cartògrafa d’una obra @ca
definition: Relaciona una obra amb una família que és responsable de la creació d’una obra cartogràfica. @ca
toolkit label: família cartògrafa d’una obra @ca
toolkit definition: Família que és responsable de la creació d’una obra cartogràfica. @ca
label: har familie, som er kartograf for værk @da
definition: Relaterer et værk til en familie, som er ansvarlig for et kartografisk værk. @da
toolkit label: familie, som er kartograf for værk @da
toolkit definition: Familie, som er ansvarlig for et kartografisk værk. @da
label: teose kartograaf (perekond) @et
definition: Seostab teose perekonnaga, kes vastutab kartograafilise teose loomise eest. @et
toolkit label: teose kartograaf (perekond) @et
toolkit definition: Perekond, kes vastutab kartograafilise teose loomise eest. @et
label: hat Kartografin/Kartografen eines Werks (Familie) @de
definition: Setzt ein Werk in Beziehung zu einer Familie, die für die Schaffung eines kartografischen Werks verantwortlich ist. @de
toolkit label: Kartografin/Kartograf eines Werks (Familie) @de
toolkit definition: Eine Familie, die für die Schaffung eines kartografischen Werks verantwortlich ist. @de
label: mű térképész családja a következő: @hu
definition: Hozzákapcsol egy művet egy családhoz, amely felelős egy kartográfiai mű létrehozásáért. @hu
toolkit label: mű térképész családja: @hu
toolkit definition: Egy család, amely felelős egy kartográfiai mű létrehozásáért. @hu
label: ha come cartografo famiglia di opera @it
definition: Correla un'opera alla famiglia responsabile di un'opera cartografica. @it
toolkit label: cartografo famiglia di opera @it
toolkit definition: Famiglia responsabile di un'opera cartografica. @it
label: a pour famille cartographe d’une œuvre @fr
definition: Met une œuvre en relation avec une famille qui est responsable de la création d’une œuvre cartographique. @fr
toolkit label: famille cartographe d’une œuvre @fr
toolkit definition: Famille qui est responsable de la création d’une œuvre cartographique. @fr
label: darba kartogrāfs (dzimta/ģimene) @lv
definition: Sasaista darbu ar dzimtu/ģimeni, kas ir atbildīga par karti, atlantu, globusu vai citu kartogrāfijas materiālu. @lv
toolkit label: darba kartogrāfs (dzimta/ģimene) @lv
toolkit definition: Dzimta/ģimene, kas ir atbildīga par karti, atlantu, globusu vai citu kartogrāfijas materiālu. @lv
label: 有作品的地图绘制者家族 @zh-hans
definition: 将一种作品与负责创建一种地图作品的一个家族关联起来。 @zh-hans
toolkit label: 作品的地图绘制者家族 @zh-hans
toolkit definition: 负责创建一种地图作品的一个家族 @zh-hans
has subproperty: P10576
label: eserin kartograf ailesi ile ilişkilidir @tr
definition: Bir eseri, kartografik bir çalışma oluşturmaktan sorumlu olan bir aileyle ilişkilendirir. @tr
toolkit label: eserin kartograf ailesi @tr
toolkit definition: Bir kartografik eser yaratmaktan sorumlu bir aile. @tr

has cartographer person of work
status: Published
lexical alias: cartographerPersonOfWork.en
definition: Relates a work to a person who is responsible for creating a cartographic work.
toolkit label: cartographer person of work
toolkit definition: A person who is responsible for creating a cartographic work.
type: Property
domain: C10001
has element type: 2
sub property of: has creator person of work
sub property of: has cartographer agent of work
label: teoksen kartantekijä (henkilö) @fi
definition: Liittää teoksen henkilöön, joka on vastuussa kartografisen teoksen luomisesta. @fi
toolkit label: teoksen kartantekijä (henkilö) @fi
toolkit definition: Henkilö, joka on vastuussa kartografisen teoksen luomisesta. @fi
label: har kartograf for verk (person) @no
definition: Relaterer et verk til en person som er ansvarlig for et kartografisk verk. @no
toolkit label: kartograf for verk (person) @no
toolkit definition: En person som er ansvarlig for et kartografisk verk. @no
label: heeft cartograaf-persoon van werk @nl
definition: Relateert een werk aan een persoon die verantwoordelijk is voor het creëren van een cartografisch werk. @nl
toolkit label: cartograaf-persoon van werk @nl
toolkit definition: Een persoon die verantwoordelijk is voor het creëren van een cartografisch werk. @nl
label: له شخص رسام خرائط لعمل @ar
definition: يربط بين عمل وشخص مسئول عن إنشاء عمل خرائطي. @ar
toolkit label: شخص رسام خرائط لعمل @ar
toolkit definition: شخص مسئول عن إنشاء عمل خرائطي. @ar
label: té com a persona cartògrafa d’una obra @ca
definition: Relaciona una obra amb una persona que és responsable de la creació d’una obra cartogràfica. @ca
toolkit label: persona cartògrafa d’una obra @ca
toolkit definition: Persona que és responsable de la creació d’una obra cartogràfica. @ca
label: har person, som er kartograf for værk @da
definition: Relaterer et værk til en person, som er ansvarlig for et kartografisk værk. @da
toolkit label: person, som er kartograf for værk @da
toolkit definition: Person, som er ansvarlig for et kartografisk værk. @da
label: teose kartograaf (isik) @et
definition: Seostab teose isikuga, kes vastutab kartograafilise teose loomise eest. @et
toolkit label: teose kartograaf (isik) @et
toolkit definition: Isik, kes vastutab kartograafilise teose loomise eest. @et
label: hat Kartografin/Kartografen eines Werks (Person) @de
definition: Setzt ein Werk in Beziehung zu einer Person, die für die Schaffung eines kartografischen Werks verantwortlich ist. @de
toolkit label: Kartografin/Kartograf eines Werks (Person) @de
toolkit definition: Eine Person, die für die Schaffung eines kartografischen Werks verantwortlich ist. @de
label: mű térképész személye a következő: @hu
definition: Hozzákapcsol egy művet egy személyhez, aki felelős egy kartográfiai mű létrehozásáért. @hu
toolkit label: mű térképész személye: @hu
toolkit definition: Egy személy, aki felelős egy kartográfiai mű létrehozásáért. @hu
label: ha come cartografo persona di opera @it
definition: Correla un'opera alla persona responsabile di un'opera cartografica. @it
toolkit label: cartografo persona di opera @it
toolkit definition: Persona responsabile di un'opera cartografica. @it
label: a pour personne cartographe d’une œuvre @fr
definition: Met une œuvre en relation avec une personne qui est responsable de la création d’une œuvre cartographique. @fr
toolkit label: personne cartographe d’une œuvre @fr
toolkit definition: Personne qui est responsable de la création d’une œuvre cartographique. @fr
label: darba kartogrāfs (persona) @lv
definition: Sasaista darbu ar personu, kura ir atbildīga par karti, atlantu, globusu vai citu kartogrāfijas materiālu. @lv
toolkit label: darba kartogrāfs (persona) @lv
toolkit definition: Persona, kura ir atbildīga par karti, atlantu, globusu vai citu kartogrāfijas materiālu. @lv
label: 有作品的地图绘制者个人 @zh-hans
definition: 将一种作品与负责创建一种地图作品的一个个人关联起来。 @zh-hans
toolkit label: 作品的地图绘制者个人 @zh-hans
toolkit definition: 负责创建一种地图作品的一个个人 @zh-hans
has subproperty: P10435
label: eserin kartografı ile ilişkilidir @tr
definition: Bir eseri, bir kartografik eser oluşturmaktan sorumlu olan bir kişiyle ilişkilendirir. @tr
toolkit label: eserin kartografı @tr
toolkit definition: Bir kartografik eser yaratmaktan sorumlu kişi. @tr

has casting director agent
status: Published
sub property of: has creator agent of work
type: Property
lexical alias: castingDirectorAgent.en
definition: Relates a work to an agent who is responsible for most aspects of assigning parts and duties to performers.
domain: C10001
toolkit label: casting director agent
toolkit definition: An agent who is responsible for most aspects of assigning parts and duties to performers.
instruction number: 18.5
label: har agent, som er caster @da
definition: Relaterer et værk til en agent, som er ansvarlig for de fleste aspekter ved tildeling af roller og ansvar til udøvere. @da
toolkit label: agent, som er caster @da
toolkit definition: Agent, som er ansvarlig for de fleste aspekter ved tildeling af roller og ansvar til udøvere. @da
label: có giám đốc phân vai @vi
definition: Liên kết tác phẩm với tác nhân có trách nhiệm về phần lớn khía cạnh được gán cho phần hoặc nhiệm vụ của những người biểu diễn. @vi
toolkit label: giám đốc phân vai @vi
toolkit definition: Tác nhân có trách nhiệm về phần lớn khía cạnh được gán cho phần hoặc nhiệm vụ của những người biểu diễn. @vi
label: hat Casting Director (Akteur) @de
definition: Setzt ein Werk in Beziehung zu einem Akteur, der für die meisten Aspekte der Rollenvergabe und Aufgabenzuteilung an Ausführende verantwortlich ist. @de
toolkit label: Casting Director (Akteur) @de
toolkit definition: Ein Akteur, der für die meisten Aspekte der Rollenvergabe und Aufgabenzuteilung an Ausführende verantwortlich ist. @de
definition: Liittää teoksen toimijaan, joka on vastuussa useimmista esiintyjien roolien ja tehtävien antamiseen kuuluvista tehtävistä. @fi
toolkit label: roolittaja (toimija) @fi
toolkit definition: Toimija, joka on vastuussa useimmista esiintyjien roolien ja tehtävien antamiseen kuuluvista tehtävistä. @fi
toolkit label: casting director (agent) @no
toolkit definition: En agent som er ansvarlig for de fleste aspekter ved å fordele roller og oppgaver mellom utøvere. @no
label: té com a agent director de càsting @ca
definition: Relaciona una obra amb un agent que és responsable de la majoria dels aspectes de l’assignació de parts i funcions als intèrprets. @ca
toolkit label: agent director de càsting @ca
toolkit definition: Agent que és responsable de la majoria dels aspectes de l’assignació de parts i funcions als intèrprets. @ca
label: a pour agent directeur de casting @fr
definition: Met une œuvre en relation avec un agent qui est responsable de la majeure partie des aspects relatifs à la distribution des rôles et des fonctions aux interprètes. @fr
toolkit label: agent directeur de casting @fr
toolkit definition: Agent qui est responsable de la majeure partie des aspects relatifs à la distribution des rôles et des fonctions aux interprètes. @fr
has element type: 2
label: έχει υπεύθυνο διανομής ρόλων @el
definition: Συνδέει ένα έργο με έναν φορέα υπεύθυνο για τις περισσότερες πτυχές της κατανομής ρόλων και αρμοδιοτήτων στους εκτελεστές. @el
toolkit label: υπεύθυνος διανομής ρόλων @el
toolkit definition: Ένας φορέας υπεύθυνος για τις περισσότερες πτυχές της κατανομής ρόλων και αρμοδιοτήτων στους εκτελεστές. @el
label: szereposztó rendező ágense a következő: @hu
definition: Hozzákapcsol egy művet egy ágenshez, amely felelős a szerepek és feladatok előadókra osztásának legtöbb vonatkozásáért. @hu
toolkit label: szereposztó rendező ágens: @hu
toolkit definition: Egy ágens, amely felelős a szereposztás és feladatok előadókra osztásának legtöbb vonatkozásáért. @hu
alternative label: casting director
alternative label: roolittaja @fi
label: roolittaja (toimija) @fi
label: har casting director (agent) @no
definition: Relaterer et verk til en agent som er ansvarlig for de fleste aspekter ved å fordele roller og oppgaver mellom utøvere. @no
label: heeft castingdirector-actor @nl
definition: Relateert een werk aan een actor die verantwoordelijk is voor de meeste aspecten van het toewijzen van rollen en taken aan uitvoerders. @nl
toolkit label: castingdirector-actor @nl
toolkit definition: Een actor die verantwoordelijk is voor de meeste aspecten van het toewijzen van rollen en taken aan uitvoerders. @nl
label: له وكيل مدير طاقم تمثيل @ar
definition: يربط بين عمل ووكيل مسئول عن معظم جوانب تخصيص الأدوار والواجبات للمؤدين. @ar
alternative label: مدير طاقم تمثيل @ar
toolkit label: وكيل مدير طاقم تمثيل @ar
toolkit definition: وكيل مسئول عن معظم جوانب تحديد الأدوار والواجبات للمؤدين. @ar
alternative label: director de càsting @ca
label: casting'u juht (tegija) @et
definition: Seostab teose tegijaga, kes vastutab enamiku aspektide eest esitajatele rollide ja ülesannete jagamisel. @et
alternative label: casting'u juht @et
toolkit label: casting'u juht (tegija) @et
toolkit definition: Tegija, kes vastutab enamiku aspektide eest esitajatele rollide ja ülesannete jagamisel. @et
alternative label: szereposztó rendező: @hu
label: ha come direttore del casting agente @it
definition: Correla un’opera a un agente responsabile per la maggior parte degli aspetti della assegnazione di parti e compiti agli interpreti. @it
alternative label: direttore del casting @it
toolkit label: direttore del casting agente @it
toolkit definition: Agente responsabile per la maggior parte degli aspetti della assegnazione di parti e compiti agli interpreti. @it
alternative label: directeur de casting @fr
label: aktieru atlases režisors (aģents) @lv
definition: Sasaista darbu ar aģentu, kas ir atbildīgs par lomu sadali un pienākumu piešķiršanu izpildītājiem. @lv
toolkit label: aktieru atlases režisors (aģents) @lv
toolkit definition: Aģents, kas ir atbildīgs par lomu sadali un pienākumu piešķiršanu izpildītājiem. @lv
alternative label: Casting Director @de
alternative label: 角色导演 @zh-hans
label: 有角色导演行为者 @zh-hans
toolkit label: 角色导演行为者 @zh-hans
toolkit definition: 负责给演员分配角色和任务的大多数工作的一个行为者 @zh-hans
has subproperty: has casting director collective agent

has casting director collective agent
status: Published
lexical alias: castingDirectorCollectiveAgent.en
definition: Relates a work to a collective agent who is responsible for most aspects of assigning parts and duties to performers.
toolkit label: casting director collective agent
toolkit definition: A collective agent who is responsible for most aspects of assigning parts and duties to performers.
type: Property
domain: C10001
has element type: 2
sub property of: has creator collective agent of work
sub property of: has casting director agent
label: roolittaja (yhteistoimija) @fi
definition: Liittää teoksen yhteistoimijaan, joka on vastuussa useimmista esiintyjien roolien ja tehtävien antamiseen kuuluvista tehtävistä. @fi
toolkit label: roolittaja (yhteistoimija) @fi
toolkit definition: Yhteistoimija, joka on vastuussa useimmista esiintyjien roolien ja tehtävien antamiseen kuuluvista tehtävistä. @fi
label: har casting director (kollektivt verk) @no
definition: Relaterer et verk til en kollektiv agent som er ansvarlig for de fleste aspekter ved å fordele roller og oppgaver mellom utøvere. @no
toolkit label: casting director (kollektivt verk) @no
toolkit definition: En kollektiv agent som er ansvarlig for de fleste aspekter ved å fordele roller og oppgaver mellom utøvere. @no
label: heeft castingdirector-collectieve actor @nl
definition: Relateert een werk aan een collectieve actor die verantwoordelijk is voor de meeste aspecten van het toewijzen van rollen en taken aan uitvoerders. @nl
toolkit label: castingdirector-collectieve actor @nl
toolkit definition: Een collectieve actor die verantwoordelijk is voor de meeste aspecten van het toewijzen van rollen en taken aan uitvoerders. @nl
label: له وكيل جماعي مدير طاقم تمثيل @ar
definition: يربط بين عمل ووكيل جماعي مسئول عن معظم جوانب تخصيص الأدوار والواجبات للمؤدين. @ar
toolkit label: وكيل جماعي مدير طاقم تمثيل @ar
toolkit definition: وكيل جماعي مسئول عن معظم جوانب تخصيص الأدوار والواجبات للمؤدين. @ar
label: té com a agent col·lectiu director de càsting @ca
definition: Relaciona una obra amb un agent col·lectiu que és responsable de la majoria dels aspectes de l’assignació de parts i funcions als intèrprets. @ca
toolkit label: agent col·lectiu director de càsting @ca
toolkit definition: Agent col·lectiu que és responsable de la majoria dels aspectes de l’assignació de parts i funcions als intèrprets. @ca
label: har kollektiv agent, som er caster @da
definition: Relaterer et værk til en kollektiv agent, som er ansvarlig for de fleste aspekter ved tildeling af roller og ansvar til udøvere. @da
toolkit label: kollektiv agent, som er caster @da
toolkit definition: Kollektiv agent, som er ansvarlig for de fleste aspekter ved tildeling af roller og ansvar til udøvere. @da
label: casting'u juht (kollektiiv) @et
definition: Seostab teose kollektiiviga, kes vastutab enamiku aspektide eest esitajatele rollide ja ülesannete jagamisel. @et
toolkit label: casting'u juht (kollektiiv) @et
toolkit definition: Kollektiiv, kes vastutab enamiku aspektide eest esitajatele rollide ja ülesannete jagamisel. @et
label: hat Casting Director (Gemeinschaftlicher Akteur) @de
definition: Setzt ein Werk in Beziehung zu einem gemeinschaftlichen Akteur, der für die meisten Aspekte der Rollenvergabe und Aufgabenzuteilung an Ausführende verantwortlich ist. @de
toolkit label: Casting Director (Gemeinschaftlicher Akteur) @de
toolkit definition: Ein gemeinschaftlicher Akteur, der für die meisten Aspekte der Rollenvergabe und Aufgabenzuteilung an Ausführende verantwortlich ist. @de
label: szereposztó rendező kollektív ágense a következő: @hu
definition: Hozzákapcsol egy művet egy kollektív ágenshez, amely felelős a szerepek és feladatok előadókra osztásának legtöbb vonatkozásáért. @hu
toolkit label: szereposztó rendező kollektív ágens: @hu
toolkit definition: Egy kollektív ágens, amely felelős a szerepek és feladatok előadókra osztásának legtöbb vonatkozásáért. @hu
label: ha come direttore del casting agente collettivo @it
definition: Correla un'opera all'agente collettivo responsabile della maggior parte degli aspetti relativi all'assegnazione agli interpreti di parti e compiti. @it
toolkit label: direttore del casting agente collettivo @it
toolkit definition: Agente collettivo responsabile della maggior parte degli aspetti relativi all'assegnazione agli interpreti di parti e compiti. @it
label: a pour agent collectif directeur de casting @fr
definition: Met une œuvre en relation avec un agent collectif qui est responsable de la majeure partie des aspects relatifs à la distribution des rôles et des fonctions aux interprètes. @fr
toolkit label: agent collectif directeur de casting @fr
toolkit definition: Agent collectif qui est responsable de la majeure partie des aspects relatifs à la distribution des rôles et des fonctions aux interprètes. @fr
label: aktieru atlases režisors (grupa) @lv
definition: Sasaista darbu ar grupu, kas ir atbildīga par lomu sadali un pienākumu piešķiršanu izpildītājiem. @lv
toolkit label: aktieru atlases režisors (grupa) @lv
toolkit definition: Grupa, kas ir atbildīga par lomu sadali un pienākumu piešķiršanu izpildītājiem. @lv
label: 有角色导演集体行为者 @zh-hans
definition: 将一种作品与负责给演员分配角色和任务的大多数工作的一个集体行为者关联起来。 @zh-hans
toolkit label: 角色导演集体行为者 @zh-hans
toolkit definition: 负责给演员分配角色和任务的大多数工作的一个集体行为者 @zh-hans
has subproperty: has casting director corporate body
has subproperty: has casting director family
has subproperty: P10500
label: kast yönetmeni kolektif temsilcisi ile ilişkilidir @tr
definition: Bir eseri, sanatçılara rol ve görev verilmesinin çoğu yönünden sorumlu olan kolektif bir temsilci ile ilişkilendirir. @tr
toolkit label: kast yönetmeni kolektif temsilcisi @tr
toolkit definition: Oyunculara rol ve görev atamanın çoğu yönünden sorumlu olan kolektif bir temsilci. @tr

has casting director corporate body
status: Published
lexical alias: castingDirectorCorporateBody.en
definition: Relates a work to a corporate body who is responsible for most aspects of assigning parts and duties to performers.
toolkit label: casting director corporate body
toolkit definition: A corporate body who is responsible for most aspects of assigning parts and duties to performers.
type: Property
domain: C10001
has element type: 2
sub property of: has creator corporate body of work
sub property of: has casting director collective agent
label: roolittaja (yhteisö) @fi
definition: Liittää teoksen yhteisöön, joka on vastuussa useimmista esiintyjien roolien ja tehtävien antamiseen kuuluvista tehtävistä. @fi
toolkit label: roolittaja (yhteisö) @fi
toolkit definition: Yhteisö, joka on vastuussa useimmista esiintyjien roolien ja tehtävien antamiseen kuuluvista tehtävistä. @fi
label: har casting director (korporasjon) @no
definition: Relaterer et verk til en korporasjon som er ansvarlig for de fleste aspekter ved å fordele roller og oppgaver mellom utøvere. @no
toolkit label: casting director (korporasjon) @no
toolkit definition: En korporasjon som er ansvarlig for de fleste aspekter ved å fordele roller og oppgaver mellom utøvere. @no
label: heeft castingdirector-corporatie @nl
definition: Relateert een werk aan een corporatie die verantwoordelijk is voor de meeste aspecten van het toewijzen van rollen en taken aan uitvoerders. @nl
toolkit label: castingdirector-corporatie @nl
toolkit definition: Een corporatie die verantwoordelijk is voor de meeste aspecten van het toewijzen van rollen en taken aan uitvoerders. @nl
label: له هيئة مديرة طاقم تمثيل @ar
definition: يربط بين عمل وهيئة مسئولة عن معظم جوانب تخصيص الأدوار والواجبات للمؤدين. @ar
toolkit label: هيئة مديرة طاقم تمثيل @ar
toolkit definition: هيئة مسئولة عن معظم جوانب تخصيص الأدوار والواجبات للمؤدين. @ar
label: té com a entitat corporativa directora de càsting @ca
definition: Relaciona una obra amb una entitat corporativa que és responsable de la majoria dels aspectes de l’assignació de parts i funcions als intèrprets. @ca
toolkit label: entitat corporativa directora de càsting @ca
toolkit definition: Entitat corporativa que és responsable de la majoria dels aspectes de l’assignació de parts i funcions als intèrprets. @ca
label: har korporation, som er caster @da
definition: Relaterer et værk til en korporation, som er ansvarlig for de fleste aspekter ved tildeling af roller og ansvar til udøvere. @da
toolkit label: korporation, som er caster @da
toolkit definition: Korporation, som er ansvarlig for de fleste aspekter ved tildeling af roller og ansvar til udøvere. @da
label: casting'u juht (asutus) @et
definition: Seostab teose asutusega, kes vastutab enamiku aspektide eest esitajatele rollide ja ülesannete jagamisel. @et
toolkit label: casting'u juht (asutus) @et
toolkit definition: Asutus, kes vastutab enamiku aspektide eest esitajatele rollide ja ülesannete jagamisel. @et
label: hat Casting Director (Körperschaft) @de
definition: Setzt ein Werk in Beziehung zu einer Körperschaft, die für die meisten Aspekte der Rollenvergabe und Aufgabenzuteilung an Ausführende verantwortlich ist. @de
toolkit label: Casting Director (Körperschaft) @de
toolkit definition: Eine Körperschaft, die für die meisten Aspekte der Rollenvergabe und Aufgabenzuteilung an Ausführende verantwortlich ist. @de
label: szereposztó rendező testülete a következő: @hu
definition: Hozzákapcsol egy művet egy testülethez, amely felelős a szerepek és feladatok előadókra osztásának legtöbb vonatkozásáért. @hu
toolkit label: szereposztó rendező testület: @hu
toolkit definition: Egy testület, amely felelős a szerepek és feladatok előadókra osztásának legtöbb vonatkozásáért. @hu
label: ha come direttore del casting ente @it
definition: Correla un'opera a un ente responsabile della maggior parte degli aspetti relativi all'assegnazione agli interpreti di parti e compiti. @it
toolkit label: direttore del casting ente @it
toolkit definition: Ente responsabile della maggior parte degli aspetti relativi all'assegnazione agli interpreti di parti e compiti. @it
label: a pour collectivité directrice de casting @fr
definition: Met une œuvre en relation avec une collectivité qui est responsable de la majeure partie des aspects relatifs à la distribution des rôles et des fonctions aux interprètes. @fr
toolkit label: collectivité directrice de casting @fr
toolkit definition: Collectivité qui est responsable de la majeure partie des aspects relatifs à la distribution des rôles et des fonctions aux interprètes. @fr
label: aktieru atlases režisors (institūcija) @lv
definition: Sasaista darbu ar institūciju, kas ir atbildīga par lomu sadali un pienākumu piešķiršanu izpildītājiem. @lv
toolkit label: aktieru atlases režisors (institūcija) @lv
toolkit definition: Institūcija, kas ir atbildīga par lomu sadali un pienākumu piešķiršanu izpildītājiem. @lv
label: 有角色导演团体 @zh-hans
definition: 将一种作品与负责给演员分配角色和任务的大多数工作的一个团体关联起来。 @zh-hans
toolkit label: 角色导演团体 @zh-hans
toolkit definition: 负责给演员分配角色和任务的大多数工作的一个团体 @zh-hans
has subproperty: P10547
label: kast yönetmeni tüzel kişisi ile ilişkilidir @tr
definition: Bir eseri, sanatçılara rol ve görev atamanın çoğu yönünden sorumlu olan tüzel kişi ile ilişkilendirir. @tr
toolkit label: kast yönetmeni tüzel kişisi @tr
toolkit definition: Sanatçılara rol ve görev atamanın çoğu yönünden sorumlu olan bir tüzel kişilik. @tr

has casting director family
status: Published
lexical alias: castingDirectorFamily.en
definition: Relates a work to a family who is responsible for most aspects of assigning parts and duties to performers.
toolkit label: casting director family
toolkit definition: A family who is responsible for most aspects of assigning parts and duties to performers.
type: Property
domain: C10001
has element type: 2
sub property of: has creator family of work
sub property of: has casting director collective agent
label: roolittaja (suku) @fi
definition: Liittää teoksen sukuun, joka on vastuussa useimmista esiintyjien roolien ja tehtävien antamiseen kuuluvista tehtävistä. @fi
toolkit label: roolittaja (suku) @fi
toolkit definition: Suku, joka on vastuussa useimmista esiintyjien roolien ja tehtävien antamiseen kuuluvista tehtävistä. @fi
label: har casting director (familie) @no
definition: Relaterer et verk til en familie som er ansvarlig for de fleste aspekter ved å fordele roller og oppgaver mellom utøvere. @no
toolkit label: casting director (familie) @no
toolkit definition: En familie som er ansvarlig for de fleste aspekter ved å fordele roller og oppgaver mellom utøvere. @no
label: heeft castingdirector-familie @nl
definition: Relateert een werk aan een familie die verantwoordelijk is voor de meeste aspecten van het toewijzen van rollen en taken aan uitvoerders. @nl
toolkit label: castingdirector-familie @nl
toolkit definition: Een familie die verantwoordelijk is voor de meeste aspecten van het toewijzen van rollen en taken aan uitvoerders. @nl
label: له عائلة مديرة طاقم تمثيل @ar
definition: يربط بين عمل وعائلة مسئولة عن معظم جوانب تخصيص الأدوار والواجبات للمؤدين. @ar
toolkit label: عائلة مديرة طاقم تمثيل @ar
toolkit definition: عائلة مسئولة عن معظم جوانب تخصيص الأدوار والواجبات للمؤدين. @ar
label: té com a família directora de càsting @ca
definition: Relaciona una obra amb una família que és responsable de la majoria dels aspectes de l’assignació de parts i funcions als intèrprets. @ca
toolkit label: família directora de càsting @ca
toolkit definition: Família que és responsable de la majoria dels aspectes de l’assignació de parts i funcions als intèrprets. @ca
label: har familie, som er caster @da
definition: Relaterer et værk til en familie, som er ansvarlig for de fleste aspekter ved tildeling af roller og ansvar til udøvere. @da
toolkit label: familie, som er caster @da
toolkit definition: Familie, som er ansvarlig for de fleste aspekter ved tildeling af roller og ansvar til udøvere. @da
label: casting'u juht (perekond) @et
definition: Seostab teose perekonnaga, kes vastutab enamiku aspektide eest esitajatele rollide ja ülesannete jagamisel. @et
toolkit label: casting'u juht (perekond) @et
toolkit definition: Perekond, kes vastutab enamiku aspektide eest esitajatele rollide ja ülesannete jagamisel. @et
label: hat Casting Director (Familie) @de
definition: Setzt ein Werk in Beziehung zu einer Familie, die für die meisten Aspekte der Rollenvergabe und Aufgabenzuteilung an Ausführende verantwortlich ist. @de
toolkit label: Casting Director (Familie) @de
toolkit definition: Eine Familie, die für die meisten Aspekte der Rollenvergabe und Aufgabenzuteilung an Ausführende verantwortlich ist. @de
label: szereposztó rendező családja a következő: @hu
definition: Hozzákapcsol egy művet egy családhoz, amely felelős a szerepek és feladatok előadókra osztásának legtöbb vonatkozásáért. @hu
toolkit label: szereposztó rendező család: @hu
toolkit definition: Egy család, amely felelős a szerepek és feladatok előadókra osztásának legtöbb vonatkozásáért. @hu
label: ha come direttore del casting famiglia @it
definition: Correla un'opera alla famiglia responsabile della maggior parte degli aspetti relativi all'assegnazione agli interpreti di parti e compiti. @it
toolkit label: direttore del casting famiglia @it
toolkit definition: Famiglia responsabile della maggior parte degli aspetti relativi all'assegnazione agli interpreti di parti e compiti. @it
label: a pour famille directrice de casting @fr
definition: Met une œuvre en relation avec une famille qui est responsable de la majeure partie des aspects relatifs à la distribution des rôles et des fonctions aux interprètes. @fr
toolkit label: famille directrice de casting @fr
toolkit definition: Famille qui est responsable de la majeure partie des aspects relatifs à la distribution des rôles et des fonctions aux interprètes. @fr
label: aktieru atlases režisors (dzimta/ģimene) @lv
definition: Sasaista darbu ar dzimtu/ģimeni, kas ir atbildīga par lomu sadali un pienākumu piešķiršanu izpildītājiem. @lv
toolkit label: aktieru atlases režisors (dzimta/ģimene) @lv
toolkit definition: Dzimta/ģimene, kas ir atbildīga par lomu sadali un pienākumu piešķiršanu izpildītājiem. @lv
label: 有角色导演家族 @zh-hans
definition: 将一种作品与负责给演员分配角色和任务的大多数工作的一个家族关联起来。 @zh-hans
toolkit label: 角色导演家族 @zh-hans
toolkit definition: 负责给演员分配角色和任务的大多数工作的一个家族 @zh-hans
has subproperty: P10594
label: kast yönetmeni ailesi ile ilişkilidir @tr
definition: Bir eseri, sanatçılara rol ve görev atamanın çoğu yönünden sorumlu olan bir aile ile ilişkilendirir. @tr
toolkit label: kast yönetmeni ailesi @tr
toolkit definition: Oyunculara rol ve görev atamanın çoğu yönünden sorumlu olan bir aile. @tr

has casting director person
status: Published
lexical alias: castingDirectorPerson.en
definition: Relates a work to a person who is responsible for most aspects of assigning parts and duties to performers.
toolkit label: casting director person
toolkit definition: A person who is responsible for most aspects of assigning parts and duties to performers.
type: Property
domain: C10001
has element type: 2
sub property of: has creator person of work
sub property of: has casting director agent
label: roolittaja (henkilö) @fi
definition: Liittää teoksen henkilöön, joka on vastuussa useimmista esiintyjien roolien ja tehtävien antamiseen kuuluvista tehtävistä. @fi
toolkit label: roolittaja (henkilö) @fi
toolkit definition: Henkilö, joka on vastuussa useimmista esiintyjien roolien ja tehtävien antamiseen kuuluvista tehtävistä. @fi
label: har casting director (person) @no
definition: Relaterer et verk til en person som er ansvarlig for de fleste aspekter ved å fordele roller og oppgaver mellom utøvere. @no
toolkit label: casting director (person) @no
toolkit definition: En person som er ansvarlig for de fleste aspekter ved å fordele roller og oppgaver mellom utøvere. @no
label: heeft castingdirector-persoon @nl
definition: Relateert een werk aan een persoon die verantwoordelijk is voor de meeste aspecten van het toewijzen van rollen en taken aan uitvoerders. @nl
toolkit label: castingdirector-persoon @nl
toolkit definition: Een persoon die verantwoordelijk is voor de meeste aspecten van het toewijzen van rollen en taken aan uitvoerders. @nl
label: له شخص مدير طاقم تمثيل @ar
definition: يربط بين عمل وشخص مسئول عن معظم جوانب تخصيص الأدوار والواجبات للمؤدين. @ar
toolkit label: شخص مدير طاقم تمثيل @ar
toolkit definition: شخص يكون مسئولاً عن معظم جوانب تخصيص الأدوار والواجبات للمؤدين. @ar
label: té com a persona directora de càsting @ca
definition: Relaciona una obra amb una persona que és responsable de la majoria dels aspectes de l’assignació de parts i funcions als intèrprets. @ca
toolkit label: persona directora de càsting @ca
toolkit definition: Persona que és responsable de la majoria dels aspectes de l’assignació de parts i funcions als intèrprets. @ca
label: har person, som er caster @da
definition: Relaterer et værk til en person, som er ansvarlig for de fleste aspekter ved tildeling af roller og ansvar til udøvere. @da
toolkit label: person, som er caster @da
toolkit definition: Person, som er ansvarlig for de fleste aspekter ved tildeling af roller og ansvar til udøvere. @da
label: casting'u juht (isik) @et
definition: Seostab teose isikuga, kes vastutab enamiku aspektide eest esitajatele rollide ja ülesannete jagamisel. @et
toolkit label: casting'u juht (isik) @et
toolkit definition: Isik, kes vastutab enamiku aspektide eest esitajatele rollide ja ülesannete jagamisel. @et
label: hat Casting Director (Person) @de
definition: Setzt ein Werk in Beziehung zu einer Person, die für die meisten Aspekte der Rollenvergabe und Aufgabenzuteilung an Ausführende verantwortlich ist. @de
toolkit label: Casting Director (Person) @de
toolkit definition: Eine Person, die für die meisten Aspekte der Rollenvergabe und Aufgabenzuteilung an Ausführende verantwortlich ist. @de
label: szereposztó rendező személye a következő: @hu
definition: Hozzákapcsol egy művet egy személyhez, aki felelős a szerepek és feladatok előadókra osztásának legtöbb vonatkozásáért. @hu
toolkit label: szereposztó rendező személy: @hu
toolkit definition: Egy személy, aki felelős a szereposztás és feladatok előadókra osztásának legtöbb vonatkozásáért. @hu
label: ha come direttore del casting persona @it
definition: Correla un'opera alla persona responsabile della maggior parte degli aspetti relativi all'assegnazione di parti e compiti agli interpreti. @it
toolkit label: direttore del casting persona @it
toolkit definition: Persona responsabile della maggior parte degli aspetti relativi all'assegnazione di parti e compiti agli interpreti. @it
label: a pour personne directrice de casting @fr
definition: Met une œuvre en relation avec une personne qui est responsable de la majeure partie des aspects relatifs à la distribution des rôles et des fonctions aux interprètes. @fr
toolkit label: personne directrice de casting @fr
toolkit definition: Personne qui est responsable de la majeure partie des aspects relatifs à la distribution des rôles et des fonctions aux interprètes. @fr
label: aktieru atlases režisors (persona) @lv
definition: Sasaista darbu ar personu, kura ir atbildīga par lomu sadali un pienākumu piešķiršanu izpildītājiem. @lv
toolkit label: aktieru atlases režisors (persona) @lv
toolkit definition: Persona, kura ir atbildīga par lomu sadali un pienākumu piešķiršanu izpildītājiem. @lv
label: 有角色导演个人 @zh-hans
definition: 将一种资源与负责给演员分配角色和任务的大多数工作的一个个人关联起来。 @zh-hans
toolkit label: 角色导演个人 @zh-hans
toolkit definition: 负责给演员分配角色和任务的大多数工作的一个个人 @zh-hans
has subproperty: P10453
label: kast yönetmeni ile ilişkilidir @tr
definition: Bir eseri, sanatçılara rol ve görev atamanın çoğu yönünden sorumlu olan bir kişiyle ilişkilendirir. @tr
toolkit label: kast yönetmeni @tr
toolkit definition: Sanatçılara rol ve görev atamanın çoğu yönünden sorumlu olan kişi. @tr

has category of work
status: Published
definition: Relates a work to a type to which a work belongs.
type: Property
domain: C10001
lexical alias: categoryOfWork.en
instruction number: 6.3
toolkit label: category of work
toolkit definition: A type to which a work belongs.
toolkit label: catégorie d’œuvre @fr
toolkit definition: Type auquel une œuvre appartient. @fr
toolkit label: forma de la obra @es
toolkit definition: Una clase o género al cual pertenece una obra. @es
label: har verkets form @sv
toolkit label: verkets form @sv
label: har kategori af værk @da
definition: Relaterer et værk til en type, som et værk tilhører. @da
toolkit label: kategori af værk @da
toolkit definition: Type, som et værk tilhører. @da
definition: Met une œuvre en relation avec un type auquel une œuvre appartient. @fr
label: có hình thái của tác phẩm @vi
definition: Liên kết tác phẩm với lớp hoặc loại mà tác phẩm thuộc vào. @vi
toolkit label: hình thái của tác phẩm @vi
toolkit definition: Lớp hoặc loại mà tác phẩm thuộc vào. @vi
label: hat Kategorie eines Werks @de
definition: Setzt ein Werk in Beziehung zu einer Art, zu der ein Werk gehört. @de
toolkit label: Kategorie eines Werks @de
toolkit definition: Eine Art, zu der ein Werk gehört. @de
label: a pour catégorie d’œuvre @fr
definition: Liittää teoksen tyyppiin, johon teos kuuluu. @fi
toolkit label: teoksen kategoria @fi
toolkit definition: Tyyppi, johon teos kuuluu. @fi
toolkit label: kategori av verk @no
toolkit definition: En type som verket tilhører. @no
label: té com a categoria d’obra @ca
definition: Relaciona una obra amb un tipus al qual pertany una obra. @ca
toolkit label: categoria d’obra @ca
toolkit definition: Tipus al qual pertany una obra. @ca
has element type: 5
label: έχει μορφή του έργου @el
definition: Συνδέει ένα έργο με μια τάξη ή ένα είδος στο οποίο ανήκει ένα έργο. @el
toolkit label: μορφή του έργου @el
toolkit definition: Μια τάξη ή ένα είδος στο οποίο ανήκει ένα έργο. @el
label: műformája a következő: @hu
definition: Egy művet hozzákapcsol egy típushoz, amelyhez a mű tartozik. @hu
toolkit label: műkategória @hu
toolkit definition: Egy típus, amelyhez egy mű tartozik. @hu
scope note: Includes a class or genre.
alternative label: form of work
sub property of: P00029
scope note: Kattaa luokan tai genren. @fi
alternative label: teoksen muoto @fi
label: teoksen kategoria @fi
label: har kategori av verk @no
definition: Relaterer et verk til en type som verket tilhører. @no
scope note: Inkluderer en klasse eller sjanger. @no
alternative label: verkets form @no
label: heeft categorie van werk @nl
definition: Relateert een werk aan een type waartoe een werk behoort. @nl
scope note: Omvat een klasse of genre. @nl
toolkit label: categorie van werk @nl
toolkit definition: Een type waartoe een werk behoort. @nl
label: له فئة لعمل @ar
definition: يربط بين عمل ونوع ينتمي إليه عمل. @ar
scope note: يتضمن فئة أو شكل أدبي. @ar
alternative label: شكل عمل @ar
toolkit label: فئة لعمل @ar
toolkit definition: نوع ينتمي إليه عمل. @ar
scope note: Inclou una classe o un gènere. @ca
alternative label: forma d’obra @ca
scope note: Omfatter en klasse eller genre @da
alternative label: værkets form @da
label: teose kategooria @et
definition: Seostab teose tüübiga, millesse teos kuulub. @et
scope note: Hõlmab liiki ja žanri. @et
alternative label: teose vorm @et
toolkit label: teose kategooria @et
toolkit definition: Tüüp, millesse teos kuulub. @et
scope note: Darunter fallen Klassen oder Genres. @de
alternative label: Form eines Werks @de

has intended audience of representative expression
status: Published
definition: Relates a work to a category of user for whom a representative expression of a work is intended, or for whom a representative expression of a work is considered suitable.
type: Property
domain: C10001
lexical alias: intendedAudienceOfRepresentativeExpression.en
instruction number: 7.7
toolkit label: intended audience of representative expression
toolkit definition: A category of user for whom a representative expression of a work is intended, or for whom a representative expression of a work is considered suitable.
toolkit label: public cible d’une expression représentative @fr
toolkit definition: Classe d’utilisateurs à laquelle une expression représentative d’une œuvre est destinée ou supposée convenir. @fr
toolkit label: audiencia prevista @es
toolkit definition: La clase de usuario a la cual va dirigido el contenido de un recurso, o para quienes el contenido se considera apropiado. @es
label: har målgrupp @sv
toolkit label: målgrupp @sv
label: har tiltænkt målgruppe for repræsentativt udtryk @da
definition: Relaterer et værk til en brugerkategori, som et værks repræsentative udtryks indhold er målrettet, eller for hvilken indholdet i det repræsentative udtryk anses passende. @da
toolkit label: tiltænkt målgruppe for repræsentativt udtryk @da
toolkit definition: Brugerkategori, som et værks repræsentative udtryks indhold er målrettet, eller for hvilken indholdet i det repræsentative udtryk anses passende. @da
definition: Met une œuvre en relation avec une classe d’utilisateurs à laquelle une expression représentative d’une œuvre est destinée ou supposée convenir. @fr
label: có khán giả dự kiến @vi
definition: Liên kết tác phẩm với chia loại của ngườ dùng mà nội dung của tác phẩm hướng tới, hoặc những người mà nội dung đó được xem là phù hợp. @vi
toolkit label: khán giả dự kiến @vi
toolkit definition: Chia loại của ngườ dùng mà nội dung của tác phẩm hướng tới, hoặc những người mà nội dung đó được xem là phù hợp. @vi
label: hat Zielgruppe einer repräsentativen Expression @de
definition: Setzt ein Werk in Beziehung zu einer Gruppe von Benutzenden, für die eine repräsentative Expression eines Werks gedacht ist oder für die eine repräsentative Expression eines Werks als passend angesehen wird. @de
toolkit label: Zielgruppe einer repräsentativen Expression @de
toolkit definition: Eine Gruppe von Benutzenden, für die eine repräsentative Expression eines Werks gedacht ist oder für die eine repräsentative Expression eines Werks als passend angesehen wird. @de
label: a pour public cible d’une expression représentative @fr
definition: Liittää teoksen käyttäjäryhmään, jolle teoksen edustava ekspressio on tarkoitettu tai jolle teoksen edustavan ekspression katsotaan sopivan. @fi
toolkit label: edustavan ekspression kohderyhmä @fi
toolkit definition: Käyttäjäryhmä, jolle teoksen edustava ekspressio on tarkoitettu tai jolle teoksen edustavan ekspression katsotaan sopivan. @fi
toolkit label: målgruppe for et representativt uttrykk @no
toolkit definition: En brukerkategori som innholdet i et representativt uttrykk er beregnet for eller blir ansett som passende for. @no
label: té com a destinataris previstos d’una expressió representativa @ca
definition: Relaciona una obra amb una categoria d’usuaris als quals va destinada una expressió representativa d’una obra o per als quals es considera adequada una expressió representativa d’una obra. @ca
toolkit label: destinataris previstos d’una expressió representativa @ca
toolkit definition: Categoria d’usuaris als quals va destinada una expressió representativa d’una obra o per als quals es considera adequada una expressió representativa d’una obra. @ca
has element type: 5
label: έχει επιδιωκόμενο κοινό @el
definition: Συνδέει ένα έργο με μια κατηγορία του χρήστη για την οποία προορίζεται το περιεχόμενο ενός έργου ή για την οποία θεωρείται κατάλληλο το περιεχόμενο. @el
toolkit label: επιδιωκόμενο κοινό @el
toolkit definition: Μια κατηγορία του χρήστη για την οποία προορίζεται το περιεχόμενο ενός έργου ή για την οποία θεωρείται κατάλληλο το περιεχόμενο. @el
label: reprezentatív kifejezési forma célközönsége a következő: @hu
definition: Hozzákapcsol egy művet egy használói kategóriához, amelynek egy reprezentatív kifejezési formájának tartalmát szánták, vagy amelynek ezt a tartalmat alkalmasnak tekintik. @hu
toolkit label: reprezentatív kifejezési formához tartozó célközönség @hu
toolkit definition: Egy használói kategória, amelynek egy reprezentatív kifejezési formájának tartalmát szánták, vagy amelynek ezt a tartalmat alkalmasnak tekintik. @hu
alternative label: intended audience
label: edustavan ekspression kohderyhmä @fi
label: har målgruppe for et representativt uttrykk @no
definition: Relaterer et verk til en brukerkategori som innholdet i et representativt uttrykk er beregnet for eller blir ansett som passende for. @no
label: heeft beoogde doelgroep van representatieve expressie @nl
definition: Relateert een werk aan een categorie van gebruiker voor wie een representatieve expressie van een werk bedoeld is, of voor wie een representatieve expressie van een werk geschikt geacht wordt. @nl
toolkit label: beoogde doelgroep van representatieve expressie @nl
toolkit definition: Een categorie van gebruiker voor wie een representatieve expressie van een werk bedoeld is, of voor wie een representatieve expressie van een werk geschikt geacht wordt. @nl
alternative label: kohderyhmä @fi
label: له جمهور مستهدف لتعبيرة ممثِلة @ar
definition: يربط بين عمل وفئة من المستخدمين المقصود بها تعبيرة ممثِلة لعمل، أو تُعد التعبيرة الممثِلة للعمل مناسبة لهم. @ar
toolkit label: جمهور مستهدف لتعبيرة ممثِلة @ar
toolkit definition: فئة من المستخدمين المقصود بها تعبيرة ممثِلة لعمل، أو تُعد التعبيرة الممثِلة للعمل مناسبة لهم. @ar
label: iseloomuliku väljenduse sihtrühm @et
definition: Seostab teose kasutajarühmaga, kellele teose iseloomulik väljendus on mõeldud või kellele see on arvatavasti kohane. @et
toolkit label: iseloomuliku väljenduse sihtrühm @et
toolkit definition: Kasutajarühm, kellele teose iseloomulik väljendus on mõeldud või kellele see on arvatavasti kohane. @et
label: ha come destinatari presunti di espressione rappresentativa @it
definition: Correla un’opera a una categoria di utenti per cui un’espressione rappresentativa di un’opera è destinata o per cui è ritenuta adatta. @it
toolkit label: destinatari presunti di espressione rappresentativa @it
toolkit definition: Categoria di utenti per cui un’espressione rappresentativa di un’opera è destinata o per cui è ritenuta adatta. @it
label: reprezentatīvās izteiksmes mērķauditorija @lv
definition: Sasaista darbu ar lietotāju kategoriju, kurai ir paredzēta darba raksturīga izteiksme, vai kurai darba raksturīgā izteiksme uzskatāma par piemērotu. @lv
toolkit label: reprezentatīvās izteiksmes mērķauditorija @lv
toolkit definition: Lietotāju kategorija, kurai ir paredzēta darba raksturīga izteiksme, vai kurai darba raksturīgā izteiksme uzskatāma par piemērotu. @lv
alternative label: public cible @fr
alternative label: جمهور مستهدف @ar
alternative label: Zielgruppe @de
alternative label: destinataris previstos @ca
alternative label: 目标受众 @zh-hans
label: 有代表性内容表达的目标受众 @zh-hans
definition: 将一种作品与一种作品的一种代表性内容表达的目标使用者或者一种作品的一种代表性内容表达被认为适合的使用者的类别关联起来。 @zh-hans
toolkit label: 代表性内容表达的目标受众 @zh-hans

has choreographer agent
status: Published
definition: Relates a work to an agent who is responsible for creating a choreographic work.
type: Property
domain: C10001
sub property of: has creator agent of work
lexical alias: choreographerAgent.en
toolkit label: choreographer agent
toolkit definition: An agent who is responsible for creating a choreographic work.
toolkit label: agent chorégraphe @fr
toolkit definition: Agent qui est responsable de la création d’une œuvre chorégraphique. @fr
toolkit label: coreógrafo @es
toolkit definition: Una persona, familia o entidad corporativa responsable de la creación de una obra de movimiento. @es
instruction number: 18.5
label: har agent, som er koreograf @da
definition: Relaterer et værk til en agent, som er ansvarlig for et koreografisk værk. @da
toolkit label: agent, som er koreograf @da
toolkit definition: Agent, som er ansvarlig for et koreografisk værk. @da
definition: Met une œuvre en relation avec un agent qui est responsable de la création d’une œuvre chorégraphique. @fr
label: có biên đạo múa @vi
definition: Liên kết tác phẩm với tác nhân có trách nhiệm tạo lập tác phẩm động thái. @vi
toolkit label: biên đạo múa @vi
toolkit definition: Tác nhân có trách nhiệm tạo lập tác phẩm động thái. @vi
label: hat Choreografin/Choreografen (Akteur) @de
definition: Setzt ein Werk in Beziehung zu einem Akteur, der für die Schaffung eines choreografischen Werks verantwortlich ist. @de
toolkit label: Choreografin/Choreograf (Akteur) @de
toolkit definition: Ein Akteur, der für die Schaffung eines choreografischen Werks verantwortlich ist. @de
label: a pour agent chorégraphe @fr
definition: Liittää teoksen toimijaan, joka on vastuussa koreografisen teoksen luomisesta. @fi
toolkit label: koreografi (toimija) @fi
toolkit definition: Toimija, joka on vastuussa koreografisen teoksen luomisesta. @fi
toolkit label: koreograf (agent) @no
toolkit definition: En agent som er ansvarlig for å skape et koreografisk verk. @no
label: té com a agent coreògraf @ca
definition: Relaciona una obra amb un agent que és responsable de la creació d’una obra coreogràfica. @ca
toolkit label: agent coreògraf @ca
toolkit definition: Agent que és responsable de la creació d’una obra coreogràfica. @ca
has element type: 2
label: έχει χορογράφο @el
definition: Συνδέει ένα έργο με έναν φορέα υπεύθυνο για τη δημιουργία ενός έργου κίνησης. @el
toolkit label: χορογράφος @el
toolkit definition: Ένας φορέας υπεύθυνος για τη δημιουργία ενός έργου κίνησης. @el
label: koreográfus ágense a következő: @hu
definition: Hozzákapcsol egy művet ágenshez, amely felelős egy koreografikus mű létrehozásáért. @hu
toolkit label: koreográfus ágens: @hu
toolkit definition: Egy ágens, amely felelős egy koreografikus mű létrehozásáért. @hu
alternative label: choreographer
alternative label: teoksen koreografi @fi
label: koreografi (toimija) @fi
label: har koreograf (agent) @no
definition: Relaterer et verk til en agent som er ansvarlig for å skape et koreografisk verk. @no
alternative label: koreograf for verk @no
label: heeft choreograaf-actor @nl
definition: Relateert een werk aan een actor die verantwoordelijk is voor het creëren van een choreografisch werk. @nl
toolkit label: choreograaf-actor @nl
toolkit definition: Een actor die verantwoordelijk is voor het creëren van een choreografisch werk. @nl
label: له وكيل مصمم رقصات @ar
definition: يربط بين عمل ووكيل مسئول عن ابتكار عمل راقص. @ar
alternative label: مصمم رقصات @ar
toolkit label: وكيل مصمم رقصات @ar
toolkit definition: وكيل مسئول عن ابتكار عمل راقص. @ar
alternative label: coreògraf @ca
alternative label: koreograf af værk @da
label: koreograaf (tegija) @et
definition: Seostab teose tegijaga, kes vastutab koreograafilise teose loomise eest. @et
alternative label: teose koreograaf @et
toolkit label: koreograaf (tegija) @et
toolkit definition: Tegija, kes vastutab koreograafilise teose loomise eest. @et
alternative label: Choreograf @de
alternative label: koreográfus: @hu
label: ha come coreografo agente @it
definition: Correla un'opera a un agente responsabile della creazione di un'opera coreografica. @it
alternative label: coreografo di opera @it
toolkit label: coreografo agente @it
toolkit definition: Agente responsabile della creazione di un'opera coreografica. @it
alternative label: chorégraphe @fr
label: horeogrāfs (aģents) @lv
definition: Sasaista darbu ar aģentu, kas ir atbildīgs par horeogrāfisku darbu. @lv
toolkit label: horeogrāfs (aģents) @lv
toolkit definition: Aģents, kas ir atbildīgs par horeogrāfisku darbu. @lv
toolkit label: 编舞者行为者 @zh-hans

has choreographer collective agent
status: Published
lexical alias: choreographerCollectiveAgent.en
definition: Relates a work to a collective agent who is responsible for creating a choreographic work.
toolkit label: choreographer collective agent
toolkit definition: A collective agent who is responsible for creating a choreographic work.
type: Property
domain: C10001
has element type: 2
sub property of: has creator collective agent of work
sub property of: has choreographer agent
label: koreografi (yhteistoimija) @fi
definition: Liittää teoksen yhteistoimijaan, joka on vastuussa koreografisen teoksen luomisesta. @fi
toolkit label: koreografi (yhteistoimija) @fi
toolkit definition: Yhteistoimija, joka on vastuussa koreografisen teoksen luomisesta. @fi
label: har koreograf (kollektiv agent) @no
definition: Relaterer et verk til en kollektiv agent som er ansvarlig for å skape et koreografisk verk. @no
toolkit label: koreograf (kollektiv agent) @no
toolkit definition: En kollektiv agent som er ansvarlig for å skape et koreografisk verk. @no
label: heeft choreograaf-collectieve actor @nl
definition: Relateert een werk aan een collectieve actor die verantwoordelijk is voor het creëren van een choreografisch werk. @nl
toolkit label: choreograaf-collectieve actor @nl
toolkit definition: Een collectieve actor die verantwoordelijk is voor het creëren van een choreografisch werk. @nl
label: له وكيل جماعي مصمم رقصات @ar
definition: يربط بين عمل ووكيل جماعي مسئول عن ابتكار عمل راقص. @ar
toolkit label: وكيل جماعي مصمم رقصات @ar
toolkit definition: وكيل جماعي مسئول عن ابتكار عمل راقص. @ar
label: té com a agent col·lectiu coreògraf @ca
definition: Relaciona una obra amb un agent col·lectiu que és responsable de la creació d’una obra coreogràfica. @ca
toolkit label: agent col·lectiu coreògraf @ca
toolkit definition: Agent col·lectiu que és responsable de la creació d’una obra coreogràfica. @ca
label: har kollektiv agent, som er koreograf @da
definition: Relaterer et værk til en kollektiv agent, som er ansvarlig for et koreografisk værk. @da
toolkit label: kollektiv agent, som er koreograf @da
toolkit definition: Kollektiv agent, som er ansvarlig for et koreografisk værk. @da
label: koreograaf (kollektiiv) @et
definition: Seostab teose kollektiiviga, kes vastutab koreograafilise teose loomise eest. @et
toolkit label: koreograaf (kollektiiv) @et
toolkit definition: Kollektiiv, kes vastutab koreograafilise teose loomise eest. @et
label: hat Choreografin/Choreografen (Gemeinschaftlicher Akteur) @de
definition: Setzt ein Werk in Beziehung zu einem gemeinschaftlichen Akteur, der für die Schaffung eines choreografischen Werks verantwortlich ist. @de
toolkit label: Choreografin/Choreograf (Gemeinschaftlicher Akteur) @de
toolkit definition: Ein gemeinschaftlicher Akteur, der für die Schaffung eines choreografischen Werks verantwortlich ist. @de
label: koreográfus kollektív ágense a következő: @hu
definition: Hozzákapcsol egy művet egy kollektív ágenshez, amely felelős egy koreografikus mű létrehozásáért. @hu
toolkit label: koreográfus kollektív ágens: @hu
toolkit definition: Egy kollektív ágens, amely felelős egy koreografikus mű létrehozásáért. @hu
label: ha come coreografo agente collettivo @it
definition: Correla un'opera all'agente collettivo responsabile di un'opera coreografica. @it
toolkit label: coreografo agente collettivo @it
toolkit definition: Agente collettivo, responsabile di un'opera coreografica. @it
label: a pour agent collectif chorégraphe @fr
definition: Met une œuvre en relation avec un agent collectif qui est responsable de la création d’une œuvre chorégraphique. @fr
toolkit label: agent collectif chorégraphe @fr
toolkit definition: Agent collectif qui est responsable de la création d’une œuvre chorégraphique. @fr
label: horeogrāfs (grupa) @lv
definition: Sasaista darbu ar grupu, kas ir atbildīga par horeogrāfisku darbu. @lv
toolkit label: horeogrāfs (grupa) @lv
toolkit definition: Grupa, kas ir atbildīga par horeogrāfisku darbu. @lv
label: 有编舞者集体行为者 @zh-hans
definition: 将一种作品与负责创建一种编舞作品的一个集体行为者关联起来。 @zh-hans
toolkit label: 编舞者集体行为者 @zh-hans
toolkit definition: 负责创建一种编舞作品的一个集体行为者 @zh-hans
has subproperty: has choreographer corporate body
has subproperty: has choreographer family
has subproperty: P10481
label: koreograf kolektif temsilci ile ilişkilidir @tr
definition: Bir eseri, bir koreografik eser yaratmaktan sorumlu olan kolektif bir temsilci ile ilişkilendirir. @tr
toolkit label: koreograf kolektif temsilcisi @tr
toolkit definition: Bir koreografik çalışmanın oluşturulmasından sorumlu olan kolektif temsilci @tr

has choreographer corporate body
status: Published
lexical alias: choreographerCorporateBody.en
definition: Relates a work to a corporate body who is responsible for creating a choreographic work.
toolkit label: choreographer corporate body
toolkit definition: A corporate body who is responsible for creating a choreographic work.
type: Property
domain: C10001
has element type: 2
sub property of: has creator corporate body of work
sub property of: has choreographer collective agent
label: koreografi (yhteisö) @fi
definition: Liittää teoksen yhteisöön, joka on vastuussa koreografisen teoksen luomisesta. @fi
toolkit label: koreografi (yhteisö) @fi
toolkit definition: Yhteisö, joka on vastuussa koreografisen teoksen luomisesta. @fi
label: har koreograf (korporasjon) @no
definition: Relaterer et verk til en korporasjon som er ansvarlig for å skape et koreografisk verk. @no
toolkit label: koreograf (korporasjon) @no
toolkit definition: En korporasjon som er ansvarlig for å skape et koreografisk verk. @no
label: heeft choreograaf-corporatie @nl
definition: Relateert een werk aan een corporatie die verantwoordelijk is voor het creëren van een choreografisch werk. @nl
toolkit label: choreograaf-corporatie @nl
toolkit definition: Een corporatie die verantwoordelijk is voor het creëren van een choreografisch werk. @nl
label: له هيئة مصممة رقصات @ar
definition: يربط بين عمل وهيئة مسئولة عن ابتكار عمل راقص. @ar
toolkit label: هيئة مصممة رقصات @ar
toolkit definition: هيئة مسئولة عن ابتكار عمل راقص. @ar
label: té com a entitat corporativa coreògrafa @ca
definition: Relaciona una obra amb una entitat corporativa que és responsable de la creació d’una obra coreogràfica. @ca
toolkit label: entitat corporativa coreògrafa @ca
toolkit definition: Entitat corporativa que és responsable de la creació d’una obra coreogràfica. @ca
label: har korporation, som er koreograf @da
definition: Relaterer et værk til en korporation, som er ansvarlig for et koreografisk værk. @da
toolkit label: korporation, som er koreograf @da
toolkit definition: Korporation, som er ansvarlig for et koreografisk værk. @da
label: koreograaf (asutus) @et
definition: Seostab teose asutusega, kes vastutab koreograafilise teose loomise eest. @et
toolkit label: koreograaf (asutus) @et
toolkit definition: Asutus, kes vastutab koreograafilise teose loomise eest. @et
label: hat Choreografin/Choreografen (Körperschaft) @de
definition: Setzt ein Werk in Beziehung zu einer Körperschaft, die für die Schaffung eines choreografischen Werks verantwortlich ist. @de
toolkit label: Choreografin/Choreograf (Körperschaft) @de
toolkit definition: Eine Körperschaft, die für die Schaffung eines choreografischen Werks verantwortlich ist. @de
label: koreográfus testülete a következő: @hu
definition: Hozzákapcsol egy művet egy testülethez, amely felelős egy koreografikus mű létrehozásáért. @hu
toolkit label: koreográfus testület: @hu
toolkit definition: Egy testület, amely felelős egy koreografikus mű létrehozásáért. @hu
label: ha come coreografo ente @it
definition: Correla un'opera a un ente responsabile di un'opera coreografica. @it
toolkit label: coreografo ente @it
toolkit definition: Ente responsabile di un'opera coreografica. @it
label: a pour collectivité chorégraphe @fr
definition: Met une œuvre en relation avec une collectivité qui est responsable de la création d’une œuvre chorégraphique. @fr
toolkit label: collectivité chorégraphe @fr
toolkit definition: Collectivité qui est responsable de la création d’une œuvre chorégraphique. @fr
label: horeogrāfs (institūcija) @lv
definition: Sasaista darbu ar institūciju, kas ir atbildīga par horeogrāfisku darbu. @lv
toolkit label: horeogrāfs (institūcija) @lv
toolkit definition: Institūcija, kas ir atbildīga par horeogrāfisku darbu. @lv
label: 有编舞者团体 @zh-hans
definition: 将一种作品与负责创建一种编舞作品的一个团体关联起来。 @zh-hans
toolkit label: 编舞者团体 @zh-hans
toolkit definition: 负责创建一种编舞作品的一个团体 @zh-hans
has subproperty: P10528
label: koreograf tüzel kişi ile ilişkilidir @tr
definition: Bir eseri, eseri görevlendirmekten sorumlu olan tüzel kişi ile ilişkilendirir. @tr
toolkit label: koreograf tüzel kişisi @tr
toolkit definition: Bir koreografik çalışma oluşturmaktan sorumlu olan bir tüzel kişi. @tr

has choreographer family
status: Published
lexical alias: choreographerFamily.en
definition: Relates a work to a family who is responsible for creating a choreographic work.
toolkit label: choreographer family
toolkit definition: A family who is responsible for creating a choreographic work.
type: Property
domain: C10001
has element type: 2
sub property of: has creator family of work
sub property of: has choreographer collective agent
label: koreografi (suku) @fi
definition: Liittää teoksen sukuun, joka on vastuussa koreografisen teoksen luomisesta. @fi
toolkit label: koreografi (suku) @fi
toolkit definition: Suku, joka on vastuussa koreografisen teoksen luomisesta. @fi
label: har koreograf (familie) @no
definition: Relaterer et verk til en familie som er ansvarlig for å skape et koreografisk verk. @no
toolkit label: koreograf (familie) @no
toolkit definition: En familie som er ansvarlig for å skape et koreografisk verk. @no
label: heeft choreograaf-familie @nl
definition: Relateert een werk aan een familie die verantwoordelijk is voor het creëren van een choreografisch werk. @nl
toolkit label: choreograaf-familie @nl
toolkit definition: Een familie die verantwoordelijk is voor het creëren van een choreografisch werk. @nl
label: له عائلة مصممة رقصات @ar
definition: يربط بين عمل وعائلة مسئولة عن ابتكار عمل راقص. @ar
toolkit label: عائلة مصممة رقصات @ar
toolkit definition: عائلة مسئولة عن ابتكار عمل راقص. @ar
label: té com a família coreògrafa @ca
definition: Relaciona una obra amb una família que és responsable de la creació d’una obra coreogràfica. @ca
toolkit label: família coreògrafa @ca
toolkit definition: Família que és responsable de la creació d’una obra coreogràfica. @ca
label: har familie, som er koreograf @da
definition: Relaterer et værk til en familie, som er ansvarlig for et koreografisk værk. @da
toolkit label: familie, som er koreograf @da
toolkit definition: Familie, som er ansvarlig for et koreografisk værk. @da
label: koreograaf (perekond) @et
definition: Seostab teose perekonnaga, kes vastutab koreograafilise teose loomise eest. @et
toolkit label: koreograaf (perekond) @et
toolkit definition: Perekond, kes vastutab koreograafilise teose loomise eest. @et
label: hat Choreografin/Choreografen (Familie) @de
definition: Setzt ein Werk in Beziehung zu einer Familie, die für die Schaffung eines choreografischen Werks verantwortlich ist. @de
toolkit label: Choreografin/Choreograf (Familie) @de
toolkit definition: Eine Familie, die für die Schaffung eines choreografischen Werks verantwortlich ist. @de
label: koreográfus családja a következő: @hu
definition: Hozzákapcsol egy művet egy családhoz, amely felelős egy koreografikus mű létrehozásáért. @hu
toolkit label: koreográfus család: @hu
toolkit definition: Egy család, amely felelős egy koreografikus mű létrehozásáért. @hu
label: ha come coreografo famiglia @it
definition: Correla un'opera alla famiglia responsabile di un'opera coreografica. @it
toolkit label: coreografo famiglia @it
toolkit definition: Famiglia responsabile di un'opera coreografica. @it
label: a pour famille chorégraphe @fr
definition: Met une œuvre en relation avec une famille qui est responsable de la création d’une œuvre chorégraphique. @fr
toolkit label: famille chorégraphe @fr
toolkit definition: Famille qui est responsable de la création d’une œuvre chorégraphique. @fr
label: horeogrāfs (dzimta/ģimene) @lv
definition: Sasaista darbu ar dzimtu/ģimeni, kas ir atbildīga par horeogrāfisku darbu. @lv
toolkit label: horeogrāfs (dzimta/ģimene) @lv
toolkit definition: Dzimta/ģimene, kas ir atbildīga par horeogrāfisku darbu. @lv
label: 有编舞者家族 @zh-hans
definition: 将一种作品与负责创建一种编舞作品的一个家族关联起来。 @zh-hans
toolkit label: 编舞者家族 @zh-hans
toolkit definition: 负责创建一种编舞作品的一个家族 @zh-hans
has subproperty: P10575
label: koreograf aile ile ilişkilidir @tr
definition: Bir eseri, kareografik bir çalışma oluşturmaktan sorumlu olan bir aileyle ilişkilendirir. @tr
toolkit label: koreograf ailesi @tr
toolkit definition: Bir koreografik eser yaratmaktan sorumlu bir aile. @tr

has choreographer person
status: Published
lexical alias: choreographerPerson.en
definition: Relates a work to a person who is responsible for creating a choreographic work.
toolkit label: choreographer person
toolkit definition: A person who is responsible for creating a choreographic work.
type: Property
domain: C10001
has element type: 2
sub property of: has creator person of work
sub property of: has choreographer agent
label: koreografi (henkilö) @fi
definition: Liittää teoksen henkilöön, joka on vastuussa koreografisen teoksen luomisesta. @fi
toolkit label: koreografi (henkilö) @fi
toolkit definition: Henkilö, joka on vastuussa koreografisen teoksen luomisesta. @fi
label: har koreograf (person) @no
definition: Relaterer et verk til en person som er ansvarlig for å skape et koreografisk verk. @no
toolkit label: koreograf (person) @no
toolkit definition: En person som er ansvarlig for å skape et koreografisk verk. @no
label: heeft choreograaf-persoon @nl
definition: Relateert een werk aan een persoon die verantwoordelijk is voor het creëren van een choreografisch werk. @nl
toolkit label: choreograaf-persoon @nl
toolkit definition: Een persoon die verantwoordelijk is voor het creëren van een choreografisch werk. @nl
label: له شخص مصمم رقصات @ar
definition: يربط بين عمل وشخص مسئول عن ابتكارعمل راقص. @ar
toolkit label: شخص مصمم رقصات @ar
toolkit definition: شخص مسئول عن ابتكار عمل راقص. @ar
label: té com a persona coreògrafa @ca
definition: Relaciona una obra amb una persona que és responsable de la creació d’una obra coreogràfica. @ca
toolkit label: persona coreògrafa @ca
toolkit definition: Persona que és responsable de la creació d’una obra coreogràfica. @ca
label: har person, som er koreograf @da
definition: Relaterer et værk til en person, som er ansvarlig for et koreografisk værk. @da
toolkit label: person, som er koreograf @da
toolkit definition: Person, som er ansvarlig for et koreografisk værk. @da
label: koreograaf (isik) @et
definition: Seostab teose isikuga, kes vastutab koreograafilise teose loomise eest. @et
toolkit label: koreograaf (isik) @et
toolkit definition: Isik, kes vastutab koreograafilise teose loomise eest. @et
label: hat Choreografin/Choreografen (Person) @de
definition: Setzt ein Werk in Beziehung zu einer Person, die für die Schaffung eines choreografischen Werks verantwortlich ist. @de
toolkit label: Choreografin/Choreograf (Person) @de
toolkit definition: Eine Person, die für die Schaffung eines choreografischen Werks verantwortlich ist. @de
label: koreográfus személye a következő: @hu
definition: Hozzákapcsol egy művet egy személyhez, aki felelős egy koreografikus mű létrehozásáért. @hu
toolkit label: koreográfus személy: @hu
toolkit definition: Egy személy, aki felelős egy koreografikus mű létrehozásáért. @hu
label: ha come coreografo persona @it
definition: Correla un'opera alla persona responsabile di un'opera coreografica. @it
toolkit label: coreografo persona @it
toolkit definition: Persona responsabile di un'opera coreografica. @it
label: a pour personne chorégraphe @fr
definition: Met une œuvre en relation avec une personne qui est responsable de la création d’une œuvre chorégraphique. @fr
toolkit label: personne chorégraphe @fr
toolkit definition: Personne qui est responsable de la création d’une œuvre chorégraphique. @fr
label: horeogrāfs (persona) @lv
definition: Sasaista darbu ar personu, kura ir atbildīga par horeogrāfisku darbu. @lv
toolkit label: horeogrāfs (persona) @lv
toolkit definition: Persona, kura ir atbildīga par horeogrāfisku darbu. @lv
label: 有编舞者个人 @zh-hans
definition: 将一种作品与负责创建一种编舞作品的一个个人关联起来。 @zh-hans
toolkit label: 编舞者个人 @zh-hans
toolkit definition: 负责创建一种编舞作品的一个个人 @zh-hans
has subproperty: P10434
label: koreograf ile ilişkilidir @tr
definition: Bir eseri, bir koreografik eser oluşturmaktan sorumlu olan bir kişiyle ilişkilendirir. @tr
toolkit label: koreograf @tr
toolkit definition: Bir koreografik eser yaratmaktan sorumlu olan kişi. @tr

has civil defendant corporate body
status: Published
lexical alias: civilDefendantCorporateBody.en
definition: Relates a work to a corporate body who is sued in a civil proceeding.
toolkit label: civil defendant corporate body
toolkit definition: A corporate body who is sued in a civil proceeding.
type: Property
domain: C10001
sub property of: has defendant corporate body
has element type: 2
label: yhteisövastaaja siviilioikeudessa @fi
definition: Liittää teoksen yhteisöön, jota vastaan on nostettu kanne. @fi
toolkit label: yhteisövastaaja siviilioikeudessa @fi
toolkit definition: Yhteisö, jota vastaan on nostettu kanne. @fi
label: har sivilrettslig saksøkt korporasjon @no
definition: Relaterer et verk til en korporasjon som er ansvarlig for å være saksøkt i en sivilrettslig sak. @no
toolkit label: sivilrettslig saksøkt korporasjon @no
toolkit definition: En korporasjon som er ansvarlig for å være saksøkt i en sivilrettslig sak. @no
label: heeft burgelijke verweerder-corporatie @nl
definition: Relateert een werk aan een corporatie die is gedaagd in een civielrechtelijke procedure. @nl
toolkit label: burgelijke verweerder-corporatie @nl
toolkit definition: Een corporatie die is gedaagd in een civielrechtelijke procedure. @nl
label: له هيئة مدنية مدعى عليها @ar
definition: يربط بين عمل وهيئة تتم مقاضاتها في دعوى مدنية. @ar
toolkit label: هيئة مدنية مدعى عليها @ar
toolkit definition: هيئة تتم مقاضاتها في دعوى مدنية. @ar
label: té com a entitat corporativa acusada civil @ca
definition: Relaciona una obra amb una entitat corporativa que és demandada en un procés civil. @ca
toolkit label: entitat corporativa acusada civil @ca
toolkit definition: Entitat corporativa que és demandada en un procés civil. @ca
label: har korporation, som er civilretlig sagsøgt @da
definition: Relaterer et værk til en korporation, som er ansvarlig for at blive sagsøgt i en civilretlig straffesag. @da
toolkit label: korporation, som er civilretlig sagsøgt @da
toolkit definition: Korporation, som er ansvarlig for at blive sagsøgt i en civilretlig straffesag. @da
label: kostja (asutus) @et
definition: Seostab teose asutusega, kelle vastu on esitatud hagi tsiviilkohtumenetluses. @et
toolkit label: kostja (asutus) @et
toolkit definition: Asutus, kelle vastu on esitatud hagi tsiviilkohtumenetluses. @et
label: hat Beklagte/Beklagten in einem Zivilverfahren (Körperschaft) @de
definition: Setzt ein Werk in Beziehung zu einer Körperschaft, die in einem Zivilverfahren verklagt wird. @de
toolkit label: Beklagte/Beklagter in einem Zivilverfahren (Körperschaft) @de
toolkit definition: Eine Körperschaft, die in einem Zivilverfahren verklagt wird. @de
label: polgári eljárás alperes testülete a következő: @hu
definition: Hozzákapcsol egy művet egy testülethez, amelyet egy polgári eljárásban perbe fognak. @hu
toolkit label: polgári eljárásban alperes testület: @hu
toolkit definition: Egy testület, amelyet egy polgári eljárásban perbe fognak. @hu
label: ha come convenuto ente @it
definition: Correla un'opera a un ente citato in un procedimento civile. @it
toolkit label: convenuto ente @it
toolkit definition: Ente citato in un procedimento civile. @it
label: a pour collectivité défenderesse civile @fr
definition: Met une œuvre en relation avec une collectivité contre laquelle une poursuite civile est intentée. @fr
toolkit label: collectivité défenderesse civile @fr
toolkit definition: Collectivité contre laquelle une poursuite civile est intentée. @fr
label: civiltiesisks atbildētājs (institūcija) @lv
definition: Sasaista darbu ar institūciju, pret kuru celta sūdzība civilprocesā. @lv
toolkit label: civiltiesisks atbildētājs (institūcija) @lv
toolkit definition: Institūcija, pret kuru celta sūdzība civilprocesā. @lv
label: 有民事被告团体 @zh-hans
definition: 将一种作品与在一项民事诉讼中被指控的一个团体关联起来。 @zh-hans
toolkit label: 民事被告团体 @zh-hans
toolkit definition: 在一项民事诉讼中被指控的一个团体 @zh-hans
has subproperty: P10395
label: sivil davalı tüzel kişi ile ilişkilidir @tr
definition: Bir eseri, bir hukuk davasında dava edilen tüzel kişi ile ilişkilendirir. @tr
toolkit label: davalı tüzel kişi @tr
toolkit definition: Bir hukuk davasında dava edilen tüzel kişi. @tr

has civil defendant person
status: Published
lexical alias: civilDefendantPerson.en
definition: Relates a work to a person who is sued in a civil proceeding.
toolkit label: civil defendant person
toolkit definition: A person who is sued in a civil proceeding.
type: Property
domain: C10001
sub property of: has defendant person
has element type: 2
label: henkilövastaaja siviilioikeudessa @fi
definition: Liittää teoksen henkilöön, jota vastaan on nostettu kanne. @fi
toolkit label: henkilövastaaja siviilioikeudessa @fi
toolkit definition: Henkilö, jota vastaan on nostettu kanne. @fi
label: har sivilrettslig saksøkt person @no
definition: Relaterer et verk til en person som er saksøkt i en sivilrettslig sak. @no
toolkit label: sivilrettslig saksøkt person @no
toolkit definition: En person som er saksøkt i en sivilrettslig sak. @no
label: heeft burgelijke verweerder-persoon @nl
definition: Relateert een werk aan een persoon die gedaagd wordt in een civielrechtelijke procedure. @nl
toolkit label: burgelijke verweerder-persoon @nl
toolkit definition: Een persoon die gedaagd wordt in een civielrechtelijke procedure. @nl
label: té com a persona acusada civil @ca
definition: Relaciona una obra amb una persona que és demandada en un procés civil. @ca
toolkit label: persona acusada civil @ca
toolkit definition: Persona que és demandada en un procés civil. @ca
label: har person, som er civilretlig sagsøgt @da
definition: Relaterer et værk til en person, som er sagsøgt i en civilretlig straffesag. @da
toolkit label: person, som er civilretlig sagsøgt @da
toolkit definition: Person, som er sagsøgt i en civilretlig straffesag. @da
label: kostja (isik) @et
definition: Seostab teose isikuga, kelle vastu on esitatud hagi tsiviilkohtumenetluses. @et
toolkit label: kostja (isik) @et
toolkit definition: Isik, kelle vastu on esitatud hagi tsiviilkohtumenetluses. @et
label: hat Beklagte/Beklagten in einem Zivilverfahren (Person) @de
definition: Setzt ein Werk in Beziehung zu einer Person, die in einem Zivilverfahren verklagt wird. @de
toolkit label: Beklagte/Beklagter in einem Zivilverfahren (Person) @de
toolkit definition: Eine Person, die in einem Zivilverfahren verklagt wird. @de
label: polgári eljárás alperes személye a következő: @hu
definition: Hozzákapcsol egy művet egy személyhez, akit egy polgári eljárásban perbe fognak. @hu
toolkit label: polgári eljárás alperes személy: @hu
toolkit definition: Egy személy, akit egy polgári eljárásban perbe fognak. @hu
label: ha come convenuto persona @it
definition: Correla un'opera a una persona citata in un procedimento civile. @it
toolkit label: convenuto persona @it
toolkit definition: Persona citata in un procedimento civile. @it
label: a pour personne défenderesse civile @fr
definition: Met une œuvre en relation avec une personne contre laquelle une poursuite civile est intentée. @fr
toolkit label: personne défenderesse civile @fr
toolkit definition: Personne contre laquelle une poursuite civile est intentée. @fr
label: civiltiesisks atbildētājs (persona) @lv
definition: Sasaista darbu ar personu, pret kuru celta prasība civilprocesā. @lv
toolkit label: civiltiesisks atbildētājs (persona) @lv
toolkit definition: Persona, pret kuru celta prasība civilprocesā. @lv
label: له شخص مدعى عليه جنائيا @ar
definition: يربط بين عمل وهيئة موجَه إليها اتهام في دعوى جنائية. @ar
toolkit label: شخص مدعى عليه جنائيا @ar
toolkit definition: شخص تتم مقاضاته في دعوى جنائية. @ar
label: 有民事被告个人 @zh-hans
definition: 将一种作品与在一项民事诉讼中被指控的一个个人关联起来。 @zh-hans
toolkit label: 民事被告个人 @zh-hans
toolkit definition: 在一项民事诉讼中被指控的一个个人 @zh-hans
has subproperty: P10397
label: sivil davalı ile ilişkilidir @tr
definition: Bir eseri, bir hukuk davasında dava edilen kişiyle ilişkilendirir. @tr
toolkit label: davalı kişi @tr
toolkit definition: Bir hukuk davasında dava edilen kişi. @tr

has colour content of representative expression
status: Published
type: Property
lexical alias: colourContentOfRepresentativeExpression.en
definition: Relates a work to an indication of the presence of colour or tone in the content of a representative expression of a work.
domain: C10001
toolkit label: colour content of representative expression
has element type: 4
toolkit definition: An indication of the presence of colour or tone in the content of a representative expression of a work.
alternative label: color content of representative expression
label: edustavan ekspression värisisältö @fi
definition: Liittää teoksen osoitukseen värin tai sävyn läsnäolosta teoksen edustavan ekspression sisällössä. @fi
toolkit label: edustavan ekspression värisisältö @fi
toolkit definition: Osoitus värin tai sävyn läsnäolosta teoksen edustavan ekspression sisällössä. @fi
label: har fargeinnhold for representativt uttrykk @no
definition: Relaterer et verk til tilstedeværelse av farge, tone etc. i innholdet i et representativt uttrykk av et verk. @no
toolkit label: fargeinnhold for representativt uttrykk @no
toolkit definition: Tilstedeværelse av farge, tone etc. i innholdet i et representativt uttrykk av et verk. @no
label: heeft kleurcontent van representatieve expressie @nl
definition: Relateert een werk aan een indicatie van de aanwezigheid van kleur of toon in de content van een representatieve expressie van een werk. @nl
toolkit label: kleurcontent van representatieve expressie @nl
toolkit definition: Een indicatie van de aanwezigheid van kleur of toon in de content van een representatieve expressie van een werk. @nl
label: له محتوى ملون لتعبيرة ممثِلة @ar
definition: يربط بين عمل وإشارة إلى وجود لون أو درجة لون في محتوى تعبيرة ممثِلة لعمل. @ar
alternative label: محتوى ملون لتعبيرة ممثِلة @ar
toolkit label: محتوى ملون لتعبيرة ممثِلة @ar
toolkit definition: إشارة إلى وجود لون أو درجة لون في محتوى تعبيرة ممثِلة لعمل. @ar
label: té com a contingut de color d’una expressió representativa @ca
definition: Relaciona una obra amb una indicació de la presència de color o de tonalitat en el contingut d’una expressió representativa d’una obra. @ca
toolkit label: contingut de color d’una expressió representativa @ca
toolkit definition: Indicació de la presència de color o de tonalitat en el contingut d’una expressió representativa d’una obra. @ca
label: har farveindhold for repræsentativt udtryk @da
definition: Relaterer et værk til en tilstedeværelse af farve, tone etc. i indholdet af et værks repræsentative udtryk. @da
alternative label: farveindhold for repræsentativt udtryk @da
toolkit label: farveindhold for repræsentativt udtryk @da
toolkit definition: Tilstedeværelse af farve, tone etc. i indholdet af et værks repræsentative udtryk. @da
label: iseloomuliku väljenduse värvisisu @et
definition: Seostab teose värvi, tooni vms olemasoluga teose iseloomuliku väljenduse sisus. @et
toolkit label: iseloomuliku väljenduse värvisisu @et
toolkit definition: Värvi, tooni vms olemasolu teose iseloomuliku väljenduse sisus. @et
label: hat Farbinhalt einer repräsentativen Expression @de
definition: Setzt ein Werk in Beziehung zu einer Angabe über das Vorhandensein von Farbe oder Tönung im Inhalt einer repräsentativen Expression eines Werks. @de
toolkit label: Farbinhalt einer repräsentativen Expression @de
toolkit definition: Eine Angabe über das Vorhandensein von Farbe oder Tönung im Inhalt einer repräsentativen Expression eines Werks. @de
label: reprezentatív kifejezési forma színtartalma a következő: @hu
definition: Hozzákapcsol egy művet egy mű reprezentatív kifejezési formájában megtestesülő, a hang színét vagy színárnyalatát mutató jelöléshez. @hu
alternative label: reprezentatív kifejezési forma színtartalma: @hu
toolkit label: reprezentatív kifejezési formához tartozó színtartalom @hu
toolkit definition: Egy mű reprezentatív kifejezési formájában megtestesülő, a hang színét vagy színárnyalatát mutató jelölés. @hu
label: ha come colorazione di espressione rappresentativa @it
definition: Correla un’opera a una presenza di colore, tonalità, etc. nel contenuto di un’espressione rappresentativa di un’opera. @it
toolkit label: colorazione dell'espressione rappresentativa @it
toolkit definition: Presenza di colore, tonalità, etc. nel contenuto di un’espressione rappresentativa di un’opera. @it
label: a pour contenu de couleur d’une expression représentative @fr
definition: Met une œuvre en relation avec une indication de la présence de couleur ou de teinte dans le contenu d’une expression représentative d’une œuvre. @fr
toolkit label: contenu de couleur d’une expression représentative @fr
toolkit definition: Indication de la présence de couleur ou de teinte dans le contenu d’une expression représentative d’une œuvre. @fr
label: reprezentatīvās izteiksmes krāsainība @lv
definition: Sasaista darbu ar krāsas, toņa u.c. klātbūtni darba reprezentatīvajā izteiksmē. @lv
toolkit label: reprezentatīvās izteiksmes krāsainība @lv
toolkit definition: Krāsas, toņa u.c. klātbūtne darba reprezentatīvajā izteiksmē @lv
alternative label: - @fi
alternative label: 代表性内容表达的颜色内容 @zh-hans
label: 有代表性内容表达的颜色内容 @zh-hans
definition: 将一种作品与一种作品的的代表性内容表达之颜色或色调是否出现在内容中的指示关联起来。 @zh-hans
toolkit label: 代表性内容表达的颜色内容 @zh-hans
toolkit definition: 一种作品的的代表性内容表达之颜色或色调是否出现在内容中的指示 @zh-hans
has subproperty: P10348
alternative label: temsili anlatımın renk içeriği @tr
label: temsili anlatımın renk içeriği ile ilişkilidir @tr
definition: Bir eseri, eserin temsili bir anlatımın içeriğindeki renk veya tonun varlığının göstergesiyle ilişkilendirir. @tr
toolkit label: temsili anlatımın renk içeriği @tr
toolkit definition: Bir eserin temsili anlatımının içeriğinde renk veya ton varlığının bir göstergesi. @tr

has commissioning agent
status: Published
type: Property
definition: Relates a work to an agent who is responsible for commissioning a work.
domain: C10001
toolkit label: commissioning agent
toolkit definition: An agent who is responsible for commissioning a work.
toolkit label: entidad encargada @es
toolkit definition: Una persona, familia o entidad corporativa responsable de la puesta en marcha de una obra. @es
instruction number: 18.5
label: har agent, som er opgavestiller @da
definition: Relaterer et værk til en agent, som er ansvarlig for bestilling af et værk. @da
toolkit label: agent, som er opgavestiller @da
toolkit definition: Agent, som er ansvarlig for bestilling af et værk. @da
label: có tập thể uỷ thác @vi
definition: Liên kết tác phẩm với tác nhân có trách nhiệm về uỷ thác tác phẩm. @vi
toolkit label: tập thể uỷ thác @vi
toolkit definition: Tác nhân có trách nhiệm về uỷ thác tác phẩm. @vi
label: hat Auftraggeberin/Auftraggeber (Akteur) @de
definition: Setzt ein Werk in Beziehung zu einem Akteur, der ein Werk in Auftrag gibt. @de
toolkit label: Auftraggeberin/Auftraggeber (Akteur) @de
toolkit definition: Ein Akteur, der ein Werk in Auftrag gibt. @de
definition: Liittää teoksen toimijaan, joka on vastuussa teoksen teettämisestä. @fi
toolkit label: toimeksiantaja (toimija) @fi
toolkit definition: Toimija, joka on vastuussa teoksen teettämisestä. @fi
toolkit label: oppdragsgiver (agent) @no
toolkit definition: En agent som er ansvarlig for å bestille et verk. @no
label: té com a agent comitent @ca
definition: Relaciona una obra amb un agent que és responsable d’encarregar una obra. @ca
toolkit label: agent comitent @ca
toolkit definition: Agent que és responsable d’encarregar una obra. @ca
label: a pour agent commanditaire @fr
definition: Met une œuvre en relation avec un agent qui est responsable de la commande d’une œuvre. @fr
toolkit label: agent commanditaire @fr
toolkit definition: Agent qui est responsable de la commande d’une œuvre. @fr
has element type: 2
label: έχει φορέα ανάθεσης @el
definition: Συνδέει ένα έργο με έναν φορέα υπεύθυνο για την ανάθεση ενός έργου. @el
toolkit label: φορέας ανάθεσης @el
toolkit definition: Ένας φορέας υπεύθυνος για την ανάθεση ενός έργου. @el
label: megrendelő ágense a következő: @hu
definition: Hozzákapcsol egy művet egy ágenshez, amely felelős egy mű megrendeléséért. @hu
toolkit label: megrendelő ágens: @hu
toolkit definition: Egy ágens, amely felelős egy mű megrendeléséért. @hu
alternative label: commissioning body
alternative label: toimeksiantaja @fi
label: toimeksiantaja (toimija) @fi
label: har oppdragsgiver (agent) @no
definition: Relaterer et verk til en agent som er ansvarlig for å bestille et verk. @no
alternative label: oppdragsgiver @no
sub property of: has related agent of work
lexical alias: commissioningAgent.en
label: heeft opdrachtgever-actor @nl
definition: Relateert een werk aan een actor die verantwoordelijk is voor opdracht geven tot een werk. @nl
toolkit label: opdrachtgever-actor @nl
toolkit definition: Een actor die verantwoordelijk is voor opdracht geven tot een werk. @nl
label: له وكيل جهة تكليف @ar
definition: يربط بين عمل ووكيل مسئول عن التكليف بعمل. @ar
alternative label: جهة تكليف @ar
toolkit label: وكيل جهة تكليف @ar
toolkit definition: وكيل مسئول عن التكليف بعمل. @ar
alternative label: comitent @ca
alternative label: bestillende institution @da
label: tellija (tegija) @et
definition: Seostab teose tegijaga, kes vastutab teose tellimise eest. @et
alternative label: tellija @et
toolkit label: tellija (tegija) @et
toolkit definition: Tegija, kes vastutab teose tellimise eest. @et
alternative label: megrendelő: @hu
label: ha come committente agente @it
definition: Correla un’opera a un agente che commissiona un’opera. @it
alternative label: committente @it
toolkit label: committente agente @it
toolkit definition: Agente che commissiona un’opera. @it
alternative label: commanditaire @fr
label: pasūtītājs (aģents) @lv
definition: Sasaista darbu ar aģentu, kas ir atbildīgs par darba pasūtīšanu. @lv
toolkit label: pasūtītājs (aģents) @lv
toolkit definition: Aģents, kas ir atbildīgs par darba pasūtīšanu. @lv
alternative label: Auftraggeber @de
toolkit label: 委托行为者 @zh-hans

has commissioning collective agent
status: Published
definition: Relates a work to a collective agent who is responsible for commissioning a work.
toolkit label: commissioning collective agent
toolkit definition: A collective agent who is responsible for commissioning a work.
type: Property
domain: C10001
has element type: 2
sub property of: has commissioning agent
label: toimeksiantaja (yhteistoimija) @fi
definition: Liittää teoksen yhteistoimijaan, joka on vastuussa teoksen teettämisestä. @fi
toolkit label: toimeksiantaja (yhteistoimija) @fi
toolkit definition: Yhteistoimija, joka on vastuussa teoksen teettämisestä. @fi
label: har oppdragsgiver (kollektiv agent) @no
definition: Relaterer et verk til en kollektiv agent som er ansvarlig for å bestille et verk. @no
toolkit label: oppdragsgiver (kollektiv agent) @no
toolkit definition: En kollektiv agent som er ansvarlig for å bestille et verk. @no
sub property of: has related collective agent of work
lexical alias: commissioningCollectiveAgent.en
label: heeft opdrachtgever-collectieve actor @nl
definition: Relateert een werk aan een collectieve actor die verantwoordelijk is voor opdracht geven tot een werk. @nl
toolkit label: opdrachtgever-collectieve actor @nl
toolkit definition: Een collectieve actor die verantwoordelijk is voor opdracht geven tot een werk. @nl
label: له وكيل جماعي مكلف @ar
definition: يربط بين عمل ووكيل جماعي مسئول عن التكليف بعمل. @ar
toolkit label: وكيل جماعي هيئة تكليف @ar
toolkit definition: وكيل جماعي مسئول عن التكليف بعمل. @ar
label: té com a agent col·lectiu comitent @ca
definition: Relaciona una obra amb un agent col·lectiu que és responsable d’encarregar una obra. @ca
toolkit label: agent col·lectiu comitent @ca
toolkit definition: Agent col·lectiu que és responsable d’encarregar una obra. @ca
label: har kollektiv agent, som er opgavestiller @da
definition: Relaterer et værk til en kollektiv agent, som er ansvarlig for bestilling af et værk. @da
toolkit label: kollektiv agent, som er opgavestiller @da
toolkit definition: Kollektiv agent, som er ansvarlig for bestilling af et værk. @da
label: tellija (kollektiiv) @et
definition: Seostab teose kollektiiviga, kes vastutab teose tellimise eest. @et
toolkit label: tellija (kollektiiv) @et
toolkit definition: Kollektiiv, kes vastutab teose tellimise eest. @et
label: hat Auftraggeberin/Auftraggeber (Gemeinschaftlicher Akteur) @de
definition: Setzt ein Werk in Beziehung zu einem gemeinschaftlichen Akteur, der ein Werk in Auftrag gibt. @de
toolkit label: Auftraggeberin/Auftraggeber (Gemeinschaftlicher Akteur) @de
toolkit definition: Ein gemeinschaftlicher Akteur, der ein Werk in Auftrag gibt. @de
label: megrendelő kollektív ágense a következő: @hu
definition: Hozzákapcsol egy művet egy kollektív ágenshez, amely felelős egy mű megrendeléséért. @hu
toolkit label: megrendelő kollektív ágens: @hu
toolkit definition: Egy kollektív ágens, amely felelős egy mű megrendeléséért. @hu
label: ha come committente agente collettivo @it
definition: Correla un'opera all'agente collettivo responsabile della committenza di un'opera. @it
toolkit label: committente agente collettivo @it
toolkit definition: Agente collettivo responsabile della committenza di un'opera. @it
label: a pour agent collectif commanditaire @fr
definition: Met une œuvre en relation avec un agent collectif qui est responsable de la commande d’une œuvre. @fr
toolkit label: agent collectif commanditaire @fr
toolkit definition: Agent collectif qui est responsable de la commande d’une œuvre. @fr
label: pasūtītājs (grupa) @lv
definition: Sasaista darbu ar grupu, kas ir atbildīga par darba pasūtīšanu. @lv
toolkit label: pasūtītājs (grupa) @lv
toolkit definition: Grupa, kas ir atbildīga par darba pasūtīšanu. @lv
label: 有委托集体行为者 @zh-hans
definition: 将一种资源与负责委托一种资源的一个集体行为者关联起来。 @zh-hans
toolkit label: 委托集体行为者 @zh-hans
toolkit definition: 负责委托一种资源的一个集体行为者 @zh-hans
has subproperty: has commissioning corporate body
has subproperty: has commissioning family
has subproperty: P10486
label: görevlendiren kolektif temsilci ile ilişkilidir @tr
definition: Bir eseri, bir eseri görevlendirmekten sorumlu olan kolektif bir temsilci ile ilişkilendirir. @tr
toolkit label: görevlendiren kolektif temsilci @tr
toolkit definition: Bir eserin komisyonunu vermekten sorumlu olan kolektif bir temsilci @tr

has commissioning corporate body
status: Published
definition: Relates a work to a corporate body who is responsible for commissioning a work.
toolkit label: commissioning corporate body
toolkit definition: A corporate body who is responsible for commissioning a work.
type: Property
domain: C10001
has element type: 2
sub property of: has commissioning collective agent
label: toimeksiantaja (yhteisö) @fi
definition: Liittää teoksen yhteisöön, joka on vastuussa teoksen teettämisestä. @fi
toolkit label: toimeksiantaja (yhteisö) @fi
toolkit definition: Yhteisö, joka on vastuussa teoksen teettämisestä. @fi
label: har oppdragsgiver (korporasjon) @no
definition: Relaterer et verk til en korporasjon som er ansvarlig for å bestille et verk. @no
toolkit label: oppdragsgiver (korporasjon) @no
toolkit definition: En korporasjon som er ansvarlig for å bestille et verk. @no
sub property of: has related corporate body of work
lexical alias: commissioningCorporateBody.en
label: heeft opdrachtgever-corporatie @nl
definition: Relateert een werk aan een corporatie die verantwoordelijk is voor opdracht geven tot een werk. @nl
toolkit label: opdrachtgever-corporatie @nl
toolkit definition: Een corporatie die verantwoordelijk is voor opdracht geven tot een werk. @nl
label: له هيئة تكليف @ar
definition: يربط بين عمل وهيئة مسئولة عن التكليف بعمل. @ar
toolkit label: هيئة تكليف @ar
toolkit definition: هيئة مسئولة عن التكليف بعمل. @ar
label: té com a entitat corporativa comitent @ca
definition: Relaciona una obra amb una entitat corporativa que és responsable d’encarregar una obra. @ca
toolkit label: entitat corporativa comitent @ca
toolkit definition: Entitat corporativa que és responsable d’encarregar una obra. @ca
label: har korporation, som er opgavestiller @da
definition: Relaterer et værk til en korporation, som er ansvarlig for bestilling af et værk. @da
toolkit label: korporation, som er opgavestiller @da
toolkit definition: Korporation, som er ansvarlig for bestilling af et værk. @da
label: tellija (asutus) @et
definition: Seostab teose asutusega, kes vastutab teose tellimise eest. @et
toolkit label: tellija (asutus) @et
toolkit definition: Asutus, kes vastutab teose tellimise eest. @et
label: hat Auftraggeberin/Auftraggeber (Körperschaft) @de
definition: Setzt ein Werk in Beziehung zu einer Körperschaft, die ein Werk in Auftrag gibt. @de
toolkit label: Auftraggeberin/Auftraggeber (Körperschaft) @de
toolkit definition: Eine Körperschaft, die ein Werk in Auftrag gibt. @de
label: megrendelő testülete a következő: @hu
definition: Hozzákapcsol egy művet egy testülethez, amely felelős egy mű megrendeléséért. @hu
toolkit label: megrendelő testület: @hu
toolkit definition: Egy testület, amely felelős egy mű megrendeléséért. @hu
label: ha come committente ente @it
definition: Correla un'opera a un ente responsabile della committenza di un'opera. @it
toolkit label: committente ente @it
toolkit definition: Ente responsabile della committenza di un'opera. @it
label: a pour collectivité commanditaire @fr
definition: Met une œuvre en relation avec une collectivité qui est responsable de la commande d’une œuvre. @fr
toolkit label: collectivité commanditaire @fr
toolkit definition: Collectivité qui est responsable de la commande d’une œuvre. @fr
label: pasūtītājs (institūcija) @lv
definition: Sasaista darbu ar institūciju, kas ir atbildīga par darba pasūtīšanu. @lv
toolkit label: pasūtītājs (institūcija) @lv
toolkit definition: Institūcija, kas ir atbildīga par darba pasūtīšanu. @lv
label: 有委托团体 @zh-hans
definition: 将一种作品与负责委托一种作品的一个团体关联起来。 @zh-hans
toolkit label: 委托团体 @zh-hans
toolkit definition: 负责委托一种作品的一个团体 @zh-hans
has subproperty: P10533
label: görevlendiren tüzel kişi ile ilişkilidir @tr
definition: Bir eseri, eseri görevlendirmekten sorumlu olan tüzel kişi ile ilişkilendirir. @tr
toolkit label: görevlendiren tüzel kişi @tr
toolkit definition: Bir eserin devreye alınmasından sorumlu bir tüzel kişilik. @tr

has commissioning family
status: Published
definition: Relates a work to a family who is responsible for commissioning a work.
toolkit label: commissioning family
toolkit definition: A family who is responsible for commissioning a work.
type: Property
domain: C10001
has element type: 2
sub property of: has commissioning collective agent
label: toimeksiantaja (suku) @fi
definition: Liittää teoksen sukuun, joka on vastuussa teoksen teettämisestä. @fi
toolkit label: toimeksiantaja (suku) @fi
toolkit definition: Suku, joka on vastuussa teoksen teettämisestä. @fi
label: har oppdragsgiver (familie) @no
definition: Relaterer et verk til en familie som er ansvarlig for å bestille et verk. @no
toolkit label: oppdragsgiver (familie) @no
toolkit definition: En familie som er ansvarlig for å bestille et verk. @no
sub property of: has related family of work
lexical alias: commissioningFamily.en
label: heeft opdrachtgever-familie @nl
definition: Relateert een werk aan een familie die verantwoordelijk is voor opdracht geven tot een werk. @nl
toolkit label: opdrachtgever-familie @nl
toolkit definition: Een familie die verantwoordelijk is voor opdracht geven tot een werk. @nl
label: له عائلة مكلِفة @ar
definition: يربط بين عمل وعائلة مسئولة عن التكليف بعمل. @ar
toolkit label: عائلة مكلِفة @ar
toolkit definition: عائلة مسئولة عن التكليف بعمل. @ar
label: té com a família entitat comitent @ca
definition: Relaciona una obra amb una família que és responsable d’encarregar una obra. @ca
toolkit label: família entitat comitent @ca
toolkit definition: Família que és responsable d’encarregar una obra. @ca
label: har familie, som er opgavestiller @da
definition: Relaterer et værk til en familie, som er ansvarlig for bestilling af et værk. @da
toolkit label: familie, som er opgavestiller @da
toolkit definition: Familie, som er ansvarlig for bestilling af et værk. @da
label: tellija (perekond) @et
definition: Seostab teose perekonnaga, kes vastutab teose tellimise eest. @et
toolkit label: tellija (perekond) @et
toolkit definition: Perekond, kes vastutab teose tellimise eest. @et
label: hat Auftraggeberin/Auftraggeber (Familie) @de
definition: Setzt ein Werk in Beziehung zu einer Familie, die ein Werk in Auftrag gibt. @de
toolkit label: Auftraggeberin/Auftraggeber (Familie) @de
toolkit definition: Eine Familie, die ein Werk in Auftrag gibt. @de
label: megrendelő családja a következő: @hu
definition: Hozzákapcsol egy művet egy családhoz, amely felelős egy mű megrendeléséért. @hu
toolkit label: megrendelő család. @hu
toolkit definition: Egy család, amely felelős egy mű megrendeléséért. @hu
label: ha come committente famiglia @it
definition: Correla un'opera alla famiglia responsabile della committenza di un'opera. @it
toolkit label: committente famiglia @it
toolkit definition: Famiglia responsabile della committenza di un'opera. @it
label: a pour famille commanditaire @fr
definition: Met une œuvre en relation avec une famille qui est responsable de la commande d’une œuvre. @fr
toolkit label: famille commanditaire @fr
toolkit definition: Famille qui est responsable de la commande d’une œuvre. @fr
label: pasūtītājs (dzimta/ģimene) @lv
definition: Sasaista darbu ar dzimtu/ģimeni, kas ir atbildīga par darba pasūtīšanu. @lv
toolkit label: pasūtītājs (dzimta/ģimene) @lv
toolkit definition: Dzimta/ģimene, kas ir atbildīga par darba pasūtīšanu. @lv
label: 有委托家族 @zh-hans
definition: 将一种作品与负责委托一种作品的一个家族关联起来。 @zh-hans
toolkit label: 委托家族 @zh-hans
toolkit definition: 负责委托一种作品的一个家族 @zh-hans
has subproperty: P10580
label: görevlendiren aile ile ilişkilidir @tr
definition: Bir eseri, eseri görevlendirmekten sorumlu olan bir aileyle ilişkilendirir. @tr
toolkit label: görevlendiren aile @tr
toolkit definition: Bir eserden sorumlu olan aile. @tr

has commissioning person
status: Published
definition: Relates a work to a person who is responsible for commissioning a work.
toolkit label: commissioning person
toolkit definition: A person who is responsible for commissioning a work.
type: Property
domain: C10001
has element type: 2
sub property of: has commissioning agent
label: toimeksiantaja (henkilö) @fi
definition: Liittää teoksen henkilöön, joka on vastuussa teoksen teettämisestä. @fi
toolkit label: toimeksiantaja (henkilö) @fi
toolkit definition: Henkilö, joka on vastuussa teoksen teettämisestä. @fi
label: har oppdragsgiver (person) @no
definition: Relaterer et verk til en person som er ansvarlig for å bestille et verk. @no
toolkit label: oppdragsgiver (person) @no
toolkit definition: En person som er ansvarlig for å bestille et verk. @no
sub property of: has related person of work
lexical alias: commissioningPerson.en
label: heeft opdrachtgever-persoon @nl
definition: Relateert een werk aan een persoon die verantwoordelijk is voor opdracht geven tot een werk. @nl
toolkit label: opdrachtgever-persoon @nl
toolkit definition: Een persoon die verantwoordelijk is voor opdracht geven tot een werk. @nl
label: له شخص مكلف @ar
definition: يربط بين عمل وشخص مسئول عن التكليف بعمل. @ar
toolkit label: شخص مكلف @ar
toolkit definition: شخص يكون مسئولاً عن التكليف بعمل. @ar
label: té com a persona comitent @ca
definition: Relaciona una obra amb una persona que és responsable d’encarregar una obra. @ca
toolkit label: persona comitent @ca
toolkit definition: Persona que és responsable d’encarregar una obra. @ca
label: har person, som er opgavestiller @da
definition: Relaterer et værk til en person, som er ansvarlig for bestilling af et værk. @da
toolkit label: person, som er opgavestiller @da
toolkit definition: Person, som er ansvarlig for bestilling af et værk. @da
label: tellija (isik) @et
definition: Seostab teose isikuga, kes vastutab teose tellimise eest. @et
toolkit label: tellija (isik) @et
toolkit definition: Isik, kes vastutab teose tellimise eest. @et
label: hat Auftraggeberin/Auftraggeber (Person) @de
definition: Setzt ein Werk in Beziehung zu einer Person, die ein Werk in Auftrag gibt. @de
toolkit label: Auftraggeberin/Auftraggeber (Person) @de
toolkit definition: Eine Person, die ein Werk in Auftrag gibt. @de
label: megrendelő személye a következő: @hu
definition: Hozzákapcsol egy művet egy személyhez, aki felelős egy mű megrendeléséért. @hu
toolkit label: megrendelő személy: @hu
toolkit definition: Egy személy, aki felelős egy mű megrendeléséért. @hu
label: ha come committente persona @it
definition: Correla un'opera alla persona responsabile della committenza di un'opera. @it
toolkit label: committente persona @it
toolkit definition: Persona responsabile della committenza di un'opera. @it
label: a pour personne commanditaire @fr
definition: Met une œuvre en relation avec une personne qui est responsable de la commande d’une œuvre. @fr
toolkit label: personne commanditaire @fr
toolkit definition: Personne qui est responsable de la commande d’une œuvre. @fr
label: pasūtītājs (persona) @lv
definition: Sasaista darbu ar personu, kura ir atbildīga par darba pasūtīšanu. @lv
toolkit label: pasūtītājs (persona) @lv
toolkit definition: Persona, kura ir atbildīga par darba pasūtīšanu. @lv
label: 有委托个人 @zh-hans
definition: 将一种作品与负责委托一种作品的一个个人关联起来。 @zh-hans
toolkit label: 委托个人 @zh-hans
toolkit definition: 负责委托一种作品的一个个人 @zh-hans
has subproperty: P10439
label: görevlendiren kişi ile ilişkilidir @tr
definition: Bir eseri, eseri görevlendirmekten sorumlu olan bir kişiye ilişkilendirir. @tr
toolkit label: görevlendiren kişi @tr
toolkit definition: Bir eseri görevlendirmeden sorumlu kişi. @tr

has compiler agent
status: Published
definition: Relates a work to an agent who is responsible for creating a metadata description set.
type: Property
domain: C10001
lexical alias: compilerAgent.en
toolkit label: compiler agent
toolkit definition: An agent who is responsible for creating a metadata description set.
toolkit label: agent compilateur @fr
toolkit definition: Agent qui est responsable de la création d’un ensemble de métadonnées descriptives. @fr
toolkit label: compilador @es
toolkit definition: Una persona, familia o entidad corporativa responsable de la creación de una nueva obra (por ej., una bibliografía, un directorio) seleccionando, arreglando, agregando y editando datos, información, etc. @es
scope note: A metadata description set includes a bibliography of works, expressions, or manifestations, a directory of agents and places, and an analytic finding aid.
see also: P20048
instruction number: 18.5
label: har agent, som er kompilator @da
definition: Relaterer et værk til en agent, som er ansvarlig for at skabe et nyt værk, såsom en bibliografi eller en fortegnelse, ved at udvælge, arrangere, samle og redigere data, information etc. @da
scope note: Revidering eller klarlægning af indholdet af et udtryk af et værk, og udvælgelse og sammensætning af udtryk for værker eller dele af værker, er ikke omfattet. @da
toolkit label: agent, som er kompilator @da
toolkit definition: Agent, som er ansvarlig for at skabe et nyt værk, såsom en bibliografi eller en fortegnelse, ved at udvælge, arrangere, samle og redigere data, information etc. @da
definition: Met une œuvre en relation avec un agent qui est responsable de la création d’un ensemble de métadonnées descriptives. @fr
label: có người biên soạn @vi
definition: Liên kết tác phẩm với tác nhân có trách nhiệm tạo lập tác phẩm mới như là thư mục hoặc danh bạ bằng cách lựa chọn, sắp xếp, tập hợp, và biên tập dữ liệu, thông tin, v.v... @vi
scope note: Sửa lại hoặc làm rõ nội dung, hoặc lưa chọn và kết hợp lại các tác phẩm hoặc phần của tác phẩm, bởi một hoặc nhiều hơn người sáng tạo, được bao gồm @vi
toolkit label: người biên soạn @vi
toolkit definition: Tác nhân có trách nhiệm tạo lập tác phẩm mới như là thư mục hoặc danh bạ bằng cách lựa chọn, sắp xếp, tập hợp, và biên tập dữ liệu, thông tin, v.v... @vi
label: hat Zusammenstellende/Zusammenstellenden (Akteur) @de
definition: Setzt ein Werk in Beziehung zu einem Akteur, der durch Selektieren, Gliedern, Aggregieren und Editieren von Daten und Informationen und so weiter für die Schaffung eines neuen Werks, zum Beispiel einer Bibliografie oder eines Verzeichnisses, verantwortlich ist. @de
scope note: Darunter fallen keine Überarbeitungen oder Erläuterungen des Inhalts einer Expression eines Werks und die Auswahl und Zusammenstellung von Expressionen von Werken oder Teilen von Werken. @de
toolkit label: Zusammenstellende/Zusammenstellender (Akteur) @de
toolkit definition: Ein Akteur, der durch Selektieren, Gliedern, Aggregieren und Editieren von Daten und Informationen und so weiter für die Schaffung eines neuen Werks, zum Beispiel einer Bibliografie oder eines Verzeichnisses, verantwortlich ist. @de
label: a pour agent compilateur @fr
definition: Liittää teoksen toimijaan, joka on vastuussa uuden teoksen, kuten bibliografian tai hakemiston luomisesta valitsemalla, järjestämällä, koostamalla ja toimittamalla dataa, informaatiota tms. @fi
toolkit label: kokoaja (toimija) @fi
toolkit definition: Toimija, joka on vastuussa uuden teoksen, kuten bibliografian tai hakemiston luomisesta valitsemalla, järjestämällä, koostamalla ja toimittamalla dataa, informaatiota tms. @fi
toolkit label: utarbeider (agent) @no
toolkit definition: En agent som er ansvarlig for å skape et nytt verk som en bibliografi eller katalog ved å velge ut, arrangere, samle og redigere data, informasjon, etc. @no
label: té com a agent compilador @ca
definition: Relaciona una obra amb un agent que és responsable de la creació d’un conjunt de descripció de metadades. @ca
scope note: Un conjunt de descripció de metadades inclou una bibliografia d’obres, expressions o manifestacions, un directori d’agents i llocs, i un instrument de descripció analític. @ca
toolkit label: agent compilador @ca
toolkit definition: Un agent que és responsable de la creació d’un conjunt de descripció de metadades. @ca
scope note: Un ensemble de métadonnées descriptives comprend une bibliographie d’œuvres, d’expressions ou de manifestations, un répertoire d’agents et de lieux ainsi qu’un instrument de recherche analytique. @fr
has element type: 2
label: έχει συμπιλητή @el
definition: Συνδέει ένα έργο με έναν φορέα υπεύθυνο για τη δημιουργία ενός νέου έργου, όπως μιας βιβλιογραφίας ή ενός οδηγού μέσω της επιλογής, της οργάνωσης, της συλλογής και της επιμέλειας δεδομένων, πληροφοριών κ.λπ. @el
scope note: Δεν περιλαμβάνεται η αναθεώρηση ή η αποσαφήνιση του περιεχομένου ή η επιλογή και η συγκέντρωση έργων ή μερών ενός έργου από έναν ή περισσότερους δημιουργούς. @el
toolkit label: συμπιλητής @el
toolkit definition: Ένας φορέας υπεύθυνος για τη δημιουργία ενός νέου έργου, όπως μιας βιβλιογραφίας ή ενός οδηγού μέσω της επιλογής, της οργάνωσης, της συλλογής και της επιμέλειας δεδομένων, πληροφοριών κ.λπ. @el
label: összeállító ágense a következő: @hu
definition: Hozzákapcsol egy művet egy ágenshez, amely adatok, információk stb. kiválasztása, elrendezése, aggregálása és szerkesztése révén felelős egy olyan új mű létrehozásáért, mint például egy bibliográfia vagy adattár. @hu
scope note: összeállító: @hu
toolkit label: összeállító ágens: @hu
toolkit definition: Egy ágens, amely adatok, információk stb. kiválasztása, elrendezése, aggregálása és szerkesztése révén felelős egy olyan új mű létrehozásáért, mint például egy bibliográfia vagy adattár. @hu
alternative label: compiler
scope note: Toimija, joka on vastuussa uuden teoksen, kuten bibliografian tai luettelon luomisesta valitsemalla, järjestämällä, koostamalla ja toimittamalla dataa, informaatiota tms. @fi
alternative label: kokoaja @fi
label: kokoaja (toimija) @fi
label: har utarbeider (agent) @no
definition: Relaterer et verk til en agent som er ansvarlig for å skape et nytt verk som en bibliografi eller katalog ved å velge ut, arrangere, samle og redigere data, informasjon, etc. @no
scope note: Det å redigere innholdet i et uttrykk av et verk eller gjøre det klarere, eller velge ut og kombinere uttrykk av et verk eller deler av et verk, er ikke inkludert. @no
alternative label: utarbeider @no
label: heeft samensteller-actor @nl
definition: Relateert een werk aan een actor die verantwoordelijk is voor het creëren van een nieuw werk zoals een bibliografie of een adresboek door selecteren, arrangeren, verzamelen en redigeren van data, informatie etc. @nl
scope note: Het herzien of toelichten van de content van een expressie van een werk en het selecteren en bundelen van expressies van werken of delen van werken is uitgesloten. @nl
toolkit label: samensteller-actor @nl
toolkit definition: Een actor die verantwoordelijk is voor het creëren van een nieuw werk zoals een bibliografie of een adresboek door selecteren, arrangeren, verzamelen en redigeren van data, informatie etc. @nl
label: له وكيل مجمع @ar
definition: يربط بين عمل ووكيل مسئول عن إنشاء عمل جديد مثل ببليوجرافية أو دليل عن طريق اختيار البيانات والمعلومات، وترتيبها، وتجميعها، وتحريرها، إلخ. @ar
scope note: تُستبعد مراجعة محتوى تعبيرة لعمل أو توضيحه واختيار تعبيرات عن الأعمال أو أجزاء من الأعمال وتجميعها. @ar
alternative label: جامع @ar
toolkit label: وكيل جامع @ar
toolkit definition: وكيل مسؤول عن إنشاء عمل جديد مثل ببليوجرافية أو دليل عن طريق اختيار البيانات والمعلومات، وترتيبها، وتجميعها، وتحريرها، إلخ. @ar
alternative label: compilador @ca
alternative label: kompilator @da
label: koostaja (tegija) @et
definition: Seostab teose tegijaga, kes vastutab uue teose, nt bibliograafia või teatmiku loomise eest, valides, korrastades, koondades ja toimetades andmeid, infot jms. @et
scope note: Ei hõlma teose väljenduse sisu läbivaatamist ja parandamist ega teoste või nende osade väljenduste väljavalimist ja kokkupanemist. @et
alternative label: koostaja @et
toolkit label: koostaja (tegija) @et

has compiler collective agent
status: Published
lexical alias: compilerCollectiveAgent.en
definition: Relates a work to a collective agent who is responsible for creating a metadata description set.
toolkit label: compiler collective agent
toolkit definition: A collective agent who is responsible for creating a metadata description set.
type: Property
domain: C10001
has element type: 2
sub property of: has compiler agent
scope note: A metadata description set includes a bibliography of works, expressions, or manifestations, a directory of agents and places, and an analytic finding aid.
label: kokoaja (yhteistoimija) @fi
definition: Liittää teoksen yhteistoimijaan, joka on vastuussa uuden teoksen, kuten bibliografian tai hakemiston luomisesta valitsemalla, järjestämällä, koostamalla ja toimittamalla dataa, informaatiota tms. @fi
scope note: Ei kata teoksen ekspression sisällön muokkaamista tai selkeyttämistä eikä teosten tai teosten osien valitsemista ja kokoamista yhteen. @fi
toolkit label: kokoaja (yhteistoimija) @fi
toolkit definition: Yhteistoimija, joka on vastuussa uuden teoksen, kuten bibliografian tai hakemiston luomisesta valitsemalla, järjestämällä, koostamalla ja toimittamalla dataa, informaatiota tms. @fi
label: har utarbeider (kollektiv agent) @no
definition: Relaterer et verk til en kollektiv agent som er ansvarlig for å skape et nytt verk som en bibliografi eller katalog ved å velge ut, arrangere, samle og redigere data, informasjon, etc. @no
scope note: Det å redigere innholdet i et uttrykk av et verk eller gjøre det klarere, eller velge ut og kombinere uttrykk av et verk eller deler av et verk, er ikke inkludert. @no
toolkit label: utarbeider (kollektiv agent) @no
toolkit definition: En kollektiv agent som er ansvarlig for å skape et nytt verk som en bibliografi eller katalog ved å velge ut, arrangere, samle og redigere data, informasjon, etc. @no
label: heeft samensteller-collectieve actor @nl
definition: Relateert een werk aan een collectieve actor die verantwoordelijk is voor het creëren van een nieuw werk zoals een bibliografie of een adresboek door selecteren, arrangeren, verzamelen en redigeren van data, informatie etc. @nl
scope note: Het herzien of toelichten van de content van een expressie van een werk en het selecteren en bundelen van expressies van werken of delen van werken is uitgesloten. @nl
toolkit label: samensteller-collectieve actor @nl
toolkit definition: Een collectieve actor die verantwoordelijk is voor het creëren van een nieuw werk zoals een bibliografie of een adresboek door selecteren, arrangeren, verzamelen en redigeren van data, informatie etc. @nl
label: له وكيل جماعي جامع @ar
definition: يربط بين عمل ووكيل جماعي مسئول عن إنشاء عمل جديد مثل ببليوجرافية أو دليل عن طريق اختيار البيانات والمعلومات، وترتيبها، وتجميعها، وتحريرها، إلخ. @ar
scope note: تُستبعد مراجعة محتوى تعبيرة لعمل أو توضيحه واختيار تعبيرات عن الأعمال أو أجزاء من الأعمال وتجميعها. @ar
toolkit label: وكيل جماعي جامع @ar
toolkit definition: وكيل جماعي مسئول عن إنشاء عمل جديد مثل ببليوجرافية أو دليل عن طريق اختيار البيانات والمعلومات، وترتيبها، وتجميعها، وتحريرها، إلخ. @ar
label: té com a agent col·lectiu compilador @ca
definition: Relaciona una obra amb un agent col·lectiu que és responsable de la creació d’un conjunt de descripció de metadades. @ca
scope note: Un conjunt de descripció de metadades inclou una bibliografia d’obres, expressions o manifestacions, un directori d’agents i llocs, i un instrument de descripció analític. @ca
toolkit label: agent col·lectiu compilador @ca
toolkit definition: Agent col·lectiu que és responsable de la creació d’un conjunt de descripció de metadades. @ca
label: har kollektiv agent, som er kompilator @da
definition: Relaterer et værk til en kollektiv agent, som er ansvarlig for at skabe et nyt værk, såsom en bibliografi eller en fortegnelse, ved at udvælge, arrangere, samle og redigere data, information etc. @da
scope note: Revidering eller klarlægning af indholdet af et udtryk af et værk, og udvælgelse og sammensætning af udtryk for værker eller dele af værker, er ikke omfattet. @da
toolkit label: kollektiv agent, som er kompilator @da
toolkit definition: Kollektiv agent, som er ansvarlig for at skabe et nyt værk, såsom en bibliografi eller en fortegnelse, ved at udvælge, arrangere, samle og redigere data, information etc. @da
label: koostaja (kollektiiv) @et
definition: Seostab teose kollektiiviga, kes vastutab uue teose, nt bibliograafia või teatmiku loomise eest, valides, korrastades, koondades ja toimetades andmeid, infot jms. @et
scope note: Ei hõlma teose väljenduse sisu läbivaatamist ja parandamist ega teoste või nende osade väljenduste väljavalimist ja kokkupanemist. @et
toolkit label: koostaja (kollektiiv) @et
toolkit definition: Kollektiiv, kes vastutab uue teose, nt bibliograafia või teatmiku loomise eest, valides, korrastades, koondades ja toimetades andmeid, infot jms. @et
label: hat Zusammenstellende/Zusammenstellenden (Gemeinschaftlicher Akteur) @de
definition: Setzt ein Werk in Beziehung zu einem gemeinschaftlichen Akteur, der durch Selektieren, Gliedern, Aggregieren und Editieren von Daten und Informationen und so weiter für die Schaffung eines neuen Werks, zum Beispiel einer Bibliografie oder eines Verzeichnisses, verantwortlich ist. @de
scope note: Darunter fallen keine Überarbeitungen oder Erläuterungen des Inhalts einer Expression eines Werks und die Auswahl und Zusammenstellung von Expressionen von Werken oder Teilen von Werken. @de
toolkit label: Zusammenstellende/Zusammenstellender (Gemeinschaftlicher Akteur) @de
toolkit definition: Ein gemeinschaftlicher Akteur, der durch Selektieren, Gliedern, Aggregieren und Editieren von Daten und Informationen und so weiter für die Schaffung eines neuen Werks, zum Beispiel einer Bibliografie oder eines Verzeichnisses, verantwortlich ist. @de
label: összeállító kollektív ágense a következő: @hu
definition: Hozzákapcsol egy művet egy kollektív ágenshez, amely adatok, információk stb. kiválasztása, elrendezése, aggregálása és szerkesztése révén felelős egy olyan új mű létrehozásáért, mint például egy bibliográfia vagy adattár. @hu
scope note: Nem tartozik ide sem egy mű kifejezési formájának tartalmi felülvizsgálata vagy tisztázása, sem a művek vagy műrészek kifejezési formáinak kiválasztása és összeállítása. @hu
toolkit label: összeállító kollektív ágens: @hu
toolkit definition: Egy kollektív ágens, amely adatok, információk stb. kiválasztása, elrendezése, aggregálása és szerkesztése révén felelős egy olyan új mű létrehozásáért, mint például egy bibliográfia vagy adattár. @hu
label: ha come compilatore agente collettivo @it
definition: Correla un'opera a un agente collettivo responsabile della creazione di una nuova opera come una bibliografia o un repertorio, tramite la la selezione, organizzazione, aggregazione e cura di dati, informazioni, etc. @it
scope note: Sono esclusi la revisione o il chiarimento del contenuto di un'espressione di un'opera, e la selezione e raccolta di espressioni di opere o parti di opere. @it
toolkit label: compilatore agente collettivo @it
toolkit definition: Agente collettivo responsabile della creazione di una nuova opera, come una bibliografia o un repertorio, tramite la selezione, organizzazione, aggregazione e cura di dati, informazioni, etc. @it
label: a pour agent collectif compilateur @fr
definition: Met une œuvre en relation avec un agent collectif qui est responsable de la création d’un ensemble de métadonnées descriptives. @fr
scope note: Un ensemble de métadonnées descriptives comprend une bibliographie d’œuvres, d’expressions ou de manifestations, un répertoire d’agents et de lieux ainsi qu’un instrument de recherche analytique. @fr
toolkit label: agent collectif compilateur @fr
toolkit definition: Agent collectif qui est responsable de la création d’un ensemble de métadonnées descriptives. @fr
sub property of: has aggregator collective agent
label: sastādītājs (grupa) @lv
definition: Sasaista darbu ar grupu, kas ir atbildīga par jauna darba, piemēram, bibliogrāfijas vai rādītāja izveidi, izvēloties, sakārtojot, apkopojot un rediģējot datus, informāciju, u.tml. @lv
toolkit label: sastādītājs (grupa) @lv
toolkit definition: Grupa, kas ir atbildīga par jauna darba, piemēram, bibliogrāfijas vai rādītāja izveidi, izvēloties, sakārtojot, apkopojot un rediģējot datus, informāciju, u.tml. @lv
scope note: Neietver satura pārskatīšanu vai precizēšanu, vai viena vai vairāku radītāju darbu vai to daļu atlasi vai apvienošanu. @lv
label: 有编纂者集体行为者 @zh-hans
definition: 将一种作品与负责创建一个元数据描述集的一个集体行为者关联起来。 @zh-hans
toolkit label: 编纂者集体行为者 @zh-hans
toolkit definition: 负责创建一个元数据描述集的一个集体行为者 @zh-hans
scope note: 元数据描述集包括作品、内容表达、或载体表现的书目、行为者和地点的名录、以及分析查询工具。 @zh-hans
has subproperty: has compiler corporate body
has subproperty: has compiler family
has subproperty: has collection registrar collective agent

has compiler corporate body
status: Published
lexical alias: compilerCorporateBody.en
definition: Relates a work to a corporate body who is responsible for creating a metadata description set.
toolkit label: compiler corporate body
toolkit definition: A corporate body who is responsible for creating a metadata description set.
type: Property
domain: C10001
has element type: 2
sub property of: has compiler collective agent
scope note: A metadata description set includes a bibliography of works, expressions, or manifestations, a directory of agents and places, and an analytic finding aid.
label: kokoaja (yhteisö) @fi
definition: Liittää teoksen yhteisöön, joka on vastuussa uuden teoksen, kuten bibliografian tai hakemiston luomisesta valitsemalla, järjestämällä, koostamalla ja toimittamalla dataa, informaatiota tms. @fi
scope note: Ei kata teoksen ekspression sisällön muokkaamista tai selkeyttämistä eikä teosten tai teosten osien valitsemista ja kokoamista yhteen. @fi
toolkit label: kokoaja (yhteisö) @fi
toolkit definition: Yhteisö, joka on vastuussa uuden teoksen, kuten bibliografian tai hakemiston luomisesta valitsemalla, järjestämällä, koostamalla ja toimittamalla dataa, informaatiota tms. @fi
label: har utarbeider (korporasjon) @no
definition: Relaterer et verk til en korporasjon som er ansvarlig for å skape et nytt verk som en bibliografi eller katalog ved å velge ut, arrangere, samle og redigere data, informasjon, etc. @no
scope note: Det å redigere innholdet i et uttrykk av et verk eller gjøre det klarere, eller velge ut og kombinere uttrykk av et verk eller deler av et verk, er ikke inkludert. @no
toolkit label: utarbeider (korporasjon) @no
toolkit definition: En korporasjon som er ansvarlig for å skape et nytt verk som en bibliografi eller katalog ved å velge ut, arrangere, samle og redigere data, informasjon, etc. @no
label: heeft samensteller-corporatie @nl
definition: Relateert een werk aan een corporatie die verantwoordelijk is voor het creëren van een nieuw werk zoals een bibliografie of een adresboek door selecteren, arrangeren, verzamelen en redigeren van data, informatie etc. @nl
scope note: Het herzien of toelichten van de content van een expressie van een werk en het selecteren en bundelen van expressies van werken of delen van werken is uitgesloten. @nl
toolkit label: samensteller-corporatie @nl
toolkit definition: Een corporatie die verantwoordelijk is voor het creëren van een nieuw werk zoals een bibliografie of een adresboek door selecteren, arrangeren, verzamelen en redigeren van data, informatie etc. @nl
label: له هيئة جامعة @ar
definition: يربط بين عمل وهيئة تكون مسئولة عن إنشاء عمل جديد مثل ببليوجرافية أو دليل عن طريق اختيار البيانات والمعلومات، وترتيبها، وتجميعها، وتحريرها، إلخ. @ar
scope note: تُستبعد مراجعة محتوى تعبيرة لعمل أو توضيحه واختيار تعبيرات عن أعمال أو أجزاء من أعمال وتجميعها. @ar
toolkit label: هيئة جامعة @ar
toolkit definition: هيئة تكون مسئولة عن إنشاء عمل جديد مثل ببليوجرافية أو دليل عن طريق اختيار البيانات والمعلومات، وترتيبها، وتجميعها، وتحريرها، إلخ. @ar
label: té com a entitat corporativa compiladora @ca
definition: Relaciona una obra amb una entitat corporativa que és responsable de la creació d’un conjunt de descripció de metadades. @ca
scope note: Un conjunt de descripció de metadades inclou una bibliografia d’obres, expressions o manifestacions, un directori d’agents i llocs, i un instrument de descripció analític. @ca
toolkit label: entitat corporativa compiladora @ca
toolkit definition: Entitat corporativa que és responsable de la creació d’un conjunt de descripció de metadades. @ca
label: har korporation, som er kompilator @da
definition: Relaterer et værk til en korporation, som er ansvarlig for at skabe et nyt værk, såsom en bibliografi eller en fortegnelse, ved at udvælge, arrangere, samle og redigere data, information etc. @da
scope note: Revidering eller klarlægning af indholdet af et udtryk af et værk, og udvælgelse og sammensætning af udtryk for værker eller dele af værker, er ikke omfattet. @da
toolkit label: korporation, som er kompilator @da
toolkit definition: Korporation, som er ansvarlig for at skabe et nyt værk, såsom en bibliografi eller en fortegnelse, ved at udvælge, arrangere, samle og redigere data, information etc. @da
label: koostaja (asutus) @et
definition: Seostab teose asutusega, kes vastutab uue teose, nt bibliograafia või teatmiku loomise eest, valides, korrastades, koondades ja toimetades andmeid, infot jms. @et
scope note: Ei hõlma teose väljenduse sisu läbivaatamist ja parandamist ega teoste või nende osade väljenduste väljavalimist ja kokkupanemist. @et
toolkit label: koostaja (asutus) @et
toolkit definition: Asutus, kes vastutab uue teose, nt bibliograafia või teatmiku loomise eest, valides, korrastades, koondades ja toimetades andmeid, infot jms. @et
label: hat Zusammenstellende/Zusammenstellenden (Körperschaft) @de
definition: Setzt ein Werk in Beziehung zu einer Körperschaft, die durch Selektieren, Gliedern, Aggregieren und Editieren von Daten und Informationen und so weiter für die Schaffung eines neuen Werks, zum Beispiel einer Bibliografie oder eines Verzeichnisses, verantwortlich ist. @de
scope note: Darunter fallen keine Überarbeitungen oder Erläuterungen des Inhalts einer Expression eines Werks und die Auswahl und Zusammenstellung von Expressionen von Werken oder Teilen von Werken. @de
toolkit label: Zusammenstellende/Zusammenstellender (Körperschaft) @de
toolkit definition: Eine Körperschaft, die durch Selektieren, Gliedern, Aggregieren und Editieren von Daten und Informationen und so weiter für die Schaffung eines neuen Werks, zum Beispiel einer Bibliografie oder eines Verzeichnisses, verantwortlich ist. @de
label: összeállító testülete a következő: @hu
definition: Hozzákapcsol egy művet egy testülethez, amely adatok, információk stb. kiválasztása, elrendezése, aggregálása és szerkesztése révén felelős egy olyan új mű létrehozásáért, mint például egy bibliográfia vagy adattár. @hu
scope note: Nem tartozik ide sem egy mű kifejezési formájának tartalmi felülvizsgálata vagy tisztázása, sem a művek vagy műrészek kifejezési formáinak kiválasztása és összeállítása. @hu
toolkit label: összeállító testület: @hu
toolkit definition: Egy testület, amely adatok, információk stb. kiválasztása, elrendezése, aggregálása és szerkesztése révén felelős egy olyan új mű létrehozásáért, mint például egy bibliográfia vagy adattár. @hu
label: ha come compilatore ente @it
definition: Correla un'opera a un ente responsabile della creazione di una nuova opera, come una bibliografia o un repertorio, tramite la selezione, organizzazione, aggregazione e cura di dati, informazioni, etc. @it
scope note: Sono esclusi la revisione o il chiarimento del contenuto di un'espressione di un'opera, e la selezione e raccolta di espressioni di opere o parti di opere. @it
toolkit label: compilatore ente @it
toolkit definition: Ente responsabile della creazione di una nuova opera, come una bibliografia o un repertorio, tramite la selezione, organizzazione, aggregazione e cura di dati, informazioni, etc. @it
label: a pour collectivité compilatrice @fr
definition: Met une œuvre en relation avec une collectivité qui est responsable de la création d’un ensemble de métadonnées descriptives. @fr
scope note: Un ensemble de métadonnées descriptives comprend une bibliographie d’œuvres, d’expressions ou de manifestations, un répertoire d’agents et de lieux ainsi qu’un instrument de recherche analytique. @fr
toolkit label: collectivité compilatrice @fr
toolkit definition: Collectivité qui est responsable de la création d’un ensemble de métadonnées descriptives. @fr
sub property of: has aggregator corporate body
label: sastādītājs (institūcija) @lv
definition: Sasaista darbu ar institūciju, kas ir atbildīga par jauna darba, piemēram, bibliogrāfijas vai rādītāja izveidi, izvēloties, sakārtojot, apkopojot un rediģējot datus, informāciju, u.tml. @lv
toolkit label: sastādītājs (institūcija) @lv
toolkit definition: Institūcija, kas ir atbildīga par jauna darba, piemēram, bibliogrāfijas vai rādītāja izveidi, izvēloties, sakārtojot, apkopojot un rediģējot datus, informāciju, u.tml. @lv
scope note: Neietver satura pārskatīšanu vai precizēšanu, vai viena vai vairāku radītāju darbu vai to daļu atlasi vai apvienošanu. @lv
label: 有编纂者团体 @zh-hans
definition: 将一种作品与负责创建一个元数据描述集的一个团体关联起来。 @zh-hans
toolkit label: 编纂者团体 @zh-hans
toolkit definition: 负责创建一个元数据描述集的一个团体 @zh-hans
scope note: 元数据描述集包括作品、内容表达、或载体表现的书目、行为者和地点的名录、以及分析查询工具。 @zh-hans
has subproperty: has collection registrar corporate body
has subproperty: P10538
label: derleyici tüzel kişi ile ilişkilidir @tr

has compiler family
status: Published
lexical alias: compilerFamily.en
definition: Relates a work to a family who is responsible for creating a metadata description set.
toolkit label: compiler family
toolkit definition: A family who is responsible for creating a metadata description set.
type: Property
domain: C10001
has element type: 2
sub property of: has compiler collective agent
scope note: A metadata description set includes a bibliography of works, expressions, or manifestations, a directory of agents and places, and an analytic finding aid.
label: kokoaja (suku) @fi
definition: Liittää teoksen sukuun, joka on vastuussa uuden teoksen, kuten bibliografian tai hakemiston luomisesta valitsemalla, järjestämällä, koostamalla ja toimittamalla dataa, informaatiota tms. @fi
scope note: Ei kata teoksen ekspression sisällön muokkaamista tai selkeyttämistä eikä teosten tai teosten osien valitsemista ja kokoamista yhteen. @fi
toolkit label: kokoaja (suku) @fi
toolkit definition: Suku, joka on vastuussa uuden teoksen, kuten bibliografian tai hakemiston luomisesta valitsemalla, järjestämällä, koostamalla ja toimittamalla dataa, informaatiota tms. @fi
label: har utarbeider (familie) @no
definition: Relaterer et verk til en familie som er ansvarlig for å skape et nytt verk som en bibliografi eller katalog ved å velge ut, arrangere, samle og redigere data, informasjon, etc. @no
scope note: Det å redigere innholdet i et uttrykk av et verk eller gjøre det klarere, eller velge ut og kombinere uttrykk av et verk eller deler av et verk, er ikke inkludert. @no
toolkit label: utarbeider (familie) @no
toolkit definition: En familie som er ansvarlig for å skape et nytt verk som en bibliografi eller katalog ved å velge ut, arrangere, samle og redigere data, informasjon, etc. @no
label: heeft samensteller-familie @nl
definition: Relateert een werk aan een familie die verantwoordelijk is voor het creëren van een nieuw werk zoals een bibliografie of een adresboek door selecteren, arrangeren, verzamelen en redigeren van data, informatie etc. @nl
scope note: Het herzien of toelichten van de content van een expressie van een werk en het selecteren en bundelen van expressies van werken of delen van werken is uitgesloten. @nl
toolkit label: samensteller-familie @nl
toolkit definition: Een familie die verantwoordelijk is voor het creëren van een nieuw werk zoals een bibliografie of een adresboek door selecteren, arrangeren, verzamelen en redigeren van data, informatie etc. @nl
label: له عائلة جامعة @ar
definition: يربط بين عمل وعائلة مسئولة عن إنشاء عمل جديد مثل ببليوجرافية أو دليل عن طريق اختيار البيانات والمعلومات، وترتيبها، وتجميعها، وتحريرها، إلخ. @ar
scope note: تُستبعد مراجعة محتوى تعبيرة لعمل أو توضيحه واختيار تعبيرات عن أعمال أو أجزاء من أعمال وتجميعها. @ar
toolkit label: عائلة جامعة @ar
toolkit definition: عائلة مسئولة عن إنشاء عمل جديد مثل ببليوجرافية أو دليل عن طريق اختيار البيانات والمعلومات، وترتيبها، وتجميعها، وتحريرها، إلخ. @ar
label: té com a família compiladora @ca
definition: Relaciona una obra amb una família que és responsable de la creació d’un conjunt de descripció de metadades. @ca
scope note: Un conjunt de descripció de metadades inclou una bibliografia d’obres, expressions o manifestacions, un directori d’agents i llocs, i un instrument de descripció analític. @ca
toolkit label: família compiladora @ca
toolkit definition: Família que és responsable de la creació d’un conjunt de descripció de metadades. @ca
label: har familie, som er kompilator @da
definition: Relaterer et værk til en familie, som er ansvarlig for at skabe et nyt værk, såsom en bibliografi eller en fortegnelse, ved at udvælge, arrangere, samle og redigere data, information etc. @da
scope note: Revidering eller klarlægning af indholdet af et udtryk af et værk, og udvælgelse og sammensætning af udtryk for værker eller dele af værker, er ikke omfattet. @da
toolkit label: familie, som er kompilator @da
toolkit definition: Familie, som er ansvarlig for at skabe et nyt værk, såsom en bibliografi eller en fortegnelse, ved at udvælge, arrangere, samle og redigere data, information etc. @da
label: koostaja (perekond) @et
definition: Seostab teose perekonnaga, kes vastutab uue teose, nt bibliograafia või teatmiku loomise eest, valides, korrastades, koondades ja toimetades andmeid, infot jms. @et
scope note: Ei hõlma teose väljenduse sisu läbivaatamist ja parandamist ega teoste või nende osade väljenduste väljavalimist ja kokkupanemist. @et
toolkit label: koostaja (perekond) @et
toolkit definition: Perekond, kes vastutab uue teose, nt bibliograafia või teatmiku loomise eest, valides, korrastades, koondades ja toimetades andmeid, infot jms. @et
label: hat Zusammenstellende/Zusammenstellenden (Familie) @de
definition: Setzt ein Werk in Beziehung zu einer Familie, die durch Selektieren, Gliedern, Aggregieren und Editieren von Daten und Informationen und so weiter für die Schaffung eines neuen Werks, zum Beispiel einer Bibliografie oder eines Verzeichnisses, verantwortlich ist. @de
scope note: Darunter fallen keine Überarbeitungen oder Erläuterungen des Inhalts einer Expression eines Werks und die Auswahl und Zusammenstellung von Expressionen von Werken oder Teilen von Werken. @de
toolkit label: Zusammenstellende/Zusammenstellender (Familie) @de
toolkit definition: Eine Familie, die durch Selektieren, Gliedern, Aggregieren und Editieren von Daten und Informationen und so weiter für die Schaffung eines neuen Werks, zum Beispiel einer Bibliografie oder eines Verzeichnisses, verantwortlich ist. @de
label: összeállító családja a következő: @hu
definition: Hozzákapcsol egy művet egy családhoz, amely adatok, információk stb. kiválasztása, elrendezése, aggregálása és szerkesztése révén felelős egy olyan új mű létrehozásáért, mint például egy bibliográfia vagy adattár. @hu
scope note: Nem tartozik ide sem egy mű kifejezési formájának tartalmi felülvizsgálata vagy tisztázása, sem a művek vagy műrészek kifejezési formáinak kiválasztása és összeállítása. @hu
toolkit label: összeállító család: @hu
toolkit definition: Egy család, amely adatok, információk stb. kiválasztása, elrendezése, aggregálása és szerkesztése révén felelős egy olyan új mű létrehozásáért, mint például egy bibliográfia vagy adattár. @hu
label: ha come compilatore famiglia @it
definition: Correla un'opera alla famiglia responsabile della creazione di una nuova opera, come una bibliografia o un repertorio, tramite la selezione, organizzazione, aggregazione e cura di dati, informazioni, etc. @it
scope note: Sono esclusi la revisione o il chiarimento del contenuto di un'espressione di un'opera, e la selezione e raccolta di espressioni di opere o parti di opere. @it
toolkit label: compilatore famiglia @it
toolkit definition: Famiglia responsabile della creazione di una nuova opera, come una bibliografia o un repertorio, tramite la selezione, organizzazione, aggregazione e cura di dati, informazioni, etc. @it
label: a pour famille compilatrice @fr
definition: Met une œuvre en relation avec une famille qui est responsable de la création d’un ensemble de métadonnées descriptives. @fr
scope note: Un ensemble de métadonnées descriptives comprend une bibliographie d’œuvres, d’expressions ou de manifestations, un répertoire d’agents et de lieux ainsi qu’un instrument de recherche analytique. @fr
toolkit label: famille compilatrice @fr
toolkit definition: Famille qui est responsable de la création d’un ensemble de métadonnées descriptives. @fr
sub property of: has aggregator family
label: sastādītājs (dzimta/ģimene) @lv
definition: Sasaista darbu ar dzimtu/ģimeni, kas ir atbildīga par jauna darba, piemēram, bibliogrāfijas vai rādītāja izveidi, izvēloties, sakārtojot, apkopojot un rediģējot datus, informāciju, u.tml. @lv
toolkit label: sastādītājs (dzimta/ģimene) @lv
toolkit definition: Dzimta/ģimene, kas ir atbildīga par jauna darba, piemēram, bibliogrāfijas vai rādītāja izveidi, izvēloties, sakārtojot, apkopojot un rediģējot datus, informāciju, u.tml. @lv
scope note: Neietver satura pārskatīšanu vai precizēšanu, vai viena vai vairāku radītāju darbu vai to daļu atlasi vai apvienošanu. @lv
label: 有编纂者家族 @zh-hans
definition: 将一种作品与负责创建一个元数据描述集的一个家族关联起来。 @zh-hans
toolkit label: 编纂者家族 @zh-hans
toolkit definition: 负责创建一个元数据描述集的一个家族 @zh-hans
scope note: 元数据描述集包括作品、内容表达、或载体表现的书目、行为者和地点的名录、以及分析查询工具。 @zh-hans
has subproperty: has collection registrar family
has subproperty: P10585
label: derleyen aile ile ilişkilidir @tr

has compiler person
status: Published
lexical alias: compilerPerson.en
definition: Relates a work to a person who is responsible for creating a metadata description set.
toolkit label: compiler person
toolkit definition: A person who is responsible for creating a metadata description set.
type: Property
domain: C10001
has element type: 2
sub property of: has compiler agent
scope note: A metadata description set includes a bibliography of works, expressions, or manifestations, a directory of agents and places, and an analytic finding aid.
label: kokoaja (henkilö) @fi
definition: Liittää teoksen henkilöön, joka on vastuussa uuden teoksen, kuten bibliografian tai hakemiston luomisesta valitsemalla, järjestämällä, koostamalla ja toimittamalla dataa, informaatiota tms. @fi
scope note: Ei kata teoksen ekspression sisällön muokkaamista tai selkeyttämistä eikä teosten tai teosten osien valitsemista ja kokoamista yhteen. @fi
toolkit label: kokoaja (henkilö) @fi
toolkit definition: Henkilö, joka on vastuussa uuden teoksen, kuten bibliografian tai hakemiston luomisesta valitsemalla, järjestämällä, koostamalla ja toimittamalla dataa, informaatiota tms. @fi
label: har utarbeider (person) @no
definition: Relaterer et verk til en person som er ansvarlig for å skape et nytt verk som en bibliografi eller katalog ved å velge ut, arrangere, samle og redigere data, informasjon, etc. @no
scope note: Det å redigere innholdet i et uttrykk av et verk eller gjøre det klarere, eller velge ut og kombinere uttrykk av et verk eller deler av et verk, er ikke inkludert. @no
toolkit label: utarbeider (person) @no
toolkit definition: En person som er ansvarlig for å skape et nytt verk som en bibliografi eller katalog ved å velge ut, arrangere, samle og redigere data, informasjon, etc. @no
label: heeft samensteller-persoon @nl
definition: Relateert een werk aan een persoon die verantwoordelijk is voor het creëren van een nieuw werk zoals een bibliografie of een adresboek door selecteren, arrangeren, verzamelen en redigeren van data, informatie etc. @nl
scope note: Het herzien of toelichten van de content van een expressie van een werk en het selecteren en bundelen van expressies van werken of delen van werken is uitgesloten. @nl
toolkit label: samensteller-persoon @nl
toolkit definition: Een persoon die verantwoordelijk is voor het creëren van een nieuw werk zoals een bibliografie of een adresboek door selecteren, arrangeren, verzamelen en redigeren van data, informatie etc. @nl
label: له شخص جامع @ar
definition: يربط بين عمل وشخص مسئول عن إنشاء عمل جديد مثل ببليوجرافية أو دليل عن طريق اختيار البيانات والمعلومات، وترتيبها، وتجميعها، وتحريرها، إلخ. @ar
scope note: تُستبعد مراجعة محتوى تعبيرة لعمل أو توضيحه واختيار تعبيرات عن الأعمال أو أجزاء من الأعمال وتجميعها. @ar
toolkit label: شخص جامع @ar
toolkit definition: شخص يكون مسئولاً عن إنشاء عمل جديد مثل ببليوجرافية أو دليل عن طريق اختيار البيانات والمعلومات، وترتيبها، وتجميعها، وتحريرها، إلخ. @ar
label: té com a persona compiladora @ca
definition: Relaciona una obra amb una persona que és responsable de la creació d’un conjunt de descripció de metadades. @ca
scope note: Un conjunt de descripció de metadades inclou una bibliografia d’obres, expressions o manifestacions, un directori d’agents i llocs, i un instrument de descripció analític. @ca
toolkit label: persona compiladora @ca
toolkit definition: Persona que és responsable de la creació d’un conjunt de descripció de metadades. @ca
label: har person, som er kompilator @da
definition: Relaterer et værk til en person, som er ansvarlig for at skabe et nyt værk, såsom en bibliografi eller en fortegnelse, ved at udvælge, arrangere, samle og redigere data, information etc. @da
scope note: Revidering eller klarlægning af indholdet af et udtryk af et værk, og udvælgelse og sammensætning af udtryk for værker eller dele af værker, er ikke omfattet. @da
toolkit label: person, som er kompilator @da
toolkit definition: Person, som er ansvarlig for at skabe et nyt værk, såsom en bibliografi eller en fortegnelse, ved at udvælge, arrangere, samle og redigere data, information etc. @da
label: koostaja (isik) @et
definition: Seostab teose isikuga, kes vastutab uue teose, nt bibliograafia või teatmiku loomise eest, valides, korrastades, koondades ja toimetades andmeid, infot jms. @et
scope note: Ei hõlma teose väljenduse sisu läbivaatamist ja parandamist ega teoste või nende osade väljenduste väljavalimist ja kokkupanemist. @et
toolkit label: koostaja (isik) @et
toolkit definition: Isik, kes vastutab uue teose, nt bibliograafia või teatmiku loomise eest, valides, korrastades, koondades ja toimetades andmeid, infot jms. @et
label: hat Zusammenstellende/Zusammenstellenden (Person) @de
definition: Setzt ein Werk in Beziehung zu einer Person, die durch Selektieren, Gliedern, Aggregieren und Editieren von Daten und Informationen und so weiter für die Schaffung eines neuen Werks, zum Beispiel einer Bibliografie oder eines Verzeichnisses, verantwortlich ist. @de
scope note: Darunter fallen keine Überarbeitungen oder Erläuterungen des Inhalts einer Expression eines Werks und die Auswahl und Zusammenstellung von Expressionen von Werken oder Teilen von Werken. @de
toolkit label: Zusammenstellende/Zusammenstellender (Person) @de
toolkit definition: Eine Person, die durch Selektieren, Gliedern, Aggregieren und Editieren von Daten und Informationen und so weiter für die Schaffung eines neuen Werks, zum Beispiel einer Bibliografie oder eines Verzeichnisses, verantwortlich ist. @de
label: összeállító személye a következő: @hu
definition: Hozzákapcsol egy művet egy személyhez, aki adatok, információk stb. kiválasztása, elrendezése, aggregálása és szerkesztése révén felelős egy olyan új mű létrehozásáért, mint például egy bibliográfia vagy adattár. @hu
scope note: Nem tartozik ide sem egy mű kifejezési formájának tartalmi felülvizsgálata vagy tisztázása, sem a művek vagy műrészek kifejezési formáinak kiválasztása és összeállítása. @hu
toolkit label: összeállító személy: @hu
toolkit definition: Egy személy, aki adatok, információk stb. kiválasztása, elrendezése, összeállítása és szerkesztése révén felelős egy olyan új mű létrehozásáért, mint például egy bibliográfia vagy adattár. @hu
label: ha come compilatore persona @it
definition: Correla un'opera alla persona responsabile della creazione di una nuova opera come una bibliografia o un repertorio, tramite selezione, organizzazione, aggregazione e cura di dati, informazioni, etc. @it
scope note: Sono esclusi la revisione o il chiarimento del contenuto di un'espressione di un'opera, e la selezione e raccolta di espressioni di opere o parti di opere. @it
toolkit label: compilatore persona @it
toolkit definition: Persona responsabile della creazione di una nuova opera, come una bibliografia o un repertorio, tramite la selezione, organizzazione, aggregazione e cura di dati, informazioni, etc. @it
label: a pour personne compilatrice @fr
definition: Met une œuvre en relation avec une personne qui est responsable de la création d’un ensemble de métadonnées descriptives. @fr
scope note: Un ensemble de métadonnées descriptives comprend une bibliographie d’œuvres, d’expressions ou de manifestations, un répertoire d’agents et de lieux ainsi qu’un instrument de recherche analytique. @fr
toolkit label: personne compilatrice @fr
toolkit definition: Personne qui est responsable de la création d’un ensemble de métadonnées descriptives. @fr
sub property of: has aggregator person
label: sastādītājs (persona) @lv
definition: Sasaista darbu ar personu, kura ir atbildīga par jauna darba, piemēram, bibliogrāfijas vai rādītāja izveidi, izvēloties, sakārtojot, apkopojot un rediģējot datus, informāciju, u.tml. @lv
toolkit label: sastādītājs (persona) @lv
toolkit definition: Persona, kura ir atbildīga par jauna darba, piemēram, bibliogrāfijas vai rādītāja izveidi, izvēloties, sakārtojot, apkopojot un rediģējot datus, informāciju, u.tml. @lv
scope note: Neietver satura pārskatīšanu vai precizēšanu, vai viena vai vairāku radītāju darbu vai to daļu atlasi vai apvienošanu. @lv
label: 有编纂者个人 @zh-hans
definition: 将一种作品与负责创建一个元数据描述集的一个个人关联起来。 @zh-hans
toolkit label: 编纂者个人 @zh-hans
toolkit definition: 负责创建一个元数据描述集的一个个人 @zh-hans
scope note: 元数据描述集包括作品、内容表达、或载体表现的书目、行为者和地点的名录、以及分析查询工具。 @zh-hans
has subproperty: has collection registrar person
has subproperty: P10444
label: derleyen kişi ile ilişkilidir @tr

has composer agent of work
status: Published
definition: Relates a work to an agent who is responsible for creating a musical work.
type: Property
domain: C10001
sub property of: has creator agent of work
lexical alias: composerAgentOfWork.en
toolkit label: composer agent of work
toolkit definition: An agent who is responsible for creating a musical work.
toolkit label: agent compositeur d’une œuvre @fr
toolkit definition: Agent qui est responsable de la création d’une œuvre musicale. @fr
toolkit label: compositor @es
toolkit definition: Una persona, familia o entidad corporativa responsable de la creación de una obra musical. @es
scope note: Adaptation of another musical work to form a distinct alteration, paraphrasing a work or creating a work in the general style of another composer, or creating a work that is based on the music of another composer, is included.
instruction number: 18.5
label: har agent, som er komponist af værk @da
definition: Relaterer et værk til en agent, som er ansvarlig for at skabe et musikværk. @da
scope note: Bearbejdninger af et andet musikværk for at danne en distinkt forandring ved at parafrasere et værk eller skabe et værk i en anden komponists typiske stil, eller skabe et værk, der er baseret på en anden komponists musik, er omfattet. @da
toolkit label: agent, som er komponist af værk @da
toolkit definition: Agent, som er ansvarlig for at skabe et musikværk. @da
definition: Met une œuvre en relation avec un agent qui est responsable de la création d’une œuvre musicale. @fr
label: có người soạn @vi
definition: Liên kết tác phẩm với tác nhân có trách nhiệm tạo lập tác phẩm âm nhạc. @vi
scope note: Phỏng theo tác phẩm âm nhạc khác thành hình thái sửa đổi riêng, diễn giải tác phẩm hoặc tạo lập tác phẩm với phong cách chung của người soạn khác, hoặc tạo lập tác phẩm dựa trên âm nhạc của người soạn khác, được bao gồm. @vi
toolkit label: người soạn @vi
toolkit definition: Tác nhân có trách nhiệm tạo lập tác phẩm âm nhạc. @vi
label: hat Komponistin/Komponisten eines Werks (Akteur) @de
definition: Setzt ein Werk in Beziehung zu einem Akteur, der für die Schaffung eines Musikwerks verantwortlich ist. @de
scope note: Darunter fallen Adaptionen anderer Musikwerke, die sich deutlich vom Original unterscheiden, Paraphrasierungen von Werken oder Schaffungen neuer Werke im Stil einer anderen Komponistin/eines anderen Komponisten oder Schaffungen von Werken, die auf der Musik einer anderen Komponistin/eines anderen Komponisten basieren. @de
toolkit label: Komponistin/Komponist eines Werks (Akteur) @de
toolkit definition: Ein Akteur, der für die Schaffung eines Musikwerks verantwortlich ist. @de
label: a pour agent compositeur d’une œuvre @fr
definition: Liittää teoksen toimijaan, joka on vastuussa musiikkiteoksen luomisesta. @fi
toolkit label: teoksen säveltäjä (toimija) @fi
toolkit definition: Toimija, joka on vastuussa musiikkiteoksen luomisesta. @fi
toolkit label: komponist for verk (agent) @no
toolkit definition: En agent som er ansvarlig for å skape et musikalsk verk. @no
label: té com a agent compositor d’una obra @ca
definition: Relaciona una obra amb un agent que és responsable de la creació d’una obra musical. @ca
scope note: Inclou una adaptació d’una altra obra musical per formar una alteració distinta parafrasejant una obra o creant una obra en l’estil general d’un altre compositor o creant una obra que es basa en la música d’un altre compositor. @ca
toolkit label: agent compositor d’una obra @ca
toolkit definition: Agent que és responsable de la creació d’una obra musical. @ca
scope note: Le fait d’adapter une autre œuvre musicale pour constituer une modification distincte, de paraphraser une œuvre ou de créer une œuvre dans le style général d’un autre compositeur, ou bien de créer une œuvre d’après la musique d’un autre compositeur est inclus. @fr
has element type: 2
label: έχει συνθέτη @el
definition: Συνδέει ένα έργο με έναν φορέα υπεύθυνο για τη δημιουργία ενός μουσικού έργου. @el
scope note: Περιλαμβάνεται η προσαρμογή ενός άλλου μουσικού έργου για να αποτελέσει μια διακριτή μεταβολή, η παράφραση ενός έργου ή η δημιουργία ενός έργου στο γενικό ύφος ενός άλλου συνθέτη ή η δημιουργία ενός έργου που βασίζεται στη μουσική ενός άλλου συνθέτη. @el
toolkit label: συνθέτης @el
toolkit definition: Ένας φορέας υπεύθυνος για τη δημιουργία ενός μουσικού έργου. @el
label: mű zeneszerző ágense a következő: @hu
definition: Hozzákapcsol egy művet egy ágenshez, amely felelős egy zenemű megalkotásáért. @hu
scope note: zeneszerző: @hu
toolkit label: mű zeneszerző ágense: @hu
toolkit definition: Egy ágens, amely felelős egy mű létrehozásáért. @hu
alternative label: composer
scope note: Kattaa selvän muunnoksen muodostamiseksi tehdyn toisen musiikkiteoksen mukaelman, teoksen parafraasin tai teoksen luomisen toisen säveltäjän yleisen tyylin mukaisesti tai toisen säveltäjän musiikkiin perustuvan teoksen luomisen. @fi
alternative label: teoksen säveltäjä @fi
label: teoksen säveltäjä (toimija) @fi
label: har komponist for verk (agent) @no
definition: Relaterer et verk til en agent som er ansvarlig for å skape et musikalsk verk. @no
scope note: Bearbeidelse av et annet musikalsk verk som utgjør en klar endring, omskriving av et verk eller det å skape et verk med samme generelle stil som en annen komponists arbeid, eller det å skape et verk som er basert på en annen komponists musikk, er inkludert. @no
alternative label: komponist for verk @no
label: heeft componist-actor van werk @nl
definition: Relateert een werk aan een actor die verantwoordelijk is voor het creëren van een muziekwerk. @nl
scope note: Bewerken van een ander muziekwerk om een onderscheidende aanpassing te vormen, een werk te parafraseren of een werk te creëren in de algemene stijl van een andere componist, of een werk te creëren dat gebaseerd is op de muziek van een andere componist is inbegrepen. @nl
toolkit label: componist-actor van werk @nl
toolkit definition: Een actor die verantwoordelijk is voor het creëren van een muziekwerk. @nl
label: له وكيل ملحن لعمل @ar
definition: يربط بين عمل ووكيل مسؤول عن إنشاء عمل موسيقي. @ar
scope note: يتم تضمين تكييف عمل موسيقي آخر لتشكيل تغيير مميز، أو إعادة صياغة عمل أو إنشاء عمل بالأسلوب العام لمؤلف موسيقي آخر، أو إنشاء عمل يعتمد على موسيقى ملحن آخر. @ar
alternative label: ملحن @ar
toolkit label: وكيل ملحن عمل @ar
toolkit definition: وكيل مسؤول عن إنشاء عمل موسيقي. @ar
alternative label: compositor @ca
alternative label: komponist af værk @da
label: teose helilooja (tegija) @et
definition: Seostab teose tegijaga, kes vastutab muusikateose loomise eest. @et
scope note: Hõlmab ka teise muusikateose adapteerimist selgelt eristuvaks uueks teoseks, teose parafraseerimist või teise helilooja stiilis teose komponeerimist, samuti teise helilooja muusikal põhineva teose loomist. @et
alternative label: teose helilooja @et
toolkit label: teose helilooja (tegija) @et

has composer collective agent of work
status: Published
lexical alias: composerCollectiveAgentOfWork.en
definition: Relates a work to a collective agent who is responsible for creating a musical work.
toolkit label: composer collective agent of work
toolkit definition: A collective agent who is responsible for creating a musical work.
type: Property
domain: C10001
has element type: 2
sub property of: has creator collective agent of work
sub property of: has composer agent of work
scope note: Adaptation of another musical work to form a distinct alteration, paraphrasing a work or creating a work in the general style of another composer, or creating a work that is based on the music of another composer, is included.
label: teoksen säveltäjä (yhteistoimija) @fi
definition: Liittää teoksen yhteistoimijaan, joka on vastuussa musiikkiteoksen luomisesta. @fi
scope note: Kattaa selvän muunnoksen muodostamiseksi tehdyn toisen musiikkiteoksen mukaelman, teoksen parafraasin tai teoksen luomisen toisen säveltäjän yleisen tyylin mukaisesti tai toisen säveltäjän musiikkiin perustuvan teoksen luomisen. @fi
toolkit label: teoksen säveltäjä (yhteistoimija) @fi
toolkit definition: Yhteistoimija, joka on vastuussa musiikkiteoksen luomisesta. @fi
label: har komponist for verk (kollektiv agent) @no
definition: Relaterer et verk til en kollektiv agent som er ansvarlig for å skape et musikalsk verk. @no
scope note: Bearbeidelse av et annet musikalsk verk som utgjør en klar endring, omskriving av et verk eller det å skape et verk med samme generelle stil som en annen komponists arbeid, eller det å skape et verk som er basert på en annen komponists musikk, er inkludert. @no
toolkit label: komponist for verk (kollektiv agent) @no
toolkit definition: En kollektiv agent som er ansvarlig for å skape et musikalsk verk. @no
label: heeft componist-collectieve actor werk @nl
definition: Relateert een werk aan een collectieve actor die verantwoordelijk is voor het creëren van een muziekwerk. @nl
scope note: Bewerken van een ander muziekwerk om een onderscheidende aanpassing te vormen, een werk te parafraseren of een werk te creëren in de algemene stijl van een andere componist, of een werk te creëren dat gebaseerd is op de muziek van een andere componist is inbegrepen. @nl
toolkit label: componist-collectieve actor werk @nl
toolkit definition: Een collectieve actor die verantwoordelijk is voor het creëren van een muziekwerk. @nl
label: له وكيل جماعي ملحن لعمل @ar
definition: يربط بين عمل ووكيل جماعي مسئول عن إنشاء عمل موسيقي. @ar
scope note: يتم تضمين تكييف عمل موسيقي آخر لعمل تغيير مميز، أو إعادة صياغة عمل أو إنشاء عمل بالأسلوب العام لمؤلف موسيقي آخر، أو إنشاء عمل مبني على موسيقى ملحن آخر. @ar
toolkit label: وكيل جماعي ملحن لعمل @ar
toolkit definition: وكيل جماعي مسئول عن إنشاء عمل موسيقي. @ar
label: té com a agent col·lectiu compositor d’una obra @ca
definition: Relaciona una obra amb un agent col·lectiu que és responsable de la creació d’una obra musical. @ca
scope note: Inclou una adaptació d’una altra obra musical per formar una alteració distinta parafrasejant una obra o creant una obra en l’estil general d’un altre compositor o creant una obra que es basa en la música d’un altre compositor. @ca
toolkit label: agent col·lectiu compositor d’una obra @ca
toolkit definition: Agent col·lectiu que és responsable de la creació d’una obra musical. @ca
label: har kollektiv agent, som er komponist af værk @da
definition: Relaterer et værk til en kollektiv agent, som er ansvarlig for at skabe et musikværk. @da
scope note: Bearbejdninger af et andet musikværk for at danne en distinkt forandring ved at parafrasere et værk eller skabe et værk i en anden komponists typiske stil, eller skabe et værk, der er baseret på en anden komponists musik, er omfattet. @da
toolkit label: kollektiv agent, som er komponist af værk @da
toolkit definition: Kollektiv agent, som er ansvarlig for at skabe et musikværk. @da
label: teose helilooja (kollektiiv) @et
definition: Seostab teose kollektiiviga, kes vastutab muusikateose loomise eest. @et
scope note: Hõlmab ka teise muusikateose adapteerimist selgelt eristuvaks uueks teoseks, teose parafraseerimist või teise helilooja stiilis teose komponeerimist, samuti teise helilooja muusikal põhineva teose loomist. @et
toolkit label: teose helilooja (kollektiiv) @et
toolkit definition: Kollektiiv, kes vastutab muusikateose loomise eest. @et
label: hat Komponistin/Komponisten eines Werks (Gemeinschaftlicher Akteur) @de
definition: Setzt ein Werk in Beziehung zu einem gemeinschaftlichen Akteur, der für die Schaffung eines Musikwerks verantwortlich ist. @de
scope note: Darunter fallen Adaptionen anderer Musikwerke, die sich deutlich vom Original unterscheiden, Paraphrasierungen von Werken oder Schaffungen neuer Werke im Stil einer anderen Komponistin/eines anderen Komponisten oder Schaffungen von Werken, die auf der Musik einer anderen Komponistin/eines anderen Komponisten basieren. @de
toolkit label: Komponistin/Komponist eines Werks (Gemeinschaftlicher Akteur) @de
toolkit definition: Ein gemeinschaftlicher Akteur, der für die Schaffung eines Musikwerks verantwortlich ist. @de
label: mű zeneszerző kollektív ágense a következő: @hu
definition: Hozzákapcsol egy művet egy kollektív ágenshez, amely felelős egy zenemű létrehozásáért. @hu
scope note: Beletartozik egy másik zenemű adaptálása egy eltérő alterációs formára, egy mű parafrazeálása, vagy egy mű megalkotása egy másik zeneszerző általános stílusában, vagy egy olyan mű megalkotása, amely egy másik zeneszerző zenéjén alapul. @hu
toolkit label: mű zeneszerző kollektív ágense: @hu
toolkit definition: Egy kollektív ágens, amely felelős egy zenemű létrehozásáért. @hu
label: ha come compositore agente collettivo di opera @it
definition: Correla un'opera all'agente collettivo responsabile della creazione di un'opera musicale. @it
scope note: E' compreso l'adattamento di altra opera musicale per costituire una variazione distinta, tramite la parafrasi di un'opera o la creazione di un'opera nello stile tipico di un altro compositore, o tramite la creazione di un'opera basata sulla musica di un altro compositore. @it
toolkit label: compositore agente collettivo di opera @it
toolkit definition: Agente collettivo responsabile della creazione di un'opera musicale. @it
label: a pour agent collectif compositeur d’une œuvre @fr
definition: Met une œuvre en relation avec un agent collectif qui est responsable de la création d’une œuvre musicale. @fr
scope note: Le fait d’adapter une autre œuvre musicale pour constituer une modification distincte, de paraphraser une œuvre ou de créer une œuvre dans le style général d’un autre compositeur, ou bien de créer une œuvre d’après la musique d’un autre compositeur est inclus. @fr
toolkit label: agent collectif compositeur d’une œuvre @fr
toolkit definition: Agent collectif qui est responsable de la création d’une œuvre musicale. @fr
label: darba komponists (grupa) @lv
definition: Sasaista darbu ar grupu, kas ir atbildīga par mūzikas darba radīšanu. @lv
toolkit label: darba komponists (grupa) @lv
toolkit definition: Grupa, kas ir atbildīga par mūzikas darba radīšanu. @lv
scope note: Tiek iekļauta cita muzikāla darba pielāgošana/adaptācija, lai izveidotu izmaiņas, pārfrāzējot darbu vai radot darbu cita komponista vispārējā stilā vai radot darbu, kas balstās uz cita komponista mūziku. @lv
label: 有作品的作曲者集体行为者 @zh-hans
definition: 将一种作品与负责创建一种音乐作品的一个集体行为者关联起来。 @zh-hans
toolkit label: 作品的作曲者集体行为者 @zh-hans
toolkit definition: 负责创建一种音乐作品的一个集体行为者 @zh-hans
scope note: 包括将另一种音乐作品改编以形成一种不同的变化形式、将一种作品演绎或用另一个作曲者的一般风格创建一种新的作品、或者基于另一个作曲者的音乐创建一种新的作品。 @zh-hans
has subproperty: has composer corporate body of work
has subproperty: has composer family of work
has subproperty: P10489

has composer corporate body of work
status: Published
lexical alias: composerCorporateBodyOfWork.en
definition: Relates a work to a corporate body who is responsible for creating a musical work.
toolkit label: composer corporate body of work
toolkit definition: A corporate body who is responsible for creating a musical work.
type: Property
domain: C10001
has element type: 2
sub property of: has creator corporate body of work
sub property of: has composer collective agent of work
scope note: Adaptation of another musical work to form a distinct alteration, paraphrasing a work or creating a work in the general style of another composer, or creating a work that is based on the music of another composer, is included.
label: teoksen säveltäjä (yhteisö) @fi
definition: Liittää teoksen yhteisöön, joka on vastuussa musiikkiteoksen luomisesta. @fi
scope note: Kattaa selvän muunnoksen muodostamiseksi tehdyn toisen musiikkiteoksen mukaelman, teoksen parafraasin tai teoksen luomisen toisen säveltäjän yleisen tyylin mukaisesti tai toisen säveltäjän musiikkiin perustuvan teoksen luomisen. @fi
toolkit label: teoksen säveltäjä (yhteisö) @fi
toolkit definition: Yhteisö, joka on vastuussa musiikkiteoksen luomisesta. @fi
label: har komponist for verk (korporasjon) @no
definition: Relaterer et verk til en korporasjon som er ansvarlig for å skape et musikalsk verk. @no
scope note: Bearbeidelse av et annet musikalsk verk som utgjør en klar endring, omskriving av et verk eller det å skape et verk med samme generelle stil som en annen komponists arbeid, eller det å skape et verk som er basert på en annen komponists musikk, er inkludert. @no
toolkit label: komponist for verk (korporasjon) @no
toolkit definition: En korporasjon som er ansvarlig for å skape et musikalsk verk. @no
label: heeft componist-corporatie werk @nl
definition: Relateert een werk aan een corporatie die verantwoordelijk is voor het creëren van een muziekwerk. @nl
scope note: Bewerken van een ander muziekwerk om een onderscheidende aanpassing te vormen, een werk te parafraseren of een werk te creëren in de algemene stijl van een andere componist, of een werk te creëren dat gebaseerd is op de muziek van een andere componist is inbegrepen. @nl
toolkit label: componist-corporatie werk @nl
toolkit definition: Een corporatie die verantwoordelijk is voor het creëren van een muziekwerk. @nl
label: له هيئة ملحنة عمل @ar
definition: يربط بين عمل وهيئة مسئولة عن إنشاء عمل موسيقي. @ar
scope note: يتم تضمين تكييف عمل موسيقي آخر لعمل تغيير مميز، أو إعادة صياغة عمل أو إنشاء عمل بالأسلوب العام لمؤلف موسيقي آخر، أو إنشاء عمل مبني على موسيقى ملحن آخر. @ar
toolkit label: هيئة ملحنة عمل @ar
toolkit definition: هيئة مسئولة عن إنشاء عمل موسيقي. @ar
label: té com a entitat corporativa compositora d’una obra @ca
definition: Relaciona una obra amb una entitat corporativa que és responsable de la creació d’una obra musical. @ca
scope note: Inclou una adaptació d’una altra obra musical per formar una alteració distinta parafrasejant una obra o creant una obra en l’estil general d’un altre compositor o creant una obra que es basa en la música d’un altre compositor. @ca
toolkit label: entitat corporativa compositora d’una obra @ca
toolkit definition: Entitat corporativa que és responsable de la creació d’una obra musical. @ca
label: har korporation, som er komponist af værk @da
definition: Relaterer et værk til en korporation, som er ansvarlig for at skabe et musikværk. @da
scope note: Bearbejdninger af et andet musikværk for at danne en distinkt forandring ved at parafrasere et værk eller skabe et værk i en anden komponists typiske stil, eller skabe et værk, der er baseret på en anden komponists musik, er omfattet. @da
toolkit label: korporation, som er komponist af værk @da
toolkit definition: Korporation, som er ansvarlig for at skabe et musikværk. @da
label: teose helilooja (asutus) @et
definition: Seostab teose asutusega, kes vastutab muusikateose loomise eest. @et
scope note: Hõlmab ka teise muusikateose adapteerimist selgelt eristuvaks uueks teoseks, teose parafraseerimist või teise helilooja stiilis teose komponeerimist, samuti teise helilooja muusikal põhineva teose loomist. @et
toolkit label: teose helilooja (asutus) @et
toolkit definition: Asutus, kes vastutab muusikateose loomise eest. @et
label: hat Komponistin/Komponisten eines Werks (Körperschaft) @de
definition: Setzt ein Werk in Beziehung zu einer Körperschaft, die für die Schaffung eines Musikwerks verantwortlich ist. @de
scope note: Darunter fallen Adaptionen anderer Musikwerke, die sich deutlich vom Original unterscheiden, Paraphrasierungen von Werken oder Schaffungen neuer Werke im Stil einer anderen Komponistin/eines anderen Komponisten oder Schaffungen von Werken, die auf der Musik einer anderen Komponistin/eines anderen Komponisten basieren. @de
toolkit label: Komponistin/Komponist eines Werks (Körperschaft) @de
toolkit definition: Eine Körperschaft, die für die Schaffung eines Musikwerks verantwortlich ist. @de
label: mű zeneszerző testülete a következő: @hu
definition: Hozzákapcsol egy művet egy testülethez, amely felelős egy zenemű létrehozásáért. @hu
scope note: Beletartozik egy másik zenemű adaptálása egy eltérő alterációs formára, egy mű parafrazeálása, vagy egy mű megalkotása egy másik zeneszerző általános stílusában, vagy egy olyan mű megalkotása, amely egy másik zeneszerző zenéjén alapul. @hu
toolkit label: mű zeneszerző testülete: @hu
toolkit definition: Egy testület, amely felelős egy zenemű létrehozásáért. @hu
label: ha come compositore di opera ente @it
definition: Correla un'opera a un ente responsabile della creazione di un'opera musicale. @it
scope note: E' compreso l'adattamento di altra opera musicale per costituire una variazione distinta, tramite la parafrasi di un'opera o la creazione di un'opera nello stile tipico di un altro compositore, o tramite la creazione di un'opera basata sulla musica di un altro compositore. @it
toolkit label: compositore ente di opera @it
toolkit definition: Ente responsabile della creazione di un'opera musicale. @it
label: a pour collectivité compositrice d’une œuvre @fr
definition: Met une œuvre en relation avec une collectivité qui est responsable de la création d’une œuvre musicale. @fr
scope note: Le fait d’adapter une autre œuvre musicale pour constituer une modification distincte, de paraphraser une œuvre ou de créer une œuvre dans le style général d’un autre compositeur, ou bien de créer une œuvre d’après la musique d’un autre compositeur est inclus. @fr
toolkit label: collectivité compositrice d’une œuvre @fr
toolkit definition: Collectivité qui est responsable de la création d’une œuvre musicale. @fr
label: darba komponists (institūcija) @lv
definition: Sasaista darbu ar institūciju, kas ir atbildīga par mūzikas darba radīšanu. @lv
toolkit label: darba komponists (institūcija) @lv
toolkit definition: Institūcija, kas ir atbildīga par mūzikas darba radīšanu. @lv
scope note: Tiek iekļauta cita muzikāla darba pielāgošana/adaptācija, lai izveidotu izmaiņas, pārfrāzējot darbu vai radot darbu cita komponista vispārējā stilā vai radot darbu, kas balstās uz cita komponista mūziku. @lv
label: 有作品的作曲者团体 @zh-hans
definition: 将一种作品与负责创建一种音乐作品的一个团体关联起来。 @zh-hans
toolkit label: 作品的作曲者团体 @zh-hans
toolkit definition: 负责创建一种音乐作品的一个团体 @zh-hans
scope note: 包括将另一种音乐作品改编以形成一种不同的变化形式、将一种作品演绎或用另一个作曲者的一般风格创建一种新的作品、或者基于另一个作曲者的音乐创建一种新的作品。 @zh-hans
has subproperty: P10536
label: eserin besteci tüzel kişisi ile ilişkilidir @tr
definition: Bir eseri, bir müzik eseri yaratmaktan sorumlu olan tüzel kişi ile ilişkilendirir. @tr

has composer family of work
status: Published
lexical alias: composerFamilyOfWork.en
definition: Relates a work to a family who is responsible for creating a musical work.
toolkit label: composer family of work
toolkit definition: A family who is responsible for creating a musical work.
type: Property
domain: C10001
has element type: 2
sub property of: has creator family of work
sub property of: has composer collective agent of work
scope note: Adaptation of another musical work to form a distinct alteration, paraphrasing a work or creating a work in the general style of another composer, or creating a work that is based on the music of another composer, is included.
label: teoksen säveltäjä (suku) @fi
definition: Liittää teoksen sukuun, joka on vastuussa musiikkiteoksen luomisesta. @fi
scope note: Kattaa selvän muunnoksen muodostamiseksi tehdyn toisen musiikkiteoksen mukaelman, teoksen parafraasin tai teoksen luomisen toisen säveltäjän yleisen tyylin mukaisesti tai toisen säveltäjän musiikkiin perustuvan teoksen luomisen. @fi
toolkit label: teoksen säveltäjä (suku) @fi
toolkit definition: Suku, joka on vastuussa musiikkiteoksen luomisesta. @fi
label: har komponist (familie) @no
definition: Relaterer et verk til en familie som er ansvarlig for å skape et musikalsk verk. @no
scope note: Bearbeidelse av et annet musikalsk verk som utgjør en klar endring, omskriving av et verk eller det å skape et verk med samme generelle stil som en annen komponists arbeid, eller det å skape et verk som er basert på en annen komponists musikk, er inkludert. @no
toolkit label: komponist (familie) @no
toolkit definition: En familie som er ansvarlig for å skape et musikalsk verk. @no
label: heeft componist-familie werk @nl
definition: Relateert een werk aan een familie die verantwoordelijk is voor het creëren van een muziekwerk. @nl
scope note: Bewerken van een ander muziekwerk om een onderscheidende aanpassing te vormen, een werk te parafraseren of een werk te creëren in de algemene stijl van een andere componist, of een werk te creëren dat gebaseerd is op de muziek van een andere componist is inbegrepen. @nl
toolkit label: componist-familie werk @nl
toolkit definition: Een familie die verantwoordelijk is voor het creëren van een muziekwerk. @nl
label: له عائلة ملحنة لعمل @ar
definition: يربط بين عمل وعائلة مسئولة عن إنشاء عمل موسيقي. @ar
scope note: يتم تضمين تكييف عمل موسيقي آخر لعمل تغيير مميز، أو إعادة صياغة عمل أو إنشاء عمل بالأسلوب العام لمؤلف موسيقي آخر، أو إنشاء عمل مبني على موسيقى ملحن آخر. @ar
toolkit label: عائلة ملحنة لعمل @ar
toolkit definition: عائلة مسئولة عن إنشاء عمل موسيقي. @ar
label: té com a família compositora d’una obra @ca
definition: Relaciona una obra amb una família que és responsable de la creació d’una obra musical. @ca
scope note: Inclou una adaptació d’una altra obra musical per formar una alteració distinta parafrasejant una obra o creant una obra en l’estil general d’un altre compositor o creant una obra que es basa en la música d’un altre compositor. @ca
toolkit label: família compositora d’una obra @ca
toolkit definition: Família que és responsable de la creació d’una obra musical. @ca
label: har familie, som er komponist af værk @da
definition: Relaterer et værk til en familie, som er ansvarlig for at skabe et musikværk. @da
scope note: Bearbejdninger af et andet musikværk for at danne en distinkt forandring ved at parafrasere et værk eller skabe et værk i en anden komponists typiske stil, eller skabe et værk, der er baseret på en anden komponists musik, er omfattet. @da
toolkit label: familie, som er komponist af værk @da
toolkit definition: Familie, som er ansvarlig for at skabe et musikværk. @da
label: teose helilooja (perekond) @et
definition: Seostab teose perekonnaga, kes vastutab muusikateose loomise eest. @et
scope note: Hõlmab ka teise muusikateose adapteerimist selgelt eristuvaks uueks teoseks, teose parafraseerimist või teise helilooja stiilis teose komponeerimist, samuti teise helilooja muusikal põhineva teose loomist. @et
toolkit label: teose helilooja (perekond) @et
toolkit definition: Perekond, kes vastutab muusikateose loomise eest. @et
label: hat Komponistin/Komponisten eines Werks (Familie) @de
definition: Setzt ein Werk in Beziehung zu einer Familie, die für die Schaffung eines Musikwerks verantwortlich ist. @de
scope note: Darunter fallen Adaptionen anderer Musikwerke, die sich deutlich vom Original unterscheiden, Paraphrasierungen von Werken oder Schaffungen neuer Werke im Stil einer anderen Komponistin/eines anderen Komponisten oder Schaffungen von Werken, die auf der Musik einer anderen Komponistin/eines anderen Komponisten basieren. @de
toolkit label: Komponistin/Komponist eines Werks (Familie) @de
toolkit definition: Eine Familie, die für die Schaffung eines Musikwerks verantwortlich ist. @de
label: mű zeneszerző családja a következő: @hu
definition: Hozzákapcsol egy művet egy családhoz, amely felelős egy zenemű létrehozásáért. @hu
scope note: Beletartozik egy másik zenemű adaptálása egy eltérő alterációs formára, egy mű parafrazeálása, vagy egy mű megalkotása egy másik zeneszerző általános stílusában, vagy egy olyan mű megalkotása, amely egy másik zeneszerző zenéjén alapul. @hu
toolkit label: mű zeneszerző családja: @hu
toolkit definition: Egy család, amely felelős egy zenemű létrehozásáért. @hu
label: ha come compositore famiglia di opera @it
definition: Correla un'opera alla famiglia responsabile della creazione di un'opera musicale. @it
scope note: E' compreso l'adattamento di altra opera musicale per costituire una variazione distinta, tramite la parafrasi di un'opera o la creazione di un'opera nello stile tipico di un altro compositore, o tramite la creazione di un'opera basata sulla musica di un altro compositore. @it
toolkit label: compositore famiglia di opera @it
toolkit definition: Famiglia responsabile della creazione di un'opera musicale. @it
label: a pour famille compositrice d’une œuvre @fr
definition: Met une œuvre en relation avec une famille qui est responsable de la création d’une œuvre musicale. @fr
scope note: Le fait d’adapter une autre œuvre musicale pour constituer une modification distincte, de paraphraser une œuvre ou de créer une œuvre dans le style général d’un autre compositeur, ou bien de créer une œuvre d’après la musique d’un autre compositeur est inclus. @fr
toolkit label: famille compositrice d’une œuvre @fr
toolkit definition: Famille qui est responsable de la création d’une œuvre musicale. @fr
label: darba komponists (dzimta/ģimene) @lv
definition: Sasaista darbu ar dzimtu/ģimeni, kas ir atbildīga par mūzikas darba radīšanu. @lv
toolkit label: darba komponists (dzimta/ģimene) @lv
toolkit definition: Dzimta/ģimene, kas ir atbildīga par mūzikas darba radīšanu. @lv
scope note: Tiek iekļauta cita muzikāla darba pielāgošana/adaptācija, lai izveidotu izmaiņas, pārfrāzējot darbu vai radot darbu cita komponista vispārējā stilā vai radot darbu, kas balstās uz cita komponista mūziku. @lv
label: 有作品的作曲者家族 @zh-hans
definition: 将一种作品与负责创建一种音乐作品的一个家族关联起来。 @zh-hans
toolkit label: 作品的作曲者家族 @zh-hans
toolkit definition: 负责创建一种音乐作品的一个家族 @zh-hans
scope note: 包括将另一种音乐作品改编以形成一种不同的变化形式、将一种作品演绎或用另一个作曲者的一般风格创建一种新的作品、或者基于另一个作曲者的音乐创建一种新的作品。 @zh-hans
has subproperty: P10583
label: eserin besteci ailesi ile ilişkilidir @tr
definition: Bir eseri, bir müzik çalışması oluşturmaktan sorumlu aileyle ilişkilendirir. @tr

has composer person of work
status: Published
lexical alias: composerPersonOfWork.en
definition: Relates a work to a person who is responsible for creating a musical work.
toolkit label: composer person of work
toolkit definition: A person who is responsible for creating a musical work.
type: Property
domain: C10001
has element type: 2
sub property of: has creator person of work
sub property of: has composer agent of work
scope note: Adaptation of another musical work to form a distinct alteration, paraphrasing a work or creating a work in the general style of another composer, or creating a work that is based on the music of another composer, is included.
label: teoksen säveltäjä (henkilö) @fi
definition: Liittää teoksen henkilöön, joka on vastuussa musiikkiteoksen luomisesta. @fi
scope note: Kattaa selvän muunnoksen muodostamiseksi tehdyn toisen musiikkiteoksen mukaelman, teoksen parafraasin tai teoksen luomisen toisen säveltäjän yleisen tyylin mukaisesti tai toisen säveltäjän musiikkiin perustuvan teoksen luomisen. @fi
toolkit label: teoksen säveltäjä (henkilö) @fi
toolkit definition: Henkilö, joka on vastuussa musiikkiteoksen luomisesta. @fi
label: har komponist for verk (person) @no
definition: Relaterer et verk til en person som er ansvarlig for å skape et musikalsk verk. @no
scope note: Bearbeidelse av et annet musikalsk verk som utgjør en klar endring, omskriving av et verk eller det å skape et verk med samme generelle stil som en annen komponists arbeid, eller det å skape et verk som er basert på en annen komponists musikk, er inkludert. @no
toolkit label: komponist for verk (person) @no
toolkit definition: En person som er ansvarlig for å skape et musikalsk verk. @no
label: heeft componist-persoon werk @nl
definition: Relateert een werk aan een persoon die verantwoordelijk is voor het creëren van een muziekwerk. @nl
scope note: Bewerken van een ander muziekwerk om een onderscheidende aanpassing te vormen, een werk te parafraseren of een werk te creëren in de algemene stijl van een andere componist, of een werk te creëren dat gebaseerd is op de muziek van een andere componist is inbegrepen. @nl
toolkit label: componist-persoon werk @nl
toolkit definition: Een persoon die verantwoordelijk is voor het creëren van een muziekwerk. @nl
label: له شخص ملحن لعمل @ar
definition: يربط بين عمل وشخص مسئول عن إنشاء عمل موسيقي. @ar
scope note: يتم تضمين تكييف عمل موسيقي آخر لعمل تغيير مميز، أو إعادة صياغة عمل أو إنشاء عمل بالأسلوب العام لمؤلف موسيقي آخر، أو إنشاء عمل مبني على موسيقى ملحن آخر. @ar
toolkit label: شخص ملحن لعمل @ar
toolkit definition: شخص يكون مسئولاً عن إنشاء عمل موسيقي. @ar
label: té com a persona compositora d’una obra @ca
definition: Relaciona una obra amb una persona que és responsable de la creació d’una obra musical. @ca
scope note: Inclou una adaptació d’una altra obra musical per formar una alteració distinta parafrasejant una obra o creant una obra en l’estil general d’un altre compositor o creant una obra que es basa en la música d’un altre compositor. @ca
toolkit label: persona compositora d’una obra @ca
toolkit definition: Persona que és responsable de la creació d’una obra musical. @ca
label: har person, som er komponist af værk @da
definition: Relaterer et værk til en person, som er ansvarlig for at skabe et musikværk. @da
scope note: Bearbejdninger af et andet musikværk for at danne en distinkt forandring ved at parafrasere et værk eller skabe et værk i en anden komponists typiske stil, eller skabe et værk, der er baseret på en anden komponists musik, er omfattet. @da
toolkit label: person, som er komponist af værk @da
toolkit definition: Person, som er ansvarlig for at skabe et musikværk. @da
label: teose helilooja (isik) @et
definition: Seostab teose isikuga, kes vastutab muusikateose loomise eest. @et
scope note: Hõlmab ka teise muusikateose adapteerimist selgelt eristuvaks uueks teoseks, teose parafraseerimist või teise helilooja stiilis teose komponeerimist, samuti teise helilooja muusikal põhineva teose loomist. @et
toolkit label: teose helilooja (isik) @et
toolkit definition: Isik, kes vastutab muusikateose loomise eest. @et
label: hat Komponistin/Komponisten eines Werks (Person) @de
definition: Setzt ein Werk in Beziehung zu einer Person, die für die Schaffung eines Musikwerks verantwortlich ist. @de
scope note: Darunter fallen Adaptionen anderer Musikwerke, die sich deutlich vom Original unterscheiden, Paraphrasierungen von Werken oder Schaffungen neuer Werke im Stil einer anderen Komponistin/eines anderen Komponisten oder Schaffungen von Werken, die auf der Musik einer anderen Komponistin/eines anderen Komponisten basieren. @de
toolkit label: Komponistin/Komponist eines Werks (Person) @de
toolkit definition: Eine Person, die für die Schaffung eines Musikwerks verantwortlich ist. @de
label: mű zeneszerző személye a következő: @hu
definition: Hozzákapcsol egy művet egy személyhez, aki felelős egy zenemű létrehozásáért. @hu
scope note: Beletartozik egy másik zenemű adaptálása egy eltérő alterációs formára, egy mű parafrazeálása, vagy egy mű megalkotása egy másik zeneszerző általános stílusában, vagy egy olyan mű megalkotása, amely egy másik zeneszerző zenéjén alapul. @hu
toolkit label: mű zeneszerző személye: @hu
toolkit definition: Egy személy, aki felelős egy zenemű létrehozásáért. @hu
label: ha come compositore persona di opera @it
definition: Correla un'opera alla persona responsabile della creazione di un'opera musicale. @it
scope note: E' compreso l'adattamento di altra opera musicale per costituire una variazione distinta, tramite la parafrasi di un'opera o la creazione di un'opera nello stile tipico di un altro compositore, o la creazione di un'opera basata sulla musica di un altro compositore. @it
toolkit label: compositore persona di opera @it
toolkit definition: Persona responsabile della creazione di un'opera musicale. @it
label: a pour personne compositrice d’une œuvre @fr
definition: Met une œuvre en relation avec une personne qui est responsable de la création d’une œuvre musicale. @fr
scope note: Le fait d’adapter une autre œuvre musicale pour constituer une modification distincte, de paraphraser une œuvre ou de créer une œuvre dans le style général d’un autre compositeur, ou bien de créer une œuvre d’après la musique d’un autre compositeur est inclus. @fr
toolkit label: personne compositrice d’une œuvre @fr
toolkit definition: Personne qui est responsable de la création d’une œuvre musicale. @fr
label: darba komponists (persona) @lv
definition: Sasaista darbu ar personu, kura ir atbildīga par mūzikas darba radīšanu. @lv
toolkit label: darba komponists (persona) @lv
toolkit definition: Persona, kura ir atbildīga par mūzikas darba radīšanu. @lv
scope note: Tiek iekļauta cita muzikāla darba pielāgošana/adaptācija, lai izveidotu izmaiņas, pārfrāzējot darbu vai radot darbu cita komponista vispārējā stilā vai radot darbu, kas balstās uz cita komponista mūziku. @lv
label: 有作品的作曲者个人 @zh-hans
definition: 将一种作品与负责创建一种音乐作品的一个个人关联起来。 @zh-hans
toolkit label: 作品的作曲者个人 @zh-hans
toolkit definition: 负责创建一种音乐作品的一个个人 @zh-hans
scope note: 包括将另一种音乐作品改编以形成一种不同的变化形式、将一种作品演绎或用另一个作曲者的一般风格创建一种新的作品、或者基于另一个作曲者的音乐创建一种新的作品。 @zh-hans
has subproperty: P10442
label: eserin bestecisi ile ilişkilidir @tr
definition: Bir eseri, bir müzik eseri oluşturmaktan sorumlu olan bir kişiyle ilişkilendirir. @tr

has consultant agent
status: Published
definition: Relates a work to an agent who provides consultation services, and often makes recommendations, for a related agent who is represented as a creator of a work.
type: Property
domain: C10001
sub property of: has creator agent of work
lexical alias: consultantAgent.en
toolkit label: consultant agent
toolkit definition: An agent who provides consultation services, and often makes recommendations, for a related agent who is represented as a creator of a work.
toolkit label: agent consultant @fr
toolkit definition: Agent qui fournit des services de consultation et fait souvent des recommandations à un agent en relation représenté comme créateur d’une œuvre. @fr
toolkit label: consultor @es
toolkit definition: Una persona, familia o entidad corporativa que proporciona servicios de consultoría, y que a menudo hace recomendaciones, a otra persona, familia o entidad corporativa que es representada como el creador de una obra. @es
instruction number: 18.5
label: har agent, som er rådgiver @da
definition: Relaterer et værk til en agent, som yder rådgivning, og ofte kommer med anbefalinger til en relateret agent, som er repræsenteret som ophav til et værk. @da
toolkit label: agent, som er rådgiver @da
toolkit definition: Agent, som yder rådgivning, og ofte kommer med anbefalinger til en relateret agent, som er repræsenteret som ophav til et værk. @da
definition: Met une œuvre en relation avec un agent qui fournit des services de consultation et fait souvent des recommandations à un agent en relation représenté comme créateur d’une œuvre. @fr
label: có người tư vấn @vi
definition: Liên kết tác phẩm với tác nhân cung cấp dịch vụ tư vấn, và thường đưa ra khuyến nghị, cho tác nhân khác người được nêu như là người sáng tạo của tác phẩm. @vi
toolkit label: người tư vấn @vi
toolkit definition: Tác nhân cung cấp dịch vụ tư vấn, và thường đưa ra khuyến nghị, cho tác nhân khác người được nêu như là người sáng tạo của tác phẩm. @vi
label: hat Beraterin/Berater (Akteur) @de
definition: Setzt ein Werk in Beziehung zu einem Akteur, der Beratungsdienste anbietet und häufig einem in Beziehung stehenden Akteur, der als geistiger Schöpfer eines Werks repräsentiert wird, Empfehlungen macht. @de
toolkit label: Beraterin/Berater (Akteur) @de
toolkit definition: Ein Akteur, der Beratungsdienste anbietet und häufig einem in Beziehung stehenden Akteur, der als geistiger Schöpfer eines Werks repräsentiert wird, Empfehlungen macht. @de
label: a pour agent consultant @fr
definition: Liittää teoksen toimijaan, joka tarjoaa asiantuntijapalveluita ja usein antaa suosituksia toimijalle, joka esiintyy teoksen tekijänä. @fi
toolkit label: asiantuntija (toimija) @fi
toolkit definition: Toimija, joka tarjoaa asiantuntijapalveluita ja usein antaa suosituksia toimijalle, joka esiintyy teoksen tekijänä. @fi
toolkit label: konsulent (agent) @no
toolkit definition: Det å skape et nytt verk ved å omskrive eller bearbeide verk av en annen opphaver er inkludert hvis dette i vesentlig grad har endret originalverkets særpreg og innhold, eller hvis mediet for uttrykket er endret. @no
label: té com a agent consultor @ca
definition: Relaciona una obra amb un agent que proporciona serveis d’assessorament, i que sovint fa recomanacions, a un agent relacionat que es representa com un creador d’una obra. @ca
toolkit label: agent consultor @ca
toolkit definition: Agent que proporciona serveis d’assessorament, i que sovint fa recomanacions, a un agent relacionat que es representa com un creador d’una obra. @ca
has element type: 2
label: έχει σύμβουλο @el
definition: Συνδέει ένα έργο με έναν φορέα που παρέχει υπηρεσίες συμβουλευτικής και συχνά κάνει συστάσεις σε κάποιον άλλον φορέα, ο οποίος αναπαρίσταται ως ο δημιουργός ενός έργου. @el
toolkit label: σύμβουλος @el
toolkit definition: Ένας φορέας που παρέχει υπηρεσίες συμβουλευτικής και συχνά κάνει συστάσεις σε κάποιον άλλον φορέα, ο οποίος αναπαρίσταται ως ο δημιουργός ενός έργου. @el
label: tanácsadó ágense a következő: @hu
definition: Hozzákapcsol egy művet egy ágenshez, amely tanácsadási szolgáltatásokat nyújt és gyakran javaslatokat ad egy mű létrehozójaként megjelenő ágensnek. @hu
toolkit label: tanácsadó ágens: @hu
toolkit definition: Egy ágens, amely tanácsadási szolgáltatásokat nyújt és gyakran javaslatokat ad egy mű létrehozójaként megjelenő ágensnek. @hu
alternative label: consultant
alternative label: asiantuntija @fi
label: asiantuntija (toimija) @fi
label: har konsulent (agent) @no
definition: Relaterer et verk til en agent som leverer konsulenttjenester og ofte gir anbefalinger til en annen agent som representeres som opphaveren til et verk. @no
alternative label: konsulent @no
label: heeft consultant-actor @nl
definition: Relateert een werk aan een actor die diensten van raadgeving levert, en vaak aanbevelingen doet, aan een gerelateerde actor die vertegenwoordigd wordt als een maker van een werk. @nl
toolkit label: consultant-actor @nl
toolkit definition: Een actor die diensten van raadgeving levert, en vaak aanbevelingen doet, aan een gerelateerde actor die vertegenwoordigd wordt als een maker van een werk. @nl
label: له وكيل استشاري @ar
definition: يربط بين عمل ووكيل يقدم خدمات استشارية، وغالبا ما يقدم مقترحات، لوكيل ذي صلة يقدَّم على أنه منشئ لعمل. @ar
alternative label: استشاري @ar
toolkit label: وكيل استشاري @ar
toolkit definition: وكيل يقدم خدمات استشارية، وغالبًا ما يقدم مقترحات، لوكيل ذي صلة يقدَّم على أنه منشئ لعمل. @ar
alternative label: consultor @ca
alternative label: rådgiver @da
label: konsultant (tegija) @et
definition: Seostab teose tegijaga, kes annab konsultatsiooni ja sageli ka soovitusi seotud tegijale, kes on esitatud teose autorina. @et
alternative label: konsultant @et
toolkit label: konsultant (tegija) @et
toolkit definition: Tegija, kes annab konsultatsiooni ja sageli ka soovitusi seotud tegijale, kes on esitatud teose autorina. @et
alternative label: tanácsadó: @hu
label: ha come consulente agente @it
definition: Correla un'opera a un agente che fornisce servizi di consulenza, e spesso formula raccomandazioni a un agente correlato presentato come il creatore di un'opera. @it
alternative label: consulente @it
toolkit label: consulente agente @it
toolkit definition: Agente che fornisce servizi di consulenza, e spesso formula raccomandazioni a un agente correlato che viene presentato come il creatore di un'opera. @it
label: konsultants (aģents) @lv
definition: Sasaista darbu ar aģentu, kas sniedz konsultāciju pakalpojumus un ieteikumus citam aģentam, kas ir darba radītājs. @lv
toolkit label: konsultants (aģents) @lv
toolkit definition: Aģents, kas sniedz konsultāciju pakalpojumus un ieteikumus citam aģentam, kas ir darba radītājs. @lv
alternative label: Berater @de
alternative label: 顾问 @zh-hans
toolkit label: 顾问行为者 @zh-hans

has consultant collective agent
status: Published
lexical alias: consultantCollectiveAgent.en
definition: Relates a work to a collective agent who provides consultation services, and often makes recommendations, for a related agent who is represented as a creator of a work.
toolkit label: consultant collective agent
toolkit definition: A collective agent who provides consultation services, and often makes recommendations, for a related agent who is represented as a creator of a work.
type: Property
domain: C10001
has element type: 2
sub property of: has creator collective agent of work
sub property of: has consultant agent
label: asiantuntija (yhteistoimija) @fi
definition: Liittää teoksen yhteistoimijaan, joka tarjoaa asiantuntijapalveluita ja usein antaa suosituksia toimijalle, joka esiintyy teoksen tekijänä. @fi
toolkit label: asiantuntija (yhteistoimija) @fi
toolkit definition: Yhteistoimija, joka tarjoaa asiantuntijapalveluita ja usein antaa suosituksia toimijalle, joka esiintyy teoksen tekijänä. @fi
label: har konsulent (kollektiv agent) @no
definition: Relaterer et verk til en kollektiv agent som leverer konsulenttjenester og ofte gir anbefalinger til en annen agent som representeres som opphaveren til et verk. @no
toolkit label: konsulent (kollektiv agent) @no
toolkit definition: En kollektiv agent som leverer konsulenttjenester og ofte gir anbefalinger til en annen agent som representeres som opphaveren til et verk. @no
label: heeft consultant-collectieve actor @nl
definition: Relateert een werk aan een collectieve actor die diensten van raadgeving levert, en vaak aanbevelingen doet, aan een gerelateerde actor die vertegenwoordigd wordt als een maker van een werk. @nl
toolkit label: consultant-collectieve actor @nl
toolkit definition: Een collectieve actor die diensten van raadgeving levert, en vaak aanbevelingen doet, aan een gerelateerde actor die vertegenwoordigd wordt als een maker van een werk. @nl
label: له وكيل جماعي استشاري @ar
definition: يربط بين عمل ووكيل جماعي يقدم خدمات استشارية، وغالبًا ما يقدم مقترحات، لوكيل ذي صلة يقدَم على أنه منشئ لعمل. @ar
toolkit label: وكيل جماعي استشاري @ar
toolkit definition: وكيل جماعي يقدم خدمات استشارية، وغالبًا ما يقدم مقترحات، لوكيل ذي صلة يقدَم على أنه منشئ لعمل. @ar
label: té com a agent col·lectiu consultor @ca
definition: Relaciona una obra amb un agent col·lectiu que proporciona serveis d’assessorament, i que sovint fa recomanacions, a un agent relacionat que es representa com un creador d’una obra. @ca
toolkit label: agent col·lectiu consultor @ca
toolkit definition: Agent col·lectiu que proporciona serveis d’assessorament, i que sovint fa recomanacions, a un agent relacionat que es representa com un creador d’una obra. @ca
label: har kollektiv agent, som er rådgiver @da
definition: Relaterer et værk til en kollektiv agent, som yder rådgivning, og ofte kommer med anbefalinger til en relateret agent, som er repræsenteret som ophav til et værk. @da
toolkit label: kollektiv agent, som er rådgiver @da
toolkit definition: Kollektiv agent, som yder rådgivning, og ofte kommer med anbefalinger til en relateret agent, som er repræsenteret som ophav til et værk. @da
label: konsultant (kollektiiv) @et
definition: Seostab teose kollektiiviga, kes annab konsultatsiooni ja sageli ka soovitusi seotud tegijale, kes on esitatud teose autorina. @et
toolkit label: konsultant (kollektiiv) @et
toolkit definition: Kollektiiv, kes annab konsultatsiooni ja sageli ka soovitusi seotud tegijale, kes on esitatud teose autorina. @et
label: hat Beraterin/Berater (Gemeinschaftlicher Akteur) @de
definition: Setzt ein Werk in Beziehung zu einem gemeinschaftlicher Akteur, der Beratungsdienste anbietet und häufig einem in Beziehung stehenden Akteur, der als geistiger Schöpfer eines Werks repräsentiert wird, Empfehlungen macht. @de
toolkit label: Beraterin/Berater (Gemeinschaftlicher Akteur) @de
toolkit definition: Ein gemeinschaftlicher Akteur, der Beratungsdienste anbietet und häufig einem in Beziehung stehenden Akteur, der als geistiger Schöpfer eines Werks repräsentiert wird, Empfehlungen macht. @de
label: tanácsadó kollektív ágense a következő: @hu
definition: Hozzákapcsol egy művet egy kollektív ágenshez, amely tanácsadási szolgáltatásokat nyújt és gyakran javaslatokat ad egy mű létrehozójaként megjelenő ágensnek. @hu
toolkit label: tanácsadó kollektív ágens: @hu
toolkit definition: Egy kollektív ágens, amely tanácsadási szolgáltatásokat nyújt és gyakran javaslatokat ad egy mű létrehozójaként megjelenő ágensnek. @hu
label: ha come consulente agente collettivo @it
definition: Correla un'opera a un agente collettivo che fornisce servizi di consulenza e spesso formula raccomandazioni a un agente correlato presentato come creatore di un'opera. @it
toolkit label: consulente agente collettivo @it
toolkit definition: Agente collettivo che fornisce servizi di consulenza e spesso formula raccomandazioni a un agente correlato presentato come creatore di un'opera. @it
label: a pour agent collectif consultant @fr
definition: Met une œuvre en relation avec un agent collectif qui fournit des services de consultation et fait souvent des recommandations à un agent en relation représenté comme créateur d’une œuvre. @fr
toolkit label: agent collectif consultant @fr
toolkit definition: Agent collectif qui fournit des services de consultation et fait souvent des recommandations à un agent en relation représenté comme créateur d’une œuvre. @fr
label: konsultants (grupa) @lv
definition: Sasaista darbu ar grupu, kas sniedz konsultāciju pakalpojumus un ieteikumus citam aģentam, kas ir darba radītājs. @lv
toolkit label: konsultants (grupa) @lv
toolkit definition: Grupa, kas sniedz konsultāciju pakalpojumus un ieteikumus citam aģentam, kas ir darba radītājs. @lv
label: 有顾问集体行为者 @zh-hans
definition: 将一种作品与向表现为作品创作者的一个相关行为者提供咨询服务并经常提供建议的一个集体行为者关联起来。 @zh-hans
toolkit label: 顾问集体行为者 @zh-hans
toolkit definition: 向表现为作品创作者的一个相关行为者提供咨询服务并经常提供建议的一个集体行为者 @zh-hans
has subproperty: has consultant corporate body
has subproperty: has consultant family
has subproperty: P10505
label: danışman kolektif temsilci ile ilişkilidir @tr
definition: Bir eseri, bir eserin yaratıcısı olarak temsil edilen ilgili bir temsilci için danışmanlık hizmetleri sağlayan ve genellikle tavsiyelerde bulunan kolektif bir temsilci ile ilişkilendirir. @tr
toolkit label: danışman kolektif temsilcisi @tr
toolkit definition: Bir eserin yaratıcısı olarak temsil edilen ilgili bir temsilci için danışmanlık hizmetleri sağlayan ve genellikle tavsiyelerde bulunan kolektif bir temsilci. @tr

has consultant corporate body
status: Published
lexical alias: consultantCorporateBody.en
definition: Relates a work to a corporate body who provides consultation services, and often makes recommendations, for a related agent who is represented as a creator of a work.
toolkit label: consultant corporate body
toolkit definition: A corporate body who provides consultation services, and often makes recommendations, for a related agent who is represented as a creator of a work.
type: Property
domain: C10001
has element type: 2
sub property of: has creator corporate body of work
sub property of: has consultant collective agent
label: asiantuntija (yhteisö) @fi
definition: Liittää teoksen yhteisöön, joka tarjoaa asiantuntijapalveluita ja usein antaa suosituksia toimijalle, joka esiintyy teoksen tekijänä. @fi
toolkit label: asiantuntija (yhteisö) @fi
toolkit definition: Yhteisö, joka tarjoaa asiantuntijapalveluita ja usein antaa suosituksia toimijalle, joka esiintyy teoksen tekijänä. @fi
label: har konsulent (korporasjon) @no
definition: Relaterer et verk til en korporasjon som leverer konsulenttjenester og ofte gir anbefalinger til en annen agent som representeres som opphaveren til et verk. @no
toolkit label: konsulent (korporasjon) @no
toolkit definition: En korporasjon som leverer konsulenttjenester og ofte gir anbefalinger til en annen agent som representeres som opphaveren til et verk. @no
label: heeft consultant-corporatie @nl
definition: Relateert een werk aan een corporatie die diensten van raadgeving levert, en vaak aanbevelingen doet, aan een gerelateerde actor die vertegenwoordigd wordt als een maker van een werk. @nl
toolkit label: consultant-corporatie @nl
toolkit definition: Een corporatie die diensten van raadgeving levert, en vaak aanbevelingen doet, aan een gerelateerde actor die vertegenwoordigd wordt als een maker van een werk. @nl
label: له هيئة استشارية @ar
definition: يربط بين عمل وهيئة تقدم خدمات استشارية، وغالبًا ما تقدم مقترحات، لوكيل ذي صلة يقدَم على أنه منشئ لعمل. @ar
toolkit label: هيئة استشارية @ar
toolkit definition: هيئة تقدم خدمات استشارية، وغالبًا ما تقدم مقترحات، لوكيل ذي صلة يقدَم على أنه منشئ لعمل. @ar
label: té com a entitat corporativa consultora @ca
definition: Relaciona una obra amb una entitat corporativa que proporciona serveis d’assessorament, i que sovint fa recomanacions, a un agent relacionat que es representa com un creador d’una obra. @ca
toolkit label: entitat corporativa consultora @ca
toolkit definition: Entitat corporativa que proporciona serveis d’assessorament, i que sovint fa recomanacions, a un agent relacionat que es representa com un creador d’una obra. @ca
label: har korporation, som er rådgiver @da
definition: Relaterer et værk til en korporation, som yder rådgivning, og ofte kommer med anbefalinger til en relateret agent, som er repræsenteret som ophav til et værk. @da
toolkit label: korporation, som er rådgiver @da
toolkit definition: Korporation, som yder rådgivning, og ofte kommer med anbefalinger til en relateret agent, som er repræsenteret som ophav til et værk. @da
label: konsultant (asutus) @et
definition: Seostab teose asutusega, kes annab konsultatsiooni ja sageli ka soovitusi seotud tegijale, kes on esitatud teose autorina. @et
toolkit label: konsultant (asutus) @et
toolkit definition: Asutus, kes annab konsultatsiooni ja sageli ka soovitusi seotud tegijale, kes on esitatud teose autorina. @et
label: hat Beraterin/Berater (Körperschaft) @de
definition: Setzt ein Werk in Beziehung zu einer Körperschaft, die Beratungsdienste anbietet und häufig einem in Beziehung stehenden Akteur, der als geistige Schöpferin/geistiger Schöpfer eines Werks repräsentiert wird, Empfehlungen macht. @de
toolkit label: Beraterin/Berater (Körperschaft) @de
toolkit definition: Eine Körperschaft, die Beratungsdienste anbietet und häufig einem in Beziehung stehenden Akteur, der als geistige Schöpferin/geistiger Schöpfer eines Werks repräsentiert wird, Empfehlungen macht. @de
label: tanácsadó testülete a következő: @hu
definition: Hozzákapcsol egy művet egy testülethez, amely tanácsadási szolgáltatásokat nyújt és gyakran javaslatokat ad egy mű létrehozójaként megjelenő ágensnek. @hu
toolkit label: tanácsadó testület: @hu
toolkit definition: Egy testület, amely tanácsadási szolgáltatásokat nyújt és gyakran javaslatokat ad egy mű létrehozójaként megjelenő ágensnek. @hu
label: ha come consulente ente @it
definition: Correla un'opera a un ente che fornisce servizi di consulenza e spesso formula raccomandazioni a un agente correlato presentato come creatore di un'opera. @it
toolkit label: consulente ente @it
toolkit definition: Ente che fornisce servizi di consulenza e spesso formula raccomandazioni a un agente correlato presentato come creatore di un'opera. @it
label: a pour collectivité consultante @fr
definition: Met une œuvre en relation avec une collectivité qui fournit des services de consultation et fait souvent des recommandations à un agent en relation représenté comme créateur d’une œuvre. @fr
toolkit label: collectivité consultante @fr
toolkit definition: Collectivité qui fournit des services de consultation et fait souvent des recommandations à un agent en relation représenté comme créateur d’une œuvre. @fr
label: konsultants (institūcija) @lv
definition: Sasaista darbu ar institūciju, kas sniedz konsultāciju pakalpojumus un ieteikumus citam aģentam, kas ir darba radītājs. @lv
toolkit label: konsultants (institūcija) @lv
toolkit definition: Institūcija, kas sniedz konsultāciju pakalpojumus un ieteikumus citam aģentam, kas ir darba radītājs. @lv
label: 有顾问团体 @zh-hans
definition: 将一种作品与向表现为作品创作者的一个相关行为者提供咨询服务并经常提供建议的一个团体关联起来。 @zh-hans
toolkit label: 顾问团体 @zh-hans
toolkit definition: 向表现为作品创作者的一个相关行为者提供咨询服务并经常提供建议的一个团体 @zh-hans
has subproperty: P10552
label: danışman tüzel kişi ile ilişkilidir @tr
definition: Bir eseri, bir eserin yaratıcısı olarak temsil edilen ilgili bir temsilci için danışmanlık hizmetleri sağlayan ve genellikle tavsiyelerde bulunan tüzel kişi ile ilişkilendirir. @tr
toolkit label: danışman tüzel kişisi @tr
toolkit definition: Bir tüzel kişi, bir eserin yaratıcısı olarak temsil edilen ilgili bir temsilciye danışmanlık hizmeti sunar ve sıkça önerilerde bulunur. @tr

has consultant family
status: Published
lexical alias: consultantFamily.en
definition: Relates a work to a family who provides consultation services, and often makes recommendations, for a related agent who is represented as a creator of a work.
toolkit label: consultant family
toolkit definition: A family who provides consultation services, and often makes recommendations, for a related agent who is represented as a creator of a work.
type: Property
domain: C10001
has element type: 2
sub property of: has creator family of work
sub property of: has consultant collective agent
label: asiantuntija (suku) @fi
definition: Liittää teoksen sukuun, joka tarjoaa asiantuntijapalveluita ja usein antaa suosituksia toimijalle, joka esiintyy teoksen tekijänä. @fi
toolkit label: asiantuntija (suku) @fi
toolkit definition: Suku, joka tarjoaa asiantuntijapalveluita ja usein antaa suosituksia toimijalle, joka esiintyy teoksen tekijänä. @fi
label: har konsulent (familie) @no
definition: Relaterer et verk til en familie som leverer konsulenttjenester og ofte gir anbefalinger til en annen agent som representeres som opphaveren til et verk. @no
toolkit label: konsulent (familie) @no
toolkit definition: En familie som leverer konsulenttjenester og ofte gir anbefalinger til en annen agent som representeres som opphaveren til et verk. @no
label: heeft consultant-familie @nl
definition: Relateert een werk aan een familie die diensten van raadgeving levert, en vaak aanbevelingen doet, aan een gerelateerde actor die vertegenwoordigd wordt als een maker van een werk. @nl
toolkit label: consultant-familie @nl
toolkit definition: Een familie die diensten van raadgeving levert, en vaak aanbevelingen doet, aan een gerelateerde actor die vertegenwoordigd wordt als een maker van een werk. @nl
label: له عائلة استشارية @ar
definition: يربط بين عمل وعائلة تقدم خدمات استشارية، وغالبًا ما تقدم مقترحات، لوكيل ذي صلة يقدَم على أنه منشئ لعمل. @ar
toolkit label: عائلة استشارية @ar
toolkit definition: عائلة تقدم خدمات استشارية، وغالبًا ما تقدم مقترحات، لوكيل ذي صلة يقدَم على أنه منشئ لعمل. @ar
label: té com a família consultora @ca
definition: Relaciona una obra amb una família que proporciona serveis d’assessorament, i que sovint fa recomanacions, a un agent relacionat que es representa com un creador d’una obra. @ca
toolkit label: família consultora @ca
toolkit definition: Família que proporciona serveis d’assessorament, i que sovint fa recomanacions, a un agent relacionat que es representa com un creador d’una obra. @ca
label: har familie, som er rådgiver @da
definition: Relaterer et værk til en familie, som yder rådgivning, og ofte kommer med anbefalinger til en relateret agent, som er repræsenteret som ophav til et værk. @da
toolkit label: familie, som er rådgiver @da
toolkit definition: Familie, som yder rådgivning, og ofte kommer med anbefalinger til en relateret agent, som er repræsenteret som ophav til et værk. @da
label: konsultant (perekond) @et
definition: Seostab teose perekonnaga, kes annab konsultatsiooni ja sageli ka soovitusi seotud tegijale, kes on esitatud teose autorina. @et
toolkit label: konsultant (perekond) @et
toolkit definition: Perekond, kes annab konsultatsiooni ja sageli ka soovitusi seotud tegijale, kes on esitatud teose autorina. @et
label: hat Beraterin/Berater (Familie) @de
definition: Setzt ein Werk in Beziehung zu einer Familie, die Beratungsdienste anbietet und häufig einem in Beziehung stehenden Akteur, der als geistiger Schöpfer eines Werks repräsentiert wird, Empfehlungen macht. @de
toolkit label: Beraterin/Berater (Familie) @de
toolkit definition: Eine Familie, die Beratungsdienste anbietet und häufig einem in Beziehung stehenden Akteur, der als geistiger Schöpfer eines Werks repräsentiert wird, Empfehlungen macht. @de
label: tanácsadó családja a következő: @hu
definition: Hozzákapcsol egy művet egy családhoz, amely tanácsadási szolgáltatásokat nyújt és gyakran javaslatokat ad egy mű létrehozójaként megjelenő ágensnek. @hu
toolkit label: tanácsadó család: @hu
toolkit definition: Egy család, amely tanácsadási szolgáltatásokat nyújt és gyakran javaslatokat ad egy mű létrehozójaként megjelenő ágensnek. @hu
label: ha come consulente famiglia @it
definition: Correla un'opera a una famiglia che fornisce servizi di consulenza e spesso formula raccomandazioni a un agente correlato presentato come creatore di un'opera. @it
toolkit label: consulente famiglia @it
toolkit definition: Famiglia che fornisce servizi di consulenza e spesso formula raccomandazioni a un agente correlato presentato come creatore di un'opera. @it
label: a pour famille consultante @fr
definition: Met une œuvre en relation avec une famille qui fournit des services de consultation et fait souvent des recommandations à un agent en relation représenté comme créateur d’une œuvre. @fr
toolkit label: famille consultante @fr
toolkit definition: Famille qui fournit des services de consultation et fait souvent des recommandations à un agent en relation représenté comme créateur d’une œuvre. @fr
label: konsultants (dzimta/ģimene) @lv
definition: Sasaista darbu ar dzimtu/ģimeni, kas sniedz konsultāciju pakalpojumus un ieteikumus citam aģentam, kas ir darba radītājs. @lv
toolkit label: konsultants (dzimta/ģimene) @lv
toolkit definition: Dzimt/ģimene, kas sniedz konsultāciju pakalpojumus un ieteikumus citam aģentam, kas ir darba radītājs. @lv
label: 有顾问家族 @zh-hans
definition: 将一种作品与向表现为作品创作者的一个相关行为者提供咨询服务并经常提供建议的一个家族关联起来。 @zh-hans
toolkit label: 顾问家族 @zh-hans
toolkit definition: 向表现为作品创作者的一个相关行为者提供咨询服务并经常提供建议的一个家族 @zh-hans
has subproperty: P10599
label: danışman aile ile ilişkilidir @tr
definition: Bir eseri, eserin yaratıcısı olarak temsil edilen ilgili bir temsilci için danışmanlık hizmetleri sağlayan ve genellikle tavsiyelerde bulunan bir aileyle ilişkilendirir. @tr
toolkit label: danışman ailesi @tr
toolkit definition: Bir eserin yaratıcısı olarak temsil edilen ilgili bir temsilci için danışmanlık hizmetleri sağlayan ve genellikle tavsiyelerde bulunan bir aile. @tr

has consultant person
status: Published
lexical alias: consultantPerson.en
definition: Relates a work to a person who provides consultation services, and often makes recommendations, for a related agent who is represented as a creator of a work.
toolkit label: consultant person
toolkit definition: A person who provides consultation services, and often makes recommendations, for a related agent who is represented as a creator of a work.
type: Property
domain: C10001
has element type: 2
sub property of: has creator person of work
sub property of: has consultant agent
label: asiantuntija (henkilö) @fi
definition: Liittää teoksen henkilöön, joka tarjoaa asiantuntijapalveluita ja usein antaa suosituksia toimijalle, joka esiintyy teoksen tekijänä. @fi
toolkit label: asiantuntija (henkilö) @fi
toolkit definition: Henkilö, joka tarjoaa asiantuntijapalveluita ja usein antaa suosituksia toimijalle, joka esiintyy teoksen tekijänä. @fi
label: har konsulent (person) @no
definition: Relaterer et verk til en person som leverer konsulenttjenester og ofte gir anbefalinger til en annen agent som representeres som opphaveren til et verk. @no
toolkit label: konsulent (person) @no
toolkit definition: En person som leverer konsulenttjenester og ofte gir anbefalinger til en annen agent som representeres som opphaveren til et verk. @no
label: heeft consultant-persoon @nl
definition: Relateert een werk aan een persoon die diensten van raadgeving levert, en vaak aanbevelingen doet, aan een gerelateerde actor die vertegenwoordigd wordt als een maker van een werk. @nl
toolkit label: consultant-persoon @nl
toolkit definition: Een persoon die diensten van raadgeving levert, en vaak aanbevelingen doet, aan een gerelateerde actor die vertegenwoordigd wordt als een maker van een werk. @nl
label: له شخص استشاري @ar
definition: يربط بين عمل وشخص يقدم خدمات استشارية، وغالبًا ما يقدم مقترحات، لوكيل ذي صلة يقدَم على أنه منشئ عمل. @ar
toolkit label: شخص استشاري @ar
toolkit definition: شخص يقدم خدمات استشارية، وغالبًا ما يقدم مقترحات، لوكيل ذي صلة يقدَم على أنه منشئ عمل. @ar
label: té com a persona consultora @ca
definition: Relaciona una obra amb una persona que proporciona serveis d’assessorament, i que sovint fa recomanacions, a un agent relacionat que es representa com un creador d’una obra. @ca
toolkit label: persona consultora @ca
toolkit definition: Persona que proporciona serveis d’assessorament, i que sovint fa recomanacions, a un agent relacionat que es representa com un creador d’una obra. @ca
label: har person, som er rådgiver @da
definition: Relaterer et værk til en person, som yder rådgivning, og ofte kommer med anbefalinger til en relateret agent, som er repræsenteret som ophav til et værk. @da
toolkit label: person, som er rådgiver @da
toolkit definition: Person, som yder rådgivning, og ofte kommer med anbefalinger til en relateret agent, som er repræsenteret som ophav til et værk. @da
label: konsultant (isik) @et
definition: Seostab teose isikuga, kes annab konsultatsiooni ja sageli ka soovitusi seotud tegijale, kes on esitatud teose autorina. @et
toolkit label: konsultant (isik) @et
toolkit definition: Isik, kes annab konsultatsiooni ja sageli ka soovitusi seotud tegijale, kes on esitatud teose autorina. @et
label: hat Beraterin/Berater (Person) @de
definition: Setzt ein Werk in Beziehung zu einer Person, die Beratungsdienste anbietet und häufig einem in Beziehung stehenden Akteur, der als geistiger Schöpfer eines Werks repräsentiert wird, Empfehlungen macht. @de
toolkit label: Beraterin/Berater (Person) @de
toolkit definition: Eine Person, die Beratungsdienste anbietet und häufig einem in Beziehung stehenden Akteur, der als geistiger Schöpfer eines Werks repräsentiert wird, Empfehlungen macht. @de
label: tanácsadó személye a következő: @hu
definition: Hozzákapcsol egy művet egy személyhez, aki tanácsadási szolgáltatásokat nyújt és gyakran javaslatokat ad egy mű létrehozójaként megjelenő ágensnek. @hu
toolkit label: tanácsadó személy: @hu
toolkit definition: Egy személy, aki tanácsadási szolgáltatásokat nyújt és gyakran javaslatokat ad egy mű létrehozójaként megjelenő ágensnek. @hu
label: ha come consulente persona @it
definition: Correla un'opera a una persona che fornisce servizi di consulenza e spesso formula raccomandazioni a un agente correlato presentato come creatore di un'opera. @it
toolkit label: consulente persona @it
toolkit definition: Persona che fornisce servizi di consulenza e spesso formula raccomandazioni a un agente correlato presentato come creatore di un'opera. @it
label: a pour personne consultante @fr
definition: Met une œuvre en relation avec une personne qui fournit des services de consultation et fait souvent des recommandations à un agent en relation représenté comme créateur d’une œuvre. @fr
toolkit label: personne consultante @fr
toolkit definition: Personne qui fournit des services de consultation et fait souvent des recommandations à un agent en relation représenté comme créateur d’une œuvre. @fr
label: konsultants (persona) @lv
definition: Sasaista darbu ar personu, kura sniedz konsultāciju pakalpojumus un ieteikumus citam aģentam, kas ir darba radītājs. @lv
toolkit label: konsultants (persona) @lv
toolkit definition: Persona, kura sniedz konsultāciju pakalpojumus un ieteikumus citam aģentam, kas ir darba radītājs. @lv
label: 有顾问个人 @zh-hans
definition: 将一种作品与向表现为作品创作者的一个相关行为者提供咨询服务并经常提供建议的一个个人关联起来。 @zh-hans
toolkit label: 顾问个人 @zh-hans
toolkit definition: 向表现为作品创作者的一个相关行为者提供咨询服务并经常提供建议的一个个人 @zh-hans
has subproperty: P10458
label: danışman ile ilişkilidir @tr
definition: Bir eseri, eseri yaratıcısı olarak temsil edilen ilgili bir temsilci için danışmanlık hizmetleri sunan ve genellikle önerilerde bulunan bir kişiyle ilişkilendirir. @tr
toolkit label: danışman @tr
toolkit definition: Bir eserin yaratıcısı olarak temsil edilen ilgili bir temsilci için danışmanlık hizmetleri sunan ve genellikle önerilerde bulunan bir kişi. @tr

has content type of representative expression
status: Published
type: Property
lexical alias: contentTypeOfRepresentativeExpression.en
definition: Relates a work to a categorization of a representative expression that reflects the fundamental form of communication in which the content is expressed and the human sense through which it is intended to be perceived.
domain: C10001
toolkit label: content type of representative expression
has element type: 4
toolkit definition: A categorization of a representative expression that reflects the fundamental form of communication in which the content is expressed and the human sense through which it is intended to be perceived.
label: edustavan ekspression sisältötyyppi @fi
definition: Liittää teoksen edustavan ekspression jaotteluun, joka ilmaisee sisällön esitysmuodon ja sen, minkä aistin välityksellä sisältö on tarkoitus vastaanottaa. @fi
toolkit label: edustavan ekspression sisältötyyppi @fi
toolkit definition: Edustavan ekspression jaottelu, joka ilmaisee sisällön esitysmuodon ja sen, minkä aistin välityksellä sisältö on tarkoitus vastaanottaa. @fi
label: har innholdstype for representativt uttrykk @no
definition: Relaterer et verk til en katagorisering av et representativt uttrykk som gjenspeiler den opprinnelige kommunikasjonsformen som innholdet er uttrykt i, og den menneskelige sansen som det er ment å oppfattes gjennom. @no
toolkit label: innholdstype for representativt uttrykk @no
toolkit definition: En katagorisering av et representativt uttrykk som gjenspeiler den opprinnelige kommunikasjonsformen som innholdet er uttrykt i, og den menneskelige sansen som det er ment å oppfattes gjennom. @no
label: heeft contenttype van representatieve expressie @nl
definition: Relateert een werk aan een categorisatie van een representatieve expressie die de fundamentele vorm van communicatie weergeeft waarin de content uitgedrukt is en het menselijk zintuig waarmee het bedoeld is waargenomen te worden. @nl
toolkit label: contenttype van representatieve expressie @nl
toolkit definition: Een categorisatie van een representatieve expressie die de fundamentele vorm van communicatie weergeeft waarin de content uitgedrukt is en het menselijk zintuig waarmee het bedoeld is waargenomen te worden. @nl
label: له نوع محتوى لتعبيرة ممثِلة @ar
definition: يربط بين عمل وتصنيف لتعبيرة ممثِلة يعكس الشكل الأساسي للتواصل، الذي يتم فيه التعبير عن المحتوى، والحس الإنساني، الذي يُقصد تصوره من خلاله. @ar
toolkit label: نوع محتوى لتعبيرة ممثِلة @ar
toolkit definition: تصنيف لتعبيرة ممثِلة يعكس الشكل الأساسي للتواصل، الذي يتم فيه التعبير عن المحتوى، والحس الإنساني، الذي يُقصد تصوره من خلاله. @ar
label: té com a tipus de contingut d’una expressió representativa @ca
definition: Relaciona una obra amb una categorització d’una expressió representativa que reflecteix la forma fonamental de comunicació en què s’expressa el contingut i el sentit humà per mitjà del qual s’ha de percebre. @ca
toolkit label: tipus de contingut d’una expressió representativa @ca
toolkit definition: Categorització d’una expressió representativa que reflecteix la forma fonamental de comunicació en què s’expressa el contingut i el sentit humà per mitjà del qual s’ha de percebre. @ca
label: har indholdstype for repræsentativt udtryk @da
definition: Relaterer et værk til en kategorisering af et repræsentativt udtryk, som afspejler den grundlæggende kommunikationsform, som indholdet er udtrykt i, og den menneskelige sans, gennem hvilken det er tiltænkt til at blive opfattet. @da
toolkit label: indholdstype for repræsentativt udtryk @da
toolkit definition: Kategorisering af et repræsentativt udtryk, som afspejler den grundlæggende kommunikationsform, som indholdet er udtrykt i, og den menneskelige sans, gennem hvilken det er tiltænkt til at blive opfattet. @da
label: iseloomuliku väljenduse sisu tüüp @et
definition: Seostab teose iseloomuliku väljenduse kategooriaga, mis kajastab kommunikatsiooni põhivormi, milles sisu on väljendatud, ja inimmeelt, mille kaudu seda tajutakse. @et
toolkit label: iseloomuliku väljenduse sisu tüüp @et
toolkit definition: Iseloomuliku väljenduse kategooria, mis kajastab kommunikatsiooni põhivormi, milles sisu on väljendatud, ja inimmeelt, mille kaudu seda tajutakse. @et
label: hat Inhaltstyp einer repräsentativen Expression @de
definition: Setzt ein Werk in Beziehung zu einer Kategorisierung einer repräsentativen Expression, die zum einen die grundlegende Form der Kommunikation widerspiegelt, in der der Inhalt ausgedrückt wird, und zum andern die menschliche Wahrnehmung wiedergibt, durch die diese wahrgenommen werden soll. @de
toolkit label: Inhaltstyp einer repräsentativen Expression @de
toolkit definition: Eine Kategorisierung einer repräsentativen Expression, die zum einen die grundlegende Form der Kommunikation widerspiegelt, in der der Inhalt ausgedrückt wird, und zum andern die menschliche Wahrnehmung wiedergibt, durch die diese wahrgenommen werden soll. @de
label: reprezentatív kifejezési forma tartalomtípusa a következő: @hu
definition: Hozzákapcsol egy művet egy reprezentatív kifejezési forma kategorizálásához, amely tükrözi a kommunikáció azon alapvető formáját, melyen a tartalom kifejezésre kerül, és amelyet emberi érzékszerven keresztüli érzékelésére szántak. @hu
toolkit label: reprezentatív kifejezési formához tartozó tartalomtípus @hu
toolkit definition: Egy reprezentatív kifejezési forma kategorizálása, amely tükrözi a kommunikáció azon alapvető formáját, melyen a tartalom kifejezésre kerül, és amelyet emberi érzékszerven keresztüli érzékelésére szántak. @hu
label: ha come tipo di contenuto di espressione rappresentativa @it
definition: Correla un’opera a una categorizzazione dell’espressione rappresentativa che riflette la forma di comunicazione fondamentale in cui si esprime il contenuto e il senso che permette di percepirlo. @it
toolkit label: tipo di contenuto di espressione rappresentativa @it
toolkit definition: Categorizzazione dell’espressione rappresentativa che riflette la forma di comunicazione fondamentale in cui si esprime il contenuto e il senso che permette di percepirlo. @it
label: a pour type de contenu d’une expression représentative @fr
definition: Met une œuvre en relation avec une catégorisation d’une expression représentative qui reflète la forme fondamentale de communication sous laquelle le contenu est exprimé et le sens humain par lequel il est destiné à être perçu. @fr
toolkit label: type de contenu d’une expression représentative @fr
toolkit definition: Catégorisation d’une expression représentative qui reflète la forme fondamentale de communication sous laquelle le contenu est exprimé et le sens humain par lequel il est destiné à être perçu. @fr
label: reprezentatīvās izteiksmes satura veids @lv
definition: Sasaista darbu ar reprezentatīvās izteiksmes kategorizāciju, kas atspoguļo būtisko saziņas pamatformu, kurā saturs tiek izteikts ar to, kā cilvēks to uztver un saprot (maņas). @lv
toolkit label: reprezentatīvās izteiksmes satura veids @lv
toolkit definition: Reprezentatīvās izteiksmes kategorizācija, kas atspoguļo būtisko saziņas pamatformu, kurā saturs tiek izteikts ar to, kā cilvēks to uztver un saprot (maņas). @lv
label: 有代表性内容表达的内容类型 @zh-hans
definition: 将一种作品与反映一个内容被表达所用通讯的基本形式和设计被感知的人类感觉的代表性内容表达的分类关联起来。 @zh-hans
toolkit label: 代表性内容表达的内容类型 @zh-hans
toolkit definition: 反映一个内容被表达所用通讯的基本形式和设计被感知的人类感觉的代表性内容表达的分类 @zh-hans
has subproperty: P10349
label: temsili anlatımın içerik türü ile ilişkilidir @tr
definition: Bir eseri, içeriğin ifade edildiği temel iletişim biçimini ve algılanmasını amaçlayan insan duyusunu yansıtan temsili bir anlatımın sınıflandırılmasıyla ilişkilendirir. @tr
toolkit label: temsili anlatımın içerik türü @tr
toolkit definition: İçeriğin ifade edildiği temel iletişim biçimini ve algılanması amaçlanan insan duyusunu yansıtan temsili bir ifadenin kategorizasyonu. @tr

has creator agent of work
status: Published
definition: Relates a work to an agent who is responsible for creating a work.
type: Property
domain: C10001
lexical alias: creatorAgentOfWork.en
instruction number: 19.2
toolkit label: creator agent of work
toolkit definition: An agent who is responsible for creating a work.
toolkit label: agent créateur d’une œuvre @fr
toolkit definition: Agent qui est responsable de la création d’une œuvre. @fr
toolkit label: creador @es
toolkit definition: Una persona, familia o entidad corporativa responsable de la creación de una obra. @es
scope note: A creator of work includes an agent who is jointly responsible for the creation of a work either by performing the same role as another agent, such as in a collaboration between two writers, or by performing a different role, such as in a collaboration between a composer and a lyricist.
label: har skapare @sv
toolkit label: skapare @sv
sub property of: has related agent of work
label: har agent, som er ophav til værk @da
definition: Relaterer et værk til en agent, som er ansvarlig for et værk. @da
scope note: Ophav til værk omfatter en agent, som har fælles ansvar for at have skabt et værk enten ved at udføre den samme rolle som en anden agent, såsom i et samarbejde mellem to forfattere, eller ved at udføre en anden rolle, såsom i et samarbejde mellem en komponist og en tekstforfatter. @da
toolkit label: agent, som er ophav til værk @da
toolkit definition: Agent, som er ansvarlig for et værk. @da
definition: Met une œuvre en relation avec un agent qui est responsable de la création d’une œuvre. @fr
label: có người sáng tạo @vi
definition: Liên kết tác phẩm với tác nhân có trách nhiệm sáng tạo tác phẩm. @vi
scope note: Người sáng tạo bao gồm tác nhân có trách nhiệm liên dới về sáng tạo tác phẩm hoặc có cùng vai trò, như là việc phối hợp giữa 2 người viết, hoặc có vai trò khác nhau, như là việc phối hợp giữa người soạn với nhà thơ trữ tình. @vi
toolkit label: người sáng tạo @vi
toolkit definition: Tác nhân có trách nhiệm sáng tạo tác phẩm. @vi
label: hat geistige Schöpferin/geistigen Schöpfer eines Werks (Akteur) @de
definition: Setzt ein Werk in Beziehung zu einem Akteur, der für die Schaffung eines Werks verantwortlich ist. @de
scope note: Darunter fällt ein Akteur, der für die Schaffung eines Werks mitverantwortlich ist, wenn er entweder dieselbe Rolle wie ein anderer Akteur ausführt, wie bei einer Zusammenarbeit zwischen zwei Schriftstellerinnen/Schriftstellern, oder eine andere Rollen ausführt, wie bei einer Zusammenarbeit zwischen einer Komponistin/einem Komponisten und einer Textdichterin/einem Textdichter. @de
toolkit label: Geistige Schöpferin/Geistiger Schöpfer eines Werks (Akteur) @de
toolkit definition: Ein Akteur, der für die Schaffung eines Werks verantwortlich ist. @de
label: a pour agent créateur d’une œuvre @fr
definition: Liittää teoksen toimijaan, joka on vastuussa teoksen luomisesta. @fi
toolkit label: teoksen tekijä (toimija) @fi
toolkit definition: Toimija, joka on vastuussa teoksen luomisesta. @fi
toolkit label: skaper av verk (agent) @no
toolkit definition: En agent som er ansvarlig for å skape et verk. @no
label: té com a agent creador d’una obra @ca
definition: Relaciona una obra amb un agent que és responsable de la creació d’una obra. @ca
scope note: Un creador d’una obra inclou un agent que és responsable conjuntament de la creació d’una obra ja sigui realitzant la mateixa funció que un altre agent, com ara una col·laboració entre dos escriptors, o realitzant funcions diferents, com ara una col·laboració entre un compositor i un lletrista. @ca
toolkit label: agent creador d’una obra @ca
toolkit definition: Agent que és responsable de la creació d’una obra. @ca
scope note: Un créateur d’une œuvre comprend un agent coresponsable de la création d’une œuvre soit en exerçant le même rôle qu’un autre agent, comme dans le cas d’une collaboration entre deux écrivains, soit en exerçant un rôles différent, comme dans le cas d’une collaboration entre un compositeur et un parolier. @fr
has element type: 3
label: έχει δημιουργό @el
definition: Συνδέει ένα έργο με έναν φορέα υπεύθυνο για τη δημιουργία ενός έργου. @el
scope note: Οι δημιουργοί περιλαμβάνουν τους φορείς που είναι συνυπεύθυνοι για τη δημιουργία ενός έργου είτε μέσω της εκτέλεσης του ίδιου ρόλου, όπως σε μια συνεργασία μεταξύ δύο συγγραφέων ή μέσω της εκτέλεσης διαφορετικών ρόλων, όπως σε μια συνεργασία μεταξύ ενός συνθέτη και ενός στιχουργού. @el
toolkit label: δημιουργός @el
toolkit definition: Ένας φορέας υπεύθυνος για τη δημιουργία ενός έργου. @el
label: mű létrehozó ágense a következő: @hu
definition: Hozzákapcsol egy művet egy ágenshez, amely felelős egy mű létrehozásáért. @hu
scope note: létrehozó: @hu
toolkit label: mű létrehozó ágense: @hu
toolkit definition: Egy ágens, amely felelős egy mű létrehozásáért. @hu
alternative label: creator
scope note: Teoksen tekijä kattaa toimijan, joka on yhteisesti vastuussa teoksen luomisesta joko toimimalla samassa roolissa kuin toinen toimija, kuten kahden kirjoittajan välisessä yhteistyössä, tai toimimalla eri rooleissa, kuten säveltäjän ja sanoittajan välisessä yhteistyössä. @fi
alternative label: teoksen tekijä @fi
label: teoksen tekijä (toimija) @fi
label: har skaper av verk (agent) @no
definition: Relaterer et verk til en agent som er ansvarlig for å skape et verk. @no
scope note: En opphaver for verk inkluderer en agent med delt ansvar for å skape et verk, enten ved å fylle samme rolle som en annen agent, som i et samarbeid mellom to forfattere, eller ulike roller som i et samarbeid mellom en komponist og en sangtekstforfatter. @no
alternative label: opphaver for verk @no
label: heeft maker-actor van werk @nl
definition: Relateert een werk aan een actor die verantwoordelijk is voor het creëren van een werk. @nl
scope note: Een maker van werk omvat een actor die gezamenlijk verantwoordelijk is voor de creatie van een werk door ofwel dezelfde rol uit te voeren als een andere actor, zoals bij een samenwerking door twee schrijvers, ofwel door een verschillende rol uit te voeren, zoals bij een samenwerking tussen een componist en een liedtekstschrijver. @nl
toolkit label: maker-actor van werk @nl
toolkit definition: Een actor die verantwoordelijk is voor het creëren van een werk. @nl
label: له وكيل منشئ لعمل @ar
definition: يربط بين عمل ووكيل مسئول عن إنشاء عمل. @ar
scope note: يشمل منشئ العمل وكيلًا مسئولا مسئولية مشتركة عن إنشاء عمل إما عن طريق أداء نفس الدور الذي يؤديه وكيل آخر، كما هو الحال في التعاون بين كاتبين، وإما عن طريق أداء دور مختلف، كما هو الحال في التعاون بين ملحن ومؤلف أغاني. @ar
alternative label: منشئ عمل @ar
toolkit label: وكيل منشئ لعمل @ar
toolkit definition: وكيل مسئول عن إنشاء عمل. @ar
alternative label: creador d’una obra @ca
alternative label: ophav til værk @da
label: teose autor (tegija) @et
definition: Seostab teose tegijaga, kes vastutab teose loomise eest. @et
scope note: Teose autor hõlmab ka tegijat, kes kaasvastutab teose loomise eest, täites teise tegijaga kas sama rolli (nt kahe kirjaniku koostöö) või erinevat rolli (nt helilooja ja sõnade autori koostöö). @et

has creator collective agent of work
status: Published
lexical alias: creatorCollectiveAgentOfWork.en
definition: Relates a work to a collective agent who is responsible for creating a work.
toolkit label: creator collective agent of work
toolkit definition: A collective agent who is responsible for creating a work.
type: Property
domain: C10001
has element type: 2
sub property of: has related collective agent of work
sub property of: has creator agent of work
scope note: A creator of work includes an agent who is jointly responsible for the creation of a work either by performing the same role as another agent, such as in a collaboration between two writers, or by performing a different role, such as in a collaboration between a composer and a lyricist.
label: teoksen tekijä (yhteistoimija) @fi
definition: Liittää teoksen yhteistoimijaan, joka on vastuussa teoksen luomisesta. @fi
scope note: Teoksen tekijä kattaa toimijan, joka on yhteisesti vastuussa teoksen luomisesta joko toimimalla samassa roolissa kuin toinen toimija, kuten kahden kirjoittajan välisessä yhteistyössä, tai toimimalla eri rooleissa, kuten säveltäjän ja sanoittajan välisessä yhteistyössä. @fi
toolkit label: teoksen tekijä (yhteistoimija) @fi
toolkit definition: Yhteistoimija, joka on vastuussa teoksen luomisesta. @fi
label: har skaper av verk (kollektiv agent) @no
definition: Relaterer et verk til en kollektiv agent som er ansvarlig for å skape et verk. @no
scope note: En opphaver for verk inkluderer en agent med delt ansvar for å skape et verk, enten ved å fylle samme rolle som en annen agent, som i et samarbeid mellom to forfattere, eller ulike roller som i et samarbeid mellom en komponist og en sangtekstforfatter. @no
toolkit label: skaper av verk (kollektiv agent) @no
toolkit definition: En kollektiv agent som er ansvarlig for å skape et verk. @no
label: heeft maker-collectieve actor van werk @nl
definition: Relateert een werk aan een collectieve actor die verantwoordelijk is voor het creëren van een werk. @nl
scope note: Een maker van werk omvat een actor die gezamenlijk verantwoordelijk is voor de creatie van een werk door ofwel dezelfde rol uit te voeren als een andere actor, zoals bij een samenwerking door twee schrijvers, ofwel door een verschillende rol uit te voeren, zoals bij een samenwerking tussen een componist en een liedtekstschrijver. @nl
toolkit label: maker-collectieve actor van werk @nl
toolkit definition: Een collectieve actor die verantwoordelijk is voor het creëren van een werk. @nl
label: له وكيل جماعي منشئ لعمل @ar
definition: يربط بين عمل ووكيل جماعي مسئول عن إنشاء عمل. @ar
scope note: منشئ العمل يشمل وكيلًا مسئولاً مسئولية مشتركة عن إنشاء عمل إما عن طريق أداء نفس الدور الذي يؤديه وكيل آخر، كما هو الحال في التعاون بين كاتبين، أو عن طريق أداء دور مختلف، كما هو الحال في التعاون بين ملحن ومؤلف أغاني. @ar
toolkit label: وكيل جماعي منشئ لعمل @ar
toolkit definition: وكيل جماعي مسئول عن إنشاء عمل. @ar
label: té com a agent col·lectiu creador d’una obra @ca
definition: Relaciona una obra amb un agent col·lectiu que és responsable de la creació d’una obra. @ca
scope note: Un creador d’una obra inclou un agent que és responsable conjuntament de la creació d’una obra ja sigui realitzant la mateixa funció que un altre agent, com ara una col·laboració entre dos escriptors, o realitzant funcions diferents, com ara una col·laboració entre un compositor i un lletrista. @ca
toolkit label: agent col·lectiu creador d’una obra @ca
toolkit definition: Agent col·lectiu que és responsable de la creació d’una obra. @ca
label: har kollektiv agent, som er ophav til værk @da
definition: Relaterer et værk til en kollektiv agent, som er ansvarlig for et værk. @da
scope note: Ophav til værk omfatter en agent, som har fælles ansvar for at have skabt et værk enten ved at udføre den samme rolle som en anden agent, såsom i et samarbejde mellem to forfattere, eller ved at udføre en anden rolle, såsom i et samarbejde mellem en komponist og en tekstforfatter. @da
toolkit label: kollektiv agent, som er ophav til værk @da
toolkit definition: Kollektiv agent, som er ansvarlig for et værk. @da
label: teose autor (kollektiiv) @et
definition: Seostab teose kollektiiviga, kes vastutab teose loomise eest. @et
scope note: Teose autor hõlmab ka tegijat, kes kaasvastutab teose loomise eest, täites teise tegijaga kas sama rolli (nt kahe kirjaniku koostöö) või erinevat rolli (nt helilooja ja sõnade autori koostöö). @et
toolkit label: teose autor (kollektiiv) @et
toolkit definition: Kollektiiv, kes vastutab teose loomise eest. @et
label: hat geistige Schöpferin/geistigen Schöpfer eines Werks (Gemeinschaftlicher Akteur) @de
definition: Setzt ein Werk in Beziehung zu einem gemeinschaftlichen Akteur, der für die Schaffung eines Werks verantwortlich ist. @de
scope note: Darunter fällt ein Akteur, der für die Schaffung eines Werks mitverantwortlich ist, wenn er entweder dieselbe Rolle wie ein anderer Akteur ausführt, wie bei einer Zusammenarbeit zwischen zwei Schriftstellerinnen/Schriftstellern, oder eine andere Rollen ausführt, wie bei einer Zusammenarbeit zwischen einer Komponistin/einem Komponisten und einer Textdichterin/einem Textdichter. @de
toolkit label: Geistige Schöpferin/Geistiger Schöpfer eines Werks (Gemeinschaftlicher Akteur) @de
toolkit definition: Ein gemeinschaftlicher Akteur, der für die Schaffung eines Werks verantwortlich ist. @de
label: ha come creatore agente collettivo di opera @it
definition: Correla un'opera all'agente collettivo responsabile di un'opera. @it
scope note: Un creatore di opera comprende l'agente congiuntamente responsabile della creazione di un'opera, sia svolgendo lo stesso ruolo di un altro agente, come in una collaborazione tra due scrittori, sia svolgendo un ruolo differente, come in una collaborazione tra un compositore e un paroliere. @it
toolkit label: creatore agente collettivo di opera @it
toolkit definition: Agente collettivo responsabile di un'opera. @it
label: a pour agent collectif créateur d’une œuvre @fr
definition: Met une œuvre en relation avec un agent collectif qui est responsable de la création d’une œuvre. @fr
scope note: Un créateur d’une œuvre comprend un agent coresponsable de la création d’une œuvre soit en exerçant le même rôle qu’un autre agent, comme dans le cas d’une collaboration entre deux écrivains, soit en exerçant un rôles différent, comme dans le cas d’une collaboration entre un compositeur et un parolier. @fr
toolkit label: agent collectif créateur d’une œuvre @fr
toolkit definition: Agent collectif qui est responsable de la création d’une œuvre. @fr
label: darba radītājs (grupa) @lv
definition: Sasaista darbu ar grupu, kas ir atbildīga par darba radīšanu. @lv
toolkit label: darba radītājs (grupa) @lv
toolkit definition: Grupa, kas ir atbildīga par darba radīšanu. @lv
scope note: Darba radītājs ietver aģentu, kas ir atbildīgs par darba radīšanu un pilda tādu pašu lomu kā cits aģents, piemēram, kā sadarbībā starp diviem rakstniekiem vai veicot dažādas lomas, kā piemēram, komponista un teksta autora sadarbībā. @lv
label: 有作品的创作者集体行为者 @zh-hans
definition: 将一种作品与负责创作一种作品的一个集体行为者关联起来。 @zh-hans
toolkit label: 作品的创作者集体行为者 @zh-hans
toolkit definition: 负责创作一种作品的一个集体行为者 @zh-hans
scope note: 作品的创作者包括对作品的创建联合负责的行为者，他们或者行使同样的角色（例如两个写作者之间的合作）或者行使不同角色（例如作曲者和词作者之间的合作）。 @zh-hans
label: mű létrehozó kollektív ágense a következő: @hu
definition: Hozzákapcsol egy művet egy kollektív ágenshez, amely felelős egy mű létrehozásáért. @hu
toolkit label: mű létrehozó kollektív ágense: @hu
toolkit definition: Egy kollektív ágens, amely felelős egy mű létrehozásáért. @hu
scope note: A mű létrehozója magában foglal egy ágenst, amely egy másik ágenssel közösen felelős egy mű létrehozásáért akár ugyanabban a közreműködői minőségben, mint például két író közötti együttműködés, vagy eltérő közreműködői minőségben, mint például egy zeneszerző és egy szövegíró közötti együttműködés. @hu
has subproperty: has aggregator collective agent
has subproperty: has architect collective agent
has subproperty: has artist collective agent

has creator corporate body of work
status: Published
lexical alias: creatorCorporateBodyOfWork.en
definition: Relates a work to a corporate body who is responsible for creating a work.
toolkit label: creator corporate body of work
toolkit definition: A corporate body who is responsible for creating a work.
type: Property
domain: C10001
sub property of: has related corporate body of work
sub property of: has creator collective agent of work
scope note: A creator of work includes an agent who is jointly responsible for the creation of a work either by performing the same role as another agent, such as in a collaboration between two writers, or by performing a different role, such as in a collaboration between a composer and a lyricist.
label: teoksen tekijä (yhteisö) @fi
definition: Liittää teoksen yhteisöön, joka on vastuussa teoksen luomisesta. @fi
scope note: Teoksen tekijä kattaa toimijan, joka on yhteisesti vastuussa teoksen luomisesta joko toimimalla samassa roolissa kuin toinen toimija, kuten kahden kirjoittajan välisessä yhteistyössä, tai toimimalla eri rooleissa, kuten säveltäjän ja sanoittajan välisessä yhteistyössä. @fi
toolkit label: teoksen tekijä (yhteisö) @fi
toolkit definition: Yhteisö, joka on vastuussa teoksen luomisesta. @fi
label: har skaper av verk (korporasjon) @no
definition: Relaterer et verk til en korporasjon agent som er ansvarlig for å skape et verk. @no
scope note: En opphaver for verk inkluderer en agent med delt ansvar for å skape et verk, enten ved å fylle samme rolle som en annen agent, som i et samarbeid mellom to forfattere, eller ulike roller som i et samarbeid mellom en komponist og en sangtekstforfatter. @no
toolkit label: skaper av verk (korporasjon) @no
toolkit definition: En korporasjon agent som er ansvarlig for å skape et verk. @no
has element type: 3
label: heeft maker-corporatie van werk @nl
definition: Relateert een werk aan een corporatie die verantwoordelijk is voor het creëren van een werk. @nl
scope note: Een maker van werk omvat een actor die gezamenlijk verantwoordelijk is voor de creatie van een werk door ofwel dezelfde rol uit te voeren als een andere actor, zoals bij een samenwerking door twee schrijvers, ofwel door een verschillende rol uit te voeren, zoals bij een samenwerking tussen een componist en een liedtekstschrijver. @nl
toolkit label: maker-corporatie van werk @nl
toolkit definition: Een corporatie die verantwoordelijk is voor het creëren van een werk. @nl
label: هيئة منشئة عمل @ar
definition: يربط بين عمل وهيئة مسئولة عن إنشاء عمل. @ar
scope note: منشئ العمل يشمل وكيلًا مسئولاً مسئولية مشتركة عن إنشاء عمل إما عن طريق أداء نفس الدور الذي يؤديه وكيل آخر، كما هو الحال في التعاون بين كاتبين، أو عن طريق أداء دور مختلف، كما هو الحال في التعاون بين ملحن ومؤلف أغاني. @ar
toolkit label: هيئة منشئة لعمل @ar
toolkit definition: هيئة مسئولة عن إنشاء عمل. @ar
label: té com a entitat corporativa creadora d’una obra @ca
definition: Relaciona una obra amb una entitat corporativa que és responsable de la creació d’una obra. @ca
scope note: Un creador d’una obra inclou un agent que és responsable conjuntament de la creació d’una obra ja sigui realitzant la mateixa funció que un altre agent, com ara una col·laboració entre dos escriptors, o realitzant funcions diferents, com ara una col·laboració entre un compositor i un lletrista. @ca
toolkit label: entitat corporativa creadora d’una obra @ca
toolkit definition: Entitat corporativa que és responsable de la creació d’una obra. @ca
label: har korporation, som er ophav til værk @da
definition: Relaterer et værk til en korporation, som er ansvarlig for et værk. @da
scope note: Ophav til værk omfatter en agent, som har fælles ansvar for at have skabt et værk enten ved at udføre den samme rolle som en anden agent, såsom i et samarbejde mellem to forfattere, eller ved at udføre en anden rolle, såsom i et samarbejde mellem en komponist og en tekstforfatter. @da
toolkit label: korporation, som er ophav til værk @da
toolkit definition: Korporation, som er ansvarlig for et værk. @da
label: teose autor (asutus) @et
definition: Seostab teose asutusega, kes vastutab teose loomise eest. @et
scope note: Teose autor hõlmab ka tegijat, kes kaasvastutab teose loomise eest, täites teise tegijaga kas sama rolli (nt kahe kirjaniku koostöö) või erinevat rolli (nt helilooja ja sõnade autori koostöö). @et
toolkit label: teose autor (asutus) @et
toolkit definition: Asutus, kes vastutab teose loomise eest. @et
label: hat geistige Schöpferin/geistigen Schöpfer eines Werks (Körperschaft) @de
definition: Setzt ein Werk in Beziehung zu einer Körperschaft, die für die Schaffung eines Werks verantwortlich ist. @de
scope note: Darunter fällt ein Akteur, der für die Schaffung eines Werks mitverantwortlich ist, wenn er entweder dieselbe Rolle wie ein anderer Akteur ausführt, wie bei einer Zusammenarbeit zwischen zwei Schriftstellerinnen/Schriftstellern, oder eine andere Rollen ausführt, wie bei einer Zusammenarbeit zwischen einer Komponistin/einem Komponisten und einer Textdichterin/einem Textdichter. @de
toolkit label: Geistige Schöpferin/Geistiger Schöpfer eines Werks (Körperschaft) @de
toolkit definition: Eine Körperschaft, die für die Schaffung eines Werks verantwortlich ist. @de
label: ha come creatore ente di opera @it
definition: Correla un'opera a un ente responsabile di un'opera. @it
scope note: Un creatore di opera comprende un agente congiuntamente responsabile per la creazione di un'opera, sia svolgendo lo stesso ruolo di un altro agente, come in una collaborazione tra due scrittori, sia svolgendo un ruolo differente, come in una collaborazione tra un compositore e un paroliere. @it
toolkit label: creatore ente di opera @it
toolkit definition: Ente responsabile di un'opera. @it
label: a pour collectivité créatrice d’une œuvre @fr
definition: Met une œuvre en relation avec une collectivité qui est responsable de la création d’une œuvre. @fr
scope note: Un créateur d’une œuvre comprend un agent coresponsable de la création d’une œuvre soit en exerçant le même rôle qu’un autre agent, comme dans le cas d’une collaboration entre deux écrivains, soit en exerçant un rôles différent, comme dans le cas d’une collaboration entre un compositeur et un parolier. @fr
toolkit label: collectivité créatrice d’une œuvre @fr
toolkit definition: Collectivité qui est responsable de la création d’une œuvre. @fr
label: darba radītājs (institūcija) @lv
definition: Sasaista darbu ar institūciju, kas ir atbildīga par darba radīšanu. @lv
toolkit label: darba radītājs (institūcija) @lv
toolkit definition: Institūcija, kas ir atbildīga par darba radīšanu. @lv
scope note: Darba radītājs ietver aģentu, kas ir atbildīgs par darba radīšanu un pilda tādu pašu lomu kā cits aģents, piemēram, kā sadarbībā starp diviem rakstniekiem vai veicot dažādas lomas, kā piemēram, komponista un teksta autora sadarbībā. @lv
label: 有作品的创作者团体 @zh-hans
definition: 将一种作品与负责创作一种作品的一个团体关联起来。 @zh-hans
toolkit label: 作品的创作者团体 @zh-hans
toolkit definition: 负责创作一种作品的一个团体 @zh-hans
scope note: 作品的创作者包括对作品的创建联合负责的行为者，他们或者行使同样的角色（例如两个写作者之间的合作）或者行使不同角色（例如作曲者和词作者之间的合作）。 @zh-hans
label: mű létrehozó testülete a következő: @hu
definition: Hozzákapcsol egy művet egy testülethez, amely felelős egy mű létrehozásáért. @hu
toolkit label: mű létrehozó testülete: @hu
toolkit definition: Egy testület, amely felelős egy mű létrehozásáért. @hu
scope note: A mű létrehozója magában foglal egy ágenst, amely egy másik ágenssel közösen felelős egy mű létrehozásáért akár ugyanabban a közreműködői minőségben, mint például két író közötti együttműködés, vagy eltérő közreműködői minőségben, mint például egy zeneszerző és egy szövegíró közötti együttműködés. @hu
has subproperty: has aggregator corporate body
has subproperty: has defendant corporate body
has subproperty: has appellee corporate body

has creator family of work
status: Published
lexical alias: creatorFamilyOfWork.en
definition: Relates a work to a family who is responsible for creating a work.
toolkit label: creator family of work
toolkit definition: A family who is responsible for creating a work.
type: Property
domain: C10001
has element type: 2
sub property of: has related family of work
sub property of: has creator collective agent of work
scope note: A creator of work includes an agent who is jointly responsible for the creation of a work either by performing the same role as another agent, such as in a collaboration between two writers, or by performing a different role, such as in a collaboration between a composer and a lyricist.
label: teoksen tekijä (suku) @fi
definition: Liittää teoksen sukuun, joka on vastuussa teoksen luomisesta. @fi
scope note: Teoksen tekijä kattaa toimijan, joka on yhteisesti vastuussa teoksen luomisesta joko toimimalla samassa roolissa kuin toinen toimija, kuten kahden kirjoittajan välisessä yhteistyössä, tai toimimalla eri rooleissa, kuten säveltäjän ja sanoittajan välisessä yhteistyössä. @fi
toolkit label: teoksen tekijä (suku) @fi
toolkit definition: Suku, joka on vastuussa teoksen luomisesta. @fi
label: har skaper av verk (familie) @no
definition: Relaterer et verk til en familie som er ansvarlig for å skape et verk. @no
scope note: En opphaver for verk inkluderer en agent med delt ansvar for å skape et verk, enten ved å fylle samme rolle som en annen agent, som i et samarbeid mellom to forfattere, eller ulike roller som i et samarbeid mellom en komponist og en sangtekstforfatter. @no
toolkit label: skaper av verk (familie) @no
toolkit definition: En familie som er ansvarlig for å skape et verk. @no
label: heeft maker-familie van werk @nl
definition: Relateert een werk aan een familie die verantwoordelijk is voor het creëren van een werk. @nl
scope note: Een maker van werk omvat een actor die gezamenlijk verantwoordelijk is voor de creatie van een werk door ofwel dezelfde rol uit te voeren als een andere actor, zoals bij een samenwerking door twee schrijvers, ofwel door een verschillende rol uit te voeren, zoals bij een samenwerking tussen een componist en een liedtekstschrijver. @nl
toolkit label: maker-familie van werk @nl
toolkit definition: Een familie die verantwoordelijk is voor het creëren van een werk. @nl
label: له عائلة منشئة لعمل @ar
definition: يربط بين عمل وعائلة مسئولة عن إنشاء عمل. @ar
scope note: منشئ العمل يشمل وكيلًا مسئولاً مسئولية مشتركة عن إنشاء عمل إما عن طريق أداء نفس الدور الذي يؤديه وكيل آخر، كما هو الحال في التعاون بين كاتبين، أو عن طريق أداء دور مختلف، كما هو الحال في التعاون بين ملحن ومؤلف أغاني. @ar
toolkit label: عائلة منشئة لعمل @ar
toolkit definition: عائلة مسئولة عن إنشاء عمل. @ar
label: té com a família creadora d’una obra @ca
definition: Relaciona una obra amb una família que és responsable de la creació d’una obra. @ca
scope note: Un creador d’una obra inclou un agent que és responsable conjuntament de la creació d’una obra ja sigui realitzant la mateixa funció que un altre agent, com ara una col·laboració entre dos escriptors, o realitzant funcions diferents, com ara una col·laboració entre un compositor i un lletrista. @ca
toolkit label: família creadora d’una obra @ca
toolkit definition: Família que és responsable de la creació d’una obra. @ca
label: har familie, som er ophav til værk @da
definition: Relaterer et værk til en familie, som er ansvarlig for et værk. @da
scope note: Ophav til værk omfatter en agent, som har fælles ansvar for at have skabt et værk enten ved at udføre den samme rolle som en anden agent, såsom i et samarbejde mellem to forfattere, eller ved at udføre en anden rolle, såsom i et samarbejde mellem en komponist og en tekstforfatter. @da
toolkit label: familie, som er ophav til værk @da
toolkit definition: Familie, som er ansvarlig for et værk. @da
label: teose autor (perekond) @et
definition: Seostab teose perekonnaga, kes vastutab teose loomise eest. @et
scope note: Teose autor hõlmab ka tegijat, kes kaasvastutab teose loomise eest, täites teise tegijaga kas sama rolli (nt kahe kirjaniku koostöö) või erinevat rolli (nt helilooja ja sõnade autori koostöö). @et
toolkit label: teose autor (perekond) @et
toolkit definition: Perekond, kes vastutab teose loomise eest. @et
label: hat geistige Schöpferin/geistigen Schöpfer eines Werks (Familie) @de
definition: Setzt ein Werk in Beziehung zu einer Familie, die für die Schaffung eines Werks verantwortlich ist. @de
scope note: Darunter fällt ein Akteur, der für die Schaffung eines Werks mitverantwortlich ist, wenn er entweder dieselbe Rolle wie ein anderer Akteur ausführt, wie bei einer Zusammenarbeit zwischen zwei Schriftstellerinnen/Schriftstellern, oder eine andere Rollen ausführt, wie bei einer Zusammenarbeit zwischen einer Komponistin/einem Komponisten und einer Textdichterin/einem Textdichter. @de
toolkit label: Geistige Schöpferin/Geistiger Schöpfer eines Werks (Familie) @de
toolkit definition: Eine Familie, die für die Schaffung eines Werks verantwortlich ist. @de
label: mű létrehozó családja a következő: @hu
definition: Hozzákapcsol egy művet egy családhoz, amely felelős egy mű létrehozásáért. @hu
scope note: A mű létrehozója magában foglal egy ágenst, amely egy másik ágenssel közösen felelős egy mű létrehozásáért akár ugyanabban a közreműködői minőségben, mint például két író közötti együttműködés, vagy eltérő közreműködői minőségben, mint például egy zeneszerző és egy szövegíró közötti együttműködés. @hu
toolkit label: mű létrehozó családja: @hu
toolkit definition: Egy család, amely felelős egy mű létrehozásáért. @hu
label: ha come creatore famiglia di opera @it
definition: Correla un'opera alla famiglia responsabile di un'opera. @it
scope note: Un creatore di opera comprende un agente congiuntamente responsabile della creazione di un'opera, sia svolgendo lo stesso ruolo di un altro agente, come in una collaborazione tra due scrittori, sia svolgendo un ruolo differente, come in una collaborazione tra un compositore e un paroliere. @it
toolkit label: creatore famiglia di opera @it
toolkit definition: Famiglia responsabile di un'opera. @it
label: a pour famille créatrice d’une œuvre @fr
definition: Met une œuvre en relation avec une famille qui est responsable de la création d’une œuvre. @fr
scope note: Un créateur d’une œuvre comprend un agent coresponsable de la création d’une œuvre soit en exerçant le même rôle qu’un autre agent, comme dans le cas d’une collaboration entre deux écrivains, soit en exerçant un rôles différent, comme dans le cas d’une collaboration entre un compositeur et un parolier. @fr
toolkit label: famille créatrice d’une œuvre @fr
toolkit definition: Famille qui est responsable de la création d’une œuvre. @fr
label: darba radītājs (dzimta/ģimene) @lv
definition: Sasaista darbu ar dzimtu/ģimeni, kas ir atbildīga par darba radīšanu. @lv
toolkit label: darba radītājs (dzimta/ģimene) @lv
toolkit definition: Dzimta/ģimene, kas ir atbildīga par darba radīšanu. @lv
scope note: Darba radītājs ietver aģentu, kas ir atbildīgs par darba radīšanu un pilda tādu pašu lomu kā cits aģents, piemēram, kā sadarbībā starp diviem rakstniekiem vai veicot dažādas lomas, kā piemēram, komponista un teksta autora sadarbībā. @lv
label: 有作品的创作者家族 @zh-hans
definition: 将一种作品与负责创作一种作品的一个家族关联起来。 @zh-hans
toolkit label: 作品的创作者家族 @zh-hans
toolkit definition: 负责创作一种作品的一个家族 @zh-hans
scope note: 作品的创作者包括对作品的创建联合负责的行为者，他们或者行使同样的角色（例如两个写作者之间的合作）或者行使不同角色（例如作曲者和词作者之间的合作）。 @zh-hans
has subproperty: has aggregator family
has subproperty: has architect family
has subproperty: has artist family

has creator person of work
status: Published
lexical alias: creatorPersonOfWork.en
definition: Relates a work to a person who is responsible for creating a work.
toolkit label: creator person of work
toolkit definition: A person who is responsible for creating a work.
type: Property
domain: C10001
has element type: 2
sub property of: has related person of work
sub property of: has creator agent of work
scope note: A creator of work includes an agent who is jointly responsible for the creation of a work either by performing the same role as another agent, such as in a collaboration between two writers, or by performing a different role, such as in a collaboration between a composer and a lyricist.
label: teoksen tekijä (henkilö) @fi
definition: Liittää teoksen henkilöön, joka on vastuussa teoksen luomisesta. @fi
scope note: Teoksen tekijä kattaa toimijan, joka on yhteisesti vastuussa teoksen luomisesta joko toimimalla samassa roolissa kuin toinen toimija, kuten kahden kirjoittajan välisessä yhteistyössä, tai toimimalla eri rooleissa, kuten säveltäjän ja sanoittajan välisessä yhteistyössä. @fi
toolkit label: teoksen tekijä (henkilö) @fi
toolkit definition: Henkilö, joka on vastuussa teoksen luomisesta. @fi
label: har skaper av verk (person) @no
definition: Relaterer et verk til en person som er ansvarlig for å skape et verk. @no
scope note: En opphaver for verk inkluderer en agent med delt ansvar for å skape et verk, enten ved å fylle samme rolle som en annen agent, som i et samarbeid mellom to forfattere, eller ulike roller som i et samarbeid mellom en komponist og en sangtekstforfatter. @no
toolkit label: skaper av verk (person) @no
toolkit definition: En person som er ansvarlig for å skape et verk. @no
label: heeft maker-persoon van werk @nl
definition: Relateert een werk aan een persoon die verantwoordelijk is voor het creëren van een werk. @nl
scope note: Een maker van werk omvat een actor die gezamenlijk verantwoordelijk is voor de creatie van een werk door ofwel dezelfde rol uit te voeren als een andere actor, zoals bij een samenwerking door twee schrijvers, ofwel door een verschillende rol uit te voeren, zoals bij een samenwerking tussen een componist en een liedtekstschrijver. @nl
toolkit label: maker-persoon van werk @nl
toolkit definition: Een persoon die verantwoordelijk is voor het creëren van een werk. @nl
label: له شخص منشئ عمل @ar
definition: يربط بين عمل وشخص مسئول عن إنشاء عمل. @ar
scope note: منشئ العمل يشمل وكيلًا مسئولاً مسئولية مشتركة عن إنشاء عمل إما عن طريق أداء نفس الدور الذي يؤديه وكيل آخر، كما هو الحال في التعاون بين كاتبين، أو عن طريق أداء دور مختلف، كما هو الحال في التعاون بين ملحن ومؤلف أغاني. @ar
toolkit label: شخص منشئ عمل @ar
toolkit definition: شخص مسئول عن إنشاء عمل. @ar
label: té com a persona creadora d’una obra @ca
definition: Relaciona una obra amb una persona que és responsable de la creació d’una obra. @ca
scope note: Un creador d’una obra inclou un agent que és responsable conjuntament de la creació d’una obra ja sigui realitzant la mateixa funció que un altre agent, com ara una col·laboració entre dos escriptors, o realitzant funcions diferents, com ara una col·laboració entre un compositor i un lletrista. @ca
toolkit label: persona creadora d’una obra @ca
toolkit definition: Persona que és responsable de la creació d’una obra. @ca
label: har person, som er ophav til værk @da
definition: Relaterer et værk til en person, som er ansvarlig for et værk. @da
scope note: Ophav til værk omfatter en agent, som har fælles ansvar for at have skabt et værk enten ved at udføre den samme rolle som en anden agent, såsom i et samarbejde mellem to forfattere, eller ved at udføre en anden rolle, såsom i et samarbejde mellem en komponist og en tekstforfatter. @da
toolkit label: person, som er ophav til værk @da
toolkit definition: Person, som er ansvarlig for et værk. @da
label: teose autor (isik) @et
definition: Seostab teose isikuga, kes vastutab teose loomise eest. @et
scope note: Teose autor hõlmab ka tegijat, kes kaasvastutab teose loomise eest, täites teise tegijaga kas sama rolli (nt kahe kirjaniku koostöö) või erinevat rolli (nt helilooja ja sõnade autori koostöö). @et
toolkit label: teose autor (isik) @et
toolkit definition: Isik, kes vastutab teose loomise eest. @et
label: hat geistige Schöpferin/geistigen Schöpfer eines Werks (Person) @de
definition: Setzt ein Werk in Beziehung zu einer Person, die für die Schaffung eines Werks verantwortlich ist. @de
scope note: Darunter fällt ein Akteur, der für die Schaffung eines Werks mitverantwortlich ist, wenn er entweder dieselbe Rolle wie ein anderer Akteur ausführt, wie bei einer Zusammenarbeit zwischen zwei Schriftstellerinnen/Schriftstellern, oder eine andere Rollen ausführt, wie bei einer Zusammenarbeit zwischen einer Komponistin/einem Komponisten und einer Textdichterin/einem Textdichter. @de
toolkit label: Geistige Schöpferin/Geistiger Schöpfer eines Werks (Person) @de
toolkit definition: Eine Person, die für die Schaffung eines Werks verantwortlich ist. @de
label: ha come creatore persona di opera @it
definition: Correla un'opera alla persona responsabile di un'opera. @it
scope note: Un creatore di opera comprende un agente, che è congiuntamente responsabile della creazione di un'opera, sia svolgendo lo stesso ruolo di un altro agente, come in una collaborazione tra due scrittori, sia svolgendo un ruolo differente, come in una collaborazione tra un compositore e un paroliere. @it
toolkit label: creatore persona di opera @it
toolkit definition: Persona responsabile di un'opera. @it
label: a pour personne créatrice d’une œuvre @fr
definition: Met une œuvre en relation avec une personne qui est responsable de la création d’une œuvre. @fr
scope note: Un créateur d’une œuvre comprend un agent coresponsable de la création d’une œuvre soit en exerçant le même rôle qu’un autre agent, comme dans le cas d’une collaboration entre deux écrivains, soit en exerçant un rôles différent, comme dans le cas d’une collaboration entre un compositeur et un parolier. @fr
toolkit label: personne créatrice d’une œuvre @fr
toolkit definition: Personne qui est responsable de la création d’une œuvre. @fr
label: darba radītājs (persona) @lv
definition: Sasaista darbu ar personu, kura ir atbildīga par darba radīšanu. @lv
toolkit label: darba radītājs (persona) @lv
toolkit definition: Persona, kura ir atbildīga par darba radīšanu. @lv
scope note: Darba radītājs ietver aģentu, kas ir atbildīgs par darba radīšanu un pilda tādu pašu lomu kā cits aģents, piemēram, kā sadarbībā starp diviem rakstniekiem vai veicot dažādas lomas, kā piemēram, komponista un teksta autora sadarbībā. @lv
label: 有创作者个人 @zh-hans
definition: 将一种作品与负责创作一种作品的一个个人关联起来。 @zh-hans
toolkit label: 创作者个人 @zh-hans
toolkit definition: 负责创作一种作品的一个个人 @zh-hans
scope note: 作品的创作者包括对作品的创建联合负责的行为者，他们或者行使同样的角色（例如两个写作者之间的合作）或者行使不同角色（例如作曲者和词作者之间的合作）。 @zh-hans
label: mű létrehozó személye a következő: @hu
definition: Hozzákapcsol egy művet egy személyhez, aki felelős egy mű létrehozásáért. @hu
toolkit label: mű létrehozó személye: @hu
toolkit definition: Egy személy, aki felelős egy mű létrehozásáért. @hu
scope note: A mű létrehozója magában foglal egy ágenst, amely egy másik ágenssel közösen felelős egy mű létrehozásáért akár ugyanabban a közreműködői minőségben, mint például két író közötti együttműködés, vagy eltérő közreműködői minőségben, mint például egy zeneszerző és egy szövegíró közötti együttműködés. @hu
has subproperty: has academic supervisor
has subproperty: has aggregator person
has subproperty: has defendant person

has criminal defendant corporate body
status: Published
lexical alias: criminalDefendantCorporateBody.en
definition: Relates a work to a corporate body who is accused in a criminal proceeding.
toolkit label: criminal defendant corporate body
toolkit definition: A corporate body who is accused in a criminal proceeding.
type: Property
domain: C10001
sub property of: has defendant corporate body
has element type: 2
label: yhteisövastaaja rikosoikeudessa @fi
definition: Liittää teoksen yhteisöön, joka on syytettynä rikosprosessissa. @fi
toolkit label: yhteisövastaaja rikosoikeudessa @fi
toolkit definition: Yhteisö, joka on syytettynä rikosprosessissa. @fi
label: har strafferettslig saksøkt korporasjon @no
definition: Relaterer et verk til en korporasjon som er ansvarlig for å være saksøkt i en straffesak. @no
toolkit label: strafferettslig saksøkt korporasjon @no
toolkit definition: En korporasjon som er ansvarlig for å være saksøkt i en straffesak. @no
label: heeft criminele verdachte-corporatie @nl
definition: Relateert een werk aan een corporatie die is beschuldigd in een strafproces. @nl
toolkit label: criminele verdachte-corporatie @nl
toolkit definition: Een corporatie die is beschuldigd in een strafproces. @nl
label: له هيئة جنائية مدعى عليها @ar
definition: يربط بين عمل وهيئة موجَه إليها اتهام في دعوى جنائية. @ar
toolkit label: هيئة جنائية مدعى عليها @ar
toolkit definition: هيئة موجَه إليها اتهام في دعوى جنائية. @ar
label: té com a entitat corporativa acusada penal @ca
definition: Relaciona una obra amb una entitat corporativa que és acusada en un procés penal. @ca
toolkit label: entitat corporativa acusada penal @ca
toolkit definition: Entitat corporativa que és acusada en un procés penal. @ca
label: har korporation, som er sagsøgt @da
definition: Relaterer et værk til en korporation, som er ansvarlig for at blive anklaget i en straffesag. @da
toolkit label: korporation, som er sagsøgt @da
toolkit definition: Korporation, som er ansvarlig for at blive anklaget i en straffesag. @da
label: süüdistatav (asutus) @et
definition: Seostab teose asutusega, kelle vastu on esitatud süüdistus kriminaalkohtumenetluses. @et
toolkit label: süüdistatav (asutus) @et
toolkit definition: Asutus, kelle vastu on esitatud süüdistus kriminaalkohtumenetluses. @et
label: hat Angeklagte/Angeklagten in einem Strafverfahren (Körperschaft) @de
definition: Setzt ein Werk in Beziehung zu einer Körperschaft, die in einem Strafverfahren angeklagt ist. @de
toolkit label: Angeklagte/Angeklagter in einem Strafverfahren (Körperschaft) @de
toolkit definition: Eine Körperschaft, die in einem Strafverfahren angeklagt ist. @de
label: bűnvádi eljárás alperes testülete a következő: @hu
definition: Hozzákapcsol egy művet egy testülethez, amelyet egy büntetőeljárásban vádolnak. @hu
toolkit label: bűnvádi eljárásban alperes testület: @hu
toolkit definition: Egy testület, amelyet egy büntetőeljárásban vádolnak. @hu
label: ha come imputato penale ente @it
definition: Correla un'opera a un ente accusato in un procedimento penale. @it
toolkit label: imputato ente @it
toolkit definition: Ente accusato in un procedimento penale. @it
label: a pour collectivité défenderesse criminelle @fr
definition: Met une œuvre en relation avec une collectivité qui est accusée dans une poursuite criminelle. @fr
toolkit label: collectivité défenderesse criminelle @fr
toolkit definition: Collectivité qui est accusée dans une poursuite criminelle. @fr
label: atbildētājs kriminālprocesā (institūcija) @lv
definition: Sasaista darbu ar institūciju, pret kuru celta prasība kriminālprocesā. @lv
toolkit label: atbildētājs kriminālprocesā (institūcija) @lv
toolkit definition: Institūcija, pret kuru celta prasība kriminālprocesā. @lv
label: 有刑事被告团体 @zh-hans
definition: 将一种作品与在一项刑事诉讼中被指控的一个团体关联起来。 @zh-hans
toolkit label: 刑事被告团体 @zh-hans
toolkit definition: 在一项刑事诉讼中被指控的一个团体 @zh-hans
has subproperty: P10394
label: sanık tüzel kişisi ile ilişkilidir @tr
definition: Bir eseri, bir ceza davasında suçlanan tüzel kişi ile ilişkilendirir. @tr
toolkit label: suç sanığı tüzel kişi @tr
toolkit definition: Bir ceza kovuşturmasında suçlanan tüzel kişi. @tr

has criminal defendant person
status: Published
lexical alias: criminalDefendantPerson.en
definition: Relates a work to a person who is accused in a criminal proceeding.
toolkit label: criminal defendant person
toolkit definition: A person who is accused in a criminal proceeding.
type: Property
domain: C10001
sub property of: has defendant person
has element type: 2
label: henkilövastaaja rikosoikeudessa @fi
definition: Liittää teoksen henkilöön, joka on syytettynä rikosprosessissa. @fi
toolkit label: henkilövastaaja rikosoikeudessa @fi
toolkit definition: Henkilö, joka on syytettynä rikosprosessissa. @fi
label: har strafferettslig saksøkt person @no
definition: Relaterer et verk til en person som er saksøkt i en straffesak. @no
toolkit label: strafferettslig saksøkt person @no
toolkit definition: En person som er saksøkt i en straffesak. @no
label: heeft criminele verdachte-persoon @nl
definition: Relateert een werk aan een persoon die beschuldigd is in een strafproces. @nl
toolkit label: criminele verdachte-persoon @nl
toolkit definition: Een persoon die beschuldigd is in een strafproces. @nl
label: له شخص مدعى عليه جنائيا @ar
definition: يربط بين عمل وشخص متهم في دعوى جنائية. @ar
toolkit label: شخص مدعى عليه جنائيا @ar
toolkit definition: شخص متهم في دعوى جنائية. @ar
label: té com a persona acusada penal @ca
definition: Relaciona una obra amb una persona que és acusada en un procés penal. @ca
toolkit label: persona acusada penal @ca
toolkit definition: Persona que és acusada en un procés penal. @ca
label: har person, som er sagsøgt @da
definition: Relaterer et værk til en korporation, som er ansvarlig for at blive anklaget i en straffesag. @da
toolkit label: person, som er sagsøgt @da
toolkit definition: Person, som er anklaget i en straffesag. @da
label: süüdistatav (isik) @et
definition: Seostab teose isikuga, kelle vastu on esitatud süüdistus kriminaalkohtumenetluses. @et
toolkit label: süüdistatav (isik) @et
toolkit definition: Isik, kelle vastu on esitatud süüdistus kriminaalkohtumenetluses. @et
label: hat Angeklagte/Angeklagten in einem Strafverfahren (Person) @de
definition: Setzt ein Werk in Beziehung zu einer Person, die in einem Strafverfahren angeklagt ist. @de
toolkit label: Angeklagte/Angeklagter in einem Strafverfahren (Person) @de
toolkit definition: Eine Person, die in einem Strafverfahren angeklagt ist. @de
label: bűnvádi eljárás alperes személye a következő: @hu
definition: Hozzákapcsol egy művet egy személyhez, akit egy büntetőeljárásban vádolnak. @hu
toolkit label: bűnvádi eljárás alperes személy: @hu
toolkit definition: Egy személy, akit egy büntetőeljárásban vádolnak. @hu
label: ha come imputato persona @it
definition: Correla un'opera a una persona accusata in un procedimento penale. @it
toolkit label: imputato persona @it
toolkit definition: Persona accusata in un procedimento penale. @it
label: a pour personne défenderesse criminelle @fr
definition: Met une œuvre en relation avec une personne qui est accusée dans une poursuite criminelle. @fr
toolkit label: personne défenderesse criminelle @fr
toolkit definition: Personne qui est accusée dans une poursuite criminelle. @fr
label: atbildētājs kriminālprocesā (persona) @lv
definition: Sasaista darbu ar personu, kura ir apsūdzēta kriminālprocesā. @lv
toolkit label: atbildētājs kriminālprocesā (persona) @lv
toolkit definition: Persona, kura ir apsūdzēta kriminālprocesā. @lv
label: 有刑事被告个人 @zh-hans
definition: 将一种作品与在一项刑事诉讼中被指控的一个个人关联起来。 @zh-hans
toolkit label: 刑事被告个人 @zh-hans
toolkit definition: 在一项刑事诉讼中被指控的一个个人 @zh-hans
has subproperty: P10396
label: sanık kişisi ile ilişkilidir @tr
definition: Bir eseri, bir ceza davasında suçlanan kişiyle ilişkilendirir. @tr
toolkit label: suç sanığı kişi @tr
toolkit definition: Bir ceza yargılamasında suçlanan kişi. @tr

is critique of RDA entity
status: Published
lexical alias: critiqueOfRDAEntity.en
definition: Relates a work to an RDA entity that is critically evaluated by a work.
toolkit label: critique of RDA entity
toolkit definition: An RDA entity that is critically evaluated by a work.
type: Property
domain: C10001
has element type: 2
label: kritiikki RDA-entiteetistä @fi
definition: Liittää teoksen RDA-entiteettiin, johon kriittinen arviointi perustuu. @fi
toolkit label: kritiikki RDA-entiteetistä @fi
toolkit definition: RDA-entiteetti, johon kriittinen arviointi perustuu. @fi
label: er kritikk av RDA-entitet @no
definition: Relaterer et verk til en RDA-entitet brukt som utgangspunkt for en kritisk evaluering. @no
toolkit label: kritikk av RDA-entitet @no
toolkit definition: En RDA-entitet brukt som utgangspunkt for en kritisk evaluering. @no
label: is kritiek van RDA-entiteit @nl
definition: Relateert een werk aan een RDA-entiteit gebruikt als een basis voor een kritische beschouwing. @nl
toolkit label: kritiek van RDA-entiteit @nl
toolkit definition: Een RDA-entiteit gebruikt als een basis voor een kritische beschouwing. @nl
label: هو نقد لكيان "وام" @ar
definition: يربط بين عمل وكيان "وام" مستخدم كأساس لتقييم نقدي. @ar
toolkit label: نقد لكيان "وام" @ar
toolkit definition: كيان "وام" مستخدم كأساس لتقييم نقدي. @ar
label: és crítica d’una entitat RDA @ca
definition: Relaciona una obra amb una entitat RDA que és avaluada críticament per una obra. @ca
toolkit label: crítica d’una entitat RDA @ca
toolkit definition: Entitat RDA que és avaluada críticament per una obra. @ca
label: er kritik af RDA-entitet @da
definition: Relaterer et værk til en RDA-entitet, som anvendes som grundlag for en kritisk evaluering. @da
toolkit label: kritik af RDA-entitet @da
toolkit definition: RDA-entitet, som anvendes som grundlag for en kritisk evaluering. @da
label: arvustatud RDA olem @et
definition: Seostab teose RDA olemiga, mis on aluseks kriitilisele hinnangule. @et
toolkit label: arvustatud RDA olem @et
toolkit definition: RDA olem, mis on aluseks kriitilisele hinnangule. @et
label: ist Kritik von (RDA-Entität) @de
definition: Setzt ein Werk in Beziehung zu einer RDA-Entität, die als Grundlage für eine kritische Untersuchung verwendet wird. @de
toolkit label: Kritik von (RDA-Entität) @de
toolkit definition: Eine RDA-Entität, die als Grundlage für eine kritische Untersuchung verwendet wird. @de
label: bírálata a következő RDA-entitásnak: @hu
definition: Hozzákapcsol egy művet egy RDA-entitáshoz, amelyet egy kritikai kiértékelés alapjaként használnak. @hu
toolkit label: bírált RDA-entitás @hu
toolkit definition: Egy RDA-entitás, amelyet egy kritikai kiértékelés alapjaként használnak. @hu
label: è critica di entità RDA @it
definition: Correla un’opera a un’entità RDA utilizzata come base per una valutazione critica. @it
toolkit label: critica di entità RDA @it
toolkit definition: Entità RDA utilizzata come base per una valutazione critica. @it
label: est une critique d’une entité RDA @fr
definition: Met une œuvre en relation avec une entité RDA qui fait l’objet d’une évaluation critique par une œuvre. @fr
toolkit label: critique d’une entité RDA @fr
toolkit definition: Entité RDA qui fait l’objet d’une évaluation critique par une œuvre. @fr
sub property of: is evaluation of RDA entity
label: ir kritika RDA entītei @lv
definition: Sasaista darbu ar RDA entīti, kura tikusi kritiski novērtēta. @lv
toolkit label: kritika RDA entītei @lv
toolkit definition: RDA entīte, kura tikusi kritiski novērtēta. @lv
label: 是RDA实体的批评 @zh-hans
definition: 将一种作品与被一种作品批评性评价的一个RDA实体关联起来。 @zh-hans
toolkit label: RDA实体的批评 @zh-hans
toolkit definition: 被一种作品批评性评价的一个RDA实体 @zh-hans
has subproperty: P10359
label: RDA varlığının eleştirisidir @tr
definition: Bir eseri, bir eser tarafından eleştirel olarak değerlendirilen bir RDA varlığıyla ilişkilendirir. @tr
toolkit label: RDA varlığının eleştirisi @tr
toolkit definition: Bir çalışma tarafından eleştirel olarak değerlendirilen bir RDA varlığı. @tr

is description of family
status: Published
sub property of: has subject family
type: Property
lexical alias: descriptionOfFamily.en
definition: Relates a work to a family who is described by a work.
domain: C10001
instruction number: 23.5
toolkit label: description of family
toolkit definition: A family who is described by a work.
label: er beskrivelse af familie @da
definition: Relaterer et værk til en familie, som er beskrevet af et værk. @da
toolkit label: beskrivelse af familie @da
toolkit definition: Familie, som er beskrevet af et værk. @da
label: là mô tả của (gia đình) @vi
definition: Liên kết tác phẩm với gia đình mà tác phẩm nói về. @vi
toolkit label: mô tả của (gia đình) @vi
toolkit definition: Gia đình mà tác phẩm nói về. @vi
label: ist Beschreibung von (Familie) @de
definition: Setzt ein Werk in Beziehung zu einer Familie, die von einem Werk beschrieben wird. @de
toolkit label: Beschreibung von (Familie) @de
toolkit definition: Eine Familie, die von einem Werk beschrieben wird. @de
definition: Liittää teoksen sukuun, jota teos kuvaa. @fi
toolkit label: kuvaus suvusta @fi
toolkit definition: Suku, jota teos kuvaa. @fi
toolkit label: beskrivelse av familie @no
toolkit definition: En familie som beskrives av et verk. @no
label: és descripció d’una família @ca
definition: Relaciona una obra amb una família que és descrita per una obra. @ca
toolkit label: descripció d’una família @ca
toolkit definition: Família que és descrita per una obra. @ca
label: est une description d’une famille @fr
definition: Met une œuvre en relation avec une famille qui est décrite par une œuvre. @fr
toolkit label: description d’une famille @fr
toolkit definition: Famille qui est décrite par une œuvre. @fr
sub property of: is description of collective agent
has element type: 2
label: είναι περιγραφή της (οικογένεια) @el
definition: Συνδέει ένα έργο με μια οικογένεια που περιγράφεται από ένα περιγραφικό έργο. @el
toolkit label: περιγραφή της (οικογένεια) @el
toolkit definition: Μια οικογένεια που περιγράφεται από ένα περιγραφικό έργο. @el
label: leírása a következő családnak: @hu
definition: Hozzákapcsol egy művet egy családhoz, amelyet egy mű leír. @hu
toolkit definition: Egy család, amelyet egy mű leír. @hu
label: kuvaus suvusta @fi
label: er beskrivelse av familie @no
definition: Relaterer et verk til en familie som beskrives av et verk. @no
label: is beschrijving van familie @nl
definition: Relateert een werk aan een familie die beschreven wordt door een werk. @nl
toolkit label: beschrijving van familie @nl
toolkit definition: Een familie die beschreven wordt door een werk. @nl
label: هو وصف لعائلة @ar
definition: يربط بين عمل وعائلة موصوفة في عمل. @ar
toolkit label: وصف لعائلة @ar
toolkit definition: عائلة موصوفة في عمل. @ar
label: kirjeldatud perekond @et
definition: Seostab teose perekonnaga, keda teoses on kirjeldatud. @et
toolkit label: kirjeldatud perekond @et
toolkit definition: Perekond, keda teoses on kirjeldatud. @et
toolkit label: leírt család: @hu
label: è descrizione di famiglia @it
definition: Correla un'opera a una famiglia che è descritta da un'opera. @it
toolkit label: descrizione di famiglia @it
toolkit definition: Famiglia che è descritta da un'opera. @it
label: ir apraksts dzimtai/ģimenei @lv
definition: Sasaista darbu ar dzimtu/ģimeni, kas aprakstīta darbā. @lv
toolkit label: apraksts dzimtai/ģimenei @lv
toolkit definition: Dzimta/ģimene, kas aprakstīta darbā. @lv
label: 是家族的描述 @zh-hans
definition: 将一种作品与被一种作品描述的一个家族关联起来。 @zh-hans
toolkit label: 家族的描述 @zh-hans
toolkit definition: 被一种作品描述的一个家族 @zh-hans
has subproperty: is metadata description of family
has subproperty: P10327
label: ailenin tanımıdır @tr
definition: Bir eseri, eser tarafından tanımlanan bir aileyle ilişkilendirir. @tr
toolkit label: ailenin tanımı @tr
toolkit definition: Bir çalışma tarafından tanımlanan aile. @tr

has date of capture of representative expression
status: Published
type: Property
lexical alias: dateOfCaptureOfRepresentativeExpression.en
definition: Relates a work to a timespan that is associated with recording, filming, etc., the content of a representative expression.
domain: C10001
toolkit label: date of capture of representative expression
has element type: 3
toolkit definition: A timespan that is associated with recording, filming, etc., the content of a representative expression.
sub property of: has date of work
label: edustavan ekspression tallennusajankohta @fi
definition: Liittää teoksen ajanjaksoon, joka liittyy edustavan ekspression sisällön äänitykseen, filmaukseen tms. @fi
toolkit label: edustavan ekspression tallennusajankohta @fi
toolkit definition: Ajanjakso, joka liittyy edustavan ekspression sisällön äänitykseen, filmaukseen tms. @fi
label: har tidspunkt for opptak for representativt uttrykk @no
definition: Relaterer et verk til et tidsrom som forbindes med innspilling, opptak, etc. av innholdet i et representativt uttrykk. @no
toolkit label: tidspunkt for opptak for representativt uttrykk @no
toolkit definition: Et tidsrom som forbindes med innspilling, opptak, etc. av innholdet i et representativt uttrykk. @no
label: heeft datum van vastleggen van representatieve expressie @nl
definition: Relateert een werk aan een tijdspanne die geassocieerd is met het opnemen, filmen etc. van de content van een representatieve expressie. @nl
toolkit label: datum van vastleggen van representatieve expressie @nl
toolkit definition: Een tijdspanne die geassocieerd is met het opnemen, filmen etc. van de content van een representatieve expressie. @nl
label: له تاريخ التقاط لتعبيرة ممثِلة @ar
definition: يربط بين عمل وفترة زمنية مرتبطة بتسجيل محتوى تعبيرة ممثِلة، أو تصويره، إلخ. @ar
toolkit label: تاريخ التقاط لتعبيرة ممثِلة @ar
toolkit definition: فترة زمنية مرتبطة بتسجيل محتوى تعبيرة ممثِلة، أو تصويره، إلخ. @ar
label: té com a data de captura d’una expressió representativa @ca
definition: Relaciona una obra amb un interval de temps que s’associa amb l’enregistrament, la filmació, etc. del contingut d’una expressió representativa. @ca
toolkit label: data de captura d’una expressió representativa @ca
toolkit definition: Interval de temps que s’associa amb l’enregistrament, la filmació, etc. del contingut d’una expressió representativa. @ca
label: har dato for indspilning af repræsentativt udtryk @da
definition: Relaterer et værk til en tidsperiode, som er knyttet til indspilning, filmoptagelse, etc., af et repræsentativt udtryks indhold. @da
toolkit label: dato for indspilning af repræsentativt udtryk @da
toolkit definition: Tidsperiode, som er knyttet til indspilning, filmoptagelse, etc., af et repræsentativt udtryks indhold. @da
label: iseloomuliku väljenduse jäädvustamise daatum @et
definition: Seostab teose ajavahemikuga, mis on seotud iseloomuliku väljenduse sisu salvestamise, filmimise vms jäädvustamisega. @et
toolkit label: iseloomuliku väljenduse jäädvustamise daatum @et
toolkit definition: Ajavahemik, mis on seotud iseloomuliku väljenduse sisu salvestamise, filmimise vms jäädvustamisega. @et
label: hat Aufzeichnungsdatum einer repräsentativen Expression @de
definition: Setzt ein Werk in Beziehung zu einem Zeitraum, der mit der Aufnahme, dem Filmen und so weiter des Inhalts einer Expression in Verbindung steht. @de
toolkit label: Aufzeichnungsdatum einer repräsentativen Expression @de
toolkit definition: Ein Zeitraum, der mit der Aufnahme, dem Filmen und so weiter des Inhalts einer repräsentativen Expression in Verbindung steht. @de
label: reprezentatív kifejezési forma rögzítési dátuma a következő: @hu
definition: Hozzákapcsol egy művet egy időtartamhoz, amely egy reprezentatív kifejezési forma tartalmának rögzítéséhez, filmezéséhez, stb. kapcsolódik. @hu
toolkit label: reprezentatív kifejezési formához tartozó rögzítési dátum @hu
toolkit definition: Egy időtartam, amely egy reprezentatív kifejezési forma tartalmának rögzítéséhez, filmezéséhez, stb. kapcsolódik. @hu
label: ha come data di cattura di espressione rappresentativa @it
definition: Correla un’opera a un intervallo di date associate alla registrazione, ripresa, etc. del contenuto di un’espressione rappresentativa. @it
toolkit label: data di cattura di espressione rappresentativa @it
toolkit definition: Intervallo di date associate alla registrazione, ripresa, etc. del contenuto di un’espressione rappresentativa. @it
label: a pour date de captation d’une expression représentative @fr
definition: Met une œuvre en relation avec un laps de temps qui est associé à l’enregistrement, au tournage, etc. du contenu d’une expression représentative. @fr
toolkit label: date de captation d’une expression représentative @fr
toolkit definition: Laps de temps qui est associé à l’enregistrement, au tournage, etc. du contenu d’une expression représentative. @fr
label: reprezentatīvās izteiksmes tveršanas datējums @lv
definition: Sasaista darbu ar laikposmu, kas saistīts ar reprezentatīvās izteiksmes satura ierakstīšanu, filmēšanu u.tml. @lv
toolkit label: reprezentatīvās izteiksmes tveršanas datējums @lv
toolkit definition: Laikposms, kas saistīts ar reprezentatīvās izteiksmes satura ierakstīšanu, filmēšanu u.tml. @lv
label: 有代表性内容表达的摄录日期 @zh-hans
definition: 将一种作品与和一种代表性内容表达的内容的录制、摄制等有关的一个时间段关联起来。 @zh-hans
toolkit label: 代表性内容表达的摄录日期 @zh-hans
toolkit definition: 和一种代表性内容表达的内容的录制、摄制等有关的一个时间段 @zh-hans
has subproperty: P10350
label: temsili anlatım kayıt tarihi ile ilişkilidir @tr
definition: Bir eseri, temsili bir anlatımın içeriği olan kayıt, filme alma vb. ile bağlantılı olan bir zaman aralığıyla ilişkilendirir. @tr
toolkit label: temsili anlatımın kaydedilme tarihi @tr
toolkit definition: Temsili bir anlatımın içeriğinin kaydedilmesi, filme alınması vb. ile bağlantılı olan bir zaman aralığı. @tr

has date of representative expression
status: Published
lexical alias: dateOfRepresentativeExpression.en
definition: Relates a work to a timespan that is the earliest associated with a representative expression of a work.
toolkit label: date of representative expression
toolkit definition: A timespan that is the earliest associated with a representative expression of a work.
type: Property
domain: C10001
sub property of: has related timespan of work
has element type: 3
label: edustavan ekspression ajankohta @fi
definition: Liittää teoksen varhaisimpaan teoksen edustavaan ekspressioon liittyvään ajanjaksoon. @fi
toolkit label: edustavan ekspression ajankohta @fi
toolkit definition: Varhaisin teoksen edustavaan ekspressioon liittyvä ajanjakso. @fi
label: har dato for representativt uttrykk @no
definition: Relaterer et verk til det tidligste tidsrommet som forbindes med et representativt uttrykk av et verk. @no
toolkit label: dato for representativt uttrykk @no
toolkit definition: Det tidligste tidsrommet som forbindes med et representativt uttrykk av et verk. @no
label: heeft datum van representatieve expressie @nl
definition: Relateert een werk aan een tijdspanne die de vroegste datum geassocieerd met een representatieve expressie van een werk is. @nl
toolkit label: datum van representatieve expressie @nl
toolkit definition: Een tijdspanne die de vroegste datum geassocieerd met een representatieve expressie van een werk is. @nl
label: له تاريخ تعبيرة ممثِلة @ar
definition: يربط بين عمل وفترة زمنية هي الفترة الأقدم المرتبطة بتعبيرة ممثِلة لعمل. @ar
toolkit label: تاريخ تعبيرة ممثِلة @ar
toolkit definition: فترة زمنية هي الفترة الأقدم المرتبطة بتعبيرة ممثِلة لعمل. @ar
label: té com a data d’una expressió representativa @ca
definition: Relaciona una obra amb un interval de temps que és el més antic associat amb una expressió representativa d’una obra. @ca
toolkit label: data d’una expressió representativa @ca
toolkit definition: Interval de temps que és el més antic associat amb una expressió representativa d’una obra. @ca
label: har dato for repræsentativt udtryk @da
definition: Relaterer et værk til en tidsperiode, som er den tidligste dato knyttet til et værks repræsentative udtryk. @da
toolkit label: dato for repræsentativt udtryk @da
toolkit definition: Tidsperiode, som er den tidligste dato knyttet til et værks repræsentative udtryk. @da
label: iseloomuliku väljenduse daatum @et
definition: Seostab teose varaseima ajavahemikuga, mis on seotud teose iseloomuliku väljendusega. @et
toolkit label: iseloomuliku väljenduse daatum @et
toolkit definition: Varaseim ajavahemik, mis on seotud teose iseloomuliku väljendusega. @et
label: hat Datum einer repräsentativen Expression @de
definition: Setzt ein Werk in Beziehung zu dem frühesten Zeitraum, der mit einer repräsentativen Expression eines Werks in Verbindung steht. @de
toolkit label: Datum einer repräsentativen Expression @de
toolkit definition: Der früheste Zeitraum, der mit einer repräsentativen Expression eines Werks in Verbindung steht. @de
label: reprezentatív kifejezési forma dátuma a következő: @hu
definition: Hozzákapcsol egy művet egy legkorábbi időtartamhoz, amely egy mű reprezentatív kifejezési formájával társítható. @hu
toolkit label: reprezentatív kifejezési formához tartozó dátum @hu
toolkit definition: Egy legkorábbi időtartam, amely egy mű reprezentatív kifejezési formájával társítható. @hu
label: ha come data di espressione rappresentativa @it
definition: Correla un'opera a al primo arco di tempo associato a un'espressione rappresentativa di un'opera. @it
toolkit label: data di espressione rappresentativa @it
toolkit definition: Primo arco di tempo associato a un'espressione rappresentativa di un'opera. @it
label: a pour date d’une expression représentative @fr
definition: Met une œuvre en relation avec un laps de temps qui est le plus ancien associé à une expression représentative d’une œuvre. @fr
toolkit label: date d’une expression représentative @fr
toolkit definition: Laps de temps qui est le plus ancien associé à une expression représentative d’une œuvre. @fr
label: reprezentatīvās izteiksmes datējums @lv
definition: Sasaista darbu ar laikposmu, kas saistīts ar agrāko darba reprezentatīvo izteiksmi. @lv
toolkit label: reprezentatīvās izteiksmes datējums @lv
toolkit definition: Agrākais laikposms, kas saistīts ar darba reprezentatīvo izteiksmi. @lv
label: 有代表性内容表达的日期 @zh-hans
definition: 将一种作品与和一种作品的代表性内容表达有关的最早的时间段关联起来。 @zh-hans
toolkit label: 代表性内容表达的日期 @zh-hans
toolkit definition: 和一种作品的代表性内容表达有关的最早的时间段 @zh-hans
has subproperty: P10398
label: temsili anlatım tarihi ile ilişkilidir @tr
definition: Bir eseri, bir eserin temsili anlatımı ile bağlantılı olan en eski zaman aralığı ile ilişkilendirir. @tr
toolkit label: temsili anlatımın tarihi @tr
toolkit definition: Bir eserin temsili anlatımı ile bağlantılı olan en erken zaman aralığı. @tr

has date of work
status: Published
definition: Relates a work to a timespan that is the earliest associated with a work.
type: Property
domain: C10001
lexical alias: dateOfWork.en
instruction number: 6.4
toolkit label: date of work
toolkit definition: A timespan that is the earliest associated with a work.
toolkit label: date d’une œuvre @fr
toolkit definition: Laps de temps qui est le plus ancien associé à une œuvre. @fr
toolkit label: fecha de la obra @es
toolkit definition: La fecha más antigua asociada con una obra. @es
label: har tid för verket @sv
toolkit label: tid för verket @sv
label: har dato for værk @da
definition: Relaterer et værk til en tidsperiode, som er den tidligste dato knyttet til et værk. @da
toolkit label: dato for værk @da
toolkit definition: Tidsperiode, som er den tidligste dato knyttet til et værk. @da
definition: Met une œuvre en relation avec un laps de temps qui est le plus ancien associé à une œuvre. @fr
label: có ngày của tác phẩm @vi
definition: Liên kết tác phẩm với ngày sớm nhất liên quan tới tác phẩm. @vi
toolkit label: ngày của tác phẩm @vi
toolkit definition: Ngày sớm nhất liên quan tới tác phẩm. @vi
label: hat Datum eines Werks @de
definition: Setzt ein Werk in Beziehung zu dem frühesten Zeitraum, der mit einem Werk in Verbindung steht. @de
toolkit label: Datum eines Werks @de
toolkit definition: Der früheste Zeitraum, der mit einem Werk in Verbindung steht. @de
label: a pour date d’une œuvre @fr
definition: Liittää teoksen varhaisimpaan teokseen liittyvään ajanjaksoon. @fi
toolkit label: teoksen ajankohta @fi
toolkit definition: Varhaisin teokseen liittyvä ajanjakso. @fi
toolkit label: tidspunkt for verk @no
toolkit definition: Et tidsrom som er det tidligste tidspunktet som kan forbindes med et verk. @no
label: té com a data d’obra @ca
definition: Relaciona una obra amb un interval de temps que és el més antic associat amb una obra. @ca
toolkit label: data d’obra @ca
toolkit definition: Interval de temps que és una data més antiga associada amb una obra. @ca
sub property of: has related timespan of work
has element type: 3
label: έχει χρονολογία του έργου @el
definition: Συνδέει ένα έργο με μια προηγούμενη χρονολογία συνδεδεμένη με ένα έργο. @el
toolkit label: χρονολογία του έργου @el
toolkit definition: Μια προηγούμενη χρονολογία συνδεδεμένη με ένα έργο. @el
label: mű dátuma a következő: @hu
definition: Hozzákapcsol egy művet egy legkorábbi időtartamhoz, ami egy művel társítható. @hu
toolkit label: műhöz tartozó dátum @hu
toolkit definition: Egy legkorábbi időtartam, ami egy művel társítható. @hu
label: teoksen ajankohta @fi
label: har tidspunkt for verk @no
definition: Relaterer et verk til et tidsrom som er det tidligste tidspunktet som kan forbindes med et verk. @no
label: heeft datum van werk @nl
definition: Relateert een werk aan een tijdspanne die de vroegste is, geassocieerd met een werk. @nl
toolkit label: datum van werk @nl
toolkit definition: Een tijdspanne die de vroegste is, geassocieerd met een werk. @nl
label: له تاريخ عمل @ar
definition: يربط بين عمل وفترة زمنية تمثل أقدم تاريخ مرتبط بعمل. @ar
toolkit label: تاريخ عمل @ar
toolkit definition: فترة زمنية عبارة عن أقدم تاريخ مرتبط بعمل. @ar
label: teose daatum @et
definition: Seostab teose ajavahemikuga, milleks on teosega seotud varaseim daatum. @et
toolkit label: teose daatum @et
toolkit definition: Ajavahemik, milleks on teosega seotud varaseim daatum. @et
label: ha come data dell'opera @it
definition: Correla un’opera a un intervallo di tempo che è la prima data associata a un'opera. @it
toolkit label: data dell'opera @it
toolkit definition: Intervallo di tempo che è la prima data associata a un'opera. @it
label: darba datējums @lv
definition: Sasaista darbu ar laikposmu, kas ir agrākais darba radīšanas datējums. @lv
toolkit label: darba datējums @lv
toolkit definition: Agrākais darba radīšanas datējums. @lv
label: 有作品的日期 @zh-hans
definition: 将一种作品与和一种作品有关的最早的时间段关联起来。 @zh-hans
toolkit label: 作品的日期 @zh-hans
toolkit definition: 和一种作品有关的最早的时间段 @zh-hans
has subproperty: has date of capture of representative expression
has subproperty: has year degree granted
has subproperty: P10219
label: eser tarihi ile ilişkilidir @tr
definition: Bir eseri, eserle bağlantılı olan en erken zaman aralığıyla ilişkilendirir. @tr

has dedicatee agent of work
status: Published
definition: Relates a work to an agent to whom a work is dedicated.
type: Property
domain: C10001
sub property of: has related agent of work
lexical alias: dedicateeAgentOfWork.en
toolkit label: dedicatee agent of work
toolkit definition: An agent to whom a work is dedicated.
toolkit label: agent dédicataire d’une œuvre @fr
toolkit definition: Agent à qui une œuvre est dédiée. @fr
toolkit label: destinatario de una dedicatoria @es
toolkit definition: Una persona, familia o entidad corporativa a la cual se dedicó una obra. @es
instruction number: 18.5
label: har agent, som er tilegnet i værk @da
definition: Relaterer et værk til en agent, som et værk er tilegnet. @da
toolkit label: agent, som er tilegnet i værk @da
toolkit definition: Agent, som et værk er tilegnet. @da
definition: Met une œuvre en relation avec un agent à qui une œuvre est dédiée. @fr
label: có người được đề tặng @vi
definition: Liên kết tác phẩm với tác nhân mà tác phẩm đề tặng. @vi
toolkit label: người được đề tặng @vi
toolkit definition: Tác nhân mà tác phẩm đề tặng. @vi
label: hat Widmungsempfängerin/Widmungsempfänger eines Werks (Akteur) @de
definition: Setzt ein Werk in Beziehung zu einem Akteur, dem ein Werk gewidmet ist. @de
toolkit label: Widmungsempfängerin/Widmungsempfänger eines Werks (Akteur) @de
toolkit definition: Ein Akteur, dem ein Werk gewidmet ist. @de
label: a pour agent dédicataire d’une œuvre @fr
definition: Liittää teoksen toimijaan, jolle teos on omistettu. @fi
toolkit label: teoksen omistuksen kohde (toimija) @fi
toolkit definition: Toimija, jolle teos on omistettu. @fi
toolkit label: verk tilegnet til (agent) @no
toolkit definition: En agent som et verk er dedisert til. @no
label: té com a agent dedicatari d’una obra @ca
definition: Relaciona una obra amb un agent a qui es dedica una obra. @ca
toolkit label: agent dedicatari d’una obra @ca
toolkit definition: Agent a qui es dedica una obra. @ca
has element type: 2
label: έχει αποδέκτη αφιέρωσης @el
definition: Συνδέει ένα έργο με έναν φορέα, στον οποίο είναι αφιερωμένο το έργο. @el
toolkit label: αποδέκτης αφιέρωσης @el
toolkit definition: Ένας φορέας στον οποίο είναι αφιερωμένο ένα έργο. @el
label: mű dedikált ágense a következő: @hu
definition: Hozzákapcsol egy művet egy ágenshez, amelynek egy művet dedikálnak. @hu
toolkit label: mű dedikált ágense: @hu
toolkit definition: Egy ágens, amelynek egy művet dedikálnak. @hu
alternative label: dedicatee
alternative label: teoksen omistuksen kohde @fi
label: teoksen omistuksen kohde (toimija) @fi
label: har verk tilegnet til (agent) @no
definition: Relaterer et verk til en agent som et verk er dedisert til. @no
alternative label: verk tilegnet til @no
label: heeft opgedragene-actor van werk @nl
definition: Relateert een werk aan een actor aan wie een werk is opgedragen. @nl
toolkit label: opgedragene-actor van werk @nl
toolkit definition: Een actor aan wie een werk is opgedragen. @nl
label: له وكيل مُهدى إليه عمل @ar
definition: يربط بين عمل ووكيل مُهدى إليه عمل. @ar
alternative label: مُهدى إليه @ar
toolkit label: وكيل مُهدى إليه عمل @ar
toolkit definition: وكيل مُهدى إليه عمل. @ar
alternative label: dedicatari @ca
alternative label: dedikeret til i værk @da
label: teose pühenduse saaja (tegija) @et
definition: Seostab teose tegijaga, kellele teos on pühendatud. @et
alternative label: teose pühenduse saaja @et
alternative label: teose dedikatsiooni saaja (tegija) @et
toolkit label: teose pühenduse saaja (tegija) @et
toolkit definition: Tegija, kellele teos on pühendatud. @et
alternative label: dedikált: @hu
label: ha come dedicatario agente di opera @it
definition: Correla un'opera a un agente a cui un'opera è dedicata. @it
alternative label: dedicatario di opera @it
toolkit label: dedicatario agente di opera @it
toolkit definition: Agente a cui è dedicata un'opera. @it
alternative label: dédicataire @fr
label: veltījumdarbs aģentam @lv
definition: Sasaista darbu ar aģentu, kam ir veltīts darbs. @lv
toolkit label: veltījumdarbs aģentam @lv
toolkit definition: Aģents, kam ir veltīts darbs. @lv
toolkit label: 作品的被题献者行为者 @zh-hans

has dedicatee collective agent of work
status: Published
lexical alias: dedicateeCollectiveAgentOfWork.en
definition: Relates a work to a collective agent to whom a work is dedicated.
toolkit label: dedicatee collective agent of work
toolkit definition: A collective agent to whom a work is dedicated.
type: Property
domain: C10001
has element type: 2
sub property of: has related collective agent of work
sub property of: has dedicatee agent of work
label: teoksen omistuksen kohde (yhteistoimija) @fi
definition: Liittää teoksen yhteistoimijaan, jolle teos on omistettu. @fi
toolkit label: teoksen omistuksen kohde (yhteistoimija) @fi
toolkit definition: Yhteistoimija, jolle teos on omistettu. @fi
label: har kollektiv agent som verk er tilegnet @no
definition: Relaterer et verk til en kollektiv agent som et verk er dedisert til. @no
toolkit label: kollektiv agent som verk er tilegnet @no
toolkit definition: En kollektiv agent som et verk er dedisert til. @no
label: heeft opgedragene-collectieve actor van werk @nl
definition: Relateert een werk aan een collectieve actor aan wie een werk is opgedragen. @nl
toolkit label: opgedragene-collectieve actor van werk @nl
toolkit definition: Een collectieve actor aan wie een werk is opgedragen. @nl
label: له وكيل جماعي مُهدى إليه عمل @ar
definition: يربط بين عمل ووكيل جماعي مُهدى إليه عمل. @ar
toolkit label: وكيل جماعي مُهدى إليه عمل @ar
toolkit definition: وكيل جماعي مُهدى إليه عمل. @ar
label: té com a agent col·lectiu dedicatari d’una obra @ca
definition: Relaciona una obra amb un agent col·lectiu a qui es dedica una obra. @ca
toolkit label: agent col·lectiu dedicatari d’una obra @ca
toolkit definition: Agent col·lectiu a qui es dedica una obra. @ca
label: har kollektiv agent, som er tilegnet i værk @da
definition: Relaterer et værk til en kollektiv agent, som et værk er tilegnet. @da
toolkit label: kollektiv agent, som er tilegnet i værk @da
toolkit definition: Kollektiv agent, som et værk er tilegnet. @da
label: teose pühenduse saaja (kollektiiv) @et
definition: Seostab teose kollektiiviga, kellele teos on pühendatud. @et
alternative label: teose dedikatsiooni saaja (kollektiiv) @et
toolkit label: teose pühenduse saaja (kollektiiv) @et
toolkit definition: Kollektiiv, kellele teos on pühendatud. @et
label: hat Widmungsempfängerin/Widmungsempfänger eines Werks (Gemeinschaftlicher Akteur) @de
definition: Setzt ein Werk in Beziehung zu einem gemeinschaftlichen Akteur, dem ein Werk gewidmet ist. @de
toolkit label: Widmungsempfängerin/Widmungsempfänger eines Werks (Gemeinschaftlicher Akteur) @de
toolkit definition: Ein gemeinschaftlicher Akteur, dem ein Werk gewidmet ist. @de
label: mű dedikált kollektív ágense a következő: @hu
definition: Hozzákapcsol egy művet egy kollektív ágenshez, amelynek egy művet dedikálnak. @hu
toolkit label: mű dedikált kollektív ágense: @hu
toolkit definition: Egy kollektív ágens, amelynek egy művet dedikálnak. @hu
label: ha come dedicatario agente collettivo di opera @it
definition: Correla un'opera a un agente collettivo al quale un'opera è dedicata. @it
toolkit label: dedicatario agente collettivo di opera @it
toolkit definition: Agente collettivo al quale un'opera è dedicata. @it
label: a pour agent collectif dédicataire d’une œuvre @fr
definition: Met une œuvre en relation avec un agent collectif à qui une œuvre est dédiée. @fr
toolkit label: agent collectif dédicataire d’une œuvre @fr
toolkit definition: Agent collectif à qui une œuvre est dédiée. @fr
label: veltījumdarbs grupai @lv
definition: Sasaista darbu ar grupu, kam ir veltīts darbs. @lv
toolkit label: veltījumdarbs grupai @lv
toolkit definition: Grupa, kam ir veltīts darbs. @lv
label: 有作品的被题献者集体行为者 @zh-hans
definition: 将一种作品与一种作品被题献的一个集体行为者关联起来。 @zh-hans
toolkit label: 作品的被题献者集体行为者 @zh-hans
toolkit definition: 一种作品被题献的一个集体行为者 @zh-hans
has subproperty: has dedicatee corporate body of work
has subproperty: has dedicatee family of work
has subproperty: P10459
label: eserin ithaf edilen kolektif temsilcisi ile ilişkilidir @tr
definition: Bir eseri, eserin adanmış olduğu kolektif bir temsilci ile ilişkilendirir. @tr
toolkit label: eserin adandığı kolektif temsilci @tr
toolkit definition: Bir eserin adanmış olduğu kolektif bir temsilci. @tr

has dedicatee corporate body of work
status: Published
lexical alias: dedicateeCorporateBodyOfWork.en
definition: Relates a work to a corporate body to whom a work is dedicated.
toolkit label: dedicatee corporate body of work
toolkit definition: A corporate body to whom a work is dedicated.
type: Property
domain: C10001
has element type: 2
sub property of: has related corporate body of work
sub property of: has dedicatee collective agent of work
label: teoksen omistuksen kohde (yhteisö) @fi
definition: Liittää teoksen yhteisöön, jolle teos on omistettu. @fi
toolkit label: teoksen omistuksen kohde (yhteisö) @fi
toolkit definition: Yhteisö, jolle teos on omistettu. @fi
label: har korporasjon som verk er tilegnet @no
definition: Relaterer et verk til en korporasjon som et verk er dedisert til. @no
toolkit label: korporasjon som verk er tilegnet @no
toolkit definition: En korporasjon som et verk er dedisert til. @no
label: heeft opgedragene-corporatie van werk @nl
definition: Relateert een werk aan een corporatie aan wie een werk is opgedragen. @nl
toolkit label: opgedragene-corporatie van werk @nl
toolkit definition: Een corporatie aan wie een werk is opgedragen. @nl
label: له هيئة مُهدى إليها عمل @ar
definition: يربط بين عمل وهيئة مُهدى إليها عمل. @ar
toolkit label: هيئة مُهدى إليها عمل @ar
toolkit definition: هيئة مُهدى إليها عمل. @ar
label: té com a entitat corporativa dedicatària d’una obra @ca
definition: Relaciona una obra amb una entitat corporativa a qui es dedica una obra. @ca
toolkit label: entitat corporativa dedicatària d’una obra @ca
toolkit definition: Entitat corporativa a qui es dedica una obra. @ca
label: har korporation, som er tilegnet i værk @da
definition: Relaterer et værk til en korporation, som et værk er tilegnet. @da
toolkit label: korporation, som er tilegnet i værk @da
toolkit definition: Korporation, som et værk er tilegnet. @da
label: teose pühenduse saaja (asutus) @et
definition: Seostab teose asutusega, kellele teos on pühendatud. @et
alternative label: teose dedikatsiooni saaja (asutus) @et
toolkit label: teose pühenduse saaja (asutus) @et
toolkit definition: Asutus, kellele teos on pühendatud. @et
label: hat Widmungsempfängerin/Widmungsempfänger eines Werks (Körperschaft) @de
definition: Setzt ein Werk in Beziehung zu einer Körperschaft, der ein Werk gewidmet ist. @de
toolkit label: Widmungsempfängerin/Widmungsempfänger eines Werks (Körperschaft) @de
toolkit definition: Eine Körperschaft, der ein Werk gewidmet ist. @de
label: mű dedikált testülete a következő: @hu
definition: Hozzákapcsol egy művet egy testülethez, amelynek egy művet dedikálnak. @hu
toolkit label: mű dedikált testülete: @hu
toolkit definition: Egy testület, amelynek egy művet dedikálnak. @hu
label: ha come dedicatario ente di opera @it
definition: Correla un'opera a un ente al quale un'opera è dedicata. @it
toolkit label: dedicatario ente di opera @it
toolkit definition: Ente al quale un'opera è dedicata. @it
label: a pour collectivité dédicataire d’une œuvre @fr
definition: Met une œuvre en relation avec une collectivité à qui une œuvre est dédiée. @fr
toolkit label: collectivité dédicataire d’une œuvre @fr
toolkit definition: Collectivité à qui une œuvre est dédiée. @fr
label: veltījumdarbs institūcijai @lv
definition: Sasaista darbu ar institūciju, kam ir veltīts darbs. @lv
toolkit label: veltījumdarbs institūcijai @lv
toolkit definition: Institūcija, kam ir veltīts darbs. @lv
label: 有作品的被题献者团体 @zh-hans
definition: 将一种作品与一种作品被题献的一个团体关联起来。 @zh-hans
toolkit label: 作品的被题献者团体 @zh-hans
toolkit definition: 一种作品被题献的一个团体 @zh-hans
has subproperty: P10506
label: eserin ithaf edilen tüzel kişisi ile ilişkilidir @tr
definition: Bir eseri, kendisine adanan tüzel kişi ile ilişkilendirir. @tr
toolkit label: eserin adandığı tüzel kişi @tr
toolkit definition: Kendisine eser tahsis edilen tüzel kişilik. @tr

has dedicatee family of work
status: Published
lexical alias: dedicateeFamilyOfWork.en
definition: Relates a work to a family to whom a work is dedicated.
toolkit label: dedicatee family of work
toolkit definition: A family to whom a work is dedicated.
type: Property
domain: C10001
has element type: 2
sub property of: has related family of work
sub property of: has dedicatee collective agent of work
label: teoksen omistuksen kohde (suku) @fi
definition: Liittää teoksen sukuun, jolle teos on omistettu. @fi
toolkit label: teoksen omistuksen kohde (suku) @fi
toolkit definition: Suku, jolle teos on omistettu. @fi
label: har familie som verk er tilegnet @no
definition: Relaterer et verk til en familie som et verk er dedisert til. @no
toolkit label: familie som verk er tilegnet @no
toolkit definition: En familie som et verk er dedisert til. @no
label: heeft opgedragene-familie van werk @nl
definition: Relateert een werk aan een familie aan wie een werk is opgedragen. @nl
toolkit label: opgedragene-familie van werk @nl
toolkit definition: Een familie aan wie een werk is opgedragen. @nl
label: له عائلة مُهدى إليها @ar
definition: يربط بين عمل وعائلة مُهدى إليها عمل. @ar
toolkit label: عائلة مُهدى إليها عمل @ar
toolkit definition: عائلة مُهدى إليها عمل. @ar
label: té com a família dedicatària d’una obra @ca
definition: Relaciona una obra amb una família a qui es dedica una obra. @ca
toolkit label: família dedicatària d’una obra @ca
toolkit definition: Família a qui es dedica una obra. @ca
label: har familie, som er tilegnet i værk @da
definition: Relaterer et værk til en familie, som et værk er tilegnet. @da
toolkit label: familie, som er tilegnet i værk @da
toolkit definition: Familie, som et værk er tilegnet. @da
label: teose pühenduse saaja (perekond) @et
definition: Seostab teose perekonnaga, kellele teos on pühendatud. @et
alternative label: teose dedikatsiooni saaja (perekond) @et
toolkit label: teose pühenduse saaja (perekond) @et
toolkit definition: Perekond, kellele teos on pühendatud. @et
label: hat Widmungsempfängerin/Widmungsempfänger eines Werks (Familie) @de
definition: Setzt ein Werk in Beziehung zu einer Familie, der ein Werk gewidmet ist. @de
toolkit label: Widmungsempfängerin/Widmungsempfänger eines Werks (Familie) @de
toolkit definition: Eine Familie, der ein Werk gewidmet ist. @de
label: mű dedikált családja a következő: @hu
definition: Hozzákapcsol egy művet egy családhoz, amelynek egy művet dedikálnak. @hu
toolkit label: mű dedikált családja: @hu
toolkit definition: Egy család, amelynek egy művet dedikálnak. @hu
label: ha come dedicatario famiglia di opera @it
definition: Correla un'opera a una famiglia alla quale un'opera è dedicata. @it
toolkit label: dedicatario famiglia di opera @it
toolkit definition: Famiglia alla quale un'opera è dedicata. @it
label: a pour famille dédicataire d’une œuvre @fr
definition: Met une œuvre en relation avec une famille à qui une œuvre est dédiée. @fr
toolkit label: famille dédicataire d’une œuvre @fr
toolkit definition: Famille à qui une œuvre est dédiée. @fr
label: veltījumdarbs dzimtai/ģimenei @lv
definition: Sasaista darbu ar dzimtu/ģimeni, kam ir veltīts darbs. @lv
toolkit label: veltījumdarbs dzimtai/ģimenei @lv
toolkit definition: Dzimta/ģimene, kam ir veltīts darbs. @lv
label: 有作品的被题献者家族 @zh-hans
definition: 将一种作品与一种作品被题献的一个家族关联起来。 @zh-hans
toolkit label: 作品的被题献者家族 @zh-hans
toolkit definition: 一种作品被题献的一个家族 @zh-hans
has subproperty: P10553
label: eserin ithaf edilen ailesi ile ilişkilidir @tr
definition: Bir eseri, kendisine adanan bir aileyle ilişkilendirir. @tr
toolkit label: eserin adandığı aile @tr
toolkit definition: Kendisine bir eser adanmış bir aile. @tr

has dedicatee person of work
status: Published
lexical alias: dedicateePersonOfWork.en
definition: Relates a work to a person to whom a work is dedicated.
toolkit label: dedicatee person of work
toolkit definition: A person to whom a work is dedicated.
type: Property
domain: C10001
has element type: 2
sub property of: has related person of work
sub property of: has dedicatee agent of work
label: teoksen omistuksen kohde (henkilö) @fi
definition: Liittää teoksen henkilöön, jolle teos on omistettu. @fi
toolkit label: teoksen omistuksen kohde (henkilö) @fi
toolkit definition: Henkilö, jolle teos on omistettu. @fi
label: har person som verk er tilegnet @no
definition: Relaterer et verk til en person som et verk er dedisert til. @no
toolkit label: person som verk er tilegnet @no
toolkit definition: En person som et verk er dedisert til. @no
label: heeft opgedragene-persoon van werk @nl
definition: Relateert een werk aan een persoon aan wie een werk is opgedragen. @nl
toolkit label: opgedragene-persoon van werk @nl
toolkit definition: Een persoon aan wie een werk is opgedragen. @nl
label: له شخص مُهدى إليه عمل @ar
definition: يربط بين عمل وشخص مُهدى إليه عمل. @ar
toolkit label: شخص مُهدى إليه عمل @ar
toolkit definition: شخص مُهدى إليه عمل. @ar
label: té com a persona dedicatària d’una obra @ca
definition: Relaciona una obra amb una persona a qui es dedica una obra. @ca
toolkit label: persona dedicatària d’una obra @ca
toolkit definition: Persona a qui es dedica una obra. @ca
label: har person, som er tilegnet i værk @da
definition: Relaterer et værk til en person, som et værk er tilegnet. @da
toolkit label: person, som er tilegnet i værk @da
toolkit definition: Person, som et værk er tilegnet. @da
label: teose pühenduse saaja (isik) @et
definition: Seostab teose isikuga, kellele teos on pühendatud. @et
alternative label: teose dedikatsiooni saaja (isik) @et
toolkit label: teose pühenduse saaja (isik) @et
toolkit definition: Isik, kellele teos on pühendatud. @et
label: hat Widmungsempfängerin/Widmungsempfänger eines Werks (Person) @de
definition: Setzt ein Werk in Beziehung zu einer Person, der ein Werk gewidmet ist. @de
toolkit label: Widmungsempfängerin/Widmungsempfänger eines Werks (Person) @de
toolkit definition: Eine Person, der ein Werk gewidmet ist. @de
label: mű dedikált személye a következő: @hu
definition: Hozzákapcsol egy művet egy személyhez, akinek egy művet dedikálnak. @hu
toolkit label: mű dedikált személye: @hu
toolkit definition: Egy személy, akinek egy művet dedikálnak. @hu
label: ha come dedicatario persona di opera @it
definition: Correla un'opera a una persona alla quale un'opera è dedicata. @it
toolkit label: dedicatario persona di opera @it
toolkit definition: Persona alla quale un'opera è dedicata. @it
label: a pour personne dédicataire d’une œuvre @fr
definition: Met une œuvre en relation avec une personne à qui une œuvre est dédiée. @fr
toolkit label: personne dédicataire d’une œuvre @fr
toolkit definition: Personne à qui une œuvre est dédiée. @fr
label: veltījumdarbs personai @lv
definition: Sasaista darbu ar personu kurai ir veltīts darbs. @lv
toolkit label: veltījumdarbs personai @lv
toolkit definition: Persona kurai ir veltīts darbs. @lv
label: 有作品的被题献者个人 @zh-hans
definition: 将一种作品与一种作品被题献给的一个个人关联起来。 @zh-hans
toolkit label: 作品的被题献者个人 @zh-hans
toolkit definition: 一种作品被题献给的一个个人 @zh-hans
has subproperty: P10412
label: eserin ithaf edilen kişisi ile ilişkilidir @tr
definition: Bir eseri, kendisine adanan kişi ile ilişkilendirir. @tr
toolkit label: eserin adandığı kişi @tr
toolkit definition: Kendisine bir eser ithaf edilen kişi @tr

has dedicator agent
status: Published
definition: Relates a work to an agent who assigns a work as an acknowledgement of the inspiration or support of a related agent.
type: Property
domain: C10001
sub property of: has creator agent of work
lexical alias: dedicatorAgent.en
toolkit label: dedicator agent
toolkit definition: An agent who assigns a work as an acknowledgement of the inspiration or support of a related agent.
toolkit label: agent dédicateur d’une œuvre @fr
toolkit definition: Agent qui dédie une œuvre en reconnaissance de l’inspiration ou du soutien d’un agent en relation. @fr
toolkit label: autor de dedicación @es
toolkit definition: Una persona, familia o entidad corporativa que dedica una obra. @es
instruction number: 18.5
label: har agent, som er dedikationsskriver @da
definition: Relaterer et værk til en agent, som tilegner et værk til en relateret agent, som en anerkendelse af inspiration eller støtte. @da
toolkit label: agent, som er dedikationsskriver @da
toolkit definition: Agent, som tilegner et værk til en relateret agent, som en anerkendelse af inspiration eller støtte. @da
definition: Met une œuvre en relation avec un agent qui dédie une œuvre en reconnaissance de l’inspiration ou du soutien d’un agent en relation. @fr
label: có người đề tặng @vi
definition: Liên kết tác phẩm với tác nhân đề tặng tác phẩm. @vi
toolkit label: người đề tặng @vi
toolkit definition: Tác nhân đề tặng tác phẩm. @vi
label: hat Widmende/Widmenden (Akteur) @de
definition: Setzt ein Werk in Beziehung zu einem Akteur, der ein Werk als Zeichen der Anerkennung oder Unterstützung einem in Beziehung stehenden Akteur widmet. @de
toolkit label: Widmende/Widmender (Akteur) @de
toolkit definition: Ein Akteur, der ein Werk als Zeichen der Anerkennung oder Unterstützung einem in Beziehung stehenden Akteur widmet. @de
label: a pour agent dédicateur d’une œuvre @fr
definition: Liittää teoksen toimijaan, joka nimittää teoksen sitä innoittaineen tai tukeneen toimijan tunnustukseksi. @fi
toolkit label: omistuksen tekijä (toimija) @fi
toolkit definition: Toimija, joka nimittää teoksen sitä innoittaineen tai tukeneen toimijan tunnustukseksi. @fi
toolkit label: agent som dediserer @no
toolkit definition: En agent som tilegner et verk som en bekreftelse på inspirasjon eller støtte fra en relatert agent. @no
label: té com a agent dedicant @ca
definition: Relaciona una obra amb un agent que assigna una obra com a reconeixement a la inspiració o el suport d’un agent relacionat. @ca
toolkit label: agent dedicant @ca
toolkit definition: Agent que assigna una obra com a reconeixement a la inspiració o el suport d’un agent relacionat. @ca
has element type: 2
label: έχει αφιερωτή @el
definition: Συνδέει ένα έργο με έναν φορέα, από τον οποίο δημιουργείται η αφιέρωση. @el
toolkit label: αφιερωτής @el
toolkit definition: Ένας φορέας από τον οποίο δημιουργείται μια αφιέρωση. @el
label: dedikáló ágense a következő: @hu
definition: Hozzákapcsol egy művet egy ágenshez, amely köszönetképpen megjelöl egy művet egy kapcsolódó ágens inspirációjáért, támogatásáért cserébe. @hu
toolkit label: dedikáló ágens: @hu
toolkit definition: Egy ágens, amely köszönetképpen megjelöl egy művet egy kapcsolódó ágens által nyújtott inspirációért, támogatásért cserébe. @hu
alternative label: dedicator
alternative label: omistuksen tekijä @fi
label: omistuksen tekijä (toimija) @fi
label: har agent som dediserer @no
definition: Relateter et verk til en agent som tilegner et verk som en bekreftelse på inspirasjon eller støtte fra en relatert agent. @no
alternative label: dedikatør @no
label: heeft opdrager-actor @nl
definition: Relateert een werk aan een actor die een werk toekent als erkenning van de inspiratie of hulp van een gerelateerde actor. @nl
toolkit label: opdrager-actor @nl
toolkit definition: Een actor die een werk toekent als erkenning van de inspiratie of hulp van een gerelateerde actor. @nl
label: له وكيل مُهدي @ar
definition: يربط بين عمل ووكيل يخصص عملا تقديرا لإلهام وكيل مرتبط أو دعمه. @ar
alternative label: مُهدي @ar
toolkit label: له وكيل مُهدي @ar
toolkit definition: وكيل يخصص عملا تقديرا لإلهام وكيل مرتبط أو دعمه. @ar
alternative label: dedicant @ca
alternative label: tilegner @da
label: pühendaja (tegija) @et
definition: Seostab teose tegijaga, kes pühendab teose tänuavaldusena innustust või toetust jaganud seotud tegijale. @et
alternative label: pühendaja @et
toolkit label: pühendaja (tegija) @et
toolkit definition: Tegija, kes pühendab teose tänuavaldusena innustust või toetust jaganud seotud tegijale. @et
alternative label: dedikáló: @hu
label: ha come dedicante agente @it
definition: Correla un’opera a un agente che dedica un’opera come riconoscimento dell’ispirazione o del sostegno a un agente correlato. @it
alternative label: dedicante @it
toolkit label: dedicante agente @it
toolkit definition: Agente che dedica un’opera come riconoscimento dell’ispirazione o del sostegno a un agente correlato. @it
alternative label: dédicateur @fr
label: veltītājs (aģents) @lv
definition: Sasaista darbu ar aģentu, kas velta darbu pateicībā par saistītā aģenta iedvesmojumu vai atbalstu. @lv
toolkit label: veltītājs (aģents) @lv
toolkit definition: Aģents, kas velta darbu pateicībā par saistītā aģenta iedvesmojumu vai atbalstu. @lv
alternative label: Widmender @de
toolkit label: 题献者行为者 @zh-hans

has dedicator collective agent
status: Published
lexical alias: dedicatorCollectiveAgent.en
definition: Relates a work to a collective agent who assigns a work as an acknowledgement of the inspiration or support of a related agent.
toolkit label: dedicator collective agent
toolkit definition: A collective agent who assigns a work as an acknowledgement of the inspiration or support of a related agent.
type: Property
domain: C10001
has element type: 2
sub property of: has creator collective agent of work
sub property of: has dedicator agent
label: omistuksen tekijä (yhteistoimija) @fi
definition: Liittää teoksen yhteistoimijaan, joka nimittää teoksen tunnustukseksi siihen liittyvän toimijan innoituksesta tai tuesta. @fi
toolkit label: omistuksen tekijä (yhteistoimija) @fi
toolkit definition: Yhteistoimija, joka nimittää teoksen tunnustukseksi siihen liittyvän toimijan innoituksesta tai tuesta. @fi
label: har dediserende kollektiv agent @no
definition: Relaterer et verk til en kollektiv agent som tildeler et verk som anerkjennelse for inspirasjon eller støtte fra en relatert agent. @no
toolkit label: dediserende kollektiv agent @no
toolkit definition: En kollektiv agent som tildeler et verk som anerkjennelse for inspirasjon eller støtte fra en relatert agent. @no
label: heeft opdrager-collectieve actor @nl
definition: Relateert een werk aan een collectieve actor die een werk toekent als erkenning van de inspiratie of hulp van een gerelateerde actor. @nl
toolkit label: opdrager-collectieve actor @nl
toolkit definition: Een collectieve actor die een werk toekent als erkenning van de inspiratie of hulp van een gerelateerde actor. @nl
label: له وكيل جماعي مهدي @ar
definition: يربط بين عمل ووكيل جماعي يقوم بتعيين عمل باعتباره إقرارًا بإلهام وكيل ذي صلة أو دعمه. @ar
toolkit label: وكيل جماعي مهدي @ar
toolkit definition: وكيل جماعي يقوم بتعيين عمل باعتباره إقرارًا بإلهام وكيل ذي صلة أو دعمه. @ar
label: té com a agent col·lectiu dedicant @ca
definition: Relaciona una obra amb un agent col·lectiu que assigna una obra com a reconeixement a la inspiració o el suport d’un agent relacionat. @ca
toolkit label: agent col·lectiu dedicant @ca
toolkit definition: Agent col·lectiu que assigna una obra com a reconeixement a la inspiració o el suport d’un agent relacionat. @ca
label: har kollektiv agent, som er dedikationsskriver @da
definition: Relaterer et værk til en kollektiv agent, som tilegner et værk til en relateret agent, som en anerkendelse af inspiration eller støtte. @da
toolkit label: kollektiv agent, som er dedikationsskriver @da
toolkit definition: Kollektiv agent, som tilegner et værk til en relateret agent, som en anerkendelse af inspiration eller støtte. @da
label: pühendaja (kollektiiv) @et
definition: Seostab teose kollektiiviga, kes pühendab teose tänuavaldusena innustust või toetust jaganud seotud tegijale. @et
toolkit label: pühendaja (kollektiiv) @et
toolkit definition: Kollektiiv, kes pühendab teose tänuavaldusena innustust või toetust jaganud seotud tegijale. @et
label: hat Widmende/Widmenden (Gemeinschaftlicher Akteur) @de
definition: Setzt ein Werk in Beziehung zu einem gemeinschaftlichen Akteur, der ein Werk als Zeichen der Anerkennung oder Unterstützung einem in Beziehung stehenden Akteur widmet. @de
toolkit label: Widmende/Widmender (Gemeinschaftlicher Akteur) @de
toolkit definition: Ein gemeinschaftlicher Akteur, der ein Werk als Zeichen der Anerkennung oder Unterstützung einem in Beziehung stehenden Akteur widmet. @de
label: dedikáló kollektív ágense a következő: @hu
definition: Hozzákapcsol egy művet egy kollektív ágenshez, amely köszönetképpen megjelöl egy művet egy kapcsolódó ágens inspirációjáért, támogatásáért cserébe. @hu
toolkit label: dedikáló kollektív ágens: @hu
toolkit definition: Egy kollektív ágens, amely köszönetképpen megjelöl egy művet egy kapcsolódó ágens inspirációjáért, támogatásáért cserébe. @hu
label: ha come dedicante agente collettivo @it
definition: Correla un'opera a un agente collettivo che dedica un'opera come riconoscimento dell'ispirazione o del sostegno di un agente correlato. @it
toolkit label: dedicante agente collettivo @it
toolkit definition: Agente collettivo che dedica un'opera come riconoscimento dell'ispirazione o del sostegno di un agente correlato. @it
label: a pour agent collectif dédicateur d’une œuvre @fr
definition: Met une œuvre en relation avec un agent collectif qui dédie une œuvre en reconnaissance de l’inspiration ou du soutien d’un agent en relation. @fr
toolkit label: agent collectif dédicateur d’une œuvre @fr
toolkit definition: Agent collectif qui dédie une œuvre en reconnaissance de l’inspiration ou du soutien d’un agent en relation. @fr
label: veltītājs (grupa) @lv
definition: Sasaista darbu ar grupu, kas velta darbu pateicībā par saistītā aģenta iedvesmojumu vai atbalstu. @lv
toolkit label: veltītājs (grupa) @lv
toolkit definition: Grupa, kas velta darbu pateicībā par saistītā aģenta iedvesmojumu vai atbalstu. @lv
label: 有题献者集体行为者 @zh-hans
definition: 将一种作品与指定一种作品作为一个相关行为者的启发或支持之感谢的一个集体行为者关联起来。 @zh-hans
toolkit label: 题献者集体行为者 @zh-hans
toolkit definition: 指定一种作品作为一个相关行为者的启发或支持之感谢的一个集体行为者 @zh-hans
has subproperty: has dedicator corporate body
has subproperty: has dedicator family
has subproperty: P10461
label: ithaf eden kolektif temsilcisi ile ilişkilidir @tr
definition: Bir eseri, ilgili bir temsilcinin ilhamı veya desteğinin bir teşekkürü olarak bir eseri atfeden kolektif bir temsilci ile ilişkilendirir. @tr
toolkit label: adayan kolektif temsilci @tr
toolkit definition: Bir eseri, ilgili bir temsilcinin ilhamının veya desteğinin bir onayı olarak atayan kolektif bir temsilci. @tr

has dedicator corporate body
status: Published
lexical alias: dedicatorCorporateBody.en
definition: Relates a work to a corporate body who assigns a work as an acknowledgement of the inspiration or support of a related agent.
toolkit label: dedicator corporate body
toolkit definition: A corporate body who assigns a work as an acknowledgement of the inspiration or support of a related agent.
type: Property
domain: C10001
has element type: 2
sub property of: has creator corporate body of work
sub property of: has dedicator collective agent
label: omistuksen tekijä (yhteisö) @fi
definition: Liittää teoksen yhteisöön, joka nimittää teoksen tunnustukseksi siihen liittyvän toimijan innoituksesta tai tuesta. @fi
toolkit label: omistuksen tekijä (yhteisö) @fi
toolkit definition: Yhteisö, joka nimittää teoksen tunnustukseksi siihen liittyvän toimijan innoituksesta tai tuesta. @fi
label: har korporasjon som dediserer @no
definition: Relaterer et verk til en korporasjon som tilegner et verk som en bekreftelse på inspirasjon eller støtte fra en relatert agent. @no
toolkit label: korporasjon som dediserer @no
toolkit definition: En korporasjon som tilegner et verk som en bekreftelse på inspirasjon eller støtte fra en relatert agent. @no
label: heeft opdrager-corporatie @nl
definition: Relateert een werk aan een corporatie die een werk toekent als erkenning van de inspiratie of hulp van een gerelateerde actor. @nl
toolkit label: opdrager-corporatie @nl
toolkit definition: Een corporatie die een werk toekent als erkenning van de inspiratie of hulp van een gerelateerde actor. @nl
label: له هيئة مهدية @ar
definition: يربط بين عمل وهيئة تخصص عملاً باعتباره إقرارًا بإلهام وكيل ذي صلة أو دعمه. @ar
toolkit label: هيئة مهدية @ar
toolkit definition: هيئة تخصص عملاً باعتباره إقرارًا بإلهام وكيل ذي صلة أو دعمه. @ar
label: té com a entitat corporativa dedicant @ca
definition: Relaciona una obra amb una entitat corporativa que assigna una obra com a reconeixement per la inspiració o el suport d’un agent relacionat. @ca
toolkit label: entitat corporativa dedicant @ca
toolkit definition: Entitat corporativa que assigna una obra com a reconeixement per la inspiració o el suport d’un agent relacionat. @ca
label: har korporation, som er dedikationsskriver @da
definition: Relaterer et værk til en korporation, som tilegner et værk til en relateret agent, som en anerkendelse af inspiration eller støtte. @da
toolkit label: korporation, som er dedikationsskriver @da
toolkit definition: Korporation, som tilegner et værk til en relateret agent, som en anerkendelse af inspiration eller støtte. @da
label: pühendaja (asutus) @et
definition: Seostab teose asutusega, kes pühendab teose tänuavaldusena innustust või toetust jaganud seotud tegijale. @et
toolkit label: pühendaja (asutus) @et
toolkit definition: Asutus, kes pühendab teose tänuavaldusena innustust või toetust jaganud seotud tegijale. @et
label: hat Widmende/Widmenden (Körperschaft) @de
definition: Setzt ein Werk in Beziehung zu einer Körperschaft, die ein Werk als Zeichen der Anerkennung oder Unterstützung einem in Beziehung stehenden Akteur widmet. @de
toolkit label: Widmende/Widmender (Körperschaft) @de
toolkit definition: Eine Körperschaft, die ein Werk als Zeichen der Anerkennung oder Unterstützung einem in Beziehung stehenden Akteur widmet. @de
label: dedikáló testülete a következő: @hu
definition: Hozzákapcsol egy művet egy testülethez, amely köszönetképpen megjelöl egy művet egy kapcsolódó ágens inspirációjáért, támogatásáért cserébe. @hu
toolkit label: dedikáló testület: @hu
toolkit definition: Egy testület, amely köszönetképpen megjelöl egy művet egy kapcsolódó ágens inspirációjáért, támogatásáért cserébe. @hu
label: ha come dedicante ente @it
definition: Correla un'opera a un ente che dedica un’opera come riconoscimento dell’ispirazione o del sostegno di un agente correlato. @it
toolkit label: dedicante ente @it
toolkit definition: Ente che dedica un’opera come riconoscimento dell’ispirazione o del sostegno di un agente correlato. @it
label: a pour collectivité dédicatrice d’une œuvre @fr
definition: Met une œuvre en relation avec une collectivité qui dédie une œuvre en reconnaissance de l’inspiration ou du soutien d’un agent en relation. @fr
toolkit label: collectivité dédicatrice d’une œuvre @fr
toolkit definition: Collectivité qui dédie une œuvre en reconnaissance de l’inspiration ou du soutien d’un agent en relation. @fr
label: veltītājs (institūcija) @lv
definition: Sasaista darbu ar institūciju, kas velta darbu pateicībā par saistītā aģenta iedvesmojumu vai atbalstu. @lv
toolkit label: veltītājs (institūcija) @lv
toolkit definition: Institūcija, kas velta darbu pateicībā par saistītā aģenta iedvesmojumu vai atbalstu. @lv
label: 有题献者团体 @zh-hans
definition: 将一种作品与指定一种作品作为一个相关行为者的启发或支持之感谢的一个团体关联起来。 @zh-hans
toolkit label: 题献者团体 @zh-hans
toolkit definition: 指定一种作品作为一个相关行为者的启发或支持之感谢的一个团体 @zh-hans
has subproperty: P10508
label: ithaf eden tüzel kişisi ile ilişkilidir @tr
definition: Bir eseri, ilgili bir temsilcinin ilhamı veya desteğinin bir teşekkürü olarak bir eseri atfeden tüzel kişi ile ilişkilendirir. @tr
toolkit label: adayan tüzel kişi @tr
toolkit definition: İlgili bir temsilcinin ilham veya desteğinin kabulü olarak bir eser atayan bir tüzel kişilik. @tr

has dedicator family
status: Published
lexical alias: dedicatorFamily.en
definition: Relates a work to a family who assigns a work as an acknowledgement of the inspiration or support of a related agent.
toolkit label: dedicator family
toolkit definition: A family who assigns a work as an acknowledgement of the inspiration or support of a related agent.
type: Property
domain: C10001
has element type: 2
sub property of: has creator family of work
sub property of: has dedicator collective agent
label: omistuksen tekijä (suku) @fi
definition: Liittää teoksen sukuun, joka nimittää teoksen tunnustukseksi siihen liittyvän toimijan innoituksesta tai tuesta. @fi
toolkit label: omistuksen tekijä (suku) @fi
toolkit definition: Suku, joka nimittää teoksen tunnustukseksi siihen liittyvän toimijan innoituksesta tai tuesta. @fi
label: har familie som dediserer @no
definition: Relaterer et verk til en familie som tilegner et verk som en bekreftelse på inspirasjon eller støtte fra en relatert agent. @no
toolkit label: familie som dediserer @no
toolkit definition: En familie som tilegner et verk som en bekreftelse på inspirasjon eller støtte fra en relatert agent. @no
label: heeft opdrager-familie @nl
definition: Relateert een werk aan een familie die een werk toekent als erkenning van de inspiratie of hulp van een gerelateerde actor. @nl
toolkit label: opdrager-familie @nl
toolkit definition: Een familie die een werk toekent als erkenning van de inspiratie of hulp van een gerelateerde actor. @nl
label: له عائلة مهدية @ar
definition: يربط بين عمل وعائلة تخصص عملاً باعتباره إقرارًا بإلهام وكيل ذي صلة أو دعمه. @ar
toolkit label: عائلة مهدية @ar
toolkit definition: عائلة تخصص عملاً باعتباره إقرارًا بإلهام وكيل ذي صلة أو دعمه. @ar
label: té com a família dedicant @ca
definition: Relaciona una obra amb una família que dedica una obra com a reconeixement a la inspiració o el suport d’un agent relacionat. @ca
toolkit label: família dedicant @ca
toolkit definition: Família que dedica una obra com a reconeixement a la inspiració o el suport d’un agent relacionat. @ca
label: har familie, som er dedikationsskriver @da
definition: Relaterer et værk til en familie, som tilegner et værk til en relateret agent, som en anerkendelse af inspiration eller støtte. @da
toolkit label: familie, som er dedikationsskriver @da
toolkit definition: Familie, som tilegner et værk til en relateret agent, som en anerkendelse af inspiration eller støtte. @da
label: pühendaja (perekond) @et
definition: Seostab teose perekonnaga, kes pühendab teose tänuavaldusena innustust või toetust jaganud seotud tegijale. @et
toolkit label: pühendaja (perekond) @et
toolkit definition: Perekond, kes pühendab teose tänuavaldusena innustust või toetust jaganud seotud tegijale. @et
label: hat Widmende/Widmenden (Familie) @de
definition: Setzt ein Werk in Beziehung zu einer Familie, die ein Werk als Anerkennung für die Inspiration oder Unterstützung einem in Beziehung stehenden Akteur widmet. @de
toolkit label: Widmende/Widmender (Familie) @de
toolkit definition: Eine Familie, die ein Werk als Anerkennung für die Inspiration oder Unterstützung einem in Beziehung stehenden Akteur widmet. @de
label: dedikáló családja a következő: @hu
definition: Hozzákapcsol egy művet egy családhoz, amely köszönetképpen megjelöl egy művet egy kapcsolódó ágens inspirációjáért, támogatásáért cserébe. @hu
toolkit label: dedikáló család: @hu
toolkit definition: Egy család, amely köszönetképpen megjelöl egy művet egy kapcsolódó ágens inspirációjáért, támogatásáért cserébe. @hu
label: ha come dedicante famiglia @it
definition: Correla un'opera a una famiglia che dedica un’opera come riconoscimento dell’ispirazione o del sostegno di un agente correlato. @it
toolkit label: dedicante famiglia @it
toolkit definition: Famiglia che dedica un'opera come riconoscimento dell'ispirazione o del sostegno di un agente correlato. @it
label: a pour famille dédicatrice d’une œuvre @fr
definition: Met une œuvre en relation avec une famille qui dédie une œuvre en reconnaissance de l’inspiration ou du soutien d’un agent en relation. @fr
toolkit label: famille dédicatrice d’une œuvre @fr
toolkit definition: Famille qui dédie une œuvre en reconnaissance de l’inspiration ou du soutien d’un agent en relation. @fr
label: veltītājs (dzimta/ģimene) @lv
definition: Sasaista darbu ar dzimtu/ģimeni, kas velta darbu pateicībā par saistītā aģenta iedvesmojumu vai atbalstu. @lv
toolkit label: veltītājs (dzimta/ģimene) @lv
toolkit definition: Dzimta/ģimene, kas velta darbu pateicībā par saistītā aģenta iedvesmojumu vai atbalstu. @lv
label: 有题献者家族 @zh-hans
definition: 将一种作品与指定一种作品作为一个相关行为者的启发或支持之感谢的一个家族关联起来。 @zh-hans
toolkit label: 题献者家族 @zh-hans
toolkit definition: 指定一种作品作为一个相关行为者的启发或支持之感谢的一个家族 @zh-hans
has subproperty: P10555
label: ithaf eden ailesi ile ilişkilidir @tr
definition: Bir eseri, ilgili bir temsilcinin ilhamı veya desteğinin bir teşekkürü olarak bir eseri atfeden bir aileyle ilişkilendirir. @tr
toolkit label: adayan aile @tr
toolkit definition: İlgili bir temsilcinin ilham veya desteğinin kabulü olarak bir iş atayan bir aile. @tr

has dedicator person
status: Published
lexical alias: dedicatorPerson.en
definition: Relates a work to a person who assigns a work as an acknowledgement of the inspiration or support of a related agent.
toolkit label: dedicator person
toolkit definition: A person who assigns a work as an acknowledgement of the inspiration or support of a related agent.
type: Property
domain: C10001
has element type: 2
sub property of: has creator person of work
sub property of: has dedicator agent
label: omistuksen tekijä (henkilö) @fi
definition: Liittää teoksen henkilöön, joka nimittää teoksen tunnustukseksi siihen liittyvän toimijan innoituksesta tai tuesta. @fi
toolkit label: omistuksen tekijä (henkilö) @fi
toolkit definition: Henkilö, joka nimittää teoksen tunnustukseksi siihen liittyvän toimijan innoituksesta tai tuesta. @fi
label: har dediserende person @no
definition: Relaterer et verk til en person som tildeler et verk som anerkjennelse for inspirasjon eller støtte fra en relatert agent. @no
toolkit label: dediserende person @no
toolkit definition: En person som tildeler et verk som anerkjennelse for inspirasjon eller støtte fra en relatert agent. @no
label: heeft opdrager-persoon @nl
definition: Relateert een werk aan een persoon die een werk toekent als erkenning van de inspiratie of hulp van een gerelateerde actor. @nl
toolkit label: opdrager-persoon @nl
toolkit definition: Een persoon die een werk toekent als erkenning van de inspiratie of hulp van een gerelateerde actor. @nl
label: له شخص مُهدي @ar
definition: يربط بين عمل وشخص يعين عملًا كإقرار بإلهام وكيل ذي صلة أو دعمه. @ar
toolkit label: شخص مُهدي @ar
toolkit definition: شخص يعين عملًا كإقرار بإلهام وكيل ذي صلة أو دعمه. @ar
label: té com a persona dedicant @ca
definition: Relaciona una obra amb una persona que assigna una obra com a reconeixement per la inspiració o el suport d’un agent relacionat. @ca
toolkit label: persona dedicant @ca
toolkit definition: Persona que assigna una obra com a reconeixement per la inspiració o el suport d’un agent relacionat. @ca
label: har person, som er dedikationsskriver @da
definition: Relaterer et værk til en person, som tilegner et værk til en relateret agent, som en anerkendelse af inspiration eller støtte. @da
toolkit label: person, som er dedikationsskriver @da
toolkit definition: Person, som tilegner et værk til en relateret agent, som en anerkendelse af inspiration eller støtte. @da
label: pühendaja (isik) @et
definition: Seostab teose isikuga, kes pühendab teose tänuavaldusena innustust või toetust jaganud seotud tegijale. @et
toolkit label: pühendaja (isik) @et
toolkit definition: Isik, kes pühendab teose tänuavaldusena innustust või toetust jaganud seotud tegijale. @et
label: hat Widmende/Widmenden (Person) @de
definition: Setzt ein Werk in Beziehung zu einer Person, die ein Werk als Zeichen der Anerkennung oder Unterstützung einem in Beziehung stehenden Akteur widmet. @de
toolkit label: Widmende/Widmender (Person) @de
toolkit definition: Eine Person, die ein Werk als Zeichen der Anerkennung oder Unterstützung einem in Beziehung stehenden Akteur widmet. @de
label: dedikáló személye a következő: @hu
definition: Hozzákapcsol egy művet egy személyhez, aki köszönetképpen megjelöl egy művet egy kapcsolódó ágens inspirációjáért, támogatásáért cserébe. @hu
toolkit label: dedikáló személy: @hu
toolkit definition: Egy személy, aki köszönetképpen megjelöl egy művet egy kapcsolódó ágens inspirációjáért, támogatásáért cserébe. @hu
label: ha come dedicante persona @it
definition: Correla un'opera a una persona che dedica un'opera come riconoscimento dell'ispirazione o del sostegno di un agente correlato. @it
toolkit label: dedicante persona @it
toolkit definition: Persona che dedica un'opera come riconoscimento dell'ispirazione o del sostegno di un agente correlato. @it
label: a pour personne dédicatrice d’une œuvre @fr
definition: Met une œuvre en relation avec une personne qui dédie une œuvre en reconnaissance de l’inspiration ou du soutien d’un agent en relation. @fr
toolkit label: personne dédicatrice d’une œuvre @fr
toolkit definition: Personne qui dédie une œuvre en reconnaissance de l’inspiration ou du soutien d’un agent en relation. @fr
label: veltītājs (persona) @lv
definition: Sasaista darbu ar personu, kura velta darbu pateicībā par saistītā aģenta iedvesmojumu vai atbalstu. @lv
toolkit label: veltītājs (persona) @lv
toolkit definition: Persona, kura velta darbu pateicībā par saistītā aģenta iedvesmojumu vai atbalstu. @lv
label: 有题献者个人 @zh-hans
definition: 将一种作品与指定一种作品作为一个相关行为者的启发或支持之感谢的一个个人关联起来。 @zh-hans
toolkit label: 题献者个人 @zh-hans
toolkit definition: 指定一种作品作为一个相关行为者的启发或支持之感谢的一个个人 @zh-hans
has subproperty: P10414
label: ithaf eden kişisi ile ilişkilidir @tr
definition: Bir eseri, ilgili bir temsilcinin ilhamı veya desteğinin bir teşekkürü olarak bir eseri atfeden kişi ile ilişkilendirir. @tr
toolkit label: adayan kişi @tr
toolkit definition: İlgili bir temsilcinin fikir ya da desteğinin teşekkürü olarak bir eseri atfeden kişi. @tr

har sagsøgte
status: Deprecated
type: Property
domain: C10001
sub property of: has other agent associated with work (Deprecated)
lexical alias: defendant.en
toolkit label: défendeur @fr
toolkit definition: Personne ou collectivité qui est accusée dans une poursuite criminelle ou contre laquelle une poursuite civile est intentée. @fr
toolkit label: acusado @es
toolkit definition: Una persona o entidad corporativa que es acusada en un proceso penal o demandada en un proceso civil. @es
instruction number: 18.5
definition: Relaterer et værk til en person eller korporation, der er anklaget i en straffesag eller sagsøgt i en civil sag. @da
toolkit label: sagsøgte @da
toolkit definition: Person eller korporation, der er anklaget i en straffesag eller sagsøgt i en civil sag. @da
definition: Met une œuvre en relation avec une personne ou une collectivité qui est accusée dans une poursuite criminelle ou contre laquelle une poursuite civile est intentée. @fr
label: có bị đơn @vi
definition: Liên kết tác phẩm với cá nhân hoặc tập thể bị buộc tội trong vụ kiện hình sự hoặc bị kiện trong vụ kiện dân sự. @vi
toolkit label: bị đơn @vi
toolkit definition: Cá nhân hoặc tập thể bị buộc tội trong vụ kiện hình sự hoặc bị kiện trong vụ kiện dân sự. @vi
label: hat Angeklagten/Beklagten @de
definition: Setzt ein Werk mit einer Person oder einer Körperschaft, die in einem Strafverfahren angeklagt oder in einem Zivilprozess verklagt ist, in Beziehung. @de
toolkit label: Angeklagter/Beklagter @de
toolkit definition: Eine Person oder eine Körperschaft, die in einem Strafverfahren angeklagt oder in einem Zivilprozess verklagt ist. @de
label: a pour défendeur @fr
label: vastaaja @fi
definition: Liittää teoksen henkilöön tai yhteisöön, joka on syytettynä rikosprosessissa tai jota vastaan on nostettu kanne siviiliprosessissa @fi
toolkit label: vastaaja @fi
toolkit definition: Henkilö tai yhteisö, joka on syytettynä rikosprosessissa tai jota vastaan on nostettu kanne siviiliprosessissa @fi
toolkit label: saksøkte @no
toolkit definition: En person eller korporasjon som er tiltalt i en straffesak eller saksøkt i en sivilrettslig sak. @no
label: té com a acusat @ca
definition: Relaciona una obra amb una persona o entitat corporativa que és acusada en un procés penal o demandada en un procés civil. @ca
toolkit label: acusat @ca
toolkit definition: Persona o entitat corporativa que és acusada en un procés penal o demandada en un procés civil. @ca
label: έχει εναγόμενο @el
definition: Συνδέει ένα έργο με ένα φυσικό πρόσωπο ή συλλογικό όργανο, το οποίο έχει κατηγορηθεί σε μία ποινική διαδικασία ή έχει ασκηθεί αγωγή εναντίον του στο πλαίσιο αστικής διαδικασίας. @el
toolkit label: εναγόμενος @el
toolkit definition: Ένα φυσικό πρόσωπο ή συλλογικό όργανο, το οποίο έχει κατηγορηθεί σε μία ποινική διαδικασία ή έχει ασκηθεί αγωγή εναντίον του στο πλαίσιο αστικής διαδικασίας. @el

har afledt værkrelation med
status: Deprecated
type: Property
domain: C10001
sub property of: has related work of work
scope note: Derivative works include summaries, abstracts, digests, adaptations, dramatizations, novelizations, screenplays, free translations, paraphrases, imitations, parodies, etc.
lexical alias: derivativeWorkRelationship.en
toolkit label: relation d’œuvre dérivée @fr
toolkit definition: Œuvre qui est basée sur une autre œuvre ou en constitue un dérivé. @fr
toolkit label: relaciones de obra derivada @es
toolkit definition: Una obra que se basa en, o es un derivado de la obra. @es
instruction number: 24.5
definition: Relaterer et værk til et værk, der er baseret på eller er en afledning af et værk. @da
scope note: Afledte værker inkluderer resumeer, abstracts, sammenfatninger, bearbejdelser, dramatiseringer, omskrivninger til roman, manuskripter, frie oversættelser, parafraser, imitationer, parodier etc. @da
toolkit label: afledt værkrelation @da
toolkit definition: Værk, der er baseret på eller er en afledning af et værk. @da
definition: Met une œuvre en relation avec une œuvre qui est basée sur une autre œuvre ou en constitue un dérivé. @fr
label: có mối quan hệ tác phẩm dẫn xuất với @vi
definition: Liên kết tác phẩm với tác phẩm dựa trên hoặc là dẫn xuất của tác phẩm khác. @vi
scope note: Tác phẩm dẫn xuất bao gồm cả tóm lược, tóm tắt, vựng tập, phỏng theo, kịch hoá, tiểu thuyết hoá, kịch bản, bản dịch tự do, diễn giải, mô phỏng, nhại, v.v... @vi
toolkit label: mối quan hệ tác phẩm dẫn xuấti @vi
toolkit definition: Tác phẩm dựa trên hoặc là dẫn xuất của tác phẩm khác. @vi
label: hat abgeleitete Beziehung auf Werkebene @de
definition: Setzt ein Werk mit einem Werk, das auf einer Ableitung eines anderen Werks basiert oder eine Ableitung eines anderen Werks ist, in Beziehung. @de
scope note: Zu abgeleiteten Werken gehören Zusammenfassungen, Abstracts, Digests, Bearbeitungen, Bühnenbearbeitungen, Romanbearbeitungen, freie Übersetzungen, Paraphrasen, Imitationen, Parodien usw. @de
toolkit label: Abgeleitete Beziehung auf Werkebene @de
toolkit definition: Ein Werk, das auf einer Ableitung eines anderen Werks basiert oder eine Ableitung eines anderen Werks ist. @de
label: a pour relation d’œuvre dérivée @fr
label: teoksen johdannaissuhde @fi
definition: Liittää teoksen teokseen, joka perustuu toiseen teokseen tai on johdettu toisesta teoksesta. @fi
toolkit label: teoksen johdannaissuhde @fi
toolkit definition: Teos, joka perustuu toiseen teokseen tai on johdettu toisesta teoksesta. Johdettuja teoksia ovat yhteenvedot, abtraktit, mukautetut lyhennelmät, mukaelmat, dramatisoinnit, romaanimukaelmat, käsikirjoitukset, vapaamuotoiset käännökset, parafraasit, jäljitelmat, parodiat tms. @fi
toolkit label: relasjonstypen avledet verk @no
toolkit definition: Et verk som er basert på eller avledet fra et annet verk. @no
label: té com a relació d’obra derivada @ca
definition: Relaciona una obra amb una obra que es basa o deriva d’una altra obra. @ca
scope note: Les obres derivades inclouen sumaris, resums, compendis, adaptacions, dramatitzacions, novel·litzacions, guions, traduccions lliures, paràfrasis, imitacions, paròdies, etc. @ca
toolkit label: relació d’obra derivada @ca
toolkit definition: Obra que es basa o deriva d’una altra obra. @ca
scope note: Les œuvres dérivées comprennent les résumés, y compris les résumés analytiques, les condensés, les adaptations, les novélisations, les scénarios, les traductions libres, les paraphrases, les imitations, les parodies, etc. @fr
label: έχει παράγωγη σχέση έργου με @el
definition: Συνδέει ένα έργο με ένα έργο το οποίο βασίζεται σε ή είναι παράγωγο ενός άλλου έργου. @el
scope note: Τα παράγωγα έργα περιλαμβάνουν περιλήψεις, επιτομές, προσαρμογές, δραματοποιήσεις, μυθιστοριογραφήσεις, σενάρια, ελεύθερες μεταφράσεις, παραφράσεις, μιμήσεις, παρωδίες κ.λπ. @el
toolkit label: παράγωγη σχέση έργου με @el
toolkit definition: Ένα έργο το οποίο βασίζεται σε ή είναι παράγωγο ενός άλλου έργου. @el
has subproperty: P10229

is description of agent
status: Published
type: Property
lexical alias: descriptionOfAgent.en
definition: Relates a work to an agent who is described by a work.
domain: C10001
sub property of: has subject agent
toolkit label: description of agent
toolkit definition: An agent who is described by a work.
has element type: 2
sub property of: is description of RDA entity
label: kuvaus toimijasta @fi
definition: Liittää teoksen toimijaan, jota teos kuvaa. @fi
toolkit label: kuvaus toimijasta @fi
toolkit definition: Toimija, jota teos kuvaa. @fi
label: er beskrivelse av agent @no
definition: Relaterer et verk til en agent som beskrives av et verk. @no
toolkit label: beskrivelse av agent @no
toolkit definition: En agent som beskrives av et verk. @no
label: is beschrijving van actor @nl
definition: Relateert een werk aan een actor die beschreven wordt door een werk. @nl
toolkit label: beschrijving van actor @nl
toolkit definition: Een actor die beschreven wordt door een werk. @nl
label: هو وصف لهيئة @ar
definition: يربط بين عمل ووكيل موصوف في عمل. @ar
toolkit label: وصف لوكيل @ar
toolkit definition: وكيل موصوف في عمل. @ar
label: és descripció d’un agent @ca
definition: Relaciona una obra amb un agent que és descrit per una obra. @ca
toolkit label: descripció d’un agent @ca
toolkit definition: Agent que és descrit per una obra. @ca
label: er beskrivelse af agent @da
definition: Relaterer et værk til en agent, som er beskrevet af et værk. @da
toolkit label: beskrivelse af agent @da
toolkit definition: Agent, som er beskrevet af et værk. @da
label: kirjeldatud tegija @et
definition: Seostab teose tegijaga, keda on teoses kirjeldatud. @et
toolkit label: kirjeldatud tegija @et
toolkit definition: Tegija, keda on teoses kirjeldatud. @et
label: ist Beschreibung von (Akteur) @de
definition: Setzt ein Werk in Beziehung zu einem Akteur, der von einem Werk beschrieben wird. @de
toolkit label: Beschreibung von (Akteur) @de
toolkit definition: Ein Akteur, der von einem Werk beschrieben wird. @de
label: leírása a következő ágensnek: @hu
definition: Hozzákapcsol egy művet egy ágenshez, amelyet egy mű leír. @hu
toolkit label: leírt ágens: @hu
toolkit definition: Egy ágens, amelyet egy mű leír. @hu
label: è descrizione di agente @it
definition: Correla un’opera a un agente che è descritto da un’opera. @it
toolkit label: descrizione di agente @it
toolkit definition: Agente che è descritto da un’opera. @it
label: est une description d’un agent @fr
definition: Met une œuvre en relation avec un agent qui est décrit par une œuvre. @fr
toolkit label: description d’un agent @fr
toolkit definition: Agent qui est décrit par une œuvre. @fr
label: ir apraksts aģentam @lv
definition: Sasaista darbu ar aģentu, kas aprakstīts darbā. @lv
toolkit label: apraksts aģentam @lv
toolkit definition: Aģents, kas aprakstīts darbā. @lv
label: 是行为者的描述 @zh-hans
definition: 将一种作品与被一种作品描述的一个行为者关联起来。 @zh-hans
toolkit label: 行为者的描述 @zh-hans
toolkit definition: 被一种作品描述的一个行为者 @zh-hans
has subproperty: is description of collective agent
has subproperty: is description of person
has subproperty: is metadata description of agent
has subproperty: P10338
label: temsilcinin tanımıdır @tr
definition: Bir eseri, bir eserle tanımlanan bir temsilciyle ilişkilendirir. @tr
toolkit label: temsilcinin tanımı @tr
toolkit definition: Bir çalışmayla tanımlanan bir temsilci. @tr

is description of collective agent
status: Published
type: Property
lexical alias: descriptionOfCollectiveAgent.en
definition: Relates a work to a collective agent who is described by a work.
domain: C10001
sub property of: has subject collective agent
sub property of: is description of agent
toolkit label: description of collective agent
toolkit definition: A collective agent who is described by a work.
has element type: 2
label: kuvaus yhteistoimijasta @fi
definition: Liittää teoksen yhteistoimijaan, jota teos kuvaa. @fi
toolkit label: kuvaus yhteistoimijasta @fi
toolkit definition: Yhteistoimija, jota teos kuvaa. @fi
label: er beskrivelse av kollektiv agent @no
definition: Relaterer et verk til en kollektiv agent som beskrives av et verk. @no
toolkit label: beskrivelse av kollektiv agent @no
toolkit definition: En kollektiv agent som beskrives av et verk. @no
label: is beschrijving van collectieve actor @nl
definition: Relateert een werk aan een collectieve actor die beschreven wordt door een werk. @nl
toolkit label: beschrijving van collectieve actor @nl
toolkit definition: Een collectieve actor die beschreven wordt door een werk. @nl
label: هو وصف لوكيل جماعي @ar
definition: يربط بين عمل ووكيل جماعي موصوف في عمل. @ar
toolkit label: وصف لوكيل جماعي @ar
toolkit definition: وكيل جماعي موصوف في عمل. @ar
label: és descripció d’un agent col·lectiu @ca
definition: Relaciona una obra amb un agent col·lectiu que és descrit per una obra. @ca
toolkit label: descripció d’un agent col·lectiu @ca
toolkit definition: Agent col·lectiu que és descrit per una obra. @ca
label: er beskrivelse af kollektiv agent @da
definition: Relaterer et værk til en kollektiv agent, som er beskrevet af et værk. @da
toolkit label: beskrivelse af kollektiv agent @da
toolkit definition: Kollektiv agent, som er beskrevet af et værk. @da
label: kirjeldatud kollektiiv @et
definition: Seostab teose kollektiiviga, keda on teoses kirjeldatud. @et
toolkit label: kirjeldatud kollektiiv @et
toolkit definition: Kollektiiv, keda on teoses kirjeldatud. @et
label: ist Beschreibung von (Gemeinschaftlicher Akteur) @de
definition: Setzt ein Werk in Beziehung zu einem gemeinschaftlichen Akteur, der von einem Werk beschrieben wird. @de
toolkit label: Beschreibung von (Gemeinschaftlicher Akteur) @de
toolkit definition: Ein gemeinschaftlicher Akteur, der von einem Werk beschrieben wird. @de
label: leírása a következő kollektív ágensnek: @hu
definition: Hozzákapcsol egy művet egy kollektív ágenshez, amelyet egy mű leír. @hu
toolkit label: leírt kollektív ágens: @hu
toolkit definition: Egy kollektív ágens, amelyet egy mű leír. @hu
label: è descrizione di agente collettivo @it
definition: Correla un’opera a un agente collettivo che è descritto da un’opera. @it
toolkit label: descrizione di agente collettivo @it
toolkit definition: Agente collettivo che è descritto da un’opera. @it
label: est une description d’un agent collectif @fr
definition: Met une œuvre en relation avec un agent collectif qui est décrit par une œuvre. @fr
toolkit label: description d’un agent collectif @fr
toolkit definition: Agent collectif qui est décrit par une œuvre. @fr
label: ir apraksts grupai @lv
definition: Sasaista darbu ar grupu, kas aprakstīta darbā. @lv
toolkit label: apraksts grupai @lv
toolkit definition: Grupa, kas aprakstīta darbā. @lv
label: 是集体行为者的描述 @zh-hans
definition: 将一种作品与被一种作品描述的一个集体行为者行为者关联起来。 @zh-hans
toolkit label: 集体行为者行为者的描述 @zh-hans
toolkit definition: 被一种作品描述的一个集体行为者行为者 @zh-hans
has subproperty: is description of family
has subproperty: is description of corporate body
has subproperty: is metadata description of collective agent
has subproperty: P10339
label: kolektif temsilcinin tanımıdır @tr
definition: Bir eseri, bir eseriyle tanımlanan kolektif bir temsilci ile ilişkilendirir. @tr
toolkit label: kolektif temsilcinin tanımı @tr
toolkit definition: Bir eser tarafından tanımlanan kolektif temsilci. @tr

is description of nomen
status: Published
lexical alias: descriptionOfNomen.en
definition: Relates a work to a nomen that is described by a work.
toolkit label: description of nomen
toolkit definition: A nomen that is described by a work.
type: Property
domain: C10001
sub property of: has subject nomen
has element type: 2
sub property of: is description of RDA entity
label: kuvaus nomenista @fi
definition: Liittää teoksen nomeniin, jota teos kuvaa. @fi
toolkit label: kuvaus nomenista @fi
toolkit definition: Nomen, jota teos kuvaa. @fi
label: er beskrivelse av nomen @no
definition: Relaterer et verk til et nomen som beskrives av et verk. @no
toolkit label: beskrivelse av nomen @no
toolkit definition: Et nomen som beskrives av et verk. @no
label: is beschrijving van nomen @nl
definition: Relateert een werk aan een nomen dat beschreven wordt door een werk. @nl
toolkit label: beschrijving van nomen @nl
toolkit definition: Een nomen dat beschreven wordt door een werk. @nl
label: هو وصف تسمية @ar
definition: يربط بين عمل وتسمية موصوفة في عمل. @ar
toolkit label: وصف تسمية @ar
toolkit definition: تسمية موصوفة في عمل. @ar
label: és descripció d’un nomen @ca
definition: Relaciona una obra amb un nomen que és descrit per una obra. @ca
toolkit label: descripció d’un nomen @ca
toolkit definition: Nomen que és descrit per una obra. @ca
label: er beskrivelse af nomen @da
definition: Relaterer et værk til et nomen, som er beskrevet af et værk. @da
toolkit label: beskrivelse af nomen @da
toolkit definition: Nomen, som er beskrevet af et værk. @da
label: kirjeldatud nomen @et
definition: Seostab teose nomen'iga, mida teoses on kirjeldatud. @et
toolkit label: kirjeldatud nomen @et
toolkit definition: Nomen, mida teoses on kirjeldatud. @et
label: ist Beschreibung von (Nomen) @de
definition: Setzt ein Werk in Beziehung zu einem Nomen, das von einem Werk beschrieben wird. @de
toolkit label: Beschreibung von (Nomen) @de
toolkit definition: Ein Nomen, das von einem Werk beschrieben wird. @de
label: leírása a következő nomennek: @hu
definition: Hozzákapcsol egy művet egy nomenhez, amelyet egy mű leír. @hu
toolkit label: leírt nomen @hu
toolkit definition: Egy nomen, amelyet egy mű leír. @hu
label: è descrizione di nomen @it
definition: Correla un'opera a un nomen descritto da un'opera. @it
toolkit label: descrizione di nomen @it
toolkit definition: Nomen descritto da un'opera. @it
label: est une description d’un nomen @fr
definition: Met une œuvre en relation avec un nomen qui est décrit par une œuvre. @fr
toolkit label: description d’un nomen @fr
toolkit definition: Nomen qui est décrit par une œuvre. @fr
label: ir apraksts nomenam @lv
definition: Sasaista darbu ar nomenu, kurš aprakstīts darbā. @lv
toolkit label: apraksts nomenam @lv
toolkit definition: Nomens, kurš aprakstīts darbā. @lv
label: 是命名的描述 @zh-hans
definition: 将一种作品与被一种作品描述的一个命名关联起来。 @zh-hans
toolkit label: 命名的描述 @zh-hans
toolkit definition: 被一种作品描述的一个命名 @zh-hans
has subproperty: is metadata description of nomen
has subproperty: P10600
label: ismin tanımıdır @tr
definition: Bir eseri, bir eser tarafından tanımlanan bir isim ile ilişkilendirir. @tr
toolkit label: ismin tanımı @tr
toolkit definition: Bir eser tarafından tanımlanan bir isim. @tr

is description of place
status: Published
lexical alias: descriptionOfPlace.en
definition: Relates a work to a place that is described by a work.
toolkit label: description of place
toolkit definition: A place that is described by a work.
type: Property
domain: C10001
sub property of: has subject place
has element type: 2
sub property of: is description of RDA entity
label: kuvaus paikasta @fi
definition: Liittää teoksen paikkaan, jota teos kuvaa. @fi
toolkit label: kuvaus paikasta @fi
toolkit definition: Paikka, jota teos kuvaa. @fi
label: er beskrivelse av sted @no
definition: Relaterer et verk til et sted som beskrives av et verk. @no
toolkit label: beskrivelse av sted @no
toolkit definition: Et sted som beskrives av et verk. @no
label: is beschrijving van plaats @nl
definition: Relateert een werk aan een plaats die beschreven wordt door een werk. @nl
toolkit label: beschrijving van plaats @nl
toolkit definition: Een plaats die beschreven wordt door een werk. @nl
label: هو وصف مكان @ar
definition: يربط بين عمل ومكان موصوف في عمل. @ar
toolkit label: وصف مكان @ar
toolkit definition: مكان موصوف في عمل. @ar
label: és descripció d’un lloc @ca
definition: Relaciona una obra amb un lloc que és descrit per una obra. @ca
toolkit label: descripció d’un lloc @ca
toolkit definition: Lloc que és descrit per una obra. @ca
label: er beskrivelse af sted @da
definition: Relaterer et værk til et sted, som er beskrevet af et værk. @da
toolkit label: beskrivelse af sted @da
toolkit definition: Sted, som er beskrevet af et værk. @da
label: kirjeldatud koht @et
definition: Seostab teose kohaga, mida teoses on kirjeldatud. @et
toolkit label: kirjeldatud koht @et
toolkit definition: Koht, mida teoses on kirjeldatud. @et
label: Ist Beschreibung von (Geografikum) @de
definition: Setzt ein Werk in Beziehung zu einem Geografikum, das von einem Werk beschrieben wird. @de
toolkit label: Beschreibung von (Geografikum) @de
toolkit definition: Ein Geografikum, das von einem Werk beschrieben wird. @de
label: leírása a következő helynek: @hu
definition: Hozzákapcsol egy művet egy helyhez, amelyet egy mű leír. @hu
toolkit label: leírt hely @hu
toolkit definition: Egy hely, amelyet egy mű leír. @hu
label: è descrizione di luogo @it
definition: Correla un'opera a un luogo descritto da un'opera. @it
toolkit label: descrizione di luogo @it
toolkit definition: Luogo descritto da un'opera. @it
label: est une description d’un lieu @fr
definition: Met une œuvre en relation avec un lieu qui est décrit par une œuvre. @fr
toolkit label: description d’un lieu @fr
toolkit definition: Lieu qui est décrit par une œuvre. @fr
label: ir apraksts vietai @lv
definition: Sasaista darbu ar vietu, kas aprakstīta darbā. @lv
toolkit label: apraksts vietai @lv
toolkit definition: Vieta, kas aprakstīta darbā. @lv
label: 是地点的描述 @zh-hans
definition: 将一种作品与被一种作品描述的一个地点关联起来。 @zh-hans
toolkit label: 地点的描述 @zh-hans
toolkit definition: 被一种作品描述的一个地点 @zh-hans
has subproperty: is metadata description of place
has subproperty: P10601
label: yerin tanımıdır @tr
definition: Bir eseri, eser tarafından tanımlanan bir yerle ilişkilendirir. @tr
toolkit label: yerin tanımı @tr
toolkit definition: Bir eser tarafından tanımlanan bir yer. @tr

is description of RDA entity
status: Published
lexical alias: descriptionOfRDAEntity.en
definition: Relates a work to an RDA entity that is described by a work.
toolkit label: description of RDA entity
toolkit definition: An RDA entity that is described by a work.
type: Property
domain: C10001
has element type: 2
sub property of: has subject RDA entity
label: kuvaus RDA-entiteetistä @fi
definition: Liittää teoksen RDA-entiteettiin, jota teos kuvaa. @fi
toolkit label: kuvaus RDA-entiteetistä @fi
toolkit definition: RDA-entiteetti, jota teos kuvaa. @fi
label: er beskrivelse av RDA-entitet @no
definition: Relaterer et verk til en RDA-entitet som er beskrevet av et verk. @no
toolkit label: beskrivelse av RDA-entitet @no
toolkit definition: En RDA-entitet som er beskrevet av et verk. @no
label: is beschrijving van RDA-entiteit @nl
definition: Relateert een werk aan een RDA-entiteit die beschreven wordt door een werk. @nl
toolkit label: beschrijving van RDA-entiteit @nl
toolkit definition: Een RDA-entiteit die beschreven wordt door een werk. @nl
label: هو وصف لكيان "وام" @ar
definition: يربط بين عمل وكيان "وام" موصوف في عمل. @ar
toolkit label: وصف لكيان "وام" @ar
toolkit definition: كيان "وام" موصوف في عمل. @ar
label: és descripció d’una entitat RDA @ca
definition: Relaciona una obra amb una entitat RDA que és descrita per una obra. @ca
toolkit label: descripció d’una entitat RDA @ca
toolkit definition: Entitat RDA que és descrita per una obra. @ca
label: er beskrivelse af RDA-entitet @da
definition: Relaterer et værk til en RDA-entitet, som er beskrevet af et værk. @da
toolkit label: beskrivelse af RDA-entitet @da
toolkit definition: RDA-entitet, som er beskrevet af et værk. @da
label: kirjeldatud RDA olem @et
definition: Seostab teose RDA olemiga, mida teoses on kirjeldatud. @et
toolkit label: kirjeldatud RDA olem @et
toolkit definition: RDA olem, mida teoses on kirjeldatud. @et
label: ist Beschreibung von (RDA-Entität) @de
definition: Setzt ein Werk in Beziehung zu einer RDA-Entität, die von einem Werk beschrieben wird. @de
toolkit label: Beschreibung von (RDA-Entität) @de
toolkit definition: Eine RDA-Entität, die von einem Werk beschrieben wird. @de
label: leírása a következő RDA-entitásnak: @hu
definition: Hozzákapcsol egy művet egy RDA-entitáshoz, amelyet egy mű leír. @hu
toolkit label: leírt RDA-entitás @hu
toolkit definition: Egy RDA-entitás, amelyet egy mű leír. @hu
label: è descrizione di entità RDA @it
definition: Correla un’opera a un’entità RDA che è descritta da un’opera. @it
toolkit label: descrizione di entità RDA @it
toolkit definition: Entità RDA che è descritta da un’opera. @it
label: est une description d’une entité RDA @fr
definition: Met une œuvre en relation avec une entité RDA qui est décrite par une œuvre. @fr
toolkit label: description d’une entité RDA @fr
toolkit definition: Entité RDA qui est décrite par une œuvre. @fr
label: ir apraksts RDA entītei @lv
definition: Sasaista darbu ar RDA entīti, kas aprakstīta darbā. @lv
toolkit label: apraksts RDA entītei @lv
toolkit definition: RDA entīte, kas aprakstīta darbā. @lv
label: 是RDA实体的描述 @zh-hans
definition: 将一种作品与被一种作品描述的一个RDA实体关联起来。 @zh-hans
toolkit label: RDA实体的描述 @zh-hans
toolkit definition: 被一种作品描述的一个RDA实体 @zh-hans
has subproperty: is description of agent
has subproperty: is description of nomen
has subproperty: is description of place
has subproperty: is description of timespan
has subproperty: is description of expression
has subproperty: is description of manifestation
has subproperty: is description of work
has subproperty: is description of item
has subproperty: is metadata description of RDA entity
has subproperty: P10360
label: RDA varlığının tanımıdır @tr
definition: Bir eseri, bir eser tarafından tanımlanan bir RDA varlığıyla ilişkilendirir. @tr
toolkit label: RDA varlığının tanımı @tr
toolkit definition: Bir eser tarafından açıklanan bir RDA varlığı. @tr

is description of timespan
status: Published
lexical alias: descriptionOfTimespan.en
definition: Relates a work to a timespan that is described by a work.
toolkit label: description of timespan
toolkit definition: A timespan that is described by a work.
type: Property
domain: C10001
sub property of: has subject timespan
has element type: 2
sub property of: is description of RDA entity
label: kuvaus ajanjaksosta @fi
definition: Liittää teoksen ajanjaksoon, jota teos kuvaa. @fi
toolkit label: kuvaus ajanjaksosta @fi
toolkit definition: Ajanjakso, jota teos kuvaa. @fi
label: er beskrivelse av tidsrom @no
definition: Relaterer et verk til et tidsrom som beskrives av et verk. @no
toolkit label: beskrivelse av tidsrom @no
toolkit definition: Et tidsrom som beskrives av et verk. @no
label: is beschrijving van tijdspanne @nl
definition: Relateert een werk aan een tijdspanne die beschreven wordt door een werk. @nl
toolkit label: beschrijving van tijdspanne @nl
toolkit definition: Een tijdspanne die beschreven wordt door een werk. @nl
label: هو وصف فترة زمنية @ar
definition: يربط بين عمل وفترة زمنية موصوفة في عمل. @ar
toolkit label: وصف فترة زمنية @ar
toolkit definition: فترة زمنية موصوفة في عمل. @ar
label: és descripció d’un interval de temps @ca
definition: Relaciona una obra amb un interval de temps que és descrit per una obra. @ca
toolkit label: descripció d’un interval de temps @ca
toolkit definition: Interval de temps que és descrit per una obra. @ca
label: er beskrivelse af tidsperiode @da
definition: Relaterer et værk til en tidsperiode, som er beskrevet af et værk. @da
toolkit label: beskrivelse af tidsperiode @da
toolkit definition: Tidsperiode, som er beskrevet af et værk. @da
label: kirjeldatud ajavahemik @et
definition: Seostab teose ajavahemikuga, mida teoses on kirjeldatud. @et
toolkit label: kirjeldatud ajavahemik @et
toolkit definition: Ajavahemik, mida teoses on kirjeldatud. @et
label: Ist Beschreibung von (Zeitraum) @de
definition: Setzt ein Werk in Beziehung zu einem Zeitraum, der von einem Werk beschrieben wird. @de
toolkit label: Beschreibung von (Zeitraum) @de
toolkit definition: Ein Zeitraum, der von einem Werk beschrieben wird. @de
label: leírása a következő időtartamnak: @hu
definition: Hozzákapcsol egy művet egy időtartamhoz, amelyet egy mű leír. @hu
toolkit label: leírt időtartam @hu
toolkit definition: Egy időtartam, amelyet egy mű leír. @hu
label: è descrizione di arco di tempo @it
definition: Correla un'opera a un arco di tempo descritto da un'opera. @it
toolkit label: descrizione di arco di tempo @it
toolkit definition: Arco di tempo descritto da un'opera. @it
label: est une description d’un laps de temps @fr
definition: Met une œuvre en relation avec un laps de temps qui est décrit par une œuvre. @fr
toolkit label: description d’un laps de temps @fr
toolkit definition: Laps de temps qui est décrit par une œuvre. @fr
label: ir apraksts laikposmam @lv
definition: Sasaista darbu ar laikposmu, kas aprakstīts darbā. @lv
toolkit label: apraksts laikposmam @lv
toolkit definition: Laikposms, kas aprakstīts darbā. @lv
label: 是时间段的描述 @zh-hans
definition: 将一种作品与被一种作品描述的一个时间段关联起来。 @zh-hans
toolkit label: 时间段的描述 @zh-hans
toolkit definition: 被一种作品描述的一个时间段 @zh-hans
has subproperty: is metadata description of timespan
has subproperty: P10602
label: zaman aralığının tanımıdır @tr
definition: Bir eseri, bir eser tarafından tanımlanan bir zaman aralığıyla ilişkilendirir. @tr
toolkit label: zaman aralığının tanımı @tr
toolkit definition: Bir eser tarafından tanımlanan bir zaman aralığı. @tr

has descriptive work relationship with (Deprecated)
status: Deprecated
type: Property
scope note: Descriptive works include descriptions, critiques, evaluations, reviews, commentaries, etc.
toolkit definition: A work that is described in or is a description of the work. (Deprecated)
toolkit label: descriptive work relationship (Deprecated)
definition: Relates a work to a work that is described in or is a description of the work. (Deprecated)
lexical alias: descriptiveWorkRelationship.en
domain: C10001

has designer agent
status: Published
definition: Relates a work to an agent who is responsible for creating a design for an object.
type: Property
domain: C10001
sub property of: has creator agent of work
lexical alias: designerAgent.en
toolkit label: designer agent
toolkit definition: An agent who is responsible for creating a design for an object.
toolkit label: agent designer @fr
toolkit definition: Agent qui est responsable de la conception d’un objet. @fr
toolkit label: diseñador @es
toolkit definition: Una persona, familia o entidad corporativa responsable de la creación del diseño de un objeto. @es
instruction number: 18.5
label: har agent, som er designer @da
definition: Relaterer et værk til en agent, som er ansvarlig for at designe et objekt. @da
toolkit label: agent, som er designer @da
toolkit definition: Agent, som er ansvarlig for at designe et objekt. @da
definition: Met une œuvre en relation avec un agent qui est responsable de la conception d’un objet. @fr
label: có người thiết kế @vi
definition: Liên kết tác phẩm với tác nhân có trách nhiệm sáng tạo thiết kế cho vật thể. @vi
toolkit label: người thiết kế @vi
toolkit definition: Tác nhân có trách nhiệm sáng tạo thiết kế cho vật thể. @vi
label: hat Designerin/Designer (Akteur) @de
definition: Setzt ein Werk in Beziehung zu einem Akteur, der für die Gestaltung des Designs eines Objekts verantwortlich ist. @de
toolkit label: Designerin/Designer (Akteur) @de
toolkit definition: Ein Akteur, der für die Gestaltung des Designs eines Objekts verantwortlich ist. @de
label: a pour agent designer @fr
definition: Liittää teoksen toimijaan, joka on vastuussa kohteen suunnittelusta tai muotoilusta. @fi
toolkit label: designer (toimija) @fi
toolkit definition: Toimija, joka on vastuussa kohteen suunnittelusta tai muotoilusta. @fi
toolkit label: designer (agent) @no
toolkit definition: En agent som er ansvarlig for å designe en gjenstand. @no
label: té com a agent dissenyador @ca
definition: Relaciona una obra amb un agent que és responsable de la creació d’un disseny d’un objecte. @ca
toolkit label: agent dissenyador @ca
toolkit definition: Agent que és responsable de la creació d’un disseny d’un objecte. @ca
has element type: 2
label: έχει σχεδιαστή @el
definition: Συνδέει ένα έργο με έναν φορέα υπεύθυνο για τον σχεδιασμό ενός αντικειμένου. @el
toolkit label: σχεδιαστής @el
toolkit definition: Ένας φορέας υπεύθυνος για τον σχεδιασμό ενός αντικειμένου. @el
label: tervező ágense a következő: @hu
definition: Hozzákapcsol egy művet egy ágenshez, amely felelős egy tárgy tervezetének a megalkotásáért. @hu
toolkit label: tervező ágens: @hu
toolkit definition: Egy ágens, amely felelős egy tárgy tervezetének a megalkotásáért. @hu
alternative label: designer
label: designer (toimija) @fi
label: har designer (agent) @no
definition: Relaterer et verk til en agent som er ansvarlig for å designe en gjenstand. @no
label: heeft ontwerper-actor @nl
definition: Relateert een werk aan een actor die verantwoordelijk is voor het creëren van een ontwerp voor een object. @nl
toolkit label: ontwerper-actor @nl
toolkit definition: Een actor die verantwoordelijk is voor het creëren van een ontwerp voor een object. @nl
label: له وكيل مصمم @ar
definition: يربط بين عمل ووكيل مسئول عن إعداد تصميم لكائن. @ar
alternative label: مصمم @ar
toolkit label: وكيل مصمم @ar
toolkit definition: وكيل مسئول عن إعداد تصميم كائن. @ar
alternative label: dissenyador @ca
label: kujundaja (tegija) @et
definition: Seostab teose tegijaga, kes vastutab objekti kujunduse loomise eest. @et
alternative label: kujundaja @et
alternative label: disainer (tegija) @et
toolkit label: kujundaja (tegija) @et
toolkit definition: Tegija, kes vastutab objekti kujunduse loomise eest. @et
alternative label: tervező: @hu
label: ha come designer agente @it
definition: Correla un'opera a un agente responsabile della creazione del progetto di un oggetto. @it
toolkit label: designer agente @it
toolkit definition: Agente responsabile della creazione del progetto di un oggetto. @it
label: dizainers (aģents) @lv
definition: Sasaista darbu ar aģentu, kas ir atbildīgs par objekta dizaina radīšanu/izveidi. @lv
toolkit label: dizainers (aģents) @lv
toolkit definition: Aģents, kas ir atbildīgs par objekta dizaina radīšanu/izveidi. @lv
alternative label: Designer @de
alternative label: 设计者 @zh-hans
label: 有设计者行为者 @zh-hans
definition: 将一种作品与负责创建一个物体的设计的一个行为者关联起来。 @zh-hans
toolkit label: 设计者行为者 @zh-hans

has designer collective agent
status: Published
lexical alias: designerCollectiveAgent.en
definition: Relates a work to a collective agent who is responsible for creating a design for an object.
toolkit label: designer collective agent
toolkit definition: A collective agent who is responsible for creating a design for an object.
type: Property
domain: C10001
has element type: 2
sub property of: has creator collective agent of work
sub property of: has designer agent
label: designer (yhteistoimija) @fi
definition: Liittää teoksen yhteistoimijaan, joka on vastuussa kohteen suunnittelusta tai muotoilusta. @fi
toolkit label: designer (yhteistoimija) @fi
toolkit definition: Yhteistoimija, joka on vastuussa kohteen suunnittelusta tai muotoilusta. @fi
label: har designer (kollektiv agent) @no
definition: Relaterer et verk til en kollektiv agent som er ansvarlig for å designe en gjenstand. @no
toolkit label: designer (kollektiv agent) @no
toolkit definition: En kollektiv agent som er ansvarlig for å designe en gjenstand. @no
label: heeft ontwerper-collectieve actor @nl
definition: Relateert een werk aan een collectieve actor die verantwoordelijk is voor het creëren van een ontwerp voor een object. @nl
toolkit label: ontwerper-collectieve actor @nl
toolkit definition: Een collectieve actor die verantwoordelijk is voor het creëren van een ontwerp voor een object. @nl
label: له وكيل جماعي مصمم @ar
definition: يربط بين عمل ووكيل جماعي مسئول عن إنشاء تصميم لكائن. @ar
toolkit label: وكيل جماعي مصمم @ar
toolkit definition: وكيل جماعي مسئول عن إنشاء تصميم لكائن. @ar
label: té com a agent col·lectiu dissenyador @ca
definition: Relaciona una obra amb un agent col·lectiu que és responsable de la creació d’un disseny d’un objecte. @ca
toolkit label: agent col·lectiu dissenyador @ca
toolkit definition: Agent col·lectiu que és responsable de la creació d’un disseny d’un objecte. @ca
label: har kollektiv agent, som er designer @da
definition: Relaterer et værk til en kollektiv agent, som er ansvarlig for at designe et objekt. @da
toolkit label: kollektiv agent, som er designer @da
toolkit definition: Kollektiv agent, som er ansvarlig for at designe et objekt. @da
label: kujundaja (kollektiiv) @et
definition: Seostab teose kollektiiviga, kes vastutab objekti kujunduse loomise eest. @et
alternative label: disainer (kollektiiv) @et
toolkit label: kujundaja (kollektiiv) @et
toolkit definition: Kollektiiv, kes vastutab objekti kujunduse loomise eest. @et
label: hat Designerin/Designer (Gemeinschaftlicher Akteur) @de
definition: Setzt ein Werk in Beziehung zu einem gemeinschaftlichen Akteur, der für die Gestaltung des Designs eines Objekts verantwortlich ist. @de
toolkit label: Designerin/Designer (Gemeinschaftlicher Akteur) @de
toolkit definition: Ein gemeinschaftlicher Akteur, der für die Gestaltung des Designs eines Objekts verantwortlich ist. @de
label: tervező kollektív ágense a következő: @hu
definition: Hozzákapcsol egy művet egy kollektív ágenshez, amely felelős egy tárgy tervezetének a megalkotásáért. @hu
toolkit label: tervező kollektív ágens: @hu
toolkit definition: Egy kollektív ágens, amely felelős egy tárgy tervezetének a megalkotásáért. @hu
label: ha come designer agente collettivo @it
definition: Correla un'opera all'agente collettivo responsabile della creazione del progetto di un oggetto. @it
toolkit label: designer agente collettivo @it
toolkit definition: Agente collettivo responsabile della creazione del progetto di un oggetto. @it
label: a pour agent collectif designer @fr
definition: Met une œuvre en relation avec un agent collectif qui est responsable de la conception d’un objet. @fr
toolkit label: agent collectif designer @fr
toolkit definition: Agent collectif qui est responsable de la conception d’un objet. @fr
label: dizainers (grupa) @lv
definition: Sasaista darbu ar grupu, kas ir atbildīga par objekta dizaina radīšanu/izveidi. @lv
toolkit label: dizainers (grupa) @lv
toolkit definition: Grupa, kas ir atbildīga par objekta dizaina radīšanu/izveidi. @lv
label: 有设计者集体行为者 @zh-hans
definition: 将一种作品与负责创建一个物体的设计的一个集体行为者关联起来。 @zh-hans
toolkit label: 设计者集体行为者 @zh-hans
toolkit definition: 负责创建一个物体的设计的一个集体行为者 @zh-hans
has subproperty: has designer corporate body
has subproperty: has designer family
has subproperty: P10488
label: tasarımcı kolektif temsilcisi ile ilişkilidir @tr
definition: Bir eseri, bir nesne için tasarım oluşturmaktan sorumlu olan kolektif bir temsilci ile ilişkilendirir. @tr
toolkit label: tasarımcı kolektif temsilci @tr
toolkit definition: Bir nesne için tasarım oluşturmaktan sorumlu olan kolektif temsilci @tr

has designer corporate body
status: Published
lexical alias: designerCorporateBody.en
definition: Relates a work to a corporate body who is responsible for creating a design for an object.
toolkit label: designer corporate body
toolkit definition: A corporate body who is responsible for creating a design for an object.
type: Property
domain: C10001
has element type: 2
sub property of: has creator corporate body of work
sub property of: has designer collective agent
label: designer (yhteisö) @fi
definition: Liittää teoksen yhteisöön, joka on vastuussa kohteen suunnittelusta tai muotoilusta. @fi
toolkit label: designer (yhteisö) @fi
toolkit definition: Yhteisö, joka on vastuussa kohteen suunnittelusta tai muotoilusta. @fi
label: har designer (korporasjon) @no
definition: Relaterer et verk til en korporasjon som er ansvarlig for å designe en gjenstand. @no
toolkit label: designer (korporasjon) @no
toolkit definition: En korporasjon som er ansvarlig for å designe en gjenstand. @no
label: heeft ontwerper-corporatie @nl
definition: Relateert een werk aan een corporatie die verantwoordelijk is voor het creëren van een ontwerp voor een object. @nl
toolkit label: ontwerper-corporatie @nl
toolkit definition: Een corporatie die verantwoordelijk is voor het creëren van een ontwerp voor een object. @nl
label: له هيئة مصممة @ar
definition: يربط بين عمل وهيئة مسئولة عن إنشاء تصميم لكائن. @ar
toolkit label: هيئة مصممة @ar
toolkit definition: هيئة مسئولة عن إنشاء تصميم لكائن. @ar
label: té com a entitat corporativa dissenyadora @ca
definition: Relaciona una obra amb una entitat corporativa que és responsable de la creació d’un disseny d’un objecte. @ca
toolkit label: entitat corporativa dissenyadora @ca
toolkit definition: Entitat corporativa que és responsable de la creació d’un disseny d’un objecte. @ca
label: har korporation, som er designer @da
definition: Relaterer et værk til en korporation, som er ansvarlig for at designe et objekt. @da
toolkit label: korporation, som er designer @da
toolkit definition: Korporation, som er ansvarlig for at designe et objekt. @da
label: kujundaja (asutus) @et
definition: Seostab teose asutusega, kes vastutab objekti kujunduse loomise eest. @et
alternative label: disainer (asutus) @et
toolkit label: kujundaja (asutus) @et
toolkit definition: Asutus, kes vastutab objekti kujunduse loomise eest. @et
label: hat Designerin/Designer (Körperschaft) @de
definition: Setzt ein Werk in Beziehung zu einer Körperschaft, die für die Gestaltung des Designs eines Objekts verantwortlich ist. @de
toolkit label: Designerin/Designer (Körperschaft) @de
toolkit definition: Eine Körperschaft, die für die Gestaltung des Designs eines Objekts verantwortlich ist. @de
label: tervező testülete a következő: @hu
definition: Hozzákapcsol egy művet egy testülethez, amely felelős egy tárgy tervezetének a megalkotásáért. @hu
toolkit label: tervező testület: @hu
toolkit definition: Egy testület, amely felelős egy tárgy tervezetének a megalkotásáért. @hu
label: ha come designer ente @it
definition: Correla un'opera a un ente responsabile della creazione del progetto di un oggetto. @it
toolkit label: designer ente @it
toolkit definition: Ente responsabile della creazione del progetto di un oggetto. @it
label: a pour collectivité designer @fr
definition: Met une œuvre en relation avec une collectivité qui est responsable de la conception d’un objet. @fr
toolkit label: collectivité designer @fr
toolkit definition: Collectivité qui est responsable de la conception d’un objet. @fr
label: dizainers (institūcija) @lv
definition: Sasaista darbu ar institūciju, kas ir atbildīga par objekta dizaina radīšanu/izveidi. @lv
toolkit label: dizainers (institūcija) @lv
toolkit definition: Institūcija, kas ir atbildīga par objekta dizaina radīšanu/izveidi. @lv
label: 有设计者团体 @zh-hans
definition: 将一种作品与负责创建一个物体的设计的一个团体关联起来。 @zh-hans
toolkit label: 设计者团体 @zh-hans
toolkit definition: 负责创建一个物体的设计的一个团体 @zh-hans
has subproperty: P10535
label: tasarımcı tüzel kişisi ile ilişkilidir @tr
definition: Bir eseri, bir nesne için tasarım oluşturmaktan sorumlu olan tüzel kişi ile ilişkilendirir. @tr
toolkit label: tasarımcı tüzel kişi @tr
toolkit definition: Bir nesne için tasarım oluşturmaktan sorumlu olan bir tüzel kişi. @tr

has designer family
status: Published
lexical alias: designerFamily.en
definition: Relates a work to a family who is responsible for creating a design for an object.
toolkit label: designer family
toolkit definition: A family who is responsible for creating a design for an object.
type: Property
domain: C10001
has element type: 2
sub property of: has creator family of work
sub property of: has designer collective agent
label: designer (suku) @fi
definition: Liittää teoksen sukuun, joka on vastuussa kohteen suunnittelusta tai muotoilusta. @fi
toolkit label: designer (suku) @fi
toolkit definition: Suku, joka on vastuussa kohteen suunnittelusta tai muotoilusta. @fi
label: har designer (familie) @no
definition: Relaterer et verk til en familie som er ansvarlig for å designe en gjenstand. @no
toolkit label: designer (familie) @no
toolkit definition: En familie som er ansvarlig for å designe en gjenstand. @no
label: heeft ontwerper-familie @nl
definition: Relateert een werk aan een familie die verantwoordelijk is voor het creëren van een ontwerp voor een object. @nl
toolkit label: ontwerper-familie @nl
toolkit definition: Een familie die verantwoordelijk is voor het creëren van een ontwerp voor een object. @nl
label: له عائلة مصممة @ar
definition: يربط بين عمل وعائلة مسئولة عن إنشاء تصميم لكائن. @ar
toolkit label: عائلة مصممة @ar
toolkit definition: عائلة مسئولة عن إنشاء تصميم لكائن. @ar
label: té com a família dissenyadora @ca
definition: Relaciona una obra amb una família que és responsable de la creació d’un disseny d’un objecte. @ca
toolkit label: família dissenyadora @ca
toolkit definition: Família que és responsable de la creació d’un disseny d’un objecte. @ca
label: har familie, som er designer @da
definition: Relaterer et værk til en familie, som er ansvarlig for at designe et objekt. @da
toolkit label: familie, som er designer @da
toolkit definition: Familie, som er ansvarlig for at designe et objekt. @da
label: kujundaja (perekond) @et
definition: Seostab teose perekonnaga, kes vastutab objekti kujunduse loomise eest. @et
alternative label: disainer (perekond) @et
toolkit label: kujundaja (perekond) @et
toolkit definition: Perekond, kes vastutab objekti kujunduse loomise eest. @et
label: hat Designerin/Designer (Familie) @de
definition: Setzt ein Werk in Beziehung zu einer Familie, die für die Gestaltung des Designs eines Objekts verantwortlich ist. @de
toolkit label: Designerin/Designer (Familie) @de
toolkit definition: Eine Familie, die für die Gestaltung des Designs eines Objekts verantwortlich ist. @de
label: tervező családja a következő: @hu
definition: Hozzákapcsol egy művet egy családhoz, amely felelős egy tárgy tervezetének a megalkotásáért. @hu
toolkit label: tervező család: @hu
toolkit definition: Egy család, amely felelős egy tárgy tervezetének a megalkotásáért. @hu
label: ha come designer famiglia @it
definition: Correla un'opera alla famiglia responsabile della creazione del progetto di un oggetto. @it
toolkit label: designer famiglia @it
toolkit definition: Famiglia responsabile della creazione del progetto di un oggetto. @it
label: a pour famille designer @fr
definition: Met une œuvre en relation avec une famille qui est responsable de la conception d’un objet. @fr
toolkit label: famille designer @fr
toolkit definition: Famille qui est responsable de la conception d’un objet. @fr
label: dizainers (dzimta/ģimene) @lv
definition: Sasaista darbu ar dzimtu/ģimeni, kas ir atbildīga par objekta dizaina radīšanu/izveidi. @lv
toolkit label: dizainers (dzimta/ģimene) @lv
toolkit definition: Dzimta/ģimene, kas ir atbildīga par objekta dizaina radīšanu/izveidi. @lv
label: 有设计者家族 @zh-hans
definition: 将一种作品与负责创建一个物体的设计的一个家族关联起来。 @zh-hans
toolkit label: 设计者家族 @zh-hans
toolkit definition: 负责创建一个物体的设计的一个家族 @zh-hans
has subproperty: P10582
label: tasarımcı ailesi ile ilişkilidir @tr
definition: Bir eseri, bir nesne için tasarım oluşturmaktan sorumlu olan bir aileyle ilişkilendirir. @tr
toolkit label: tasarımcı aile @tr
toolkit definition: Bir nesne için tasarım oluşturmaktan sorumlu bir aile. @tr

has designer person
status: Published
lexical alias: designerPerson.en
definition: Relates a work to a person who is responsible for creating a design for an object.
toolkit label: designer person
toolkit definition: A person who is responsible for creating a design for an object.
type: Property
domain: C10001
has element type: 2
sub property of: has creator person of work
sub property of: has designer agent
label: designer (henkilö) @fi
definition: Liittää teoksen henkilöön, joka on vastuussa kohteen suunnittelusta tai muotoilusta. @fi
toolkit label: designer (henkilö) @fi
toolkit definition: Henkilö, joka on vastuussa kohteen suunnittelusta tai muotoilusta. @fi
label: har designer (person) @no
definition: Relaterer et verk til en person som er ansvarlig for å designe en gjenstand. @no
toolkit label: designer (person) @no
toolkit definition: En person som er ansvarlig for å designe en gjenstand. @no
label: heeft ontwerper-persoon @nl
definition: Relateert een werk aan een persoon die verantwoordelijk is voor het creëren van een ontwerp voor een object. @nl
toolkit label: ontwerper-persoon @nl
toolkit definition: Een persoon die verantwoordelijk is voor het creëren van een ontwerp voor een object. @nl
label: له شخص مصمم @ar
definition: يربط بين عمل وشخص مسئول عن إنشاء تصميم لكائن. @ar
toolkit label: شخص مصمم @ar
toolkit definition: شخص يكون مسئولاً عن إنشاء تصميم لكائن. @ar
label: té com a persona dissenyadora @ca
definition: Relaciona una obra amb una persona que és responsable de la creació d’un disseny d’un objecte. @ca
toolkit label: persona dissenyadora @ca
toolkit definition: Persona que és responsable de la creació d’un disseny d’un objecte. @ca
label: har person, som er designer @da
definition: Relaterer et værk til en person, som er ansvarlig for at designe et objekt. @da
toolkit label: person, som er designer @da
toolkit definition: Person, som er ansvarlig for at designe et objekt. @da
label: kujundaja (isik) @et
definition: Seostab teose isikuga, kes vastutab objekti kujunduse loomise eest. @et
alternative label: disainer (isik) @et
toolkit label: kujundaja (isik) @et
toolkit definition: Isik, kes vastutab objekti kujunduse loomise eest. @et
label: hat Designerin/Designer (Person) @de
definition: Setzt ein Werk in Beziehung zu einer Person, die für die Gestaltung des Designs eines Objekts verantwortlich ist. @de
toolkit label: Designerin/Designer (Person) @de
toolkit definition: Eine Person, die für die Gestaltung des Designs eines Objekts verantwortlich ist. @de
label: tervező személye a következő: @hu
definition: Hozzákapcsol egy művet egy személyhez, aki felelős egy tárgy tervezetének a megalkotásáért. @hu
toolkit label: tervező személy: @hu
toolkit definition: Egy személy, aki felelős egy tárgy tervezetének a megalkotásáért. @hu
label: ha come designer persona @it
definition: Correla un'opera alla persona responsabile della creazione del progetto di un oggetto. @it
toolkit label: designer persona @it
toolkit definition: Persona responsabile della creazione del progetto di un oggetto. @it
label: a pour personne designer @fr
definition: Met une œuvre en relation avec une personne qui est responsable de la conception d’un objet. @fr
toolkit label: personne designer @fr
toolkit definition: Personne qui est responsable de la conception d’un objet. @fr
label: dizainers (persona) @lv
definition: Sasaista darbu ar personu, kura ir atbildīga par objekta dizaina radīšanu/izveidi. @lv
toolkit label: dizainers (persona) @lv
toolkit definition: Persona, kura ir atbildīga par objekta dizaina radīšanu/izveidi. @lv
label: 有设计者个人 @zh-hans
definition: 将一种作品与负责创建一个物体的设计的一个个人关联起来。 @zh-hans
toolkit label: 设计者个人 @zh-hans
toolkit definition: 负责创建一个物体的设计的一个个人 @zh-hans
has subproperty: P10441
label: tasarımcı kişisi ile ilişkilidir @tr
definition: Bir eseri, bir obje için tasarım oluşturmaktan sorumlu olan bir kişiyle ilişkilendirir. @tr
toolkit label: tasarımcı kişi @tr
toolkit definition: Bir obje için tasarım oluşturmaktan sorumlu kişi. @tr

has degree granting institution
status: Published
definition: Relates a work to a corporate body who approves a work that is a thesis or dissertation associated with an academic degree.
type: Property
domain: C10001
sub property of: has creator corporate body of work
lexical alias: degreeGrantingInstitution.en
toolkit label: degree granting institution
toolkit definition: A corporate body who approves a work that is a thesis or dissertation associated with an academic degree.
toolkit label: institution conférant un grade universitaire @fr
toolkit definition: Collectivité qui approuve une œuvre consistant en une thèse ou un mémoire associés à un grade universitaire. @fr
toolkit label: institución que otorga el grado @es
toolkit definition: Una entidad corporativa que otorga un grado académico. @es
instruction number: 18.5
label: har gradtildelende institution @da
definition: Relaterer et værk til en korporation, som godkender et værk, som er en afhandling for en akademisk grad. @da
toolkit label: gradtildelende institution @da
toolkit definition: Korporation, som godkender et værk, som er en afhandling for en akademisk grad. @da
definition: Met une œuvre en relation avec une collectivité qui approuve une œuvre consistant en une thèse ou un mémoire associés à un grade universitaire. @fr
label: có cơ quan cấp văn bằng @vi
definition: Liên kết tác phẩm với tập thể cấp văn bằng học thuật. @vi
toolkit label: cơ quan cấp văn bằng @vi
toolkit definition: Tập thể cấp văn bằng học thuật. @vi
label: hat grad-verleihende Institution @de
definition: Setzt ein Werk in Beziehung zu einer Körperschaft, die eine Hochschulschrift (Werk) genehmigt, die mit einem akademischen Grad in Verbindung steht. @de
toolkit label: Grad-verleihende Institution @de
toolkit definition: Eine Körperschaft, die eine Hochschulschrift (Werk) genehmigt, die mit einem akademischen Grad in Verbindung steht. @de
label: a pour institution conférant un grade universitaire @fr
definition: Liittää teoksen yhteisöön, joka hyväksyy teoksen, joka on akateemiseen oppiarvoon liittyvä opinnäyte tai väitöskirja. @fi
toolkit label: oppiarvon myöntävä yhteisö @fi
toolkit definition: Yhteisö, joka hyväksyy teoksen, joka on akateemiseen oppiarvoon liittyvä opinnäyte tai väitöskirja. @fi
toolkit label: gradstildelende institusjon @no
toolkit definition: En korporasjon som godkjenner et verk som er en avhandling for en akademisk grad. @no
label: té com a institució que concedeix un títol acadèmic @ca
definition: Relaciona una obra amb una entitat corporativa que aprova una obra que és una tesi o una dissertació associada amb un títol acadèmic. @ca
toolkit label: institució que concedeix un títol acadèmic @ca
toolkit definition: Entitat corporativa que aprova una obra que és una tesi o una dissertació associada amb un títol acadèmic. @ca
has element type: 2
label: έχει ίδρυμα χορήγησης του πτυχίου @el
definition: Συνδέει ένα έργο με ένα συλλογικό όργανο που χορηγεί ένα ανώτερου εκπαιδευτικού επιπέδου πτυχίο. @el
toolkit label: ίδρυμα χορήγησης του πτυχίου @el
toolkit definition: Ένα συλλογικό όργανο που χορηγεί ένα ανώτερου εκπαιδευτικού επιπέδου πτυχίο. @el
label: tudományos fokozatot adó intézménye a következő: @hu
definition: Hozzákapcsol egy művet egy testülethez, amely jóváhagy egy művet, amely egy tudományos fokozat elnyeréséért benyújtott szakdolgozat vagy disszertáció. @hu
toolkit label: tudományos fokozatot adó intézmény: @hu
toolkit definition: Egy testület, amely jóváhagy egy művet, amely egy tudományos fokozat elnyeréséért benyújtott szakdolgozat vagy disszertáció. @hu
alternative label: granting institution or faculty
label: oppiarvon myöntävä yhteisö @fi
label: har gradstildelende institusjon @no
definition: Relaterer et verk til en korporasjon som godkjenner et verk som er en avhandling for en akademisk grad. @no
label: heeft graadverstrekkende instantie @nl
definition: Relateert een werk aan een corporatie die een werk goedkeurt dat is een scriptie of proefschrift geassocieerd met een academische graad. @nl
toolkit label: graadverstrekkende instantie @nl
toolkit definition: Een corporatie die een werk goedkeurt dat is een scriptie of proefschrift geassocieerd met een academische graad. @nl
alternative label: laitos tai tiedekunta @fi
label: له مؤسسة مانحة لدرجة علمية @ar
definition: يربط بين عمل وهيئة تصدق على عمل عبارة عن أطروحة ماجستير أو دكتوراه مرتبطة بدرجة أكاديمية. @ar
toolkit label: مؤسسة مانحة لدرجة علمية @ar
toolkit definition: هيئة تصدق على عمل عبارة عن أطروحة ماجستير أو دكتوراه مرتبطة بدرجة أكاديمية. @ar
label: kraadi andev asutus @et
definition: Seostab teose asutusega, kes kiidab heaks akadeemilise kraadi taotlemiseks esitatud teose. @et
toolkit label: kraadi andev asutus @et
toolkit definition: Asutus, kes kiidab heaks akadeemilise kraadi taotlemiseks esitatud teose. @et
label: ha come istituzione che conferisce un titolo accademico @it
definition: Correla un’opera a un ente che approva un’opera che è una tesi per il conseguimento di un titolo accademico. @it
toolkit label: istituzione che conferisce un titolo accademico @it
toolkit definition: Ente che approva un'opera che è una tesi per il conseguimento di un titolo accademico. @it
label: grāda piešķīrējinstitūcija @lv
definition: Sasaista darbu ar institūciju, kas piešķir akadēmisko grādu. @lv
toolkit label: grāda piešķīrējinstitūcija @lv
toolkit definition: Institūcija, kas piešķir akadēmisko grādu. @lv
alternative label: institution ou faculté conférant un grade universitaire @fr
alternative label: مؤسسة أو كلية مانحة @ar
alternative label: Verleihende Institution oder Fakultät @de
alternative label: institució o facultat que concedeix un títol acadèmic @ca
alternative label: 授予机构或院系 @zh-hans
label: 有学位授予机构 @zh-hans
definition: 将一种作品与批准和一个学位相关的一种学位论文的一个团体关联起来。 @zh-hans
toolkit label: 学位授予机构 @zh-hans
toolkit definition: 批准和一个学位相关的一种学位论文的一个团体 @zh-hans

has degree committee member
status: Published
type: Property
lexical alias: degreeCommitteeMember.en
definition: Relates a work to a person who serves on a committee that supervises a thesis or dissertation of a student.
domain: C10001
toolkit label: degree committee member
toolkit definition: A person who serves on a committee that supervises a thesis or dissertation of a student.
sub property of: has creator person of work
toolkit label: miembro del comité de grado @es
toolkit definition: Una persona que sirve en un comité que supervisa una tesis de grado. @es
instruction number: 18.5
label: har medlem af kandidatudvalg @da
definition: Relaterer et værk til en person, som er medlem af et udvalg, der fører tilsyn med en studerendes speciale eller afhandling. @da
toolkit label: medlem af kandidatudvalg @da
toolkit definition: Person, som er medlem af et udvalg, der fører tilsyn med en studerendes speciale eller afhandling. @da
label: có thành viên uỷ ban văn bằng @vi
definition: Liên kết tác phẩm với cá nhân phục vụ trong uỷ ban giám sát luận văn hoặc luận án của sinh viên. @vi
toolkit label: thành viên uỷ ban văn bằng @vi
toolkit definition: Cá nhân phục vụ trong uỷ ban giám sát luận văn hoặc luận án của sinh viên. @vi
label: hat Mitglied eines Graduierungsausschusses @de
definition: Setzt ein Werk in Beziehung zu einer Person, die Mitglied eines Ausschusses ist, der eine Hochschulschrift von einer Studentin/einem Studenten beaufsichtigt. @de
toolkit label: Mitglied eines Graduierungsausschusses @de
toolkit definition: Eine Person, die Mitglied eines Ausschusses ist, der eine Hochschulschrift von einer Studentin/einem Studenten beaufsichtigt. @de
definition: Liittää teoksen henkilöön, joka osallistuu akateemisen opinnäytteen tai väitöskirjan tarkastuksen suorittavaan ryhmään. @fi
toolkit label: opinnäytteen tarkastaja @fi
toolkit definition: Henkilö, joka osallistuu akateemisen opinnäytteen tai väitöskirjan tarkastuksen suorittavaan ryhmään. @fi
toolkit label: medlem av bedømmelseskomité @no
toolkit definition: En person som deltar i en komité som veileder en students avhandling eller masteroppgave. @no
label: té com a membre d’un comitè acadèmic @ca
definition: Relaciona una obra amb una persona que forma part d’un comitè que supervisa una tesi o una dissertació d’un estudiant. @ca
toolkit label: membre d’un comitè acadèmic @ca
toolkit definition: Persona que forma part d’un comitè que supervisa una tesi o una dissertació d’un estudiant. @ca
label: a pour membre de comité de thèse @fr
definition: Met une œuvre en relation avec une personne qui siège à un comité supervisant une thèse ou un mémoire d’un étudiant. @fr
toolkit label: membre de comité de thèse @fr
toolkit definition: Personne qui siège à un comité supervisant une thèse ou un mémoire d’un étudiant. @fr
has element type: 2
label: έχει μέλος συμβουλευτικής επιτροπής πτυχίων @el
definition: Συνδέει ένα έργο με ένα φυσικό πρόσωπο, το οποίο συνιστά μέλος της επιτροπής εποπτείας της διδακτορικής διατριβής ενός φοιτητή. @el
toolkit label: μέλος συμβουλευτικής επιτροπής πτυχίων @el
toolkit definition: Ένα φυσικό πρόσωπο, το οποίο συνιστά μέλος της επιτροπής εποπτείας της διδακτορικής διατριβής ενός φοιτητή. @el
label: diplomabizottsági tagja a következő: @hu
definition: Hozzákapcsol egy művet egy személyhez, aki egy olyan bizottságban szolgál, amely felügyeli egy hallgató szakdolgozatát vagy disszertációját. @hu
toolkit label: diplomabizottsági tagja: @hu
toolkit definition: Egy személy, aki egy olyan bizottságban szolgál, amely felügyeli egy hallgató szakdolgozatát vagy disszertációját. @hu
label: opinnäytteen tarkastaja @fi
label: har medlem av bedømmelseskomité @no
definition: Relaterer et verk til en person som deltar i en komité som veileder en students avhandling eller masteroppgave. @no
label: heeft graad commissie-lid @nl
definition: Relateert een werk aan een persoon die zitting heeft in een commissie die een scriptie of proefschrift van een student begeleidt. @nl
toolkit label: graad commissie-lid @nl
toolkit definition: Een persoon die zitting heeft in een commissie die een scriptie of proefschrift van een student begeleidt. @nl
label: له عضو لجنة درجة علمية @ar
definition: يربط بين عمل وشخص يعمل في لجنة تشرف على أطروحة أو رسالة جامعية لطالب. @ar
toolkit label: له عضو لجنة درجة علمية @ar
toolkit definition: شخص يعمل في لجنة تشرف على أطروحة أو رسالة جامعية لطالب. @ar
label: kraadinõukogu liige @et
definition: Seostab teose isikuga, kes kuulub üliõpilase väitekirja ülevaatavasse nõukogusse. @et
toolkit label: kraadinõukogu liige @et
toolkit definition: Isik, kes kuulub üliõpilase väitekirja ülevaatavasse nõukogusse. @et
label: ha come membro di una commissione che assegna un titolo accademico @it
definition: Correla un’opera a una persona che partecipa a una commissione che supervisiona la tesi o la dissertazione di uno studente. @it
toolkit label: membro di una commissione che assegna un titolo accademico @it
toolkit definition: Persona che partecipa a una commissione che supervisiona la tesi o la dissertazione di uno studente. @it
label: grāda piešķīrējkomisijas dalībnieks @lv
definition: Sasaista darbu ar personu, kura ir komisijas dalībnieks un piešķir akadēmisko grādu. @lv
toolkit label: grāda piešķīrējkomisijas dalībnieks @lv
toolkit definition: Persona, kura ir komisijas dalībnieks un piešķir akadēmisko grādu. @lv
label: 有学位委员会成员 @zh-hans
definition: 将一种作品与在一个委员会中任职并指导一个学生论文的一个个人关联起来。 @zh-hans
toolkit label: 学位委员会成员 @zh-hans
toolkit definition: 在一个委员会中任职并指导一个学生论文的一个个人 @zh-hans
has subproperty: P10284
label: tez komitesi üyesi ile ilişkilidir @tr
definition: Bir eseri, bir öğrencinin tezini veya bitirme tezini denetleyen bir komitede görev yapan bir kişiyle ilişkilendirir. @tr
toolkit label: bölüm komitesi üyesi @tr
toolkit definition: Bir öğrencinin tezini veya doktora tezini denetleyen bir komitede görev yapan kişi. @tr

has year degree granted
status: Published
definition: Relates a work to a timespan during which an academic degree is conferred by a granting institution or faculty.
type: Property
domain: C10001
lexical alias: yearDegreeGranted.en
instruction number: 7.9.4
toolkit label: year degree granted
toolkit definition: A timespan during which an academic degree is conferred by a granting institution or faculty.
toolkit label: année d’obtention de grade universitaire @fr
toolkit definition: Laps de temps pendant lequel un grade universitaire est décerné par une institution ou une faculté conférant un grade universitaire. @fr
toolkit label: año de otorgación del grado @es
toolkit definition: El año calendario en el que una institución o cuerpo docente otorgante confiere un grado académico a un candidato. @es
label: har år när examen avlades @sv
toolkit label: år när examen avlades @sv
label: har årstal for tildeling af grad @da
definition: Relaterer et værk til en tidsperiode, hvor en akademisk grad tildeles af en tildelende institution eller fakultet. @da
toolkit label: årstal for tildeling af grad @da
toolkit definition: Tidsperiode, hvor en akademisk grad tildeles af en tildelende institution eller fakultet. @da
definition: Met une œuvre en relation avec un laps de temps pendant lequel un grade universitaire est décerné par une institution ou une faculté conférant un grade universitaire. @fr
label: có năm văn bằng được cấp @vi
definition: Liên kết tác phẩm với năm theo lịch mà viện hoặc khoa cấp văn bằng trao văn bằng học thuật cho ứng viên. @vi
toolkit label: năm văn bằng được cấp @vi
toolkit definition: Năm theo lịch mà viện hoặc khoa cấp văn bằng trao văn bằng học thuật cho ứng viên. @vi
label: hat Jahr, in dem ein akademischer Grad verliehen wird @de
definition: Setzt ein Werk in Beziehung zu einem Zeitraum, in dem ein akademischer Grad, der mit einer Hochschulschrift in Verbindung steht, von einer Institution oder Fakultät verliehen wird. @de
toolkit label: Jahr, in dem ein akademischer Grad verliehen wird @de
toolkit definition: Ein Zeitraum, in dem ein akademischer Grad, der mit einer Hochschulschrift in Verbindung steht, von einer Institution oder Fakultät verliehen wird. @de
label: a pour année d’obtention de grade universitaire @fr
definition: Liittää teoksen ajanjaksoon, jonka aikana laitos tai tiedekunta on myöntänyt akateemisen oppiarvon. @fi
toolkit label: oppiarvon myöntämisvuosi @fi
toolkit definition: Ajanjakso, jonka aikana laitos tai tiedekunta on myöntänyt akateemisen oppiarvon. @fi
toolkit label: årstall for tildeling av grad @no
toolkit definition: Et tidsrom hvor en tildelende institusjon eller et fakultet tildelte en akademisk grad. @no
label: té com a any d’obtenció d’un títol acadèmic @ca
definition: Relaciona una obra amb un interval de temps durant el qual una institució o una facultat concedeix un títol acadèmic. @ca
toolkit label: any d’obtenció d’un títol acadèmic @ca
toolkit definition: Interval de temps durant el qual una institució o una facultat concedeix un títol acadèmic. @ca
sub property of: has date of work
has element type: 2
label: έχει έτος χορήγησης πτυχίου @el
definition: Συνδέει ένα έργο με ένα ημερολογιακό έτος κατά το οποίο ένα ίδρυμα χορήγησης ή διδακτικό προσωπικό απονέμει ένα ανώτερου εκπαιδευτικού επιπέδου πτυχίο σε έναν υποψήφιο. @el
toolkit label: έτος χορήγησης πτυχίου @el
toolkit definition: Ένα ημερολογιακό έτος κατά το οποίο ένα ίδρυμα απονομής ή διδακτικό προσωπικό απονέμει ένα ανώτερου εκπαιδευτικού επιπέδου πτυχίο σε έναν υποψήφιο. @el
label: fokozatszerzési éve a következő: @hu
definition: Hozzákapcsol egy művet egy időtartamhoz, amely során egy adományozó intézmény vagy kar tudományos fokozatot adott egy jelöltnek. @hu
toolkit label: fokozatszerzési éve: @hu
toolkit definition: Egy időtartam, amely során egy adományozó intézmény vagy kar tudományos fokozatot adott egy jelöltnek. @hu
label: oppiarvon myöntämisvuosi @fi
label: har årstall for tildeling av grad @no
definition: Relaterer et verk til et tidsrom hvor en tildelende institusjon eller et fakultet tildelte en akademisk grad. @no
label: heeft jaar graad toegekend @nl
definition: Relateert een werk aan een tijdspanne gedurende welke een academische graad is toegekend door een verstrekkende instantie of faculteit. @nl
toolkit label: jaar graad toegekend @nl
toolkit definition: Een tijdspanne gedurende welke een academische graad is toegekend door een verstrekkende instantie of faculteit. @nl
label: له سنة منح درجة أكاديمية @ar
definition: يربط بين عمل وفترة زمنية تمنح خلالها مؤسسة مانحة أو هيئة تدريس درجة أكاديمية. @ar
toolkit label: سنة منح درجة أكاديمية @ar
toolkit definition: فترة زمنية تمنح خلالها مؤسسة مانحة أو هيئة تدريس درجة أكاديمية. @ar
label: kraadi kinnitamise aasta @et
definition: Seostab teose ajavahemikuga, millal kraadi andev asutus või teaduskond on kinnitanud akadeemilise kraadi. @et
toolkit label: kraadi kinnitamise aasta @et
toolkit definition: Ajavahemik, millal kraadi andev asutus või teaduskond on kinnitanud akadeemilise kraadi. @et
label: ha come anno di assegnazione del titolo accademico @it
definition: Correla un’opera a un intervallo di tempo durante il quale un titolo accademico è conferito da una da un’istituzione o facoltà conferente. @it
toolkit label: anno di assegnazione del titolo accademico @it
toolkit definition: Intervallo di tempo durante il quale un titolo accademico è conferito da una da un’istituzione o facoltà conferente. @it
label: grāda piešķiršanas gads @lv
definition: Sasaista darbu ar laikposmu, kurā zinātnisko/akadēmisko grādu kandidātam piešķir piešķīrēja iestāde vai fakultāte. @lv
toolkit label: grāda piešķiršanas gads @lv
toolkit definition: Laikposms, kurā zinātnisko/akadēmisko grādu kandidātam piešķir piešķīrēja iestāde vai fakultāte. @lv
label: 有学位授予年份 @zh-hans
definition: 将一种作品与一个授予机构或院系在期间授予一个学位的一个时间段关联起来。 @zh-hans
toolkit label: 学位授予年份 @zh-hans
toolkit definition: 一个授予机构或院系在期间授予一个学位的一个时间段 @zh-hans
has subproperty: P10215
label: akademik derecenin verildiği yıl ile ilişkilidir @tr
definition: Bir eseri, akademik derecenin bir kurum veya fakülte tarafından verildiği bir zaman aralığıyla ilişkilendirir. @tr
toolkit label: mezuniyet derecesinin verildiği yıl @tr
toolkit definition: Akademik derecenin bir kurum veya fakülte tarafından verildiği zaman aralığı. @tr

has director agent
status: Published
definition: Relates a work to an agent who is responsible for the general management and supervision of a filmed performance, a radio or television program, etc.
type: Property
domain: C10001
sub property of: has creator agent of work
lexical alias: directorAgent.en
toolkit label: director agent
toolkit definition: An agent who is responsible for the general management and supervision of a filmed performance, a radio or television program, etc.
toolkit label: agent réalisateur @fr
toolkit definition: Agent qui est responsable de la gestion et de la supervision générales d’une prestation filmée, d’une émission de radio ou de télévision, etc. @fr
toolkit label: director general @es
toolkit definition: Una persona, familia o entidad corporativa responsable de la dirección y supervisión general de una producción cinematográfica, un programa de radio o televisión, etc. @es
instruction number: 18.5
label: har agent, som er instruktør @da
definition: Relaterer et værk til en agent, som er ansvarlig for den generelle ledelse af- og tilsyn med en filmoptagelse, et radio- eller tv-program etc. @da
toolkit label: agent, som er instruktør @da
toolkit definition: Agent, som er ansvarlig for den generelle ledelse af- og tilsyn med en filmoptagelse, et radio- eller tv-program etc. @da
definition: Met une œuvre en relation avec un agent qui est responsable de la gestion et de la supervision générales d’une prestation filmée, d’une émission de radio ou de télévision, etc. @fr
label: có đạo diễn @vi
definition: Liên kết tác phẩm với tác nhân có trách nhiệm quản lý và giám sát chung về biểu diễm làm phim, chương trình truyền thanh hoặc truyền hình, v.v... @vi
toolkit label: đạo diễn @vi
toolkit definition: Tác nhân có trách nhiệm quản lý và giám sát chung về biểu diễm làm phim, chương trình truyền thanh hoặc truyền hình, v.v... @vi
label: hat Regisseurin/Regisseur (Akteur) @de
definition: Setzt ein Werk in Beziehung zu einem Akteur, der für das allgemeine Management und die Leitung einer verfilmten Darbietung, einer Hörfunk- oder Fernsehsendung und so weiter verantwortlich ist. @de
toolkit label: Regisseurin/Regisseur (Akteur) @de
toolkit definition: Ein Akteur, der für das allgemeine Management und die Leitung einer verfilmten Darbietung, einer Hörfunk- oder Fernsehsendung und so weiter verantwortlich ist. @de
label: a pour agent réalisateur @fr
definition: Liittää teoksen toimijaan, joka on vastuussa elokuvatun esityksen, radio- tai televisio-ohjelman tms. yleisestä johtamisesta. @fi
toolkit label: ohjaaja (toimija) @fi
toolkit definition: Toimija, joka on vastuussa elokuvatun esityksen, radio- tai televisio-ohjelman tms. yleisestä johtamisesta. @fi
toolkit label: regissør (agent) @no
toolkit definition: En agent som er ansvarlig for generell ledelse av en filmet forestilling, et radio- eller fjernsynsprogram, etc. @no
label: té com a agent realitzador @ca
definition: Relaciona una obra amb un agent que és responsable de la gestió general i la supervisió d’una actuació filmada, d’un programa radiofònic o de televisió, etc. @ca
toolkit label: agent realitzador @ca
toolkit definition: Agent que és responsable de la gestió general i la supervisió d’una actuació filmada, d’un programa radiofònic o de televisió, etc. @ca
has element type: 2
label: έχει σκηνοθέτη @el
definition: Συνδέει ένα έργο με έναν φορέα υπεύθυνο για τη γενική διαχείριση και εποπτεία μιας κινηματογραφικής παράστασης, ενός ραδιοφωνικού ή τηλεοπτικού προγράμματος κ.λπ. @el
toolkit label: σκηνοθέτης @el
toolkit definition: Ένας φορέας υπεύθυνος για τη γενική διαχείριση και εποπτεία μιας κινηματογραφικής παράστασης, ενός ραδιοφωνικού ή τηλεοπτικού προγράμματος κ.λπ. @el
label: rendező ágense a következő: @hu
definition: Hozzákapcsol egy művet egy ágenshez, amely felelős egy filmre vett előadás, egy rádió- vagy televízióműsor stb. általános irányításáért és felügyeletéért. @hu
toolkit label: rendező ágens: @hu
toolkit definition: Egy ágens, amely felelős egy filmre vett előadás, egy rádió- vagy televízióműsor stb. általános irányításáért és felügyeletéért. @hu
alternative label: director
alternative label: ohjaaja @fi
label: ohjaaja (toimija) @fi
label: har regissør (agent) @no
definition: Relaterer et verk til en agent som er ansvarlig for generell ledelse av en filmet forestilling, et radio- eller fjernsynsprogram, etc. @no
alternative label: regissør @no
label: heeft regisseur-actor @nl
definition: Relateert een werk aan een actor die verantwoordelijk is voor het algemene beheer en toezicht van een gefilmde voorstelling, een radio- of televisieprogramma etc. @nl
toolkit label: regisseur-actor @nl
toolkit definition: Een actor die verantwoordelijk is voor het algemene beheer en toezicht van een gefilmde voorstelling, een radio- of televisieprogramma etc. @nl
label: له وكيل مخرج @ar
definition: يربط بين عمل ووكيل مسئول عن الإدارة العامة والإشراف على أداء فيلمي، أو برنامج إذاعي أو تليفزيوني، إلخ. @ar
alternative label: مخرج @ar
toolkit label: وكيل مخرج @ar
toolkit definition: وكيل مسئول عن الإدارة العامة والإشراف على أداء فيلمي، أو برنامج إذاعي أو تليفزيوني، إلخ. @ar
alternative label: realitzador @ca
alternative label: instruktør @da
label: režissöör (tegija) @et
definition: Seostab teose tegijaga, kes vastutab filmitava etenduse, raadio- või telesaate vms üldise juhtimise ja juhendamise eest. @et
alternative label: režissöör @et
alternative label: lavastaja (tegija) @et
toolkit label: režissöör (tegija) @et
toolkit definition: Tegija, kes vastutab filmitava etenduse, raadio- või telesaate vms üldise juhtimise ja juhendamise eest. @et
alternative label: rendező: @hu
label: ha come regista agente @it
definition: Correla un'opera a un agente responsabile dell'organizzazione e supervisione generali di una rappresentazione cinematografica, programma radiofonico o televisivo, etc. @it
alternative label: regista @it
toolkit label: regista agente @it
toolkit definition: Agente responsabile dell'organizzazione e supervisione generali di una rappresentazione cinematografica, programma radiofonico o televisivo, etc. @it
alternative label: réalisateur @fr
label: režisors (aģents) @lv
definition: Sasaista darbu ar aģentu, kas ir atbildīgs par radio vai televīzijas raidījuma, uzfilmētā pasākuma u.tml. vispārējo vadību un uzraudzību. @lv
toolkit label: režisors (aģents) @lv
toolkit definition: Aģents, kas ir atbildīgs par radio vai televīzijas raidījuma, uzfilmētā pasākuma u.tml. vispārējo vadību un uzraudzību. @lv
toolkit label: 导演行为者 @zh-hans

has director agent of photography
status: Published
definition: Relates a work to an agent who captures images, either electronically or on film or video stock, and often selects and arranges the lighting.
type: Property
scope note: A director of photography for a movie is also called a chief cinematographer.
domain: C10001
sub property of: has creator agent of work
lexical alias: directorAgentOfPhotography.en
toolkit label: director agent of photography
toolkit definition: An agent who captures images, either electronically or on film or video stock, and often selects and arranges the lighting.
toolkit label: agent directeur de la photographie @fr
toolkit definition: Agent qui capte des images, de manière électronique ou bien sur film ou vidéo, et qui, souvent, choisit et dispose l’éclairage. @fr
toolkit label: director de fotografía @es
toolkit definition: Una persona, familia o entidad corporativa que captura imágenes, ya sea almacenadas electrónicamente o en película o vídeo, y con frecuencia selecciona y arregla la iluminación. @es
instruction number: 18.5
label: har agent, som er filmfotograf @da
definition: Relaterer et værk til en agent, som optager billeder, enten elektronisk eller på film eller video, og ofte også udvælger og arrangerer lyssætning. @da
scope note: Filmfotografen på en film kaldes også for en cheffotograf. @da
toolkit label: agent, som er filmfotograf @da
toolkit definition: Agent, som optager billeder, enten elektronisk eller på film eller video, og ofte også udvælger og arrangerer lyssætning. @da
definition: Met une œuvre en relation avec un agent qui capte des images, de manière électronique ou bien sur film ou vidéo, et qui, souvent, choisit et dispose l’éclairage. @fr
label: có giám đốc hình ảnh @vi
definition: Liên kết tác phẩm với tác nhân thu nạp hình ảnh, hoặc là bằng điện tử hoặc trên phim hoặc video, và thường lựa chọn, và bố trí chiếu sáng. @vi
scope note: Giám đố hình ảnh của phim điện ảnh cũng được gọi là nhà điện ảnh chính. @vi
toolkit label: giám đốc hình ảnh @vi
toolkit definition: Tác nhân thu nạp hình ảnh, hoặc là bằng điện tử hoặc trên phim hoặc video, và thường lựa chọn, và bố trí chiếu sáng. @vi
label: hat Kamerafrau/Kameramann (Akteur) @de
definition: Setzt ein Werk in Beziehung zu einem Akteur, der Bilder aufzeichnet, entweder elektronisch oder auf Film- oder Videomaterial, und häufig die Belichtung auswählt und arrangiert. @de
scope note: Eine Kamerafrau/Ein Kameramann für einen Film wird auch als "Bildregisseurin/Bildregisseur" bezeichnet. @de
toolkit label: Kamerafrau/Kameramann (Akteur) @de
toolkit definition: Ein Akteur, der Bilder aufzeichnet, entweder elektronisch oder auf Film- oder Videomaterial, und häufig die Belichtung auswählt und arrangiert. @de
label: a pour agent directeur de la photographie @fr
definition: Liittää teoksen toimijaan, joka tallentaa kuvia joko sähköisesti tai filmille tai videolle ja usein valitsee ja järjestää valaistuksen. @fi
toolkit label: kuvaaja (toimija) @fi
toolkit definition: Toimija, joka tallentaa kuvia joko sähköisesti tai filmille tai videolle ja usein valitsee ja järjestää valaistuksen. @fi
toolkit label: filmfotograf (agent) @no
toolkit definition: En agent som filmer levende bilder, enten elektronisk eller på film, og som ofte velger og arrangerer lyssetting. @no
label: té com a agent director de fotografia @ca
definition: Relaciona una obra amb un agent que captura imatges, ja sigui electrònicament o sobre pel·lícula o vídeo, i que sovint selecciona i arregla la il·luminació. @ca
scope note: Un director de fotografia d’una pel·lícula també s’anomena primer operador. @ca
toolkit label: agent director de fotografia @ca
toolkit definition: Agent que captura imatges, ja sigui electrònicament o sobre pel·lícula o vídeo, i que sovint selecciona i arregla la il·luminació. @ca
scope note: Un directeur de la photographie pour un film est également appelé un chef opérateur de prise de vue. @fr
has element type: 2
label: έχει διευθυντή φωτογραφίας @el
definition: Συνδέει ένα έργο με έναν φορέα ο οποίος συλλαμβάνει τις εικόνες είτε ηλεκτρονικά είτε με φιλμ είτε με βίντεο και συχνά επιλέγει και οργανώνει τον φωτισμό. @el
scope note: Ένας διευθυντής φωτογραφίας σε μια ταινία ονομάζεται επίσης επικεφαλής κινηματογραφιστής. @el
toolkit label: διευθυντής φωτογραφίας @el
toolkit definition: Ένας φορέας ο οποίος συλλαμβάνει τις εικόνες είτε ηλεκτρονικά είτε με φιλμ είτε με βίντεο και συχνά επιλέγει και οργανώνει τον φωτισμό. @el
label: operatőre a következő: @hu
definition: Hozzákapcsol egy művet egy ágenshez, amely elektronikusan, filmen vagy videóállományon képeket rögzít, és gyakran kiválasztja és elrendezi a megvilágítást. @hu
scope note: operatőr ágens: @hu
toolkit label: Egy ágens, amely elektronikusan, filmen vagy videóállományon képeket rögzít, és gyakran kiválasztja és elrendezi a megvilágítást. @hu
toolkit definition: operatőr: @hu
alternative label: director of photography
scope note: Elokuvan kuvaajaa kutsutaan myös elokuvaajaksi. @fi
alternative label: kuvaaja @fi
label: kuvaaja (toimija) @fi
label: har filmfotograf (agent) @no
definition: Relaterer et verk til en agent som filmer levende bilder, enten elektronisk eller på film, og som ofte velger og arrangerer lyssetting. @no
scope note: Filmfotografen for en film kalles også sjefsfotograf. @no
alternative label: filmfotograf @no
label: heeft cameraregisseur-actor @nl
definition: Relateert een werk aan een actor die beelden vastlegt, hetzij elektronisch hetzij op film- of videomateriaal, en vaak de belichting selecteert en arrangeert. @nl
scope note: Een cameraregisseur voor een film wordt ook hoofd-cinematograaf genoemd. @nl
toolkit label: cameraregisseur-actor @nl
toolkit definition: Een actor die beelden vastlegt, hetzij elektronisch hetzij op film- of videomateriaal, en vaak de belichting selecteert en arrangeert. @nl
label: له وكيل مدير تصوير @ar
definition: يربط بين عمل ووكيل يلتقط الصور، إما إلكترونيا وإما بفيلم أو تسجيلات فيديو، وغالبا ما يختار الإضاءة وينسقها. @ar
scope note: مدير تصوير لفيلم يسمى أيضا كبير المصورين السينمائيين. @ar
alternative label: مدير تصوير @ar
toolkit label: وكيل مدير تصوير @ar
toolkit definition: وكيل يلتقط صور، إما إلكترونيا وإما بفيلم أو تسجيلات فيديو، وغالبا ما يختار الإضاءة وينسقها. @ar
alternative label: director de fotografia @ca
label: operaator-lavastaja (tegija) @et
definition: Seostab teose tegijaga, kes jäädvustab pildi kas elektrooniliselt või filmi- või videolindile ning sageli valib ja seab üles valgustuse. @et
scope note: Filmi operaator-lavastajat nimetatakse inglise keeles sageli ka chief cinematographer. @et
alternative label: operaator-lavastaja @et
toolkit label: operaator-lavastaja (tegija) @et
toolkit definition: Tegija, kes jäädvustab pildi kas elektrooniliselt või filmi- või videolindile ning sageli valib ja seab üles valgustuse. @et

has director collective agent
status: Published
lexical alias: directorCollectiveAgent.en
definition: Relates a work to a collective agent who is responsible for the general management and supervision of a filmed performance, a radio or television program, etc.
toolkit label: director collective agent
toolkit definition: A collective agent who is responsible for the general management and supervision of a filmed performance, a radio or television program, etc.
type: Property
domain: C10001
has element type: 2
sub property of: has creator collective agent of work
sub property of: has director agent
label: ohjaaja (yhteistoimija) @fi
definition: Liittää teoksen yhteistoimijaan, joka on vastuussa elokuvatun esityksen, radio- tai televisio-ohjelman tms. yleisestä johtamisesta. @fi
toolkit label: ohjaaja (yhteistoimija) @fi
toolkit definition: Yhteistoimija, joka on vastuussa elokuvatun esityksen, radio- tai televisio-ohjelman tms. yleisestä johtamisesta. @fi
label: har regissør (kollektiv agent) @no
definition: Relaterer et verk til en kollektiv agent som er ansvarlig for de fleste forretningsmessige aspektene ved en produksjon for film eller fjernsyn, lydinnspilling, webcast, etc. @no
toolkit label: regissør (kollektiv agent) @no
toolkit definition: En kollektiv agent som er ansvarlig for de fleste forretningsmessige aspektene ved en produksjon for film eller fjernsyn, lydinnspilling, webcast, etc. @no
label: heeft regisseur-collectieve actor @nl
definition: Relateert een werk aan een corporatie die verantwoordelijk is voor het algemene beheer en toezicht van een gefilmde voorstelling, een radio- of televisieprogramma etc. @nl
toolkit label: regisseur-collectieve actor @nl
toolkit definition: Een corporatie die verantwoordelijk is voor het algemene beheer en toezicht van een gefilmde voorstelling, een radio- of televisieprogramma etc. @nl
label: له وكيل جماعي مخرج @ar
definition: يربط بين عمل ووكيل جماعي مسئول عن الإدارة العامة والإشراف على أداء مصور، أو برنامج إذاعي أو تليفزيوني، إلخ. @ar
toolkit label: وكيل جماعي مخرج @ar
toolkit definition: وكيل جماعي مسئول عن الإدارة العامة والإشراف على أداء مصور، أو برنامج إذاعي أو تليفزيوني، إلخ. @ar
label: té com a agent col·lectiu realitzador @ca
definition: Relaciona una obra amb un agent col·lectiu que és responsable de la gestió general i la supervisió d’una actuació filmada, un programa radiofònic o de televisió, etc. @ca
toolkit label: agent col·lectiu realitzador @ca
toolkit definition: Agent col·lectiu que és responsable de la gestió general i la supervisió d’una actuació filmada, un programa radiofònic o de televisió, etc. @ca
label: har kollektiv agent, som er instruktør @da
definition: Relaterer et værk til en kollektiv agent, som er ansvarlig for den generelle ledelse af- og tilsyn med en filmoptagelse, et radio- eller tv-program etc. @da
toolkit label: kollektiv agent, som er instruktør @da
toolkit definition: Kollektiv agent, som er ansvarlig for den generelle ledelse af- og tilsyn med en filmoptagelse, et radio- eller tv-program etc. @da
label: režissöör (kollektiiv) @et
definition: Seostab teose kollektiiviga, kes vastutab filmitava etenduse, raadio- või telesaate vms üldise juhtimise ja juhendamise eest. @et
alternative label: lavastaja (kollektiiv) @et
toolkit label: režissöör (kollektiiv) @et
toolkit definition: Kollektiiv, kes vastutab filmitava etenduse, raadio- või telesaate vms üldise juhtimise ja juhendamise eest. @et
label: hat Regisseurin/Regisseur (Gemeinschaftlicher Akteur) @de
definition: Setzt ein Werk in Beziehung zu einem gemeinschaftlichen Akteur, der für das allgemeine Management und die Leitung einer verfilmten Darbietung, einer Hörfunk- oder Fernsehsendung und so weiter verantwortlich ist. @de
toolkit label: Regisseurin/Regisseur (Gemeinschaftlicher Akteur) @de
toolkit definition: Ein gemeinschaftlicher Akteur, der für das allgemeine Management und die Leitung einer verfilmten Darbietung, einer Hörfunk- oder Fernsehsendung und so weiter verantwortlich ist. @de
label: rendező kollektív ágense a következő: @hu
definition: Hozzákapcsol egy művet egy kollektív ágenshez, amely felelős egy filmre vett előadás, egy rádió- vagy televízióműsor stb. általános irányításáért és felügyeletéért. @hu
toolkit label: rendező kollektív ágens: @hu
toolkit definition: Egy kollektív ágens, amely felelős egy filmre vett előadás, egy rádió- vagy televízióműsor stb. általános irányításáért és felügyeletéért. @hu
label: ha come regista agente collettivo @it
definition: Correla un'opera all'agente collettivo responsabile della gestione generale e della supervisione di un'interpretazione cinematografica, programma radiofonico o televisivo, etc. @it
toolkit label: regista agente collettivo @it
toolkit definition: Agente collettivo responsabile della gestione generale e della supervisione di un'interpretazione cinematografica, programma radiofonico o televisivo, etc. @it
label: a pour agent collectif réalisateur @fr
definition: Met une œuvre en relation avec un agent collectif qui est responsable de la gestion et de la supervision générales d’une prestation filmée, d’une émission de radio ou de télévision, etc. @fr
toolkit label: agent collectif réalisateur @fr
toolkit definition: Agent collectif qui est responsable de la gestion et de la supervision générales d’une prestation filmée, d’une émission de radio ou de télévision, etc. @fr
label: režisors (grupa) @lv
definition: Sasaista darbu ar grupu, kas ir atbildīga par radio vai televīzijas raidījuma, uzfilmētā pasākuma u.tml. vispārējo vadību un uzraudzību. @lv
toolkit label: režisors (grupa) @lv
toolkit definition: Grupa, kas ir atbildīga par radio vai televīzijas raidījuma, uzfilmētā pasākuma u.tml. vispārējo vadību un uzraudzību. @lv
label: 有导演集体行为者 @zh-hans
definition: 将一种作品与负责电影表演、广播或电视节目等的全面管理和监督的一个集体行为者关联起来。 @zh-hans
toolkit label: 导演集体行为者 @zh-hans
toolkit definition: 负责电影表演、广播或电视节目等的全面管理和监督的一个集体行为者 @zh-hans
has subproperty: has director corporate body
has subproperty: has director family
has subproperty: has film director collective agent
has subproperty: has radio director collective agent
has subproperty: has television director collective agent
has subproperty: P10502
label: yönetmen kolektif temsilcisi ile ilişkilidir @tr
definition: Bir eseri, filme alınmış bir performansın, bir radyo veya televizyon programının vb. genel yönetimi ve denetiminden sorumlu olan kolektif bir temsilci ile ilişkilendirir. @tr
toolkit label: yönetmen kolektif temsilcisi @tr
toolkit definition: Filme alınmış bir performansın, bir radyo veya televizyon programının vb. genel yönetimi ve denetiminden sorumlu kolektif bir temsilci. @tr

has director collective agent of photography
status: Published
lexical alias: directorCollectiveAgentOfPhotography.en
definition: Relates a work to a collective agent who captures images, either electronically or on film or video stock, and often selects and arranges the lighting.
toolkit label: director collective agent of photography
toolkit definition: A collective agent who captures images, either electronically or on film or video stock, and often selects and arranges the lighting.
type: Property
domain: C10001
has element type: 2
sub property of: has creator collective agent of work
sub property of: has director agent of photography
scope note: A director of photography for a movie is also called a chief cinematographer.
label: kuvaaja (yhteistoimija) @fi
definition: Liittää teoksen yhteistoimijaan, joka tallentaa kuvia joko sähköisesti tai filmille tai videolle ja usein valitsee ja järjestää valaistuksen. @fi
scope note: Elokuvan kuvaajaa kutsutaan myös elokuvaajaksi. @fi
toolkit label: kuvaaja (yhteistoimija) @fi
toolkit definition: Yhteistoimija, joka tallentaa kuvia joko sähköisesti tai filmille tai videolle ja usein valitsee ja järjestää valaistuksen. @fi
label: har filmfotograf (kollektiv agent) @no
definition: Relaterer et verk til en kollektiv agent som filmer levende bilder, enten elektronisk eller på film, og som ofte velger og arrangerer lyssetting. @no
scope note: Filmfotografen for en film kalles også sjefsfotograf. @no
toolkit label: filmfotograf (kollektiv agent) @no
toolkit definition: En kollektiv agent som filmer levende bilder, enten elektronisk eller på film, og som ofte velger og arrangerer lyssetting. @no
label: heeft cameraregisseur-collectieve actor @nl
definition: Relateert een werk aan een collectieve actor die beelden vastlegt, hetzij elektronisch hetzij op film- of videomateriaal, en vaak de belichting selecteert en arrangeert. @nl
scope note: Een cameraregisseur voor een film wordt ook hoofd-cinematograaf genoemd. @nl
toolkit label: cameraregisseur-collectieve actor @nl
toolkit definition: Een collectieve actor die beelden vastlegt, hetzij elektronisch hetzij op film- of videomateriaal, en vaak de belichting selecteert en arrangeert. @nl
label: له وكيل جماعي مدير تصوير @ar
definition: يربط بين عمل ووكيل جماعي يلتقط الصور، إما إلكترونيًا، أو على فيلم، أو مقاطع فيديو، وغالبًا ما يختار الإضاءة ويرتبها. @ar
scope note: مدير تصوير لفيلم يسمى أيضا كبير المصورين السينمائيين. @ar
toolkit label: وكيل جماعي مدير تصوير @ar
toolkit definition: وكيل جماعي يلتقط الصور، إما إلكترونيًا، أو على فيلم، أو مقاطع فيديو، وغالبًا ما يختار الإضاءة ويرتبها. @ar
label: té com a agent col·lectiu director de fotografia @ca
definition: Relaciona una obra amb un agent col·lectiu que captura imatges, ja sigui electrònicament o sobre pel·lícula o vídeo, i que sovint selecciona i arregla la il·luminació. @ca
scope note: Un director de fotografia d’una pel·lícula també s’anomena primer operador. @ca
toolkit label: agent col·lectiu director de fotografia @ca
toolkit definition: Agent col·lectiu que captura imatges, ja sigui electrònicament o sobre pel·lícula o vídeo, i que sovint selecciona i arregla la il·luminació. @ca
label: har kollektiv agent, som er filmfotograf @da
definition: Relaterer et værk til en kollektiv agent, som optager billeder, enten elektronisk eller på film eller video, og ofte også udvælger og arrangerer lyssætning. @da
scope note: Filmfotografen på en film kaldes også for en cheffotograf. @da
toolkit label: kollektiv agent, som er filmfotograf @da
toolkit definition: Kollektiv agent, som optager billeder, enten elektronisk eller på film eller video, og ofte også udvælger og arrangerer lyssætning. @da
label: operaator-lavastaja (kollektiiv) @et
definition: Seostab teose kollektiiviga, kes jäädvustab pildi kas elektrooniliselt või filmi- või videolindile ning sageli valib ja seab üles valgustuse. @et
scope note: Filmi operaator-lavastajat nimetatakse inglise keeles sageli ka chief cinematographer. @et
toolkit label: operaator-lavastaja (kollektiiv) @et
toolkit definition: Kollektiiv, kes jäädvustab pildi kas elektrooniliselt või filmi- või videolindile ning sageli valib ja seab üles valgustuse. @et
label: hat Kamerafrau/Kameramann (Gemeinschaftlicher Akteur) @de
definition: Setzt ein Werk in Beziehung zu einem gemeinschaftlichen Akteur, der Bilder aufzeichnet, entweder elektronisch oder auf Film- oder Videomaterial, und häufig die Belichtung auswählt und arrangiert. @de
scope note: Eine Kamerafrau/Ein Kameramann für einen Film wird auch als "Bildregisseurin/Bildregisseur" bezeichnet. @de
toolkit label: Kamerafrau/Kameramann (Gemeinschaftlicher Akteur) @de
toolkit definition: Ein gemeinschaftlicher Akteur, der Bilder aufzeichnet, entweder elektronisch oder auf Film- oder Videomaterial, und häufig die Belichtung auswählt und arrangiert. @de
label: operatőr kollektív ágense a következő: @hu
definition: Hozzákapcsol egy művet egy kollektív ágenshez, amely elektronikusan, filmen vagy videóállományon képeket rögzít, és gyakran kiválasztja és elrendezi a megvilágítást. @hu
scope note: Egy film operatőrét vezető operatőrnek is nevezik. @hu
toolkit label: operatőr kollektív ágens: @hu
toolkit definition: Egy kollektív ágens, amely elektronikusan, filmen vagy videóállományon képeket rögzít, és gyakran kiválasztja és elrendezi a megvilágítást. @hu
label: ha come direttore della fotografia agente collettivo @it
definition: Correla un'opera a un agente collettivo che cattura le immagini sia elettronicamente che su film o su video, e che spesso seleziona e sistema le luci. @it
scope note: Un direttore della fotografia in un film è detto anche capo operatore. @it
toolkit label: direttore della fotografia agente collettivo @it
toolkit definition: Agente collettivo che cattura le immagini, sia elettronicamente che su film o su video, e che spesso seleziona e sistema le luci. @it
label: a pour agent collectif directeur de la photographie @fr
definition: Met une œuvre en relation avec un agent collectif qui capte des images, de manière électronique ou bien sur film ou vidéo, et qui, souvent, choisit et dispose l’éclairage. @fr
scope note: Un directeur de la photographie pour un film est également appelé un chef opérateur de prise de vue. @fr
toolkit label: agent collectif directeur de la photographie @fr
toolkit definition: Agent collectif qui capte des images, de manière électronique ou bien sur film ou vidéo, et qui, souvent, choisit et dispose l’éclairage. @fr
label: kinooperators (grupa) @lv
definition: Sasaista darbu ar grupu, kas uzņem attēlus elektroniski vai uz filmas vai video, un bieži izvēlas un izvieto apgaismojumu. @lv
toolkit label: kinooperators (grupa) @lv
toolkit definition: Grupa, kas uzņem attēlus elektroniski vai uz filmas vai video, un bieži izvēlas un izvieto apgaismojumu. @lv
scope note: Kinooperatoru mēdz saukt arī par galveno operatoru. @lv
label: 有摄影指导集体行为者 @zh-hans
definition: 将一种作品与通过电子、胶片或视频存储方式摄录影像、且经常负责灯光的选择和布置的一个集体行为者关联起来。 @zh-hans
toolkit label: 摄影指导集体行为者 @zh-hans
toolkit definition: 通过电子、胶片或视频存储方式摄录影像、且经常负责灯光的选择和布置的一个集体行为者 @zh-hans
scope note: 电影的摄影指导也称总摄影师 @zh-hans
has subproperty: has director corporate body of photography
has subproperty: has director family of photography
has subproperty: P10462

has director corporate body
status: Published
lexical alias: directorCorporateBody.en
definition: Relates a work to a corporate body who is responsible for the general management and supervision of a filmed performance, a radio or television program, etc.
toolkit label: director corporate body
toolkit definition: A corporate body who is responsible for the general management and supervision of a filmed performance, a radio or television program, etc.
type: Property
domain: C10001
has element type: 2
sub property of: has creator corporate body of work
sub property of: has director collective agent
label: ohjaaja (yhteisö) @fi
definition: Liittää teoksen yhteisöön, joka on vastuussa elokuvatun esityksen, radio- tai televisio-ohjelman tms. yleisestä johtamisesta. @fi
toolkit label: ohjaaja (yhteisö) @fi
toolkit definition: Yhteisö, joka on vastuussa elokuvatun esityksen, radio- tai televisio-ohjelman tms. yleisestä johtamisesta. @fi
label: har regissør (korporasjon) @no
definition: Relaterer et verk til en korporasjon som er ansvarlig for de fleste forretningsmessige aspektene ved en produksjon for film eller fjernsyn, lydinnspilling, webcast, etc. @no
toolkit label: regissør (korporasjon) @no
toolkit definition: En korporasjon som er ansvarlig for de fleste forretningsmessige aspektene ved en produksjon for film eller fjernsyn, lydinnspilling, webcast, etc. @no
label: heeft regisseur-corporatie @nl
definition: Relateert een werk aan een familie die verantwoordelijk is voor het algemene beheer en toezicht van een gefilmde voorstelling, een radio- of televisieprogramma etc. @nl
toolkit label: regisseur-corporatie @nl
toolkit definition: Een familie die verantwoordelijk is voor het algemene beheer en toezicht van een gefilmde voorstelling, een radio- of televisieprogramma etc. @nl
label: له هيئة مخرجة @ar
definition: يربط بين عمل وهيئة مسئولة عن الإدارة العامة والإشراف على أداء مصور، أو برنامج إذاعي أو تليفزيوني، إلخ. @ar
toolkit label: هيئة مخرجة @ar
toolkit definition: هيئة مسئولة عن الإدارة العامة والإشراف على أداء مصور، أو برنامج إذاعي أو تليفزيوني، إلخ. @ar
label: té com a entitat corporativa realitzadora @ca
definition: Relaciona una obra amb una entitat corporativa que és responsable de la gestió general i la supervisió d’una actuació filmada, d’un programa radiofònic o de televisió, etc. @ca
toolkit label: entitat corporativa realitzadora @ca
toolkit definition: Entitat corporativa que és responsable de la gestió general i la supervisió d’una actuació filmada, d’un programa radiofònic o de televisió, etc. @ca
label: har korporation, som er instruktør @da
definition: Relaterer et værk til en korporation, som er ansvarlig for den generelle ledelse af- og tilsyn med en filmoptagelse, et radio- eller tv-program etc. @da
toolkit label: korporation, som er instruktør @da
toolkit definition: Korporation, som er ansvarlig for den generelle ledelse af- og tilsyn med en filmoptagelse, et radio- eller tv-program etc. @da
label: režissöör (asutus) @et
definition: Seostab teose asutusega, kes vastutab filmitava etenduse, raadio- või telesaate vms üldise juhtimise ja juhendamise eest. @et
alternative label: lavastaja (asutus) @et
toolkit label: režissöör (asutus) @et
toolkit definition: Asutus, kes vastutab filmitava etenduse, raadio- või telesaate vms üldise juhtimise ja juhendamise eest. @et
label: hat Regisseurin/Regisseur (Körperschaft) @de
definition: Setzt ein Werk in Beziehung zu einer Körperschaft, die für das allgemeine Management und die Leitung einer verfilmten Darbietung, einer Hörfunk- oder Fernsehsendung und so weiter verantwortlich ist. @de
toolkit label: Regisseurin/Regisseur (Körperschaft) @de
toolkit definition: Eine Körperschaft, die für das allgemeine Management und die Leitung einer verfilmten Darbietung, einer Hörfunk- oder Fernsehsendung und so weiter verantwortlich ist. @de
label: rendező testülete a következő: @hu
definition: Hozzákapcsol egy művet egy testülethez, amely felelős egy filmre vett előadás, egy rádió- vagy televízióműsor stb. általános irányításáért és felügyeletéért. @hu
toolkit label: rendező testület: @hu
toolkit definition: Egy testület, amely felelős egy filmre vett előadás, egy rádió- vagy televízióműsor stb. általános irányításáért és felügyeletéért. @hu
label: ha come regista ente @it
definition: Correla un'opera a un ente responsabile della gestione generale e della supervisione di un'interpretazione cinematografica, programma radiofonico o televisivo, etc. @it
toolkit label: regista ente @it
toolkit definition: Ente responsabile della gestione generale e della supervisione di un'interpretazione cinematografica, programma radiofonico o televisivo, etc. @it
label: a pour collectivité réalisatrice @fr
definition: Met une œuvre en relation avec une collectivité qui est responsable de la gestion et de la supervision générales d’une prestation filmée, d’une émission de radio ou de télévision, etc. @fr
toolkit label: collectivité réalisatrice @fr
toolkit definition: Collectivité qui est responsable de la gestion et de la supervision générales d’une prestation filmée, d’une émission de radio ou de télévision, etc. @fr
label: režisors (institūcija) @lv
definition: Sasaista darbu ar institūciju, kas ir atbildīga par radio vai televīzijas raidījuma, uzfilmētā pasākuma u.tml. vispārējo vadību un uzraudzību. @lv
toolkit label: režisors (institūcija) @lv
toolkit definition: Institūcija, kas ir atbildīga par radio vai televīzijas raidījuma, uzfilmētā pasākuma u.tml. vispārējo vadību un uzraudzību. @lv
label: 有导演团体 @zh-hans
definition: 将一种作品与负责电影表演、广播或电视节目等的全面管理和监督的一个团体关联起来。 @zh-hans
toolkit label: 导演团体 @zh-hans
toolkit definition: 负责电影表演、广播或电视节目等的全面管理和监督的一个团体 @zh-hans
has subproperty: has film director corporate body
has subproperty: has radio director corporate body
has subproperty: has television director corporate body
has subproperty: P10549
label: yönetmen tüzel kişisi ile ilişkilidir @tr
definition: Bir eseri, filme alınmış bir performansın, bir radyo veya televizyon programının vb. genel yönetimi ve denetiminden sorumlu olan tüzel kişi ile ilişkilendirir. @tr
toolkit label: yönetmen tüzel kişisi @tr
toolkit definition: Filme alınmış bir performansın, bir radyo veya televizyon programının vb. genel yönetim ve denetiminden sorumlu olan tüzel kişi. @tr

has director corporate body of photography
status: Published
lexical alias: directorCorporateBodyOfPhotography.en
definition: Relates a work to a corporate body who captures images, either electronically or on film or video stock, and often selects and arranges the lighting.
toolkit label: director corporate body of photography
toolkit definition: A corporate body who captures images, either electronically or on film or video stock, and often selects and arranges the lighting.
type: Property
domain: C10001
has element type: 2
sub property of: has creator corporate body of work
sub property of: has director collective agent of photography
scope note: A director of photography for a movie is also called a chief cinematographer.
label: kuvaaja (yhteisö) @fi
definition: Liittää teoksen yhteisöön, joka tallentaa kuvia joko sähköisesti tai filmille tai videolle ja usein valitsee ja järjestää valaistuksen. @fi
scope note: Elokuvan kuvaajaa kutsutaan myös elokuvaajaksi. @fi
toolkit label: kuvaaja (yhteisö) @fi
toolkit definition: Yhteisö, joka tallentaa kuvia joko sähköisesti tai filmille tai videolle ja usein valitsee ja järjestää valaistuksen. @fi
label: har filmfotograf (korporasjon) @no
definition: Relaterer et verk til en korporasjon som filmer levende bilder, enten elektronisk eller på film, og som ofte velger og arrangerer lyssetting. @no
scope note: Filmfotografen for en film kalles også sjefsfotograf. @no
toolkit label: filmfotograf (korporasjon) @no
toolkit definition: En korporasjon som filmer levende bilder, enten elektronisk eller på film, og som ofte velger og arrangerer lyssetting. @no
label: heeft cameraregisseur-corporatie @nl
definition: Relateert een werk aan een corporatie die beelden vastlegt, hetzij elektronisch hetzij op film- of videomateriaal, en vaak de belichting selecteert en arrangeert. @nl
scope note: Een cameraregisseur voor een film wordt ook hoofd-cinematograaf genoemd. @nl
toolkit label: cameraregisseur-corporatie @nl
toolkit definition: Een corporatie die beelden vastlegt, hetzij elektronisch hetzij op film- of videomateriaal, en vaak de belichting selecteert en arrangeert. @nl
label: له هيئة مديرة تصوير @ar
definition: يربط بين عمل وهيئة تلتقط الصور، إما إلكترونيًا أو على فيلم أو مقاطع فيديو، وغالبًا ما تختار الإضاءة وترتبها. @ar
scope note: مدير تصوير لفيلم يسمى أيضا كبير المصورين السينمائيين. @ar
toolkit label: هيئة مديرة تصوير @ar
toolkit definition: هيئة تلتقط الصور، إما إلكترونيًا أو على فيلم أو مقاطع فيديو، وغالبًا ما تختار الإضاءة وترتبها. @ar
label: té com a entitat corporativa directora de fotografia @ca
definition: Relaciona una obra amb una entitat corporativa que captura imatges, ja sigui electrònicament o sobre pel·lícula o vídeo, i que sovint selecciona i arregla la il·luminació. @ca
scope note: Un director de fotografia d’una pel·lícula també s’anomena primer operador. @ca
toolkit label: entitat corporativa directora de fotografia @ca
toolkit definition: Entitat corporativa que captura imatges, ja sigui electrònicament o sobre pel·lícula o vídeo, i que sovint selecciona i arregla la il·luminació. @ca
label: har korporation, som er filmfotograf @da
definition: Relaterer et værk til en korporation, som optager billeder, enten elektronisk eller på film eller video, og ofte også udvælger og arrangerer lyssætning. @da
scope note: Filmfotografen på en film kaldes også for en cheffotograf. @da
toolkit label: korporation, som er filmfotograf @da
toolkit definition: Korporation, som optager billeder, enten elektronisk eller på film eller video, og ofte også udvælger og arrangerer lyssætning. @da
label: operaator-lavastaja (asutus) @et
definition: Seostab teose asutusega, kes jäädvustab pildi kas elektrooniliselt või filmi- või videolindile ning sageli valib ja seab üles valgustuse. @et
scope note: Filmi operaator-lavastajat nimetatakse inglise keeles sageli ka chief cinematographer. @et
toolkit label: operaator-lavastaja (asutus) @et
toolkit definition: Asutus, kes jäädvustab pildi kas elektrooniliselt või filmi- või videolindile ning sageli valib ja seab üles valgustuse. @et
label: hat Kamerafrau/Kameramann (Körperschaft) @de
definition: Setzt ein Werk in Beziehung zu einer Körperschaft, die Bilder aufzeichnet, entweder elektronisch oder auf Film- oder Videomaterial, und häufig die Belichtung auswählt und arrangiert. @de
scope note: Eine Kamerafrau/Ein Kameramann für einen Film wird auch als "Bildregisseurin/Bildregisseur" bezeichnet. @de
toolkit label: Kamerafrau/Kameramann (Körperschaft) @de
toolkit definition: Eine Körperschaft, die Bilder aufzeichnet, entweder elektronisch oder auf Film- oder Videomaterial, und häufig die Belichtung auswählt und arrangiert. @de
label: operatőr testülete a következő: @hu
definition: Hozzákapcsol egy művet egy testülethez, amely elektronikusan, filmen vagy videóállományon képeket rögzít, és gyakran kiválasztja és elrendezi a megvilágítást. @hu
scope note: Egy film operatőrét vezető operatőrnek is nevezik. @hu
toolkit label: operatőr testület: @hu
toolkit definition: Egy testület, amely elektronikusan, filmen vagy videóállományon képeket rögzít, és gyakran kiválasztja és elrendezi a megvilágítást. @hu
label: ha come direttore della fotografia ente @it
definition: Correla un'opera a un ente che cattura le immagini, sia elettronicamente che su film o su video, e che spesso seleziona e sistema le luci. @it
scope note: Un direttore della fotografia in un film è detto anche capo operatore. @it
toolkit label: direttore della fotografia ente @it
toolkit definition: Ente che cattura le immagini, sia elettronicamente che su film o su video, e che spesso seleziona e sistema le luci. @it
label: a pour collectivité directrice de la photographie @fr
definition: Met une œuvre en relation avec une collectivité qui capte des images, de manière électronique ou bien sur film ou vidéo, et qui, souvent, choisit et dispose l’éclairage. @fr
scope note: Un directeur de la photographie pour un film est également appelé un chef opérateur de prise de vue. @fr
toolkit label: collectivité directrice de la photographie @fr
toolkit definition: Collectivité qui capte des images, de manière électronique ou bien sur film ou vidéo, et qui, souvent, choisit et dispose l’éclairage. @fr
label: kinooperators (institūcija) @lv
definition: Sasaista darbu ar institūciju, kas uzņem attēlus elektroniski vai uz filmas vai video, un bieži izvēlas un izvieto apgaismojumu. @lv
toolkit label: kinooperators (institūcija) @lv
toolkit definition: Institūcija, kas uzņem attēlus elektroniski vai uz filmas vai video, un bieži izvēlas un izvieto apgaismojumu. @lv
scope note: Kinooperatoru mēdz saukt arī par galveno operatoru. @lv
label: 有摄影指导团体 @zh-hans
definition: 将一种作品与通过电子、胶片或视频存储方式摄录影像、且经常负责灯光的选择和布置的一个团体关联起来。 @zh-hans
toolkit label: 摄影指导团体 @zh-hans
toolkit definition: 通过电子、胶片或视频存储方式摄录影像、且经常负责灯光的选择和布置的一个团体 @zh-hans
scope note: 电影的摄影指导也称总摄影师 @zh-hans
has subproperty: P10509
label: görüntü yönetmeni tüzel kişisi ile ilişkilidir @tr
definition: Bir eseri, elektronik olarak veya film ya da video stoğu üzerinde görüntü yakalayan ve genellikle ışıklandırmayı seçen ve düzenleyen tüzel kişi ile ilişkilendirir. @tr

has director family
status: Published
lexical alias: directorFamily.en
definition: Relates a work to a family who is responsible for the general management and supervision of a filmed performance, a radio or television program, etc.
toolkit label: director family
toolkit definition: A family who is responsible for the general management and supervision of a filmed performance, a radio or television program, etc.
type: Property
domain: C10001
has element type: 2
sub property of: has creator family of work
sub property of: has director collective agent
label: ohjaaja (suku) @fi
definition: Liittää teoksen sukuun, joka on vastuussa elokuvatun esityksen, radio- tai televisio-ohjelman tms. yleisestä johtamisesta. @fi
toolkit label: ohjaaja (suku) @fi
toolkit definition: Suku, joka on vastuussa elokuvatun esityksen, radio- tai televisio-ohjelman tms. yleisestä johtamisesta. @fi
label: har regissør (familie) @no
definition: Relaterer et verk til en familie som er ansvarlig for generell ledelse av en filmet forestilling, et radio- eller fjernsynsprogram, etc. @no
toolkit label: regissør (familie) @no
toolkit definition: En familie som er ansvarlig for generell ledelse av en filmet forestilling, et radio- eller fjernsynsprogram, etc. @no
label: heeft regisseur-familie @nl
definition: Relateert een werk aan een collectieve actor die verantwoordelijk is voor het algemene beheer en toezicht van een gefilmde voorstelling, een radio- of televisieprogramma etc. @nl
toolkit label: regisseur-familie @nl
toolkit definition: Een collectieve actor die verantwoordelijk is voor het algemene beheer en toezicht van een gefilmde voorstelling, een radio- of televisieprogramma etc. @nl
label: له عائلة مخرجة @ar
definition: يربط بين عمل وعائلة مسئولة عن الإدارة العامة والإشراف على أداء مصور، أو برنامج إذاعي، أو تليفزيوني، إلخ. @ar
toolkit label: عائلة مخرجة @ar
toolkit definition: عائلة مسئولة عن الإدارة العامة والإشراف على أداء مصور، أو برنامج إذاعي، أو تليفزيوني، إلخ. @ar
label: té com a família realitzadora @ca
definition: Relaciona una obra amb una família que és responsable de la gestió general i la supervisió d’una actuació filmada, d’un programa radiofònic o de televisió, etc. @ca
toolkit label: família realitzadora @ca
toolkit definition: Família que és responsable de la gestió general i la supervisió d’una actuació filmada, d’un programa radiofònic o de televisió, etc. @ca
label: har familie, som er instruktør @da
definition: Relaterer et værk til en familie, som er ansvarlig for den generelle ledelse af- og tilsyn med en filmoptagelse, et radio- eller tv-program etc. @da
toolkit label: familie, som er instruktør @da
toolkit definition: Familie, som er ansvarlig for den generelle ledelse af- og tilsyn med en filmoptagelse, et radio- eller tv-program etc. @da
label: režissöör (perekond) @et
definition: Seostab teose perekonnaga, kes vastutab filmitava etenduse, raadio- või telesaate vms üldise juhtimise ja juhendamise eest. @et
alternative label: lavastaja (perekond) @et
toolkit label: režissöör (perekond) @et
toolkit definition: Perekond, kes vastutab filmitava etenduse, raadio- või telesaate vms üldise juhtimise ja juhendamise eest. @et
label: hat Regisseurin/Regisseur (Familie) @de
definition: Setzt ein Werk in Beziehung zu einer Familie, die für das allgemeine Management und die Leitung einer verfilmten Darbietung, einer Hörfunk- oder Fernsehsendung und so weiter verantwortlich ist. @de
toolkit label: Regisseurin/Regisseur (Familie) @de
toolkit definition: Eine Familie, die für das allgemeine Management und die Leitung einer verfilmten Darbietung, einer Hörfunk- oder Fernsehsendung und so weiter verantwortlich ist. @de
label: rendező családja a következő: @hu
definition: Hozzákapcsol egy művet egy családhoz, amely felelős egy filmre vett előadás, egy rádió- vagy televízióműsor stb. általános irányításáért és felügyeletéért. @hu
toolkit label: rendező család: @hu
toolkit definition: Egy család, amely felelős egy filmre vett előadás, egy rádió- vagy televízióműsor stb. általános irányításáért és felügyeletéért. @hu
label: ha come regista famiglia @it
definition: Correla un'opera alla famiglia responsabile della gestione generale e della supervisione di un'interpretazione cinematografica, programma radiofonico o televisivo, etc. @it
toolkit label: regista famiglia @it
toolkit definition: Famiglia responsabile della gestione generale e della supervisione di un'interpretazione cinematografica, programma radiofonico o televisivo, etc. @it
label: a pour famille réalisatrice @fr
definition: Met une œuvre en relation avec une famille qui est responsable de la gestion et de la supervision générales d’une prestation filmée, d’une émission de radio ou de télévision, etc. @fr
toolkit label: famille réalisatrice @fr
toolkit definition: Famille qui est responsable de la gestion et de la supervision générales d’une prestation filmée, d’une émission de radio ou de télévision, etc. @fr
label: režisors (dzimta/ģimene) @lv
definition: Sasaista darbu ar dzimtu/ģimeni, kas ir atbildīga par radio vai televīzijas raidījuma, uzfilmētā pasākuma u.tml. vispārējo vadību un uzraudzību. @lv
toolkit label: režisors (dzimta/ģimene) @lv
toolkit definition: Dzimta/ģimene, kas ir atbildīga par radio vai televīzijas raidījuma, uzfilmētā pasākuma u.tml. vispārējo vadību un uzraudzību. @lv
label: 有导演家族 @zh-hans
definition: 将一种作品与负责电影表演、广播或电视节目等的全面管理和监督的一个家族关联起来。 @zh-hans
toolkit label: 导演家族 @zh-hans
toolkit definition: 负责电影表演、广播或电视节目等的全面管理和监督的一个家族 @zh-hans
has subproperty: has film director family
has subproperty: has radio director family
has subproperty: has television director family
has subproperty: P10596
label: yönetmen ailesi ile ilişkilidir @tr
definition: Bir eseri, filme alınmış bir performansın, bir radyo veya televizyon programının vb. genel yönetimi ve denetiminden sorumlu olan bir aileyle ilişkilendirir. @tr
toolkit label: yönetmen ailesi @tr
toolkit definition: Filme alınmış bir gösterinin, bir radyo veya televizyon programının vb. genel yönetim ve denetiminden sorumlu olan bir aile. @tr

has director family of photography
status: Published
lexical alias: directorFamilyOfPhotography.en
definition: Relates a work to a family who captures images, either electronically or on film or video stock, and often selects and arranges the lighting.
toolkit label: director family of photography
toolkit definition: A family who captures images, either electronically or on film or video stock, and often selects and arranges the lighting.
type: Property
domain: C10001
has element type: 2
sub property of: has creator family of work
sub property of: has director collective agent of photography
scope note: A director of photography for a movie is also called a chief cinematographer.
label: kuvaaja (suku) @fi
definition: Liittää teoksen sukuun, joka tallentaa kuvia joko sähköisesti tai filmille tai videolle ja usein valitsee ja järjestää valaistuksen. @fi
scope note: Elokuvan kuvaajaa kutsutaan myös elokuvaajaksi. @fi
toolkit label: kuvaaja (suku) @fi
toolkit definition: Suku, joka tallentaa kuvia joko sähköisesti tai filmille tai videolle ja usein valitsee ja järjestää valaistuksen. @fi
label: har filmfotograf (familie) @no
definition: Relaterer et verk til en familie som filmer levende bilder, enten elektronisk eller på film, og som ofte velger og arrangerer lyssetting. @no
scope note: Filmfotografen for en film kalles også sjefsfotograf. @no
toolkit label: filmfotograf (familie) @no
toolkit definition: En familie som filmer levende bilder, enten elektronisk eller på film, og som ofte velger og arrangerer lyssetting. @no
label: heeft cameraregisseur-familie @nl
definition: Relateert een werk aan een familie die beelden vastlegt, hetzij elektronisch hetzij op film- of videomateriaal, en vaak de belichting selecteert en arrangeert. @nl
scope note: Een cameraregisseur voor een film wordt ook hoofd-cinematograaf genoemd. @nl
toolkit label: cameraregisseur-familie @nl
toolkit definition: Een familie die beelden vastlegt, hetzij elektronisch hetzij op film- of videomateriaal, en vaak de belichting selecteert en arrangeert. @nl
label: له عائلة مديرة تصوير @ar
definition: يربط بين عمل وعائلة تلتقط الصور، إما إلكترونيًا، أو على فيلم، أو مقاطع فيديو، وغالبًا ما تختار الإضاءة وترتبها. @ar
scope note: مدير تصوير لفيلم يسمى أيضا كبير المصورين السينمائيين. @ar
toolkit label: عائلة مديرة تصوير @ar
toolkit definition: عائلة تلتقط الصور، إما إلكترونيًا، أو على فيلم، أو مقاطع فيديو، وغالبًا ما تختار الإضاءة وترتبها. @ar
label: té com a família directora de fotografia @ca
definition: Relaciona una obra amb una família que captura imatges, ja sigui electrònicament o sobre pel·lícula o vídeo, i que sovint selecciona i arregla la il·luminació. @ca
scope note: Un director de fotografia d’una pel·lícula també s’anomena primer operador. @ca
toolkit label: família directora de fotografia @ca
toolkit definition: Família que captura imatges, ja sigui electrònicament o sobre pel·lícula o vídeo, i que sovint selecciona i arregla la il·luminació. @ca
label: har familie, som er filmfotograf @da
definition: Relaterer et værk til en familie, som optager billeder, enten elektronisk eller på film eller video, og ofte også udvælger og arrangerer lyssætning. @da
scope note: Filmfotografen på en film kaldes også for en cheffotograf. @da
toolkit label: familie, som er filmfotograf @da
toolkit definition: Familie, som optager billeder, enten elektronisk eller på film eller video, og ofte også udvælger og arrangerer lyssætning. @da
label: operaator-lavastaja (perekond) @et
definition: Seostab teose perekonnaga, kes jäädvustab pildi kas elektrooniliselt või filmi- või videolindile ning sageli valib ja seab üles valgustuse. @et
scope note: Filmi operaator-lavastajat nimetatakse inglise keeles sageli ka chief cinematographer. @et
toolkit label: operaator-lavastaja (perekond) @et
toolkit definition: Perekond, kes jäädvustab pildi kas elektrooniliselt või filmi- või videolindile ning sageli valib ja seab üles valgustuse. @et
label: hat Kamerafrau/Kameramann (Familie) @de
definition: Setzt ein Werk in Beziehung zu einer Familie, die Bilder aufzeichnet, entweder elektronisch oder auf Film- oder Videomaterial, und häufig die Belichtung auswählt und arrangiert. @de
scope note: Eine Kamerafrau/Ein Kameramann für einen Film wird auch als "Bildregisseurin/Bildregisseur" bezeichnet. @de
toolkit label: Kamerafrau/Kameramann (Familie) @de
toolkit definition: Eine Familie, die Bilder aufzeichnet, entweder elektronisch oder auf Film- oder Videomaterial, und häufig die Belichtung auswählt und arrangiert. @de
label: operatőr családja a következő: @hu
definition: Hozzákapcsol egy művet egy családhoz, amely elektronikusan, filmen vagy videóállományon képeket rögzít, és gyakran kiválasztja és elrendezi a megvilágítást. @hu
scope note: Egy film operatőrét vezető operatőrnek is nevezik. @hu
toolkit label: operatőr család: @hu
toolkit definition: Egy család, amely elektronikusan, filmen vagy videóállományon képeket rögzít, és gyakran kiválasztja és elrendezi a megvilágítást. @hu
label: ha come direttore famiglia della fotografia @it
definition: Correla un'opera a una famiglia che cattura le immagini, sia elettronicamente che su film o su video, e che spesso seleziona e sistema le luci. @it
scope note: Un direttore della fotografia in un film è detto anche capo operatore. @it
toolkit label: direttore famiglia della fotografia @it
toolkit definition: Famiglia che cattura le immagini, sia elettronicamente che su film o su video, e che spesso seleziona e sistema le luci. @it
label: a pour famille directrice de la photographie @fr
definition: Met une œuvre en relation avec une famille qui capte des images, de manière électronique ou bien sur film ou vidéo, et qui, souvent, choisit et dispose l’éclairage. @fr
scope note: Un directeur de la photographie pour un film est également appelé un chef opérateur de prise de vue. @fr
toolkit label: famille directrice de la photographie @fr
toolkit definition: Famille qui capte des images, de manière électronique ou bien sur film ou vidéo, et qui, souvent, choisit et dispose l’éclairage. @fr
label: kinooperators (dzimta/ģimene) @lv
definition: Sasaista darbu ar dzimtu/ģimeni, kas uzņem attēlus elektroniski vai uz filmas vai video, un bieži izvēlas un izvieto apgaismojumu. @lv
toolkit label: kinooperators (dzimta/ģimene) @lv
toolkit definition: Dzimta/ģimene, kas uzņem attēlus elektroniski vai uz filmas vai video, un bieži izvēlas un izvieto apgaismojumu. @lv
scope note: Kinooperatoru mēdz saukt arī par galveno operatoru. @lv
label: 有摄影指导家族 @zh-hans
definition: 将一种作品与通过电子、胶片或视频存储方式摄录影像、且经常负责灯光的选择和布置的一个家族关联起来。 @zh-hans
toolkit label: 摄影指导家族 @zh-hans
toolkit definition: 通过电子、胶片或视频存储方式摄录影像、且经常负责灯光的选择和布置的一个家族 @zh-hans
scope note: 电影的摄影指导也称总摄影师 @zh-hans
has subproperty: P10556
label: görüntü yönetmeni ailesi ile ilişkilidir @tr
definition: Bir eseri, elektronik olarak veya film ya da video stoğu üzerinde görüntü kaydeden ve genellikle ışıklandırmayı seçip düzenleyen bir aileyle ilişkilendirir. @tr

has director person
status: Published
lexical alias: directorPerson.en
definition: Relates a work to a person who is responsible for the general management and supervision of a filmed performance, a radio or television program, etc.
toolkit label: director person
toolkit definition: A person who is responsible for the general management and supervision of a filmed performance, a radio or television program, etc.
type: Property
domain: C10001
has element type: 2
sub property of: has creator person of work
sub property of: has director agent
label: ohjaaja (henkilö) @fi
definition: Liittää teoksen henkilöön, joka on vastuussa elokuvatun esityksen, radio- tai televisio-ohjelman tms. yleisestä johtamisesta. @fi
toolkit label: ohjaaja (henkilö) @fi
toolkit definition: Henkilö, joka on vastuussa elokuvatun esityksen, radio- tai televisio-ohjelman tms. yleisestä johtamisesta. @fi
label: har regissør (person) @no
definition: Relaterer et verk til en person som er ansvarlig for generell ledelse av en filmet forestilling, et radio- eller fjernsynsprogram, etc. @no
toolkit label: regissør (person) @no
toolkit definition: En person som er ansvarlig for generell ledelse av en filmet forestilling, et radio- eller fjernsynsprogram, etc. @no
label: heeft regisseur-person @nl
definition: Relateert een werk aan een persoon die verantwoordelijk is voor het algemene beheer en toezicht van een gefilmde voorstelling, een radio- of televisieprogramma etc. @nl
toolkit label: regisseur-person @nl
toolkit definition: Een persoon die verantwoordelijk is voor het algemene beheer en toezicht van een gefilmde voorstelling, een radio- of televisieprogramma etc. @nl
label: له شخص مخرج @ar
definition: يربط بين عمل وشخص مسئول عن الإدارة العامة والإشراف على أداء مصور، أو برنامج إذاعي أو تليفزيوني، إلخ. @ar
toolkit label: شخص مخرج @ar
toolkit definition: شخص يكون مسئولاً عن الإدارة العامة والإشراف على أداء مصور، أو برنامج إذاعي أو تليفزيوني، إلخ. @ar
label: té com a persona realitzadora @ca
definition: Relaciona una obra amb una persona que és responsable de la gestió general i la supervisió d’una actuació filmada, un programa radiofònic o de televisió, etc. @ca
toolkit label: persona realitzadora @ca
toolkit definition: Persona que és responsable de la gestió general i la supervisió d’una actuació filmada, un programa radiofònic o de televisió, etc. @ca
label: har person, som er instruktør @da
definition: Relaterer et værk til en person, som er ansvarlig for den generelle ledelse af- og tilsyn med en filmoptagelse, et radio- eller tv-program etc. @da
toolkit label: person, som er instruktør @da
toolkit definition: Person, som er ansvarlig for den generelle ledelse af- og tilsyn med en filmoptagelse, et radio- eller tv-program etc. @da
label: režissöör (isik) @et
definition: Seostab teose isikuga, kes vastutab filmitava etenduse, raadio- või telesaate vms üldise juhtimise ja juhendamise eest. @et
alternative label: lavastaja (isik) @et
toolkit label: režissöör (isik) @et
toolkit definition: Isik, kes vastutab filmitava etenduse, raadio- või telesaate vms üldise juhtimise ja juhendamise eest. @et
label: hat Regisseurin/Regisseur (Person) @de
definition: Setzt ein Werk in Beziehung zu einer Person, die für das allgemeine Management und die Leitung einer verfilmten Darbietung, einer Hörfunk- oder Fernsehsendung und so weiter verantwortlich ist. @de
toolkit label: Regisseurin/Regisseur (Person) @de
toolkit definition: Eine Person, die für das allgemeine Management und die Leitung einer verfilmten Darbietung, einer Hörfunk- oder Fernsehsendung und so weiter verantwortlich ist. @de
label: rendező személye a következő: @hu
definition: Hozzákapcsol egy művet egy személyhez, aki felelős egy filmre vett előadás, egy rádió- vagy televízióműsor stb. általános irányításáért és felügyeletéért. @hu
toolkit label: rendező személy: @hu
toolkit definition: Egy személy, aki felelős egy filmre vett előadás, egy rádió- vagy televízióműsor stb. általános irányításáért és felügyeletéért. @hu
label: ha come regista persona @it
definition: Correla un'opera alla persona responsabile della gestione generale e della supervisione di un'interpretazione cinematografica, programma radiofonico o televisivo, etc. @it
toolkit label: regista persona @it
toolkit definition: Persona responsabile della gestione generale e della supervisione di un'interpretazione cinematografica, programma radiofonico o televisivo, etc. @it
label: a pour personne réalisatrice @fr
definition: Met une œuvre en relation avec une personne qui est responsable de la gestion et de la supervision générales d’une prestation filmée, d’une émission de radio ou de télévision, etc. @fr
toolkit label: personne réalisatrice @fr
toolkit definition: Personne qui est responsable de la gestion et de la supervision générales d’une prestation filmée, d’une émission de radio ou de télévision, etc. @fr
label: režisors (persona) @lv
definition: Sasaista darbu ar personu, kura ir atbildīga par radio vai televīzijas raidījuma, uzfilmētā pasākuma u.tml. vispārējo vadību un uzraudzību. @lv
toolkit label: režisors (persona) @lv
toolkit definition: Persona, kura ir atbildīga par radio vai televīzijas raidījuma, uzfilmētā pasākuma u.tml. vispārējo vadību un uzraudzību. @lv
label: 有导演个人 @zh-hans
definition: 将一种作品与负责电影表演、广播或电视节目等的全面管理和监督的一个个人关联起来。 @zh-hans
toolkit label: 导演个人 @zh-hans
toolkit definition: 负责电影表演、广播或电视节目等的全面管理和监督的一个个人 @zh-hans
has subproperty: has film director person
has subproperty: has radio director person
has subproperty: has television director person
has subproperty: P10455
label: yönetmen kişisi ile ilişkilidir @tr
definition: Bir eseri, filme alınmış bir performansın, bir radyo veya televizyon programının vb. genel yönetimi ve denetiminden sorumlu olan bir kişiyle ilişkilendirir. @tr
toolkit label: yönetmen @tr
toolkit definition: Filme alınmış bir performansın, bir radyo veya televizyon programının vb. genel yönetimi ve denetiminden sorumlu olan kişi. @tr

has director person of photography
status: Published
lexical alias: directorPersonOfPhotography.en
definition: Relates a work to a person who captures images, either electronically or on film or video stock, and often selects and arranges the lighting.
toolkit label: director person of photography
toolkit definition: A person who captures images, either electronically or on film or video stock, and often selects and arranges the lighting.
type: Property
domain: C10001
has element type: 2
sub property of: has creator person of work
sub property of: has director agent of photography
scope note: A director of photography for a movie is also called a chief cinematographer.
label: kuvaaja (henkilö) @fi
definition: Liittää teoksen henkilöön, joka tallentaa kuvia joko sähköisesti tai filmille tai videolle ja usein valitsee ja järjestää valaistuksen. @fi
scope note: Elokuvan kuvaajaa kutsutaan myös elokuvaajaksi. @fi
toolkit label: kuvaaja (henkilö) @fi
toolkit definition: Henkilö, joka tallentaa kuvia joko sähköisesti tai filmille tai videolle ja usein valitsee ja järjestää valaistuksen. @fi
label: har filmfotograf (person) @no
definition: Relaterer et verk til en person som tar bilder, enten elektronisk eller på film, og som ofte velger og arrangerer lyssetting. @no
scope note: Filmfotografen for en film kalles også sjefsfotograf. @no
toolkit label: filmfotograf (person) @no
toolkit definition: En person som tar bilder, enten elektronisk eller på film, og som ofte velger og arrangerer lyssetting. @no
label: heeft cameraregisseur-persoon @nl
definition: Relateert een werk aan een persoon die beelden vastlegt, hetzij elektronisch hetzij op film- of videomateriaal, en vaak de belichting selecteert en arrangeert. @nl
scope note: Een cameraregisseur voor een film wordt ook hoofd-cinematograaf genoemd. @nl
toolkit label: cameraregisseur-persoon @nl
toolkit definition: Een persoon die beelden vastlegt, hetzij elektronisch hetzij op film- of videomateriaal, en vaak de belichting selecteert en arrangeert. @nl
label: له شخص مدير تصوير @ar
definition: يربط بين عمل وشخص يلتقط الصور، إما إلكترونيًا أو على فيلم أو مقاطع فيديو، وغالبًا ما يختار الإضاءة وينسقها. @ar
scope note: مدير تصوير لفيلم يسمى أيضا كبير المصورين السينمائيين. @ar
toolkit label: شخص مدير تصوير @ar
toolkit definition: شخص يلتقط الصور، إما إلكترونيًا أو على فيلم أو مقاطع فيديو، وغالبًا ما يختار الإضاءة وينسقها. @ar
label: té com a persona directora de fotografia @ca
definition: Relaciona una obra amb una persona que captura imatges, ja sigui electrònicament o sobre pel·lícula o vídeo, i que sovint selecciona i arregla la il·luminació. @ca
scope note: Un director de fotografia d’una pel·lícula també s’anomena primer operador. @ca
toolkit label: persona directora de fotografia @ca
toolkit definition: Persona que captura imatges, ja sigui electrònicament o sobre pel·lícula o vídeo, i que sovint selecciona i arregla la il·luminació. @ca
label: har person, som er filmfotograf @da
definition: Relaterer et værk til en person, som optager billeder, enten elektronisk eller på film eller video, og ofte også udvælger og arrangerer lyssætning. @da
scope note: Filmfotografen på en film kaldes også for en cheffotograf. @da
toolkit label: person, som er filmfotograf @da
toolkit definition: Person, som optager billeder, enten elektronisk eller på film eller video, og ofte også udvælger og arrangerer lyssætning. @da
label: operaator-lavastaja (isik) @et
definition: Seostab teose isikuga, kes jäädvustab pildi kas elektrooniliselt või filmi- või videolindile ning sageli valib ja seab üles valgustuse. @et
scope note: Filmi operaator-lavastajat nimetatakse inglise keeles sageli ka chief cinematographer. @et
toolkit label: operaator-lavastaja (isik) @et
toolkit definition: Isik, kes jäädvustab pildi kas elektrooniliselt või filmi- või videolindile ning sageli valib ja seab üles valgustuse. @et
label: hat Kamerafrau/Kameramann (Person) @de
definition: Setzt ein Werk in Beziehung zu einer Person, die Bilder aufzeichnet, entweder elektronisch oder auf Film- oder Videomaterial, und häufig die Belichtung auswählt und arrangiert. @de
scope note: Eine Kamerafrau/Ein Kameramann für einen Film wird auch als "Bildregisseurin/Bildregisseur" bezeichnet. @de
toolkit label: Kamerafrau/Kameramann (Person) @de
toolkit definition: Eine Person, die Bilder aufzeichnet, entweder elektronisch oder auf Film- oder Videomaterial, und häufig die Belichtung auswählt und arrangiert. @de
label: operatőr személye a következő: @hu
definition: Hozzákapcsol egy művet egy személyhez, aki elektronikusan, filmen vagy videóállományon képeket rögzít, és gyakran kiválasztja és elrendezi a megvilágítást. @hu
scope note: Egy film operatőrét vezető operatőrnek is nevezik. @hu
toolkit label: operatőr személy: @hu
toolkit definition: Egy személy, aki elektronikusan, filmen vagy videóállományon képeket rögzít, és gyakran kiválasztja és elrendezi a megvilágítást. @hu
label: ha come direttore persona della fotografia @it
definition: Correla un'opera a una persona che cattura le immagini, sia elettronicamente che su film o su video, e che spesso sceglie e sistema le luci. @it
scope note: Un direttore della fotografia in un film è detto anche capo operatore. @it
toolkit label: direttore persona della fotografia @it
toolkit definition: Persona che cattura le immagini, sia elettronicamente che su film o su video, e che spesso sceglie e sistema le luci. @it
label: a pour personne directrice de la photographie @fr
definition: Met une œuvre en relation avec une personne qui capte des images, de manière électronique ou bien sur film ou vidéo, et qui, souvent, choisit et dispose l’éclairage. @fr
scope note: Un directeur de la photographie pour un film est également appelé un chef opérateur de prise de vue. @fr
toolkit label: personne directrice de la photographie @fr
toolkit definition: Personne qui capte des images, de manière électronique ou bien sur film ou vidéo, et qui, souvent, choisit et dispose l’éclairage. @fr
label: kinooperators (persona) @lv
definition: Sasaista darbu ar personu, kura uzņem attēlus elektroniski vai uz filmas vai video, un bieži izvēlas un izvieto apgaismojumu. @lv
toolkit label: kinooperators (persona) @lv
toolkit definition: Persona, kura uzņem attēlus elektroniski vai uz filmas vai video, un bieži izvēlas un izvieto apgaismojumu. @lv
scope note: Kinooperatoru mēdz saukt arī par galveno operatoru. @lv
label: 有摄影指导个人 @zh-hans
definition: 将一种作品与通过电子、胶片或视频存储方式摄录影像、且经常负责灯光的选择和布置的一个个人关联起来。 @zh-hans
toolkit label: 摄影指导个人 @zh-hans
toolkit definition: 通过电子、胶片或视频存储方式摄录影像、且经常负责灯光的选择和布置的一个个人 @zh-hans
scope note: 电影的摄影指导也称总摄影师 @zh-hans
has subproperty: P10415
label: görüntü yönetmeni kişisi ile ilişkilidir @tr
definition: Bir eseri, elektronik olarak veya film ya da video stoğu üzerinde görüntü kaydeden ve genellikle ışıklandırmayı seçen ve düzenleyen kişi ile ilişkilendirir. @tr

has dissertation or thesis information
status: Published
definition: Relates a work to a statement that identifies an academic institution, degree, or year for which a work was presented.
type: Property
domain: C10001
lexical alias: dissertationOrThesisInformation.en
instruction number: 7.9
toolkit label: dissertation or thesis information
toolkit definition: A statement that identifies an academic institution, degree, or year for which a work was presented.
toolkit label: information sur une thèse ou un mémoire @fr
toolkit definition: Mention qui identifie une institution universitaire à laquelle une œuvre a été présentée, un grade universitaire obtenu ou une année d’obtention de grade. @fr
toolkit label: información de una disertación o tesis @es
toolkit definition: Información relativa a una obra presentada como parte de los requisitos formales de un grado académico. @es
label: har uppgifter om akademisk avhandling och dylikt @sv
toolkit label: uppgifter om akademisk avhandling och dylikt @sv
label: har afhandlings- eller specialeoplysninger @da
definition: Relaterer et værk til en oplysning, som identificerer en akademisk institution, akademisk grad og årstal, hvor et værk blev forsvaret. @da
toolkit label: afhandlings- eller specialeoplysninger @da
toolkit definition: Oplysning, som identificerer en akademisk institution, akademisk grad og årstal, hvor et værk blev forsvaret. @da
definition: Met une œuvre en relation avec une mention qui identifie une institution universitaire à laquelle une œuvre a été présentée, un grade universitaire obtenu ou une année d’obtention de grade. @fr
label: có thông tin luận văn hoặc luận án @vi
definition: Liên kết tác phẩm với thông tin nhận dạng học viện, văn bằng, và năm mà tác phẩm được trình bày. @vi
toolkit label: thông tin luận văn hoặc luận án @vi
toolkit definition: Thông tin nhận dạng học viện, văn bằng, và năm mà tác phẩm được trình bày. @vi
label: hat Hochschulschriftenvermerk @de
definition: Setzt ein Werk in Beziehung zu einer Angabe, die eine akademische Institution, einen Grad oder ein Jahr, in dem eine Arbeit präsentiert wurde, bezeichnet. @de
toolkit label: Hochschulschriftenvermerk @de
toolkit definition: Eine Angabe, die eine akademische Institution, einen Grad oder ein Jahr, in dem eine Arbeit präsentiert wurde, bezeichnet. @de
label: a pour information sur une thèse ou un mémoire @fr
definition: Liittää teoksen merkintöön, joka identifioi teokseen liittyvän akateemisen laitoksen, oppiarvon tai vuoden. @fi
toolkit label: tieto väitöskirjasta tai muusta akateemisesta opinnäytteestä @fi
toolkit definition: Merkintö, joka identifioi teokseen liittyvän akateemisen laitoksen, oppiarvon tai vuoden. @fi
toolkit label: informasjon om en avhandling @no
toolkit definition: En angivelse av en akademisk institusjon, en grad og et tidspunktet som et verk ble presentert for. @no
label: té com a informació sobre tesi o dissertació @ca
definition: Relaciona una obra amb una menció que identifica una institució acadèmica, un títol acadèmic o un any en el qual es va presentar una obra. @ca
toolkit label: informació sobre tesi o dissertació @ca
toolkit definition: Menció que identifica una institució acadèmica, un títol acadèmic o un any en el qual es va presentar una obra . @ca
has element type: 6
label: έχει πληροφορίες διδακτορικής διατριβής ή διπλωματικής ή πτυχιακής εργασίας @el
definition: Συνδέει ένα έργο με μια δήλωση που ταυτίζει ένα ακαδημαϊκό ίδρυμα, πτυχίο και έτος για το οποίο παρουσιάστηκε ένα έργο. @el
toolkit label: πληροφορίες διδακτορικής διατριβής ή διπλωματικής ή πτυχιακής εργασίας @el
toolkit definition: Μια δήλωση που ταυτίζει ένα ακαδημαϊκό ίδρυμα, πτυχίο και έτος για το οποίο παρουσιάστηκε ένα έργο. @el
label: disszertációja/tézisinformációja a következő: @hu
definition: Hozzákapcsol egy művet egy közléshez, amely azonosítja egy mű kapcsolódó tudományos intézményét, fokozatát és az évet amelyben bemutatták. @hu
toolkit label: disszertációja/tézisinformációja: @hu
toolkit definition: Egy közlés, amely azonosítja egy mű kapcsolódó tudományos intézményét, fokozatát és az évet amelyben bemutatták. @hu
label: tieto väitöskirjasta tai muusta akateemisesta opinnäytteestä @fi
label: har informasjon om en avhandling @no
definition: Relaterer et verk til en angivelse av en akademisk institusjon, en grad og et tidspunktet som et verk ble presentert for. @no
label: heeft dissertatie- of these-informatie @nl
definition: Relateert een werk aan een mededeling die identificeert een academische instelling, graad of jaar waarvoor een werk gepresenteerd was. @nl
toolkit label: dissertatie- of these-informatie @nl
toolkit definition: Een mededeling die identificeert een academische instelling, graad of jaar waarvoor een werk gepresenteerd was. @nl
label: له معلومات رسالة دكتوراه أو أطروحة ماجستير @ar
definition: يربط بين عمل وبيان يحدد المؤسسة الأكاديمية، والدرجة العلمية، والسَنة التي قُدم فيها العمل. @ar
toolkit label: معلومات رسالة دكتوراه أو أطروحة ماجستير @ar
toolkit definition: بيان يحدد المؤسسة الأكاديمية، والدرجة العلمية، والسَنة التي قُدم فيها العمل. @ar
label: väitekirja info @et
definition: Seostab teose märkega, mis identifitseerib akadeemilise asutuse, kraadi ja aasta, kellele, milleks ja millal teos oli esitatud. @et
toolkit label: väitekirja info @et
toolkit definition: Märge, mis identifitseerib akadeemilise asutuse, kraadi ja aasta, kellele, milleks ja millal teos oli esitatud. @et
label: ha come informazioni sulla dissertazione o tesi @it
definition: Correla un’opera a una formulazione che identifica una istituzione accademica, un titolo e un anno per cui un’opera è stata presentata. @it
toolkit label: informazioni sulla dissertazione o tesi @it
toolkit definition: Formulazione che identifica una istituzione accademica, un titolo e un anno per cui un’opera è stata presentata. @it
label: informācija par disertāciju vai tēzēm @lv
definition: Sasaista darbu ar informāciju par darbu, kas ir oficiāla prasību daļa akadēmiskā grāda iegūšanai. @lv
toolkit label: informācija par disertāciju vai tēzēm @lv
toolkit definition: Informācija par darbu, kas ir oficiāla prasību daļa akadēmiskā grāda iegūšanai. @lv
label: 有学位论文信息 @zh-hans
definition: 将一种作品与标识一种作品被提交的学术机构、学位和年份的说明关联起来。 @zh-hans
toolkit label: 学位论文信息 @zh-hans
toolkit definition: 标识一种作品被提交的学术机构、学位和年份的说明 @zh-hans
has subproperty: P10209
label: tez bilgisi ile ilişkilidir @tr
definition: Bir eseri, eserin sunulduğu akademik kurumu, dereceyi veya yılı tanımlayan bir bildirimle ilişkilendirir. @tr
toolkit label: tez veya doktora tezi bilgisi @tr
toolkit definition: Bir çalışmanın sunulduğu akademik kurumu, dereceyi veya yılı tanımlayan bir bildirim. @tr

has duration of representative expression
status: Published
type: Property
lexical alias: durationOfRepresentativeExpression.en
definition: Relates a work to an extent of expression of a representative expression of a work that is a playing time, performance time, running time, or other length of time.
domain: C10001
toolkit label: duration of representative expression
has element type: 3
toolkit definition: An extent of expression of a representative expression of a work that is a playing time, performance time, running time, or other length of time.
sub property of: has related timespan of work
label: edustavan ekspression kesto @fi
definition: Liittää teoksen teoksen edustavan ekspression ekspression laajuuteen, joka on soittoaika, esitysaika, toistoaika tai muu ajan pituus. @fi
toolkit label: edustavan ekspression kesto @fi
toolkit definition: Teoksen edustavan ekspression ekspression laajuus, joka on soittoaika, esitysaika, toistoaika tai muu ajan pituus. @fi
label: har varighet for representativt uttrykk @no
definition: Relaterer et verk til et omfang for uttrykk av et representativt uttrykk av et verk som er spilletid, framføringstid, avspillingstid eller et annet tidsrom. @no
toolkit label: varighet for representativt uttrykk @no
toolkit definition: Et omfang for uttrykk av et representativt uttrykk av et verk som er spilletid, framføringstid, avspillingstid eller et annet tidsrom. @no
label: heeft duur van representatieve expressie @nl
definition: Relateert een werk aan een omvang van expressie van een representatieve expressie van een werk dat een speeltijd, opvoeringstijd, looptijd of andere tijdsduur. @nl
toolkit label: duur van representatieve expressie @nl
toolkit definition: Een omvang van expressie van een representatieve expressie van een werk dat een speeltijd, opvoeringstijd, looptijd of andere tijdsduur. @nl
label: له مدة لتعبيرة ممثِلة @ar
definition: يربط بين عمل ومدى تعبير تعبيرة ممثِلة لعمل عبارة عن وقت تشغيل، أو وقت أداء، أو مدة عرض، أو مدة زمنية أخرى. @ar
toolkit label: مدة تعبيرة ممثِلة @ar
toolkit definition: مدى تعبير تعبيرة ممثِلة لعمل عبارة عن وقت تشغيل، أو وقت أداء، أو مدة عرض، أو مدة زمنية أخرى. @ar
label: té com a durada d’una expressió representativa @ca
definition: Relaciona una obra amb una extensió d’expressió d’una expressió representativa d’una obra que és un temps de reproducció, d’execució o de qualsevol altre longitud de temps. @ca
toolkit label: durada d’una expressió representativa @ca
toolkit definition: Extensió d’expressió d’una expressió representativa d’una obra que és un temps de reproducció, d’execució o de qualsevol altre longitud de temps. @ca
label: har spilletid af repræsentativt udtryk @da
definition: Relaterer et værk til omfanget af et værks repræsentative udtryk, som er en varighed, opførelsestid, spilletid etc. eller anden tidsperiode. @da
toolkit label: spilletid af repræsentativt udtryk @da
toolkit definition: Omfanget af et værks repræsentative udtryk, som er en varighed, opførelsestid, spilletid etc. eller anden tidsperiode. @da
label: iseloomuliku väljenduse kestus @et
definition: Seostab teose teose iseloomuliku väljenduse mahuga, milleks on mängimisaeg, esituse aeg, töötamisaeg või muu ajavahemik. @et
toolkit label: iseloomuliku väljenduse kestus @et
toolkit definition: Teose iseloomuliku väljenduse maht, milleks on mängimisaeg, esituse aeg, töötamisaeg või muu ajavahemik. @et
label: hat Dauer einer repräsentativen Expression @de
definition: Setzt ein Werk in Beziehung zu einem Umfang einer repräsentativen Expression eines Werks, bei dem es sich um eine Wiedergabezeit, eine Aufführungszeit, eine Laufzeit oder eine andere Zeitspanne handelt. @de
toolkit label: Dauer einer repräsentativen Expression @de
toolkit definition: Ein Umfang einer repräsentativen Expression eines Werks, bei dem es sich um eine Wiedergabezeit, eine Aufführungszeit, eine Laufzeit oder eine andere Zeitspanne handelt. @de
label: reprezentatív kifejezési forma időterjedelme a következő: @hu
definition: Hozzákapcsol egy művet egy mű reprezentatív kifejezési formája kifejezési formájának terjedelméhez, amely játékidő, előadás ideje, futási idő vagy egyéb időtartomány. @hu
toolkit label: reprezentatív kifejezési formához tartozó időtartam @hu
toolkit definition: Egy mű reprezentatív kifejezési formája kifejezési formájának terjedelme, amely játékidő, előadás ideje, futási idő vagy egyéb időtartomány. @hu
label: ha come durata di espressione rappresentativa @it
definition: Correla un’opera a un’estensione dell’espressione di un’espressione rappresentativa cioè una durata di riproduzione, di esecuzione, attivazione o altro intervallo di tempo. @it
toolkit label: durata dell'espressione rappresentativa @it
toolkit definition: Estensione dell’espressione di un’espressione rappresentativa cioè una durata di riproduzione, di esecuzione, attivazione o altro intervallo di tempo. @it
label: a pour durée d’une expression représentative @fr
definition: Met une œuvre en relation avec une étendue d’une expression d’une expression représentative d’une œuvre qui consiste en une durée de lecture, d’exécution, de projection ou en une autre période de temps. @fr
toolkit label: durée d’une expression représentative @fr
toolkit definition: Étendue d’une expression d’une expression représentative d’une œuvre qui consiste en une durée de lecture, d’exécution, de projection ou en une autre période de temps. @fr
label: reprezentatīvās izteiksmes ilgums @lv
definition: Sasaista darbu ar reprezentatīvās izteiksmes satura atskaņošanas ilgumu, izpildes laiku, darbības laiku, u.tml. @lv
toolkit label: reprezentatīvās izteiksmes ilgums @lv
toolkit definition: Reprezentatīvās izteiksmes satura atskaņošanas ilgums, izpildes laiks, darbības laiks, u.tml. @lv
label: 有代表性内容表达的持续时间 @zh-hans
definition: 将一种作品与作为播放时间、表演时间、运行时间或其他时间长度的一种代表性内容表达的表现的数量关联起来。 @zh-hans
toolkit label: 代表性内容表达的持续时间 @zh-hans
toolkit definition: 作为播放时间、表演时间、运行时间或其他时间长度的一种代表性内容表达的表现的数量 @zh-hans
has subproperty: P10351
label: temsili anlatım süresi ile ilişkilidir @tr
definition: Bir eseri, bir çalma süresi, performans süresi, çalışma süresi veya başka bir süre uzunluğu olan bir eserin temsili anlatımının kapsamıyla ilişkilendirir. @tr
toolkit label: temsili ifadenin süresi @tr
toolkit definition: Çalma süresi, performans süresi, çalışma süresi veya başka bir süre uzunluğu olan bir eserin temsili bir anlatımına ait bir anlatım kapsamı. @tr

has editorial director agent
status: Published
sub property of: has creator agent of work
type: Property
lexical alias: editorialDirectorAgent.en
domain: C10001
toolkit label: editorial director agent
toolkit definition: An agent who has legal or intellectual responsibility, but not creative responsibility, for the editorial policy and content of a diachronic work.
scope note: Revision, clarification, or other change of content of an expression of a work is excluded.
see also: P20048
instruction number: 18.5
definition: Relates a work to an agent who has legal or intellectual responsibility, but not creative responsibility, for the editorial policy and content of a diachronic work.
label: har agent, som er ansvarshavende redaktør @da
definition: Relaterer et værk til en agent, som er juridisk eller intellektuelt ansvarlig, men ikke skabelsesansvarlig, for et diakronisk værks redaktionelle linje og indhold. @da
scope note: Revision, indholdspræcisering eller anden ændring af indholdet af et værks udtryk er ikke omfattet. @da
toolkit label: agent, som er ansvarshavende redaktør @da
toolkit definition: Agent, som er juridisk eller intellektuelt ansvarlig, men ikke skabelsesansvarlig, for et diakronisk værks redaktionelle linje og indhold. @da
label: có giám đốc biên tập @vi
definition: Liên kết tác phẩm với tác nhân có trách nhiệm pháp lý và/hoặc trú tuệ khác với sáng tạo nội dung của ấn phẩm nhiều kỳ, tài nguyên tích hợp, hoặc chuyên khảo nhiều phần. @vi
scope note: Duyệt lại, làm rõ nội dung, v.v..., trong biểu hiện của tác phẩm không được bao gồm. @vi
toolkit label: giám đốc biên tập @vi
toolkit definition: Tác nhân có trách nhiệm pháp lý và/hoặc trú tuệ khác với sáng tạo nội dung của ấn phẩm nhiều kỳ, tài nguyên tích hợp, hoặc chuyên khảo nhiều phần. @vi
label: hat Chefredakteurin/Chefredakteur (Akteur) @de
definition: Setzt ein Werk in Beziehung zu einem Akteur, der die rechtliche oder intellektuelle, aber keine kreative, Verantwortung für die redaktionelle Vorgehensweise und den Inhalt eines diachronen Werks trägt. @de
scope note: Darunter fallen nicht Überarbeitungen, Erläuterungen oder andere inhaltliche Änderungen an einer Expression eines Werks. @de
toolkit label: Chefredakteurin/Chefredakteur (Akteur) @de
toolkit definition: Ein Akteur, der die rechtliche oder intellektuelle, aber keine kreative, Verantwortung für die redaktionelle Vorgehensweise und den Inhalt eines diachronen Werks trägt. @de
definition: Liittää teoksen toimijaan, jolla on juridinen tai tiedollinen vastuu, mutta ei luovaa vastuuta, diakronisen teoksen toimituslinjasta ja sisällöstä. @fi
toolkit label: toimituspäällikkö (toimija) @fi
toolkit definition: Toimija, jolla on juridinen tai tiedollinen vastuu, mutta ei luovaa vastuuta, diakronisen teoksen toimituslinjasta ja sisällöstä. @fi
toolkit label: redaksjonssjef (agent) @no
toolkit definition: En agent som har juridisk eller intellektuelt ansvar, men ikke kreativt ansvar, for det redaksjonelle innholdet i et diakronisk verk. @no
label: té com a agent director editorial @ca
definition: Relaciona una obra amb un agent que té responsabilitat legal o intel·lectual, però no responsabilitat creativa, de la política editorial i el contingut d’una obra diacrònica. @ca
scope note: S’exclou la revisió, l’aclariment o qualsevol altre canvi del contingut d’una expressió d’una obra. @ca
toolkit label: agent director editorial @ca
toolkit definition: Agent que té responsabilitat legal o intel·lectual, però no responsabilitat creativa, de la política editorial i el contingut d’una obra diacrònica. @ca
label: a pour agent directeur de publication @fr
definition: Met une œuvre en relation avec un agent qui a la responsabilité légale ou intellectuelle, mais non la responsabilité créative, de la politique éditoriale et du contenu d’une œuvre diachronique. @fr
scope note: La révision, la clarification ou toute autre modification du contenu d’une expression d’une œuvre sont exclues. @fr
toolkit label: agent directeur de publication @fr
toolkit definition: Agent qui a la responsabilité légale ou intellectuelle, mais non la responsabilité créative, de la politique éditoriale et du contenu d’une œuvre diachronique. @fr
has element type: 2
label: έχει διευθυντή σύνταξης @el
definition: Συνδέει ένα έργο με έναν φορέα υπεύθυνο για τη νομική ή/και πνευματική υπευθυνότητα, άλλη από τη δημιουργία, για το περιεχόμενο ενός περιοδικού, ενός ενσωματωμένου πόρου ή μιας πολυμερούς μονογραφίας. @el
scope note: Δεν περιλαμβάνεται η αναθεώρηση, η αποσαφήνιση του περιεχομένου κ.λπ. σε μια έκφραση ενός έργου. @el
toolkit label: διευθυντής σύνταξης @el
toolkit definition: Ένας φορέας υπεύθυνος για τη νομική ή/και πνευματική υπευθυνότητα, άλλη από τη δημιουργία, για το περιεχόμενο ενός περιοδικού, ενός ενσωματωμένου πόρου ή μιας πολυμερούς μονογραφίας. @el
label: főszerkesztő ágense a következő: @hu
definition: Hozzákapcsol egy művet egy ágenshez, amelynek jogi vagy szellemi, de nem alkotói felelőssége van egy diakronikus mű szerkesztési politikájáért és tartalmáért. @hu
scope note: Nem tartozik bele egy mű kifejezési formájának revíziója, áttekintése, vagy egyéb tartalmi változtatása. @hu
toolkit label: főszerkesztő ágens: @hu
toolkit definition: Egy ágens, amelynek jogi vagy szellemi, de nem alkotói felelőssége van egy diakronikus mű szerkesztési politikájáért és tartalmáért. @hu
alternative label: editorial director
scope note: Ei kata teoksen ekspression sisällön tarkastamista, selkeyttämistä tai muuta muutosta. @fi
alternative label: toimituspäällikkö @fi
label: toimituspäällikkö (toimija) @fi
label: har redaksjonssjef (agent) @no
definition: Relaterer et verk til en agent som har juridisk eller intellektuelt ansvar, men ikke kreativt ansvar, for det redaksjonelle innholdet i et diakronisk verk. @no
scope note: Å redigere innholdet i et uttrykk av et verk eller gjøre det klarere er ikke inkludert. @no
alternative label: redaksjonssjef @no
label: heeft hoofdredacteur-actor @nl
definition: Relateert een werk aan een actor die wettelijke of intellectuele verantwoordelijkheid, maar niet creatieve verantwoordelijkheid heeft voor het redactioneel beleid en content van een diachronisch werk. @nl
scope note: Herziening, toelichting of andere verandering van content van een expressie van een werk is uitgesloten. @nl
toolkit label: hoofdredacteur-actor @nl
toolkit definition: Een actor die wettelijke of intellectuele verantwoordelijkheid, maar niet creatieve verantwoordelijkheid heeft voor het redactioneel beleid en content van een diachronisch werk. @nl
label: له وكيل مدير تحرير @ar
definition: يربط بين عمل ووكيل يتحمل مسئولية قانونية أو فكرية، ولكن لا يتحمل مسئولية إبداعية، عن السياسة التحريرية ومحتوى عمل ممتد زمنيًا. @ar
scope note: تُستبعد مراجعة محتوى تعبيرة لعمل، أو توضيحه، أو أي تغيير آخر فيه. @ar
alternative label: مدير تحرير @ar
toolkit label: وكيل مدير تحرير @ar
toolkit definition: وكيل يتحمل مسئولية قانونية أو فكرية، ولكن لا يتحمل مسئولية إبداعية، عن السياسة التحريرية ومحتوى عمل ممتد زمنيًا. @ar
alternative label: director editorial @ca
alternative label: ansvarshavende redaktør @da
label: peatoimetaja (tegija) @et
definition: Seostab teose tegijaga, kes juriidiliselt või intellektuaalselt, kuid mitte loominguliselt vastutab diakroonilise teose toimetamispõhimõtete ja sisu eest. @et
scope note: Ei hõlma teose väljenduse sisu parandamist, täpsustamist ega muude muudatuste tegemist. @et
alternative label: peatoimetaja @et
toolkit label: peatoimetaja (tegija) @et
toolkit definition: Tegija, kes juriidiliselt või intellektuaalselt, kuid mitte loominguliselt vastutab diakroonilise teose toimetamispõhimõtete ja sisu eest. @et

has editorial director collective agent
status: Published
lexical alias: editorialDirectorCollectiveAgent.en
definition: Relates a work to a collective agent who has legal or intellectual responsibility, but not creative responsibility, for the editorial policy and content of a diachronic work.
toolkit label: editorial director collective agent
toolkit definition: A collective agent who has legal or intellectual responsibility, but not creative responsibility, for the editorial policy and content of a diachronic work.
type: Property
domain: C10001
has element type: 2
sub property of: has creator collective agent of work
sub property of: has editorial director agent
scope note: Revision, clarification, or other change of content of an expression of a work is excluded.
label: toimituspäällikkö (yhteistoimija) @fi
definition: Liittää teoksen yhteistoimijaan, jolla on juridinen tai tiedollinen vastuu, mutta ei luovaa vastuuta, diakronisen teoksen toimituslinjasta ja sisällöstä. @fi
scope note: Ei kata teoksen ekspression sisällön tarkastamista, selkeyttämistä tai muuta muutosta. @fi
toolkit label: toimituspäällikkö (yhteistoimija) @fi
toolkit definition: Yhteistoimija, jolla on juridinen tai tiedollinen vastuu, mutta ei luovaa vastuuta, diakronisen teoksen toimituslinjasta ja sisällöstä. @fi
label: har redaksjonssjef (kollektiv agent) @no
definition: Relaterer et verk til en kollektiv agent som har juridisk eller intellektuelt ansvar, bortsett fra kreativt ansvar, for det redaksjonelle innholdet i et diakronisk verk. @no
scope note: Å redigere innholdet i et uttrykk av et verk eller gjøre det klarere er ikke inkludert. @no
toolkit label: redaksjonssjef (kollektiv agent) @no
toolkit definition: En kollektiv agent som har juridisk eller intellektuelt ansvar, bortsett fra kreativt ansvar, for det redaksjonelle innholdet i et diakronisk verk. @no
label: heeft hoofdredacteur-collectieve actor @nl
definition: Relateert een werk aan een collectieve actor die wettelijke of intellectuele verantwoordelijkheid, maar niet creatieve verantwoordelijkheid heeft voor het redactioneel beleid en content van een diachronisch werk. @nl
scope note: Herziening, toelichting of andere verandering van content van een expressie van een werk is uitgesloten. @nl
toolkit label: hoofdredacteur-collectieve actor @nl
toolkit definition: Een collectieve actor die wettelijke of intellectuele verantwoordelijkheid, maar niet creatieve verantwoordelijkheid heeft voor het redactioneel beleid en content van een diachronisch werk. @nl
label: له وكيل جماعي مدير تحرير @ar
definition: يربط بين عمل ووكيل جماعي يتحمل مسئولية قانونية أو فكرية، ولكن لا يتحمل مسئولية إبداعية، عن السياسة التحريرية ومحتوى عمل ممتد زمنيًا. @ar
scope note: تُستبعد مراجعة محتوى تعبيرة لعمل، أو توضيحه، أو أي تغيير آخر فيه. @ar
toolkit label: وكيل جماعي مدير تحرير @ar
toolkit definition: وكيل جماعي يتحمل مسئولية قانونية أو فكرية، ولكن لا يتحمل مسئولية إبداعية، عن السياسة التحريرية ومحتوى عمل ممتد زمنيًا. @ar
label: té com a agent col·lectiu director editorial @ca
definition: Relaciona una obra amb un agent col·lectiu que té responsabilitat legal o intel·lectual, però no responsabilitat creativa, de la política editorial i el contingut d’una obra diacrònica. @ca
scope note: S’exclou la revisió, l’aclariment o qualsevol altre canvi del contingut d’una expressió d’una obra. @ca
toolkit label: agent col·lectiu director editorial @ca
toolkit definition: Agent col·lectiu que té responsabilitat legal o intel·lectual, però no responsabilitat creativa, de la política editorial i el contingut d’una obra diacrònica. @ca
label: har kollektiv agent, som er ansvarshavende redaktør @da
definition: Relaterer et værk til en kollektiv agent, som er juridisk eller intellektuelt ansvarlig, men ikke skabelsesansvarlig, for et diakronisk værks redaktionelle linje og indhold. @da
scope note: Revision, indholdspræcisering eller anden ændring af indholdet af et værks udtryk er ikke omfattet. @da
toolkit label: kollektiv agent, som er ansvarshavende redaktør @da
toolkit definition: Kollektiv agent, som er juridisk eller intellektuelt ansvarlig, men ikke skabelsesansvarlig, for et diakronisk værks redaktionelle linje og indhold. @da
label: peatoimetaja (kollektiiv) @et
definition: Seostab teose kollektiiviga, kes juriidiliselt või intellektuaalselt, kuid mitte loominguliselt vastutab diakroonilise teose toimetamispõhimõtete ja sisu eest. @et
scope note: Ei hõlma teose väljenduse sisu parandamist, täpsustamist ega muude muudatuste tegemist. @et
toolkit label: peatoimetaja (kollektiiv) @et
toolkit definition: Kollektiiv, kes juriidiliselt või intellektuaalselt, kuid mitte loominguliselt vastutab diakroonilise teose toimetamispõhimõtete ja sisu eest. @et
label: hat Chefredakteurin/Chefredakteur (Gemeinschaftlicher Akteur) @de
definition: Setzt ein Werk in Beziehung zu einem gemeinschaftlichen Akteur, der die rechtliche oder intellektuelle, aber keine kreative, Verantwortung für die redaktionelle Vorgehensweise und den Inhalt eines diachronen Werks trägt. @de
scope note: Darunter fallen nicht Überarbeitungen, Erläuterungen oder andere inhaltliche Änderungen an einer Expression eines Werks. @de
toolkit label: Chefredakteurin/Chefredakteur (Gemeinschaftlicher Akteur) @de
toolkit definition: Ein gemeinschaftlicher Akteur, der die rechtliche oder intellektuelle, aber keine kreative, Verantwortung für die redaktionelle Vorgehensweise und den Inhalt eines diachronen Werks trägt. @de
label: főszerkesztő kollektív ágense a következő: @hu
definition: Hozzákapcsol egy művet egy kollektív ágenshez, amelynek jogi vagy szellemi, de nem alkotói felelőssége van egy diakronikus mű szerkesztési politikájáért és tartalmáért. @hu
scope note: Nem tartozik bele egy mű kifejezési formájának revíziója, áttekintése, vagy egyéb tartalmi változtatása. @hu
toolkit label: főszerkesztő kollektív ágens: @hu
toolkit definition: Egy kollektív ágens, amelynek jogi vagy szellemi, de nem alkotói felelőssége van egy diakronikus forrás szerkesztési politikájáért és tartalmáért. @hu
label: a pour agent collectif directeur de publication @fr
definition: Met une œuvre en relation avec un agent collectif qui a la responsabilité légale ou intellectuelle, mais non la responsabilité créative, de la politique éditoriale et du contenu d’une œuvre diachronique. @fr
scope note: La révision, la clarification ou toute autre modification du contenu d’une expression d’une œuvre sont exclues. @fr
toolkit label: agent collectif directeur de publication @fr
toolkit definition: Agent collectif qui a la responsabilité légale ou intellectuelle, mais non la responsabilité créative, de la politique éditoriale et du contenu d’une œuvre diachronique. @fr
label: galvenais redaktors (grupa) @lv
definition: Sasaista darbu ar grupu, kam ir juridiska vai intelektuāla, bet ne radoša atbildība par diahroniskā darba izdošanas politiku un saturu. @lv
toolkit label: galvenais redaktors (grupa) @lv
toolkit definition: Grupa, kam ir juridiska vai intelektuāla, bet ne radoša atbildība par diahroniskā darba izdošanas politiku un saturu. @lv
scope note: Darbība neietver darba izteiksmes satura pārskatīšanu, precizēšanu vai cita veida izmaiņas u. tml. @lv
label: 有主编集体行为者 @zh-hans
definition: 将一种作品与有对一种历时作品的编辑政策和内容的法律或知识责任（但非创作责任）的一个集体行为者关联起来。 @zh-hans
toolkit label: 主编集体行为者 @zh-hans
toolkit definition: 有对一种历时作品的编辑政策和内容的法律或知识责任（但非创作责任）的一个集体行为者 @zh-hans
scope note: 不包括对一种作品的一种内容表达之内容的修订、说明或其他变化。 @zh-hans
has subproperty: has editorial director corporate body
has subproperty: has editorial director family
has subproperty: P10464
label: yayın yönetmeni kolektif temsilcisi ile ilişkilidir @tr
definition: Bir eseri, artzamanlı bir eserin yayın politikası ve içeriği için yasal veya fikri sorumluluğu olan ancak yaratıcı sorumluluğu olmayan bir kolektif temsilci ile ilişkilendirir. @tr
toolkit label: yayın yönetmeni kolektif temsilcisi @tr
toolkit definition: Çağdışı bir eserin yayın politikası ve içeriği için yasal veya entelektüel sorumluluğu olan ancak yaratıcı sorumluluğu olmayan kolektif bir temsilci. @tr
scope note: Bir eserin anlatımının gözden geçirilmesi, netleştirilmesi veya içeriğinin başka bir şekilde değiştirilmesi hariçtir. @tr

has editorial director corporate body
status: Published
lexical alias: editorialDirectorCorporateBody.en
definition: Relates a work to a corporate body who has legal or intellectual responsibility, but not creative responsibility, for the editorial policy and content of a diachronic work.
toolkit label: editorial director corporate body
toolkit definition: A corporate body who has legal or intellectual responsibility, but not creative responsibility, for the editorial policy and content of a diachronic work.
type: Property
domain: C10001
has element type: 2
sub property of: has creator corporate body of work
sub property of: has editorial director collective agent
scope note: Revision, clarification, or other change of content of an expression of a work is excluded.
label: toimituspäällikkö (yhteisö) @fi
definition: Liittää teoksen yhteisöön, jolla on juridinen tai tiedollinen vastuu, mutta ei luovaa vastuuta, diakronisen teoksen toimituslinjasta ja sisällöstä. @fi
scope note: Ei kata teoksen ekspression sisällön tarkastamista, selkeyttämistä tai muuta muutosta. @fi
toolkit label: toimituspäällikkö (yhteisö) @fi
toolkit definition: Yhteisö, jolla on juridinen tai tiedollinen vastuu, mutta ei luovaa vastuuta, diakronisen teoksen toimituslinjasta ja sisällöstä. @fi
label: har redaksjonssjef (korporasjon) @no
definition: Relaterer et verk til en korporasjon som har juridisk eller intellektuelt ansvar, bortsett fra kreativt ansvar, for det redaksjonelle innholdet i et diakronisk verk. @no
scope note: Å redigere innholdet i et uttrykk av et verk eller gjøre det klarere er ikke inkludert. @no
toolkit label: redaksjonssjef (korporasjon) @no
toolkit definition: En korporasjon som har juridisk eller intellektuelt ansvar, bortsett fra kreativt ansvar, for det redaksjonelle innholdet i et diakronisk verk. @no
label: heeft hoofdredacteur-corporatie @nl
definition: Relateert een werk aan een corporatie die wettelijke of intellectuele verantwoordelijkheid, maar niet creatieve verantwoordelijkheid heeft voor het redactioneel beleid en content van een diachronisch werk. @nl
scope note: Herziening, toelichting of andere verandering van content van een expressie van een werk is uitgesloten. @nl
toolkit label: hoofdredacteur-corporatie @nl
toolkit definition: Een corporatie die wettelijke of intellectuele verantwoordelijkheid, maar niet creatieve verantwoordelijkheid heeft voor het redactioneel beleid en content van een diachronisch werk. @nl
label: له هيئة مديرة تحرير @ar
definition: يربط بين عمل وهيئة تتحمل مسئولية قانونية أو فكرية، ولكن لا تتحمل مسئولية إبداعية، عن السياسة التحريرية ومحتوى عمل ممتد زمنيًا. @ar
scope note: تُستبعد مراجعة محتوى تعبيرة لعمل، أو توضيحه، أو أي تغيير آخر فيه. @ar
toolkit label: هيئة مديرة تحرير @ar
toolkit definition: هيئة تتحمل مسئولية قانونية أو فكرية، ولكن لا تتحمل مسئولية إبداعية، عن السياسة التحريرية ومحتوى عمل ممتد زمنيًا. @ar
label: té com a entitat corporativa directora editorial @ca
definition: Relaciona una obra amb una entitat corporativa que té responsabilitat legal o intel·lectual, però no responsabilitat creativa, de la política editorial i el contingut d’una obra diacrònica. @ca
scope note: S’exclou la revisió, l’aclariment o qualsevol altre canvi del contingut d’una expressió d’una obra. @ca
toolkit label: entitat corporativa directora editorial @ca
toolkit definition: Entitat corporativa que té responsabilitat legal o intel·lectual, però no responsabilitat creativa, de la política editorial i el contingut d’una obra diacrònica. @ca
label: har korporation, som er ansvarshavende redaktør @da
definition: Relaterer et værk til en korporation, som er juridisk eller intellektuelt ansvarlig, men ikke skabelsesansvarlig, for et diakronisk værks redaktionelle linje og indhold. @da
scope note: Revision, indholdspræcisering eller anden ændring af indholdet af et værks udtryk er ikke omfattet. @da
toolkit label: korporation, som er ansvarshavende redaktør @da
toolkit definition: Korporation, som er juridisk eller intellektuelt ansvarlig, men ikke skabelsesansvarlig, for et diakronisk værks redaktionelle linje og indhold. @da
label: peatoimetaja (asutus) @et
definition: Seostab teose asutusega, kes juriidiliselt või intellektuaalselt, kuid mitte loominguliselt vastutab diakroonilise teose toimetamispõhimõtete ja sisu eest. @et
scope note: Ei hõlma teose väljenduse sisu parandamist, täpsustamist ega muude muudatuste tegemist. @et
toolkit label: peatoimetaja (asutus) @et
toolkit definition: Asutus, kes juriidiliselt või intellektuaalselt, kuid mitte loominguliselt vastutab diakroonilise teose toimetamispõhimõtete ja sisu eest. @et
label: hat Chefredakteurin/Chefredakteur (Körperschaft) @de
definition: Setzt ein Werk in Beziehung zu einer Körperschaft, die die rechtliche oder intellektuelle, aber keine kreative, Verantwortung für die redaktionelle Vorgehensweise und den Inhalt eines diachronen Werks trägt. @de
scope note: Darunter fallen nicht Überarbeitungen, Erläuterungen oder andere inhaltliche Änderungen an einer Expression eines Werks. @de
toolkit label: Chefredakteurin/Chefredakteur (Körperschaft) @de
toolkit definition: Eine Körperschaft, die die rechtliche oder intellektuelle, aber keine kreative, Verantwortung für die redaktionelle Vorgehensweise und den Inhalt eines diachronen Werks trägt. @de
label: főszerkesztő testülete a következő: @hu
definition: Hozzákapcsol egy művet egy testülethez, amelynek jogi vagy szellemi, de nem alkotói felelőssége van egy diakronikus mű szerkesztési politikájáért és tartalmáért. @hu
scope note: Nem tartozik bele egy mű kifejezési formájának revíziója, áttekintése, vagy egyéb tartalmi változtatása. @hu
toolkit label: főszerkesztő testület: @hu
toolkit definition: Egy testület, amelynek jogi vagy szellemi, de nem alkotói felelőssége van egy diakronikus mű szerkesztési politikájáért és tartalmáért. @hu
label: a pour collectivité directrice de publication @fr
definition: Met une œuvre en relation avec une collectivité qui a la responsabilité légale ou intellectuelle, mais non la responsabilité créative, de la politique éditoriale et du contenu d’une œuvre diachronique. @fr
scope note: La révision, la clarification ou toute autre modification du contenu d’une expression d’une œuvre sont exclues. @fr
toolkit label: collectivité directrice de publication @fr
toolkit definition: Collectivité qui a la responsabilité légale ou intellectuelle, mais non la responsabilité créative, de la politique éditoriale et du contenu d’une œuvre diachronique. @fr
label: galvenais redaktors (institūcija) @lv
definition: Sasaista darbu ar institūciju, kam ir juridiska vai intelektuāla, bet ne radoša atbildība par diahroniskā darba izdošanas politiku un saturu. @lv
toolkit label: galvenais redaktors (institūcija) @lv
toolkit definition: Institūcija, kam ir juridiska vai intelektuāla, bet ne radoša atbildība par diahroniskā darba izdošanas politiku un saturu. @lv
scope note: Darbība neietver darba izteiksmes satura pārskatīšanu, precizēšanu vai cita veida izmaiņas u.tml. @lv
label: 有主编团体 @zh-hans
definition: 将一种作品与有对一种历时作品的编辑政策和内容的法律或知识责任（但非创作责任）的一个团体关联起来。 @zh-hans
toolkit label: 主编团体 @zh-hans
toolkit definition: 有对一种历时作品的编辑政策和内容的法律或知识责任（但非创作责任）的一个团体 @zh-hans
scope note: 不包括对一种作品的一种内容表达之内容的修订、说明或其他变化。 @zh-hans
has subproperty: P10511
label: yayın yönetmeni tüzel kişisi ile ilişkilidir @tr
definition: Bir eseri, artzamanlı bir eserin yayın politikası ve içeriği için yasal veya fikri sorumluluğu olan ancak yaratıcı sorumluluğu olmayan tüzel kişi ile ilişkilendirir. @tr
toolkit label: yayın yönetmeni tüzel kişisi @tr
toolkit definition: Art zamanlı bir çalışmanın yayın politikası ve içeriği konusunda yasal veya fikri sorumluluğu olan ancak yaratıcı sorumluluğu olmayan bir tüzel kişilik. @tr
scope note: Bir eserin anlatımının gözden geçirilmesi, netleştirilmesi veya içeriğinin başka bir şekilde değiştirilmesi hariçtir. @tr

has editorial director family
status: Published
lexical alias: editorialDirectorFamily.en
definition: Relates a work to a family who has legal or intellectual responsibility, but not creative responsibility, for the editorial policy and content of a diachronic work.
toolkit label: editorial director family
toolkit definition: A family who has legal or intellectual responsibility, but not creative responsibility, for the editorial policy and content of a diachronic work.
type: Property
domain: C10001
has element type: 2
sub property of: has creator family of work
sub property of: has editorial director collective agent
scope note: Revision, clarification, or other change of content of an expression of a work is excluded.
label: toimituspäällikkö (suku) @fi
definition: Liittää teoksen sukuun, jolla on juridinen tai tiedollinen vastuu, mutta ei luovaa vastuuta, diakronisen teoksen toimituslinjasta ja sisällöstä. @fi
scope note: Ei kata teoksen ekspression sisällön tarkastamista, selkeyttämistä tai muuta muutosta. @fi
toolkit label: toimituspäällikkö (suku) @fi
toolkit definition: Suku, jolla on juridinen tai tiedollinen vastuu, mutta ei luovaa vastuuta, diakronisen teoksen toimituslinjasta ja sisällöstä. @fi
label: har redaksjonssjef (familie) @no
definition: Relaterer et verk til en familie som har juridisk eller intellektuelt ansvar, bortsett fra kreativt ansvar, for det redaksjonelle innholdet i et diakronisk verk. @no
scope note: Å redigere innholdet i et uttrykk av et verk eller gjøre det klarere er ikke inkludert. @no
toolkit label: redaksjonssjef (familie) @no
toolkit definition: En familie som har juridisk eller intellektuelt ansvar, bortsett fra kreativt ansvar, for det redaksjonelle innholdet i et diakronisk verk. @no
label: heeft hoofdredacteur-familie @nl
definition: Relateert een werk aan een familie die wettelijke of intellectuele verantwoordelijkheid, maar niet creatieve verantwoordelijkheid heeft voor het redactioneel beleid en content van een diachronisch werk. @nl
scope note: Herziening, toelichting of andere verandering van content van een expressie van een werk is uitgesloten. @nl
toolkit label: hoofdredacteur-familie @nl
toolkit definition: Een familie die wettelijke of intellectuele verantwoordelijkheid, maar niet creatieve verantwoordelijkheid heeft voor het redactioneel beleid en content van een diachronisch werk. @nl
label: له عائلة مديرة تحرير @ar
definition: يربط بين عمل وعائلة تتحمل مسئولية قانونية أو فكرية، ولكن لا تتحمل مسئولية إبداعية، عن السياسة التحريرية ومحتوى عمل ممتد زمنيًا. @ar
scope note: تُستبعد مراجعة محتوى تعبيرة لعمل، أو توضيحه، أو أي تغيير آخر فيه. @ar
toolkit label: عائلة مديرة تحرير @ar
toolkit definition: عائلة تتحمل مسئولية قانونية أو فكرية، ولكن لا تتحمل مسئولية إبداعية، عن السياسة التحريرية ومحتوى عمل ممتد زمنيًا. @ar
label: té com a família directora editorial @ca
definition: Relaciona una obra amb una família que té responsabilitat legal o intel·lectual, però no responsabilitat creativa, de la política editorial i el contingut d’una obra diacrònica. @ca
scope note: S’exclou la revisió, l’aclariment o qualsevol altre canvi del contingut d’una expressió d’una obra. @ca
toolkit label: família directora editorial @ca
toolkit definition: Família que té responsabilitat legal o intel·lectual, però no responsabilitat creativa, de la política editorial i el contingut d’una obra diacrònica. @ca
label: har familie, som er ansvarshavende redaktør @da
definition: Relaterer et værk til en familie, som er juridisk eller intellektuelt ansvarlig, men ikke skabelsesansvarlig, for et diakronisk værks redaktionelle linje og indhold. @da
scope note: Revision, indholdspræcisering eller anden ændring af indholdet af et værks udtryk er ikke omfattet. @da
toolkit label: familie, som er ansvarshavende redaktør @da
toolkit definition: Familie, som er juridisk eller intellektuelt ansvarlig, men ikke skabelsesansvarlig, for et diakronisk værks redaktionelle linje og indhold. @da
label: peatoimetaja (perekond) @et
definition: Seostab teose perekonnaga, kes juriidiliselt või intellektuaalselt, kuid mitte loominguliselt vastutab diakroonilise teose toimetamispõhimõtete ja sisu eest. @et
scope note: Ei hõlma teose väljenduse sisu parandamist, täpsustamist ega muude muudatuste tegemist. @et
toolkit label: peatoimetaja (perekond) @et
toolkit definition: Perekond, kes juriidiliselt või intellektuaalselt, kuid mitte loominguliselt vastutab diakroonilise teose toimetamispõhimõtete ja sisu eest. @et
label: hat Chefredakteurin/Chefredakteur (Familie) @de
definition: Setzt ein Werk in Beziehung zu einer Familie, die die rechtliche oder intellektuelle, aber keine kreative, Verantwortung für die redaktionelle Vorgehensweise und den Inhalt eines diachronen Werks trägt. @de
scope note: Darunter fallen nicht Überarbeitungen, Erläuterungen oder andere inhaltliche Änderungen an einer Expression eines Werks. @de
toolkit label: Chefredakteurin/Chefredakteur (Familie) @de
toolkit definition: Eine Familie, die die rechtliche oder intellektuelle, aber keine kreative, Verantwortung für die redaktionelle Vorgehensweise und den Inhalt eines diachronen Werks trägt. @de
label: főszerkesztő családja a következő: @hu
definition: Hozzákapcsol egy művet egy családhoz, amelynek jogi vagy szellemi, de nem alkotói felelőssége van egy diakronikus mű szerkesztési politikájáért és tartalmáért. @hu
scope note: Nem tartozik bele egy mű kifejezési formájának revíziója, áttekintése, vagy egyéb tartalmi változtatása. @hu
toolkit label: főszerkesztő család: @hu
toolkit definition: Egy család, amelynek jogi vagy szellemi, de nem alkotói felelőssége van egy diakronikus mű szerkesztési politikájáért és tartalmáért. @hu
label: a pour famille directrice de publication @fr
definition: Met une œuvre en relation avec une famille qui a la responsabilité légale ou intellectuelle, mais non la responsabilité créative, de la politique éditoriale et du contenu d’une œuvre diachronique. @fr
scope note: La révision, la clarification ou toute autre modification du contenu d’une expression d’une œuvre sont exclues. @fr
toolkit label: famille directrice de publication @fr
toolkit definition: Famille qui a la responsabilité légale ou intellectuelle, mais non la responsabilité créative, de la politique éditoriale et du contenu d’une œuvre diachronique. @fr
label: galvenais redaktors (dzimta/ģimene) @lv
definition: Sasaista darbu ar dzimtu/ģimeni, kam ir juridiska vai intelektuāla, bet ne radoša atbildība par diahroniskā darba izdošanas politiku un saturu. @lv
toolkit label: galvenais redaktors (dzimta/ģimene) @lv
toolkit definition: Dzimta/ģimene, kam ir juridiska vai intelektuāla, bet ne radoša atbildība par diahroniskā darba izdošanas politiku un saturu. @lv
scope note: Darbība neietver darba izteiksmes satura pārskatīšanu, precizēšanu vai cita veida izmaiņas u.tml. @lv
label: 有主编家族 @zh-hans
definition: 将一种作品与有对一种历时作品的编辑政策和内容的法律或知识责任（但非创作责任）的一个家族关联起来。 @zh-hans
toolkit label: 主编家族 @zh-hans
toolkit definition: 有对一种历时作品的编辑政策和内容的法律或知识责任（但非创作责任）的一个家族 @zh-hans
scope note: 不包括对一种作品的一种内容表达之内容的修订、说明或其他变化。 @zh-hans
has subproperty: P10558
label: yayın yönetmeni ailesi ile ilişkilidir @tr
definition: Bir eseri, artzamanlı bir çalışmanın yayın politikası ve içeriği için yasal veya fikri sorumluluğu olan ancak yaratıcı sorumluluğu olmayan bir aileyle ilişkilendirir. @tr
toolkit label: yayın yönetmeni ailesi @tr
toolkit definition: Bir artzamanlı eserin editöryal politikası ve içeriği üzerinde yasal veya fikri sorumluluğa sahip olan, ancak yaratıcı sorumluluğa sahip olmayan bir aile. @tr
scope note: Bir eserin anlatımının gözden geçirilmesi, netleştirilmesi veya içeriğinin başka bir şekilde değiştirilmesi hariçtir. @tr

has editorial director person
status: Published
lexical alias: editorialDirectorPerson.en
definition: Relates a work to a person who has legal or intellectual responsibility, but not creative responsibility, for the editorial policy and content of a diachronic work.
toolkit label: editorial director person
toolkit definition: A person who has legal or intellectual responsibility, but not creative responsibility, for the editorial policy and content of a diachronic work.
type: Property
domain: C10001
has element type: 2
sub property of: has creator person of work
sub property of: has editorial director agent
scope note: Revision, clarification, or other change of content of an expression of a work is excluded.
label: toimituspäällikkö (henkilö) @fi
definition: Liittää teoksen henkilöön, jolla on juridinen tai tiedollinen vastuu, mutta ei luovaa vastuuta, diakronisen teoksen toimituslinjasta ja sisällöstä. @fi
scope note: Ei kata teoksen ekspression sisällön tarkastamista, selkeyttämistä tai muuta muutosta. @fi
toolkit label: toimituspäällikkö (henkilö) @fi
toolkit definition: Henkilö, jolla on juridinen tai tiedollinen vastuu, mutta ei luovaa vastuuta, diakronisen teoksen toimituslinjasta ja sisällöstä. @fi
label: har redaksjonssjef (person) @no
definition: Relaterer et verk til en person som har juridisk eller intellektuelt ansvar, bortsett fra kreativt ansvar, for det redaksjonelle innholdet i et diakronisk verk. @no
scope note: Å redigere innholdet i et uttrykk av et verk eller gjøre det klarere er ikke inkludert. @no
toolkit label: redaksjonssjef (person) @no
toolkit definition: En person som har juridisk eller intellektuelt ansvar, bortsett fra kreativt ansvar, for det redaksjonelle innholdet i et diakronisk verk. @no
label: heeft hoofdredacteur-persoon @nl
definition: Relateert een werk aan een persoon die wettelijke of intellectuele verantwoordelijkheid, maar niet creatieve verantwoordelijkheid heeft voor het redactioneel beleid en content van een diachronisch werk. @nl
scope note: Herziening, toelichting of andere verandering van content van een expressie van een werk is uitgesloten. @nl
toolkit label: hoofdredacteur-persoon @nl
toolkit definition: Een persoon die wettelijke of intellectuele verantwoordelijkheid, maar niet creatieve verantwoordelijkheid heeft voor het redactioneel beleid en content van een diachronisch werk. @nl
label: له شخص مدير تحرير @ar
definition: يربط بين عمل وشخص يتحمل مسئولية قانونية أو فكرية، ولكن لا يتحمل مسئولية إبداعية، عن السياسة التحريرية ومحتوى عمل ممتد زمنيًا. @ar
scope note: تُستبعد مراجعة محتوى تعبيرة لعمل، أو توضيحه، أو أي تغيير آخر فيه. @ar
toolkit label: شخص مدير تحرير @ar
toolkit definition: شخص يتحمل مسئولية قانونية أو فكرية، ولكن لا يتحمل مسئولية إبداعية، عن السياسة التحريرية ومحتوى عمل ممتد زمنيًا. @ar
label: té com a persona directora editorial @ca
definition: Relaciona una obra amb una persona que té responsabilitat legal o intel·lectual, però no responsabilitat creativa, de la política editorial i el contingut d’una obra diacrònica. @ca
scope note: S’exclou la revisió, l’aclariment o qualsevol altre canvi del contingut d’una expressió d’una obra. @ca
toolkit label: persona directora editorial @ca
toolkit definition: Persona que té responsabilitat legal o intel·lectual, però no responsabilitat creativa, de la política editorial i el contingut d’una obra diacrònica. @ca
label: har person, som er ansvarshavende redaktør @da
definition: Relaterer et værk til en person, som er juridisk eller intellektuelt ansvarlig, men ikke skabelsesansvarlig, for et diakronisk værks redaktionelle linje og indhold. @da
scope note: Revision, indholdspræcisering eller anden ændring af indholdet af et værks udtryk er ikke omfattet. @da
toolkit label: person, som er ansvarshavende redaktør @da
toolkit definition: Person, som er juridisk eller intellektuelt ansvarlig, men ikke skabelsesansvarlig, for et diakronisk værks redaktionelle linje og indhold. @da
label: peatoimetaja (isik) @et
definition: Seostab teose isikuga, kes juriidiliselt või intellektuaalselt, kuid mitte loominguliselt vastutab diakroonilise teose toimetamispõhimõtete ja sisu eest. @et
scope note: Ei hõlma teose väljenduse sisu parandamist, täpsustamist ega muude muudatuste tegemist. @et
toolkit label: peatoimetaja (isik) @et
toolkit definition: Isik, kes juriidiliselt või intellektuaalselt, kuid mitte loominguliselt vastutab diakroonilise teose toimetamispõhimõtete ja sisu eest. @et
label: hat Chefredakteurin/Chefredakteur (Person) @de
definition: Setzt ein Werk in Beziehung zu einer Person, die die rechtliche oder intellektuelle, aber keine kreative, Verantwortung für die redaktionelle Vorgehensweise und den Inhalt eines diachronen Werks trägt. @de
scope note: Darunter fallen nicht Überarbeitungen, Erläuterungen oder andere inhaltliche Änderungen an einer Expression eines Werks. @de
toolkit label: Chefredakteurin/Chefredakteur (Person) @de
toolkit definition: Eine Person, die die rechtliche oder intellektuelle, aber keine kreative, Verantwortung für die redaktionelle Vorgehensweise und den Inhalt eines diachronen Werks trägt. @de
label: főszerkesztő személye a következő: @hu
definition: Hozzákapcsol egy művet egy személyhez, akinek jogi vagy szellemi, de nem alkotói felelőssége van egy diakronikus mű szerkesztési politikájáért és tartalmáért. @hu
scope note: Nem tartozik bele egy mű kifejezési formájának revíziója, áttekintése, vagy egyéb tartalmi változtatása. @hu
toolkit label: főszerkesztő személy: @hu
toolkit definition: Egy személy, akinek jogi vagy szellemi, de nem alkotói felelőssége van egy diakronikus mű szerkesztési politikájáért és tartalmáért. @hu
label: ha come direttore editoriale persona @it
definition: Correla un'opera a una persona che ha la responsabilità legale o intellettuale, ma non quella creativa, per la politica editoriale e i contenuti di un’opera diacronica. @it
scope note: Sono esclusi revisione, chiarimenti o altre modifiche al contenuto di un'espressione di un'opera. @it
toolkit label: direttore editoriale persona @it
toolkit definition: Persona che ha la responsabilità legale o intellettuale, ma non creativa, per le politica editoriale e i contenuti di un'opera diacronica. @it
label: a pour personne directrice de publication @fr
definition: Met une œuvre en relation avec une personne qui a la responsabilité légale ou intellectuelle, mais non la responsabilité créative, de la politique éditoriale et du contenu d’une œuvre diachronique. @fr
scope note: La révision, la clarification ou toute autre modification du contenu d’une expression d’une œuvre sont exclues. @fr
toolkit label: personne directrice de publication @fr
toolkit definition: Personne qui a la responsabilité légale ou intellectuelle, mais non la responsabilité créative, de la politique éditoriale et du contenu d’une œuvre diachronique. @fr
label: galvenais redaktors (persona) @lv
definition: Sasaista darbu ar personu, kurai ir juridiska vai intelektuāla, bet ne radoša atbildība par diahroniskā darba izdošanas politiku un saturu. @lv
toolkit label: galvenais redaktors (persona) @lv
toolkit definition: Persona, kurai ir juridiska vai intelektuāla, bet ne radoša atbildība par diahroniskā darba izdošanas politiku un saturu. @lv
scope note: Darbība neietver darba izteiksmes satura pārskatīšanu, precizēšanu vai cita veida izmaiņas u.tml. @lv
label: 有主编个人 @zh-hans
definition: 将一种作品与有对一种历时作品的编辑政策和内容的法律或知识责任（但非创作责任）的一个个人关联起来。 @zh-hans
toolkit label: 主编个人 @zh-hans
toolkit definition: 有对一种历时作品的编辑政策和内容的法律或知识责任（但非创作责任）的一个个人 @zh-hans
scope note: 不包括对一种作品的一种内容表达之内容的修订、说明或其他变化。 @zh-hans
has subproperty: P10417
label: yayın yönetmeni kişisi ile ilişkilidir @tr
definition: Bir eseri, artzamanlı bir eserin yayın politikası ve içeriği için yasal veya fikri sorumluluğu olan ancak yaratıcı sorumluluğu olmayan kişi ile ilişkilendirir. @tr

has whole-part work relationship with (Deprecated)
status: Deprecated
type: Property
domain: C10001
definition: Relates a work to a work that is contained in or contains a related work. (Deprecated)
scope note: Parts of works include discrete components such as subseries, and individual poems, stories, or essays in a collection or anthology.
lexical alias: wholePartWorkRelationship.en
toolkit label: whole-part work relationship (Deprecated)
toolkit definition: A work that is contained in or contains a related work. (Deprecated)
toolkit label: relation d’œuvre tout-partie @fr
toolkit definition: Œuvre qui contient ou est contenue dans une autre œuvre. @fr
sub property of: has related work of work
toolkit label: relación de la obra todo-parte @es
toolkit definition: Una obra que es incluida en, o contiene la obra. @es
instruction number: 24.5
label: har helhed-del-værkrelation med @da
definition: Relaterer et værk til et værk der indgår i, eller indeholder et værk. @da
scope note: Dele af værker inkluderer separate bestanddele som fx underserier og individuelle digte, historier eller essays i en samling eller antologi. @da
toolkit label: helhed-del-værkrelation @da
toolkit definition: Værk der indgår i, eller indeholder et værk. @da
definition: Met une œuvre en relation avec une œuvre qui contient ou est contenue dans une autre œuvre. @fr
label: có mối quan hệ tác phẩm phần toàn bộ với @vi
definition: Liên kết tác phẩm với tác phẩm được chứa trong hoặc chứa tác phẩm khác. @vi
scope note: Phần của tác phẩm bao gồm bộ phận cấu thành tách biệt như là tiểu tùng thư, và bài thơ, câu chuyện riêng rẽ, hoặc bài tiểu luận trong bộ sưu tập hoặc hợp tuyển. @vi
toolkit label: mối quan hệ tác phẩm phần toàn bộ @vi
toolkit definition: Tác phẩm được chứa trong hoặc chứa tác phẩm khác. @vi
label: hat Teil-Ganzes-Beziehung auf Werkebene @de
definition: Setzt ein Werk mit einem Werk, das in einem anderen Werk enthalten ist oder ein anderes Werk enthält, in Beziehung. @de
scope note: Dazu gehören separate Bestandteile wie z. B. Unterreihen, einzelne Gedichte, Geschichten oder Essays in einer Sammlung oder Anthologie. @de
toolkit label: Teil-Ganzes-Beziehung auf Werkebene @de
toolkit definition: Ein Werk, das in einem anderen Werk enthalten ist oder ein anderes Werk enthält. @de
label: a pour relation d’œuvre tout-partie @fr
label: teoksen osa-kokonaisuussuhde @fi
definition: Liittää teoksen teokseen, joka sisältyy toiseen teokseen tai sisältää toisen teoksen. @fi
toolkit label: teoksen osa-kokonaisuussuhde @fi
toolkit definition: Teos, joka sisältyy toiseen teokseen tai sisältää toisen teoksen. Teoksen osat ovat itsenäisiä osia, kuten alasarjat, tai yksittäisiä kokoelmaan tai antologiaan sisältyviä runoja, tarinoita tai esseitä. @fi
toolkit label: relasjonstypen hel/del av verk @no
toolkit definition: Et verk som omfattes av eller selv omfatter et annet verk. @no
label: té com a relació d’obra tot-part @ca
definition: Relaciona una obra amb una obra que és continguda o conté una altra obra. @ca
scope note: Les parts d’obres inclouen components discrets com ara subcol·leccions, i poemes individuals, narracions o assaigs en una col·lecció o una antologia. @ca
toolkit label: relació d’obra tot-part @ca
toolkit definition: Obra que és continguda o conté una altra obra. @ca
scope note: Les parties d’œuvres comprennent les composantes distinctes telles que les sous-collections ainsi que les poèmes, les nouvelles ou les essais individuels dans un recueil ou une anthologie. @fr
has element type: 2
label: έχει σχέση συνόλου-τμήματος έργου με @el
definition: Συνδέει ένα έργο με ένα έργο το οποίο περιέχεται σε ή περιέχει ένα άλλο έργο. @el
scope note: Τα μέρη του έργου περιλαμβάνουν διακριτά συστατικά, όπως υποσειρές και μεμονωμένα ποιήματα, ιστορίες ή δοκίμια σε μια συλλογή ή ανθολογία. @el
toolkit label: σχέση συνόλου-τμήματος έργου με @el
toolkit definition: Ένα έργο το οποίο περιέχεται σε ή περιέχει ένα άλλο έργο. @el
label: van egész-rész műkapcsolata @hu
definition: Egy művet hozzákapcsol egy műhöz, amelyet egy másik mű tartalmaz, vagy amely egy másik művet tartalmaz. @hu
scope note: Műrészek magukba foglalják az olyan megkülönböztethető komponenseket, mint az alsorozat, egyedi költemények, történetek, sztorik, vagy egy gyűjtemény vagy antológia esszéi. @hu
toolkit label: egész-rész műkapcsolata @hu
toolkit definition: Egy mű, amelyet egy másik mű tartalmaz, vagy amely egy másik művet tartalmaz. @hu
has subproperty: P10232

has declination
status: Published
type: Property
lexical alias: declination.en
definition: Relates a work to the angular distance of a celestial body that is measured north or south through 90° from the celestial equator along the hour circle through the body.
domain: C10001
toolkit label: declination
toolkit definition: The angular distance of a celestial body that is measured north or south through 90° from the celestial equator along the hour circle through the body.
instruction number: 7.4.4
label: har deklination @da
definition: Relaterer et værk til en vinkelafstand til et himmellegeme målt nord eller syd gennem 90° fra himmelækvator langs himmellegemets timekrans. @da
toolkit label: deklination @da
toolkit definition: Vinkelafstand til et himmellegeme målt nord eller syd gennem 90° fra himmelækvator langs himmellegemets timekrans. @da
label: có độ lệch @vi
definition: Liên kết tác phẩm với khoảng cách góc tới vật thể trên không gian bầu trời được đo theo hướng bắc hoặc nam qua 90° từ xích đạo bầu trời dọc theo vòng cung giờ của vật thể. @vi
toolkit label: độ lệch @vi
toolkit definition: Khoảng cách góc tới vật thể trên không gian bầu trời được đo theo hướng bắc hoặc nam qua 90° từ xích đạo bầu trời dọc theo vòng cung giờ của vật thể. @vi
label: hat Deklination @de
definition: Setzt ein Werk in Beziehung zu dem Winkelabstand eines Himmelskörpers zwischen dem Frühlingspunkt und dem Längenkreis, der auf der Äquatorebene gegen den Uhrzeigersinn gemessen und in einem Maß von 0 bis 24 Stunden angegeben wird. @de
toolkit label: Deklination @de
toolkit definition: Der Winkelabstand eines Himmelskörpers zwischen dem Frühlingspunkt und dem Längenkreis, der auf der Äquatorebene gegen den Uhrzeigersinn gemessen und in einem Maß von 0 bis 24 Stunden angegeben wird. @de
definition: Liittää teoksen taivaankappaleen kulmaetäisyyteen, joka on mitattu taivaanekvaattorista pohjoiseen tai etelään 90°:een läpi kappaleen tuntiympyrää pitkin. @fi
toolkit label: deklinaatio @fi
toolkit definition: Taivaankappaleen kulmaetäisyys, joka on mitattu taivaanekvaattorista pohjoiseen tai etelään 90°:een läpi kappaleen tuntiympyrää pitkin. @fi
toolkit label: deklinasjon @no
toolkit definition: En vinkelavstand til et himmellegeme i astrosfæren målt nord eller sør til og med 90° fra himmelekvator langs himmellegemets timesirkel. @no
label: té com a declinació @ca
definition: Relaciona una obra amb la distància angular d’un cos celeste que es mesura al nord o al sud a 90º de l’equador celeste al llarg del cercle horari passant pel cos. @ca
toolkit label: declinació @ca
toolkit definition: La distància angular d’un cos celeste que es mesura al nord o al sud a 90º de l’equador celeste al llarg del cercle horari passant pel cos. @ca
label: a pour déclinaison @fr
definition: Met une œuvre en relation avec une distance angulaire d’un corps céleste qui est mesurée au nord ou au sud à 90° de l’équateur céleste le long du cercle horaire passant par le corps. @fr
toolkit label: déclinaison @fr
toolkit definition: Distance angulaire d’un corps céleste qui est mesurée au nord ou au sud à 90° de l’équateur céleste le long du cercle horaire passant par le corps. @fr
has element type: 6
label: έχει απόκλιση @el
definition: Συνδέει ένα έργο με μια γωνιακή απόσταση προς ένα σώμα στην ουράνια σφαίρα, η οποία μετριέται βόρεια ή νότια σε 90° από τον ουράνιο ισημερινό μέχρι τον ωρικό κύκλο του σώματος. @el
toolkit label: απόκλιση @el
toolkit definition: Μια γωνιακή απόσταση προς ένα σώμα στην ουράνια σφαίρα η οποία μετριέται βόρεια ή νότια σε 90° από τον ουράνιο ισημερινό μέχρι τον ωρικό κύκλο του σώματος. @el
label: deklinációja a következő: @hu
definition: Hozzákapcsol egy művet az égi egyenlítőtől az éggömbön lévő égitesthez 90°-ban északra vagy délre mért szögtávolsághoz az égitest óraköre mentén. @hu
toolkit label: deklinációja: @hu
toolkit definition: Az égi egyenlítőtől az éggömbön lévő égitesthez 90°-ban északra vagy délre mért szögtávolság az égitest óraköre mentén. @hu
label: deklinaatio @fi
label: har deklinasjon @no
definition: Relaterer et verk til en vinkelavstand til et himmellegeme i astrosfæren målt nord eller sør til og med 90° fra himmelekvator langs himmellegemets timesirkel. @no
label: heeft declinatie @nl
definition: Relateert een werk aan de hoekafstand van een hemellichaam dat is gemeten noord of zuid door 90° van de hemelevenaar langs de uurcirkel door het lichaam. @nl
toolkit label: declinatie @nl
toolkit definition: De hoekafstand van een hemellichaam dat is gemeten noord of zuid door 90° van de hemelevenaar langs de uurcirkel door het lichaam. @nl
label: له زاوية ميل أو انحراف @ar
definition: يربط بين عمل ومسافة زاوية لجرم سماوي مقاسة شمالًا أو جنوبًا خلال 90 درجة من خط الاستواء السماوي على طول دائرة ساعة الجرم السماوي. @ar
toolkit label: زاوية ميل أو انحراف @ar
toolkit definition: مسافة زاوية لجرم سماوي مقاسة شمالًا أو جنوبًا خلال 90 درجة من خط الاستواء السماوي على طول دائرة ساعة الجرم السماوي. @ar
label: kääne @et
definition: Seostab teose taevakeha nurkkaugusega, mis on mõõdetud kuni 90° taevaekvaatorist põhja või lõuna suunas mööda taevakeha käänderingi. @et
toolkit label: kääne @et
toolkit definition: Taevakeha nurkkaugus, mis on mõõdetud kuni 90° taevaekvaatorist põhja või lõuna suunas mööda taevakeha käänderingi. @et
label: ha come declinazione @it
definition: Correla un’opera a una distanza angolare di un corpo nella sfera celeste misurata a 90° a Nord o a Sud dell’equatore celeste lungo il circolo orario. @it
toolkit label: declinazione @it
toolkit definition: Distanza angolare di un corpo nella sfera celeste misurata a 90° a Nord o a Sud dell’equatore celeste lungo il circolo orario. @it
label: deklinācija @lv
definition: Sasaista darbu ar ekvatoriālā koordinātēm jeb skaitli, kas raksturo debess sfēras punkta leņķisko (no 0 līdz 90) attālumu no debess ekvatora sfēras punkta uz ziemeļiem vai dienvidiem pulksteņrādītāja kustības virzienā. (ģeogr. vārdn.). @lv
toolkit label: deklinācija @lv
toolkit definition: Ekvatoriālā koordināta jeb skaitlis, kas raksturo debess sfēras punkta leņķisko (no 0 līdz 90) attālumu no debess ekvatora sfēras punkta uz ziemeļiem vai dienvidiem pulksteņrādītāja kustības virzienā. (ģeogr. vārdn.) @lv
label: 有赤纬 @zh-hans
definition: 将一种作品与从天球赤道沿天体时圈通过90度向北或向南度量的角距离关联起来。 @zh-hans
toolkit label: 赤纬 @zh-hans
toolkit definition: 从天球赤道沿天体时圈通过90度向北或向南度量的角距离 @zh-hans
has subproperty: P10303
label: eğim ile ilişkilidir @tr
definition: Bir eseri, gök cisminden geçen saat dairesi boyunca gök ekvatorundan 90° ile kuzeye veya güneye ölçülen bir gök cisminin açısal mesafesi ile ilişkilendirir. @tr
toolkit label: eğim @tr
toolkit definition: Bir cismin içinden geçen saat dairesi boyunca gök ekvatorundan 90° ile kuzeye veya güneye ölçülen bir gök cisminin açısal mesafesi. @tr

has praeses
status: Published
definition: Relates a work to a person who is a faculty moderator of an academic disputation, normally proposing a thesis and participating in the ensuing disputation.
type: Property
domain: C10001
sub property of: has creator person of work
lexical alias: praeses.en
toolkit label: praeses
toolkit definition: A person who is a faculty moderator of an academic disputation, normally proposing a thesis and participating in the ensuing disputation.
toolkit definition: Personne qui préside une disputation académique et qui, normalement, propose une thèse et participe au débat qui s’ensuit. @fr
toolkit label: moderador académico @es
toolkit definition: Una persona del profesorado que actúa como árbitro de la facultad en un debate académico, normalmente proponiendo una tesis y participando en el debate consiguiente. @es
instruction number: 18.5
label: har præses @da
definition: Relaterer et værk til en person, som er fakultetsordstyrer for en akademisk disputation, normalt ved at fremsætte en tese og deltage i den efterfølgende disputation. @da
toolkit label: præses @da
toolkit definition: Person, som er fakultetsordstyrer for en akademisk disputation, normalt ved at fremsætte en tese og deltage i den efterfølgende disputation. @da
definition: Met une œuvre en relation avec une personne qui préside une disputation académique et qui, normalement, propose une thèse et participe au débat qui s’ensuit. @fr
label: có chủ tịch hội đông @vi
definition: Liên kết tác phẩm với cá nhân là người điều hành cuộc thảo luận học thuật, thường đưa ra luận đề và tham dự cuộc thảo luận kế tiếp. @vi
toolkit label: chủ tịch hội đông @vi
toolkit definition: Cá nhân là người điều hành cuộc thảo luận học thuật, thường đưa ra luận đề và tham dự cuộc thảo luận kế tiếp. @vi
label: hat Praeses @de
definition: Setzt ein Werk in Beziehung zu einer Person, die auf Fakultätsseite eine akademische Disputation moderiert, normalerweise eine These vorschlägt und an der sich daraus ergebenden Disputation teilnimmt. @de
toolkit label: Praeses @de
toolkit definition: Eine Person, die auf Fakultätsseite eine akademische Disputation moderiert, normalerweise eine These vorschlägt und an der sich daraus ergebenden Disputation teilnimmt. @de
label: a pour praeses @fr
definition: Liittää teoksen henkilöön, joka on akateemisen väitöstilaisuuden puheenjohtaja ja joka yleensä esittelee väitöskirjan tiedekunnan edustajana sekä osallistuu siitä käytävään keskusteluun. @fi
toolkit label: preeses @fi
toolkit definition: Henkilö, joka on akateemisen väitöstilaisuuden puheenjohtaja ja joka yleensä esittelee väitöskirjan tiedekunnan edustajana sekä osallistuu siitä käytävään keskusteluun. @fi
toolkit label: preses @no
toolkit definition: En person som er fakultetets ordstyrer i en akademisk disputas og som vanligvis foreslår en avhandling og deltar i den påfølgende disputasen. @no
label: té com a praeses @ca
definition: Relaciona una obra amb una persona que és un moderador d’una disputa acadèmica; normalment proposa una tesi i participa en el debat subsegüent. @ca
toolkit definition: Persona que és un moderador d’una disputa acadèmica; normalment proposa una tesi i participa en el debat subsegüent. @ca
has element type: 2
label: έχει επόπτη @el
definition: Συνδέει ένα έργο με ένα φυσικό πρόσωπο, το οποίο είναι επόπτης σχολής/τομέα μιας ακαδημαϊκής διατριβής και ο οποίος συνήθως προτείνει ένα θέμα και συμμετέχει στην εκπόνηση της διατριβής. @el
toolkit label: επόπτης @el
toolkit definition: Ένα φυσικό πρόσωπο, το οποίο είναι επόπτης σχολής/τομέα σε μια ακαδημαϊκή διατριβή και ο οποίος συνήθως προτείνει ένα θέμα και συμμετέχει στην εκπόνηση της διατριβής. @el
label: elnöke a következő: @hu
definition: Hozzákapcsol egy művet egy személyhez, aki egy tudományos vita kari moderátora, aki szokásos módon előterjeszt egy értekezést és részt vesz az azt követő vitában. @hu
toolkit label: elnök: @hu
toolkit definition: Egy személy, aki egy tudományos vita kari moderátora, aki szokásos módon előterjeszt egy értekezést és részt vesz az azt követő vitában. @hu
label: preeses @fi
label: har preses @no
definition: Relaterer et verk til en person som er fakultetets ordstyrer i en akademisk disputas og som vanligvis foreslår en avhandling og deltar i den påfølgende disputasen. @no
label: heeft preses @nl
definition: Relateert een werk aan een persoon die een faculteitsmoderator van een academische disputatie is, gewoonlijk een stelling voorstellend en deelnemend in het daaropvolgende dispuut. @nl
toolkit definition: Een persoon die een faculteitsmoderator van een academische disputatie is, gewoonlijk een stelling voorstellend en deelnemend in het daaropvolgende dispuut. @nl
label: له رئيس جلسة @ar
definition: يربط بين عمل وشخص يكون مشرفا في هيئة تدريس في مناظرة أكاديمية، وعادة ما يقترح أطروحة ويشارك في المناظرة المترتبة عليها. @ar
toolkit label: رئيس جلسة @ar
toolkit definition: شخص يكون مشرفا في هيئة تدريس في مناظرة أكاديمية، وعادة ما يقترح أطروحة ويشارك في المناظرة المترتبة عليها. @ar
label: praeses @et
definition: Seostab teose isikuga, kes teaduskonna väitlusjuhina juhatab akadeemilist väitluskoosolekut, tavaliselt esitledes väitekirja ning osaledes järgnevas väitluses. @et
toolkit definition: Isik, kes teaduskonna väitlusjuhina juhatab akadeemilist väitluskoosolekut, tavaliselt esitledes väitekirja ning osaledes järgnevas väitluses. @et
alternative label: Präses @de
label: ha come relatore @it
definition: Correla un’opera a una persona con funzione di moderatore nell'ambito di una disputa accademica, il quale normalmente propone una tesi e partecipa alla discussione che ne deriva. @it
toolkit label: relatore @it
toolkit definition: Persona con funzione di moderatore nell'ambito di una disputa accademica, il quale normalmente propone una tesi e partecipa alla discussione che ne deriva. @it
label: akadēmiskā disputa vadītājs @lv
definition: Sasaista darbu ar personu, kura ir fakultātes moderators akadēmiskajā disputā, parasti piedāvā tematu un piedalās turpmākajā diskusijā. @lv
toolkit label: akadēmiskā disputa vadītājs @lv
toolkit definition: Persona, kura ir fakultātes moderators akadēmiskajā disputā, parasti piedāvā tematu un piedalās turpmākajā diskusijā. @lv
label: 有评审人 @zh-hans
definition: 将一种作品与作为学术辩论的主持教师（通常是提出一个论题并参与后续的辩论）的一个个人关联起来。 @zh-hans
toolkit label: 评审人 @zh-hans
toolkit definition: 作为学术辩论的主持教师（通常是提出一个论题并参与后续的辩论）的一个个人 @zh-hans
has subproperty: P10045
label: danışman ile ilişkilidir @tr
definition: Bir eseri, akademik bir tartışmanın fakülte moderatörü olan, normalde bir tez öneren ve ardından gelen tartışmaya katılan bir kişiyle ilişkilendirir. @tr
toolkit label: danışman @tr
toolkit definition: Akademik bir tartışmanın fakülte moderatörü olan, normalde bir tez öneren ve ardından gelen tartışmaya katılan bir kişi. @tr

is prequel to (Deprecated)
status: Deprecated
definition: Relates a work to a work whose narrative is extended backwards in time by a later work. (Deprecated)
type: Property
domain: C10001
sub property of: is succeeded by work
lexical alias: prequelTo.en
toolkit label: prequel to (Deprecated)
toolkit definition: A work whose narrative is extended backwards in time by a later work. (Deprecated)
toolkit label: antépisode de @fr
toolkit definition: Œuvre dont le récit est étendu sur une période plus ancienne dans le temps par une œuvre ultérieure. @fr
toolkit label: precuela de @es
toolkit definition: Una obra cuya narración se extiende hacia atrás en el tiempo por una obra posterior. @es
instruction number: 24.5
label: er forhistorie til (værk) @da
definition: Relaterer et værk til et værk, hvis fortælling udvides bagud i tid af et senere værk. @da
toolkit label: forhistorie til @da
toolkit definition: Værk, hvis fortælling udvides bagud i tid af et senere værk. @da
definition: Met une œuvre en relation avec une œuvre dont le récit est étendu sur une période plus ancienne dans le temps par une œuvre ultérieure. @fr
label: là mở rộng của (tác phẩm) @vi
definition: Liên kết tác phẩm với tác phẩm mà câu chuyện kể được mở rộng ngược lại theo thời gian bởi tác phẩm sau này. @vi
toolkit label: mở rộng của (tác phẩm) @vi
toolkit definition: Tác phẩm mà câu chuyện kể được mở rộng ngược lại theo thời gian bởi tác phẩm sau này. @vi
label: ist Prequel zu @de
definition: Setzt ein Werk mit einem Werk, dessen Erzählungstrang zeitlich rückwärts durch ein späteres Werk erweitert wird, in Beziehung. @de
toolkit label: Prequel zu @de
toolkit definition: Ein Werk, dessen Erzählungstrang zeitlich rückwärts durch ein späteres Werk erweitert wird. @de
label: est un antépisode de @fr
label: esiosa teokselle @fi
definition: Liittää teoksen aikaisempaan teokseen, jota myöhempi teos juonellisesti edeltää. @fi
toolkit label: esiosa teokselle @fi
toolkit definition: Teos, jota myöhempi teos juonellisesti edeltää. @fi
toolkit definition: Et verk hvis historie fortsettes bakover i tid i et senere verk. @no
label: és preqüela de @ca
definition: Relaciona una obra amb una obra el contingut narratiu de la qual una obra posterior amplia cap enrere en el temps. @ca
toolkit label: preqüela de @ca
toolkit definition: Obra el contingut narratiu de la qual una obra posterior amplia cap enrere en el temps. @ca
has element type: 2
label: είναι προοίμιο του @el
definition: Συνδέει ένα έργο με ένα έργο το οποίο επεκτείνει την αφήγηση ενός μεταγενέστερου έργου προς τα πίσω στον χρόνο. @el
toolkit label: προοίμιο του @el
toolkit definition: Ένα έργο το οποίο επεκτείνει την αφήγηση ενός μεταγενέστερου έργου προς τα πίσω στον χρόνο. @el
label: előzménye @hu
definition: Egy művet hozzákapcsol egy műhöz, amelynek narratíváját egy későbbi mű időben visszafelé kiterjesztette. @hu
toolkit label: előzménye @hu
toolkit definition: Egy mű, amelynek narratíváját egy későbbi mű időben visszafelé kiterjeszti. @hu
has subproperty: P10195

is evaluation of RDA entity
status: Published
lexical alias: evaluationOfRDAEntity.en
definition: Relates a work to an RDA entity that is examined or judged by a work.
toolkit label: evaluation of RDA entity
toolkit definition: An RDA entity that is examined or judged by a work.
type: Property
domain: C10001
has element type: 2
sub property of: has subject RDA entity
label: arviointi RDA-entiteetistä @fi
definition: Liittää teoksen RDA-entiteettiin, jota on tutkittu tai arvioitu. @fi
toolkit label: arviointi RDA-entiteetistä @fi
toolkit definition: RDA-entiteetti, jota on tutkittu tai arvioitu. @fi
label: er evaluering av RDA-entitet @no
definition: Relaterer et verk til en RDA-entitet som er utforsket eller vurdert. @no
toolkit label: evaluering av RDA-entitet @no
toolkit definition: En RDA-entitet som er utforsket eller vurdert. @no
label: is beschouwing van RDA-entiteit @nl
definition: Relateert een werk aan een RDA-entiteit die onderzocht of beoordeeld wordt. @nl
toolkit label: beschouwing van RDA-entiteit @nl
toolkit definition: Een RDA-entiteit die onderzocht of beoordeeld wordt. @nl
label: هو تقييم لكيان "وام" @ar
definition: يربط بين عمل وكيان "وام" الذي يتم فحصه أو الحكم عليه. @ar
toolkit label: تقييم لكيان "وام" @ar
toolkit definition: كيان "وام" الذي يتم فحصه أو الحكم عليه. @ar
label: és avaluació d’una entitat RDA @ca
definition: Relaciona una obra amb una entitat RDA que és examinada o jutjada per una obra. @ca
toolkit label: avaluació d’una entitat RDA @ca
toolkit definition: Entitat RDA que és examinada o jutjada per una obra. @ca
label: er evaluering af RDA-entitet @da
definition: Relaterer et værk til en RDA-entitet, som er undersøgt eller bedømt. @da
toolkit label: evaluering af RDA-entitet @da
toolkit definition: RDA-entitet, som er undersøgt eller bedømt. @da
label: hinnang RDA olemile @et
definition: Seostab teose RDA olemiga, mida on kontrollitud või hinnatud. @et
toolkit label: hinnang RDA olemile @et
toolkit definition: RDA olem, mida on kontrollitud või hinnatud. @et
label: ist Evaluierung von (RDA-Entität) @de
definition: Setzt ein Werk in Beziehung zu einer RDA-Entität, die untersucht oder beurteilt wird. @de
toolkit label: Evaluierung von (RDA-Entität) @de
toolkit definition: Eine RDA-Entität, die untersucht oder beurteilt wird. @de
label: értékelése a következő RDA-entitásnak: @hu
definition: Hozzákapcsol egy művet egy RDA-entitáshoz, amelyet elemeznek és megítélnek. @hu
toolkit label: értékelt RDA-entitás @hu
toolkit definition: Egy RDA-entitás, amelyet elemeznek és megítélnek. @hu
label: è valutazione di entità RDA @it
definition: Correla un’opera a un’entità RDA che è esaminata o valutata. @it
toolkit label: valutazione di entità RDA @it
toolkit definition: Entità RDA che è esaminata o valutata. @it
label: est une évaluation d’une entité RDA @fr
definition: Met une œuvre en relation avec une entité RDA qui est examinée ou jugée par une œuvre. @fr
toolkit label: évaluation d’une entité RDA @fr
toolkit definition: Entité RDA qui est examinée ou jugée par une œuvre. @fr
label: ir novērtējums RDA entītei @lv
definition: Sasaista darbu ar RDA entīti, kas tiek pārbaudīta vai vērtēta. @lv
toolkit label: novērtējums RDA entītei @lv
toolkit definition: RDA entīte, kas tiek pārbaudīta vai vērtēta. @lv
label: 是RDA实体的评价 @zh-hans
definition: 将一种作品与被一种作品检查或评判的一种RDA实体关联起来。 @zh-hans
toolkit label: RDA实体的评价 @zh-hans
toolkit definition: 被一种作品检查或评判的一种RDA实体 @zh-hans
has subproperty: is critique of RDA entity
has subproperty: is review of RDA entity
has subproperty: P10361
label: RDA varlığının değerlendirmesidir @tr
definition: Bir eseri, bir eser tarafından incelenen veya yargılanan bir RDA varlığıyla ilişkilendirir. @tr
toolkit label: RDA varlığının değerlendirilmesi @tr
toolkit definition: Bir eser tarafından incelenen veya değerlendirilen bir RDA varlığı. @tr

has extension plan
status: Published
lexical alias: extensionPlan.en
definition: Relates a work to a categorization that reflects an intention to extend the content of a work.
toolkit label: extension plan
toolkit definition: A categorization that reflects an intention to extend the content of a work.
type: Property
domain: C10001
has element type: 4
label: laajennussuunnitelma @fi
definition: Liittää teoksen luokitukseen, joka kuvastaa aikomusta laajentaa teoksen sisältöä. @fi
toolkit label: laajennussuunnitelma @fi
toolkit definition: Luokitus, joka kuvastaa aikomusta laajentaa teoksen sisältöä. @fi
label: har utvidelsesplan @no
definition: Relaterer et verk til en kategorisering som viser en intensjon om utvidelse av innholdet av et verk. @no
toolkit label: utvidelsesplan @no
toolkit definition: En kategorisering som viser en intensjon om utvidelse av innholdet av et verk. @no
label: heeft extensieplan @nl
definition: Relateert een werk aan een categorisatie die een intentie weergeeft om de content van een werk voort te zetten. @nl
toolkit label: extensieplan @nl
toolkit definition: Een categorisatie die een intentie weergeeft om de content van een werk voort te zetten. @nl
label: له خطة توسع @ar
definition: يربط بين عمل وتصنيف يعكس توجها نحو توسيع محتوى عمل. @ar
toolkit label: خطة توسع @ar
toolkit definition: تصنيف يعكس توجها نحو توسيع محتوى عمل. @ar
label: té com a pla d’extensió @ca
definition: Relaciona una obra amb una categorització que reflecteix una intenció d’ampliar el contingut d’una obra. @ca
toolkit label: pla d’extensió @ca
toolkit definition: Categorització que reflecteix una intenció d’ampliar el contingut d’una obra. @ca
label: har udvidelsesplan @da
definition: Relaterer et værk til en kategorisering, som afspejler en intention om udvidelse af et værks indhold. @da
toolkit label: udvidelsesplan @da
toolkit definition: Kategorisering, som afspejler en intention om udvidelse af et værks indhold. @da
label: jätkamiskava @et
definition: Seostab teose kategooriaga, mis väljendab kavatsust laiendada teose sisu. @et
toolkit label: jätkamiskava @et
toolkit definition: Kategooria, mis väljendab kavatsust laiendada teose sisu. @et
label: hat Erweiterungsplan @de
definition: Setzt ein Werk in Beziehung zu einer Kategorisierung, die die Absicht widerspiegelt, den Inhalt eines Werks zu erweitern. @de
toolkit label: Erweiterungsplan @de
toolkit definition: Eine Kategorisierung, die die Absicht widerspiegelt, den Inhalt eines Werks zu erweitern. @de
label: közzétételi terve a következő: @hu
definition: Hozzákapcsol egy művet egy kategorizáláshoz, amely tükröz egy mű tartalmának közzétételére vonatkozó szándékot. @hu
toolkit label: közzétételi terve: @hu
toolkit definition: Egy kategorizálás, amely tükröz egy mű tartalmának közzétételére vonatkozó szándékot. @hu
label: ha come piano di ampliamento @it
definition: Correla un’opera a una categorizzazione che riflette una intenzione di estendere il contenuto di un’opera. @it
toolkit label: piano di ampliamento @it
toolkit definition: Categorizzazione che riflette una intenzione di estendere il contenuto di un’opera. @it
label: a pour plan d’extension @fr
definition: Met une œuvre en relation avec une catégorisation qui indique une intention d’élargir le contenu d’une œuvre. @fr
toolkit label: plan d’extension @fr
toolkit definition: Catégorisation qui indique une intention d’élargir le contenu d’une œuvre. @fr
label: paplašināšanas plāns @lv
definition: Sasaista darbu ar apzīmējumu, kas atspoguļo nodomu paplašināt darba saturu. @lv
toolkit label: paplašināšanas plāns @lv
toolkit definition: Apzīmējums, kas atspoguļo nodomu paplašināt darba saturu. @lv
label: 有扩充计划 @zh-hans
definition: 将一种作品与反映扩充一种作品之内容的意向的一种类别关联起来。 @zh-hans
toolkit label: 扩充计划 @zh-hans
toolkit definition: 反映扩充一种作品之内容的意向的一种类别 @zh-hans
has subproperty: P10365
label: genişletme planı ile ilişkilidir @tr
definition: Bir eseri, bir eserin içeriğini genişletme amacını yansıtan bir sınıflandırmayla ilişkilendirir. @tr
toolkit label: genişletme planı @tr
toolkit definition: Bir eserin içeriğini genişletme niyetini yansıtan bir sınıflandırma. @tr

has extent of representative expression
status: Published
type: Property
lexical alias: extentOfRepresentativeExpression.en
definition: Relates a work to a type, number, and measurement unit that quantify an aspect of the extent of a representative expression of a work.
domain: C10001
toolkit label: extent of representative expression
has element type: 6
toolkit definition: A type, number, and measurement unit that quantify an aspect of the extent of a representative expression of a work.
label: edustavan ekspression laajuus @fi
definition: Liittää teoksen tyyppiin, lukuun ja mittayksikköön, joka ilmaisee teoksen edustavan ekspression laajuutta. @fi
toolkit label: edustavan ekspression laajuus @fi
toolkit definition: Tyyppi, luku ja mittayksikkö, joka ilmaisee teoksen edustavan ekspression laajuutta. @fi
label: har omfang for representativt uttrykk @no
definition: Relaterer et verk til en type, nummerering og måleenhet som kvantifiserer et aspekt av omfanget for et representativt uttrykk av et verk. @no
toolkit label: omfang for representativt uttrykk @no
toolkit definition: En type, nummerering og måleenhet som kvantifiserer et aspekt av omfanget for et representativt uttrykk av et verk. @no
label: heeft omvang van representatieve expressie @nl
definition: Relateert een werk aan een soort, nummer en meeteenheid die een aspect kwantificeren van de omvang van een representatieve expressie van een werk. @nl
toolkit label: omvang van representatieve expressie @nl
toolkit definition: Een soort, nummer en meeteenheid die een aspect kwantificeren van de omvang van een representatieve expressie van een werk. @nl
label: له مدى تعبيرة ممثِلة @ar
definition: يربط بين عمل ونوع، ورقم، ووحدة قياس تحدد جانبًا من مدى تعبيرة ممثِلة لعمل. @ar
toolkit label: مدى تعبيرة ممثِلة @ar
toolkit definition: نوع، ورقم، ووحدة قياس تحدد جانبًا من مدى تعبيرة ممثِلة لعمل. @ar
label: té com a extensió d’una expressió representativa @ca
definition: Relaciona una obra amb un tipus, número i unitat de mesura que quantifica un aspecte de l’extensió d’una expressió representativa d’una obra. @ca
toolkit label: extensió d’una expressió representativa @ca
toolkit definition: Tipus, número i unitat de mesura que quantifica un aspecte de l’extensió d’una expressió representativa d’una obra. @ca
label: har omfang af repræsentativt udtryk @da
definition: Relaterer et værk til en type, et tal og en måleenhed, som kvantificerer et aspekt af omfanget af et værks repræsentative udtryk. @da
toolkit label: omfang af repræsentativt udtryk @da
toolkit definition: Type, et tal og en måleenhed, som kvantificerer et aspekt af omfanget af et værks repræsentative udtryk. @da
label: iseloomuliku väljenduse maht @et
definition: Seostab teose tüübi, arvu ja mõõtühikuga, mis näitavad kvantitatiivselt teose iseloomuliku väljenduse mahu tunnuseid. @et
toolkit label: iseloomuliku väljenduse maht @et
toolkit definition: Tüüp, arv ja mõõtühik, mis näitavad kvantitatiivselt teose iseloomuliku väljenduse mahu tunnuseid. @et
label: hat Umfang einer repräsentativen Expression @de
definition: Setzt ein Werk in Beziehung zu einer Art, Nummer oder Maßeinheit, die eine Eigenschaft des Umfangs einer repräsentativen Expression eines Werks beziffert. @de
toolkit label: Umfang einer repräsentativen Expression @de
toolkit definition: Eine Art, Nummer oder Maßeinheit, die eine Eigenschaft des Umfangs einer repräsentativen Expression eines Werks beziffert. @de
label: reprezentatív kifejezési forma terjedelme a következő: @hu
definition: Hozzákapcsol egy művet egy típushoz, számhoz és mértékegységhez, amely egy mű reprezentatív kifejezési formája terjedelmének számszerű aspektusa. @hu
toolkit label: reprezentatív kifejezési formához tartozó terjedelem @hu
toolkit definition: Egy típus, szám és mértékegység, amely egy mű reprezentatív kifejezési formája terjedelmének számszerű aspektusa. @hu
label: ha come estensione dell'espressione rappresentativa @it
definition: Correla un’opera a un tipo, numero e unità di misura che quantificano un aspetto dell’estensione di un’espressione rappresentativa di un’opera. @it
toolkit label: espensione dell'espressione rappresentativa @it
toolkit definition: Tipo, numero e unità di misura che quantificano un aspetto dell’estensione di un’espressione rappresentativa di un’opera. @it
label: a pour étendue d’une expression représentative @fr
definition: Met une œuvre en relation avec un type, un nombre et une unité de mesure qui quantifient un aspect de l’étendue d’une expression représentative d’une œuvre. @fr
toolkit label: étendue d’une expression représentative @fr
toolkit definition: Type, nombre et unité de mesure qui quantifient un aspect de l’étendue d’une expression représentative d’une œuvre. @fr
label: reprezentatīvās izteiksmes apjoms @lv
definition: Sasaista darbu ar mērvienību, daudzumu un izmēru, kas nosaka darba raksturīgās izteiksmes apjomu. @lv
toolkit label: reprezentatīvās izteiksmes apjoms @lv
toolkit definition: Mērvienība, daudzums un izmērs, kas nosaka darba raksturīgās izteiksmes apjomu. @lv
label: 有代表性内容表达的数量 @zh-hans
definition: 将一种作品与把一种作品的一种代表性内容表达的一个数量方面定量化的一个类型、数字和计量单位关联起来。 @zh-hans
toolkit label: 代表性内容表达的数量 @zh-hans
toolkit definition: 把一种作品的一种代表性内容表达的一个数量方面定量化的一个类型、数字和计量单位 @zh-hans
has subproperty: P10352
label: temsili anlatım kapsamı ile ilişkilidir @tr
definition: Bir eseri, bir eserin temsili bir anlatımının kapsamının bir yönünü ölçen bir tür, sayı ve ölçü birimiyle ilişkilendirir. @tr
toolkit label: temsili anlatımın kapsamı @tr
toolkit definition: Bir eserin temsili anlatımının kapsamının bir yönünü nicelleştiren bir tür, sayı ve ölçü birimi. @tr

has appellant person
status: Published
definition: Relates a work to a person who appeals a decision of a lower court recorded in a legal work of a higher court.
type: Property
domain: C10001
lexical alias: appellantPerson.en
toolkit label: appellant person
toolkit definition: A person who appeals a decision of a lower court recorded in a legal work of a higher court.
toolkit label: personne appelante @fr
toolkit definition: Personne qui en appelle d’une décision d’un tribunal inférieur enregistrée dans une œuvre juridique d’un tribunal supérieur. @fr
sub property of: has creator person of work
toolkit label: persona apelante @es
toolkit definition: Una persona que apela una decisión de una corte menor registrada en una obra jurídica de una corte superior. @es
instruction number: 18.5
label: har person, som er appellant @da
definition: Relaterer et værk til en person, som appellerer imod en lavere retsinstans dom, som er registreret i et juridisk værk fra en højere retsinstans. @da
toolkit label: person, som er appellant @da
toolkit definition: Person, som appellerer imod en lavere retsinstans dom, som er registreret i et juridisk værk fra en højere retsinstans. @da
definition: Met une œuvre en relation avec une personne qui en appelle d’une décision d’un tribunal inférieur enregistrée dans une œuvre juridique d’un tribunal supérieur. @fr
label: có cá nhân kháng cáo @vi
definition: Liên kết tác phẩm với cá nhân kháng cáo quyết định của toà án cấp thấp hơn được ghi trong tác phẩm luật pháp của toà án cấp cao hơn. @vi
toolkit label: cá nhân kháng cáo @vi
toolkit definition: Cá nhân kháng cáo quyết định của toà án cấp thấp hơn được ghi trong tác phẩm luật pháp của toà án cấp cao hơn. @vi
label: hat Berufungsklagende/Revisionsklagende (Person) @de
definition: Setzt ein Werk in Beziehung zu einer Person, die gegen ein Gerichtsurteil einer unteren Instanz, das in einem juristischen Werk einer höheren Instanz erfasst ist, Rechtsmittel (Berufung/Revision) einlegt. @de
toolkit label: Berufungsklagende/Revisionsklagende (Person) @de
toolkit definition: Eine Person, die gegen ein Gerichtsurteil einer unteren Instanz, das in einem juristischen Werk einer höheren Instanz erfasst ist, Rechtsmittel (Berufung/Revision) einlegt. @de
label: a pour personne appelante @fr
definition: Liittää teoksen henkilöön, joka hakee muutosta alemman oikeusasteen päätökseen. @fi
toolkit label: henkilö muutoksenhakijana @fi
toolkit definition: Henkilö, joka hakee muutosta alemman oikeusasteen päätökseen. @fi
toolkit label: appellant (person) @no
toolkit definition: En person som anker en avgjørelse fra en lavere rettsinstans som er registrert i et juridisk verk fra en høyere rettsinstans. @no
label: té com a persona apel·lant @ca
definition: Relaciona una obra amb una persona que recorre una decisió d’un tribunal inferior enregistrada en una obra legal d’un tribunal superior. @ca
toolkit label: persona apel·lant @ca
toolkit definition: Persona que recorre una decisió d’un tribunal inferior enregistrada en una obra legal d’un tribunal superior. @ca
has element type: 2
label: έχει εκκαλούν/αναιρεσείον φυσικό πρόσωπο @el
definition: Συνδέει ένα έργο με ένα φυσικό πρόσωπο, που ασκεί έφεση εναντίον απόφασης κατώτερου δικαστηρίου, που καταχωρίστηκε στα πρακτικά ενός ανωτέρου δικαστηρίου. @el
toolkit label: εκκαλούν/αναιρεσείον φυσικό πρόσωπο @el
toolkit definition: Ένα φυσικό πρόσωπο, που ασκεί έφεση εναντίον απόφασης κατώτερου δικαστηρίου, που καταχωρίστηκε στα πρακτικά ενός ανωτέρου δικαστηρίου. @el
label: fellebbező személye a következő: @hu
definition: Hozzákapcsol egy művet egy személyhez, aki egy magasabb rendű bíróság jogi művében rögzített alacsonyabb rendű bíróság döntése ellen fellebbez. @hu
toolkit label: fellebbező személy: @hu
toolkit definition: Egy személy, aki egy magasabb rendű bíróság jogi művében rögzített alacsonyabb rendű bíróság döntése ellen fellebbez. @hu
label: henkilö muutoksenhakijana @fi
label: har appellant (person) @no
definition: Relaterer et verk til en person som anker en avgjørelse fra en lavere rettsinstans som er registrert i et juridisk verk fra en høyere rettsinstans. @no
label: heeft aanklager in beroep-persoon @nl
definition: Relateert een werk aan een persoon die in beroep gaat tegen een oordeel van een lager gerechtshof vastgelegd in een juridisch werk van een hoger gerechtshof. @nl
toolkit label: aanklager in beroep-persoon @nl
toolkit definition: Een persoon die in beroep gaat tegen een oordeel van een lager gerechtshof vastgelegd in een juridisch werk van een hoger gerechtshof. @nl
label: له شخص مستأنف @ar
definition: يربط بين عمل وشخص يستأنف حكم صادر عن محكمة دنيا ومسجل في عمل قانوني لمحكمة عليا. @ar
toolkit label: شخص مستأنف @ar
toolkit definition: الشخص الذي يستأنف حكم صادر عن محكمة دنيا ومسجل في عمل قانوني لمحكمة عليا. @ar
label: appellant (isik) @et
definition: Seostab teose isikuga, kes esitab alama astme kohtu otsuse peale apellatsiooni, mis on dokumenteeritud kõrgema astme kohtu juriidilises teoses. @et
toolkit label: appellant (isik) @et
toolkit definition: Isik, kes esitab alama astme kohtu otsuse peale apellatsiooni, mis on dokumenteeritud kõrgema astme kohtu juriidilises teoses. @et
label: ha come appellante persona @it
definition: Correla un’opera a una persona che si appella alla decisione di un tribunale ordinario registrata in un'opera giuridica di un tribunale superiore. @it
toolkit label: appellante persona @it
toolkit definition: Persona che si appella alla decisione di un tribunale ordinario registrata in un'opera giuridica di un tribunale superiore. @it
label: apelācijas iesniedzējpersona @lv
definition: Sasaista darbu ar personu, kura pārsūdz zemākas instances tiesas spriedumu augstāka līmeņa tiesā. @lv
toolkit label: apelācijas iesniedzējpersona @lv
toolkit definition: Persona, kura pārsūdz zemākas instances tiesas spriedumu augstāka līmeņa tiesā. @lv
label: 有上诉者个人 @zh-hans
definition: 将一种作品与记录在上级法院的一种法律作品中起诉一个下级法院决定的一个个人关联起来。 @zh-hans
toolkit label: 上诉者个人 @zh-hans
toolkit definition: 记录在上级法院的一种法律作品中起诉一个下级法院决定的一个个人 @zh-hans
has subproperty: P10042
label: temyiz eden kişi ile ilişkilidir @tr
definition: Bir eseri, üst mahkemenin yasal eserinde kaydedilen bir alt mahkeme kararını temyiz eden kişi ile ilişkilendirir. @tr
toolkit label: temyiz eden kişi @tr
toolkit definition: Daha yüksek bir mahkemenin yasal bir çalışmasında kaydedilen bir alt mahkeme kararını temyiz eden kişi. @tr

has appellant corporate body
status: Published
definition: Relates a work to a corporate body who appeals a decision of a lower court recorded in a legal work of a higher court.
type: Property
domain: C10001
sub property of: has creator corporate body of work
lexical alias: appellantCorporateBody.en
toolkit label: appellant corporate body
toolkit definition: A corporate body who appeals a decision of a lower court recorded in a legal work of a higher court.
toolkit label: collectivité appelante @fr
toolkit definition: Collectivité qui en appelle d’une décision d’un tribunal inférieur enregistrée dans une œuvre juridique d’un tribunal supérieur. @fr
toolkit label: entidad corporativa apelante @es
toolkit definition: Una entidad corporativa que apela una decisión de una corte menor registrada en una obra jurídica de una corte superior. @es
instruction number: 18.5
label: har korporation, som er appellant @da
definition: Relaterer et værk til en korporation, som appellerer imod en lavere retsinstans dom, som er registreret i et juridisk værk fra en højere retsinstans. @da
toolkit label: korporation, som er appellant @da
toolkit definition: Korporation, som appellerer imod en lavere retsinstans dom, som er registreret i et juridisk værk fra en højere retsinstans. @da
definition: Met une œuvre en relation avec une collectivité qui en appelle d’une décision d’un tribunal inférieur enregistrée dans une œuvre juridique d’un tribunal supérieur. @fr
label: có tập thể kháng cáo @vi
definition: Liên kết tác phẩm với tập thể kháng cáo quyết định của toà án cấp thấp hơn được ghi trong tác phẩm luật pháp của toà án cấp cao hơn. @vi
toolkit label: tập thể kháng cáo @vi
toolkit definition: Tập thể kháng cáo quyết định của toà án cấp thấp hơn được ghi trong tác phẩm luật pháp của toà án cấp cao hơn. @vi
label: hat Berufungsklagende/Revisionsklagende (Körperschaft) @de
definition: Setzt ein Werk in Beziehung zu einer Körperschaft, die gegen ein Gerichtsurteil einer unteren Instanz, das in einem juristischen Werk einer höheren Instanz erfasst ist, Rechtsmittel (Berufung/Revision) einlegt. @de
toolkit label: Berufungsklagende/Revisionsklagende (Körperschaft) @de
toolkit definition: Eine Körperschaft, die gegen ein Gerichtsurteil einer unteren Instanz, das in einem juristischen Werk einer höheren Instanz erfasst ist, Rechtsmittel (Berufung/Revision) einlegt. @de
label: a pour collectivité appelante @fr
definition: Liittää teoksen yhteisöön, joka hakee muutosta alemman oikeusasteen päätökseen. @fi
toolkit label: yhteisö muutoksenhakijana @fi
toolkit definition: Yhteisö, joka hakee muutosta alemman oikeusasteen päätökseen. @fi
toolkit label: appellerende korporasjon @no
toolkit definition: En korporasjon som anker avgjørelsen til en lavere rettsinstans som er registrert i et juridisk verk fra en høyere rettsinstans. @no
label: té com a entitat corporativa apel·lant @ca
definition: Relaciona una obra amb una entitat corporativa que recorre una decisió d’un tribunal inferior enregistrada en una obra legal d’un tribunal superior. @ca
toolkit label: entitat corporativa apel·lant @ca
toolkit definition: Entitat corporativa que recorre una decisió d’un tribunal inferior enregistrada en una obra legal d’un tribunal superior. @ca
has element type: 2
label: έχει εκαλλούν/αναιρεσείον συλλογικό όργανο @el
definition: Συνδέει ένα έργο με ένα συλλογικό όργανο, που ασκεί έφεση εναντίον απόφασης κατώτερου δικαστηρίου, που καταχωρίστηκε στα πρακτικά ενός ανωτέρου δικαστηρίου. @el
toolkit label: εκαλλούν/αναιρεσείον συλλογικό όργανο @el
toolkit definition: Ένα συλλογικό όργανο, που ασκεί έφεση εναντίον απόφασης κατώτερου δικαστηρίου, που καταχωρίστηκε στα πρακτικά ενός ανωτέρου δικαστηρίου. @el
label: fellebbező testülete a következő: @hu
definition: Hozzákapcsol egy művet egy testülethez, amely egy magasabb rendű bíróság jogi művében rögzített alacsonyabb rendű bíróság döntése ellen fellebbez. @hu
toolkit label: fellebbező testület: @hu
toolkit definition: Egy testület, amely egy magasabb rendű bíróság jogi művében rögzített alacsonyabb rendű bíróság döntése ellen fellebbez. @hu
label: yhteisö muutoksenhakijana @fi
label: har appellerende korporasjon @no
definition: Relaterer et verk til en korporasjon som anker en avgjørelse til en lavere rettsinstans som er registrert i et juridisk verk fra en høyere rettsinstans. @no
label: heeft aanklager in beroep-corporatie @nl
definition: Relateert een werk aan een corporatie die in beroep gaat tegen een oordeel van een lager gerechtshof vastgelegd in een juridisch werk van een hoger gerechtshof. @nl
toolkit label: aanklager in beroep-corporatie @nl
toolkit definition: Een corporatie die in beroep gaat tegen een oordeel van een lager gerechtshof vastgelegd in een juridisch werk van een hoger gerechtshof. @nl
label: له هيئة مستأنفة @ar
definition: يربط بين عمل وهيئة تستأنف حكم صادر عن محكمة دنيا ومسجل في عمل قانوني لمحكمة عليا. @ar
toolkit label: هيئة مستأنفة @ar
toolkit definition: هيئة تستأنف حكم صادر عن محكمة دنيا ومسجل في عمل قانوني لمحكمة عليا. @ar
label: apellant (asutus) @et
definition: Seostab teose asutusega, kes esitab alama astme kohtu otsuse peale apellatsiooni, mis on dokumenteeritud kõrgema astme kohtu juriidilises teoses. @et
toolkit label: apellant (asutus) @et
toolkit definition: Asutus, kes esitab alama astme kohtu otsuse peale apellatsiooni, mis on dokumenteeritud kõrgema astme kohtu juriidilises teoses. @et
label: ha come appellante ente @it
definition: Correla un’opera a un ente che si appella alla decisione di un tribunale ordinario registrata in un'opera giuridica di tribunale superiore. @it
toolkit label: appellante ente @it
toolkit definition: Ente che si appella alla decisione di un tribunale ordinario registrata in un'opera giuridica di un tribunale superiore. @it
label: apelācijas iesniedzējinstitūcija @lv
definition: Sasaista darbu ar institūciju, kas pārsūdz zemāka līmeņa tiesas spriedumu kādā augstāka līmeņa tiesā. @lv
toolkit label: apelācijas iesniedzējinstitūcija @lv
toolkit definition: Institūcija, kas pārsūdz zemāka līmeņa tiesas spriedumu kādā augstāka līmeņa tiesā. @lv
label: 有上诉者团体 @zh-hans
definition: 将一种作品与记录在上级法院的一种法律作品中起诉一个下级法院决定的一个团体关联起来。 @zh-hans
toolkit label: 上诉者团体 @zh-hans
toolkit definition: 记录在上级法院的一种法律作品中起诉一个下级法院决定的一个团体 @zh-hans
has subproperty: P10009
label: temyiz eden tüzel kişi ile ilişkilidir @tr
definition: Bir eseri, üst mahkemenin yasal eserinde kaydedilen bir alt mahkeme kararını temyiz eden tüzel kişi ile ilişkilendirir. @tr
toolkit label: itiraz eden tüzel kişi @tr
toolkit definition: Daha yüksek bir mahkemeye ait bir hukuki çalışmada, alt mahkemenin bir kararına itiraz eden bir tüzel kişi. @tr

has plaintiff person
status: Published
definition: Relates a work to a person who brings a suit in a civil proceeding.
type: Property
domain: C10001
sub property of: has creator person of work
lexical alias: plaintiffPerson.en
toolkit label: plaintiff person
toolkit definition: A person who brings a suit in a civil proceeding.
toolkit label: personne demanderesse @fr
toolkit definition: Personne qui intente une poursuite civile. @fr
toolkit label: persona demandante @es
toolkit definition: Una persona que presenta una demanda en un proceso civil. @es
instruction number: 18.5
label: har person, som er sagsøger @da
definition: Relaterer et værk til en person, som anlægger en sag i en civilproces. @da
toolkit label: person, som er sagsøger @da
toolkit definition: Person, som anlægger en sag i en civilproces. @da
definition: Met une œuvre en relation avec une personne qui intente une poursuite civile. @fr
label: có cá nhân nguyên đơn @vi
definition: Liên kết tác phẩm với cá nhân đưa ra đơn kiện trong vụ kiện dân sự. @vi
toolkit label: cá nhân nguyên đơn @vi
toolkit definition: Cá nhân đưa ra đơn kiện trong vụ kiện dân sự. @vi
label: hat Zivilklägerin/Zivilkläger (Person) @de
definition: Setzt ein Werk in Beziehung zu einer Person, die eine Klage in ein Zivilverfahren einbringt. @de
toolkit label: Zivilklägerin/Zivilkläger (Person) @de
toolkit definition: Eine Person, die eine Klage in ein Zivilverfahren einbringt. @de
label: a pour personne demanderesse @fr
definition: Liittää teoksen henkilöön, joka nostaa kanteen siviilioikeudenkäyntiin. @fi
toolkit label: henkilökantaja @fi
toolkit definition: Henkilö, joka nostaa kanteen siviilioikeudenkäyntiin. @fi
toolkit label: saksøker (person) @no
toolkit definition: En person som er saksøker i en sivilrettslig sak. @no
label: té com a persona demandant @ca
definition: Relaciona una obra amb una persona que interposa una demanda civil. @ca
toolkit label: persona demandant @ca
toolkit definition: Persona que interposa una demanda civil. @ca
has element type: 2
label: έχει ενάγον φυσικό πρόσωπο @el
definition: Συνδέει ένα έργο με ένα φυσικό πρόσωπο, το οποίο ασκεί αγωγή στο πλαίσιο αστικής διαδικασίας. @el
toolkit label: ενάγον φυσικό πρόσωπο @el
toolkit definition: Ένα φυσικό πρόσωπο, το οποίο ασκεί αγωγή στο πλαίσιο αστικής διαδικασίας. @el
label: felperese a következő: @hu
definition: Hozzákapcsol egy művet egy személyhez, aki polgárjogi eljárás keretében pert indít. @hu
toolkit label: felperes: @hu
toolkit definition: Egy személy, aki polgárjogi eljárás keretében pert indít. @hu
label: henkilökantaja @fi
label: har saksøker (person) @no
definition: Relaterer et verk til en person som er saksøker i en sivilrettslig sak. @no
label: heeft aanklager-persoon @nl
definition: Relateert een werk aan een persoon die een proces aanspant in een civielrechtelijke procedure. @nl
toolkit label: aanklager-persoon @nl
toolkit definition: Een persoon die een proces aanspant in een civielrechtelijke procedure. @nl
label: له شخص مدعي @ar
definition: يربط بين عمل وشخص يرفع دعوى ضمن دعوى مدنية. @ar
toolkit label: شخص مدعي @ar
toolkit definition: شخص يرفع دعوى ضمن دعوى مدنية. @ar
label: hageja (isik) @et
definition: Seostab teose isikuga, kes esitab tsiviilkohtumenetluses hagi. @et
toolkit label: hageja (isik) @et
toolkit definition: Isik, kes esitab tsiviilkohtumenetluses hagi. @et
label: ha come querelante persona @it
definition: Correla un’opera a una persona che intenta un’azione legale nell’ambito di un procedimento civile. @it
toolkit label: querelante persona @it
toolkit definition: Persona che intenta un’azione legale nell’ambito di un procedimento civile. @it
label: prasītājs (persona) @lv
definition: Sasaista darbu ar personu, kura ceļ prasību civiltiesā. @lv
toolkit label: prasītājs (persona) @lv
toolkit definition: Persona, kura ceļ prasību civiltiesā. @lv
label: 有原告个人 @zh-hans
definition: 将一种作品与在民事诉讼中起诉的一个个人关联起来。 @zh-hans
toolkit label: 原告个人 @zh-hans
toolkit definition: 在民事诉讼中起诉的一个个人 @zh-hans
has subproperty: P10043
label: davacı kişisi ile ilişkilidir @tr
definition: Bir eseri, hukuk davasına taşıyan kişi ile ilişkilendirir. @tr
toolkit label: davacı kişi @tr
toolkit definition: Davayı sivil mahkemeye taşıyan kişi. @tr

has plaintiff corporate body
status: Published
definition: Relates a work to a corporate body who brings a suit in a civil proceeding.
type: Property
domain: C10001
sub property of: has creator corporate body of work
lexical alias: plaintiffCorporateBody.en
toolkit label: plaintiff corporate body
toolkit definition: A corporate body who brings a suit in a civil proceeding.
toolkit label: collectivité demanderesse @fr
toolkit definition: Collectivité qui intente une poursuite civile. @fr
toolkit label: entidad corporativa demandante @es
toolkit definition: Una entidad corporativa que presenta una demanda en un proceso civil. @es
instruction number: 18.5
label: har korporation, som er sagsøger @da
definition: Relaterer et værk til en korporation, som anlægger en sag i en civilproces. @da
toolkit label: korporation, som er sagsøger @da
toolkit definition: Korporation, som anlægger en sag i en civilproces. @da
definition: Met une œuvre en relation avec une collectivité qui intente une poursuite civile. @fr
label: có tập thể nguyên đơn @vi
definition: Liên kết tác phẩm với tập thể đưa ra đơn kiện trong vụ kiện dân sự. @vi
toolkit label: tập thể nguyên đơn @vi
toolkit definition: Tập thể đưa ra đơn kiện trong vụ kiện dân sự. @vi
label: hat Zivilklägerin/Zivilkläger (Körperschaft) @de
definition: Setzt ein Werk in Beziehung zu einer Körperschaft, die eine Klage in ein Zivilverfahren einbringt. @de
toolkit label: Zivilklägerin/Zivilkläger (Körperschaft) @de
toolkit definition: Eine Körperschaft, die eine Klage in ein Zivilverfahren einbringt. @de
label: a pour collectivité demanderesse @fr
definition: Liittää teoksen yhteisöön, joka nostaa kanteen siviilioikeudenkäyntiin. @fi
toolkit label: yhteisökantaja @fi
toolkit definition: Yhteisö, joka nostaa kanteen siviilioikeudenkäyntiin. @fi
toolkit label: saksøker (korporasjon) @no
toolkit definition: En korporasjon som er saksøker i en sivilrettslig sak. @no
label: té com a entitat corporativa demandant @ca
definition: Relaciona una obra amb una entitat corporativa que interposa una demanda civil. @ca
toolkit label: entitat corporativa demandant @ca
toolkit definition: Entitat corporativa que interposa una demanda civil. @ca
has element type: 2
label: έχει ενάγον συλλογικό όργανο @el
definition: Συνδέει ένα έργο με ένα συλλογικό όργανο, το οποίο ασκεί αγωγή στο πλαίσιο αστικής διαδικασίας. @el
toolkit label: ενάγον συλλογικό όργανο @el
toolkit definition: Ένα συλλογικό όργανο, το οποίο ασκεί αγωγή στο πλαίσιο αστικής διαδικασίας. @el
label: felperes testülete a következő: @hu
definition: Hozzákapcsol egy művet egy testülethez, amely polgárjogi eljárás keretében pert indít. @hu
toolkit label: felperes testület: @hu
toolkit definition: Egy testület, amely polgárjogi eljárás keretében pert indít. @hu
label: yhteisökantaja @fi
label: har saksøker (korporasjon) @no
definition: Relaterer et verk til en korporasjon som er saksøker i en sivilrettslig sak. @no
label: heeft aanklager-corporatie @nl
definition: Relateert een werk aan een corporatie die een proces aanspant in een civielrechtelijke procedure. @nl
toolkit label: aanklager-corporatie @nl
toolkit definition: Een corporatie die een proces aanspant in een civielrechtelijke procedure. @nl
label: له هيئة مدعية @ar
definition: يربط بين عمل وهيئة ترفع دعوى ضمن دعوى مدنية. @ar
toolkit label: هيئة مدعية @ar
toolkit definition: هيئة ترفع دعوى ضمن دعوى مدنية. @ar
label: hageja (asutus) @et
definition: Seostab teose asutusega, kes esitab tsiviilkohtumenetluses hagi. @et
toolkit label: hageja (asutus) @et
toolkit definition: Asutus, kes esitab tsiviilkohtumenetluses hagi. @et
label: ha come querelante ente @it
definition: Correla un’opera a un ente che intenta un’azione legale nell’ambito di un procedimento civile. @it
toolkit label: querelante ente @it
toolkit definition: Ente che intenta un’azione legale nell’ambito di un procedimento civile. @it
label: prasītājs (institūcija) @lv
definition: Sasaista darbu ar institūciju, kas ceļ parasību civiltiesā. @lv
toolkit label: prasītājs (institūcija) @lv
toolkit definition: Institūcija, kas ceļ parasību civiltiesā. @lv
label: 有原告团体 @zh-hans
definition: 将一种作品与在民事诉讼中起诉的一个团体关联起来。 @zh-hans
toolkit label: 原告团体 @zh-hans
toolkit definition: 在民事诉讼中起诉的一个团体 @zh-hans
has subproperty: P10010
label: davacı tüzel kişisi ile ilişkilidir @tr
definition: Bir eseri, hukuk davasına taşıyan tüzel kişi ile ilişkilendirir. @tr
toolkit label: davacı eden tüzel kişi @tr
toolkit definition: Bir davayı hukuk mahkemesine taşıyan tüzel kişilik. @tr

has film director agent
status: Published
definition: Relates a work to an agent who is a director who is responsible for the general management and supervision of a filmed performance.
type: Property
domain: C10001
sub property of: has director agent
lexical alias: filmDirectorAgent.en
toolkit label: film director agent
toolkit definition: An agent who is a director who is responsible for the general management and supervision of a filmed performance.
toolkit label: agent réalisateur de cinéma @fr
toolkit definition: Agent réalisateur qui est responsable de la gestion et de la supervision générales d’une prestation filmée. @fr
toolkit label: director de cine @es
toolkit definition: Un director responsable de la gestión y supervisión general de una producción cinematográfica. @es
instruction number: 18.5
label: har agent, som er filminstruktør @da
definition: Relaterer et værk til en agent, som er en instruktør, som er ansvarlig for den generelle ledelse af- og tilsyn med en filmoptagelse. @da
toolkit label: agent, som er filminstruktør @da
toolkit definition: Agent, som er en instruktør, som er ansvarlig for den generelle ledelse af- og tilsyn med en filmoptagelse. @da
definition: Met une œuvre en relation avec un agent réalisateur qui est responsable de la gestion et de la supervision générales d’une prestation filmée. @fr
label: có đạo diễn phim @vi
definition: Liên kết tác phẩm với đạo diễn có trách nhiệm về quản lý và giám sát chung của biểu diễn để làm phim. @vi
toolkit label: đạo diễn phim @vi
toolkit definition: Đạo diễn có trách nhiệm về quản lý và giám sát chung của biểu diễn để làm phim. @vi
label: hat Filmregisseurin/Filmregisseur (Akteur) @de
definition: Setzt ein Werk in Beziehung zu einer Regisseurin/einem Regisseur (Akteur), die/der für das allgemeine Management und die Leitung einer verfilmten Darbietung verantwortlich ist. @de
toolkit label: Filmregisseurin/Filmregisseur (Akteur) @de
toolkit definition: Eine Regisseurin/Ein Regisseur (Akteur), die/der für das allgemeine Management und die Leitung einer verfilmten Darbietung verantwortlich ist. @de
label: a pour agent réalisateur de cinéma @fr
definition: Liittää teoksen toimijaan, joka on ohjaaja, joka on vastuussa elokuvatun esityksen yleisestä johtamisesta ja valvonnasta. @fi
toolkit label: elokuvaohjaaja (toimija) @fi
toolkit definition: Toimija, joka on ohjaaja, joka on vastuussa elokuvatun esityksen yleisestä johtamisesta ja valvonnasta. @fi
toolkit label: filmregissør (agent) @no
toolkit definition: En agent som er regissør med ansvar for generell ledelse av en filmet forestilling. @no
label: té com a agent director cinematogràfic @ca
definition: Relaciona una obra amb un agent que és un director que és responsable de la gestió general i la supervisió d’una actuació filmada. @ca
toolkit label: agent director cinematogràfic @ca
toolkit definition: Agent que és un director que és responsable de la gestió general i la supervisió d’una actuació filmada. @ca
has element type: 2
label: έχει σκηνοθέτη @el
definition: Συνδέει ένα έργο με έναν σκηνοθέτη υπεύθυνο για τη γενική διεύθυνση και εποπτεία μίας κινηματογραφικής ερμηνείας. @el
toolkit label: σκηνοθέτης @el
toolkit definition: Ένας σκηνοθέτης υπεύθυνος για τη γενική διεύθυνση και εποπτεία μίας κινηματογραφικής ερμηνείας. @el
label: filmrendező ágense a következő: @hu
definition: Hozzákapcsol egy művet egy rendező ágenshez, amely felelős egy filmre vett előadás általános menedzseléséért és felügyeletéért. @hu
toolkit label: filmrendező ágens: @hu
toolkit definition: Egy rendező ágens, amely felelős egy filmre vett előadás általános menedzseléséért és felügyeletéért. @hu
alternative label: film director
alternative label: elokuvaohjaaja @fi
label: elokuvaohjaaja (toimija) @fi
label: har filmregissør (agent) @no
definition: Relaterer et verk til en agent som er regissør med ansvar for generell ledelse av en filmet forestilling. @no
alternative label: filmregissør @no
label: heeft filmregisseur-actor @nl
definition: Relateert een werk aan een actor die een regisseur is die verantwoordelijk is voor het algemeen beheer en toezicht van een gefilmde uitvoering. @nl
toolkit label: filmregisseur-actor @nl
toolkit definition: Een actor die een regisseur is die verantwoordelijk is voor het algemeen beheer en toezicht van een gefilmde uitvoering. @nl
label: له وكيل مخرج أفلام @ar
definition: يربط بين عمل ووكيل يكون مخرجا مسئولاً عن الإدارة العامة والإشراف على أداء مصوَّر. @ar
alternative label: مخرج أفلام @ar
toolkit label: وكيل مخرج أفلام @ar
toolkit definition: وكيل يكون مديرًا مسئولاً عن الإدارة العامة والإشراف على أداء مصور. @ar
alternative label: director cinematogràfic @ca
alternative label: filminstruktør @da
label: filmirežissöör (tegija) @et
definition: Seostab teose tegijaga, kes on filmitava esituse üldise juhtimise ja juhendamise eest vastutav režissöör. @et
alternative label: filmirežissöör @et
alternative label: filmilavastaja (tegija) @et
toolkit label: filmirežissöör (tegija) @et
toolkit definition: Tegija, kes on filmitava esituse üldise juhtimise ja juhendamise eest vastutav režissöör. @et
alternative label: filmrendező: @hu
label: ha come regista cinematografico agente @it
definition: Correla un’opera all'agente regista responsabile dell'organizzazione e della supervisione generali di una rappresentazione cinematografica. @it
alternative label: regista cinematografico @it
toolkit label: regista cinematografico agente @it
toolkit definition: Agente regista responsabile dell'organizzazione e della supervisione generali di una rappresentazione cinematografica. @it
label: kinorežisors (aģents) @lv
definition: Sasaista darbu ar aģentu, kas ir filmas režisors, kurš ir atbildīgs par uzfilmētā pasākuma vispārējo vadību un uzraudzību. @lv
toolkit label: kinorežisors (aģents) @lv
toolkit definition: Aģents, kas ir filmas režisors, kurš ir atbildīgs par uzfilmētā pasākuma vispārējo vadību un uzraudzību. @lv
alternative label: Filmregisseur @de
toolkit label: 电影导演行为者 @zh-hans

has film director collective agent
status: Published
lexical alias: filmDirectorCollectiveAgent.en
definition: Relates a work to a collective agent who is a director who is responsible for the general management and supervision of a filmed performance.
toolkit label: film director collective agent
toolkit definition: A collective agent who is a director who is responsible for the general management and supervision of a filmed performance.
type: Property
domain: C10001
has element type: 2
sub property of: has director collective agent
sub property of: has film director agent
label: elokuvaohjaaja (yhteistoimija) @fi
definition: Liittää teoksen yhteistoimijaan, joka on ohjaaja, joka on vastuussa elokuvatun esityksen yleisestä johtamisesta ja valvonnasta. @fi
toolkit label: elokuvaohjaaja (yhteistoimija) @fi
toolkit definition: Yhteistoimija, joka on ohjaaja, joka on vastuussa elokuvatun esityksen yleisestä johtamisesta ja valvonnasta. @fi
label: har filmregissør (kollektiv agent) @no
definition: Relaterer et verk til en kollektiv agent som er regissør med ansvar for generell ledelse av en filmet forestilling. @no
toolkit label: filmregissør (kollektiv agent) @no
toolkit definition: En kollektiv agent som er regissør med ansvar for generell ledelse av en filmet forestilling. @no
label: heeft filmregisseur-collectieve actor @nl
definition: Relateert een werk aan een collectieve actor die een regisseur is die verantwoordelijk is voor het algemeen beheer en toezicht van een gefilmde uitvoering. @nl
toolkit label: filmregisseur-collectieve actor @nl
toolkit definition: Een collectieve actor die een regisseur is die verantwoordelijk is voor het algemeen beheer en toezicht van een gefilmde uitvoering. @nl
label: له وكيل جماعي مخرج أفلام @ar
definition: يربط بين عمل ووكيل جماعي يكون مديرًا مسئولاً عن الإدارة العامة والإشراف على الأداء المصور. @ar
toolkit label: وكيل جماعي مخرج أفلام @ar
toolkit definition: وكيل جماعي يكون مديرًا مسئولاً عن الإدارة العامة والإشراف على الأداء المصور. @ar
label: té com a agent col·lectiu director cinematogràfic @ca
definition: Relaciona una obra amb un agent col·lectiu que és un director que és responsable de la gestió i la supervisió d’una actuació filmada. @ca
toolkit label: agent col·lectiu director cinematogràfic @ca
toolkit definition: Agent col·lectiu que és un director que és responsable de la gestió i la supervisió d’una actuació filmada. @ca
label: har kollektiv agent, som er filminstruktør @da
definition: Relaterer et værk til en kollektiv agent, som er en instruktør, som er ansvarlig for den generelle ledelse af- og tilsyn med en filmoptagelse. @da
toolkit label: kollektiv agent, som er filminstruktør @da
toolkit definition: Kollektiv agent, som er en instruktør, som er ansvarlig for den generelle ledelse af- og tilsyn med en filmoptagelse. @da
label: filmirežissöör (kollektiiv) @et
definition: Seostab teose kollektiiviga, kes on filmitava etenduse üldise juhtimise ja juhendamise eest vastutav režissöör. @et
alternative label: filmilavastaja (kollektiiv) @et
toolkit label: filmirežissöör (kollektiiv) @et
toolkit definition: Kollektiiv, kes on filmitava etenduse üldise juhtimise ja juhendamise eest vastutav režissöör. @et
label: hat Filmregisseurin/Filmregisseur (Gemeinschaftlicher Akteur) @de
definition: Setzt ein Werk in Beziehung zu einer Regisseurin/einem Regisseur (Gemeinschaftlicher Akteur), die/der für das allgemeine Management und die Leitung einer verfilmten Darbietung verantwortlich ist. @de
toolkit label: Filmregisseurin/Filmregisseur (Gemeinschaftlicher Akteur) @de
toolkit definition: Eine Regisseurin/Ein Regisseur (Gemeinschaftlicher Akteur), die/der für das allgemeine Management und die Leitung einer verfilmten Darbietung verantwortlich ist. @de
label: filmrendező kollektív ágense a következő: @hu
definition: Hozzákapcsol egy művet egy rendező kollektív ágenshez, amely felelős egy filmre vett előadás általános menedzseléséért és felügyeletéért. @hu
toolkit label: filmrendező kollektív ágens: @hu
toolkit definition: Egy rendező kollektív ágens, amely felelős egy filmre vett előadás általános menedzseléséért és felügyeletéért. @hu
label: ha come regista agente collettivo @it
definition: Correla un'opera all'agente collettivo regista responsabile della gestione e supervisione generali di un'interpretazione cinematografica. @it
toolkit label: regista agente collettivo @it
toolkit definition: Agente collettivo regista responsabile della gestione e supervisione generali di un'interpretazione cinematografica. @it
label: a pour agent collectif réalisateur de cinéma @fr
definition: Met une œuvre en relation avec un agent collectif réalisateur qui est responsable de la gestion et de la supervision générales d’une prestation filmée. @fr
toolkit label: agent collectif réalisateur de cinéma @fr
toolkit definition: Agent collectif réalisateur qui est responsable de la gestion et de la supervision générales d’une prestation filmée. @fr
label: kinorežisors (grupa) @lv
definition: Sasaista darbu ar grupu, kas ir atbildīga par uzfilmētā pasākuma vispārējo vadību un uzraudzību. @lv
toolkit label: kinorežisors (grupa) @lv
toolkit definition: Grupa, kas ir atbildīga par uzfilmētā pasākuma vispārējo vadību un uzraudzību. @lv
alternative label: agent collectif réalisateur de film @fr
label: 有电影导演集体行为者 @zh-hans
definition: 将一种作品与作为一个导演并负责拍摄表演的总体管理和监督的一个集体行为者关联起来。 @zh-hans
toolkit label: 电影导演集体行为者 @zh-hans
toolkit definition: 作为一个导演并负责拍摄表演的总体管理和监督的一个集体行为者 @zh-hans
has subproperty: has film director corporate body
has subproperty: has film director family
has subproperty: P10465
label: film yönetmeni kolektif temsilcisi ile ilişkilidir @tr
definition: Bir eseri, filme alınmış bir performansın genel yönetimi ve denetiminden sorumlu yönetmen olan kolektif bir temsilci ile ilişkilendirir. @tr
toolkit label: film yönetmeni kolektif temsilcisi @tr
toolkit definition: Filme alınmış bir performansın genel yönetimi ve denetiminden sorumlu yönetmen olan kolektif bir temsilci. @tr

has film director corporate body
status: Published
lexical alias: filmDirectorCorporateBody.en
definition: Relates a work to a corporate body who is a director who is responsible for the general management and supervision of a filmed performance.
toolkit label: film director corporate body
toolkit definition: A corporate body who is a director who is responsible for the general management and supervision of a filmed performance.
type: Property
domain: C10001
has element type: 2
sub property of: has director corporate body
sub property of: has film director collective agent
label: elokuvaohjaaja (yhteisö) @fi
definition: Liittää teoksen yhteisöön, joka on ohjaaja, joka on vastuussa elokuvatun esityksen yleisestä johtamisesta ja valvonnasta. @fi
toolkit label: elokuvaohjaaja (yhteisö) @fi
toolkit definition: Yhteisö, joka on ohjaaja, joka on vastuussa elokuvatun esityksen yleisestä johtamisesta ja valvonnasta. @fi
label: har filmregissør (korporasjon) @no
definition: Relaterer et verk til en korporasjon som er regissør med ansvar for generell ledelse av en filmet forestilling. @no
toolkit label: filmregissør (korporasjon) @no
toolkit definition: En korporasjon som er regissør med ansvar for generell ledelse av en filmet forestilling. @no
label: heeft filmregisseur-corporatie @nl
definition: Relateert een werk aan een corporatie die een regisseur is die verantwoordelijk is voor het algemeen beheer en toezicht van een gefilmde uitvoering. @nl
toolkit label: filmregisseur-corporatie @nl
toolkit definition: Een corporatie die een regisseur is die verantwoordelijk is voor het algemeen beheer en toezicht van een gefilmde uitvoering. @nl
label: له هيئة مخرجة أفلام @ar
definition: يربط بين عمل وهيئة تكون مديرة مسئولة عن الإدارة العامة والإشراف على أداء مصوَّر. @ar
toolkit label: هيئة مخرجة أفلام @ar
toolkit definition: هيئة تكون مديرة مسئولة عن الإدارة العامة والإشراف على أداء مصوَّر. @ar
label: té com a entitat corporativa directora cinematogràfica @ca
definition: Relaciona una obra amb una entitat corporativa que és un director que és responsable de la gestió i la supervisió d’una actuació filmada. @ca
toolkit label: entitat corporativa directora cinematogràfica @ca
toolkit definition: Entitat corporativa que és un director que és responsable de la gestió i la supervisió d’una actuació filmada. @ca
label: har korporation, som er filminstruktør @da
definition: Relaterer et værk til en korporation, som er en instruktør, som er ansvarlig for den generelle ledelse af- og tilsyn med en filmoptagelse. @da
toolkit label: korporation, som er filminstruktør @da
toolkit definition: Korporation, som er en instruktør, som er ansvarlig for den generelle ledelse af- og tilsyn med en filmoptagelse. @da
label: filmirežissöör (asutus) @et
definition: Seostab teose asutusega, kes on filmitava etenduse üldise juhtimise ja juhendamise eest vastutav režissöör. @et
alternative label: filmilavastaja (asutus) @et
toolkit label: filmirežissöör (asutus) @et
toolkit definition: Asutus, kes on filmitava etenduse üldise juhtimise ja juhendamise eest vastutav režissöör. @et
label: hat Filmregisseurin/Filmregisseur (Körperschaft) @de
definition: Setzt ein Werk in Beziehung zu einer Regisseurin/einem Regisseur (Körperschaft), die/der für das allgemeine Management und die Leitung einer verfilmten Darbietung verantwortlich ist. @de
toolkit label: Filmregisseurin/Filmregisseur (Körperschaft) @de
toolkit definition: Eine Regisseurin/Ein Regisseur (Körperschaft), die/der für das allgemeine Management und die Leitung einer verfilmten Darbietung verantwortlich ist. @de
label: filmrendező testülete a következő: @hu
definition: Hozzákapcsol egy művet egy rendező testülethez, amely felelős egy filmre vett előadás általános menedzseléséért és felügyeletéért. @hu
toolkit label: filmrendező testület: @hu
toolkit definition: Egy rendező testület, amely felelős egy filmre vett előadás általános menedzseléséért és felügyeletéért. @hu
label: ha come regista cinematografico ente @it
definition: Correla un'opera a un ente regista responsabile della gestione generale e della supervisione di un'interpretazione cinematografica. @it
toolkit label: regista cinematografico ente @it
toolkit definition: Ente regista responsabile della gestione generale e della supervisione di un'interpretazione cinematografica. @it
label: a pour collectivité réalisatrice de cinéma @fr
definition: Met une œuvre en relation avec une collectivité réalisatrice qui est responsable de la gestion et de la supervision générales d’une prestation filmée. @fr
toolkit label: collectivité réalisatrice de cinéma @fr
toolkit definition: Collectivité réalisatrice qui est responsable de la gestion et de la supervision générales d’une prestation filmée. @fr
label: kinorežisors (institūcija) @lv
definition: Sasaista darbu ar institūciju, kas ir atbildīga par uzfilmētā pasākuma vispārējo vadību un uzraudzību. @lv
toolkit label: kinorežisors (institūcija) @lv
toolkit definition: Institūcija, kas ir atbildīga par uzfilmētā pasākuma vispārējo vadību un uzraudzību. @lv
alternative label: collectivité réalisatrice de film @fr
label: 有电影导演团体 @zh-hans
definition: 将一种作品与作为一个导演并负责拍摄表演的总体管理和监督的一个团体关联起来。 @zh-hans
toolkit label: 电影导演团体 @zh-hans
toolkit definition: 作为一个导演并负责拍摄表演的总体管理和监督的一个团体 @zh-hans
has subproperty: P10512
label: film yönetmeni tüzel kişisi ile ilişkilidir @tr
definition: Bir eseri, filme alınmış bir performansın genel yönetim ve denetiminden sorumlu bir yönetmen olan tüzel kişi ile ilişkilendirir. @tr
toolkit label: film yönetmeni tüzel kişisi @tr
toolkit definition: Filme alınmış bir performansın genel yönetim ve denetiminden sorumlu, yönetmen olan tüzel kişilik. @tr

has film director family
status: Published
lexical alias: filmDirectorFamily.en
definition: Relates a work to a family who is a director who is responsible for the general management and supervision of a filmed performance.
toolkit label: film director family
toolkit definition: A family who is a director who is responsible for the general management and supervision of a filmed performance.
type: Property
domain: C10001
has element type: 2
sub property of: has director family
sub property of: has film director collective agent
label: elokuvaohjaaja (suku) @fi
definition: Liittää teoksen sukuun, joka on ohjaaja, joka on vastuussa elokuvatun esityksen yleisestä johtamisesta ja valvonnasta. @fi
toolkit label: elokuvaohjaaja (suku) @fi
toolkit definition: Suku, joka on ohjaaja, joka on vastuussa elokuvatun esityksen yleisestä johtamisesta ja valvonnasta. @fi
label: har filmregissør (familie) @no
definition: Relaterer et verk til en familie som er regissør med ansvar for generell ledelse av en filmet forestilling. @no
toolkit label: filmregissør (familie) @no
toolkit definition: En familie som er regissør med ansvar for generell ledelse av en filmet forestilling. @no
label: heeft filmregisseur-familie @nl
definition: Relateert een werk aan een familie die een regisseur is die verantwoordelijk is voor het algemeen beheer en toezicht van een gefilmde uitvoering. @nl
toolkit label: filmregisseur-familie @nl
toolkit definition: Een familie die een regisseur is die verantwoordelijk is voor het algemeen beheer en toezicht van een gefilmde uitvoering. @nl
label: له عائلة مخرجة أفلام @ar
definition: يربط بين عمل وعائلة تكون مخرجة مسئولة عن الإدارة العامة والإشراف على أداء مصور. @ar
toolkit label: عائلة مخرجة أفلام @ar
toolkit definition: عائلة تكون مخرجة مسئولة عن الإدارة العامة والإشراف على أداء مصور. @ar
label: té com a família directora cinematogràfica @ca
definition: Relaciona una obra amb una família que és un director responsable de la gestió general i la supervisió d’una actuació filmada. @ca
toolkit label: família directora cinematogràfica @ca
toolkit definition: Família que és un director responsable de la gestió general i la supervisió d’una actuació filmada. @ca
label: har familie, som er filminstruktør @da
definition: Relaterer et værk til en familie, som er en instruktør, som er ansvarlig for den generelle ledelse af- og tilsyn med en filmoptagelse. @da
toolkit label: familie, som er filminstruktør @da
toolkit definition: Familie, som er en instruktør, som er ansvarlig for den generelle ledelse af- og tilsyn med en filmoptagelse. @da
label: filmirežissöör (perekond) @et
definition: Seostab teose perekonnaga, kes on filmitava etenduse üldise juhtimise ja juhendamise eest vastutav režissöör. @et
alternative label: filmilavastaja (perekond) @et
toolkit label: filmirežissöör (perekond) @et
toolkit definition: Perekond, kes on filmitava etenduse üldise juhtimise ja juhendamise eest vastutav režissöör. @et
label: hat Filmregisseurin/Filmregisseur (Familie) @de
definition: Setzt ein Werk in Beziehung zu einer Regisseurin/einem Regisseur (Familie), die/der für das allgemeine Management und die Leitung einer verfilmten Darbietung verantwortlich ist. @de
toolkit label: Filmregisseurin/Filmregisseur (Familie) @de
toolkit definition: Eine Regisseurin/Ein Regisseur (Familie), die/der für das allgemeine Management und die Leitung einer verfilmten Darbietung verantwortlich ist. @de
label: filmrendező családja a következő: @hu
definition: Hozzákapcsol egy művet egy rendező családhoz, amely felelős egy filmre vett előadás általános menedzseléséért és felügyeletéért. @hu
toolkit label: filmrendező család: @hu
toolkit definition: Egy rendező család amely felelős egy filmre vett előadás általános menedzseléséért és felügyeletéért. @hu
label: ha come regista cinematografico famiglia @it
definition: Correla un'opera alla famiglia regista responsabile della gestione generale e della supervisione di un'interpretazione cinematografica. @it
toolkit label: regista cinematografico famiglia @it
toolkit definition: Famiglia regista responsabile della gestione generale e della supervisione di un'interpretazione cinematografica. @it
label: a pour famille réalisatrice de cinéma @fr
definition: Met une œuvre en relation avec une famille réalisatrice qui est responsable de la gestion et de la supervision générales d’une prestation filmée. @fr
toolkit label: famille réalisatrice de cinéma @fr
toolkit definition: Famille réalisatrice qui est responsable de la gestion et de la supervision générales d’une prestation filmée. @fr
label: kinorežisors (dzimta/ģimene) @lv
definition: Sasaista darbu ar dzimtu/ģimeni, kas ir atbildīga par uzfilmētā pasākuma vispārējo vadību un uzraudzību. @lv
toolkit label: kinorežisors (dzimta/ģimene) @lv
toolkit definition: Dzimta/ģimene, kas ir atbildīga par uzfilmētā pasākuma vispārējo vadību un uzraudzību. @lv
alternative label: famille réalisatrice de film @fr
label: 有电影导演家族 @zh-hans
definition: 将一种作品与作为一个导演并负责拍摄表演的总体管理和监督的一个家族关联起来。 @zh-hans
toolkit label: 电影导演家族 @zh-hans
toolkit definition: 作为一个导演并负责拍摄表演的总体管理和监督的一个家族 @zh-hans
has subproperty: P10559
label: film yönetmeni ailesi ile ilişkilidir @tr
definition: Bir eseri, filme alınmış bir performansın genel yönetim ve denetiminden sorumlu bir yönetmen bir aileyle ilişkilendirir. @tr
toolkit label: film yönetmeni ailesi @tr
toolkit definition: Filme alınmış bir performansın genel yönetim ve denetiminden sorumlu bir yönetmen olan aile. @tr

has film director person
status: Published
lexical alias: filmDirectorPerson.en
definition: Relates a work to a person who is a director who is responsible for the general management and supervision of a filmed performance.
toolkit label: film director person
toolkit definition: A person who is a director who is responsible for the general management and supervision of a filmed performance.
type: Property
domain: C10001
has element type: 2
sub property of: has director person
sub property of: has film director agent
label: elokuvaohjaaja (henkilö) @fi
definition: Liittää teoksen henkilöön, joka on ohjaaja, joka on vastuussa elokuvatun esityksen yleisestä johtamisesta ja valvonnasta. @fi
toolkit label: elokuvaohjaaja (henkilö) @fi
toolkit definition: Henkilö, joka on ohjaaja, joka on vastuussa elokuvatun esityksen yleisestä johtamisesta ja valvonnasta. @fi
label: har filmregissør (person) @no
definition: Relaterer et verk til en person som er regissør med ansvar for generell ledelse av en filmet forestilling. @no
toolkit label: filmregissør (person) @no
toolkit definition: En person som er regissør med ansvar for generell ledelse av en filmet forestilling. @no
label: heeft filmregisseur-persoon @nl
definition: Relateert een werk aan een persoon die een regisseur is die verantwoordelijk is voor het algemeen beheer en toezicht van een gefilmde uitvoering. @nl
toolkit label: filmregisseur-persoon @nl
toolkit definition: Een persoon die een regisseur is die verantwoordelijk is voor het algemeen beheer en toezicht van een gefilmde uitvoering. @nl
label: له شخص مخرج أفلام @ar
definition: يربط بين عمل وشخص يكون مخرجًا مسئولاً عن الإدارة العامة والإشراف على أداء مصوَّر. @ar
toolkit label: شخص مخرج أفلام @ar
toolkit definition: شخص يكون مخرجًا مسئولاً عن الإدارة العامة والإشراف على أداء مصوَّر. @ar
label: té com a persona directora cinematogràfica @ca
definition: Relaciona una obra amb una persona que és un director que és responsable de la gestió general i la supervisió d’una actuació filmada. @ca
toolkit label: persona directora cinematogràfica @ca
toolkit definition: Persona que és un director que és responsable de la gestió general i la supervisió d’una actuació filmada. @ca
label: har person, som er filminstruktør @da
definition: Relaterer et værk til en person, som er en instruktør, som er ansvarlig for den generelle ledelse af- og tilsyn med en filmoptagelse. @da
toolkit label: person, som er filminstruktør @da
toolkit definition: Person, som er en instruktør, som er ansvarlig for den generelle ledelse af- og tilsyn med en filmoptagelse. @da
label: filmirežissöör (isik) @et
definition: Seostab teose isikuga, kes on filmitava etenduse üldise juhtimise ja juhendamise eest vastutav režissöör. @et
alternative label: filmilavastaja (isik) @et
toolkit label: filmirežissöör (isik) @et
toolkit definition: Isik, kes on filmitava etenduse üldise juhtimise ja juhendamise eest vastutav režissöör. @et
label: hat Filmregisseurin/Filmregisseur (Person) @de
definition: Setzt ein Werk in Beziehung zu einer Regisseurin/einem Regisseur (Person), die/der für das allgemeine Management und die Leitung einer verfilmten Darbietung verantwortlich ist. @de
toolkit label: Filmregisseurin/Filmregisseur (Person) @de
toolkit definition: Eine Regisseurin/Ein Regisseur (Person), die/der für das allgemeine Management und die Leitung einer verfilmten Darbietung verantwortlich ist. @de
label: filmrendező személye a következő: @hu
definition: Hozzákapcsol egy művet egy rendező személyhez, aki felelős egy filmre vett előadás általános menedzseléséért és felügyeletéért. @hu
toolkit label: filmrendező személy: @hu
toolkit definition: Egy rendező személy, aki felelős egy filmre vett előadás általános menedzseléséért és felügyeletéért. @hu
label: ha come regista cinematografico persona @it
definition: Correla un'opera alla persona regista responsabile della gestione e della supervisione generali di un'interpretazione cinematografica. @it
toolkit label: regista cinematografico persona @it
toolkit definition: Persona regista responsabile per la gestione generale e della supervisionedi un'interpretazione cinematografica. @it
label: a pour personne réalisatrice de cinéma @fr
definition: Met une œuvre en relation avec une personne réalisatrice qui est responsable de la gestion et de la supervision générales d’une prestation filmée. @fr
toolkit label: personne réalisatrice de cinéma @fr
toolkit definition: Personne réalisatrice qui est responsable de la gestion et de la supervision générales d’une prestation filmée. @fr
label: kinorežisors (persona) @lv
definition: Sasaista darbu ar personu, kura ir atbildīga par uzfilmētā pasākuma vispārējo vadību un uzraudzību. @lv
toolkit label: kinorežisors (persona) @lv
toolkit definition: Persona, kura ir atbildīga par uzfilmētā pasākuma vispārējo vadību un uzraudzību. @lv
alternative label: personne réalisatrice de film @fr
label: 有电影导演个人 @zh-hans
definition: 将一种作品与作为一个导演并负责拍摄表演的总体管理和监督的一个个人关联起来。 @zh-hans
toolkit label: 电影导演个人 @zh-hans
toolkit definition: 作为一个导演并负责拍摄表演的总体管理和监督的一个个人 @zh-hans
has subproperty: P10418
label: film yönetmeni kişisi ile ilişkilidir @tr
definition: Bir eseri, filme alınmış bir performansın genel yönetim ve denetiminden sorumlu yönetmen olan kişiyle ilişkilendirir. @tr
toolkit label: film yönetmeni @tr
toolkit definition: Filme alınmış bir performansın genel yönetim ve denetiminden sorumlu olan yönetmen kişi. @tr

is adapted as motion picture screenplay work
status: Published
definition: Relates a work to a work that consists of a screenplay for a motion picture, based on another work.
type: Property
domain: C10001
sub property of: is adapted as screenplay work
lexical alias: adaptedAsMotionPictureScreenplayWork.en
toolkit label: adapted as motion picture screenplay work
toolkit definition: A work that consists of a screenplay for a motion picture, based on another work.
toolkit label: adapté en scénario de film (œuvre) @fr
toolkit definition: Œuvre qui consiste en un scénario de film basé sur une autre œuvre. @fr
toolkit label: adaptada como guión cinematográfico (obra) @es
toolkit definition: Una obra que consiste en un guión para una película cinematográfica, basado en la obra fuente. @es
instruction number: 24.5
label: er bearbejdet til filmmanuskriptværk @da
definition: Relaterer et værk til et værk, som består af et manuskript til en spillefilm, baseret på et oprindeligt værk. @da
toolkit label: bearbejdet til filmmanuskriptværk @da
toolkit definition: Værk, som består af et manuskript til en spillefilm, baseret på et oprindeligt værk. @da
definition: Met une œuvre en relation avec une œuvre qui consiste en un scénario de film basé sur une autre œuvre. @fr
label: được phỏng theo như là kịch bản phim điện ảnh (tác phẩm) @vi
definition: Liên kết tác phẩm với tác phẩm có chứa kịch bản của phim điện ảnh, dựa trên tác phẩm nguồn. @vi
toolkit label: được phỏng theo như là kịch bản phim điện ảnh (tác phẩm) @vi
toolkit definition: Tác phẩm có chứa kịch bản của phim điện ảnh, dựa trên tác phẩm nguồn. @vi
label: ist bearbeitet als Filmdrehbuch (Werk) @de
definition: Setzt ein Werk in Beziehung zu einem Werk, das aus dem Drehbuch für einen Film besteht, das auf einem anderen Werk basiert. @de
toolkit label: Bearbeitet als Filmdrehbuch (Werk) @de
toolkit definition: Ein Werk, das aus dem Drehbuch für einen Film besteht, das auf einem anderen Werk basiert. @de
label: est adapté en scénario de film (œuvre) @fr
definition: Liittää teoksen teokseen, joka koostuu toiseen teokseen perustuvasta elokuvan käsikirjoituksesta. @fi
toolkit label: sovitettu elokuvakäsikirjoitukseksi (teos) @fi
toolkit definition: Teos, joka koostuu toiseen teokseen perustuvasta elokuvan käsikirjoituksesta. @fi
toolkit label: bearbeidet som manus for spillefilm (verk) @no
toolkit definition: Et verk som består av et manuskript for en spillefilm, basert på et kildeverk. @no
label: és adaptat com a obra de guió de pel·lícula cinematogràfica @ca
definition: Relaciona una obra amb una obra que consisteix en un guió d’una pel·lícula cinematogràfica basat en una altra obra. @ca
toolkit label: adaptat com a obra de guió de pel·lícula cinematogràfica @ca
toolkit definition: Obra que consisteix en un guió d’una pel·lícula cinematogràfica basat en una altra obra. @ca
has element type: 2
label: είναι προσαρμοσμένο ως σενάριο κινηματογραφικής ταινίας (έργο) @el
definition: Συνδέει ένα έργο με ένα έργο που συνίσταται από ένα σενάριο για μια κινηματογραφική ταινία βασισμένο σε ένα έργο-πηγή. @el
toolkit label: προσαρμοσμένο ως σενάριο κινηματογραφικής ταινίας (έργο) @el
toolkit definition: Ένα έργο που συνίσταται από ένα σενάριο για μια κινηματογραφική ταινία βασισμένο σε ένα έργο-πηγή. @el
label: mozgóforgatókönyvmű-feldolgozása a következő: @hu
definition: Hozzákapcsol egy művet egy műhöz, amely egy másik művön alapuló mozgókép forgatókönyvéből áll. @hu
toolkit label: mozgóképforgatókönyvmű-feldolgozása: @hu
toolkit definition: Egy mű, amely egy másik művön alapuló mozgókép forgatókönyvéből áll. @hu
label: sovitettu elokuvakäsikirjoitukseksi (teos) @fi
label: er bearbeidet som manus for spillefilm (verk) @no
definition: Relaterer et verk til et verk som består av et manuskript for en spillefilm, basert på et kildeverk. @no
label: is bewerkt als speelfilmscenariowerk @nl
definition: Relateert een werk aan een werk dat bestaat uit een scenario voor een speelfilm, gebaseerd op een ander werk. @nl
toolkit label: bewerkt als speelfilmscenariowerk @nl
toolkit definition: Een werk dat bestaat uit een scenario voor een speelfilm, gebaseerd op een ander werk. @nl
label: هو معالج كعمل سيناريو فيلم سينمائي @ar
definition: يربط عمل بعمل يتكون من سيناريو فيلم سينمائي، مبني على عمل آخر. @ar
toolkit label: معالج كعمل سيناريو فيلم سينمائي @ar
toolkit definition: عمل يتكون من سيناريو فيلم سينمائي، مبني على عمل آخر. @ar
label: adapteeritud filmistsenaariumina (teos) @et
definition: Seostab teose teosega, mis on allikteosel põhinev stsenaarium filmi jaoks. @et
toolkit label: adapteeritud filmistsenaariumina (teos) @et
toolkit definition: Teos, mis on allikteosel põhinev stsenaarium filmi jaoks. @et
label: è adattata come opera in forma di sceneggiatura cinematografica @it
definition: Correla un’opera a un’opera che consiste di una sceneggiatura per un film, basata su un’opera di partenza. @it
toolkit label: adattata come opera in forma di sceneggiatura cinematografica @it
toolkit definition: Opera che consiste di una sceneggiatura per un film, basata su un’opera di partenza. @it
label: ir adaptēts kā kinoscenārijs (darbs) @lv
definition: Sasaista darbu ar darbu - kinofilmas scenārijs veidots pēc pamatdarba. @lv
toolkit label: adaptēts kā darbs: kinoscenārijs @lv
toolkit definition: Darbs - kinofilmas scenārijs veidots pēc pamatdarba. @lv
label: 被改编为电影剧本作品 @zh-hans
definition: 将一种作品与由基于另一种作品的一种动态图像作品的剧本组成的一种作品关联起来。 @zh-hans
toolkit label: 被改编为电影剧本作品 @zh-hans
toolkit definition: 由基于另一种作品的一种动态图像作品的剧本组成的一种作品 @zh-hans
has subproperty: P10094
label: sinema filmi senaryosu eseri olarak uyarlanmıştır @tr
definition: Bir eseri, başka bir eserden uyarlanan bir sinema filmi senaryosundan oluşan bir eserle ilişkilendirir. @tr
toolkit label: sinema filmi senaryo çalışması olarak uyarlanan @tr
toolkit definition: Başka bir esere dayalı olarak bir sinema filmi senaryosundan oluşan eser. @tr

has motion picture screenplay work
status: Published
definition: Relates a work to a work that is textual work that complements a work that is a motion picture.
type: Property
domain: C10001
sub property of: has screenplay work
lexical alias: motionPictureScreenplayWork.en
toolkit label: motion picture screenplay work
toolkit definition: A work that is textual work that complements a work that is a motion picture.
toolkit label: scénario de film (œuvre) @fr
toolkit definition: Œuvre textuelle qui complète une œuvre cinématographique. @fr
toolkit label: guión cinematográfico (obra) @es
toolkit definition: Una obra que proporciona el texto para una película cinematográfica. @es
instruction number: 24.5
label: har filmmanuskriptværk @da
definition: Relaterer et værk til et værk, som realiseres som tekst, som komplementerer et værk, som er en spillefilm. @da
toolkit label: filmmanuskriptværk @da
toolkit definition: Værk, som realiseres som tekst, som komplementerer et værk, som er en spillefilm. @da
definition: Met une œuvre en relation avec une œuvre textuelle qui complète une œuvre cinématographique. @fr
label: làkịch bản điện ảnh (tác phẩm) @vi
definition: Liên kết tác phẩm với tác phẩm cung cấp văn bản cho phim điện ảnh. @vi
toolkit label: kịch bản điện ảnh (tác phẩm) @vi
toolkit definition: Tác phẩm cung cấp văn bản cho phim điện ảnh. @vi
label: hat Filmdrehbuch (Werk) @de
definition: Setzt ein Werk in Beziehung zu einem textlichen Werk, das ein Filmwerk ergänzt. @de
toolkit label: Filmdrehbuch (Werk) @de
toolkit definition: Ein textliches Werk, das ein Filmwerk ergänzt. @de
label: a pour scénario de film (œuvre) @fr
definition: Liittää teoksen teokseen, joka on tekstiteos, joka täydentää teosta, joka on elokuva. @fi
toolkit label: elokuvan käsikirjoitus (teos) @fi
toolkit definition: Teos, joka on tekstiteos, joka täydentää teosta, joka on elokuva. @fi
toolkit label: manus for spillefilm (verk) @no
toolkit definition: Et verk som realiseres som tekst som utfyller et verk som er en spillefilm. @no
label: té com a obra de guió de pel·lícula cinematogràfica @ca
definition: Relaciona una obra amb una obra que és una obra textual que complementa una obra que és una pel·lícula cinematogràfica. @ca
toolkit label: obra de guió de pel·lícula cinematogràfica @ca
toolkit definition: Obra que és una obra textual que complementa una obra que és una pel·lícula cinematogràfica. @ca
has element type: 2
label: είναι σενάριο κινηματογραφικής ταινίας (έργο) @el
definition: Συνδέει ένα έργο με ένα έργο το οποίο παρέχει κείμενο για μια κινηματογραφική ταινία. @el
toolkit label: σενάριο κινηματογραφικής ταινίας (έργο) @el
toolkit definition: Ένα έργο το οποίο παρέχει κείμενο για μια κινηματογραφική ταινία. @el
label: filmforgatókönyv-műve a következő: @hu
definition: Hozzákapcsol egy művet egy szöveges műhöz, amely kiegészít egy mozgóképművet. @hu
toolkit label: filmforgatókönyvmű @hu
toolkit definition: Egy szöveges mű, amely kiegészít egy mozgóképművet. @hu
label: elokuvan käsikirjoitus (teos) @fi
definition: Relaterer et verk til et verk som realiseres som tekst som utfyller et verk som er en spillefilm. @no
label: heeft speelfilmscenario-werk @nl
definition: Relateert een werk aan een werk dat tekstwerk is dat een werk complementeert dat een speelfilm is. @nl
toolkit label: speelfilmscenariowerk @nl
toolkit definition: Een werk dat tekstwerk is dat een werk complementeert dat een speelfilm is. @nl
label: له عمل سيناريو فيلم سينمائي @ar
definition: يربط عمل بعمل عبارة عن عمل نصي يكمل عملًا عبارة عن فيلم سينمائي. @ar
toolkit label: عمل سيناريو فيلم سينمائي @ar
toolkit definition: عمل عبارة عن عمل نصي يكمل عملًا يمثل فيلم سينمائي. @ar
label: filmistsenaarium (teos) @et
definition: Seostab teose tekstteosega, mis täiendab filmiteost. @et
toolkit label: filmistsenaarium (teos) @et
toolkit definition: Tekstteos, mis täiendab filmiteost. @et
label: ha come sceneggiatura cinematografica opera @it
definition: Correla un’opera a un’opera che è realizzata come un testo che completa un’opera che è un film. @it
toolkit label: sceneggiatura cinematografica opera @it
toolkit definition: Opera che è realizzata come un testo che completa un’opera che è un film. @it
label: darbs: kinoscenārijs @lv
definition: Sasaista darbu ar darbu, kas ir realizēts kā teksts, kas papildina darbu, kas ir kinofilma. @lv
toolkit label: darbs: kinoscenārijs @lv
toolkit definition: Darbs, kas ir realizēts kā teksts, kas papildina darbu, kas ir kinofilma. @lv
label: 有电影剧本作品 @zh-hans
definition: 将一种作品与作为一种文字作品并补充作为一种电影的一种作品的一种作品关联起来。 @zh-hans
toolkit label: 电影剧本作品 @zh-hans
toolkit definition: 作为一种文字作品并补充作为一种电影的一种作品的一种作品 @zh-hans
has subproperty: P10160
label: sinema filmi senaryosu eseri ile ilişkilidir @tr
definition: Bir eseri, sinema filmi olan bir eseri tamamlayan metinsel bir eserle ilişkilendirir. @tr
toolkit label: sinema filmi senaryo çalışması @tr
toolkit definition: Sinema filmi olan bir eseri tamamlayan metinsel bir eser @tr

has filmmaker agent
status: Published
definition: Relates a work to an agent who is responsible for creating an independent or personal film.
type: Property
scope note: A filmmaker is individually responsible for the conception and execution of all aspects of the film.
domain: C10001
sub property of: has creator agent of work
lexical alias: filmmakerAgent.en
toolkit label: filmmaker agent
toolkit definition: An agent who is responsible for creating an independent or personal film.
toolkit label: agent cinéaste @fr
toolkit definition: Agent qui est responsable de la création d’un film indépendant ou personnel. @fr
toolkit label: cineasta @es
toolkit definition: Una persona, familia o entidad corporativa responsable de la creación una película cinematográfica independiente o personal. @es
instruction number: 18.5
label: har agent, som er filmskaber @da
definition: Relaterer et værk til en agent, som er ansvarlig for at skabe en indiefilm eller personlig film. @da
scope note: Filmskaberen er individuelt ansvarlig for udtænkning og udførelse af alle filmens aspekter. @da
toolkit label: agent, som er filmskaber @da
toolkit definition: Agent, som er ansvarlig for at skabe en indiefilm eller personlig film. @da
definition: Met une œuvre en relation avec un agent qui est responsable de la création d’un film indépendant ou personnel. @fr
label: có người làm phim @vi
definition: Liên kết tác phẩm với tác nhân có trách nhiệm tạo lập phim độc lập hoặc cá nhân. @vi
scope note: Người làm phim có trách nhiệm về ý niệm và thực hiện tất cả các khía cạnh của phim đó. @vi
toolkit label: người làm phim @vi
toolkit definition: Tác nhân có trách nhiệm tạo lập phim độc lập hoặc cá nhân. @vi
label: hat Filmemacherin/Filmemacher (Akteur) @de
definition: Setzt ein Werk in Beziehung zu einem Akteur, der für die Schaffung eines unabhängigen oder privaten Films verantwortlich ist. @de
scope note: Eine Filmemacherin/Ein Filmemacher ist persönlich für das Konzept und die Ausführung aller Aspekte des Films verantwortlich. @de
toolkit label: Filmemacherin/Filmemacher (Akteur) @de
toolkit definition: Ein Akteur, der für die Schaffung eines unabhängigen oder privaten Films verantwortlich ist. @de
label: a pour agent cinéaste @fr
definition: Liittää teoksen toimijaan, joka on vastuussa riippumattoman tai henkilökohtaisen elokuvan luomisesta. @fi
toolkit label: elokuvantekijä (toimija) @fi
toolkit definition: Toimija, joka on vastuussa riippumattoman tai henkilökohtaisen elokuvan luomisesta. @fi
toolkit label: filmskaper (agent) @no
toolkit definition: En agent som er ansvarlig for å skape en uavhengig eller personlig film. @no
label: té com a agent cineasta @ca
definition: Relaciona una obra amb un agent que és responsable de la creació d’una pel·lícula cinematogràfica independent o personal. @ca
scope note: Un cineasta és responsable a títol individual de la concepció i l’execució de tots els aspectes de la pel·lícula. @ca
toolkit label: agent cineasta @ca
toolkit definition: Agent que és responsable de la creació d’una pel·lícula cinematogràfica independent o personal. @ca
scope note: Un cinéaste est responsable à titre individuel de la conception et de l’exécution de tous les aspects du film. @fr
has element type: 2
label: έχει σκηνοθέτη @el
definition: Συνδέει ένα έργο με έναν φορέα υπεύθυνο για τη δημιουργία ενός ανεξάρτητου ή προσωπικού φιλμ. @el
scope note: Ένας σκηνοθέτης είναι ατομικά υπεύθυνος για τη σύλληψη και εκτέλεση όλων των πτυχών της ταινίας. @el
toolkit label: σκηνοθέτης @el
toolkit definition: Ένας φορέας υπεύθυνος για τη δημιουργία ενός ανεξάρτητου ή προσωπικού φιλμ. @el
label: filmkészítő ágense a következő: @hu
definition: Hozzákapcsol egy művet egy ágenshez, amely felelős egy független- vagy egy magánfilm létrehozásáért. @hu
scope note: filmkészítő ágens: @hu
toolkit label: Egy ágens, amely felelős egy független vagy egy magánfilm létrehozásáért. @hu
toolkit definition: filmkészítő: @hu
alternative label: filmmaker
scope note: Tekijä vastaa itse kaikilta osin elokuvan ideoinnista ja toteuttamisesta. @fi
alternative label: elokuvantekijä @fi
label: elokuvantekijä (toimija) @fi
label: har filmskaper (agent) @no
definition: Relaterer et verk til en agent som er ansvarlig for å skape en uavhengig eller personlig film. @no
scope note: En filmskaper har personlig ansvar for planen med og gjennomføringen av alle aspektene ved filmen. @no
alternative label: filmskaper @no
label: heeft filmmaker-actor @nl
definition: Relateert een werk aan een actor die verantwoordelijk is voor het creëren van een zelfstandige of persoonlijke film. @nl
scope note: Een filmmaker is individueel verantwoordelijk voor de conceptie en uitvoering van alle aspecten van de film. @nl
toolkit label: filmmaker-actor @nl
toolkit definition: Een actor die verantwoordelijk is voor het creëren van een zelfstandige of persoonlijke film. @nl
label: له وكيل صانع أفلام @ar
definition: يربط بين عمل ووكيل مسئول عن صنع فيلم مستقل أو شخصي. @ar
scope note: صانع أفلام مسئول مسئولية فردية عن تصور جميع جوانب الفيلم وتنفيذه. @ar
alternative label: صانع أفلام @ar
toolkit label: وكيل صانع أفلام @ar
toolkit definition: وكيل مسئول عن صنع فيلم مستقل أو شخصي. @ar
alternative label: cineasta @ca
alternative label: filmskaber @da
label: filmitegija (tegija) @et
definition: Seostab teose tegijaga, kes vastutab sõltumatu või autorifilmi loomise eest. @et
scope note: Filmitegija vastutab üksinda kõigi filmi aspektide kontseptsiooni ja teostamise eest. @et
alternative label: filmitegija @et
toolkit label: filmitegija (tegija) @et

has filmmaker collective agent
status: Published
lexical alias: filmmakerCollectiveAgent.en
definition: Relates a work to a collective agent who is responsible for creating an independent or personal film.
toolkit label: filmmaker collective agent
toolkit definition: A collective agent who is responsible for creating an independent or personal film.
type: Property
domain: C10001
has element type: 2
sub property of: has creator collective agent of work
sub property of: has filmmaker agent
scope note: A filmmaker is individually responsible for the conception and execution of all aspects of the film.
label: elokuvantekijä (yhteistoimija) @fi
definition: Liittää teoksen yhteistoimijaan, joka on vastuussa riippumattoman tai henkilökohtaisen elokuvan luomisesta. @fi
scope note: Tekijä vastaa itse kaikilta osin elokuvan ideoinnista ja toteuttamisesta. @fi
toolkit label: elokuvantekijä (yhteistoimija) @fi
toolkit definition: Yhteistoimija, joka on vastuussa riippumattoman tai henkilökohtaisen elokuvan luomisesta. @fi
label: har filmskaper (kollektiv agent) @no
definition: Relaterer et verk til en kollektiv agent som er ansvarlig for å skape en uavhengig eller personlig film. @no
scope note: En filmskaper har personlig ansvar for planen med og gjennomføringen av alle aspektene ved filmen. @no
toolkit label: filmskaper (kollektiv agent) @no
toolkit definition: En kollektiv agent som er ansvarlig for å skape en uavhengig eller personlig film. @no
label: heeft filmmaker-collectieve actor @nl
definition: Relateert een werk aan een collectieve actor die verantwoordelijk is voor het creëren van een zelfstandige of persoonlijke film. @nl
scope note: Een filmmaker is individueel verantwoordelijk voor de conceptie en uitvoering van alle aspecten van de film. @nl
toolkit label: filmmaker-collectieve actor @nl
toolkit definition: Een collectieve actor die verantwoordelijk is voor het creëren van een zelfstandige of persoonlijke film. @nl
label: له وكيل جماعي صانع أفلام @ar
definition: يربط بين عمل ووكيل جماعي مسئول عن إنشاء فيلم مستقل أو شخصي. @ar
scope note: صانع أفلام مسئول مسئولية فردية عن تصور جميع جوانب الفيلم وتنفيذه. @ar
toolkit label: وكيل جماعي صانع أفلام @ar
toolkit definition: وكيل جماعي مسئول عن إنشاء فيلم مستقل أو شخصي. @ar
label: té com a agent col·lectiu cineasta @ca
definition: Relaciona una obra amb un agent col·lectiu que és responsable d’una pel·lícula cinematogràfica independent o personal. @ca
scope note: Un cineasta és responsable a títol individual de la concepció i l’execució de tots els aspectes de la pel·lícula. @ca
toolkit label: agent col·lectiu cineasta @ca
toolkit definition: Agent col·lectiu que és responsable d’una pel·lícula cinematogràfica independent o personal. @ca
label: har kollektiv agent, som er filmskaber @da
definition: Relaterer et værk til en kollektiv agent, som er ansvarlig for at skabe en indiefilm eller personlig film. @da
scope note: Filmskaberen er individuelt ansvarlig for udtænkning og udførelse af alle filmens aspekter. @da
toolkit label: kollektiv agent, som er filmskaber @da
toolkit definition: Kollektiv agent, som er ansvarlig for at skabe en indiefilm eller personlig film. @da
label: filmitegija (kollektiiv) @et
definition: Seostab teose kollektiiviga, kes vastutab sõltumatu või autorifilmi loomise eest. @et
scope note: Filmitegija vastutab üksinda kõigi filmi aspektide kontseptsiooni ja teostamise eest. @et
toolkit label: filmitegija (kollektiiv) @et
toolkit definition: Kollektiiv, kes vastutab sõltumatu või autorifilmi loomise eest. @et
label: hat Filmemacherin/Filmemacher (Gemeinschaftlicher Akteur) @de
definition: Setzt ein Werk in Beziehung zu einem gemeinschaftlichen Akteur, der für die Erstellung eines unabhängigen oder privaten Films verantwortlich ist. @de
scope note: Eine Filmemacherin/Ein Filmemacher ist persönlich für das Konzept und die Ausführung aller Aspekte des Films verantwortlich. @de
toolkit label: Filmemacherin/Filmemacher (Gemeinschaftlicher Akteur) @de
toolkit definition: Ein gemeinschaftlicher Akteur, der für die Erstellung eines unabhängigen oder privaten Films verantwortlich ist. @de
label: filmkészítő kollektív ágense a következő: @hu
definition: Hozzákapcsol egy művet egy kollektív ágenshez, amely felelős egy független- vagy egy magánfilm létrehozásáért. @hu
scope note: Egy filmkészítő egyénileg felelős egy film koncepciójáért és összes aspektusának végrehajtásáért. @hu
toolkit label: filmkészítő kollektív ágens: @hu
toolkit definition: Egy kollektív ágens, amely felelős egy független- vagy egy magánfilm létrehozásáért. @hu
label: ha come cineasta agente collettivo @it
definition: Correla un'opera all'agente collettivo responsabile della creazione di un film indipendente, o realizzato autonomamente. @it
scope note: Un cineasta è responsabile a livello individuale della concezione ed esecuzione di ogni aspetto del film. @it
toolkit label: cineasta agente collettivo @it
toolkit definition: Agente collettivo responsabile della creazione di un film indipendente, o realizzato autonomamente. @it
label: a pour agent collectif cinéaste @fr
definition: Met une œuvre en relation avec un agent collectif qui est responsable de la création d’un film indépendant ou personnel. @fr
scope note: Un cinéaste est responsable à titre individuel de la conception et de l’exécution de tous les aspects du film. @fr
toolkit label: agent collectif cinéaste @fr
toolkit definition: Agent collectif qui est responsable de la création d’un film indépendant ou personnel. @fr
label: filmas veidotājs (grupa) @lv
definition: Sasaista darbu ar grupu, kas ir atbildīga par neatkarīgas vai privātas filmas veidošanu un izpildi visos aspektos. @lv
toolkit label: filmas veidotājs (grupa) @lv
toolkit definition: Grupa, kas ir atbildīga par neatkarīgas vai privātas filmas veidošanu un izpildi visos aspektos. @lv
scope note: Filmas veidotājs ir pilnībā atbildīgs par visiem filmas koncepcijas un realizācijas aspektiem. @lv
label: 有制片人集体行为者 @zh-hans
definition: 将一种作品与负责创建一种独立或个人电影的一个集体行为者关联起来。 @zh-hans
toolkit label: 制片人集体行为者 @zh-hans
toolkit definition: 负责创建一种独立或个人电影的一个集体行为者 @zh-hans
scope note: 制片人对电影所有方面的构思和执行负有个人责任 @zh-hans
has subproperty: has filmmaker corporate body
has subproperty: has filmmaker family
has subproperty: P10497

has filmmaker corporate body
status: Published
lexical alias: filmmakerCorporateBody.en
definition: Relates a work to a corporate body who is responsible for creating an independent or personal film.
toolkit label: filmmaker corporate body
toolkit definition: A corporate body who is responsible for creating an independent or personal film.
type: Property
domain: C10001
has element type: 2
sub property of: has creator corporate body of work
sub property of: has filmmaker collective agent
scope note: A filmmaker is individually responsible for the conception and execution of all aspects of the film.
label: elokuvantekijä (yhteisö) @fi
definition: Liittää teoksen yhteisöön, joka on vastuussa riippumattoman tai henkilökohtaisen elokuvan luomisesta. @fi
scope note: Tekijä vastaa itse kaikilta osin elokuvan ideoinnista ja toteuttamisesta. @fi
toolkit label: elokuvantekijä (yhteisö) @fi
toolkit definition: Yhteisö, joka on vastuussa riippumattoman tai henkilökohtaisen elokuvan luomisesta. @fi
label: har filmskaper (korporasjon) @no
definition: Relaterer et verk til en korporasjon som er ansvarlig for å skape en uavhengig eller personlig film. @no
scope note: En filmskaper har personlig ansvar for planen med og gjennomføringen av alle aspektene ved filmen. @no
toolkit label: filmskaper (korporasjon) @no
toolkit definition: En korporasjon som er ansvarlig for å skape en uavhengig eller personlig film. @no
label: heeft filmmaker-corporatie @nl
definition: Relateert een werk aan een corporatie die verantwoordelijk is voor het creëren van een zelfstandige of persoonlijke film. @nl
scope note: Een filmmaker is individueel verantwoordelijk voor de conceptie en uitvoering van alle aspecten van de film. @nl
toolkit label: filmmaker-corporatie @nl
toolkit definition: Een corporatie die verantwoordelijk is voor het creëren van een zelfstandige of persoonlijke film. @nl
label: له هيئة صانعة أفلام @ar
definition: يربط بين عمل وهيئة مسئولة عن إنشاء فيلم مستقل أو شخصي. @ar
scope note: صانع أفلام مسئول مسئولية فردية عن تصور جميع جوانب الفيلم وتنفيذه. @ar
toolkit label: هيئة صانعة أفلام @ar
toolkit definition: هيئة مسئولة عن إنشاء فيلم مستقل أو شخصي. @ar
label: té com a entitat corporativa cineasta @ca
definition: Relaciona una obra amb una entitat corporativa que és responsable d’una pel·lícula cinematogràfica independent o personal. @ca
scope note: Un cineasta és responsable a títol individual de la concepció i l’execució de tots els aspectes de la pel·lícula. @ca
toolkit label: entitat corporativa cineasta @ca
toolkit definition: Entitat corporativa que és responsable d’una pel·lícula cinematogràfica independent o personal. @ca
label: har korporation, som er filmskaber @da
definition: Relaterer et værk til en korporation, som er ansvarlig for at skabe en indiefilm eller personlig film. @da
scope note: Filmskaberen er individuelt ansvarlig for udtænkning og udførelse af alle filmens aspekter. @da
toolkit label: korporation, som er filmskaber @da
toolkit definition: Korporation, som er ansvarlig for at skabe en indiefilm eller personlig film. @da
label: filmitegija (asutus) @et
definition: Seostab teose asutusega, kes vastutab sõltumatu või autorifilmi loomise eest. @et
scope note: Filmitegija vastutab üksinda kõigi filmi aspektide kontseptsiooni ja teostamise eest. @et
toolkit label: filmitegija (asutus) @et
toolkit definition: Asutus, kes vastutab sõltumatu või autorifilmi loomise eest. @et
label: hat Filmemacherin/Filmemacher (Körperschaft) @de
definition: Setzt ein Werk in Beziehung zu einer Körperschaft, die für die Erstellung eines unabhängigen oder privaten Films verantwortlich ist. @de
scope note: Eine Filmemacherin/Ein Filmemacher ist persönlich für das Konzept und die Ausführung aller Aspekte des Films verantwortlich. @de
toolkit label: Filmemacherin/Filmemacher (Körperschaft) @de
toolkit definition: Eine Körperschaft, die für die Erstellung eines unabhängigen oder privaten Films verantwortlich ist. @de
label: filmkészítő testülete a következő: @hu
definition: Hozzákapcsol egy művet egy testülethez, amely felelős egy független- vagy egy magánfilm létrehozásáért. @hu
scope note: Egy filmkészítő egyénileg felelős egy film koncepciójáért és összes aspektusának végrehajtásáért. @hu
toolkit label: filmkészítő testület: @hu
toolkit definition: Egy testület, amely felelős egy független- vagy egy magánfilm létrehozásáért. @hu
label: ha come cineasta ente @it
definition: Correla un'opera a un ente responsabile della creazione di un film indipendente o realizzato autonomamente. @it
scope note: Un cineasta è responsabile a livello individuale della concezione ed esecuzione di ogni aspetto del film. @it
toolkit label: cineasta ente @it
toolkit definition: Ente responsabile della creazione di un film indipendente o realizzato autonomamente. @it
label: a pour collectivité cinéaste @fr
definition: Met une œuvre en relation avec une collectivité qui est responsable de la création d’un film indépendant ou personnel. @fr
scope note: Un cinéaste est responsable à titre individuel de la conception et de l’exécution de tous les aspects du film. @fr
toolkit label: collectivité cinéaste @fr
toolkit definition: Collectivité qui est responsable de la création d’un film indépendant ou personnel. @fr
label: filmas veidotājs (institūcija) @lv
definition: Sasaista darbu ar institūciju, kas ir atbildīga par neatkarīgas vai privātas filmas veidošanu un izpildi visos aspektos. @lv
toolkit label: filmas veidotājs (institūcija) @lv
toolkit definition: Institūcija, kas ir atbildīga par neatkarīgas vai privātas filmas veidošanu un izpildi visos aspektos. @lv
scope note: Filmas veidotājs ir pilnībā atbildīgs par visiem filmas koncepcijas un realizācijas aspektiem. @lv
label: 有制片人团体 @zh-hans
definition: 将一种作品与负责创建一种独立或个人电影的一个团体关联起来。 @zh-hans
toolkit label: 制片人团体 @zh-hans
toolkit definition: 负责创建一种独立或个人电影的一个团体 @zh-hans
scope note: 制片人对电影所有方面的构思和执行负有个人责任 @zh-hans
has subproperty: P10544
label: film üreticisi tüzel kişisi ile ilişkilidir @tr
definition: Bir eseri, bağımsız veya kişisel bir film yaratmaktan sorumlu olan tüzel kişi ile ilişkilendirir. @tr

has filmmaker family
status: Published
lexical alias: filmmakerFamily.en
definition: Relates a work to a family who is responsible for creating an independent or personal film.
toolkit label: filmmaker family
toolkit definition: A family who is responsible for creating an independent or personal film.
type: Property
domain: C10001
has element type: 2
sub property of: has creator family of work
sub property of: has filmmaker collective agent
scope note: A filmmaker is individually responsible for the conception and execution of all aspects of the film.
label: elokuvantekijä (suku) @fi
definition: Liittää teoksen sukuun, joka on vastuussa riippumattoman tai henkilökohtaisen elokuvan luomisesta. @fi
scope note: Tekijä vastaa itse kaikilta osin elokuvan ideoinnista ja toteuttamisesta. @fi
toolkit label: elokuvantekijä (suku) @fi
toolkit definition: Suku, joka on vastuussa riippumattoman tai henkilökohtaisen elokuvan luomisesta. @fi
label: har filmskaper (familie) @no
definition: Relaterer et verk til en familie som er ansvarlig for å skape en uavhengig eller personlig film. @no
scope note: En filmskaper har personlig ansvar for planen med og gjennomføringen av alle aspektene ved filmen. @no
toolkit label: filmskaper (familie) @no
toolkit definition: En familie som er ansvarlig for å skape en uavhengig eller personlig film. @no
label: heeft filmmaker-familie @nl
definition: Relateert een werk aan een familie die verantwoordelijk is voor het creëren van een zelfstandige of persoonlijke film. @nl
scope note: Een filmmaker is individueel verantwoordelijk voor de conceptie en uitvoering van alle aspecten van de film. @nl
toolkit label: filmmaker-familie @nl
toolkit definition: Een familie die verantwoordelijk is voor het creëren van een zelfstandige of persoonlijke film. @nl
label: له عائلة صانعة أفلام @ar
definition: يربط بين عمل وعائلة مسئولة عن إنتاج فيلم مستقل أو شخصي. @ar
scope note: صانع أفلام مسئول مسئولية فردية عن تصور جميع جوانب الفيلم وتنفيذه. @ar
toolkit label: عائلة صانعة أفلام @ar
toolkit definition: عائلة مسئولة عن إنتاج فيلم مستقل أو شخصي. @ar
label: té com a família cineasta @ca
definition: Relaciona una obra amb una família que és responsable de la creació d’una pel·lícula cinematogràfica independent o personal. @ca
scope note: Un cineasta és responsable a títol individual de la concepció i l’execució de tots els aspectes de la pel·lícula. @ca
toolkit label: família cineasta @ca
toolkit definition: Família que és responsable de la creació d’una pel·lícula cinematogràfica independent o personal. @ca
label: har familie, som er filmskaber @da
definition: Relaterer et værk til en familie, som er ansvarlig for at skabe en indiefilm eller personlig film. @da
scope note: Filmskaberen er individuelt ansvarlig for udtænkning og udførelse af alle filmens aspekter. @da
toolkit label: familie, som er filmskaber @da
toolkit definition: Familie, som er ansvarlig for at skabe en indiefilm eller personlig film. @da
label: filmitegija (perekond) @et
definition: Seostab teose perekonnaga, kes vastutab sõltumatu või autorifilmi loomise eest. @et
scope note: Filmitegija vastutab üksinda kõigi filmi aspektide kontseptsiooni ja teostamise eest. @et
toolkit label: filmitegija (perekond) @et
toolkit definition: Perekond, kes vastutab sõltumatu või autorifilmi loomise eest. @et
label: hat Filmemacherin/Filmemacher (Familie) @de
definition: Setzt ein Werk in Beziehung zu einer Familie, die für Schaffung eines unabhängigen oder privaten Films verantwortlich ist. @de
scope note: Eine Filmemacherin/Ein Filmemacher ist persönlich für das Konzept und die Ausführung aller Aspekte des Films verantwortlich. @de
toolkit label: Filmemacherin/Filmemacher (Familie) @de
toolkit definition: Eine Familie, die für die Erstellung eines unabhängigen oder privaten Films verantwortlich ist. @de
label: filmkészítő családja a következő: @hu
definition: Hozzákapcsol egy művet egy családhoz, amely felelős egy független- vagy egy magánfilm létrehozásáért. @hu
scope note: Egy filmkészítő egyénileg felelős egy film koncepciójáért és összes aspektusának végrehajtásáért. @hu
toolkit label: filmkészítő család: @hu
toolkit definition: Egy család, amely felelős egy független- vagy egy magánfilm létrehozásáért. @hu
label: ha come cineasta famiglia @it
definition: Correla un'opera alla famiglia responsabile della creazione di un film indipendente o realizzato autonomamente. @it
scope note: Un cineasta è responsabile a livello individuale della concezione ed esecuzione di ogni aspetto del film. @it
toolkit label: cineasta famiglia @it
toolkit definition: Famiglia responsabile della creazione di un film indipendente o realizzato autonomamente. @it
label: a pour famille cinéaste @fr
definition: Met une œuvre en relation avec une famille qui est responsable de la création d’un film indépendant ou personnel. @fr
scope note: Un cinéaste est responsable à titre individuel de la conception et de l’exécution de tous les aspects du film. @fr
toolkit label: famille cinéaste @fr
toolkit definition: Famille qui est responsable de la création d’un film indépendant ou personnel. @fr
label: filmas veidotājs (dzimta/ģimene) @lv
definition: Sasaista darbu ar dzimtu/ģimeni, kas ir atbildīga par neatkarīgas vai privātas filmas veidošanu un izpildi visos aspektos. @lv
toolkit label: filmas veidotājs (dzimta/ģimene) @lv
toolkit definition: Dzimta/ģimene, kas ir atbildīga par neatkarīgas vai privātas filmas veidošanu un izpildi visos aspektos. @lv
scope note: Filmas veidotājs ir pilnībā atbildīgs par visiem filmas koncepcijas un realizācijas aspektiem. @lv
label: 有制片人家族 @zh-hans
definition: 将一种作品与负责创建一种独立或个人电影的一个家族关联起来。 @zh-hans
toolkit label: 制片人家族 @zh-hans
toolkit definition: 负责创建一种独立或个人电影的一个家族 @zh-hans
scope note: 制片人对电影所有方面的构思和执行负有个人责任 @zh-hans
has subproperty: P10591
label: film üreticisi ailesi ile ilişkilidir @tr
definition: Bir eseri, bağımsız veya kişisel bir film yaratmaktan sorumlu olan bir aileyle ilişkilendirir. @tr

has filmmaker person
status: Published
lexical alias: filmmakerPerson.en
definition: Relates a work to a person who is responsible for creating an independent or personal film.
toolkit label: filmmaker person
toolkit definition: A person who is responsible for creating an independent or personal film.
type: Property
domain: C10001
has element type: 2
sub property of: has creator person of work
sub property of: has filmmaker agent
scope note: A filmmaker is individually responsible for the conception and execution of all aspects of the film.
label: elokuvantekijä (henkilö) @fi
definition: Liittää teoksen henkilöön, joka on vastuussa riippumattoman tai henkilökohtaisen elokuvan luomisesta. @fi
scope note: Tekijä vastaa itse kaikilta osin elokuvan ideoinnista ja toteuttamisesta. @fi
toolkit label: elokuvantekijä (henkilö) @fi
toolkit definition: Henkilö, joka on vastuussa riippumattoman tai henkilökohtaisen elokuvan luomisesta. @fi
label: har filmskaper (person) @no
definition: Relaterer et verk til en person som er ansvarlig for å skape en uavhengig eller personlig film. @no
scope note: En filmskaper har personlig ansvar for planen med og gjennomføringen av alle aspektene ved filmen. @no
toolkit label: filmskaper (person) @no
toolkit definition: En person som er ansvarlig for å skape en uavhengig eller personlig film. @no
label: heeft filmmaker-persoon @nl
definition: Relateert een werk aan een persoon die verantwoordelijk is voor het creëren van een zelfstandige of persoonlijke film. @nl
scope note: Een filmmaker is individueel verantwoordelijk voor de conceptie en uitvoering van alle aspecten van de film. @nl
toolkit label: filmmaker-persoon @nl
toolkit definition: Een persoon die verantwoordelijk is voor het creëren van een zelfstandige of persoonlijke film. @nl
label: له شخص صانع أفلام @ar
definition: يربط بين عمل وشخص مسئول عن إنشاء فيلم مستقل أو شخصي. @ar
scope note: صانع أفلام مسئول مسئولية فردية عن تصور جميع جوانب الفيلم وتنفيذه. @ar
toolkit label: شخص صانع أفلام @ar
toolkit definition: شخص يكون مسئولاً عن إنشاء فيلم مستقل أو شخصي. @ar
label: té com a persona cineasta @ca
definition: Relaciona una obra amb una persona que és responsable de la creació d’una pel·lícula cinematogràfica independent o personal. @ca
scope note: Un cineasta és responsable a títol individual de la concepció i l’execució de tots els aspectes de la pel·lícula. @ca
toolkit label: persona cineasta @ca
toolkit definition: Persona que és responsable de la creació d’una pel·lícula cinematogràfica independent o personal. @ca
label: har person, som er filmskaber @da
definition: Relaterer et værk til en person, som er ansvarlig for at skabe en indiefilm eller personlig film. @da
scope note: Filmskaberen er individuelt ansvarlig for udtænkning og udførelse af alle filmens aspekter. @da
toolkit label: person, som er filmskaber @da
toolkit definition: Person, som er ansvarlig for at skabe en indiefilm eller personlig film. @da
label: filmitegija (isik) @et
definition: Seostab teose isikuga, kes vastutab sõltumatu või autorifilmi loomise eest. @et
scope note: Filmitegija vastutab üksinda kõigi filmi aspektide kontseptsiooni ja teostamise eest. @et
toolkit label: filmitegija (isik) @et
toolkit definition: Isik, kes vastutab sõltumatu või autorifilmi loomise eest. @et
label: hat Filmemacherin/Filmemacher (Person) @de
definition: Setzt ein Werk in Beziehung zu einer Person, die für Schaffung eines unabhängigen oder privaten Films verantwortlich ist. @de
scope note: Eine Filmemacherin/Ein Filmemacher ist persönlich für das Konzept und die Ausführung aller Aspekte des Films verantwortlich. @de
toolkit label: Filmemacherin/Filmemacher (Person) @de
toolkit definition: Eine Person, die für die Erstellung eines unabhängigen oder privaten Films verantwortlich ist. @de
label: filmkészítő személye a következő: @hu
definition: Hozzákapcsol egy művet egy személyhez, aki felelős egy független- vagy egy magánfilm létrehozásáért. @hu
scope note: Egy filmkészítő egyénileg felelős egy film koncepciójáért és összes aspektusának végrehajtásáért. @hu
toolkit label: filmkészítő személy: @hu
toolkit definition: Egy személy, aki felelős egy független vagy egy magánfilm létrehozásáért. @hu
label: ha come cineasta persona @it
definition: Correla un'opera alla persona responsabile della creazione di un film indipendente o realizzato autonomamente. @it
scope note: Un cineasta è responsabile a livello individuale della concezione ed esecuzione di ogni aspetto del film. @it
toolkit label: cineasta persona @it
toolkit definition: Persona responsabile della creazione di un film indipendente o realizzato autonomamente. @it
label: a pour personne cinéaste @fr
definition: Met une œuvre en relation avec une personne qui est responsable de la création d’un film indépendant ou personnel. @fr
scope note: Un cinéaste est responsable à titre individuel de la conception et de l’exécution de tous les aspects du film. @fr
toolkit label: personne cinéaste @fr
toolkit definition: Personne qui est responsable de la création d’un film indépendant ou personnel. @fr
label: filmas veidotājs (persona) @lv
definition: Sasaista darbu ar personu, kura ir atbildīga par neatkarīgas vai privātas filmas veidošanu un izpildi visos aspektos. @lv
toolkit label: filmas veidotājs (persona) @lv
toolkit definition: Persona, kura ir atbildīga par neatkarīgas vai privātas filmas veidošanu un izpildi visos aspektos. @lv
scope note: Filmas veidotājs ir pilnībā atbildīgs par visiem filmas koncepcijas un realizācijas aspektiem. @lv
label: 有制片人个人 @zh-hans
definition: 将一种作品与负责创建一种独立或个人电影的一个个人关联起来。 @zh-hans
toolkit label: 制片人个人 @zh-hans
toolkit definition: 负责创建一种独立或个人电影的一个个人 @zh-hans
scope note: 制片人对电影所有方面的构思和执行负有个人责任 @zh-hans
has subproperty: P10450
label: film üreticisi kişisi ile ilişkilidir @tr
definition: Bir eseri, bağımsız veya kişisel bir film oluşturmaktan sorumlu olan bir kişiyle ilişkilendirir. @tr

has film producer agent
status: Published
definition: Relates a work to an agent who is a producer who is responsible for most of the business aspects of the production of a film.
type: Property
domain: C10001
sub property of: has producer agent
lexical alias: filmProducerAgent.en
toolkit label: film producer agent
toolkit definition: An agent who is a producer who is responsible for most of the business aspects of the production of a film.
toolkit label: agent producteur de cinéma @fr
toolkit definition: Agent producteur qui est responsable de la majeure partie des aspects commerciaux de la production d’un film. @fr
toolkit label: productor cinematográfico @es
toolkit definition: Un productor responsable de la mayor parte de los aspectos empresariales relacionados con una película cinematográfica. @es
instruction number: 18.5
label: har agent, som er filmproducer @da
definition: Relaterer et værk til en agent, som er en producer, som er ansvarlig for størstedelen af de forretningsmæssige aspekter ved en film. @da
toolkit label: agent, som er filmproducer @da
toolkit definition: Agent, som er en producer, som er ansvarlig for størstedelen af de forretningsmæssige aspekter ved en film. @da
definition: Met une œuvre en relation avec un agent producteur qui est responsable de la majeure partie des aspects commerciaux de la production d’un film. @fr
label: có nhà sản xuất phim @vi
definition: Liên kết tác phẩm với nhà sản xuất có trách nhiệm với phần lớn khía cạnh kinh doanh của phim. @vi
toolkit label: nhà sản xuất phim @vi
toolkit definition: Nhà sản xuất có trách nhiệm với phần lớn khía cạnh kinh doanh của phim. @vi
label: hat Filmproduzentin/Filmproduzenten (Akteur) @de
definition: Setzt ein Werk in Beziehung zu einer Produzentin/einem Produzenten (Akteur), die/der für die meisten geschäftlichen Aspekte bei der Produktion eines Films verantwortlich ist. @de
toolkit label: Filmproduzentin/Filmproduzenten (Akteur) @de
toolkit definition: Eine Produzentin/Ein Produzent (Akteur), die/der für die meisten geschäftlichen Aspekte bei der Produktion eines Films verantwortlich ist. @de
label: a pour agent producteur de cinéma @fr
definition: Liittää teoksen toimijaan, joka on tuottaja, joka on vastuussa suurimmasta osasta elokuvan tuotannon liiketoiminnasta. @fi
toolkit label: elokuvatuottaja (toimija) @fi
toolkit definition: Toimija, joka on tuottaja, joka on vastuussa suurimmasta osasta elokuvan tuotannon liiketoiminnasta. @fi
toolkit label: filmprodusent (agent) @no
toolkit definition: En agent som er en produsent men ansvar for de fleste forretningsmessige aspektene ved en film. @no
label: té com a agent productor cinematogràfic @ca
definition: Relaciona una obra amb un agent que és un productor que és responsable de la majoria dels aspectes comercials de la producció d’una pel·lícula. @ca
toolkit label: agent productor cinematogràfic @ca
toolkit definition: Agent que és un productor que és responsable de la majoria dels aspectes comercials de la producció d’una pel·lícula. @ca
has element type: 2
label: έχει παραγωγό @el
definition: Συνδέει ένα έργο με έναν φορέα υπεύθυνο για τις περισσότερες επιχειρηματικές πτυχές μιας παραγωγής επί της οθόνης, ηχογράφησης, τηλεοπτικής, διαδικτυακής κ.λπ. @el
toolkit label: παραγωγός @el
toolkit definition: Ένας φορέας υπεύθυνος για τις περισσότερες επιχειρηματικές πτυχές μιας ταινίας. @el
label: filmproducer ágense a következő: @hu
definition: Hozzákapcsol egy művet egy producer ágenshez, amely felelős egy filmprodukció üzleti vonatkozásainak a zöméért. @hu
toolkit label: filmproducer ágens: @hu
toolkit definition: Egy producer ágens, aki felelős egy film üzleti vonatkozásainak a zöméért. @hu
alternative label: film producer
alternative label: elokuvatuottaja @fi
label: elokuvatuottaja (toimija) @fi
label: har filmprodusent (agent) @no
definition: Relaterer et verk til en agent som er en produsent med ansvar for de fleste forretningsmessige aspektene ved en film. @no
alternative label: filmprodusent @no
label: heeft filmproducent-actor @nl
definition: Relateert een werk aan een actor die een producent is die verantwoordelijk is voor het merendeel van de zakelijke aspecten van de productie van een film. @nl
toolkit label: filmproducent-actor @nl
toolkit definition: Een actor die een producent is die verantwoordelijk is voor het merendeel van de zakelijke aspecten van de productie van een film. @nl
label: وكيل منتج أفلام @ar
definition: يربط بين عمل ووكيل عبارة عن منتج مسئول عن معظم جوانب العمل في إنتاج فيلم. @ar
alternative label: منتج أفلام @ar
toolkit label: وكيل منتج أفلام @ar
toolkit definition: وكيل عبارة عن منتج مسئول عن معظم جوانب العمل في إنتاج فيلم. @ar
alternative label: productor cinematogràfic @ca
alternative label: filmproducer @da
label: filmiprodutsent (tegija) @et
definition: Seostab teose tegijaga, kes produtsendina vastutab enamiku äriliste aspektide eest filmi tootmisel. @et
alternative label: filmiprodutsent @et
toolkit label: filmiprodutsent (tegija) @et
toolkit definition: Tegija, kes produtsendina vastutab enamiku äriliste aspektide eest filmi tootmisel. @et
alternative label: filmproducer: @hu
label: ha come produttore cinematografico agente @it
definition: Correla un'opera all'agente produttore responsabile della maggior parte degli aspetti commerciali di un film. @it
alternative label: produttore cinematografico @it
toolkit label: produttore cinematografico agente @it
toolkit definition: Agente produttore responsabile della maggior parte degli aspetti commerciali di un film. @it
label: filmas producents (aģents) @lv
definition: Sasaista darbu ar aģentu, kas ir atbildīgs par filmas uzņemšanas finansiālajiem aspektiem. @lv
toolkit label: filmas producents (aģents) @lv
toolkit definition: Aģents, kas ir atbildīgs par filmas uzņemšanas finansiālajiem aspektiem. @lv
alternative label: Filmproduzent @de
alternative label: 电影制作者 @zh-hans
toolkit label: 电影制作者行为者 @zh-hans

has film producer collective agent
status: Published
lexical alias: filmProducerCollectiveAgent.en
definition: Relates a work to a collective agent who is a producer who is responsible for most of the business aspects of the production of a film.
toolkit label: film producer collective agent
toolkit definition: A collective agent who is a producer who is responsible for most of the business aspects of the production of a film.
type: Property
domain: C10001
has element type: 2
sub property of: has producer collective agent
sub property of: has film producer agent
label: elokuvatuottaja (yhteistoimija) @fi
definition: Liittää teoksen yhteistoimijaan, joka on tuottaja, joka on vastuussa suurimmasta osasta elokuvan tuotannon liiketoiminnasta. @fi
toolkit label: elokuvatuottaja (yhteistoimija) @fi
toolkit definition: Yhteistoimija, joka on tuottaja, joka on vastuussa suurimmasta osasta elokuvan tuotannon liiketoiminnasta. @fi
label: har filmprodusent (kollektiv agent) @no
definition: Relaterer et verk til en kollektiv agent som er en produsent med ansvar for de fleste forretningsmessige aspektene ved en film. @no
toolkit label: filmprodusent (kollektiv agent) @no
toolkit definition: En kollektiv agent som er en produsent med ansvar for de fleste forretningsmessige aspektene ved en film. @no
label: heeft filmproducent-collectieve actor @nl
definition: Relateert een werk aan een collectieve actor die een producent is die verantwoordelijk is voor het merendeel van de zakelijke aspecten van de productie van een film. @nl
toolkit label: filmproducent-collectieve actor @nl
toolkit definition: Een collectieve actor die een producent is die verantwoordelijk is voor het merendeel van de zakelijke aspecten van de productie van een film. @nl
label: له وكيل جماعي منتج أفلام @ar
definition: يربط بين عمل ووكيل جماعي يكون منتجًا مسئولاً عن معظم جوانب العمل في إنتاج فيلم. @ar
toolkit label: وكيل جماعي منتج أفلام @ar
toolkit definition: وكيل جماعي يكون منتجًا مسئولاً عن معظم جوانب العمل في إنتاج فيلم. @ar
label: té com a agent col·lectiu productor cinematogràfic @ca
definition: Relaciona una obra amb un agent col·lectiu que és un productor que és responsable de la majoria dels aspectes comercials de la producció d’una pel·lícula. @ca
toolkit label: agent col·lectiu productor cinematogràfic @ca
toolkit definition: Agent col·lectiu que és un productor que és responsable de la majoria dels aspectes comercials de la producció d’una pel·lícula. @ca
label: har kollektiv agent, som er filmproducer @da
definition: Relaterer et værk til en kollektiv agent, som er en producer, som er ansvarlig for størstedelen af de forretningsmæssige aspekter ved en film. @da
toolkit label: kollektiv agent, som er filmproducer @da
toolkit definition: Kollektiv agent, som er en producer, som er ansvarlig for størstedelen af de forretningsmæssige aspekter ved en film. @da
label: filmiprodutsent (kollektiiv) @et
definition: Seostab teose kollektiiviga, kes produtsendina vastutab enamiku äriliste aspektide eest filmi tootmisel. @et
toolkit label: filmiprodutsent (kollektiiv) @et
toolkit definition: Kollektiiv, kes produtsendina vastutab enamiku äriliste aspektide eest filmi tootmisel. @et
label: hat Filmproduzentin/Filmproduzenten (Gemeinschaftlicher Akteur) @de
definition: Setzt ein Werk in Beziehung zu einer Produzentin/einem Produzenten (Gemeinschaftlicher Akteur), die/der für die meisten geschäftlichen Aspekte bei der Produktion eines Films verantwortlich ist. @de
toolkit label: Filmproduzentin/Filmproduzent (Gemeinschaftlicher Akteur) @de
toolkit definition: Eine Produzentin/Ein Produzent (Gemeinschaftlicher Akteur), die/der für die meisten geschäftlichen Aspekte bei der Produktion eines Films verantwortlich ist. @de
label: filmproducer kollektív ágense a következő: @hu
definition: Hozzákapcsol egy művet egy producer kollektív ágenshez, amely felelős egy filmprodukció üzleti vonatkozásainak a zöméért. @hu
toolkit label: filmproducer kollektív ágens: @hu
toolkit definition: Egy producer kollektív ágens, amely felelős egy filmprodukció üzleti vonatkozásainak a zöméért. @hu
label: ha come produttore cinematografico agente collettivo @it
definition: Correla un'opera all'agente collettivo produttore responsabile della gestione della maggior parte degli aspetti commerciali di un film. @it
toolkit label: produttore cinematografico agente collettivo @it
toolkit definition: Agente collettivo produttore responsabile della gestione della maggior parte degli aspetti commerciali di un film. @it
label: a pour agent collectif producteur de cinéma @fr
definition: Met une œuvre en relation avec un agent collectif producteur qui est responsable de la majeure partie des aspects commerciaux de la production d’un film. @fr
toolkit label: agent collectif producteur de cinéma @fr
toolkit definition: Agent collectif producteur qui est responsable de la majeure partie des aspects commerciaux de la production d’un film. @fr
label: filmas producents (grupa) @lv
definition: Sasaista darbu ar grupu, kas ir atbildīga par filmas uzņemšanas finansiālajiem aspektiem. @lv
toolkit label: filmas producents (grupa) @lv
toolkit definition: Grupa, kas ir atbildīga par filmas uzņemšanas finansiālajiem aspektiem. @lv
alternative label: agent collectif producteur de film @fr
label: 有电影制作者集体行为者 @zh-hans
definition: 将一种作品与作为制作者并负责电影制作的大部分商业运作的一个集体行为者关联起来。 @zh-hans
toolkit label: 电影制作者集体行为者 @zh-hans
toolkit definition: 作为制作者并负责电影制作的大部分商业运作的一个集体行为者 @zh-hans
has subproperty: has film producer corporate body
has subproperty: has film producer family
has subproperty: P10469
label: film yapımcısı kolektif temsilcisi ile ilişkilidir @tr
definition: Bir eseri, bir filmin yapımının ticari yönlerinin çoğundan sorumlu yapımcı olan kolektif bir temsilci ile ilişkilendirir. @tr
toolkit label: film yapımcısı kolektif temsilcisi @tr
toolkit definition: Bir filmin yapımının iş yönlerinin çoğundan sorumlu olan yapımcı olan kolektif bir temsilci. @tr

has film producer corporate body
status: Published
lexical alias: filmProducerCorporateBody.en
definition: Relates a work to a corporate body who is a producer who is responsible for most of the business aspects of the production of a film.
toolkit label: film producer corporate body
toolkit definition: A corporate body who is a producer who is responsible for most of the business aspects of the production of a film.
type: Property
domain: C10001
has element type: 2
sub property of: has producer corporate body
sub property of: has film producer collective agent
label: elokuvatuottaja (yhteisö) @fi
definition: Liittää teoksen yhteisöön, joka on tuottaja, joka on vastuussa suurimmasta osasta elokuvan tuotannon liiketoiminnasta. @fi
toolkit label: elokuvatuottaja (yhteisö) @fi
toolkit definition: Yhteisö, joka on tuottaja, joka on vastuussa suurimmasta osasta elokuvan tuotannon liiketoiminnasta. @fi
label: har filmprodusent (korporasjon) @no
definition: Relaterer et verk til en korporasjon som er en produsent med ansvar for de fleste forretningsmessige aspektene ved en film. @no
toolkit label: filmprodusent (korporasjon) @no
toolkit definition: En korporasjon som er en produsent med ansvar for de fleste forretningsmessige aspektene ved en film. @no
label: heeft filmproducent-corporatie @nl
definition: Relateert een werk aan een corporatie die een producent is die verantwoordelijk is voor het merendeel van de zakelijke aspecten van de productie van een film. @nl
toolkit label: filmproducent-corporatie @nl
toolkit definition: Een corporatie die een producent is die verantwoordelijk is voor het merendeel van de zakelijke aspecten van de productie van een film. @nl
label: له هيئة منتجة أفلام @ar
definition: يربط بين عمل وهيئة تكون منتجة مسئولة عن معظم جوانب العمل في فيلم. @ar
toolkit label: هيئة منتجة أفلام @ar
toolkit definition: هيئة تكون منتجة مسئولة عن معظم جوانب العمل في فيلم. @ar
label: té com a entitat corporativa productora cinematogràfica @ca
definition: Relaciona una obra amb una entitat corporativa que és un productor que és responsable de la majoria dels aspectes comercials de la producció d’una pel·lícula. @ca
toolkit label: entitat corporativa productora cinematogràfica @ca
toolkit definition: Entitat corporativa que és un productor que és responsable de la majoria dels aspectes comercials de la producció d’una pel·lícula. @ca
label: har korporation, som er filmproducer @da
definition: Relaterer et værk til en korporation, som er en producer, som er ansvarlig for størstedelen af de forretningsmæssige aspekter ved en film. @da
toolkit label: korporation, som er filmproducer @da
toolkit definition: Korporation, som er en producer, som er ansvarlig for størstedelen af de forretningsmæssige aspekter ved en film. @da
label: filmiprodutsent (asutus) @et
definition: Seostab teose asutusega, kes produtsendina vastutab enamiku äriliste aspektide eest filmi tootmisel. @et
toolkit label: filmiprodutsent (asutus) @et
toolkit definition: Asutus, kes produtsendina vastutab enamiku äriliste aspektide eest filmi tootmisel. @et
label: hat Filmproduzentin/Filmproduzenten (Körperschaft) @de
definition: Setzt ein Werk in Beziehung zu einer Produzentin/einem Produzenten (Körperschaft), die/der für die meisten geschäftlichen Aspekte bei der Produktion eines Films verantwortlich ist. @de
toolkit label: Filmproduzentin/Filmproduzent (Körperschaft) @de
toolkit definition: Eine Produzentin/Ein Produzent (Körperschaft), die/der für die meisten geschäftlichen Aspekte bei der Produktion eines Films verantwortlich ist. @de
label: filmproducer testülete a következő: @hu
definition: Hozzákapcsol egy művet egy producer testülethez, amely felelős egy filmprodukció üzleti vonatkozásainak a zöméért. @hu
toolkit label: filmproducer testület. @hu
toolkit definition: Egy producer testület, amely felelős egy film üzleti vonatkozásainak a zöméért. @hu
label: ha come produttore cinematografico ente @it
definition: Correla un'opera a un ente produttore responsabile della gestione della maggior parte degli aspetti commerciali di un film. @it
toolkit label: produttore cinematografico ente @it
toolkit definition: Ente produttore responsabile della gestione della maggior parte degli aspetti commerciali di un film. @it
label: a pour collectivité productrice de cinéma @fr
definition: Met une œuvre en relation avec une collectivité productrice qui est responsable de la majeure partie des aspects commerciaux de la production d’un film. @fr
toolkit label: collectivité productrice de cinéma @fr
toolkit definition: Collectivité productrice qui est responsable de la majeure partie des aspects commerciaux de la production d’un film. @fr
label: filmas producents (institūcija) @lv
definition: Sasaista darbu ar institūciju, kas ir atbildīga par filmas uzņemšanas finansiālajiem aspektiem. @lv
toolkit label: filmas producents (institūcija) @lv
toolkit definition: Institūcija, kas ir atbildīga par filmas uzņemšanas finansiālajiem aspektiem. @lv
alternative label: collectivité productrice de film @fr
label: 有电影制作者团体 @zh-hans
definition: 将一种作品与作为制作者并负责电影制作的大部分商业运作的一个团体关联起来。 @zh-hans
toolkit label: 电影制作者团体 @zh-hans
toolkit definition: 作为制作者并负责电影制作的大部分商业运作的一个团体 @zh-hans
has subproperty: P10516
label: film yapımcısı tüzel kişisi ile ilişkilidir @tr
definition: Bir eseri, bir filmin yapımının ticari yönlerinin çoğundan sorumlu olan bir yapımcı olan bir tüzel kişi ile ilişkilendirir. @tr
toolkit label: film yapımcısı tüzel kişisi @tr
toolkit definition: Bir filmin yapımının ticari yönlerinin çoğundan sorumlu olan bir yapımcı olan tüzel kişi. @tr

has film producer family
status: Published
lexical alias: filmProducerFamily.en
definition: Relates a work to a family who is a producer who is responsible for most of the business aspects of the production of a film.
toolkit label: film producer family
toolkit definition: A family who is a producer who is responsible for most of the business aspects of the production of a film.
type: Property
domain: C10001
has element type: 2
sub property of: has producer family
sub property of: has film producer collective agent
label: elokuvatuottaja (suku) @fi
definition: Liittää teoksen sukuun, joka on tuottaja, joka on vastuussa suurimmasta osasta elokuvan tuotannon liiketoiminnasta. @fi
toolkit label: elokuvatuottaja (suku) @fi
toolkit definition: Suku, joka on tuottaja, joka on vastuussa suurimmasta osasta elokuvan tuotannon liiketoiminnasta. @fi
label: har filmprodusent (familie) @no
definition: Relaterer et verk til en familie som er en produsent med ansvar for de fleste forretningsmessige aspektene ved en film. @no
toolkit label: filmprodusent (familie) @no
toolkit definition: En familie som er en produsent med ansvar for de fleste forretningsmessige aspektene ved en film. @no
label: heeft filmproducent-familie @nl
definition: Relateert een werk aan een familie die een producent is die verantwoordelijk is voor het merendeel van de zakelijke aspecten van de productie van een film. @nl
toolkit label: filmproducent-familie @nl
toolkit definition: Een familie die een producent is die verantwoordelijk is voor het merendeel van de zakelijke aspecten van de productie van een film. @nl
label: له عائلة منتجة أفلام @ar
definition: يربط بين عمل وعائلة تكون منتجة مسئولة عن معظم جوانب العمل في فيلم. @ar
toolkit label: عائلة منتجة أفلام @ar
toolkit definition: عائلة تكون منتجة مسئولة عن معظم جوانب العمل في فيلم. @ar
label: té com a família productora cinematogràfica @ca
definition: Relaciona una obra amb una família que és un productor que és responsable de la majoria dels aspectes comercials de la producció d’una pel·lícula. @ca
toolkit label: família productora cinematogràfica @ca
toolkit definition: Família que és un productor que és responsable de la majoria dels aspectes comercials de la producció d’una pel·lícula. @ca
label: har familie, som er filmproducer @da
definition: Relaterer et værk til en familie, som er en producer, som er ansvarlig for størstedelen af de forretningsmæssige aspekter ved en film. @da
toolkit label: familie, som er filmproducer @da
toolkit definition: Familie, som er en producer, som er ansvarlig for størstedelen af de forretningsmæssige aspekter ved en film. @da
label: filmiprodutsent (perekond) @et
definition: Seostab teose perekonnaga, kes produtsendina vastutab enamiku äriliste aspektide eest filmi tootmisel. @et
toolkit label: filmiprodutsent (perekond) @et
toolkit definition: Perekond, kes produtsendina vastutab enamiku äriliste aspektide eest filmi tootmisel. @et
label: hat Filmproduzentin/Filmproduzenten (Familie) @de
definition: Setzt ein Werk in Beziehung zu einer Produzentin/einem Produzenten (Familie), die/der für die meisten geschäftlichen Aspekte bei der Produktion eines Films verantwortlich ist. @de
toolkit label: Filmproduzentin/Filmproduzent (Familie) @de
toolkit definition: Eine/Produzentin/Ein Produzent (Familie), die/der für die meisten geschäftlichen Aspekte bei der Produktion eines Films verantwortlich ist. @de
label: filmproducer családja a következő: @hu
definition: Hozzákapcsol egy művet egy producer családhoz, amely felelős egy filmprodukció üzleti vonatkozásainak a zöméért. @hu
toolkit label: filmproducer család: @hu
toolkit definition: Egy producer család, amely felelős egy filmprodukció üzleti vonatkozásainak a zöméért. @hu
label: ha come produttore televisivo famiglia @it
definition: Correla un'opera alla famiglia produttore responsabile della gestione della maggior parte degli aspetti commerciali di un film. @it
toolkit label: produttore cinematografico famiglia @it
toolkit definition: Famiglia produttore responsabile della gestione della maggior parte degli aspetti commerciali di un film. @it
label: a pour famille productrice de cinéma @fr
definition: Met une œuvre en relation avec une famille productrice qui est responsable de la majeure partie des aspects commerciaux de la production d’un film. @fr
toolkit label: famille productrice de cinéma @fr
toolkit definition: Famille productrice qui est responsable de la majeure partie des aspects commerciaux de la production d’un film. @fr
label: filmas producents (dzimta/ģimene) @lv
definition: Sasaista darbu ar dzimtu/ģimeni, kas ir atbildīga par filmas uzņemšanas finansiālajiem aspektiem. @lv
toolkit label: filmas producents (dzimta/ģimene) @lv
toolkit definition: Dzimta/ģimene, kas ir atbildīga par filmas uzņemšanas finansiālajiem aspektiem. @lv
alternative label: famille productrice de film @fr
label: 有电影制作者家族 @zh-hans
definition: 将一种作品与作为制作者并负责电影制作的大部分商业运作的一个家族关联起来。 @zh-hans
toolkit label: 电影制作者家族 @zh-hans
toolkit definition: 作为制作者并负责电影制作的大部分商业运作的一个家族 @zh-hans
has subproperty: P10563
label: film yapımcısı ailesi ile ilişkilidir @tr
definition: Bir eseri, bir filmin yapımının ticari yönlerinin çoğundan sorumlu olan yapımcı bir aileyle ilişkilendirir. @tr
toolkit label: film yapımcısı ailesi @tr
toolkit definition: Bir filmin üretiminin ticari yönlerinin çoğundan sorumlu olan yapımcı bir aile. @tr

has film producer person
status: Published
lexical alias: filmProducerPerson.en
definition: Relates a work to a person who is a producer who is responsible for most of the business aspects of the production of a film.
toolkit label: film producer person
toolkit definition: A person who is a producer who is responsible for most of the business aspects the production of a film.
type: Property
domain: C10001
has element type: 2
sub property of: has producer person
sub property of: has film producer agent
label: elokuvatuottaja (henkilö) @fi
definition: Liittää teoksen henkilöön, joka on tuottaja, joka on vastuussa suurimmasta osasta elokuvan tuotannon liiketoiminnasta. @fi
toolkit label: elokuvatuottaja (henkilö) @fi
toolkit definition: Henkilö, joka on tuottaja, joka on vastuussa suurimmasta osasta elokuvan tuotannon liiketoiminnasta. @fi
label: har filmprodusent (person) @no
definition: Relaterer et verk til en person som er en produsent med ansvar for de fleste forretningsmessige aspektene ved en film. @no
toolkit label: filmprodusent (person) @no
toolkit definition: En person som er en produsent med ansvar for de fleste forretningsmessige aspektene ved en film. @no
label: heeft filmproducent-persoon @nl
definition: Relateert een werk aan een persoon die een producent is die verantwoordelijk is voor het merendeel van de zakelijke aspecten van de productie van een film. @nl
toolkit label: filmproducent-persoon @nl
toolkit definition: Een persoon die een producent is die verantwoordelijk is voor het merendeel van de zakelijke aspecten van de productie van een film. @nl
label: له شخص منتج أفلام @ar
definition: يربط بين عمل وشخص يكون منتجًا مسئولاً عن معظم جوانب العمل في فيلم. @ar
toolkit label: شخص منتج أفلام @ar
toolkit definition: شخص يكون منتجًا مسئولاً عن معظم جوانب العمل في فيلم. @ar
label: té com a persona productora cinematogràfica @ca
definition: Relaciona una obra amb una persona que és un productor que és responsable de la majoria dels aspectes comercials de la producció d’una pel·lícula. @ca
toolkit label: persona productora cinematogràfica @ca
toolkit definition: Persona que és un productor que és responsable de la majoria dels aspectes comercials de la producció d’una pel·lícula. @ca
label: har person, som er filmproducer @da
definition: Relaterer et værk til en person, som er en producer, som er ansvarlig for størstedelen af de forretningsmæssige aspekter ved en film. @da
toolkit label: person, som er filmproducer @da
toolkit definition: Person, som er en producer, som er ansvarlig for størstedelen af de forretningsmæssige aspekter ved en film. @da
label: filmiprodutsent (isik) @et
definition: Seostab teose isikuga, kes produtsendina vastutab enamiku äriliste aspektide eest filmi tootmisel. @et
toolkit label: filmiprodutsent (isik) @et
toolkit definition: Isik, kes produtsendina vastutab enamiku äriliste aspektide eest filmi tootmisel. @et
label: hat Filmproduzentin/Filmproduzenten (Person) @de
definition: Setzt ein Werk in Beziehung zu einer Produzentin/einem Produzenten (Person), die/der für die meisten geschäftlichen Aspekte bei der Produktion eines Films verantwortlich ist. @de
toolkit label: Filmproduzentin/Filmproduzent (Person) @de
toolkit definition: Eine Produzentin/Ein Produzent (Person), die/der für die meisten geschäftlichen Aspekte bei der Produktion eines Films verantwortlich ist. @de
label: filmproducer személye a következő: @hu
definition: Hozzákapcsol egy művet egy producer személyhez, aki felelős egy filmprodukció üzleti vonatkozásainak a zöméért. @hu
toolkit label: filmproducer személy: @hu
toolkit definition: Egy producer személy, aki felelős egy filmprodukció üzleti vonatkozásainak a zöméért. @hu
label: ha come produttore cinematografico persona @it
definition: Correla un'opera alla persona produttore responsabile della gestione della maggior parte degli aspetti commerciali di un film. @it
toolkit label: produttore cinematografico persona @it
toolkit definition: Persona produttore responsabile della gestione della maggior parte degli aspetti commerciali di un film. @it
label: a pour personne productrice de cinéma @fr
definition: Met une œuvre en relation avec une personne productrice qui est responsable de la majeure partie des aspects commerciaux de la production d’un film. @fr
toolkit label: personne productrice de cinéma @fr
toolkit definition: Personne productrice qui est responsable de la majeure partie des aspects commerciaux de la production d’un film. @fr
label: filmas producents (persona) @lv
definition: Sasaista darbu ar personu, kura ir atbildīga par filmas uzņemšanas finansiālajiem aspektiem. @lv
toolkit label: filmas producents (persona) @lv
toolkit definition: Persona, kura ir atbildīga par filmas uzņemšanas finansiālajiem aspektiem. @lv
alternative label: personne productrice de film @fr
label: 有电影制作者个人 @zh-hans
definition: 将一种作品与作为制作者并负责电影制作的大部分商业运作的一个个人关联起来。 @zh-hans
toolkit label: 电影制作者个人 @zh-hans
toolkit definition: 作为制作者并负责电影制作的大部分商业运作的一个个人 @zh-hans
has subproperty: P10422
label: film yapımcısı kişisi ile ilişkilidir @tr
definition: Bir eseri, bir filmin yapımıyla ilgili ticari yönlerinin çoğunu yönetmekten sorumlu yapımcı olan kişiyle ilişkilendirir. @tr
toolkit label: film yapımcısı @tr
toolkit definition: Bir filmin yapımıyla ilgili ticari yönlerinin çoğunu yönetmekten sorumlu olan yapımcı kişi. @tr

is sequel to (Deprecated)
status: Deprecated
definition: Relates a work to a work whose narrative is continued by a later work. (Deprecated)
type: Property
domain: C10001
sub property of: is preceded by work
lexical alias: sequelTo.en
toolkit label: sequel to (Deprecated)
toolkit definition: A work whose narrative is continued by a later work. (Deprecated)
toolkit label: suite de @fr
toolkit definition: Œuvre dont le récit est continué par une œuvre ultérieure. @fr
toolkit label: secuela de @es
toolkit definition: La obra cuya narración se continúa en una obra posterior. @es
instruction number: 24.5
label: er efterfølger til @da
definition: Relaterer et værk til et værk, hvis fortælling fortsættes af et senere værk. @da
toolkit label: efterfølger til @da
toolkit definition: Værk, hvis fortælling fortsættes af et senere værk. @da
definition: Met une œuvre en relation avec une œuvre dont le récit est continué par une œuvre ultérieure. @fr
label: là tác phẩm mở rộng của @vi
definition: Liên kết tác phẩm với tác phẩm mà câu chuyện kể của nó được tiếp tục bởi nội dung của tác phẩm sau này. @vi
toolkit label: tác phẩm mở rộng của @vi
toolkit definition: Tác phẩm mà câu chuyện kể của nó được tiếp tục bởi nội dung của tác phẩm sau này. @vi
label: ist Sequel zu @de
definition: Setzt ein Werk mit einem Werk, dessen Erzählung durch das spätere Werk fortgesetzt wird, in Beziehung. @de
toolkit label: Sequel zu @de
toolkit definition: Ein Werk, dessen Erzählung durch das spätere Werk fortgesetzt wird. @de
label: est une suite de @fr
label: jatko-osa teokselle @fi
definition: Liittää teoksen teokseen, jonka sisältöä myöhemmin julkaistu teos juonellisesti jatkaa. @fi
toolkit label: jatko-osa teokselle @fi
toolkit definition: Teos, jonka sisältöä myöhemmin julkaistu teos juonellisesti jatkaa. @fi
toolkit label: fortsettelse av @no
toolkit definition: Et verk hvis historie fortsetter i et senere verk. @no
label: és seqüela de @ca
definition: Relaciona una obra amb una obra el contingut narratiu de la qual és continuat per una obra posterior. @ca
toolkit label: seqüela de @ca
toolkit definition: Obra el contingut narratiu de la qual és continuat per una obra posterior. @ca
has element type: 2
label: είναι συνέχεια σε @el
definition: Συνδέει ένα έργο με ένα έργο του οποίου η αφήγηση συνεχίζεται από ένα μεταγενέστερο έργο. @el
toolkit label: συνέχεια σε @el
toolkit definition: Ένα έργο του οποίου η αφήγηση συνεχίζεται από ένα μεταγενέστερο έργο. @el
label: folytatás @hu
definition: Egy művet hozzákapcsol egy műhöz, amelynek narratíváját egy későbbi mű folytatja. @hu
toolkit label: folytatása (mű) @hu
toolkit definition: Egy mű, amelynek narratíváját egy későbbi mű folytatja. @hu
has subproperty: P10227

is adapted as screenplay work
status: Published
definition: Relates a work to a work that consists of a screenplay for a motion picture, television program, or video, based on another work.
type: Property
domain: C10001
sub property of: is adapted as work
lexical alias: adaptedAsScreenplayWork.en
toolkit label: adapted as screenplay work
toolkit definition: A work that consists of a screenplay for a motion picture, television program, or video, based on another work.
toolkit label: adapté en scénario (œuvre) @fr
toolkit definition: Œuvre qui consiste en un scénario de film, d’émission de télévision ou de vidéo basé sur une autre œuvre. @fr
toolkit label: adaptada como guión (obra) @es
toolkit definition: Una obra que consiste en un guión para una película cinematrográfica, un programa de televisión o video, basado en la obra fuente. @es
instruction number: 24.5
label: er bearbejdet til manuskriptværk @da
definition: Relaterer et værk til et værk, som består af et manuskript til en spillefilm, tv-program eller en video, baseret på et oprindeligt værk. @da
toolkit label: bearbejdet til manuskriptværk @da
toolkit definition: Værk, som består af et manuskript til en spillefilm, tv-program eller en video, baseret på et oprindeligt værk. @da
definition: Met une œuvre en relation avec une œuvre qui consiste en un scénario de film, d’émission de télévision ou de vidéo basé sur une autre œuvre. @fr
label: được phỏng theo như là kịch bản (tác phẩm) @vi
definition: Liên kết tác phẩm với tác phẩm có chứa kịch bản của phim điện ảnh, chương trình truyền hình, hoặc video, dựa trên tác phẩm nguồn. @vi
toolkit label: được phỏng theo như là kịch bản (tác phẩm) @vi
toolkit definition: Tác phẩm có chứa kịch bản của phim điện ảnh, chương trình truyền hình, hoặc video, dựa trên tác phẩm nguồn. @vi
label: ist bearbeitet als Drehbuch (Werk) @de
definition: Setzt ein Werk in Beziehung zu einem Werk, das aus einem Drehbuch für einen Film, eine Fernsehsendung oder ein Video besteht, das auf einem anderen Werk basiert. @de
toolkit label: Bearbeitet als Drehbuch (Werk) @de
toolkit definition: Ein Werk, das aus einem Drehbuch für einen Film, eine Fernsehsendung oder ein Video besteht, das auf einem andern Werk basiert. @de
label: est adapté en scénario (œuvre) @fr
definition: Liittää teoksen teokseen, joka koostuu toiseen teokseen perustuvasta elokuvan, televisio-ohjelman tai videon käsikirjoituksesta. @fi
toolkit label: sovitettu käsikirjoitukseksi (teos) @fi
toolkit definition: Teos, joka koostuu toiseen teokseen perustuvasta elokuvan, televisio-ohjelman tai videon käsikirjoituksesta. @fi
toolkit label: bearbeidet som manus for skuespill (verk) @no
toolkit definition: Et verk som består av et manuskript for en spillefilm, et fjernsynsprogram eller en video, basert på et kildeverk. @no
label: és adaptat com a obra de guió @ca
definition: Relaciona una obra amb una obra que consisteix en un guió d’una pel·lícula cinematogràfica, un programa de televisió o un vídeo basat en una altra obra. @ca
toolkit label: adaptat com a obra de guió @ca
toolkit definition: Obra que consisteix en un guió d’una pel·lícula cinematogràfica, un programa de televisió o un vídeo basat en una altra obra. @ca
has element type: 2
label: είναι προσαρμοσμένο ως σενάριο (έργο) @el
definition: Συνδέει ένα έργο με ένα έργο που που συνίσταται από ένα σενάριο για μια κινηματογραφική ταινία, ένα τηλεοπτικό πρόγραμμα ή ένα βίντεο βασισμένο σε ένα έργο-πηγή. @el
toolkit label: προσαρμοσμένο ως σενάριο (έργο) @el
toolkit definition: Ένα έργο που που συνίσταται από ένα σενάριο για μια κινηματογραφική ταινία, ένα τηλεοπτικό πρόγραμμα ή ένα βίντεο βασισμένο σε ένα έργο-πηγή. @el
label: forgatókönyvmű-feldolgozása a következő: @hu
definition: Hozzákapcsol egy művet egy műhöz, amely egy másik művön alapuló mozgókép, televízióműsor vagy videó forgatókönyvéből áll. @hu
toolkit label: forgatókönyvmű-átdolgozás @hu
toolkit definition: Egy mű, amely egy másik művön alapuló mozgókép, televízióműsor vagy videó forgatókönyvéből áll. @hu
label: sovitettu käsikirjoitukseksi (teos) @fi
label: er bearbeidet som manus for skuespill (verk) @no
definition: Relaterer et verk til et verk som består av et manuskript for en spillefilm, et fjernsynsprogram eller en video, basert på et kildeverk. @no
label: is bewerkt als scenariowerk @nl
definition: Relateert een werk aan een werk dat bestaat uit een scenario voor een speelfilm, televisieprogramma of video, gebaseerd op een ander werk. @nl
toolkit label: bewerkt als scenariowerk @nl
toolkit definition: Een werk dat bestaat uit een scenario voor een speelfilm, televisieprogramma of video, gebaseerd op een ander werk. @nl
label: هو معالج كعمل سيناريو @ar
definition: يربط عمل بعمل يتكون من سيناريو فيلم سينمائي، أو برنامج تليفزيوني، أو فيديو، مبني على عمل آخر. @ar
toolkit label: معالج كعمل سيناريو @ar
toolkit definition: عمل يتكون من سيناريو فيلم سينمائي، أو برنامج تليفزيوني، أو فيديو، مبني على عمل آخر. @ar
label: adapteeritud stsenaariumina (teos) @et
definition: Seostab teose teosega, mis on allikteosel põhinev stsenaarium filmi, telesaate või video jaoks. @et
toolkit label: adapteeritud stsenaariumina (teos) @et
toolkit definition: Teos, mis on allikteosel põhinev stsenaarium filmi, telesaate või video jaoks. @et
label: è adattata come opera in forma di sceneggiatura @it
definition: Correla un’opera a un’opera che consiste di una sceneggiatura per un film, un programma televisivo o un video, basata su un’opera di partenza. @it
toolkit label: adattata come opera in forma di sceneggiatura @it
toolkit definition: Opera che consiste di una sceneggiatura per un film, un programma televisivo o un video, basata su un’opera di partenza. @it
label: ir adaptēts kā scenārijs (darbs) @lv
definition: Sasaista darbu ar darbu - kinofilmas, televīzijas uzveduma vai video scenārijs veidots pēc pamatdarba. @lv
toolkit label: adaptēts kā darbs: scenārijs @lv
toolkit definition: Darbs - kinofilmas, televīzijas uzveduma vai video scenārijs veidots pēc pamatdarba. @lv
label: 被改编为影视剧本作品 @zh-hans
definition: 将一种作品与由基于另一种作品的一种电影、电视节目或视频的剧本组成的一种作品关联起来。 @zh-hans
toolkit label: 被改编为影视剧本作品 @zh-hans
toolkit definition: 由基于另一种作品的一种电影、电视节目或视频的剧本组成的一种作品 @zh-hans
has subproperty: is adapted as motion picture screenplay work
has subproperty: is adapted as television screenplay work
has subproperty: is adapted as video screenplay work
has subproperty: P10095
label: senaryo eseri olarak uyarlanmıştır @tr
definition: Bir eseri, başka bir eserden uyarlanan bir sinema filmi, televizyon programı veya video senaryosundan oluşan bir eserle ilişkilendirir. @tr
toolkit label: Senaryo çalışması olarak uyarlanan @tr

is screenplay for motion picture work
status: Published
definition: Relates a work to a work that is a motion picture that is complemented by a textual work.
type: Property
domain: C10001
sub property of: is screenplay for work
lexical alias: screenplayForMotionPictureWork.en
toolkit label: screenplay for motion picture work
toolkit definition: A work that is a motion picture that is complemented by a textual work.
toolkit label: scénario pour un film (œuvre) @fr
toolkit definition: Œuvre cinématographique qui est complétée par une œuvre textuelle. @fr
toolkit label: guión para película cinematográfica (obra) @es
toolkit definition: Una obra que utiliza el texto como guión para una película cinematográfica. @es
instruction number: 24.5
label: er manuskript til filmværk @da
definition: Relaterer et værk til et værk, som er en spillefilm, som er komplementeret af et tekstværk. @da
toolkit label: manuskript til filmværk @da
toolkit definition: Værk, som er en spillefilm, som er komplementeret af et tekstværk. @da
definition: Met une œuvre en relation avec une œuvre cinématographique qui est complétée par une œuvre textuelle. @fr
label: là kịch bản cho điện ảnh (tác phẩm) @vi
definition: Liên kết tác phẩm với tác phẩm sử dụng văn bản như là kịch bản cho phim điện ảnh. @vi
toolkit label: kịch bản cho điện ảnh (tác phẩm) @vi
toolkit definition: Tác phẩm sử dụng văn bản như là kịch bản cho phim điện ảnh. @vi
label: ist Drehbuch für Film (Werk) @de
definition: Setzt ein Werk in Beziehung zu einem Filmwerk, das durch ein textliches Werk vervollständigt wird. @de
toolkit label: Drehbuch für Film (Werk) @de
toolkit definition: Ein Filmwerk, das durch ein textliches Werk vervollständigt wird. @de
label: est un scénario pour un film (œuvre) @fr
definition: Liittää teoksen teokseen, joka on elokuva, jota täydentää tekstiteos. @fi
toolkit label: käsikirjoitus elokuvaan (teos) @fi
toolkit definition: Teos, joka on elokuva, jota täydentää tekstiteos. @fi
toolkit label: manus for spillefilm (verk) @no
toolkit definition: Et verk som er en spillefilm som utfylles av et tekstlig verk. @no
label: és obra de guió per a pel·lícula cinematogràfica @ca
definition: Relaciona una obra amb una obra que és una pel·lícula cinematogràfica que es complementa amb una obra textual. @ca
toolkit label: obra de guió per a pel·lícula cinematogràfica @ca
toolkit definition: Obra que és una pel·lícula cinematogràfica que es complementa amb una obra textual. @ca
has element type: 2
label: είναι σενάριο για κινηματογραφική ταινία (έργο) @el
definition: Συνδέει ένα έργο με ένα έργο το οποίο χρησιμοποιεί το κείμενο ως σενάριο για μια κινηματογραφική ταινία. @el
toolkit label: σενάριο για κινηματογραφική ταινία (έργο) @el
toolkit definition: Ένα έργο το οποίο χρησιμοποιεί το κείμενο ως σενάριο για μια κινηματογραφική ταινία. @el
label: forgatókönyve a következő filmműnek @hu
definition: Hozzákapcsol egy művet egy mozgóképműhöz, amelyet egy szöveges mű egészít ki. @hu
toolkit label: filmmű-forgatókönyv @hu
toolkit definition: Egy mozgóképmű, amelyet egy szöveges mű egészít ki. @hu
label: käsikirjoitus elokuvaan (teos) @fi
label: er manus for spillefilm (verk) @no
definition: Relaterer et verk til et verk som er en spillefilm som utfylles av et tekstlig verk. @no
label: is scenario voor speelfilmwerk @nl
definition: Relateert een werk aan een werk dat een speelfilm is dat is gecomplementeerd door een tekstwerk. @nl
toolkit label: scenario voor speelfilmwerk @nl
toolkit definition: Een werk dat een speelfilm is dat is gecomplementeerd door een tekstwerk. @nl
label: هو سيناريو عمل فيلم سينمائي @ar
definition: يربط عمل بعمل عبارة عن فيلم سينمائي يكمله عمل نصي. @ar
toolkit label: سيناريو عمل فيلم سينمائي @ar
toolkit definition: عمل عبارة عن فيلم سينمائي يكمله عمل نصي. @ar
label: stsenaarium filmiteosele @et
definition: Seostab teose filmiteosega, mis on täiendatud tekstteosega. @et
toolkit label: stsenaarium filmiteosele @et
toolkit definition: Filmiteos, mis on täiendatud tekstteosega. @et
label: è sceneggiatura per opera cinematografica @it
definition: Correla un’opera a un’opera che è un film che è completata da un’opera testuale. @it
toolkit label: sceneggiatura per opera cinematografica @it
toolkit definition: Opera che è un film completata da un’opera testuale. @it
label: ir kinoscenārijs darbam @lv
definition: Sasaista darbu ar darbu, kas ir kinofilma, kurā izmantots tekstuāls darbs kā scenārijs. @lv
toolkit label: kinoscenārijs darbam @lv
toolkit definition: Darbs, kas ir kinofilma, kurā izmantots tekstuāls darbs kā scenārijs. @lv
label: 是电影作品的剧本 @zh-hans
definition: 将一种作品与作为一种电影并被一种文字作品补充的一种作品关联起来。 @zh-hans
toolkit label: 电影作品的剧本 @zh-hans
toolkit definition: 作为一种电影并被一种文字作品补充的一种作品 @zh-hans
has subproperty: P10173
label: sinema filmi eseri için senaryodur @tr
definition: Bir eseri, metinsel bir eserle tamamlanan bir sinema filmi olan bir eserle ilişkilendirir. @tr
toolkit label: sinema filmi eseri için senaryo @tr
toolkit definition: Metinsel bir eserle tamamlanan bir sinema filmi olan eser. @tr

has screenplay work
status: Published
definition: Relates a work to a work that is a textual work that complements a work that uses a screenplay.
type: Property
domain: C10001
sub property of: has text work
lexical alias: screenplayWork.en
toolkit label: screenplay work
toolkit definition: A work that is a textual work that complements a work that uses a screenplay.
toolkit label: scénario (œuvre) @fr
toolkit definition: Œuvre textuelle qui complète une œuvre qui utilise un scénario. @fr
toolkit label: guión (obra) @es
toolkit definition: Una obra que proporciona el texto para una película cinematográfica, programa de televisión o video. @es
instruction number: 24.5
label: har manuskriptværk @da
definition: Relaterer et værk til et værk, som er et tekstværk, som komplementerer et værk, som anvender et manuskript. @da
toolkit label: manuskriptværk @da
toolkit definition: Værk, som er et tekstværk, som komplementerer et værk, som anvender et manuskript. @da
definition: Met une œuvre en relation avec une œuvre textuelle qui complète une œuvre qui utilise un scénario. @fr
label: là kịch bản (tác phẩm) @vi
definition: Liên kết tác phẩm với tác phẩm cung cấp văn bản cho phim điện ảnh, chương trình truyền hình hoặc video. @vi
toolkit label: kịch bản (tác phẩm) @vi
toolkit definition: Tác phẩm cung cấp văn bản cho phim điện ảnh, chương trình truyền hình hoặc video. @vi
label: hat Drehbuch (Werk) @de
definition: Setzt ein Werk in Beziehung zu einem textlichen Werk, das ein Werk ergänzt, welches ein Drehbuch verwendet. @de
toolkit label: Drehbuch (Werk) @de
toolkit definition: Ein textliches Werk, das ein Werk ergänzt, welches ein Drehbuch verwendet. @de
label: a pour scénario (œuvre) @fr
definition: Liittää teoksen teokseen, joka on tekstiteos, joka täydentää teosta, joka käyttää käsikirjoitusta. @fi
toolkit label: käsikirjoitus (teos) @fi
toolkit definition: Teos, joka on tekstiteos, joka täydentää teosta, joka käyttää käsikirjoitusta. @fi
toolkit label: manus (verk) @no
toolkit definition: Et verk som er et tekstlig verk som utfyller et verk som bruker et manus. @no
label: té com a obra de guió @ca
definition: Relaciona una obra amb una obra que és una obra textual que complementa una obra que usa un guió. @ca
toolkit label: obra de guió @ca
toolkit definition: Obra que és una obra textual que complementa una obra que usa un guió. @ca
has element type: 2
label: είναι σενάριο (έργο) @el
definition: Συνδέει ένα έργο με ένα έργο το οποίο παρέχει το κείμενο για μια κινηματογραφική ταινία, ένα τηλεοπτικό πρόγραμμα ή βίντεο. @el
toolkit label: σενάριο (έργο) @el
toolkit definition: Ένα έργο το οποίο παρέχει το κείμενο για μια κινηματογραφική ταινία, ένα τηλεοπτικό πρόγραμμα ή βίντεο. @el
label: forgatókönyv-műve a következő: @hu
definition: Hozzákapcsol egy művet egy szöveges műhöz, amely kiegészít egy forgatókönyvet használó művet. @hu
toolkit label: forgatókönyvmű @hu
toolkit definition: Egy szövegse mű, amely kiegészít egy forgatókönyvet használó művet. @hu
label: käsikirjoitus (teos) @fi
label: har manus (verk) @no
definition: Relaterer et verk til et verk som er et tekstlig verk som utfyller et verk som bruker et manus. @no
label: heeft scenariowerk @nl
definition: Relateert een werk aan een werk dat een tekstwerk is dat een werk complementeert dat een scenario gebruikt. @nl
toolkit label: scenariowerk @nl
toolkit definition: Een werk dat een tekstwerk is dat een werk complementeert dat een scenario gebruikt. @nl
label: له عمل سيناريو @ar
definition: يربط عمل بعمل عبارة عن عمل نصي يكمل عملًا يستخدم سيناريو. @ar
toolkit label: عمل سيناريو @ar
toolkit definition: عمل عبارة عن عمل نصي يكمل عملًا يستخدم سيناريو. @ar
label: stsenaarium (teos) @et
definition: Seostab teose tekstteosega, mis täiendab stsenaariumi põhjal valminud teost. @et
toolkit label: stsenaarium (teos) @et
toolkit definition: Tekstteos, mis täiendab stsenaariumi põhjal valminud teost. @et
label: ha come sceneggiatura opera @it
definition: Correla un’opera a un’opera testuale che completa un’opera che utilizza una sceneggiatura. @it
toolkit label: sceneggiatura opera @it
toolkit definition: Opera testuale che completa un’opera che utilizza una sceneggiatura. @it
label: darbs: scenārijs @lv
definition: Sasaista darbu ar darbu, kas ir realizēts kā teksts, kas papildina darbu, kas ir lieto scenāriju. @lv
toolkit label: darbs: scenārijs @lv
toolkit definition: Darbs, kas ir realizēts kā teksts, kas papildina darbu, kas ir lieto scenāriju. @lv
label: 有影视剧剧本作品 @zh-hans
definition: 将一种作品与作为一种文字作品并补充使用一种影视剧剧本的一种作品的一种作品关联起来。 @zh-hans
toolkit label: 影视剧剧本作品 @zh-hans
toolkit definition: 作为一种文字作品并补充使用一种影视剧剧本的一种作品的一种作品 @zh-hans
has subproperty: has motion picture screenplay work
has subproperty: has television screenplay work
has subproperty: has video screenplay work
has subproperty: P10159
label: senaryo eseri ile ilişkilidir @tr
definition: Bir eseri, senaryo kullanan bir eseri tamamlayan metinsel bir eser olan bir eserle ilişkilendirir. @tr
toolkit label: senaryo eseri @tr

has founder agent of work
status: Published
sub property of: has creator agent of work
type: Property
lexical alias: founderAgentOfWork.en
definition: Relates a work to an agent who is responsible for initiating a diachronic work.
domain: C10001
toolkit label: founder agent of work
toolkit definition: An agent who is responsible for initiating a diachronic work.
instruction number: 18.5
label: har agent, som er stifter af værk @da
definition: Relaterer et værk til en agent, som er ansvarlig for at igangsætte et diakronisk værk. @da
toolkit label: agent, som er stifter af værk @da
toolkit definition: Agent, som er ansvarlig for at igangsætte et diakronisk værk. @da
label: có người tạo lập tác phẩm @vi
definition: Liên kết tác phẩm với tác nhân có trách nhiệm tạo lập ấn phẩm nhiều kỳ, tài nguyên tích hợp, hoặc chuyên khảo nhiều phần. @vi
toolkit label: người tạo lập tác phẩm @vi
toolkit definition: Tác nhân có trách nhiệm tạo lập ấn phẩm nhiều kỳ, tài nguyên tích hợp, hoặc chuyên khảo nhiều phần. @vi
label: hat Begründerin/Begründer eines Werks (Akteur) @de
definition: Setzt ein Werk in Beziehung zu einem Akteur, der für das Begründen eines diachronen Werks verantwortlich ist. @de
toolkit label: Begründerin/Begründer eines Werks (Akteur) @de
toolkit definition: Ein Akteur, der für das Begründen eines diachronen Werks verantwortlich ist. @de
definition: Liittää teoksen toimijaan, joka on vastuussa diakronisen teoksen alullepanosta. @fi
toolkit label: teoksen perustaja (toimija) @fi
toolkit definition: Toimija, joka on vastuussa diakronisen teoksen alullepanosta. @fi
toolkit label: grunnlegger av verk (agent) @no
toolkit definition: En agent som har ansvar for å etablere et diakronisk verk. @no
label: té com a agent fundador d’una obra @ca
definition: Relaciona una obra amb un agent que és responsable d’iniciar una obra diacrònica. @ca
toolkit label: agent fundador d’una obra @ca
toolkit definition: Agent que és responsable d’iniciar una obra diacrònica. @ca
label: a pour agent fondateur d’une œuvre @fr
definition: Met une œuvre en relation avec un agent qui est responsable de lancer une œuvre diachronique. @fr
toolkit label: agent fondateur d’une œuvre @fr
toolkit definition: Agent qui est responsable de lancer une œuvre diachronique. @fr
has element type: 2
label: έχει θεμελιωτή του έργου @el
definition: Συνδέει ένα έργο με έναν φορέα υπεύθυνο για την ίδρυση ενός περιοδικού, ενός ενσωματωμένου πόρου ή μιας πολυμερούς μονογραφίας. @el
toolkit label: θεμελιωτής του έργου @el
toolkit definition: Ένας φορέας υπεύθυνος για την ίδρυση ενός περιοδικού, ενός ενσωματωμένου πόρου ή μιας πολυμερούς μονογραφίας. @el
label: mű alapító ágense a következő: @hu
definition: műalapító ágens: @hu
toolkit label: Egy ágens, amely felelős egy diakronikus mű indításáért. @hu
toolkit definition: Hozzákapcsol egy művet egy ágenshez, amely felelős egy diakronikus mű indításáért. @hu
alternative label: founder of work
alternative label: teoksen perustaja @fi
label: teoksen perustaja (toimija) @fi
label: har grunnlegger av verk (agent) @no
definition: Relaterer et verk til en agent som har ansvar for å etablere et diakronisk verk. @no
alternative label: grunnlegger av verk @no
label: heeft oprichter-actor van werk @nl
definition: Relateert een werk aan een actor die verantwoordelijk is voor het initiëren van een diachronisch werk. @nl
toolkit label: oprichter-actor van werk @nl
toolkit definition: Een actor die verantwoordelijk is voor het initiëren van een diachronisch werk. @nl
label: له وكيل مؤسس لعمل @ar
definition: يربط بين عمل ووكيل مسئول عن بدء عمل ممتد زمنيًا. @ar
alternative label: مؤسس لعمل @ar
toolkit label: وكيل مؤسس لعمل @ar
toolkit definition: وكيل مسئول عن بدء عمل ممتد زمنيًا. @ar
alternative label: fundador d’una obra @ca
alternative label: stifter af værk @da
label: teose asutaja (tegija) @et
definition: Seostab teose tegijaga, kes vastutab diakroonilise teose ellukutsumise eest. @et
alternative label: teose asutaja @et
toolkit label: teose asutaja (tegija) @et
toolkit definition: Tegija, kes vastutab diakroonilise teose ellukutsumise eest. @et
alternative label: műalapító: @hu
label: ha come fondatore agente di un'opera @it
definition: Correla un'opera a un agente responsabile dell'avvio di un'opera diacronica. @it
alternative label: fondatore di opera @it
toolkit label: fondatore agente di opera @it
toolkit definition: Agente responsabile dell’avvio di un’opera diacronica. @it
alternative label: fondateur d’œuvre @fr
label: darba dibinātājs (aģents) @lv
definition: Sasaista darbu ar aģentu, kas ir atbildīgs par diahroniskā darba (seriālizdevuma, integrētā resursa vai vairākdaļu monogrāfijas) izveidošanu. @lv
toolkit label: darba dibinātājs (aģents) @lv
toolkit definition: Aģents, kas ir atbildīgs par diahroniskā darba (seriālizdevuma, integrētā resursa vai vairākdaļu monogrāfijas) izveidošanu. @lv
alternative label: Begründer eines Werks @de
toolkit label: 作品的创办者行为者 @zh-hans
toolkit definition: 负责发起一种历时作品的一个行为者 @zh-hans
has subproperty: has founder collective agent of work

has founder collective agent of work
status: Published
lexical alias: founderCollectiveAgentOfWork.en
definition: Relates a work to a collective agent who is responsible for initiating a diachronic work.
toolkit label: founder collective agent of work
toolkit definition: A collective agent who is responsible for initiating a diachronic work.
type: Property
domain: C10001
has element type: 2
sub property of: has creator collective agent of work
sub property of: has founder agent of work
label: teoksen perustaja (yhteistoimija) @fi
definition: Liittää teoksen yhteistoimijaan, joka on vastuussa diakronisen teoksen alullepanosta. @fi
toolkit label: teoksen perustaja (yhteistoimija) @fi
toolkit definition: Yhteistoimija, joka on vastuussa diakronisen teoksen alullepanosta. @fi
label: har grunnlegger av verk (kollektiv agent) @no
definition: Relaterer et verk til en kollektiv agent som har ansvar for å etablere et diakronisk verk. @no
toolkit label: grunnlegger av verk (kollektiv agent) @no
toolkit definition: En kollektiv agent som har ansvar for å etablere et diakronisk verk. @no
label: heeft oprichter-collectieve actor van werk @nl
definition: Relateert een werk aan een collectieve actor die verantwoordelijk is voor het initiëren van een diachronisch werk. @nl
toolkit label: oprichter-collectieve actor van werk @nl
toolkit definition: Een collectieve actor die verantwoordelijk is voor het initiëren van een diachronisch werk. @nl
label: له وكيل جماعي مؤسس لعمل @ar
definition: يربط بين عمل ووكيل جماعي مسئول عن بدء عمل ممتد زمنيًا. @ar
toolkit label: وكيل جماعي مؤسس لعمل @ar
toolkit definition: وكيل جماعي مسئول عن بدء عمل ممتد زمنيًا. @ar
label: té com a agent col·lectiu fundador d’una obra @ca
definition: Relaciona una obra amb un agent col·lectiu que és responsable d’iniciar una obra diacrònica. @ca
toolkit label: agent col·lectiu fundador d’una obra @ca
toolkit definition: Agent col·lectiu que és responsable d’iniciar una obra diacrònica. @ca
label: har kollektiv agent, som er stifter af værk @da
definition: Relaterer et værk til en kollektiv agent, som er ansvarlig for at igangsætte et diakronisk værk. @da
toolkit label: kollektiv agent, som er stifter af værk @da
toolkit definition: Kollektiv agent, som er ansvarlig for at igangsætte et diakronisk værk. @da
label: teose asutaja (kollektiiv) @et
definition: Seostab teose kollektiiviga, kes vastutab diakroonilise teose ellukutsumise eest. @et
toolkit label: teose asutaja (kollektiiv) @et
toolkit definition: Kollektiiv, kes vastutab diakroonilise teose ellukutsumise eest. @et
label: hat Begründerin/Begründer eines Werks (Gemeinschaftlicher Akteur) @de
definition: Setzt ein Werk in Beziehung zu einem gemeinschaftlichen Akteur, der für das Begründen eines diachronen Werks verantwortlich ist. @de
toolkit label: Begründerin/Begründer eines Werks (Gemeinschaftlicher Akteur) @de
toolkit definition: Ein gemeinschaftlicher Akteur, der für das Begründen eines diachronen Werks verantwortlich ist. @de
label: mű alapító kollektív ágense a következő: @hu
definition: Hozzákapcsol egy művet egy kollektív ágenshez, amely felelős egy diakronikus mű indításáért. @hu
toolkit label: műalapító kollektív ágens: @hu
toolkit definition: Egy kollektív ágens, amely felelős egy diakronikus mű indításáért. @hu
label: ha come fondatore agente collettivo di opera @it
definition: Correla un'opera all'agente collettivo responsabile dell'avvio di un'opera diacronica. @it
toolkit label: fondatore agente collettivo di opera @it
toolkit definition: Agente collettivo responsabile dell'avvio di un'opera diacronica. @it
label: a pour agent collectif fondateur d’une œuvre @fr
definition: Met une œuvre en relation avec un agent collectif qui est responsable de lancer une œuvre diachronique. @fr
toolkit label: agent collectif fondateur d’une œuvre @fr
toolkit definition: Agent collectif qui est responsable de lancer une œuvre diachronique. @fr
label: darba dibinātājs (grupa) @lv
definition: Sasaista darbu ar grupu, kas ir atbildīga par diahroniskā darba (seriālizdevuma, integrētā resursa vai vairākdaļu monogrāfijas) izveidošanu. @lv
toolkit label: darba dibinātājs (grupa) @lv
toolkit definition: Grupa, kas ir atbildīga par diahroniskā darba (seriālizdevuma, integrētā resursa vai vairākdaļu monogrāfijas) izveidošanu. @lv
label: 有作品的创办者集体行为者 @zh-hans
definition: 将一种作品与负责发起一种历时作品的一个集体行为者关联起来。 @zh-hans
toolkit label: 作品的创办者集体行为者 @zh-hans
toolkit definition: 负责发起一种历时作品的一个集体行为者 @zh-hans
has subproperty: has founder corporate body of work
has subproperty: has founder family of work
has subproperty: P10499
label: eserin kurucu kolektif temsilcisi ile ilişkilidir @tr
definition: Bir eseri, artzamanlı bir eseri başlatmaktan sorumlu olan kolektif bir temsilci ile ilişkilendirir. @tr
toolkit label: eserin kurucu kolektif temsilcisi @tr
toolkit definition: Bir artzamanlı çalışmayı başlatmaktan sorumlu olan kolektif bir aracı. @tr

has founder corporate body of work
status: Published
lexical alias: founderCorporateBodyOfWork.en
definition: Relates a work to a corporate body who is responsible for initiating a diachronic work.
toolkit label: founder corporate body of work
toolkit definition: A corporate body who is responsible for initiating a diachronic work.
type: Property
domain: C10001
has element type: 2
sub property of: has creator corporate body of work
sub property of: has founder collective agent of work
label: teoksen perustaja (yhteisö) @fi
definition: Liittää teoksen yhteisöön, joka on vastuussa diakronisen teoksen alullepanosta. @fi
toolkit label: teoksen perustaja (yhteisö) @fi
toolkit definition: Yhteisö, joka on vastuussa diakronisen teoksen alullepanosta. @fi
label: har grunnlegger av verk (korporasjon) @no
definition: Relaterer et verk til en korporasjon som har ansvar for å etablere et diakronisk verk. @no
toolkit label: grunnlegger av verk (korporasjon) @no
toolkit definition: En korporasjon som har ansvar for å etablere et diakronisk verk. @no
label: heeft oprichter-corporatie van werk @nl
definition: Relateert een werk aan een corporatie die verantwoordelijk is voor het initiëren van een diachronisch werk. @nl
toolkit label: oprichter-corporatie van werk @nl
toolkit definition: Een corporatie die verantwoordelijk is voor het initiëren van een diachronisch werk. @nl
label: له هيئة مؤسسة لعمل @ar
definition: يربط بين عمل وهيئة مسئولة عن بدء عمل ممتد زمنيًا. @ar
toolkit label: هيئة مؤسسة لعمل @ar
toolkit definition: هيئة مسئولة عن بدء عمل ممتد زمنيًا. @ar
label: té com a entitat corporativa fundadora d’una obra @ca
definition: Relaciona una obra amb una entitat corporativa que és responsable d’iniciar una obra diacrònica. @ca
toolkit label: entitat corporativa fundadora d’una obra @ca
toolkit definition: Entitat corporativa que és responsable d’iniciar una obra diacrònica. @ca
label: har korporation, som er stifter af værk @da
definition: Relaterer et værk til en korporation, som er ansvarlig for at igangsætte et diakronisk værk. @da
toolkit label: korporation, som er stifter af værk @da
toolkit definition: Korporation, som er ansvarlig for at igangsætte et diakronisk værk. @da
label: teose asutaja (asutus) @et
definition: Seostab teose asutusega, kes vastutab diakroonilise teose ellukutsumise eest. @et
toolkit label: teose asutaja (asutus) @et
toolkit definition: Asutus, kes vastutab diakroonilise teose ellukutsumise eest. @et
label: hat Begründerin/Begründer eines Werks (Körperschaft) @de
definition: Setzt ein Werk in Beziehung zu einer Körperschaft, die für das Begründen eines diachronen Werks verantwortlich ist. @de
toolkit label: Begründerin/Begründer eines Werks (Körperschaft) @de
toolkit definition: Eine Körperschaft, die für das Begründen eines diachronen Werks verantwortlich ist. @de
label: mű alapító testülete a következő: @hu
definition: Hozzákapcsol egy művet egy testülethez, amely felelős egy diakronikus mű indításáért. @hu
toolkit label: műalapító testület: @hu
toolkit definition: Egy testület, amely felelős egy diakronikus mű indításáért. @hu
label: ha come fondatore ente di opera @it
definition: Correla un'opera a un ente responsabile dell'avvio di un'opera diacronica. @it
toolkit label: fondatore ente di opera @it
toolkit definition: Ente responsabile dell'avvio di un'opera diacronica. @it
label: a pour collectivité fondatrice d’une œuvre @fr
definition: Met une œuvre en relation avec une collectivité qui est responsable de lancer une œuvre diachronique. @fr
toolkit label: collectivité fondatrice d’une œuvre @fr
toolkit definition: Collectivité qui est responsable de lancer une œuvre diachronique. @fr
label: darba dibinātājs (institūcija) @lv
definition: Sasaista darbu ar institūciju, kas ir atbildīga par diahroniskā darba (seriālizdevuma, integrētā resursa vai vairākdaļu monogrāfijas) izveidošanu. @lv
toolkit label: darba dibinātājs (institūcija) @lv
toolkit definition: Institūcija, kas ir atbildīga par diahroniskā darba (seriālizdevuma, integrētā resursa vai vairākdaļu monogrāfijas) izveidošanu. @lv
label: 有作品的创办者团体 @zh-hans
definition: 将一种作品与负责发起一种历时作品的一个团体关联起来。 @zh-hans
toolkit label: 作品的创办者团体 @zh-hans
toolkit definition: 负责发起一种历时作品的一个团体 @zh-hans
has subproperty: P10546
label: eserin kurucu tüzel kişisi ile ilişkilidir @tr
definition: Bir eseri, artzamanlı bir eseri başlatmaktan sorumlu olan tüzel kişi ile ilişkilendirir. @tr
toolkit label: eserin kurucu tüzel kişisi @tr
toolkit definition: Bir artzamanlı çalışmayı başlatmaktan sorumlu bir tüzel kişi. @tr

has founder family of work
status: Published
lexical alias: founderFamilyOfWork.en
definition: Relates a work to a family who is responsible for initiating a diachronic work.
toolkit label: founder family of work
toolkit definition: A family who is responsible for initiating a diachronic work.
type: Property
domain: C10001
has element type: 2
sub property of: has creator family of work
sub property of: has founder collective agent of work
label: teoksen perustaja (suku) @fi
definition: Liittää teoksen sukuun, joka on vastuussa diakronisen teoksen alullepanosta. @fi
toolkit label: teoksen perustaja (suku) @fi
toolkit definition: Suku, joka on vastuussa diakronisen teoksen alullepanosta. @fi
label: har grunnlegger av verk (familie) @no
definition: Relaterer et verk til en familie som har ansvar for å etablere et diakronisk verk. @no
toolkit label: grunnlegger av verk (familie) @no
toolkit definition: En familie som har ansvar for å etablere et diakronisk verk. @no
label: heeft oprichter-familie van werk @nl
definition: Relateert een werk aan een familie die verantwoordelijk is voor het initiëren van een diachronisch werk. @nl
toolkit label: oprichter-familie van werk @nl
toolkit definition: Een familie die verantwoordelijk is voor het initiëren van een diachronisch werk. @nl
label: له عائلة مؤسسة لعمل @ar
definition: يربط بين عمل وعائلة مسئولة عن بدء عمل ممتد زمنيًا. @ar
toolkit label: عائلة مؤسسة لعمل @ar
toolkit definition: عائلة مسئولة عن بدء عمل ممتد زمنيًا. @ar
label: té com a família fundadora d’una obra @ca
definition: Relaciona una obra amb una família que és responsable d’iniciar una obra diacrònica. @ca
toolkit label: família fundadora d’una obra @ca
toolkit definition: Família que és responsable d’iniciar una obra diacrònica. @ca
label: har familie, som er stifter af værk @da
definition: Relaterer et værk til en familie, som er ansvarlig for at igangsætte et diakronisk værk. @da
toolkit label: familie, som er stifter af værk @da
toolkit definition: Familie, som er ansvarlig for at igangsætte et diakronisk værk. @da
label: teose asutaja (perekond) @et
definition: Seostab teose perekonnaga, kes vastutab diakroonilise teose ellukutsumise eest. @et
toolkit label: teose asutaja (perekond) @et
toolkit definition: Perekond, kes vastutab diakroonilise teose ellukutsumise eest. @et
label: hat Begründerin/Begründer eines Werks (Familie) @de
definition: Setzt ein Werk in Beziehung zu einer Familie, die für das Begründen eines diachronen Werks verantwortlich ist. @de
toolkit label: Begründerin/Begründer eines Werks (Familie) @de
toolkit definition: Eine Familie, die für das Begründen eines diachronen Werks verantwortlich ist. @de
label: mű alapító családja a következő: @hu
definition: Hozzákapcsol egy művet egy családhoz, amely felelős egy diakronikus mű indításáért. @hu
toolkit label: műalapító család: @hu
toolkit definition: Egy család, amely felelős egy diakronikus mű indításáért. @hu
label: ha come fondatore famiglia di opera @it
definition: Correla un'opera alla famiglia responsabile dell'avvio di un'opera diacronica. @it
toolkit label: fondatore famiglia di opera @it
toolkit definition: Famiglia responsabile dell'avvio di un'opera diacronica. @it
label: a pour famille fondatrice d’une œuvre @fr
definition: Met une œuvre en relation avec une personne qui est responsable de lancer une œuvre diachronique. @fr
toolkit label: famille fondatrice d’une œuvre @fr
toolkit definition: Personne qui est responsable de lancer une œuvre diachronique. @fr
label: darba dibinātājs (dzimta/ģimene) @lv
definition: Sasaista darbu ar dzimtu/ģimeni, kas ir atbildīga par diahroniskā darba (seriālizdevuma, integrētā resursa vai vairākdaļu monogrāfijas) izveidošanu. @lv
toolkit label: darba dibinātājs (dzimta/ģimene) @lv
toolkit definition: Dzimta/ģimene, kas ir atbildīga par diahroniskā darba (seriālizdevuma, integrētā resursa vai vairākdaļu monogrāfijas) izveidošanu. @lv
label: 有作品的创办者家族 @zh-hans
definition: 将一种作品与负责发起一种历时作品的一个家族关联起来。 @zh-hans
toolkit label: 作品的创办者家族 @zh-hans
toolkit definition: 负责发起一种历时作品的一个家族 @zh-hans
has subproperty: P10593
label: eserin kurucu ailesi ile ilişkilidir @tr
definition: Bir eseri, artzamanlı bir eseri başlatmaktan sorumlu olan bir aileyle ilişkilendirir. @tr
toolkit label: eserin kurucu ailesi @tr
toolkit definition: Art zamanlı bir çalışmayı başlatmakla sorumlu bir aile. @tr

has founder person of work
status: Published
lexical alias: founderPersonOfWork.en
definition: Relates a work to a person who is responsible for initiating a diachronic work.
toolkit label: founder person of work
toolkit definition: A person who is responsible for initiating a diachronic work.
type: Property
domain: C10001
has element type: 2
sub property of: has creator person of work
sub property of: has founder agent of work
label: teoksen perustaja (henkilö) @fi
definition: Liittää teoksen henkilöön, joka on vastuussa diakronisen teoksen alullepanosta. @fi
toolkit label: teoksen perustaja (henkilö) @fi
toolkit definition: Henkilö, joka on vastuussa diakronisen teoksen alullepanosta. @fi
label: har grunnlegger av verk (person) @no
definition: Relaterer et verk til en person som har ansvar for å etablere et diakronisk verk. @no
toolkit label: grunnlegger av verk (person) @no
toolkit definition: En person som har ansvar for å etablere et diakronisk verk. @no
label: heeft oprichter-persoon van werk @nl
definition: Relateert een werk aan een persoon die verantwoordelijk is voor het initiëren van een diachronisch werk. @nl
toolkit label: oprichter-persoon van werk @nl
toolkit definition: Een persoon die verantwoordelijk is voor het initiëren van een diachronisch werk. @nl
label: له شخص مؤسس عمل @ar
definition: يربط بين عمل وشخص مسئول عن بدء عمل ممتد زمنيًا. @ar
toolkit label: شخص مؤسس عمل @ar
toolkit definition: شخص يكون مسئولاً عن بدء عمل ممتد زمنيًا. @ar
label: té com a persona fundadora d’una obra @ca
definition: Relaciona una obra amb una persona que és responsable d’iniciar una obra diacrònica. @ca
toolkit label: persona fundadora d’una obra @ca
toolkit definition: Persona que és responsable d’iniciar una obra diacrònica. @ca
label: har person, som er stifter af værk @da
definition: Relaterer et værk til en person, som er ansvarlig for at igangsætte et diakronisk værk. @da
toolkit label: person, som er stifter af værk @da
toolkit definition: Person, som er ansvarlig for at igangsætte et diakronisk værk. @da
label: teose asutaja (isik) @et
definition: Seostab teose isikuga, kes vastutab diakroonilise teose ellukutsumise eest. @et
toolkit label: teose asutaja (isik) @et
toolkit definition: Isik, kes vastutab diakroonilise teose ellukutsumise eest. @et
label: hat Begründerin/Begründer eines Werks (Person) @de
definition: Setzt ein Werk in Beziehung zu einer Person, die für das Begründen eines diachronen Werks verantwortlich ist. @de
toolkit label: Begründerin/Begründer eines Werks (Person) @de
toolkit definition: Eine Person, die für das Begründen eines diachronen Werks verantwortlich ist. @de
label: mű alapító személye a következő: @hu
definition: Hozzákapcsol egy művet egy személyhez, aki felelős egy diakronikus mű indításáért. @hu
toolkit label: műalapító személy: @hu
toolkit definition: Egy személy, aki felelős egy diakronikus mű indításáért. @hu
label: ha come fondatore persona di opera @it
definition: Correla un'opera alla persona responsabile dell'avvio di un'opera diacronica. @it
toolkit label: fondatore persona di opera @it
toolkit definition: Persona responsabile dell'avvio di un'opera diacronica. @it
label: a pour personne fondatrice d’une œuvre @fr
definition: Met une œuvre en relation avec une personne qui est responsable de lancer une œuvre diachronique. @fr
toolkit label: personne fondatrice d’une œuvre @fr
toolkit definition: Personne qui est responsable de lancer une œuvre diachronique. @fr
label: darba dibinātājs (persona) @lv
definition: Sasaista darbu ar personu, kura ir atbildīga par diahroniskā darba (seriālizdevuma, integrētā resursa vai vairākdaļu monogrāfijas) izveidošanu. @lv
toolkit label: darba dibinātājs (persona) @lv
toolkit definition: Persona, kura ir atbildīga par diahroniskā darba (seriālizdevuma, integrētā resursa vai vairākdaļu monogrāfijas) izveidošanu. @lv
label: 有作品的创办者个人 @zh-hans
definition: 将一种作品与负责发起一种历时作品的一个个人关联起来。 @zh-hans
toolkit label: 创办者个人 @zh-hans
toolkit definition: 负责发起一种历时作品的一个个人 @zh-hans
has subproperty: P10452
label: eserin kurucu kişisi ile ilişkilidir @tr
definition: Bir eseri, artzamanlı bir eseri başlatmaktan sorumlu olan bir kişiyle ilişkilendirir. @tr
toolkit label: eserin kurucusu @tr
toolkit definition: Artzamanlı bir eser başlatmaktan sorumlu olan kişi. @tr

has frequency
status: Published
lexical alias: frequency.en
definition: Relates a work to an interval at which a part, issue, or iteration of a diachronic work is issued.
toolkit label: frequency
toolkit definition: An interval at which a part, issue, or iteration of a diachronic work is issued.
type: Property
domain: C10001
has element type: 4
label: ilmestymistiheys @fi
definition: Liittää teoksen aikaväliin, jolloin diakronisen teoksen osa, numero tai iteraatio ilmestyy. @fi
toolkit label: ilmestymistiheys @fi
toolkit definition: Aikaväli, jolloin diakronisen teoksen osa, numero tai iteraatio ilmestyy. @fi
label: har frekvens @no
definition: Relaterer et verk til et intervall som et hefte eller en del av et diakronisk verk utgis i. @no
toolkit label: frekvens @no
toolkit definition: Et intervall som et hefte eller en del av et diakronisk verk utgis i. @no
label: heeft frequentie @nl
definition: Relateert een werk aan een interval waarmee een deel, aflevering of iteratie van een diachronisch werk is uitgevaardigd. @nl
toolkit label: frequentie @nl
toolkit definition: Een interval waarmee een deel, aflevering of iteratie van een diachronisch werk is uitgevaardigd. @nl
label: له تتابع صدور @ar
definition: يربط بين عمل وفترة زمنية يصدر فيها جزء من عمل ممتد زمنيًا، أو عدد منه، أو تكرار له. @ar
toolkit label: تتابع صدور @ar
toolkit definition: فترة زمنية يصدر فيها جزء من عمل ممتد زمنيًا، أو عدد منه، أو تكرار له. @ar
label: té com a periodicitat @ca
definition: Relaciona una obra amb un interval en el qual es publica una part, un número o una iteració d’una obra diacrònica. @ca
toolkit label: periodicitat @ca
toolkit definition: Interval en el qual es publica una part, un número o una iteració d’una obra diacrònica. @ca
label: har hyppighed @da
definition: Relaterer et værk til et interval, hvor et nummer eller del af et diakronisk værk udgives. @da
toolkit label: hyppighed @da
toolkit definition: Interval, hvor et nummer eller del af et diakronisk værk udgives. @da
label: ilmumissagedus @et
definition: Seostab teose ajavahemikuga, mille tagant avaldatakse diakroonilise teose osi, numbreid või seise. @et
toolkit label: ilmumissagedus @et
toolkit definition: Ajavahemik, mille tagant avaldatakse diakroonilise teose osi, numbreid või seise. @et
label: hat Erscheinungsfrequenz @de
definition: Setzt ein Werk in Beziehung zu einem Intervall, in dem die Teile, Ausgaben oder Iterationen eines diachronen Werks erscheinen. @de
toolkit label: Erscheinungsfrequenz @de
toolkit definition: Ein Intervall, in dem die Teile, Ausgaben oder Iterationen eines diachronen Werks erscheinen. @de
label: gyakorisága a következő: @hu
definition: Hozzákapcsol egy művet egy időközhöz, amelyben egy diakronikus mű egy részét, számát vagy iterációját közreadják. @hu
toolkit label: gyakorisága: @hu
toolkit definition: Egy időköz, amelyben egy diakronikus mű egy részét, számát vagy iterációját közreadják. @hu
label: ha come frequenza @it
definition: Correla un’opera a un intervallo in cui un fascicolo o una parte di un’opera diacronica è edita. @it
toolkit label: frequenza @it
toolkit definition: Intervallo in cui un fascicolo o una parte di un’opera diacronica è edita. @it
label: a pour périodicité @fr
definition: Met une œuvre en relation avec un intervalle de temps suivant lequel une partie, livraison ou itération d’une œuvre diachronique est publiée. @fr
toolkit label: périodicité @fr
toolkit definition: Intervalle de temps suivant lequel une partie, livraison ou itération d’une œuvre diachronique est publiée. @fr
label: periodiskums @lv
definition: Sasaista darbu ar laika intervālu, kurā laidiena vai seriālizdevuma daļa vai integrētā resursa atjauninājums izdots. @lv
toolkit label: periodiskums @lv
toolkit definition: Laika intervāls, kurā laidiena vai seriālizdevuma daļa vai integrētā resursa atjauninājums izdots. @lv
label: 有频率 @zh-hans
definition: 将一种作品与一种历时作品的期、部分或更新后的整体的发行的时间间隔关联起来。 @zh-hans
toolkit label: 频率 @zh-hans
toolkit definition: 一种历时作品的期、部分或更新后的整体的发行的时间间隔 @zh-hans
has subproperty: P10368
label: yayın sıklığı ile ilişkilidir @tr
definition: Bir eseri, bir artzamanlı eserin bir bölümünün, sayısının veya yinelemesinin yayınlandığı bir aralıkla ilişkilendirir. @tr
toolkit label: sıklık @tr
toolkit definition: Bir artzamanlı çalışmanın bir bölümünün, sayısının veya yinelemesinin yayınlandığı bir aralık. @tr

has appendix work
status: Published
definition: Relates a work to a work whose content augments a related work.
type: Property
domain: C10001
sub property of: is augmented by work
lexical alias: appendixWork.en
toolkit label: appendix work
toolkit definition: A work whose content augments a related work.
toolkit label: annexe (œuvre) @fr
toolkit definition: Œuvre dont le contenu augmente une œuvre en relation. @fr
toolkit label: apéndice (obra) @es
toolkit definition: Una obra que constituye una ampliación de otra obra y que no es esencial para la integridad del contenido, como una lista de referencias, tablas estadísticas, un tema explicativo; puede ser material que va al final del contenido de la obra principal, o que puede publicarse en forma separada. @es
instruction number: 24.5
scope note: Includes lists of references, statistical tables, and explanatory matter that are not essential to the completeness of the content.
label: er bilag (værk) @da
definition: Relaterer et værk til et værk, der udgør en berigende del af et andet værk, der ikke er væsentligt for indholdets fuldstændighed, såsom en kildefortegnelse, statistiske tabeller og forklarende stof; det kan enten være materiale, der forekommer ved slutningen af et hovedværk, eller det kan være udgivet separat. @da
toolkit label: bilag (værk) @da
toolkit definition: Værk, der udgør en berigende del af et andet værk, der ikke er væsentligt for indholdets fuldstændighed, såsom en kildefortegnelse, statistiske tabeller og forklarende stof; det kan enten være materiale, der forekommer ved slutningen af et hovedværk, eller det kan være udgivet separat. @da
definition: Met une œuvre en relation avec une œuvre dont le contenu augmente une œuvre en relation. @fr
label: là phụ bản (tác phẩm) @vi
definition: Liên kết tác phẩm với tác phẩm mà nội dung làm gia tăng tác phẩm khác. @vi
scope note: Bao gồm cả danh mục tham khảo, bảng thống kê, và vật phẩm giải thích không cần thiết đối với sự hoàn thiện của nội dung. @vi
toolkit label: phụ bản (tác phẩm) @vi
toolkit definition: Tác phẩm mà nội dung làm gia tăng tác phẩm khác. @vi
label: hat Anhang (Werk) @de
definition: Setzt ein Werk in Beziehung zu einem Werk, dessen Inhalt ein in Beziehung stehendes Werk erweitert. @de
scope note: Darunter fallen Verzeichnisse der zitierten Literatur, Statistiken und Erläuterungen, die für die Vollständigkeit des Inhalts nicht notwendig sind. @de
toolkit label: Anhang (Werk) @de
toolkit definition: Ein Werk, dessen Inhalt ein in Beziehung stehendes Werk erweitert. @de
label: a pour annexe (œuvre) @fr
definition: Liittää teoksen teokseen, jonka sisältö laajentaa siihen liittyvää teosta. @fi
toolkit label: liite (teos) @fi
toolkit definition: Teos, jonka sisältö laajentaa siihen liittyvää teosta. @fi
toolkit label: bilag (verk) @no
toolkit definition: Et verk hvis innhold utvider et annet verk. @no
label: té com a obra d’apèndix @ca
definition: Relaciona una obra amb una obra el contingut de la qual augmenta una obra relacionada. @ca
scope note: Inclou les llistes de referències, les taules estadístiques i el material explicatiu que no són essencials per a la completesa del contingut. @ca
toolkit label: obra d’apèndix @ca
toolkit definition: Obra el contingut de la qual augmenta una obra relacionada. @ca
scope note: Comprend des listes de références, des tableaux statistiques et des indications explicatives qui ne sont pas essentielles à la complétude du contenu. @fr
has element type: 2
label: είναι παράρτημα (έργο) @el
definition: Συνδέει ένα έργο με ένα έργο του οποίου το περιεχόμενο αυξάνει ένα άλλο έργο. @el
scope note: Περιλαμβάνει λίστες αναφορών, στατιστικούς πίνακες και επεξηγηματική ύλη, που δεν είναι ουσιώδη για την πληρότητα του περιεχομένου. @el
toolkit label: παράρτημα (έργο) @el
toolkit definition: Ένα έργο του οποίου το περιεχόμενο αυξάνει ένα άλλο έργο. @el
label: függeléke a következő mű: @hu
definition: Hozzákapcsol egy művet egy műhöz, amelynek a tartalma egy kapcsolódó művet kibővít. @hu
scope note: Olyan hivatkozási listákat, statisztikai táblázatokat és magyarázó anyagot foglal magába, amelyek lényegesek a tartalom teljességéhez. @hu
toolkit label: függelékmű @hu
toolkit definition: Egy mű, amelynek a tartalma egy kapcsolódó művet kibővít. @hu
scope note: Sisältää viiteluettelot, tilastotaulut ja selitykset, jotka eivät ole välttämättömiä sisällön täydellisyydelle. @fi
label: liite (teos) @fi
label: har bilag (verk) @no
definition: Relaterer et verk til et verk hvis innhold utvider et annet verk. @no
scope note: Inkluderer referanselister, tabeller over statistikk og forklarende innhold som ikke er avgjørende for innholdets fullstendighet. @no
label: heeft appendix-werk @nl
definition: Relateert een werk aan een werk waarvan de content een gerelateerd werk aanvult. @nl
scope note: Omvat referentielijsten, statistische tabellen en toelichtende materie die niet essentieel zijn voor de compleetheid van de content. @nl
toolkit label: appendix-werk @nl
toolkit definition: Een werk waarvan de content een gerelateerd werk aanvult. @nl
label: له عمل ملحق @ar
definition: يربط عمل بعمل يزيد محتواه من عمل ذي صلة. @ar
scope note: يتضمن قوائم المراجع، والجداول الإحصائية، والمسائل التفسيرية غير الضرورية لاكتمال المحتوى. @ar
toolkit label: عمل ملحق @ar
toolkit definition: عمل يزيد محتواه من عمل ذي صلة. @ar
label: apendiks (teos) @et
definition: Seostab teose teosega, mille sisu laiendab seotud teost. @et
scope note: Hõlmab viiteloetelusid, statistilisi tabeleid ja selgitavaid märkusi, mis ei ole sisu terviklikkuse seisukohalt hädavajalikud. @et
toolkit label: apendiks (teos) @et
toolkit definition: Teos, mille sisu laiendab seotud teost. @et
label: ha come appendice opera @it
definition: Correla un’opera a un’opera il cui contenuto aumenta un’opera correlata. @it
scope note: Comprende elenchi di citazioni, tavole statistiche e materiale esplicativo che non sono essenziali alla completezza del contenuto. @it
toolkit label: appendice opera @it
toolkit definition: Opera il cui contenuto aumenta un’opera correlata. @it
label: darbs: pielikums @lv
definition: Sasaista darbu ar darbu, kura saturs papildina citu darbu. @lv

has honouree agent of work
status: Published
definition: Relates a work to an agent who is honoured by a work.
type: Property
domain: C10001
sub property of: has related agent of work
lexical alias: honoureeAgentOfWork.en
toolkit label: honouree agent of work
toolkit definition: An agent who is honoured by a work.
toolkit label: agent honoré d’une œuvre @fr
toolkit definition: Agent qui est honoré par une œuvre. @fr
toolkit label: homenajeado @es
toolkit definition: Una persona, familia o entidad corporativa en cuyo honor se realiza una obra (por ej., quien es objeto de una obra conmemorativa) @es
instruction number: 18.5
label: har agent, som beæres af værk @da
definition: Relaterer et værk til en agent, som hædres af et værk. @da
toolkit label: agent, som beæres af værk @da
toolkit definition: Agent, som hædres af et værk. @da
definition: Met une œuvre en relation avec un agent qui est honoré par une œuvre. @fr
label: có người được kính trọng @vi
definition: Liên kết tác phẩm với tác nhân được tác phẩm kính trọng. @vi
toolkit label: người được kính trọng @vi
toolkit definition: Tác nhân được tác phẩm kính trọng. @vi
label: hat Gefeierte/Gefeierten eines Werks (Akteur) @de
definition: Setzt ein Werk in Beziehung zu einem Akteur, der durch ein Werk geehrt wird. @de
toolkit label: Gefeierte/Gefeierter eines Werks (Akteur) @de
toolkit definition: Ein Akteur, der durch ein Werk geehrt wird. @de
label: a pour agent honoré d’une œuvre @fr
definition: Liittää teoksen toimijaan, jonka kunniaksi teos on tehty. @fi
toolkit label: teoksella kunnioitettu toimija @fi
toolkit definition: Toimija, jonka kunniaksi teos on tehty. @fi
toolkit label: beæret agent av verk @no
toolkit definition: En agent som blir beæret av et verk. @no
label: té com a agent homenatjat d’una obra @ca
definition: Relaciona una obra amb un agent que és homenatjat per una obra. @ca
toolkit label: agent homenatjat d’una obra @ca
toolkit definition: Agent que és homenatjat per una obra. @ca
has element type: 2
alternative label: honoree agent of work
label: έχει τιμώμενο πρόσωπο @el
definition: Συνδέει ένα έργο με έναν φορέα, τιμώμενο από ένα έργο. @el
toolkit label: τιμώμενο πρόσωπο @el
toolkit definition: Ένας φορέας τιμώμενος από ένα έργο. @el
label: mű méltatott ágense a következő: @hu
definition: Hozzákapcsol egy művet egy ágenshez, amelyet egy mű méltat. @hu
toolkit label: mű méltatott ágense: @hu
toolkit definition: Egy ágens, amelyet egy mű méltat. @hu
alternative label: honouree
label: teoksella kunnioitettu toimija @fi
label: har beæret agent av verk @no
definition: Relaterer et verk til en agent som blir beæret av et verk. @no
alternative label: agent beæret av et verk @no
alternative label: beæret av verk @no
label: heeft geëerde actor van werk @nl
definition: Relateert een werk aan een actor die geëerd wordt door een werk. @nl
toolkit label: geëerde actor van werk @nl
toolkit definition: Een actor die geëerd wordt door een werk. @nl
label: له وكيل مكرَّم بعمل @ar
definition: يربط بين عمل ووكيل مكرَّم بعمل. @ar
alternative label: مكرَّم @ar
toolkit label: وكيل مكرم بعمل @ar
toolkit definition: وكيل مكرم بعمل. @ar
alternative label: agent, som er hædersperson i værk @da
label: teose austusavalduse saaja (tegija) @et
definition: Seostab teose tegijaga, keda teosega austatakse. @et
alternative label: teose austusavalduse saaja @et
toolkit label: teose austusavalduse saaja (tegija) @et
toolkit definition: Tegija, keda teosega austatakse. @et
label: ha come onorato agente di opera @it
definition: Correla un’opera a un agente che è onorato da un'opera. @it
alternative label: onorato di opera @it
toolkit label: onorato agente di opera @it
toolkit definition: Agente che è onorato da un'opera. @it
alternative label: agent honoré @fr
label: ar darbu godinātais aģents @lv
definition: Sasaista darbu ar aģentu, kas godināts ar darbu. @lv
toolkit label: ar darbu godinātais aģents @lv
toolkit definition: Aģents, kas godināts ar darbu. @lv
alternative label: Gefeierter @de
label: 有作品的被纪念者行为者 @zh-hans
toolkit label: 作品的被纪念者行为者 @zh-hans

has honouree collective agent of work
status: Published
lexical alias: honoureeCollectiveAgentOfWork.en
definition: Relates a work to a collective agent who is honoured by a work.
toolkit label: honouree collective agent of work
toolkit definition: A collective agent who is honoured by a work.
type: Property
domain: C10001
has element type: 2
sub property of: has related collective agent of work
sub property of: has honouree agent of work
alternative label: honoree collective agent of work
label: teoksella kunnioitettu yhteistoimija @fi
definition: Liittää teoksen yhteistoimijaan, jonka kunniaksi teos on tehty. @fi
toolkit label: teoksella kunnioitettu yhteistoimija @fi
toolkit definition: Yhteistoimija, jonka kunniaksi teos on tehty. @fi
label: har beæret kollektiv agent av verk @no
definition: Relaterer et verk til en kollektiv agent som blir beæret av et verk. @no
alternative label: kollektiv agent beæret av verk @no
toolkit label: beæret kollektiv agent av verk @no
toolkit definition: En kollektiv agent som blir beæret av et verk. @no
label: heeft geëerde collectieve actor van werk @nl
definition: Relateert een werk aan een collectieve actor die geëerd wordt door een werk. @nl
toolkit label: geëerde collectieve actor van werk @nl
toolkit definition: Een collectieve actor die geëerd wordt door een werk. @nl
label: له وكيل جماعي مكرم لعمل @ar
definition: يربط بين عمل ووكيل جماعي يكرَّم بعمل. @ar
alternative label: وكيل جماعي مكرم لعمل @ar
toolkit label: وكيل جماعي مكرم لعمل @ar
toolkit definition: وكيل جماعي يكرَّم بعمل. @ar
label: té com a agent col·lectiu homenatjat d’una obra @ca
definition: Relaciona una obra amb un agent col·lectiu que és homenatjat per una obra. @ca
toolkit label: agent col·lectiu homenatjat d’una obra @ca
toolkit definition: Agent col·lectiu que és homenatjat per una obra. @ca
label: har kollektiv agent, som beæres af værk @da
definition: Relaterer et værk til en kollektiv agent, som hædres af et værk. @da
alternative label: kollektiv agent, som er hædersperson i værk @da
toolkit label: kollektiv agent, som beæres af værk @da
toolkit definition: Kollektiv agent, som hædres af et værk. @da
label: teose austusavalduse saaja (kollektiiv) @et
definition: Seostab teose kollektiiviga, keda teosega austatakse. @et
toolkit label: teose austusavalduse saaja (kollektiiv) @et
toolkit definition: Kollektiiv, keda teosega austatakse. @et
label: hat Gefeierte/Gefeierten eines Werks (Gemeinschaftlicher Akteur) @de
definition: Setzt ein Werk in Beziehung zu einem gemeinschaftlichen Akteur, der durch ein Werk geehrt wird. @de
toolkit label: Gefeierte/Gefeierter eines Werks (Gemeinschaftlicher Akteur) @de
toolkit definition: Ein gemeinschaftlicher Akteur, der durch ein Werk geehrt wird. @de
label: mű méltatott kollektív ágense a következő: @hu
definition: Hozzákapcsol egy művet egy kollektív ágenshez, amelyet egy mű méltat. @hu
alternative label: mű méltatott kollektív ágens: @hu
toolkit label: mű méltatott kollektív ágens: @hu
toolkit definition: Egy kollektív ágens, amelyet egy mű méltat. @hu
label: ha come onorato agente collettivo di opera @it
definition: Correla un'opera a un agente collettivo onorato da un'opera. @it
toolkit label: agente collettivo onorato di opera @it
toolkit definition: Agente collettivo onorato da un'opera. @it
label: a pour agent collectif honoré d’une œuvre @fr
definition: Met une œuvre en relation avec un agent collectif qui est honoré par une œuvre. @fr
toolkit label: agent collectif honoré d’une œuvre @fr
toolkit definition: Agent collectif qui est honoré par une œuvre. @fr
label: ar darbu godinātā grupa @lv
definition: Sasaista darbu ar grupu, kas godināta ar darbu. @lv
toolkit label: ar darbu godinātā grupa @lv
toolkit definition: Grupa, kas godināta ar darbu. @lv
alternative label: Gefeierte/Gefeierter eines Werks (Gemeinschaftlicher Akteur) @de
alternative label: - @fi
alternative label: 作品的被纪念者集体行为者 @zh-hans
label: 有作品的被纪念者集体行为者 @zh-hans
definition: 将一种作品与被一种作品纪念的一个集体行为者关联起来。 @zh-hans
toolkit label: 作品的被纪念者集体行为者 @zh-hans
toolkit definition: 被一种作品纪念的一个集体行为者 @zh-hans
has subproperty: has honouree corporate body of work
has subproperty: has honouree family of work
has subproperty: P10480
label: eserin onurlandırılan kolektif temsilcisi ile ilişkilidir @tr
definition: Bir eseri, bir eser tarafından onurlandırılan kolektif bir temsilci ile ilişkilendirir. @tr
toolkit label: eserin onurlandırılan kolektif temsilcisi ile ilişkilidir @tr
toolkit definition: Bir eser tarafından onurlandırılan kolektif bir temsilci @tr

has honouree corporate body of work
status: Published
lexical alias: honoureeCorporateBodyOfWork.en
definition: Relates a work to a corporate body who is honoured by a work.
toolkit label: honouree corporate body of work
toolkit definition: A corporate body who is honoured by a work.
type: Property
domain: C10001
has element type: 2
sub property of: has related corporate body of work
sub property of: has honouree collective agent of work
alternative label: honoree corporate body of work
label: teoksella kunnioitettu yhteisö @fi
definition: Liittää teoksen yhteisöön, jonka kunniaksi teos on tehty. @fi
toolkit label: teoksella kunnioitettu yhteisö @fi
toolkit definition: Yhteisö, jonka kunniaksi teos on tehty. @fi
label: har beæret korporasjon av verk @no
definition: Relaterer et verk til en korporasjon som blir beæret av et verk. @no
alternative label: korporasjon beæret av verk @no
toolkit label: beæret korporasjon av verk @no
toolkit definition: En korporasjon som blir beæret av et verk. @no
label: heeft geëerde corporatie van werk @nl
definition: Relateert een werk aan een corporatie die geëerd wordt door een werk. @nl
toolkit label: geëerde corporatie van werk @nl
toolkit definition: Een corporatie die geëerd wordt door een werk. @nl
label: له هيئة مكرَّمة لعمل @ar
definition: يربط بين عمل وهيئة يتم تكريمها بعمل. @ar
alternative label: هيئة مكرَّمة لعمل @ar
toolkit label: هيئة مكرَّمة لعمل @ar
toolkit definition: هيئة يتم تكريمها بعمل. @ar
label: té com a entitat corporativa homenatjada d’una obra @ca
definition: Relaciona una obra amb una entitat corporativa que és homenatjada per una obra. @ca
toolkit label: entitat corporativa homenatjada d’una obra @ca
toolkit definition: Entitat corporativa que és homenatjada per una obra. @ca
label: har korporation, som beæres af værk @da
definition: Relaterer et værk til en korporation, som hædres af et værk. @da
alternative label: korporation, som er hædersperson i værk @da
toolkit label: korporation, som beæres af værk @da
toolkit definition: Korporation, som hædres af et værk. @da
label: teose austusavalduse saaja (asutus) @et
definition: Seostab teose asutusega, keda teosega austatakse. @et
toolkit label: teose austusavalduse saaja (asutus) @et
toolkit definition: Asutus, keda teosega austatakse. @et
label: hat Gefeierte/Gefeierten eines Werks (Körperschaft) @de
definition: Setzt ein Werk in Beziehung zu einer Körperschaft, die durch ein Werk geehrt wird. @de
toolkit label: Gefeierte/Gefeierten eines Werks (Körperschaft) @de
toolkit definition: Eine Körperschaft, die durch ein Werk geehrt wird. @de
label: mű méltatott testülete a következő: @hu
definition: Hozzákapcsol egy művet egy testülethez, amelyet egy mű méltat. @hu
alternative label: mű méltatott testülete: @hu
toolkit label: mű méltatott testülete: @hu
toolkit definition: Egy testület, amelyet egy mű méltat. @hu
label: ha come onorato ente di opera @it
definition: Correla un'opera a un ente onorato da un'opera. @it
toolkit label: onorato ente di opera @it
toolkit definition: Ente onorato da un'opera. @it
label: a pour collectivité honorée d’une œuvre @fr
definition: Met une œuvre en relation avec une collectivité qui est honorée par une œuvre. @fr
toolkit label: collectivité honorée d’une œuvre @fr
toolkit definition: Collectivité qui est honorée par une œuvre. @fr
label: ar darbu godinātā institūcija @lv
definition: Sasaista darbu ar institūciju, kas godināta ar darbu. @lv
toolkit label: ar darbu godinātā institūcija @lv
toolkit definition: Institūcija, kas godināta ar darbu. @lv
alternative label: Gefeierte/Gefeierten eines Werks (Körperschaft) @de
alternative label: - @fi
alternative label: 作品的被纪念者团体 @zh-hans
label: 有作品的被纪念者团体 @zh-hans
definition: 将一种作品与被一种作品纪念的一个团体关联起来。 @zh-hans
toolkit label: 作品的被纪念者团体 @zh-hans
toolkit definition: 被一种作品纪念的一个团体 @zh-hans
has subproperty: P10527
label: eserin onurlandırılan tüzel kişisi ile ilişkilidir @tr
definition: Bir eseri, eserle onurlandıran tüzel kişi ile ilişkilendirir. @tr
toolkit label: eserin onurlandırılan tüzel kişisi ile ilişkilidir @tr
toolkit definition: Bir eserle onurlandırılan tüzel kişi. @tr

has honouree family of work
status: Published
lexical alias: honoureeFamilyOfWork.en
definition: Relates a work to a family who is honoured by a work.
toolkit label: honouree family of work
toolkit definition: A family who is honoured by a work.
type: Property
domain: C10001
has element type: 2
sub property of: has related family of work
sub property of: has honouree collective agent of work
alternative label: honoree family of work
label: teoksella kunnioitettu suku @fi
definition: Liittää teoksen sukuun, jonka kunniaksi teos on tehty. @fi
toolkit label: teoksella kunnioitettu suku @fi
toolkit definition: Suku, jonka kunniaksi teos on tehty. @fi
label: har beæret familie av verk @no
definition: Relaterer et verk til en familie som blir beæret av et verk. @no
toolkit label: beæret familie av verk @no
toolkit definition: En familie som blir beæret av et verk. @no
label: heeft geëerde familie van werk @nl
definition: Relateert een werk aan een familie die geëerd wordt door een werk. @nl
toolkit label: geëerde familie van werk @nl
toolkit definition: Een familie die geëerd wordt door een werk. @nl
label: له عائلة مكرَّمة لعمل @ar
definition: يربط بين عمل وعائلة يتم تكريمها بعمل. @ar
alternative label: عائلة مكرَّمة لعمل @ar
toolkit label: عائلة مكرَّمة لعمل @ar
toolkit definition: عائلة يتم تكريمها بعمل. @ar
label: té com a família homenatjada d’una obra @ca
definition: Relaciona una obra amb una família que és homenatjada per una obra. @ca
toolkit label: família homenatjada d’una obra @ca
toolkit definition: Família que és homenatjada per una obra. @ca
label: har familie, som beæres af værk @da
definition: Relaterer et værk til en familie, som hædres af et værk. @da
alternative label: familie, som er hædersperson i værk @da
toolkit label: familie, som beæres af værk @da
toolkit definition: Familie, som hædres af et værk. @da
label: teose austusavalduse saaja (perekond) @et
definition: Seostab teose perekonnaga, keda teosega austatakse. @et
toolkit label: teose austusavalduse saaja (perekond) @et
toolkit definition: Perekond, keda teosega austatakse. @et
label: hat Gefeierte/Gefeierten eines Werks (Familie) @de
definition: Setzt ein Werk in Beziehung zu einer Familie, die durch ein Werk geehrt wird. @de
toolkit label: Gefeierte/Gefeierter eines Werks (Familie) @de
toolkit definition: Eine Familie, die durch ein Werk geehrt wird. @de
label: mű méltatott családja a következő: @hu
definition: Hozzákapcsol egy művet egy családhoz, amelyet egy mű méltat. @hu
alternative label: mű méltatott családja: @hu
toolkit label: méltatott család: @hu
toolkit definition: Egy család, amelyet egy mű méltat. @hu
label: ha come onorato famiglia di opera @it
definition: Correla un'opera a una famiglia onorata da un'opera. @it
alternative label: famiglia onorata di opera @it
toolkit label: onorato famiglia di opera @it
toolkit definition: Famiglia onorata da un'opera. @it
label: a pour famille honorée d’une œuvre @fr
definition: Met une œuvre en relation avec une famille qui est honorée par une œuvre. @fr
toolkit label: famille honorée d’une œuvre @fr
toolkit definition: Famille qui est honorée par une œuvre. @fr
label: ar darbu godinātā dzimta/ģimene @lv
definition: Sasaista darbu ar dzimtu/ģimeni, kas godināta ar darbu. @lv
toolkit label: ar darbu godinātā dzimta/ģimene @lv
toolkit definition: Dzimta/ģimene, kas godināta ar darbu. @lv
alternative label: - @fi
alternative label: 作品的被纪念者家族 @zh-hans
label: 有作品的被纪念者家族 @zh-hans
definition: 将一种作品与被一种作品纪念的一个家族关联起来。 @zh-hans
toolkit label: 作品的被纪念者家族 @zh-hans
toolkit definition: 被一种作品纪念的一个家族 @zh-hans
has subproperty: P10574
label: eserin onurlandırılan ailesi ile ilişkilidir @tr
definition: Bir eseri, eserle onurlandıran bir aileyle ilişkilendirir. @tr
toolkit label: eserin onurlandırılan ailesi ile ilişkilidir @tr
toolkit definition: Bir eserle onurlandırılıan bir aile. @tr

has honouree person of work
status: Published
lexical alias: honoureePersonOfWork.en
definition: Relates a work to a person who is honoured by a work.
toolkit label: honouree person of work
toolkit definition: A person who is honoured by a work.
type: Property
domain: C10001
has element type: 2
sub property of: has related person of work
sub property of: has honouree agent of work
alternative label: honoree person of work
label: teoksella kunnioitettu henkilö @fi
definition: Liittää teoksen henkilöön, jonka kunniaksi teos on tehty. @fi
toolkit label: teoksella kunnioitettu henkilö @fi
toolkit definition: Henkilö, jonka kunniaksi teos on tehty. @fi
label: har beæret person av verk @no
definition: Relaterer et verk til en person som blir beæret av et verk. @no
alternative label: person beæret av verk @no
toolkit label: beæret person av verk @no
toolkit definition: En person som blir beæret av et verk. @no
label: heeft geëerde persoon van werk @nl
definition: Relateert een werk aan een persoon die geëerd wordt door een werk. @nl
toolkit label: geëerde persoon van werk @nl
toolkit definition: Een persoon die geëerd wordt door een werk. @nl
label: له شخص مكرَّم لعمل @ar
definition: يربط بين عمل وشخص تم تكريمه بعمل. @ar
alternative label: شخص مكرَّم لعمل @ar
toolkit label: شخص مكرَّم لعمل @ar
toolkit definition: شخص تم تكريمه بعمل. @ar
label: té com a persona homenatjada d’una obra @ca
definition: Relaciona una obra amb una persona que és homenatjada per una obra. @ca
toolkit label: persona homenatjada d’una obra @ca
toolkit definition: Persona que és homenatjada per una obra. @ca
label: har person, som beæres af værk @da
definition: Relaterer et værk til en person, som hædres af et værk. @da
alternative label: person, som er hædersperson i værk @da
toolkit label: person, som beæres af værk @da
toolkit definition: Person, som hædres af et værk. @da
label: teose austusavalduse saaja (isik) @et
definition: Seostab teose isikuga, keda teosega austatakse. @et
toolkit label: teose austusavalduse saaja (isik) @et
toolkit definition: Isik, keda teosega austatakse. @et
label: hat Gefeierte/Gefeierten eines Werks (Person) @de
definition: Setzt ein Werk in Beziehung zu einer Person, die durch ein Werk geehrt wird. @de
toolkit label: Gefeierte/Gefeierter eines Werks (Person) @de
toolkit definition: Eine Person, die durch ein Werk geehrt wird. @de
label: mű méltatott személye a következő: @hu
definition: Hozzákapcsol egy művet egy személyhez, akit egy mű méltat. @hu
alternative label: mű méltatott személye: @hu
toolkit label: mű méltatott személye: @hu
toolkit definition: Egy személy, akit egy mű méltat. @hu
label: ha come onorato persona di opera @it
definition: Correla un'opera a una persona onorata da un'opera. @it
alternative label: persona onorata di opera @it
toolkit label: onorato persona di opera @it
toolkit definition: Persona onorata da un'opera. @it
label: a pour personne honorée d’une œuvre @fr
definition: Met une œuvre en relation avec une personne qui est honorée par une œuvre. @fr
toolkit label: personne honorée d’une œuvre @fr
toolkit definition: Personne qui est honorée par une œuvre. @fr
label: ar darbu godinātā persona @lv
definition: Sasaista darbu ar personu, kura godināta ar darbu. @lv
toolkit label: ar darbu godinātā persona @lv
toolkit definition: Persona, kura godināta ar darbu. @lv
alternative label: - @fi
alternative label: 作品的被纪念者个人 @zh-hans
label: 有作品的被纪念者个人 @zh-hans
definition: 将一种作品与被一种作品纪念的一个个人关联起来。 @zh-hans
toolkit label: 作品的被纪念者个人 @zh-hans
toolkit definition: 被一种作品纪念的一个个人 @zh-hans
has subproperty: P10433
label: eserin onurlandırılan kişisi ile ilişkilidir @tr
definition: Bir eseri, bir eserle onurlanan kimse ile ilişkilendirir. @tr
toolkit label: eserin onurlandırılan kişisi ile ilişkilidir @tr
toolkit definition: Bir eserle onurlandırılan kimse. @tr

has longitude
status: Published
type: Property
lexical alias: longitude.en
definition: Relates a work to the distance of a place on a planet or satellite that is measured east and west from a reference meridian.
domain: C10001
toolkit label: longitude
toolkit definition: The distance of a place on a planet or satellite that is measured east and west from a reference meridian.
instruction number: 7.4.2
label: har længdegrad @da
definition: Relaterer et værk til en afstand fra et punkt på en planet eller satellit målt øst og vest fra en referencemeridian. @da
toolkit label: længdegrad @da
toolkit definition: Afstand fra et punkt på en planet eller satellit målt øst og vest fra en referencemeridian. @da
label: có kinh độ @vi
definition: Liên kết tác phẩm với khoảng cách của một điểm trên hành tinh hoặc vệ tinh được đo theo hướng đông và tây từ kinh tuyến tham chiếu. @vi
toolkit label: kinh độ @vi
toolkit definition: Khoảng cách của một điểm trên hành tinh hoặc vệ tinh được đo theo hướng đông và tây từ kinh tuyến tham chiếu. @vi
label: hat Längengrad @de
definition: Setzt ein Werk in Beziehung zu einer Entfernung eines Gebiets auf einem Planeten oder Satelliten, das östlich und westlich von einem Bezugsmeridian gemessen wird. @de
toolkit label: Längengrad @de
toolkit definition: Die Entfernung eines Gebiets auf einem Planeten oder Satelliten, das östlich und westlich von einem Bezugsmeridian gemessen wird. @de
definition: Liittää teoksen planeetalla tai kuussa olevan paikan etäisyyteen, joka on mitattu itään ja länteen annetusta meridiaanista. @fi
toolkit label: pituusaste @fi
toolkit definition: Planeetalla tai kuussa olevan paikan etäisyys, joka on mitattu itään ja länteen annetusta meridiaanista. @fi
toolkit label: lengdegrad @no
toolkit definition: Avstanden til et punkt på en planet eller satellitt målt øst eller vest fra en referansemeridian. @no
label: té com a longitud @ca
definition: Relaciona una obra amb la distància d’un lloc sobre un planeta o un satèl·lit que es mesura a l’est i a l’oest d’un meridià de referència. @ca
toolkit label: longitud @ca
toolkit definition: La distància d’un lloc sobre un planeta o un satèl·lit que es mesura a l’est i a l’oest d’un meridià de referència. @ca
label: a pour longitude @fr
definition: Met une œuvre en relation avec une distance d’un lieu sur une planète ou un satellite qui est mesurée à l’est et à l’ouest d’un méridien de référence. @fr
toolkit definition: Distance d’un lieu sur une planète ou un satellite qui est mesurée à l’est et à l’ouest d’un méridien de référence. @fr
has element type: 6
label: έχει γεωγραφικό μήκος @el
definition: Συνδέει ένα έργο με μια απόσταση ενός σημείου πάνω σε έναν πλανήτη ή δορυφόρο που μετράται ανατολικά και δυτικά από τον μεσημβρινό αναφοράς. @el
toolkit label: γεωγραφικό μήκος @el
toolkit definition: Μια απόσταση ενός σημείου πάνω σε έναν πλανήτη ή δορυφόρο που μετράται ανατολικά και δυτικά από τον μεσημβρινό αναφοράς. @el
label: hosszúsági foka a következő: @hu
definition: Hozzákapcsol egy művet egy bolygó vagy hold egy pontjának a referencia-délkörtől (meridiántól) keletre és nyugatra mért távolságához. @hu
toolkit label: hosszúsági foka: @hu
toolkit definition: Egy bolygó vagy hold egy pontjának a referencia-délkörtől (meridiántól) keletre és nyugatra mért távolsága. @hu
label: pituusaste @fi
label: har lengdegrad @no
definition: Relaterer et verk til avstanden til et punkt på en planet eller satellitt målt øst eller vest fra en referansemeridian. @no
label: heeft lengtegraad @nl
definition: geen nieuwe vert nodig, bevatte tikfout in Engelse versie, geen inhoudelijke wijziging. @nl
toolkit label: lengtegraad @nl
toolkit definition: geen nieuwe vert nodig, bevatte tikfout in Engelse versie, geen inhoudelijke wijziging. @nl
label: له خط طول @ar
definition: يربط بين عمل ومسافة نقطة على كوكب أو قمر اصطناعي مقاسة شرقًا وغربًا من خط الزوال المرجعي. @ar
toolkit label: خط طول @ar
toolkit definition: مسافة نقطة على كوكب أو قمر اصطناعي مقاسة شرقًا وغربًا من خط الزوال المرجعي. @ar
label: pikkuskraad @et
definition: Seostab teose planeedi või selle kaaslase pinnapunkti kaugusega algmeridiaanist ida või lääne suunas. @et
toolkit label: pikkuskraad @et
toolkit definition: Planeedi või selle kaaslase pinnapunkti kaugus algmeridiaanist ida või lääne suunas @et
label: ha come longitdine @it
definition: Correla un’opera a una distanza di un punto su un pianeta o satellite misurata a Est e a Ovest del meridiano di riferimento. @it
toolkit label: longitudine @it
toolkit definition: Distanza di un punto su un pianeta o satellite misurata a Est e a Ovest del meridiano di riferimento. @it
label: ģeogrāfiskais garums @lv
definition: Sasaista darbu ar planētas vai satelīta punkta attālumu no sākummeridiāna uz austrumiem un rietumiem. @lv
toolkit label: ģeogrāfiskais garums @lv
toolkit definition: Planētas vai satelīta punkta attālums no sākummeridiāna uz austrumiem un rietumiem. @lv
label: 有经度 @zh-hans
definition: 将一种作品与从行星或卫星的基准子午线向东和向西到行星或卫星上一个地点所测量的距离关联起来。 @zh-hans
toolkit label: 经度 @zh-hans
toolkit definition: 从行星或卫星的基准子午线向东和向西到行星或卫星上一个地点所测量的距离 @zh-hans
has subproperty: P10301
label: boylam ile ilişkilidir @tr
definition: Bir eseri, bir gezegen veya uydu üzerindeki bir yerin, bir referans meridyeninden doğu ve batıya ölçülen mesafesiyle ilişkilendirir. @tr
toolkit label: boylam @tr
toolkit definition: Bir gezegen veya uydu üzerindeki bir yerin, bir referans meridyeninden doğu ve batıya ölçülen mesafesi. @tr

has longitude and latitude
status: Published
definition: Relates a work to a place that is the area of coverage of a cartographic work that is identified using the longitude of the westernmost and easternmost boundaries and the latitude of the northernmost and southernmost boundaries.
type: Property
domain: C10001
sub property of: has coordinates of cartographic content
lexical alias: longitudeAndLatitude.en
instruction number: 7.4.2
toolkit label: longitude and latitude
toolkit definition: A place that is the area of coverage of a cartographic work that is identified using the longitude of the westernmost and easternmost boundaries and the latitude of the northernmost and southernmost boundaries.
toolkit label: longitude et latitude @fr
toolkit definition: Lieu qui constitue la zone de couverture d’une œuvre cartographique identifiée à l’aide de la longitude des limites ouest et est et de la latitude des limites nord et sud. @fr
toolkit label: longitud y latitud @es
toolkit definition: Un sistema para identificar el área cubierta por el contenido cartográfico de un recurso. @es
label: har longitud och latitud @sv
toolkit label: longitud och latitud @sv
label: har længdegrad og breddegrad @da
definition: Relaterer et værk til et sted, som identificerer det område, som dækkes af et værks kartografiske indhold, ved anvendelse af længdegrader for de vestligste og østligste grænser samt breddegrader for de nordligste og sydligste grænser. @da
toolkit label: længdegrad og breddegrad @da
toolkit definition: Sted, som identificerer det område, som dækkes af et værks kartografiske indhold, ved anvendelse af længdegrader for de vestligste og østligste grænser samt breddegrader for de nordligste og sydligste grænser. @da
definition: Met une œuvre en relation avec un lieu qui constitue la zone de couverture d’une œuvre cartographique identifiée à l’aide de la longitude des limites ouest et est et de la latitude des limites nord et sud. @fr
label: có kinh độ và vĩ độ @vi
definition: Liên kết tác phẩm với hệ thống để nhận dạng khu vực được bao quát bởi nội dung bản đồ của tác phẩm sử dung kinh độ của biên giới cực tây và cực đông và vĩ độ của biên giới cực bắc và cực nam. @vi
toolkit label: kinh độ và vĩ độ @vi
toolkit definition: Hệ thống để nhận dạng khu vực được bao quát bởi nội dung bản đồ của tác phẩm sử dung kinh độ của biên giới cực tây và cực đông và vĩ độ của biên giới cực bắc và cực nam. @vi
label: hat Längengrad und Breitengrad @de
definition: Setzt ein Werk in Beziehung zu einem Gebiet, das den Abdeckungsbereich eines kartografischen Werks darstellt und anhand des Längengrads der westlichsten und östlichsten Grenze sowie des Breitengrads der nördlichsten und südlichsten Grenze identifiziert wird. @de
toolkit label: Längengrad und Breitengrad @de
toolkit definition: Ein Gebiet, das den Abdeckungsbereich eines kartografischen Werks darstellt und anhand des Längengrads der westlichsten und östlichsten Grenze sowie des Breitengrads der nördlichsten und südlichsten Grenze identifiziert wird. @de
label: a pour longitude et latitude @fr
definition: Liittää teoksen paikkaan, joka on kartografisen teoksen kattama alue, joka on identifioitu käyttämällä läntisimmän ja itäisimmän rajan pituusastetta sekä pohjoisimman ja eteläisimmän rajan leveysastetta. @fi
toolkit label: pituus- ja leveysasteet @fi
toolkit definition: Paikka, joka on kartografisen teoksen kattama alue, joka on identifioitu käyttämällä läntisimmän ja itäisimmän rajan pituusastetta sekä pohjoisimman ja eteläisimmän rajan leveysastetta. @fi
toolkit label: lengdegrad og breddegrad @no
toolkit definition: Et sted som identifiserer området som dekkes av det kartografiske innholdet til et verk, ved hjelp av lengdegrader for vestligste og østligste grense og breddegrader for nordligste og sørligste grense. @no
label: té com a longitud i latitud @ca
definition: Relaciona una obra amb un lloc que és l’àrea de cobertura d’una obra cartogràfica que s’identifica usant la longitud dels límits oest i est i la latitud dels límits nord i sud. @ca
toolkit label: longitud i latitud @ca
toolkit definition: Lloc que és l’àrea de cobertura d’una obra cartogràfica que s’identifica usant la longitud dels límits oest i est i la latitud dels límits nord i sud. @ca
has element type: 3
label: έχει γεωγραφικό μήκος και γεωγραφικό πλάτος @el
definition: Συνδέει ένα έργο με ένα σύστημα για την ταύτιση της περιοχής που καλύπτεται από το χαρτογραφικό περιεχόμενο ενός έργου που χρησιμοποιεί το γεωγραφικό μήκος για την ταύτιση της περιοχής των δυτικότερων και ανατολικότερων ορίων και το γεωγραφικό πλάτος για τα δυτικότερα και βορειότερα όρια. @el
toolkit label: γεωγραφικό μήκος και γεωγραφικό πλάτος @el
toolkit definition: Ένα σύστημα για την ταύτιση της περιοχής που καλύπτεται από το χαρτογραφικό περιεχόμενο ενός έργου που χρησιμοποιεί το γεωγραφικό μήκος για την ταύτιση της περιοχής των δυτικότερων και ανατολικότερων ορίων και το γεωγραφικό πλάτος για τα δυτικότερα και βορειότερα όρια. @el
label: hosszúsági és szélességi foka a következő: @hu
definition: Hozzákapcsol egy művet egy helyhez, amely azonosít egy kartográfiai mű által lefedett területet a legnyugatibb és legkeletibb határok hosszúságának és a legészakibb és legdélibb határok szélességének a használatával. @hu
toolkit label: hosszúsági és szélességi foka: @hu
toolkit definition: Egy hely, amely azonosít egy kartográfiai mű által lefedett területet a legnyugatibb és legkeletibb határok hosszúságának és a legészakibb és legdélibb határok szélességének a használatával. @hu
label: pituus- ja leveysasteet @fi
label: har lengdegrad og breddegrad @no
definition: Relaterer et verk til et sted som identifiserer området som dekkes av det kartografiske innholdet til et verk, ved hjelp av lengdegrader for vestligste og østligste grense og breddegrader for nordligste og sørligste grense. @no
label: heeft lengte- en breedtegraad @nl
definition: Relateert een werk aan een plaats die is het bestreken gebied van een cartografisch werk dat geïdentificeerd wordt met gebruikmaking van de lengtegraad van de meest westelijke en meest oostelijke grenzen en de breedtegraad van de meest noordelijke en meest zuidelijke grenzen. @nl
toolkit label: lengte- en breedtegraad @nl
toolkit definition: Een plaats die is het bestreken gebied van een cartografisch werk dat geïdentificeerd wordt met gebruikmaking van de lengtegraad van de meest westelijke en meest oostelijke grenzen en de breedtegraad van de meest noordelijke en meest zuidelijke grenzen. @nl
label: له خط طول وعرض @ar
definition: يربط بين عمل ومكان عبارة عن نطاق تغطية محتوى خرائطي لعمل محدد باستخدام خط الطول لأقصى الحدود الغربية والشرقية وخط العرض لأقصى الحدود الشمالية والجنوبية. @ar
toolkit label: خط طول وعرض @ar
toolkit definition: مكان عبارة عن نطاق تغطية محتوى خرائطي لعمل محدد باستخدام خط الطول لأقصى الحدود الغربية والشرقية وخط العرض لأقصى الحدود الشمالية والجنوبية. @ar
label: pikkuskraad ja laiuskraad @et
definition: Seostab teose kohaga, mis tuvastatakse teose kartograafilise sisuga hõlmatud alana läänepoolseima ja idapoolseima piirjoone pikkuskraadi ning põhjapoolseima ja lõunapoolseima piirjoone laiuskraadi abil. @et
toolkit label: pikkuskraad ja laiuskraad @et
toolkit definition: Koht, mis tuvastatakse teose kartograafilise sisuga hõlmatud alana läänepoolseima ja idapoolseima piirjoone pikkuskraadi ning põhjapoolseima ja lõunapoolseima piirjoone laiuskraadi abil. @et
label: ha come longitudine e latitudine @it
definition: Correla un’opera a un luogo che identifica un’area coperta dal contenuto cartografico di un’opera che utilizza la longitudine dei limiti orientale e occidentale e la latitudine dei limiti settentrionale e meridionale. @it
toolkit label: longitudine e latitudine @it
toolkit definition: Luogo che identifica un’area coperta dal contenuto cartografico di un’opera che utilizza la longitudine dei limiti orientale e occidentale e la latitudine dei limiti settentrionale e meridionale. @it
label: ģeogrāfiskais garums un platums @lv
definition: Sasaista darbu ar vietu, kas ir teritorija sistēmas resursa kartogrāfiskajā saturā ietvertās teritorijas identificēšanai, izmantojot ģeogrāfiskā garuma tālākās rietumu un austrumu robežas un ģeogrāfiskā platuma tālākās ziemeļu un dienvidu robežas. @lv
toolkit label: ģeogrāfiskais garums un platums @lv
toolkit definition: Sistēma resursa kartogrāfiskajā saturā ietvertās teritorijas identificēšanai, izmantojot ģeogrāfiskā garuma tālākās rietumu un austrumu robežas un ģeogrāfiskā platuma tālākās ziemeļu un dienvidu robežas. @lv
label: 有经度和纬度 @zh-hans
definition: 将一种作品与作为一种地图作品的覆盖范围、用最西和最东边界的经度以及最北和最南边界的纬度标识的一个地点关联起来。 @zh-hans
toolkit label: 经度和纬度 @zh-hans
toolkit definition: 作为一种地图作品的覆盖范围、用最西和最东边界的经度以及最北和最南边界的纬度标识的一个地点 @zh-hans
has subproperty: P10081
label: enlem ve boylam ile ilişkilidir @tr
definition: Bir eseri, en batı ve en doğu sınırlarının boylamı ile en kuzey ve en güney sınırlarının enlemi kullanılarak tanımlanan bir kartografik eserin kapsama alanı olan bir yerle ilişkilendirir. @tr
toolkit label: boylam ve enlem @tr
toolkit definition: En batı ve en doğu sınırlarının boylamı ile en kuzey ve en güney sınırlarının enlemi kullanılarak tanımlanan bir kartografik eserin kapsama alanı olan bir yer. @tr

has hosting institution
status: Published
definition: Relates a work to a corporate body who hosts a conference, exhibition, or other event that gives rise to a work, but has little or no responsibility for the content.
type: Property
domain: C10001
sub property of: has related corporate body of work
lexical alias: hostingInstitution.en
toolkit label: hosting institution
toolkit definition: A corporate body who hosts a conference, exhibition, or other event that gives rise to a work, but has little or no responsibility for the content.
toolkit label: institution hôte @fr
toolkit definition: Collectivité qui accueille un congrès, une exposition ou un autre événement qui donne lieu à la création d’une œuvre, mais qui a peu ou pas du tout de responsabilité quant au contenu. @fr
toolkit label: institución sede @es
toolkit definition: Una entidad corporativa que es sede de un evento, exposición, conferencia, etc., que da origen a la obra, pero que tiene poca o ninguna responsabilidad por el contenido de la obra. @es
instruction number: 18.5
label: har værtsinstitution @da
definition: Relaterer et værk til en korporation, som afholder en konference, udstilling eller anden begivenhed, som fører til et værk, som korporationen har ringe eller intet ansvar for indholdet af. @da
toolkit label: værtsinstitution @da
toolkit definition: Korporation, som afholder en konference, udstilling eller anden begivenhed, som fører til et værk, som korporationen har ringe eller intet ansvar for indholdet af. @da
definition: Met une œuvre en relation avec une collectivité qui accueille un congrès, une exposition ou un autre événement qui donne lieu à la création d’une œuvre, mais qui a peu ou pas du tout de responsabilité quant au contenu. @fr
label: có cơ quan chủ nhà @vi
definition: Liên kết tác phẩm với tập thể làm chủ nhà của sự kiện, triển lãm, hội nghị, v.v..., người làm ra đời tác phẩm nhưng có ít hoặc không có trách nhiệm về nội dung. @vi
toolkit label: cơ quan chủ nhà @vi
toolkit definition: Tập thể làm chủ nhà của sự kiện, triển lãm, hội nghị, v.v..., người làm ra đời tác phẩm nhưng có ít hoặc không có trách nhiệm về nội dung. @vi
label: hat gastgebende Institution @de
definition: Setzt ein Werk in Beziehung zu einer Körperschaft, die eine Konferenz, eine Ausstellung oder eine andere Veranstaltung ausrichtet, die ein Werk zur Folge hat, die aber für den Inhalt wenig oder gar keine Verantwortung trägt. @de
toolkit label: Gastgebende Institution @de
toolkit definition: Eine Körperschaft, die eine Konferenz, eine Ausstellung oder eine andere Veranstaltung ausrichtet, die ein Werk zur Folge hat, die aber für den Inhalt wenig oder gar keine Verantwortung trägt. @de
label: a pour institution hôte @fr
definition: Liittää teoksen yhteisöön, joka isännöi teokselle alun antavan konferenssin, näyttelyn tai muun tapahtuman, mutta jolla on vähän tai ei lainkaan vastuuta teoksen sisällöstä. @fi
toolkit label: isäntäorganisaatio @fi
toolkit definition: Yhteisö, joka isännöi teokselle alun antavan konferenssin, näyttelyn tai muun tapahtuman, mutta jolla on vähän tai ei lainkaan vastuuta teoksen sisällöstä @fi
toolkit label: vertsinstitusjon @no
toolkit definition: En korporasjon som er vertskap for en konferanse, en utstilling eller et annet arrangement som har inspirert til et verk, men som har lite eller intet ansvar for verkets innhold. @no
label: té com a institució d’acollida @ca
definition: Relaciona una obra amb una entitat corporativa que acull un congrés, una exposició o un altre esdeveniment, que dona lloc a la creació d’una obra, però que té poca o cap responsabilitat en el contingut. @ca
toolkit label: institució d’acollida @ca
toolkit definition: Entitat corporativa que acull un congrés, una exposició o un altre esdeveniment, que dona lloc a la creació d’una obra, però que té poca o cap responsabilitat en el contingut. @ca
has element type: 2
label: έχει ίδρυμα υποδοχής @el
definition: Συνδέει ένα έργο με ένα συλλογικό όργανο που φιλοξενεί ένα συμβάν, μια έκθεση, ένα συνέδριο κ.λπ., αλλά φέρει μερική ή καμία ευθύνη για το περιεχόμενο. @el
toolkit label: ίδρυμα υποδοχής @el
toolkit definition: Ένα συλλογικό όργανο που φιλοξενεί ένα συμβάν, μια έκθεση, ένα συνέδριο κ.λπ., εκ των οποίων προκλήθηκε η δημιουργία του έργου αλλά φέρει μερική ή καμία ευθύνη για το περιεχόμενο. @el
label: rendező intézménye a következő: @hu
definition: Hozzákapcsol egy művet egy mű létrejöttében szerepet játszó konferenciát, kiállítást vagy más eseményt rendező testülethez, azonban nincs neki, vagy csekély a felelőssége a tartalom iránt. @hu
toolkit label: rendező intézmény: @hu
toolkit definition: Egy mű létrejöttében szerepet játszó konferenciát, kiállítást vagy más eseményt rendező testület, azonban nincs neki, vagy csekély a felelőssége a tartalom iránt. @hu
alternative label: host institution
label: isäntäorganisaatio @fi
label: har vertsinstitusjon @no
definition: Relaterer et verk til en korporasjon som er vertskap for en konferanse, en utstilling eller et annet arrangement som har inspirert til et verk, men som har lite eller intet ansvar for verkets innhold. @no
label: heeft hostorganisatie @nl
definition: Relateert een werk aan een corporatie die een een conferentie, tentoonstelling of andere gebeurtenis houdt die aanleiding geeft tot een werk, met weinig of geen verantwoordelijkheid voor de content. @nl
toolkit label: hostorganisatie @nl
toolkit definition: Een corporatie die een een conferentie, tentoonstelling of andere gebeurtenis houdt die aanleiding geeft tot een werk, met weinig of geen verantwoordelijkheid voor de content. @nl
label: له مؤسسة مستضيفة @ar
definition: يربط بين عمل وهيئة تستضيف مؤتمرًا، أو معرضًا، أو حدثًا آخر ينتج عنه عمل، ولكن لديها مسئولية محدودة عن المحتوى أو غير مسئولة مطلقًا عن المحتوى. @ar
alternative label: مؤسسة مستضيفة @ar
toolkit label: مؤسسة مستضيفة @ar
toolkit definition: هيئة تستضيف مؤتمرًا، أو معرضًا، أو حدثًا آخر ينتج عنه عمل، ولكن لديها مسئولية محدودة عن المحتوى أو غير مسئولة مطلقًا عن المحتوى. @ar
alternative label: institution, som er vært @da
label: võõrustav asutus @et
definition: Seostab teose asutusega, kes korraldab konverentsi, näituse või muu teosele aluse pannud ürituse, kuid kes ei vastuta või vastutab vähe teose sisu eest. @et
toolkit label: võõrustav asutus @et
toolkit definition: Asutus, kes korraldab konverentsi, näituse või muu teosele aluse pannud ürituse, kuid ei vastuta või vastutab vähe teose sisu eest. @et
alternative label: házigazda intézmény: @hu
label: ha come istituzione ospitante @it
definition: Correla un’opera a un ente che ospita un evento, mostra, conferenza, etc., che ha dato origine a un'opera, ma che ha poca o nessuna responsabilità per il contenuto. @it
toolkit label: istituzione ospitante @it
toolkit definition: Ente che ospita un evento, mostra, conferenza, etc., che ha dato origine a un'opera, ma che ha poca o nessuna responsabilità per il contenuto. @it
alternative label: institution hôtesse @fr
label: uzņemošā institūcija @lv
definition: Sasaista darbu ar institūciju, kas izmitina konferenci, izstādi vai citu pasākumu, kas rada darbu, bet par darba saturu ir neliela vai pat nekāda atbildība. @lv
toolkit label: uzņemošā institūcija @lv
toolkit definition: Institūcija, kas izmitina konferenci, izstādi vai citu pasākumu, kas rada darbu, bet par darba saturu ir neliela vai pat nekāda atbildība. @lv
alternative label: 承办机构 @zh-hans
label: 有承办机构 @zh-hans
definition: 将一种作品与承办会议、展览或其他活动导致一种作品但对其内容很少或没有责任的一个团体关联起来。 @zh-hans
toolkit label: 承办机构 @zh-hans
toolkit definition: 承办会议、展览或其他活动导致一种作品但对其内容很少或没有责任的一个团体 @zh-hans
has subproperty: P10007

has identifier for work group
status: Published
lexical alias: identifierForWorkGroup.en
definition: Relates a work to a nomen that is an appellation of work that consists of a code, number, or other string, usually independent of natural language and social naming conventions, used to identify a work group.
toolkit label: identifier for work group
toolkit definition: A nomen that is an appellation of work that consists of a code, number, or other string, usually independent of natural language and social naming conventions, used to identify a work group.
type: Property
domain: C10001
has element type: 3
sub property of: has appellation of work group
label: teosryhmän tunniste @fi
definition: Liittää teoksen teoksen nimitykseen, joka koostuu koodista, luvusta tai muusta tavallisesti luonnollisesta kielestä ja yleisistä nimeämiskäytännöistä riippumattomasta merkkijonosta, jota käytetään teosryhmän identifiointiin. @fi
toolkit label: teosryhmän tunniste @fi
toolkit definition: Nomen, joka on teoksen nimitys, joka koostuu koodista, luvusta tai muusta tavallisesti luonnollisesta kielestä ja yleisistä nimeämiskäytännöistä riippumattomasta merkkijonosta, jota käytetään teosryhmän identifiointiin. @fi
label: har identifikator for verksgruppe @no
definition: Relaterer et verk til en betegnelse for verk som består av en kode, et tall eller annen streng, som regel uavhengig av naturlig språk og sosiale navnekonvensjoner, brukt for å identifisere en verksgruppe. @no
toolkit label: identifikator for verksgruppe @no
toolkit definition: En betegnelse for verk som består av en kode, et tall eller annen streng, som regel uavhengig av naturlig språk og sosiale navnekonvensjoner, brukt for å identifisere en verksgruppe. @no
label: heeft identificatie voor werkgroep @nl
definition: Relateert een werk aan een nomen dat is een benaming van werk die bestaat uit een code, nummer of andere string, meestal onafhankelijk van natuurlijke taal en gewoonlijke naamgevingsconventies, gebruikt om een werkgroep te identificeren. @nl
toolkit label: identificatie voor werkgroep @nl
toolkit definition: Een nomen dat is een benaming van werk die bestaat uit een code, nummer of andere string, meestal onafhankelijk van natuurlijke taal en gewoonlijke naamgevingsconventies, gebruikt om een werkgroep te identificeren. @nl
label: له معرف لمجموعة عمل @ar
definition: يربط بين عمل واسم تعريفي عبارة عن تسمية لعمل تتكون من رمز، أو رقم، أو سلسلة تمثيلات أخرى عادةً ما تكون مستقلة عن اللغة الطبيعية والتسميات المتعارف عليها اجتماعيا، وستخدم لتحديد مجموعة عمل. @ar
toolkit label: معرف لمجموعة عمل @ar
toolkit definition: تسمية عبارة عن اسم تعريفي لعمل يتكون من رمز، أو رقم، أو سلسلة تمثيلات أخرى عادةً ما تكون مستقلة عن اللغة الطبيعية والتسميات المتعارف عليها اجتماعيا، تُستخدم لتحديد مجموعة عمل. @ar
label: té com a identificador de grup d’obres @ca
definition: Relaciona una obra amb un nomen que és una apel·lació d’obra que consisteix en un codi, un número o qualsevol altra cadena, normalment independent del llenguatge natural i de les convencions lingüístiques socials, usada per identificar un grup d’obres. @ca
toolkit label: identificador de grup d’obres @ca
toolkit definition: Nomen que és una apel·lació d’obra que consisteix en un codi, un número o qualsevol altra cadena, normalment independent del llenguatge natural i de les convencions lingüístiques socials, usada per identificar un grup d’obres. @ca
label: har identifikator for værkgruppe @da
definition: Relaterer et værk til en benævnelse på værk, som består af en kode, nummer eller anden streng, ofte uafhængig af normalsprog og navngivningskonventioner, brugt til at identificere en værkgruppe. @da
toolkit label: identifikator for værkgruppe @da
toolkit definition: Benævnelse på værk, som består af en kode, nummer eller anden streng, ofte uafhængig af normalsprog og navngivningskonventioner, brugt til at identificere en værkgruppe. @da
label: teoserühma identifikaator @et
definition: Seostab teose teose nimetusega, mis koosneb teoserühma identifitseerivast koodist, numbrist või muust loomulikust keelest ja üldtuntud nimetamistavadest sõltumatust stringist. @et
toolkit label: teoserühma identifikaator @et
toolkit definition: Teose nimetus, mis koosneb teoserühma identifitseerivast koodist, numbrist või muust loomulikust keelest ja üldtuntud nimetamistavadest sõltumatust stringist. @et
label: hat Identifikator für eine Werkgruppe @de
definition: Setzt ein Werk in Beziehung zu einer Bezeichnung für ein Werk, die aus einem Code, einer Nummer oder einer anderen Zeichenkette besteht, der/die normalerweise nicht in natürlicher Sprache und unabhängig von den sozialen Benennungskonventionen ist und zur Identifizierung einer Werkgruppe verwendet wird. @de
toolkit label: Identifikator für eine Werkgruppe @de
toolkit definition: Eine Bezeichnung für ein Werk, die aus einem Code, einer Nummer oder einer anderen Zeichenkette besteht, der/die normalerweise nicht in natürlicher Sprache und unabhängig von den sozialen Benennungskonventionen ist und zur Identifizierung einer Werkgruppe verwendet wird. @de
label: műcsoport azonosítója a következő: @hu
definition: Hozzákapcsol egy művet egy nomenhez, egy mű megnevezéséhez, amely kódból, számból vagy egyéb karakterláncból áll, általában a természetes nyelvtől és társadalmi elnevezési konvencióktól független, és egy műcsoport azonosítására használják. @hu
toolkit label: műcsoportazonosító @hu
toolkit definition: Egy nomen, egy mű megnevezése, amely kódból, számból vagy egyéb karakterláncból áll, általában a természetes nyelvtől és társadalmi elnevezési konvencióktól független, és egy műcsoport azonosítására használják. @hu
label: ha come identificativo per gruppo di opere @it
definition: Correla un'opera a una denominazione di opera, che consiste di un codice, numero o altra stringa, solitamente indipendente dal linguaggio naturale e dalle convezioni sociali di denominazione, utilizzato per identificare un gruppo di opere. @it
toolkit label: identificativo per gruppo di opere @it
toolkit definition: Denominazione di opera, che consiste di un codice, numero o altra stringa, solitamente indipendente dal linguaggio naturale e dalle convezioni sociali di denominazione, utilizzato per identificare un gruppo di opere. @it
label: a pour identifiant de groupe d’œuvres @fr
definition: Met une œuvre en relation avec un nomen qui est une appellation d’œuvre consistant en un code, un nombre ou une autre chaîne, généralement indépendante du langage naturel et des conventions sociales de dénomination, utilisée pour identifier un groupe d’œuvres. @fr
toolkit label: identifiant de groupe d’œuvres @fr
toolkit definition: Nomen qui est une appellation d’œuvre consistant en un code, un nombre ou une autre chaîne, généralement indépendante du langage naturel et des conventions sociales de dénomination, utilisée pour identifier un groupe d’œuvres. @fr
label: darbu grupas identifikators @lv
definition: Sasaista darbu ar nomenu, kas ir darba apzīmējums, kas sastāv no koda, skaitļa vai citas virknes, kas parasti ir neatkarīgs no dabiskas valodas vai sabiedrībā pieņemtām nosaukšanas tradīcijām, ko izmanto, lai identificētu darbu grupu. @lv
toolkit label: darbu grupas identifikators @lv
toolkit definition: Darba apzīmējums, kas sastāv no koda, skaitļa vai citas virknes, kas parasti ir neatkarīgs no dabiskas valodas vai sabiedrībā pieņemtām nosaukšanas tradīcijām, ko izmanto, lai identificētu darbu grupu. @lv
sub property of: has identifier for work
label: 有作品群的标识符 @zh-hans
definition: 将一种作品与作为一个由代码、数字、或其他串构成的称谓、通常独立于自然语言和社会命名惯例、用以标识一种作品群的一个命名关联起来。 @zh-hans
toolkit label: 作品群的标识符 @zh-hans
toolkit definition: 作为一个由代码、数字、或其他串构成的称谓、通常独立于自然语言和社会命名惯例、用以标识一种作品群的一个命名 @zh-hans
has subproperty: P10400
label: eser grubunun tanımlayıcısı ile ilişkilidir @tr
definition: Bir eseri, bir eser grubu tanımlamak için kullanılan, genellikle doğal dil ve sosyal adlandırma kurallarından bağımsız olarak bir kod, sayı veya başka bir dizeden oluşan bir eser unvan olanı bir isimle ilişkilendirir. @tr
toolkit label: eser grubunun tanımlayıcısı ile ilişkilidir @tr
toolkit definition: Bir eser grubunu tanımlamak için kullanılan, genellikle doğal dilden ve sosyal adlandırma kurallarından bağımsız olarak, bir kod, sayı veya başka bir dizeden oluşan bir eserin unvanı olan bir isim. @tr

has index work (Deprecated)
definition: Relates a work to a work that provides a systematic, alphabetical guide to the contents of another work. (Deprecated)
type: Property
domain: C10001
sub property of: is augmented by work
lexical alias: indexWork.en
toolkit label: index work (Deprecated)
toolkit definition: A work that provides a systematic, alphabetical guide to the contents of another work. (Deprecated)
toolkit label: index (œuvre) @fr
toolkit definition: Œuvre qui fournit un guide méthodique et alphabétique du contenu d’une autre œuvre. @fr
toolkit label: índice (obra) @es
toolkit definition: Una obra que proporciona una guía alfabética, sistemática, al contenido de la obra principal, generalmente indicando los números de página u otros códigos de referencia @es
instruction number: 24.5
label: har indeksværk @da
definition: Relaterer et værk til et værk, som giver en systematisk, alfabetiseret oversigt over indholdet i et fremtrædende værk, normalt kædet sammen med sidenumre eller andre henvisningskoder. @da
toolkit label: indeksværk @da
toolkit definition: Værk, som giver en systematisk, alfabetiseret oversigt over indholdet i et fremtrædende værk, normalt kædet sammen med sidenumre eller andre henvisningskoder. @da
definition: Met une œuvre en relation avec une œuvre qui fournit un guide méthodique et alphabétique du contenu d’une autre œuvre. @fr
label: là chỉ mục (tác phẩm) @vi
definition: Liên kết tác phẩm với tác phẩm cung cấp chỉ dẫn theo hệ thống, chữ cái về nội dung của tác phẩm nổi trội, thường dẫn tới số trang hoặc mã tham chiếu khác. @vi
toolkit label: chỉ mục (tác phẩm) @vi
toolkit definition: Tác phẩm cung cấp chỉ dẫn theo hệ thống, chữ cái về nội dung của tác phẩm nổi trội, thường dẫn tới số trang hoặc mã tham chiếu khác. @vi
label: hat Index (Werk) @de
definition: Setzt ein Werk in Beziehung zu einem Werk, das eine systematische, alphabetische Orientierungshilfe zum Inhalte eines anderen Werks bietet. @de
toolkit label: Index (Werk) @de
toolkit definition: Ein Werk, das eine systematische, alphabetische Orientierungshilfe zum Inhalte eines anderen Werks bietet. @de
label: a pour index (œuvre) @fr
definition: Liittää teoksen teokseen, joka on systemaattinen, aakkosellinen opas toisen teoksen sisällöstä. @fi
toolkit label: hakemisto (teos) @fi
toolkit definition: Teos, joka on systemaattinen, aakkosellinen opas toisen teoksen sisällöstä. @fi
toolkit label: indeks (verk) @no
toolkit definition: Et verk som gir en systematisk, alfabetisk veiledning til innholdet i et mer fremtredende verk, som regel med henvisninger til sidenumre eller andre referansekoder. @no
label: té com a obra d’índex @ca
definition: Relaciona una obra amb una obra que proporciona una guia sistemàtica o alfabètica als continguts d’una altra obra. @ca
toolkit label: obra d’índex @ca
toolkit definition: Obra que proporciona una guia sistemàtica o alfabètica als continguts d’una altra obra. @ca
has element type: 2
label: είναι ευρετήριο (έργο) @el
definition: Συνδέει ένα έργο με ένα έργο το οποίο παρέχει έναν συστηματικό, αλφαβητικό οδηγό στα περιεχόμενα του κύριου έργου, που συνήθως πληκτρολογείται στη σελιδαρίθμηση ή σε άλλους κώδικες αναφοράς. @el
toolkit label: ευρετήριο (έργο) @el
toolkit definition: Ένα έργο το οποίο παρέχει έναν συστηματικό, αλφαβητικό οδηγό στα περιεχόμενα του κύριου έργου, που συνήθως πληκτρολογείται στη σελιδαρίθμηση ή σε άλλους κώδικες αναφοράς. @el
label: indexműve a következő: @hu
definition: Hozzákapcsol egy művet egy műhöz, amely egy szisztematikus és betűrendes kalauz egy másik mű tartalmához. @hu
toolkit label: indexmű @hu
toolkit definition: Egy mű, amely egy szisztematikus és betűrendes kalauz egy másik mű tartalmához. @hu
label: hakemisto (teos) @fi
label: har indeks (verk) @no
definition: Relaterer et verk til et verk som gir en systematisk, alfabetisk veiledning til innholdet i et mer fremtredende verk, som regel med henvisninger til sidenumre eller andre referansekoder. @no
label: heeft indexwerk @nl
definition: Relateert een werk aan een werk dat een systematische, alfabetische gids biedt bij de inhoud van een ander werk. @nl
toolkit label: indexwerk @nl
toolkit definition: Een werk dat een systematische, alfabetische gids biedt bij de inhoud van een ander werk. @nl
label: له عمل كشاف @ar
definition: يربط عمل بعمل يوفر دليلًا منهجيًا هجائيًا لمحتويات عمل آخر. @ar
toolkit label: عمل كشاف @ar
toolkit definition: عمل يوفر دليلًا منهجيًا هجائيًا لمحتويات عمل آخر. @ar
label: register (teos) @et
definition: Seostab teose teosega, mis on süstemaatiline ja tähestikuline aineloend dominantse teose sisu kohta. Registris kasutatakse viitamiseks tavaliselt leheküljenumbreid või muid tähiseid. @et
toolkit label: register (teos) @et
toolkit definition: Teos, mis on süstemaatiline ja tähestikuline aineloend dominantse teose sisu kohta. Registris kasutatakse viitamiseks tavaliselt leheküljenumbreid või muid tähiseid. @et
label: ha come indice opera @it
definition: Correla un’opera s un’opera che fornisce una guida sistematica e in ordine alfabetico ai contenuti di un’opera predominante, che solitamente rinvia a numeri di pagina o ad altri codici di riferimento. @it
toolkit label: indice opera @it
toolkit definition: Opera che fornisce una guida sistematica e in ordine alfabetico ai contenuti di un’opera predominante, che solitamente rinvia a numeri di pagina o ad altri codici di riferimento. @it
status: Deprecated
label: darbs: rādītājs @lv
definition: Sasaista darbu ar darbu, kas ir sistemātisks vai alfabētisks palīglīdzeklis pamatdarba saturam, parasti norādot uz lappušu numuriem vai citiem atsauču kodiem. @lv
toolkit label: darbs: rādītājs @lv
toolkit definition: Darbs, kas ir sistemātisks vai alfabētisks palīglīdzeklis pamatdarba saturam, parasti norādot uz lappušu numuriem vai citiem atsauču kodiem. @lv
has subproperty: P10158

is inspiration for
status: Published
type: Property
lexical alias: inspirationFor.en
definition: Relates a work to a work that is inspired by a related work.
domain: C10001
toolkit label: inspiration for
toolkit definition: A work that is inspired by a related work.
sub property of: has related work of work
toolkit label: inspiración para @es
toolkit definition: Una obra que se inspira en otra obra. @es
instruction number: 24.5
label: er inspiration til @da
definition: Relaterer et værk til et værk, som er inspireret af et relateret værk. @da
toolkit label: inspiration til @da
toolkit definition: Værk, som er inspireret af et relateret værk. @da
label: truyền cảm hứng bởi cho @vi
definition: Liên kết tác phẩm với tác phẩm được truyền cảm hứng bởi tác phẩm khác. @vi
toolkit label: truyền cảm hứng bởi cho @vi
toolkit definition: Tác phẩm được truyền cảm hứng bởi tác phẩm khác. @vi
label: ist Anregung für @de
definition: Setzt ein Werk in Beziehung zu einem Werk, das von einem in Beziehung stehenden Werk angeregt ist. @de
toolkit label: Anregung für @de
toolkit definition: Ein Werk, das von einem in Beziehung stehenden Werk angeregt ist. @de
definition: Liittää teoksen teokseen, jota siihen liittyvä teos on innoittanut. @fi
toolkit label: innoitus teokselle @fi
toolkit definition: Teos, jota siihen liittyvä teos on innoittanut. @fi
toolkit label: inspirasjon for @no
toolkit definition: Et verk som er inspirasjon for et relatert verk. @no
label: és inspiració per a @ca
definition: Relaciona una obra amb una obra que s’inspira en una obra relacionada. @ca
toolkit label: inspiració per a @ca
toolkit definition: Obra que s’inspira en una obra relacionada. @ca
label: est une inspiration de @fr
definition: Met une œuvre en relation avec une œuvre qui est inspirée par une œuvre en relation. @fr
toolkit label: inspiration de @fr
toolkit definition: Œuvre qui est inspirée par une œuvre en relation. @fr
has element type: 2
label: είναι έμπνευση για @el
definition: Συνδέει ένα έργο με ένα έργο το οποίο εμπνεύστηκε από ένα άλλο έργο. @el
toolkit label: έμπνευση για @el
toolkit definition: Ένα έργο το οποίο εμπνεύστηκε από ένα άλλο έργο. @el
label: inspirációja a következőnek: @hu
definition: Hozzákapcsol egy művet egy műhöz, amelyet egy kapcsolódó mű inspirált. @hu
toolkit label: inspirációja: @hu
toolkit definition: Egy mű, amelyet egy kapcsolódó mű inspirált. @hu
label: innoitus teokselle @fi
label: er inspirasjon for @no
definition: Relaterer et verk til et verk som er inspirasjon for et relatert verk. @no
label: is inspiratie voor @nl
definition: Relateert een werk aan een werk dat geïnspireerd is door een gerelateerd werk. @nl
toolkit label: inspiratie voor @nl
toolkit definition: Een werk dat geïnspireerd is door een gerelateerd werk. @nl
label: هو مصدر إلهام لـ @ar
definition: يربط عمل بعمل مستوحى من عمل ذي صلة. @ar
toolkit label: مصدر إلهام لـ @ar
toolkit definition: عمل مستوحى من عمل ذي صلة. @ar
label: inspireerinud teost @et
definition: Seostab teose teosega, mille loomist on inspireerinud seotud teos. @et
toolkit label: inspireerinud teost @et
toolkit definition: Teos, mille loomist on inspireerinud seotud teos. @et
label: è ispirazione per @it
definition: Correla un’opera a un’opera che è ispirata da un’opera correlata. @it
toolkit label: ispirazione per @it
toolkit definition: Opera che è ispirata da un’opera correlata. @it
label: ir iedvesmojis @lv
definition: Sasaista darbu ar darbu, kuru iedvesmojis cits darbs. @lv
toolkit label: ir iedvesmojis @lv
toolkit definition: Darbs, kuru iedvesmojis cits darbs. @lv
label: 是对……的启发 @zh-hans
definition: 将一种作品与受一种相关作品启发的一种作品关联起来。 @zh-hans
toolkit label: 对……的启发 @zh-hans
toolkit definition: 受一种相关作品启发的一种作品 @zh-hans
has subproperty: has subseries
has subproperty: has issue
has subproperty: P10291
label: için ilham kaynağıdır @tr
definition: Bir eseri, benzer bir eserden ilham alan bir eserle ilişkilendirir. @tr
toolkit label: ilham kaynağıdır @tr
toolkit definition: İlgili bir eserden esinlenerek oluşturulan bir eser. @tr

is inspired by
status: Published
type: Property
lexical alias: inspiredBy.en
definition: Relates a work to a work that serves as the inspiration for a related work.
domain: C10001
toolkit label: inspired by
toolkit definition: A work that serves as the inspiration for a related work.
sub property of: has related work of work
toolkit label: inspirado por @es
toolkit definition: Una obra que sirve de inspiración para otra obra. @es
instruction number: 24.5
label: er inspireret af @da
definition: Relaterer et værk til et værk, som tjener som inspiration for et relateret værk. @da
toolkit label: inspireret af @da
toolkit definition: Værk, som tjener som inspiration for et relateret værk. @da
label: được truyền cảm hứng bởi @vi
definition: Liên kết tác phẩm với tác phẩm phục vụ như là nguồn cảm hứng cho tác phẩm khác. @vi
toolkit label: được truyền cảm hứng bởi @vi
toolkit definition: Tác phẩm phục vụ như là nguồn cảm hứng cho tác phẩm khác. @vi
label: ist angeregt durch @de
definition: Setzt ein Werk in Beziehung zu einem Werk, das als Anregung für ein in Beziehung stehendes Werk dient. @de
toolkit label: Angeregt durch @de
toolkit definition: Ein Werk, das als Anregung für ein in Beziehung stehendes Werk dient. @de
definition: Liittää teoksen teokseen, joka toimii innoituksena siihen liittyvälle teokselle. @fi
toolkit label: innoittaja @fi
toolkit definition: Teos, joka toimii innoituksena siihen liittyvälle teokselle. @fi
toolkit label: inspirert av @no
toolkit definition: Et verk som har inspirert et relatert verk. @no
label: és inspirat per @ca
definition: Relaciona una obra amb una obra que serveix d’inspiració d’una obra relacionada. @ca
toolkit label: inspirat per @ca
toolkit definition: Obra que serveix d’inspiració d’una obra relacionada. @ca
label: est inspiré de @fr
definition: Met une œuvre en relation avec une œuvre qui sert d’inspiration à une œuvre en relation. @fr
toolkit label: inspiré de @fr
toolkit definition: Œuvre qui sert d’inspiration à une œuvre en relation. @fr
has element type: 2
label: είναι εμπνευσμένο από @el
definition: Συνδέει ένα έργο με ένα έργο το οποίο λειτουργεί ως έμπνευση για ένα άλλο έργο. @el
toolkit label: εμπνευσμένο από @el
toolkit definition: Ένα έργο το οποίο λειτουργεί ως έμπνευση για ένα άλλο έργο. @el
label: inspirálta a következő: @hu
definition: Hozzákapcsol egy művet egy műhöz, amely egy kapcsolódó mű inspirációjaként szolgál. @hu
toolkit label: inspirálta a következő: @hu
toolkit definition: Egy mű, amely egy kapcsolódó mű inspirációjaként szolgál. @hu
label: innoittaja @fi
label: er inspirert av @no
definition: Relaterer et verk til et verk som har inspirert et relatert verk. @no
label: is geïnspireerd door @nl
definition: Relateert een werk aan een werk dat als inspiratie dient voor een gerelateerd werk. @nl
toolkit label: geïnspireerd door @nl
toolkit definition: Een werk dat als inspiratie dient voor een gerelateerd werk. @nl
label: هو مستوحى من @ar
definition: يربط عمل بعمل يمثل مصدر إلهام لعمل ذي صلة. @ar
toolkit label: مستوحى من @ar
toolkit definition: عمل يمثل مصدر إلهام لعمل ذي صلة. @ar
label: inspireeritud teosest @et
definition: Seostab teose teosega, mis on inspireerinud seotud teose loomist. @et
toolkit label: inspireeritud teosest @et
toolkit definition: Teos, mis on inspireerinud seotud teose loomist. @et
label: è ispirata da @it
definition: Correla un’opera a un’opera che serve da ispirazione per un’opera correlata. @it
toolkit label: ispirata da @it
toolkit definition: Opera che serve da ispirazione per un’opera correlata. @it
label: ir iedvesmots no @lv
definition: Sasaista darbu ar darbu, kurš iedvesmojis citu darbu. @lv
toolkit label: iedvesmots no @lv
toolkit definition: Darbs, kurš iedvesmojis citu darbu. @lv
label: 受……启发 @zh-hans
definition: 将一种作品与作为一种相关作品的启发的一种作品关联起来。 @zh-hans
toolkit label: 受……启发 @zh-hans
toolkit definition: 作为一种相关作品的启发的一种作品 @zh-hans
has subproperty: is subseries of
has subproperty: is issue of
has subproperty: P10290
label: esinlenmiştir @tr
definition: Bir eseri, benzer bir eser için ilham kaynağı olan eserle ilişkilendirir. @tr
toolkit label: ilham almıştır @tr
toolkit definition: İlgili bir esere ilham kaynağı olan bir eser @tr

has interviewee agent of work
status: Published
definition: Relates a work to an agent who is responsible for creating a work by responding to an interviewer, usually a reporter, pollster, or some other kind of agent who gathers information.
type: Property
domain: C10001
sub property of: has creator agent of work
lexical alias: intervieweeAgentOfWork.en
toolkit label: interviewee agent of work
toolkit definition: An agent who is responsible for creating a work by responding to an interviewer, usually a reporter, pollster, or some other kind of agent who gathers information.
toolkit label: agent interviewé d’une œuvre @fr
toolkit definition: Agent qui est responsable de la création d’une œuvre en répondant à un intervieweur, habituellement un reporteur, un sondeur ou un autre agent qui recueille de l’information. @fr
toolkit label: entrevistado @es
toolkit definition: Una persona, familia o entidad corporativa responsable de la creación de una obra mediante respuestas a un entrevistador, generalmente un reportero, encuestador u otro agente recolector de información. @es
instruction number: 18.5
label: har agent, som er interviewperson for værk @da
definition: Relaterer et værk til en agent, som er ansvarlig for at skabe et værk ved at besvare spørgsmål fra en interviewer, normalt en journalist, meningsmåler eller en anden form for agent, som indsamler information. @da
toolkit label: agent, som er interviewperson for værk @da
toolkit definition: Agent, som er ansvarlig for at skabe et værk ved at besvare spørgsmål fra en interviewer, normalt en journalist, meningsmåler eller en anden form for agent, som indsamler information. @da
definition: Met une œuvre en relation avec un agent qui est responsable de la création d’une œuvre en répondant à un intervieweur, habituellement un reporteur, un sondeur ou un autre agent qui recueille de l’information. @fr
label: có người được phỏng vấn @vi
definition: Liên kết tác phẩm với tác nhân có trách nhiệm tạo lập tác phẩm bằng cách trả lời người phỏng vấn, thường là người báo cáo, người thăm dò ý kiến, hoặc hoặc tác nhân thu thập thông tin khác. @vi
toolkit label: người được phỏng vấn @vi
toolkit definition: Tác nhân có trách nhiệm tạo lập tác phẩm bằng cách trả lời người phỏng vấn, thường là người báo cáo, người thăm dò ý kiến, hoặc hoặc tác nhân thu thập thông tin khác. @vi
label: hat Interviewte/Interviewten eines Werks (Akteur) @de
definition: Setzt ein Werk in Beziehung zu einem Akteur, der für die Schaffung eines Werks verantwortlich ist, indem er einer Interviewerin/einem Interviewer antwortet. Dabei handelt es sich normalerweise um eine Reporterin/einen Reporter, eine Meinungsforscherin/einen Meinungsforscher oder eine andere Akteurin/einen anderen Akteur, die/der Informationen zusammenträgt. @de
toolkit label: Interviewte/Interviewter eines Werks (Akteur) @de
toolkit definition: Ein Akteur, der für die Schaffung eines Werks verantwortlich ist, indem er einer Interviewerin/einem Interviewer antwortet. Dabei handelt es sich normalerweise um eine Reporterin/einen Reporter, eine Meinungsforscherin/einen Meinungsforscher oder eine andere Akteurin/einen anderen Akteur, die/der Informationen zusammenträgt. @de
label: a pour agent interviewé d’une œuvre @fr
definition: Liittää teoksen toimijaan, joka on vastuussa teoksen luomisesta vastaamalla haastattelijalle, tavallisesti toimittajalle, mielipidetutkijalle tai jonkinlaiselle muulle toimijalle, joka kerää tietoja. @fi
toolkit label: teoksen haastateltava (toimija) @fi
toolkit definition: Toimija, joka on vastuussa teoksen luomisesta vastaamalla haastattelijalle, tavallisesti toimittajalle, mielipidetutkijalle tai jonkinlaiselle muulle toimijalle, joka kerää tietoja. @fi
toolkit label: intervjuobjekt for verk (agent) @no
toolkit definition: En agent som er ansvarlig for å skape et verk ved å svare på spørsmål fra en intervjuer, reporter eller annen agent som samler inn informasjon. @no
label: té com a agent entrevistat d’una obra @ca
definition: Relaciona una obra amb un agent que és responsable de la creació d’una obra responent a un entrevistador, habitualment un periodista, un enquestador o qualsevol altre tipus d’agent que recull la informació. @ca
toolkit label: agent entrevistat d’una obra @ca
toolkit definition: Agent que és responsable de la creació d’una obra responent a un entrevistador, habitualment un periodista, un enquestador o qualsevol altre tipus d’agent que recull la informació. @ca
has element type: 2
label: έχει συνεντευξιαζόμενο @el
definition: Συνδέει ένα έργο με έναν φορέα υπεύθυνο για τη δημιουργία ενός έργου αποκρινόμενο στον συνεντευκτή, συνήθως δημοσιογράφο, δημοσκόπο ή κάποιον άλλον φορέα συλλογής πληροφοριών. @el
toolkit label: συνεντευξιαζόμενος @el
toolkit definition: Ένας φορέας υπεύθυνος για τη δημιουργία ενός έργου αποκρινόμενος στον συνεντευκτή, συνήθως δημοσιογράφο, δημοσκόπο ή κάποιον άλλον φορέα συλλογής πληροφοριών. @el
label: mű interjúalany ágense a következő: @hu
definition: Hozzákapcsol egy művet egy ágenshez, amely felelős egy mű létrehozásáért oly módon, hogy válaszol egy interjúkészítőnek, általában riporternek, közvélemény-kutatónak, vagy valamilyen más információgyűjtő ágensnek. @hu
toolkit label: mű interjúalany ágense: @hu
toolkit definition: Egy ágens, amely felelős egy mű létrehozásáért oly módon, hogy válaszol egy interjúkészítőnek, általában riporternek, közvélemény-kutatónak, vagy valamilyen más információgyűjtő ágensnek. @hu
alternative label: interviewee
alternative label: teoksen haastateltava @fi
label: teoksen haastateltava (toimija) @fi
label: har intervjuobjekt for verk (agent) @no
definition: Relaterer et verk til en agent som er ansvarlig for å skape et verk ved å svare på spørsmål fra en intervjuer, reporter eller annen agent som samler inn informasjon. @no
alternative label: intervjuobjekt for verk @no
label: heeft geïnterviewde actor van werk @nl
definition: Relateert een werk aan een actor die verantwoordelijk is voor het creëren van een werk door het antwoorden op een interviewer, meestal een journalist, opiniepeiler of een andere soort actor die informatie verzamelt. @nl
toolkit label: geïnterviewde actor van werk @nl
toolkit definition: Een actor die verantwoordelijk is voor het creëren van een werk door het antwoorden op een interviewer, meestal een journalist, opiniepeiler of een andere soort actor die informatie verzamelt. @nl
label: له وكيل ضيف مقابلة لعمل @ar
definition: يربط بين عمل ووكيل مسئول عن إنشاء عمل من خلال الرد على محاور، عادة يكون مراسلا، أو مستطلع آراء، أو وكيل من نوع آخر يجمع معلومات. @ar
alternative label: ضيف مقابلة @ar
toolkit label: وكيل ضيف مقابلة لعمل @ar
toolkit definition: وكيل مسئول عن إنشاء عمل من خلال الرد على محاور، عادة يكون مراسلا، أو مستطلع آراء، أو وكيل من نوع آخر يجمع معلومات. @ar
alternative label: entrevistat @ca
alternative label: interviewede for værk @da
label: teose intervjueeritav (tegija) @et
definition: Seostab teose tegijaga, kes vastutab teose loomise eest, vastates intervjueerijale, reporterile, küsitlejale või muule infot koguvale tegijale. @et
alternative label: teose intervjueeritav @et
toolkit label: teose intervjueeritav (tegija) @et
toolkit definition: Tegija, kes vastutab teose loomise eest, vastates intervjueerijale, reporterile, küsitlejale või muule infot koguvale tegijale. @et
alternative label: interjúalany: @hu
label: ha come intervistato agente di opera @it
definition: Correla un'opera a un agente responsabile della creazione di un'opera tramite le risposte rilasciate a un intervistatore, solitamente un reporter, sondaggista o altro agente che raccoglie informazioni. @it
alternative label: intervistato di opera @it
toolkit label: intervistato agente di opera @it
toolkit definition: Agente responsabile della creazione di un'opera tramite le risposte rilasciate a un intervistatore, solitamente un reporter, sondaggista o altro agente che raccoglie informazioni. @it
alternative label: interviewé @fr
label: darbā intervēts (aģents) @lv
definition: Sasaista darbu ar aģentu, kas ir atbildīgs par darba radīšanu, atbildot uz intervētāja, parasti reportiera, aptaujas organizētāja vai kāda cita informācijas apkopotāja jautājumiem. @lv
toolkit label: darbā intervēts (aģents) @lv
toolkit definition: Aģents, kas ir atbildīgs par darba radīšanu, atbildot uz intervētāja, parasti reportiera, aptaujas organizētāja vai kāda cita informācijas apkopotāja jautājumiem. @lv
alternative label: Interviewter @de
toolkit label: 作品的受访者行为者 @zh-hans

has interviewee collective agent of work
status: Published
lexical alias: intervieweeCollectiveAgentOfWork.en
definition: Relates a work to a collective agent who is responsible for creating a work by responding to an interviewer, usually a reporter, pollster, or some other kind of agent who gathers information.
toolkit label: interviewee collective agent of work
toolkit definition: A collective agent who is responsible for creating a work by responding to an interviewer, usually a reporter, pollster, or some other kind of agent who gathers information.
type: Property
domain: C10001
has element type: 2
sub property of: has creator collective agent of work
sub property of: has interviewee agent of work
label: teoksen haastateltava (yhteistoimija) @fi
definition: Liittää teoksen yhteistoimijaan, joka on vastuussa teoksen luomisesta vastaamalla haastattelijalle, tavallisesti toimittajalle, mielipidetutkijalle tai jonkinlaiselle muulle toimijalle, joka kerää tietoja. @fi
toolkit label: teoksen haastateltava (yhteistoimija) @fi
toolkit definition: Yhteistoimija, joka on vastuussa teoksen luomisesta vastaamalla haastattelijalle, tavallisesti toimittajalle, mielipidetutkijalle tai jonkinlaiselle muulle toimijalle, joka kerää tietoja. @fi
label: har intervjuobjekt for verk (kollektiv agent) @no
definition: Relaterer et verk til en kollektiv agent som er ansvarlig for å skape et verk ved å svare på spørsmål fra en intervjuer, reporter eller annen agent som samler inn informasjon. @no
toolkit label: intervjuobjekt for verk (kollektiv agent) @no
toolkit definition: En kollektiv agent som er ansvarlig for å skape et verk ved å svare på spørsmål fra en intervjuer, reporter eller annen agent som samler inn informasjon. @no
label: heeft geïnterviewde collectieve actor van werk @nl
definition: Relateert een werk aan een collectieve actor die verantwoordelijk is voor het creëren van een werk door het antwoorden op een interviewer, meestal een journalist, opiniepeiler of een andere soort actor die informatie verzamelt. @nl
toolkit label: geïnterviewde collectieve actor van werk @nl
toolkit definition: Een collectieve actor die verantwoordelijk is voor het creëren van een werk door het antwoorden op een interviewer, meestal een journalist, opiniepeiler of een andere soort actor die informatie verzamelt. @nl
label: له وكيل جماعي مقابَل لعمل @ar
definition: يربط بين عمل ووكيل جماعي مسئول عن إنشاء عمل من خلال الرد على المحاور، وعادة ما يكون مراسلًا، أو مستطلع آراء، أو وكيلاً من نوع آخر يجمع معلومات. @ar
toolkit label: وكيل جماعي مقابَل لعمل @ar
toolkit definition: وكيل جماعي مسئول عن إنشاء عمل من خلال الرد على المحاور، وعادة ما يكون مراسلًا، أو مستطلع آراء، أو وكيلاً من نوع آخر يجمع معلومات. @ar
label: té com a agent col·lectiu entrevistat d’una obra @ca
definition: Relaciona una obra amb un agent col·lectiu que és responsable de la creació d’una obra responent a un entrevistador, normalment un periodista, enquestador o qualsevol altre tipus d’agent que recull informació. @ca
toolkit label: agent col·lectiu entrevistat d’una obra @ca
toolkit definition: Agent col·lectiu que és responsable de la creació d’una obra responent a un entrevistador, normalment un periodista, enquestador o qualsevol altre tipus d’agent que recull informació. @ca
label: har kollektiv agent, som er interviewperson for værk @da
definition: Relaterer et værk til en kollektiv agent, som er ansvarlig for at skabe et værk ved at besvare spørgsmål fra en interviewer, normalt en journalist, meningsmåler eller en anden form for agent, som indsamler information. @da
toolkit label: kollektiv agent, som er interviewperson for værk @da
toolkit definition: Kollektiv agent, som er ansvarlig for at skabe et værk ved at besvare spørgsmål fra en interviewer, normalt en journalist, meningsmåler eller en anden form for agent, som indsamler information. @da
label: teose intervjueeritav (kollektiiv) @et
definition: Seostab teose kollektiiviga, kes vastutab teose loomise eest, vastates intervjueerijale, reporterile, küsitlejale või muule infot koguvale tegijale. @et
toolkit label: teose intervjueeritav (kollektiiv) @et
toolkit definition: Kollektiiv, kes vastutab teose loomise eest, vastates intervjueerijale, reporterile, küsitlejale või muule infot koguvale tegijale. @et
label: hat Interviewte/Interviewten eines Werks (Gemeinschaftlicher Akteur) @de
definition: Setzt ein Werk in Beziehung zu einem gemeinschaftlichen Akteur, der für die Schaffung eines Werks verantwortlich ist, indem er einer Interviewerin/einem Interviewer antwortet. Dabei handelt es sich normalerweise um eine Reporterin/einen Reporter, eine Meinungsforscherin/einen Meinungsforscher oder eine andere Akteurin/einen anderen Akteur, die/der Informationen zusammenträgt. @de
toolkit label: Interviewte/Interviewter eines Werks (Gemeinschaftlicher Akteur) @de
toolkit definition: Ein gemeinschaftlicher Akteur, der für die Schaffung eines Werks verantwortlich ist, indem er einer Interviewerin/einem Interviewer antwortet. Dabei handelt es sich normalerweise um eine Reporterin/einen Reporter, eine Meinungsforscherin/einen Meinungsforscher oder eine andere Akteurin/einen anderen Akteur, die/der Informationen zusammenträgt. @de
label: mű interjúalany kollektív ágense a következő: @hu
definition: Hozzákapcsol egy művet egy kollektív ágenshez, amely felelős egy mű létrehozásáért oly módon, hogy válaszol egy interjúkészítőnek, általában riporternek, közvélemény-kutatónak, vagy valamilyen más információgyűjtő ágensnek. @hu
toolkit label: mű interjúalany kollektív ágense: @hu
toolkit definition: Egy kollektív ágens, amely felelős egy mű létrehozásáért oly módon, hogy válaszol egy interjúkészítőnek, általában riporternek, közvélemény-kutatónak, vagy valamilyen más információgyűjtő ágensnek. @hu
label: ha come intervistato agente collettivo di opera @it
definition: Correla un'opera all'agente collettivo responsabile della creazione di un'opera tramite le risposte rilasciate a un intervistatore, solitamente un reporter, sondaggista o altro genere di agente che raccoglie le informazioni. @it
toolkit label: intervistato agente collettivo di opera @it
toolkit definition: Agente collettivo responsabile della creazione di un'opera tramite le risposte rilasciate a un intervistatore, solitamente un reporter, sondaggista o altro genere di agente che raccoglie le informazioni. @it
label: a pour agent collectif interviewé d’une œuvre @fr
definition: Met une œuvre en relation avec un agent collectif qui est responsable de la création d’une œuvre en répondant à un intervieweur, habituellement un reporteur, un sondeur ou un autre agent recueillant de l’information. @fr
toolkit label: agent collectif interviewé d’une œuvre @fr
toolkit definition: Agent collectif qui est responsable de la création d’une œuvre en répondant à un intervieweur, habituellement un reporteur, un sondeur ou un autre agent recueillant de l’information. @fr
label: darbā intervēts (grupa) @lv
definition: Sasaista darbu ar grupu, kas ir atbildīga par darba radīšanu, atbildot uz intervētāja, parasti reportiera, aptaujas organizētāja vai kāda cita informācijas apkopotāja jautājumiem. @lv
toolkit label: darbā intervēts (grupa) @lv
toolkit definition: Grupa, kas ir atbildīga par darba radīšanu, atbildot uz intervētāja, parasti reportiera, aptaujas organizētāja vai kāda cita informācijas apkopotāja jautājumiem. @lv
label: 有作品的受访者集体行为者 @zh-hans
definition: 将一种作品与通过回答采访者（通常是记者、民意调查员或其他类型信息搜集行为者）而对一种作品的创建负责的一个集体行为者关联起来。 @zh-hans
toolkit label: 作品的受访者集体行为者 @zh-hans
toolkit definition: 通过回答采访者（通常是记者、民意调查员或其他类型信息搜集行为者）而对一种作品的创建负责的一个集体行为者 @zh-hans
has subproperty: has interviewee corporate body of work
has subproperty: has interviewee family of work
has subproperty: P10494
label: eserin görüşülen kolektif temsilcisi ile ilişkilidir @tr
definition: Bir eseri, genellikle bir muhabir, anketör veya bilgi toplayan başka bir tür temsilci olan bir görüşmeciye yanıt vererek bir eser oluşturmaktan sorumlu olan kolektif bir temsilci ile ilişkilendirir. @tr
toolkit label: eserin görüşülen kolektif temsilcisi ile ilişkilidir @tr
toolkit definition: Bir çalışma ile genellikle bir muhabir, anketör veya bilgi toplayan diğer türdeki temsilciler tarafından görüşme yapılan bir kolektif temsilciyi ilişkilendirir @tr

has interviewee corporate body of work
status: Published
lexical alias: intervieweeCorporateBodyOfWork.en
definition: Relates a work to a corporate body who is responsible for creating a work by responding to an interviewer, usually a reporter, pollster, or some other kind of agent who gathers information.
toolkit label: interviewee corporate body of work
toolkit definition: A corporate body who is responsible for creating a work by responding to an interviewer, usually a reporter, pollster, or some other kind of agent who gathers information.
type: Property
domain: C10001
has element type: 2
sub property of: has creator corporate body of work
sub property of: has interviewee collective agent of work
label: teoksen haastateltava (yhteisö) @fi
definition: Liittää teoksen yhteisöön, joka on vastuussa teoksen luomisesta vastaamalla haastattelijalle, tavallisesti toimittajalle, mielipidetutkijalle tai jonkinlaiselle muulle toimijalle, joka kerää tietoja. @fi
toolkit label: teoksen haastateltava (yhteisö) @fi
toolkit definition: Yhteisö, joka on vastuussa teoksen luomisesta vastaamalla haastattelijalle, tavallisesti toimittajalle, mielipidetutkijalle tai jonkinlaiselle muulle toimijalle, joka kerää tietoja. @fi
label: har intervjuobjekt (korporasjon) @no
definition: Relaterer et verk til en korporasjon som er ansvarlig for å skape et verk ved å svare på spørsmål fra en intervjuer, reporter eller annen agent som samler inn informasjon. @no
toolkit label: intervjuobjekt (korporasjon) @no
toolkit definition: En korporasjon som er ansvarlig for å skape et verk ved å svare på spørsmål fra en intervjuer, reporter eller annen agent som samler inn informasjon. @no
label: heeft geïnterviewde corporatie van werk @nl
definition: Relateert een werk aan een corporatie die verantwoordelijk is voor het creëren van een werk door het antwoorden op een interviewer, meestal een journalist, opiniepeiler of een andere soort actor die informatie verzamelt. @nl
toolkit label: geïnterviewde corporatie van werk @nl
toolkit definition: Een corporatie die verantwoordelijk is voor het creëren van een werk door het antwoorden op een interviewer, meestal een journalist, opiniepeiler of een andere soort actor die informatie verzamelt. @nl
label: له هيئة مقابَلة لعمل @ar
definition: يربط بين عمل وهيئة تكون مسئولة عن إنشاء عمل من خلال الرد على المحاور، وعادة ما يكون مراسلًا، أو مستطلع آراء، أو وكيل من نوع آخر يجمع معلومات. @ar
toolkit label: هيئة مقابَلة لعمل @ar
toolkit definition: هيئة تكون مسئولة عن إنشاء عمل من خلال الرد على المحاور، وعادة ما يكون مراسلًا، أو مستطلع آراء، أو وكيل من نوع آخر يجمع معلومات. @ar
label: té com a entitat corporativa entrevistada d’una obra @ca
definition: Relaciona una obra amb una entitat corporativa que és responsable de la creació d’una obra responent a un entrevistador, normalment un periodista, enquestador o qualsevol altre tipus d’agent que recull informació. @ca
toolkit label: entitat corporativa entrevistada d’una obra @ca
toolkit definition: Entitat corporativa que és responsable de la creació d’una obra responent a un entrevistador, normalment un periodista, enquestador o qualsevol altre tipus d’agent que recull informació. @ca
label: har korporation, som er interviewperson for værk @da
definition: Relaterer et værk til en korporation, som er ansvarlig for at skabe et værk ved at besvare spørgsmål fra en interviewer, normalt en journalist, meningsmåler eller en anden form for agent, som indsamler information. @da
toolkit label: korporation, som er interviewperson for værk @da
toolkit definition: Korporation, som er ansvarlig for at skabe et værk ved at besvare spørgsmål fra en interviewer, normalt en journalist, meningsmåler eller en anden form for agent, som indsamler information. @da
label: teose intervjueeritav (asutus) @et
definition: Seostab teose asutusega, kes vastutab teose loomise eest, vastates intervjueerijale, reporterile, küsitlejale või muule infot koguvale tegijale. @et
toolkit label: teose intervjueeritav (asutus) @et
toolkit definition: Asutus, kes vastutab teose loomise eest, vastates intervjueerijale, reporterile, küsitlejale või muule infot koguvale tegijale. @et
label: hat Interviewte/Interviewten (Körperschaft) @de
definition: Setzt ein Werk in Beziehung zu einer Körperschaft, die für die Schaffung eines Werks verantwortlich ist, indem sie einer Interviewerin/einem Interviewer antwortet. Dabei handelt es sich normalerweise um eine Reporterin/einen Reporter, eine Meinungsforscherin/einen Meinungsforscher oder eine andere Akteurin/einen anderen Akteur, die/der Informationen zusammenträgt. @de
toolkit label: Interviewte/Interviewter (Körperschaft) @de
toolkit definition: Eine Körperschaft, die für die Schaffung eines Werks verantwortlich ist, indem sie einer Interviewerin/einem Interviewer antwortet. Dabei handelt es sich normalerweise um eine Reporterin/einen Reporter, eine Meinungsforscherin/einen Meinungsforscher oder eine andere Akteurin/einen anderen Akteur, die/der Informationen zusammenträgt. @de
label: mű interjúalany testülete a következő: @hu
definition: Hozzákapcsol egy művet egy testülethez, amely felelős egy mű létrehozásáért oly módon, hogy válaszol egy interjúkészítőnek, általában riporternek, közvélemény-kutatónak, vagy valamilyen más információgyűjtő ágensnek. @hu
toolkit label: mű interjúalany testülete: @hu
toolkit definition: Egy testület, amely felelős egy mű létrehozásáért oly módon, hogy válaszol egy interjúkészítőnek, általában riporternek, közvélemény-kutatónak, vagy valamilyen más információgyűjtő ágensnek. @hu
label: ha come intervistato ente di opera @it
definition: Correla un'opera a un ente responsabile della creazione di un'opera tramite le risposte rilasciate a un intervistatore, solitamente un reporter, sondaggista o altro genere di agente che raccoglie le informazioni. @it
toolkit label: intervistato ente di opera @it
toolkit definition: Ente responsabile della creazione di un'opera tramite le risposte rilasciate a un intervistatore, solitamente un reporter, sondaggista o altro genere di agente che raccoglie le informazioni. @it
label: a pour collectivité interviewée d’une œuvre @fr
definition: Met une œuvre en relation avec une collectivité qui est responsable de la création d’une œuvre en répondant à un intervieweur, habituellement un reporteur, un sondeur ou un autre agent recueillant de l’information. @fr
toolkit label: collectivité interviewée d’une œuvre @fr
toolkit definition: Collectivité qui est responsable de la création d’une œuvre en répondant à un intervieweur, habituellement un reporteur, un sondeur ou un autre agent recueillant de l’information. @fr
label: darbā intervēts (institūcija) @lv
definition: Sasaista darbu ar institūciju, kas ir atbildīga par darba radīšanu, atbildot uz intervētāja, parasti reportiera, aptaujas organizētāja vai kāda cita informācijas apkopotāja jautājumiem. @lv
toolkit label: darbā intervēts (institūcija) @lv
toolkit definition: Institūcija, kas ir atbildīga par darba radīšanu, atbildot uz intervētāja, parasti reportiera, aptaujas organizētāja vai kāda cita informācijas apkopotāja jautājumiem. @lv
label: 有作品的受访者团体 @zh-hans
definition: 将一种作品与通过回答采访者（通常是记者、民意调查员或其他类型信息搜集行为者）而对一种作品的创建负责的一个团体关联起来。 @zh-hans
toolkit label: 作品的受访者团体 @zh-hans
toolkit definition: 通过回答采访者（通常是记者、民意调查员或其他类型信息搜集行为者）而对一种作品的创建负责的一个团体 @zh-hans
has subproperty: P10541
label: eserin görüşülen tüzel kişisi ile ilişkilidir @tr
definition: Bir eseri, bir görüşmeci, genellikle bir muhabir, anketör veya bilgi toplayan başka bir türde temsilciye yanıt vererek bir eser oluşturmaktan sorumlu olan tüzel kişi ile ilişkilendirir. @tr
toolkit label: eserin görüşülen tüzel kişisi ile ilişkilidir @tr
toolkit definition: Bir görüşmeciye, genellikle bir muhabire, anketöre veya bilgi toplayan başka bir tür temsilciye yanıt vererek bir çalışma yaratmaktan sorumlu olan bir tüzel kişi. @tr

has interviewee family of work
status: Published
lexical alias: intervieweeFamilyOfWork.en
definition: Relates a work to a family who is responsible for creating a work by responding to an interviewer, usually a reporter, pollster, or some other kind of agent who gathers information.
toolkit label: interviewee family of work
toolkit definition: A family who is responsible for creating a work by responding to an interviewer, usually a reporter, pollster, or some other kind of agent who gathers information.
type: Property
domain: C10001
has element type: 2
sub property of: has creator family of work
sub property of: has interviewee collective agent of work
label: teoksen haastateltava (suku) @fi
definition: Liittää teoksen sukuun, joka on vastuussa teoksen luomisesta vastaamalla haastattelijalle, tavallisesti toimittajalle, mielipidetutkijalle tai jonkinlaiselle muulle toimijalle, joka kerää tietoja. @fi
toolkit label: teoksen haastateltava (suku) @fi
toolkit definition: Suku, joka on vastuussa teoksen luomisesta vastaamalla haastattelijalle, tavallisesti toimittajalle, mielipidetutkijalle tai jonkinlaiselle muulle toimijalle, joka kerää tietoja. @fi
label: har intervjuobjekt (familie) @no
definition: Relaterer et verk til en familie som er ansvarlig for å skape et verk ved å svare på spørsmål fra en intervjuer, reporter eller annen agent som samler inn informasjon. @no
toolkit label: intervjuobjekt (familie) @no
toolkit definition: En familie som er ansvarlig for å skape et verk ved å svare på spørsmål fra en intervjuer, reporter eller annen agent som samler inn informasjon. @no
label: heeft geïnterviewde familie van werk @nl
definition: Relateert een werk aan een familie die verantwoordelijk is voor het creëren van een werk door het antwoorden op een interviewer, meestal een journalist, opiniepeiler of een andere soort actor die informatie verzamelt. @nl
toolkit label: geïnterviewde familie van werk @nl
toolkit definition: Een familie die verantwoordelijk is voor het creëren van een werk door het antwoorden op een interviewer, meestal een journalist, opiniepeiler of een andere soort actor die informatie verzamelt. @nl
label: له عائلة مقابلة لعمل @ar
definition: يربط بين عمل وعائلة تكون مسئولة عن إنشاء عمل من خلال الرد على المحاور، وعادة ما يكون مراسلًا، أو مستطلع آراء، أو وكيلاً من نوع آخر يجمع معلومات. @ar
toolkit label: عائلة مقابلة لعمل @ar
toolkit definition: عائلة تكون مسؤولة عن إنشاء عمل من خلال الرد على المحاور، وعادة ما يكون مراسلًا، أو مستطلع آراء، أو وكيلاً من نوع آخر يجمع معلومات. @ar
label: té com a família entrevistada d’una obra @ca
definition: Relaciona una obra amb una família que és responsable de la creació d’una obra responent a un entrevistador, normalment un periodista, enquestador o qualsevol altre tipus d’agent que recull informació. @ca
toolkit label: família entrevistada d’una obra @ca
toolkit definition: Família que és responsable de la creació d’una obra responent a un entrevistador, normalment un periodista, enquestador o qualsevol altre tipus d’agent que recull informació. @ca
label: har familie, som er interviewperson for værk @da
definition: Relaterer et værk til en familie, som er ansvarlig for at skabe et værk ved at besvare spørgsmål fra en interviewer, normalt en journalist, meningsmåler eller en anden form for agent, som indsamler information. @da
toolkit label: familie, som er interviewperson for værk @da
toolkit definition: Familie, som er ansvarlig for at skabe et værk ved at besvare spørgsmål fra en interviewer, normalt en journalist, meningsmåler eller en anden form for agent, som indsamler information. @da
label: teose intervjueeritav (perekond) @et
definition: Seostab teose perekonnaga, kes vastutab teose loomise eest, vastates intervjueerijale, reporterile, küsitlejale või muule infot koguvale tegijale. @et
toolkit label: teose intervjueeritav (perekond) @et
toolkit definition: Perekond, kes vastutab teose loomise eest, vastates intervjueerijale, reporterile, küsitlejale või muule infot koguvale tegijale. @et
label: hat Interviewte/Interviewten eines Werks (Familie) @de
definition: Setzt ein Werk in Beziehung zu einer Familie, die für die Schaffung eines Werks verantwortlich ist, indem sie einer Interviewerin/einem Interviewer antwortet. Dabei handelt es sich normalerweise um eine Reporterin/einen Reporter, eine Meinungsforscherin/einen Meinungsforscher oder eine andere Akteurin/einen anderen Akteur, die/der Informationen zusammenträgt. @de
toolkit label: Interviewte/Interviewter eines Werks (Familie) @de
toolkit definition: Eine Familie, die für die Schaffung eines Werks verantwortlich ist, indem sie einer Interviewerin/einem Interviewer antwortet. Dabei handelt es sich normalerweise um eine Reporterin/einen Reporter, eine Meinungsforscherin/einen Meinungsforscher oder eine andere Akteurin/einen anderen Akteur, die/der Informationen zusammenträgt. @de
label: mű interjúalany családja a következő: @hu
definition: Hozzákapcsol egy művet egy családhoz, amely felelős egy mű létrehozásáért oly módon, hogy válaszol egy interjúkészítőnek, általában riporternek, közvélemény-kutatónak, vagy valamilyen más információgyűjtő ágensnek. @hu
toolkit label: mű interjúalany családja: @hu
toolkit definition: Egy család, amely felelős egy mű létrehozásáért oly módon, hogy válaszol egy interjúkészítőnek, általában riporternek, közvélemény-kutatónak, vagy valamilyen más információgyűjtő ágensnek. @hu
label: ha come intervistato famiglia di opera @it
definition: Correla un'opera alla famiglia responsabile della creazione di un'opera tramite le risposte rilasciate a un intervistatore, solitamente un reporter, sondaggista o altro genere di agente che raccoglie le informazioni. @it
toolkit label: intervistato famiglia di opera @it
toolkit definition: Famiglia responsabile della creazione di un'opera tramite le risposte rilasciate a un intervistatore, solitamente un reporter, sondaggista o altro genere di agente che raccoglie le informazioni. @it
label: a pour famille interviewée d’une œuvre @fr
definition: Met une œuvre en relation avec une famille qui est responsable de la création d’une œuvre en répondant à un intervieweur, habituellement un reporteur, un sondeur ou un autre agent recueillant de l’information. @fr
toolkit label: famille interviewée d’une œuvre @fr
toolkit definition: Famille qui est responsable de la création d’une œuvre en répondant à un intervieweur, habituellement un reporteur, un sondeur ou un autre agent recueillant de l’information. @fr
label: darbā intervēts (dzimta/ģimene) @lv
definition: Sasaista darbu ar dzimtu/ģimeni, kas ir atbildīga par darba radīšanu, atbildot uz intervētāja, parasti reportiera, aptaujas organizētāja vai kāda cita informācijas apkopotāja jautājumiem. @lv
toolkit label: darbā intervēts (dzimta/ģimene) @lv
toolkit definition: Dzimta/ģimene, kas ir atbildīga par darba radīšanu, atbildot uz intervētāja, parasti reportiera, aptaujas organizētāja vai kāda cita informācijas apkopotāja jautājumiem. @lv
label: 有作品的受访者家族 @zh-hans
definition: 将一种作品与通过回答采访者（通常是记者、民意调查员或其他类型信息搜集行为者）而对一种作品的创建负责的一个家族关联起来。 @zh-hans
toolkit label: 作品的受访者家族 @zh-hans
toolkit definition: 通过回答采访者（通常是记者、民意调查员或其他类型信息搜集行为者）而对一种作品的创建负责的一个家族 @zh-hans
has subproperty: P10588
label: eserin görüşülen ailesi ile ilişkilidir @tr
definition: Bir eseri, bir görüşmeci, genellikle bir muhabir, anketör veya bilgi toplayan başka bir türde temsilciye yanıt vererek bir eser oluşturmaktan sorumlu olan bir aileyle ilişkilendirir. @tr
toolkit label: eserin görüşülen ailesi ile ilişkilidir @tr
toolkit definition: Bir görüşmeciye, genellikle bir muhabire, anketöre veya bilgi toplayan başka tür bir aracıya yanıt vererek bir eser oluşturmaktan sorumlu bir aile. @tr

has interviewee person of work
status: Published
lexical alias: intervieweePersonOfWork.en
definition: Relates a work to a person who is responsible for creating a work by responding to an interviewer, usually a reporter, pollster, or some other kind of agent who gathers information.
toolkit label: interviewee person of work
toolkit definition: A person who is responsible for creating a work by responding to an interviewer, usually a reporter, pollster, or some other kind of agent who gathers information.
type: Property
domain: C10001
has element type: 2
sub property of: has creator person of work
sub property of: has interviewee agent of work
label: teoksen haastateltava (henkilö) @fi
definition: Liittää teoksen henkilöön, joka on vastuussa teoksen luomisesta vastaamalla haastattelijalle, tavallisesti toimittajalle, mielipidetutkijalle tai jonkinlaiselle muulle toimijalle, joka kerää tietoja. @fi
toolkit label: teoksen haastateltava (henkilö) @fi
toolkit definition: Henkilö, joka on vastuussa teoksen luomisesta vastaamalla haastattelijalle, tavallisesti toimittajalle, mielipidetutkijalle tai jonkinlaiselle muulle toimijalle, joka kerää tietoja. @fi
label: har intervjuobjekt for verk (person) @no
definition: Relaterer et verk til en person som er ansvarlig for å skape et verk ved å svare på spørsmål fra en intervjuer, reporter eller annen agent som samler inn informasjon. @no
toolkit label: intervjuobjekt for verk (person) @no
toolkit definition: En person som er ansvarlig for å skape et verk ved å svare på spørsmål fra en intervjuer, reporter eller annen agent som samler inn informasjon. @no
label: heeft geïnterviewde persoon van werk @nl
definition: Relateert een werk aan een persoon die verantwoordelijk is voor het creëren van een werk door het antwoorden op een interviewer, meestal een journalist, opiniepeiler of een andere soort actor die informatie verzamelt. @nl
toolkit label: geïnterviewde persoon van werk @nl
toolkit definition: Een persoon die verantwoordelijk is voor het creëren van een werk door het antwoorden op een interviewer, meestal een journalist, opiniepeiler of een andere soort actor die informatie verzamelt. @nl
label: له شخص ضيف مقابلة لعمل @ar
definition: يربط بين عمل وشخص مسئول عن إنشاء عمل من خلال الرد على المحاور، وعادة ما يكون مراسلاً، أو مستطلع آراء، أو وكيل من نوع آخر يجمع معلومات. @ar
toolkit label: شخص ضيف مقابلة لعمل @ar
toolkit definition: شخص يكون مسئولاً عن إنشاء عمل من خلال الرد على المحاور، وعادة ما يكون مراسلًا، أو مستطلع آراء، أو وكيل من نوع آخر يجمع معلومات. @ar
label: té com a persona entrevistada d’una obra @ca
definition: Relaciona una obra amb una persona que és responsable de la creació d’una obra responent a un entrevistador, normalment un periodista, enquestador o qualsevol altre tipus d’agent que recull informació. @ca
toolkit label: persona entrevistada d’una obra @ca
toolkit definition: Persona que és responsable de la creació d’una obra responent a un entrevistador, normalment un periodista, enquestador o qualsevol altre tipus d’agent que recull informació. @ca
label: har person, som er interviewperson for værk @da
definition: Relaterer et værk til en person, som er ansvarlig for at skabe et værk ved at besvare spørgsmål fra en interviewer, normalt en journalist, meningsmåler eller en anden form for agent, som indsamler information. @da
toolkit label: person, som er interviewperson for værk @da
toolkit definition: Person, som er ansvarlig for at skabe et værk ved at besvare spørgsmål fra en interviewer, normalt en journalist, meningsmåler eller en anden form for agent, som indsamler information. @da
label: teose intervjueeritav (isik) @et
definition: Seostab teose isikuga, kes vastutab teose loomise eest, vastates intervjueerijale, reporterile, küsitlejale või muule infot koguvale tegijale. @et
toolkit label: teose intervjueeritav (isik) @et
toolkit definition: Isik, kes vastutab teose loomise eest, vastates intervjueerijale, reporterile, küsitlejale või muule infot koguvale tegijale. @et
label: hat Interviewte/Interviewten eines Werks (Person) @de
definition: Setzt ein Werk in Beziehung zu einer Person, die für die Schaffung eines Werks verantwortlich ist, indem sie einer Interviewerin/einem Interviewer antwortet. Dabei handelt es sich normalerweise um eine Reporterin/einen Reporter, eine Meinungsforscherin/einen Meinungsforscher oder eine andere Akteurin/einen anderen Akteur, die/der Informationen zusammenträgt. @de
toolkit label: Interviewte/Interviewter eines Werks (Person) @de
toolkit definition: Eine Person, die für die Schaffung eines Werks verantwortlich ist, indem sie einer Interviewerin/einem Interviewer antwortet. Dabei handelt es sich normalerweise um eine Reporterin/einen Reporter, eine Meinungsforscherin/einen Meinungsforscher oder eine andere Akteurin/einen anderen Akteur, die/der Informationen zusammenträgt. @de
label: mű interjúalany személye a következő: @hu
definition: Hozzákapcsol egy művet egy személyhez, aki felelős egy mű létrehozásáért oly módon, hogy válaszol egy interjúkészítőnek, általában riporternek, közvélemény-kutatónak, vagy valamilyen más információgyűjtő ágensnek. @hu
toolkit label: mű interjúalany személye: @hu
toolkit definition: Egy személy, aki felelős egy mű létrehozásáért oly módon, hogy válaszol egy interjúkészítőnek, általában riporternek, közvélemény-kutatónak, vagy valamilyen más információgyűjtő ágensnek. @hu
label: ha come intervistato persona di opera @it
definition: Correla un'opera alla persona responsabile della creazione di un'opera tramite le risposte date a un intervistatore, solitamente un reporter, sondaggista o altro genere di agente che raccoglie le informazioni. @it
toolkit label: intervistato persona di opera @it
toolkit definition: Persona responsabile della creazione di un'opera tramite le risposte date a un intervistatore, solitamente un reporter, sondaggista o altro genere di agente che raccoglie le informazioni. @it
label: a pour personne interviewée d’une œuvre @fr
definition: Met une œuvre en relation avec une personne qui est responsable de la création d’une œuvre en répondant à un intervieweur, habituellement un reporteur, un sondeur ou un autre agent recueillant de l’information. @fr
toolkit label: personne interviewée d’une œuvre @fr
toolkit definition: Personne qui est responsable de la création d’une œuvre en répondant à un intervieweur, habituellement un reporteur, un sondeur ou un autre agent recueillant de l’information. @fr
label: darbā intervēts (persona) @lv
definition: Sasaista darbu ar personu, kura ir atbildīga par darba radīšanu, atbildot uz intervētāja, parasti reportiera, aptaujas organizētāja vai kāda cita informācijas apkopotāja jautājumiem. @lv
toolkit label: darbā intervēts (persona) @lv
toolkit definition: Persona, kura ir atbildīga par darba radīšanu, atbildot uz intervētāja, parasti reportiera, aptaujas organizētāja vai kāda cita informācijas apkopotāja jautājumiem. @lv
label: 有作品的受访者个人 @zh-hans
definition: 将一种作品与通过回答采访者（通常是记者、民意调查员或其他类型信息搜集行为者）而对一种作品的创建负责的一个个人关联起来。 @zh-hans
toolkit label: 作品的受访者个人 @zh-hans
toolkit definition: 通过回答采访者（通常是记者、民意调查员或其他类型信息搜集行为者）而对一种作品的创建负责的一个个人 @zh-hans
has subproperty: P10447
label: eserin görüşülen kişisi ile ilişkilidir @tr
definition: Bir eseri, genellikle bir muhabir, anketör veya bilgi toplayan başka bir tür temsilci olan bir görüşmeciye yanıt vererek bir eser oluşturmaktan sorumlu olan bir kişiyle ilişkilendirir. @tr
toolkit label: eserin görüşülen kişisi ile ilişkilidir @tr
toolkit definition: Bir görüşmeciye, genellikle bir muhabire, anketöre veya bilgi toplayan başka tür bir temsilciye yanıt vererek bir eser yaratmaktan sorumlu olan kişi. @tr

has interviewer agent of work
status: Published
definition: Relates a work to an agent who is responsible for creating a work by acting as an interviewer, reporter, pollster, or some other kind of agent who gathers information.
type: Property
domain: C10001
sub property of: has creator agent of work
lexical alias: interviewerAgentOfWork.en
toolkit label: interviewer agent of work
toolkit definition: An agent who is responsible for creating a work by acting as an interviewer, reporter, pollster, or some other kind of agent who gathers information.
toolkit label: agent intervieweur d’une œuvre @fr
toolkit definition: Agent qui est responsable de la création d’une œuvre en agissant à titre d’intervieweur, de reporteur, de sondeur ou d’autre agent qui recueille de l’information. @fr
toolkit label: entrevistador @es
toolkit definition: Una persona, familia o entidad corporativa responsable de la creación de una obra actuando como un entrevistador, un reportero u otro agente recolector de información. @es
instruction number: 18.5
label: har agent, som er interviewer for værk @da
definition: Relaterer et værk til en agent, som er ansvarlig for at skabe et værk ved at optræde som interviewer, journalist, meningsmåler eller en anden form for agent, som indsamler information. @da
toolkit label: agent, som er interviewer for værk @da
toolkit definition: Agent, som er ansvarlig for at skabe et værk ved at optræde som interviewer, journalist, meningsmåler eller en anden form for agent, som indsamler information. @da
definition: Met une œuvre en relation avec un agent qui est responsable de la création d’une œuvre en agissant à titre d’intervieweur, de reporteur, de sondeur ou d’autre agent qui recueille de l’information. @fr
label: có người phỏng vấn @vi
definition: Liên kết tác phẩm với tác nhân có trách nhiệm tạo lập tác phẩm bằng cách hoạt động như là người phỏng vấn, người báo cáo, người thăm dò ý kiến, hoặc tác nhân thu thập thông tin khác. @vi
toolkit label: người phỏng vấn @vi
toolkit definition: Tác nhân có trách nhiệm tạo lập tác phẩm bằng cách hoạt động như là người phỏng vấn, người báo cáo, người thăm dò ý kiến, hoặc tác nhân thu thập thông tin khác. @vi
label: hat Interviewerin/Interviewer eines Werks (Akteur) @de
definition: Setzt ein Werk in Beziehung zu einem Akteur, der für die Schaffung eines Werks verantwortlich ist, indem er als Interviewerin/Interviewer, Reporterin/Reporter, Meinungsforscherin/Meinungsforscher oder anderer Akteur Informationen zusammenträgt. @de
toolkit label: Interviewerin/Interviewer eines Werks (Akteur) @de
toolkit definition: Ein Akteur, der für die Schaffung eines Werks verantwortlich ist, indem er als Interviewerin/Interviewer, Reporterin/Reporter, Meinungsforscherin/Meinungsforscher oder anderer Akteur Informationen zusammenträgt. @de
label: a pour agent intervieweur d’une œuvre @fr
definition: Liittää teoksen toimijaan, joka on vastuussa teoksen luomisesta toimimalla haastattelijana, toimittajana, mielipidetutkijana tai jonkinlaisena muuna toimijana, joka kerää tietoja. @fi
toolkit label: teoksen haastattelija (toimija) @fi
toolkit definition: Toimija, joka on vastuussa teoksen luomisesta toimimalla haastattelijana, toimittajana, mielipidetutkijana tai jonkinlaisena muuna toimijana, joka kerää tietoja. @fi
toolkit label: intervjuer for verk @no
toolkit definition: En agent som er ansvarlig for å skape et verk ved å fungere som intervjuer, reporter eller en annen agent som samler inn informasjon. @no
label: té com a agent entrevistador d’una obra @ca
definition: Relaciona una obra amb un agent que és responsable de la creació d’una obra actuant com un entrevistador, un periodista, un enquestador o qualsevol altre tipus d’agent que recull la informació. @ca
toolkit label: agent entrevistador d’una obra @ca
toolkit definition: Agent que és responsable de la creació d’una obra actuant com un entrevistador, un periodista, un enquestador o qualsevol altre tipus d’agent que recull la informació. @ca
has element type: 2
label: έχει συνεντευκτή @el
definition: Συνδέει ένα έργο με έναν φορέα υπεύθυνο για τη δημιουργία ενός έργου ενεργώντας ως συνεντευκτής, δημοσιογράφος, δημοσκόπος ή ως κάποιος άλλος φορέας συγκέντρωσης πληροφοριών. @el
toolkit label: συνεντευκτής @el
toolkit definition: Ένας φορέας υπεύθυνος για τη δημιουργία ενός έργου ενεργώντας ως συνεντευκτής, δημοσιογράφος, δημοσκόπος ή ως κάποιος άλλος φορέας συγκέντρωσης πληροφοριών. @el
label: mű interjúkészítő ágense a következő: @hu
definition: Hozzákapcsol egy művet egy ágenshez, amely felelős egy mű létrehozásáért oly módon, hogy interjúkészítőként, riporterként, közvélemény-kutatóként, vagy valamilyen más információgyűjtő ágensként cselekszik. @hu
toolkit label: mű interjúkészítő ágense: @hu
toolkit definition: Egy ágens, amely felelős egy mű létrehozásáért oly módon, hogy interjúkészítőként, riporterként, közvélemény-kutatóként, vagy valamilyen más információgyűjtő ágensként cselekszik. @hu
alternative label: interviewer
alternative label: teoksen haastattelija @fi
label: teoksen haastattelija (toimija) @fi
label: har intervjuer for verk @no
definition: Relaterer et verk til en agent som er ansvarlig for å skape et verk ved å fungere som intervjuer, reporter eller en annen agent som samler inn informasjon. @no
alternative label: intervjuer for verk @no
label: heeft interviewer-actor van werk @nl
definition: Relateert een werk aan een actor die verantwoordelijk is voor het creëren van een werk door het optreden als een interviewer, verslaggever, opiniepeiler of een andere soort actor die informatie verzamelt. @nl
toolkit label: interviewer-actor van werk @nl
toolkit definition: Een actor die verantwoordelijk is voor het creëren van een werk door het optreden als een interviewer, verslaggever, opiniepeiler of een andere soort actor die informatie verzamelt. @nl
label: له وكيل محاور لعمل @ar
definition: يربط بين عمل ووكيل مسئول عن إنشاء عمل من خلال قيامه بدور محاور، أو مراسل، أو مستطلع آراء، أو وكيل من نوع آخر يجمع معلومات. @ar
alternative label: محاور @ar
toolkit label: وكيل محاور عمل @ar
toolkit definition: وكيل مسئول عن إنشاء عمل من خلال قيامه بدور محاور، أو مراسل، أو مستطلع آراء، أو وكيل من نوع آخر يجمع معلومات. @ar
alternative label: entrevistador @ca
alternative label: interviewer for værk @da
label: teose intervjueerija (tegija) @et
definition: Seostab teose tegijaga, kes vastutab teose loomise eest, tegutsedes intervjueerija, reporteri, küsitleja või muu infot koguva tegijana. @et
alternative label: teose intervjueerija @et
toolkit label: teose intervjueerija (tegija) @et
toolkit definition: Tegija, kes vastutab teose loomise eest, tegutsedes intervjueerija, reporteri, küsitleja või muu infot koguva tegijana. @et
alternative label: interjúkészítő: @hu
label: ha come intervistatore agente di opera @it
definition: Correla un'opera a un agente responsabile di un'opera tramite la sua azione come intervistatore, reporter, sondaggista o altro agente che raccoglie informazioni. @it
alternative label: intervistatore di opera @it
toolkit label: intervistatore agente di opera @it
toolkit definition: Agente responsabile di un'opera tramite la sua azione come intervistatore, reporter, sondaggista o altro agente che raccoglie di informazioni. @it
alternative label: intervieweur @fr
label: darbā intervējis (aģents) @lv
definition: Sasaista darbu ar aģentu, kas ir atbildīgs par darba radīšanu, darbojoties kā intervētājs, reportieris, aptaujas organizētājs vai kāds cits informācijas apkopotājs. @lv
toolkit label: darbā intervējis (aģents) @lv
toolkit definition: Aģents, kas ir atbildīgs par darba radīšanu, darbojoties kā intervētājs, reportieris, aptaujas organizētājs vai kāds cits informācijas apkopotājs. @lv
alternative label: Interviewer @de
toolkit label: 作品的采访者行为者 @zh-hans

has interviewer collective agent of work
status: Published
lexical alias: interviewerCollectiveAgentOfWork.en
definition: Relates a work to a collective agent who is responsible for creating a work by acting as an interviewer, reporter, pollster, or some other kind of collective agent who gathers information.
toolkit label: interviewer collective agent of work
toolkit definition: A collective agent who is responsible for creating a work by acting as an interviewer, reporter, pollster, or some other kind of collective agent who gathers information.
type: Property
domain: C10001
has element type: 2
sub property of: has creator collective agent of work
sub property of: has interviewer agent of work
label: teoksen haastattelija (yhteistoimija) @fi
definition: Liittää teoksen yhteistoimijaan, joka on vastuussa teoksen luomisesta toimimalla haastattelijana, toimittajana, mielipidetutkijana tai jonkinlaisena muuna toimijana, joka kerää tietoja. @fi
toolkit label: teoksen haastattelija (yhteistoimija) @fi
toolkit definition: Yhteistoimija, joka on vastuussa teoksen luomisesta toimimalla haastattelijana, toimittajana, mielipidetutkijana tai jonkinlaisena muuna toimijana, joka kerää tietoja. @fi
label: har intervjuer for verk (kollektiv agent) @no
definition: Relaterer et verk til en kollektiv agent som er ansvarlig for å skape et verk ved å fungere som intervjuer, reporter eller en annen agent som samler inn informasjon. @no
toolkit label: intervjuer for verk (kollektiv agent) @no
toolkit definition: En kollektiv agent som er ansvarlig for å skape et verk ved å fungere som intervjuer, reporter eller en annen agent som samler inn informasjon. @no
label: heeft interviewer-collectieve actor van werk @nl
definition: Relateert een werk aan een collectieve actor die verantwoordelijk is voor het creëren van een werk door het optreden als een interviewer, verslaggever, opiniepeiler of een andere soort actor die informatie verzamelt. @nl
toolkit label: interviewer-collectieve actor van werk @nl
toolkit definition: Een collectieve actor die verantwoordelijk is voor het creëren van een werk door het optreden als een interviewer, verslaggever, opiniepeiler of een andere soort actor die informatie verzamelt. @nl
label: له وكيل جماعي محاور لعمل @ar
definition: يربط بين عمل ووكيل جماعي مسئول عن إنشاء عمل من خلال العمل كمحاور، أو مراسل، أو مستطلع آراء، أو كوكيل جماعي من نوع آخر يجمع معلومات. @ar
toolkit label: وكيل جماعي محاور لعمل @ar
toolkit definition: وكيل جماعي مسئول عن إنشاء عمل من خلال العمل كمحاور، أو مراسل، أو مستطلع آراء، أو كوكيل جماعي من نوع آخر يجمع معلومات. @ar
label: té com a agent col·lectiu entrevistador d’una obra @ca
definition: Relaciona una obra amb un agent col·lectiu que és responsable de la creació d’una obra actuant com un entrevistador, un periodista, un enquestador o qualsevol altre tipus d’agent col·lectiu que recull informació. @ca
toolkit label: agent col·lectiu entrevistador d’una obra @ca
toolkit definition: Agent col·lectiu que és responsable de la creació d’una obra actuant com un entrevistador, un periodista, un enquestador o qualsevol altre tipus d’agent col·lectiu que recull informació. @ca
label: har kollektiv agent, som er interviewer for værk @da
definition: Relaterer et værk til en kollektiv agent, som er ansvarlig for at skabe et værk ved at optræde som interviewer, journalist, meningsmåler eller en anden form for agent, som indsamler information. @da
toolkit label: kollektiv agent, som er interviewer for værk @da
toolkit definition: Kollektiv agent, som er ansvarlig for at skabe et værk ved at optræde som interviewer, journalist, meningsmåler eller en anden form for agent, som indsamler information. @da
label: teose intervjueerija (kollektiiv) @et
definition: Seostab teose kollektiiviga, kes vastutab teose loomise eest, tegutsedes intervjueerija, reporteri, küsitleja või muu infot koguva kollektiivina. @et
toolkit label: teose intervjueerija (kollektiiv) @et
toolkit definition: Kollektiiv, kes vastutab teose loomise eest, tegutsedes intervjueerija, reporteri, küsitleja või muu infot koguva kollektiivina. @et
label: hat Interviewerin/Interviewer eines Werks (Gemeinschaftlicher Akteur) @de
definition: Setzt ein Werk in Beziehung zu einem gemeinschaftlichen Akteur, der für die Schaffung eines Werks verantwortlich ist, indem er als Interviewerin/Interviewer, Reporterin/Reporter, Meinungsforscherin/Meinungsforscher oder anderer gemeinschaftlicher Akteur Informationen zusammenträgt. @de
toolkit label: Interviewerin/Interviewer eines Werks (Gemeinschaftlicher Akteur) @de
toolkit definition: Ein gemeinschaftlicher Akteur, der für die Schaffung eines Werks verantwortlich ist, indem er als Interviewerin/Interviewer, Reporterin/Reporter, Meinungsforscherin/Meinungsforscher oder anderer gemeinschaftlicher Akteur Informationen zusammenträgt. @de
label: mű interjúkészítő kollektív ágense a következő: @hu
definition: Hozzákapcsol egy művet egy kollektív ágenshez, amely felelős egy mű létrehozásáért oly módon, hogy interjúkészítőként, riporterként, közvélemény-kutatóként, vagy valamilyen más információgyűjtő kollektív ágensként cselekszik. @hu
toolkit label: mű interjúkészítő kollektív ágense: @hu
toolkit definition: Egy kollektív ágens, amely felelős egy mű létrehozásáért oly módon, hogy interjúkészítőként, riporterként, közvélemény-kutatóként, vagy valamilyen más információgyűjtő kollektív ágensként cselekszik. @hu
label: ha come intervistatore agente collettivo di opera @it
definition: Correla un'opera all'agente collettivo responsabile della creazione di un'opera che agisce come intervistatore, reporter, sondaggista o altro genere di persona che raccoglie informazioni. @it
toolkit label: intervistatore agente collettivo di opera @it
toolkit definition: Agente collettivo responsabile della creazione di un'opera che agisce come intervistatore, reporter, sondaggista o altro genere di persona che raccoglie informazioni. @it
label: a pour agent collectif intervieweur d’une œuvre @fr
definition: Met une œuvre en relation avec un agent collectif qui est responsable de la création d’une œuvre en agissant à titre d’intervieweur, de reporteur, de sondeur ou d’autre agent collectif recueillant de l’information. @fr
toolkit label: agent collectif intervieweur d’une œuvre @fr
toolkit definition: Agent collectif qui est responsable de la création d’une œuvre en agissant à titre d’intervieweur, de reporteur, de sondeur ou d’autre agent collectif recueillant de l’information. @fr
label: darbā intervējis (grupa) @lv
definition: Sasaista darbu ar grupu, kas ir atbildīga par darba radīšanu, darbojoties kā intervētājs, reportieris, aptaujas organizētājs vai kāds cits informācijas apkopotājs. @lv
toolkit label: darbā intervējis (grupa) @lv
toolkit definition: Grupa, kas ir atbildīga par darba radīšanu, darbojoties kā intervētājs, reportieris, aptaujas organizētājs vai kāds cits informācijas apkopotājs. @lv
label: 有作品的采访者集体行为者 @zh-hans
definition: 将一种作品与通过担当采访者、记者、民意调查员或其他类型信息搜集集体行为者而对一种作品的创建负责的一个集体行为者关联起来。 @zh-hans
toolkit label: 作品的采访者集体行为者 @zh-hans
toolkit definition: 通过担当采访者、记者、民意调查员或其他类型信息搜集集体行为者而对一种作品的创建负责的一个集体行为者 @zh-hans
has subproperty: has interviewer corporate body of work
has subproperty: has interviewer family of work
has subproperty: P10493
label: eserin görüşmeci kolektif temsilcisi ile ilişkilidir @tr
definition: Bir eseri, bir görüşmeci, muhabir, anketör veya bilgi toplayan başka bir tür kolektif bir temsilci olarak hareket ederek eser oluşturmaktan sorumlu olan kolektif bir temsilci ile ilişkilendirir. @tr
toolkit label: eserin görüşmeci kolektif temsilcisi ile ilişkilidir @tr
toolkit definition: Bir röportajcı, muhabir, anketör veya bilgi toplayan başka bir tür kolektif temsilci olarak bir eser yaratmaktan sorumlu olan bir kolektif temsilci. @tr

has interviewer corporate body of work
status: Published
lexical alias: interviewerCorporateBodyOfWork.en
definition: Relates a work to a corporate body who is responsible for creating a work by acting as an interviewer, reporter, pollster, or some other kind of corporate body who gathers information.
toolkit label: interviewer corporate body of work
toolkit definition: A corporate body who is responsible for creating a work by acting as an interviewer, reporter, pollster, or some other kind of corporate body who gathers information.
type: Property
domain: C10001
has element type: 2
sub property of: has creator corporate body of work
sub property of: has interviewer collective agent of work
label: teoksen haastattelija (yhteisö) @fi
definition: Liittää teoksen yhteisöön, joka on vastuussa teoksen luomisesta toimimalla haastattelijana, toimittajana, mielipidetutkijana tai jonkinlaisena muuna toimijana, joka kerää tietoja. @fi
toolkit label: teoksen haastattelija (yhteisö) @fi
toolkit definition: Yhteisö, joka on vastuussa teoksen luomisesta toimimalla haastattelijana, toimittajana, mielipidetutkijana tai jonkinlaisena muuna toimijana, joka kerää tietoja. @fi
label: har intervjuer (korporasjon) @no
definition: Relaterer et verk til en korporasjon som er ansvarlig for å skape et verk ved å fungere som intervjuer, reporter eller en annen agent som samler inn informasjon. @no
toolkit label: intervjuer (korporasjon) @no
toolkit definition: En korporasjon som er ansvarlig for å skape et verk ved å fungere som intervjuer, reporter eller en annen agent som samler inn informasjon. @no
label: heeft interviewer-corporatie van werk @nl
definition: Relateert een werk aan een corporatie die verantwoordelijk is voor het creëren van een werk door het optreden als een interviewer, verslaggever, opiniepeiler of een andere soort actor die informatie verzamelt. @nl
toolkit label: interviewer-corporatie van werk @nl
toolkit definition: Een corporatie die verantwoordelijk is voor het creëren van een werk door het optreden als een interviewer, verslaggever, opiniepeiler of een andere soort actor die informatie verzamelt. @nl
label: له هيئة محاورة لعمل @ar
definition: يربط بين عمل وهيئة مسئولة عن إنشاء عمل من خلال العمل كمحاور، أو مراسل، أو منظم استطلاعات الرأي، أو أي نوع آخر من الهيئات التي تجمع المعلومات. @ar
toolkit label: هيئة محاورة لعمل @ar
toolkit definition: هيئة مسئولة عن إنشاء عمل من خلال العمل كمحاور، أو مراسل، أو منظم استطلاعات الرأي، أو أي نوع آخر من الهيئات التي تجمع المعلومات. @ar
label: té com a entitat corporativa entrevistadora d’una obra @ca
definition: Relaciona una obra amb una entitat corporativa que és responsable de la creació d’una obra actuant com un entrevistador, un periodista, un enquestador o qualsevol altre tipus d’entitat corporativa que recull informació. @ca
toolkit label: entitat corporativa entrevistadora d’una obra @ca
toolkit definition: Entitat corporativa que és responsable de la creació d’una obra actuant com un entrevistador, un periodista, un enquestador o qualsevol altre tipus d’entitat corporativa que recull informació. @ca
label: har korporation, som er interviewer for værk @da
definition: Relaterer et værk til en korporation, som er ansvarlig for at skabe et værk ved at optræde som interviewer, journalist, meningsmåler eller en anden form for korporation, som indsamler information. @da
toolkit label: korporation, som er interviewer for værk @da
toolkit definition: Korporation, som er ansvarlig for at skabe et værk ved at optræde som interviewer, journalist, meningsmåler eller en anden form for korporation, som indsamler information. @da
label: teose intervjueerija (asutus) @et
definition: Seostab teose asutusega, kes vastutab teose loomise eest, tegutsedes intervjueerija, reporteri, küsitleja või muu infot koguva asutusena. @et
toolkit label: teose intervjueerija (asutus) @et
toolkit definition: Asutus, kes vastutab teose loomise eest, tegutsedes intervjueerija, reporteri, küsitleja või muu infot koguva asutusena. @et
label: hat Interviewerin/Interviewer eines Werks (Körperschaft) @de
definition: Setzt ein Werk in Beziehung zu einer Körperschaft, die für die Schaffung eines Werks verantwortlich ist, indem sie als Interviewerin/Interviewer, Reporterin/Reporter, Meinungsforscherin/Meinungsforscher oder andere Körperschaft Informationen zusammenträgt. @de
toolkit label: Interviewerin/Interviewer eines Werks (Körperschaft) @de
toolkit definition: Eine Körperschaft, die für die Schaffung eines Werks verantwortlich ist, indem sie als Interviewerin/Interviewer, Reporterin/Reporter, Meinungsforscherin/Meinungsforscher oder andere Körperschaft Informationen zusammenträgt. @de
label: mű interjúkészítő testülete a következő: @hu
definition: Hozzákapcsol egy művet egy testülethez, amely felelős egy mű létrehozásáért oly módon, hogy interjúkészítőként, riporterként, közvélemény-kutatóként, vagy valamilyen más információgyűjtő testületként cselekszik. @hu
toolkit label: mű interjúkészítő testülete: @hu
toolkit definition: Egy testület, amely felelős egy mű létrehozásáért oly módon, hogy interjúkészítőként, riporterként, közvélemény-kutatóként, vagy valamilyen más információgyűjtő testületként cselekszik. @hu
label: ha come intervistatore ente di opera @it
definition: Correla un'opera a un ente responsabile della creazione di un'opera che agisce come intervistatore, reporter, sondaggista o altro genere di ente che raccoglie informazioni. @it
toolkit label: intervistatore ente di opera @it
toolkit definition: Ente responsabile della creazione di un'opera che agisce come intervistatore, reporter, sondaggista o altro genere di ente che raccoglie informazioni. @it
label: a pour collectivité intervieweuse d’une œuvre @fr
definition: Met une œuvre en relation avec une collectivité qui est responsable de la création d’une œuvre en agissant à titre d’intervieweur, de reporteur, de sondeur ou d’autre collectivité recueillant de l’information. @fr
toolkit label: collectivité intervieweuse d’une œuvre @fr
toolkit definition: Collectivité qui est responsable de la création d’une œuvre en agissant à titre d’intervieweur, de reporteur, de sondeur ou d’autre collectivité recueillant de l’information. @fr
label: darbā intervējis (institūcija) @lv
definition: Sasaista darbu ar institūciju, kas ir atbildīga par darba radīšanu, darbojoties kā intervētājs, reportieris, aptaujas organizētājs vai kāds cits informācijas apkopotājs. @lv
toolkit label: darbā intervējis (institūcija) @lv
toolkit definition: Institūcija, kas ir atbildīga par darba radīšanu, darbojoties kā intervētājs, reportieris, aptaujas organizētājs vai kāds cits informācijas apkopotājs. @lv
label: 有作品的采访者团体 @zh-hans
definition: 将一种作品与通过担当采访者、记者、民意调查员或其他类型信息搜集行为者而对一种作品的创建负责的一个团体关联起来。 @zh-hans
toolkit label: 作品的采访者团体 @zh-hans
toolkit definition: 通过担当采访者、记者、民意调查员或其他类型信息搜集行为者而对一种作品的创建负责的一个团体 @zh-hans
has subproperty: P10540
label: eserin görüşmeci tüzel kişisi ile ilişkilidir @tr
definition: Bir eseri, bir görüşmeci, muhabir, anketör veya bilgi toplayan başka bir türde tüzel kişi olarak hareket ederek bir eser oluşturmaktan sorumlu olan tüzel kişi ile ilişkilendirir. @tr
toolkit label: eserin görüşmeci tüzel kişisi ile ilişkilidir @tr
toolkit definition: Bir görüşmeci, muhabir, anketör veya bilgi toplayan başka tür bir tüzel kişi olarak hareket ederek bir çalışma oluşturmaktan sorumlu bir tüzel kişi. @tr

has interviewer family of work
status: Published
lexical alias: interviewerFamilyOfWork.en
definition: Relates a work to a family who is responsible for creating a work by acting as an interviewer, reporter, pollster, or some other kind of family who gathers information.
toolkit label: interviewer family of work
toolkit definition: A family who is responsible for creating a work by acting as an interviewer, reporter, pollster, or some other kind of family who gathers information.
type: Property
domain: C10001
has element type: 2
sub property of: has creator family of work
sub property of: has interviewer collective agent of work
label: teoksen haastattelija (suku) @fi
definition: Liittää teoksen sukuun, joka on vastuussa teoksen luomisesta toimimalla haastattelijana, toimittajana, mielipidetutkijana tai jonkinlaisena muuna toimijana, joka kerää tietoja. @fi
toolkit label: teoksen haastattelija (suku) @fi
toolkit definition: Suku, joka on vastuussa teoksen luomisesta toimimalla haastattelijana, toimittajana, mielipidetutkijana tai jonkinlaisena muuna toimijana, joka kerää tietoja. @fi
label: har intervjuer (familie) @no
definition: Relaterer et verk til en familie som er ansvarlig for å skape et verk ved å fungere som intervjuer, reporter eller en annen agent som samler inn informasjon. @no
toolkit label: intervjuer (familie) @no
toolkit definition: En familie som er ansvarlig for å skape et verk ved å fungere som intervjuer, reporter eller en annen agent som samler inn informasjon. @no
label: heeft interviewer-familie van werk @nl
definition: Relateert een werk aan een familie die verantwoordelijk is voor het creëren van een werk door het optreden als een interviewer, verslaggever, opiniepeiler of een andere soort actor die informatie verzamelt. @nl
toolkit label: interviewer-familie van werk @nl
toolkit definition: Een familie die verantwoordelijk is voor het creëren van een werk door het optreden als een interviewer, verslaggever, opiniepeiler of een andere soort actor die informatie verzamelt. @nl
label: له عائلة محاورة لعمل @ar
definition: يربط بين عمل وعائلة مسئولة عن إنشاء عمل من خلال العمل كمحاور، أو مراسل، أو مستطلع آراء، أو عائلة من نوع آخر تجمع المعلومات. @ar
toolkit label: عائلة محاورة لعمل @ar
toolkit definition: عائلة مسئولة عن إنشاء عمل من خلال العمل كمحاور أو مراسل أو مستطلع آراء أو عائلة من نوع آخر تجمع المعلومات. @ar
label: té com a família entrevistadora d’una obra @ca
definition: Relaciona una obra amb una família que és responsable de la creació d’una obra actuant com un entrevistador, un periodista, un enquestador o qualsevol altre tipus de família que recull informació. @ca
toolkit label: família entrevistadora d’una obra @ca
toolkit definition: Família que és responsable de la creació d’una obra actuant com un entrevistador, un periodista, un enquestador o qualsevol altre tipus de família que recull informació. @ca
label: har familie, som er interviewer for værk @da
definition: Relaterer et værk til en familie, som er ansvarlig for at skabe et værk ved at optræde som interviewer, journalist, meningsmåler eller en anden form for korporation, som indsamler information. @da
toolkit label: familie, som er interviewer for værk @da
toolkit definition: Familie, som er ansvarlig for at skabe et værk ved at optræde som interviewer, journalist, meningsmåler eller en anden form for korporation, som indsamler information. @da
label: teose intervjueerija (perekond) @et
definition: Seostab teose perekonnaga, kes vastutab teose loomise eest, tegutsedes intervjueerija, reporteri, küsitleja või muu infot koguva perekonnana. @et
toolkit label: teose intervjueerija (perekond) @et
toolkit definition: Perekond, kes vastutab teose loomise eest, tegutsedes intervjueerija, reporteri, küsitleja või muu infot koguva perekonnana. @et
label: hat Interviewerin/Interviewer eines Werks (Familie) @de
definition: Setzt ein Werk in Beziehung zu einer Familie, die für die Schaffung eines Werks verantwortlich ist, indem sie als Interviewerin/Interviewer, Reporterin/Reporter, Meinungsforscherin/Meinungsforscher oder andere Familie Informationen zusammenträgt. @de
toolkit label: Interviewerin/Interviewer eines Werks (Familie) @de
toolkit definition: Eine Familie, die für die Schaffung eines Werks verantwortlich ist, indem sie als Interviewerin/Interviewer, Reporterin/Reporter, Meinungsforscherin/Meinungsforscher oder andere Familie Informationen zusammenträgt. @de
label: mű interjúkészítő családja a következő: @hu
definition: Hozzákapcsol egy művet egy családhoz, amely felelős egy mű létrehozásáért oly módon, hogy interjúkészítőként, riporterként, közvélemény-kutatóként, vagy valamilyen más információgyűjtő családként cselekszik. @hu
toolkit label: mű interjúkészítő családja: @hu
toolkit definition: Egy család, amely felelős egy mű létrehozásáért oly módon, hogy interjúkészítőként, riporterként, közvélemény-kutatóként, vagy valamilyen más információgyűjtő családként cselekszik. @hu
label: ha come intervistatore famiglia di opera @it
definition: Correla un'opera alla famiglia responsabile della creazione di un'opera che agisce come intervistatore, reporter, sondaggista o altro genere di persona che raccoglie informazioni. @it
toolkit label: intervistatore famiglia di opera @it
toolkit definition: Famiglia responsabile della creazione di un'opera che agisce come intervistatore, reporter, sondaggista o altro genere di persona che raccoglie informazioni. @it
label: a pour famille intervieweuse d’une œuvre @fr
definition: Met une œuvre en relation avec une famille qui est responsable de la création d’une œuvre en agissant à titre d’intervieweur, de reporteur, de sondeur ou d’autre famille recueillant de l’information. @fr
toolkit label: famille intervieweuse d’une œuvre @fr
toolkit definition: Famille qui est responsable de la création d’une œuvre en agissant à titre d’intervieweur, de reporteur, de sondeur ou d’autre famille recueillant de l’information. @fr
label: darbā intervējis (dzimta/ģimene) @lv
definition: Sasaista darbu ar dzimtu/ģimeni, kas ir atbildīga par darba radīšanu, darbojoties kā intervētājs, reportieris, aptaujas organizētājs vai kāds cits informācijas apkopotājs. @lv
toolkit label: darbā intervējis (dzimta/ģimene) @lv
toolkit definition: Dzimta/ģimene, kas ir atbildīga par darba radīšanu, darbojoties kā intervētājs, reportieris, aptaujas organizētājs vai kāds cits informācijas apkopotājs. @lv
label: 有作品的采访者家族 @zh-hans
definition: 将一种作品与通过担当采访者、记者、民意调查员或其他类型信息搜集行为者而对一种作品的创建负责的一个家族关联起来。 @zh-hans
toolkit label: 作品的采访者家族 @zh-hans
toolkit definition: 通过担当采访者、记者、民意调查员或其他类型信息搜集行为者而对一种作品的创建负责的一个家族 @zh-hans
has subproperty: P10587
label: eserin görüşmeci ailesi ile ilişkilidir @tr
definition: Bir eseri, bir görüşmeci, muhabir, anketör veya bilgi toplayan başka bir tür aile olarak hareket ederek bir eser oluşturmaktan sorumlu olan bir aileyle ilişkilendirir. @tr
toolkit label: eserin görüşmeci ailesi ile ilişkilidir @tr
toolkit definition: Görüşmeci, muhabir, anketör veya bilgi toplayan başka bir aile türü olarak hareket ederek bir eser oluşturmaktan sorumlu olan bir aile. @tr

has interviewer person of work
status: Published
lexical alias: interviewerPersonOfWork.en
definition: Relates a work to a person who is responsible for creating a work by acting as an interviewer, reporter, pollster, or some other kind of person who gathers information.
toolkit label: interviewer person of work
toolkit definition: A person who is responsible for creating a work by acting as an interviewer, reporter, pollster, or some other kind of person who gathers information.
type: Property
domain: C10001
has element type: 2
sub property of: has creator person of work
sub property of: has interviewer agent of work
label: teoksen haastattelija (henkilö) @fi
definition: Liittää teoksen henkilöön, joka on vastuussa teoksen luomisesta toimimalla haastattelijana, toimittajana, mielipidetutkijana tai jonkinlaisena muuna toimijana, joka kerää tietoja. @fi
toolkit label: teoksen haastattelija (henkilö) @fi
toolkit definition: Henkilö, joka on vastuussa teoksen luomisesta toimimalla haastattelijana, toimittajana, mielipidetutkijana tai jonkinlaisena muuna toimijana, joka kerää tietoja. @fi
label: har intervjuer for verk (person) @no
definition: Relaterer et verk til en person som er ansvarlig for å skape et verk ved å fungere som intervjuer, reporter eller en annen agent som samler inn informasjon. @no
toolkit label: intervjuer for verk (person) @no
toolkit definition: En person som er ansvarlig for å skape et verk ved å fungere som intervjuer, reporter eller en annen agent som samler inn informasjon. @no
label: heeft interviewer-persoon van werk @nl
definition: Relateert een werk aan een persoon die verantwoordelijk is voor het creëren van een werk door het optreden als een interviewer, verslaggever, opiniepeiler of een andere soort actor die informatie verzamelt. @nl
toolkit label: interviewer-persoon van werk @nl
toolkit definition: Een persoon die verantwoordelijk is voor het creëren van een werk door het optreden als een interviewer, verslaggever, opiniepeiler of een andere soort actor die informatie verzamelt. @nl
label: له شخص محاور لعمل @ar
definition: يربط بين عمل وشخص مسئول عن إنشاء عمل من خلال العمل كمحاور، أو مراسل، أو مستطلع آراء، أو أي نوع آخر من الأشخاص الذين يجمعون المعلومات. @ar
toolkit label: شخص محاور لعمل @ar
toolkit definition: شخص يكون مسئولاً عن إنشاء عمل من خلال العمل كمحاور، أو مراسل، أو مستطلع آراء، أو أي نوع آخر من الأشخاص الذين يجمعون المعلومات. @ar
label: té com a persona entrevistadora d’una obra @ca
definition: Relaciona una obra amb una persona que és responsable de la creació d’una obra actuant com un entrevistador, un periodista, un enquestador o qualsevol altre tipus de persona que recull informació. @ca
toolkit label: persona entrevistadora d’una obra @ca
toolkit definition: Persona que és responsable de la creació d’una obra actuant com un entrevistador, un periodista, un enquestador o qualsevol altre tipus de persona que recull informació. @ca
label: har person, som er interviewer for værk @da
definition: Relaterer et værk til en person, som er ansvarlig for at skabe et værk ved at optræde som interviewer, journalist, meningsmåler eller en anden form for agent, som indsamler information. @da
toolkit label: person, som er interviewer for værk @da
toolkit definition: Person, som er ansvarlig for at skabe et værk ved at optræde som interviewer, journalist, meningsmåler eller en anden form for agent, som indsamler information. @da
label: teose intervjueerija (isik) @et
definition: Seostab teose isikuga, kes vastutab teose loomise eest, tegutsedes intervjueerija, reporteri, küsitleja või muu infot koguva isikuna. @et
toolkit label: teose intervjueerija (isik) @et
toolkit definition: Isik, kes vastutab teose loomise eest, tegutsedes intervjueerija, reporteri, küsitleja või muu infot koguva isikuna. @et
label: hat Interviewerin/Interviewer eines Werks (Person) @de
definition: Setzt ein Werk in Beziehung zu einer Person, die für die Schaffung eines Werks verantwortlich ist, indem sie als Interviewerin/Interviewer, Reporterin/Reporter, Meinungsforscherin/Meinungsforscher oder andere Person Informationen zusammenträgt. @de
toolkit label: Interviewerin/Interviewer eines Werks (Person) @de
toolkit definition: Eine Person, die für die Schaffung eines Werks verantwortlich ist, indem sie als Interviewerin/Interviewer, Reporterin/Reporter, Meinungsforscherin/Meinungsforscher oder andere Person Informationen zusammenträgt. @de
label: mű interjúkészítő személye a következő: @hu
definition: Hozzákapcsol egy művet egy személyhez, aki felelős egy mű létrehozásáért oly módon, hogy interjúkészítőként, riporterként, közvélemény-kutatóként, vagy valamilyen más információgyűjtő személyként cselekszik. @hu
toolkit label: mű interjúkészítő személye: @hu
toolkit definition: Egy személy, aki felelős egy mű létrehozásáért oly módon, hogy interjúkészítőként, riporterként, közvélemény-kutatóként, vagy valamilyen más információgyűjtő személyként cselekszik. @hu
label: ha come intervistatore persona di opera @it
definition: Correla un'opera alla persona responsabile della creazione di un'opera, che agisce come intervistatore, reporter, sondaggista o altro genere di persona che raccoglie informazioni. @it
toolkit label: intervistatore persona di opera @it
toolkit definition: Persona responsabile della creazione di un'opera, che agisce come intervistatore, reporter, sondaggista o altro genere di persona che raccoglie informazioni. @it
label: a pour personne intervieweuse d’une œuvre @fr
definition: Met une œuvre en relation avec une personne qui est responsable de la création d’une œuvre en agissant à titre d’intervieweur, de reporteur, de sondeur ou d’autre personne recueillant de l’information. @fr
toolkit label: personne intervieweuse d’une œuvre @fr
toolkit definition: Personne qui est responsable de la création d’une œuvre en agissant à titre d’intervieweur, de reporteur, de sondeur ou d’autre personne recueillant de l’information. @fr
label: darbā intervējis (persona) @lv
definition: Sasaista darbu ar personu, kura ir atbildīga par darba radīšanu, darbojoties kā intervētājs, reportieris, aptaujas organizētājs vai kāds cits informācijas apkopotājs. @lv
toolkit label: darbā intervējis (persona) @lv
toolkit definition: Persona, kura ir atbildīga par darba radīšanu, darbojoties kā intervētājs, reportieris, aptaujas organizētājs vai kāds cits informācijas apkopotājs. @lv
label: 有作品的采访者个人 @zh-hans
definition: 将一种作品与通过担当采访者、记者、民意调查员或其他类型信息搜集个人而对一种作品的创建负责的一个个人关联起来。 @zh-hans
toolkit label: 作品的采访者个人 @zh-hans
toolkit definition: 通过担当采访者、记者、民意调查员或其他类型信息搜集个人而对一种作品的创建负责的一个个人 @zh-hans
has subproperty: P10446
label: eserin görüşmeci kişisi ile ilişkilidir @tr
definition: Bir eseri, görüşmeci, muhabir, anketör veya bilgi toplayan başka türde bir kişi olarak hareket ederek bir eser oluşturmaktan sorumlu olan bir kişiyle ilişkilendirir. @tr
toolkit label: eserin görüşmeci kişisi ile ilişkilidir @tr
toolkit definition: Görüşmeci, muhabir, anketör veya bilgi toplayan başka türde bir kişi olarak hareket ederek bir eser yaratmaktan sorumlu olan kişi. @tr

has inventor agent
status: Published
definition: Relates a work to an agent who is responsible for creating a new device or process.
type: Property
domain: C10001
sub property of: has creator agent of work
lexical alias: inventorAgent.en
toolkit label: inventor agent
toolkit definition: An agent who is responsible for creating a new device or process.
toolkit label: agent inventeur @fr
toolkit definition: Agent qui est responsable de la création d’un nouveau dispositif ou procédé. @fr
toolkit label: inventor @es
toolkit definition: Una persona, familia o entidad corporativa responsable de la creación de un nuevo aparato o proceso. @es
instruction number: 18.5
label: har agent, som er opfinder @da
definition: Relaterer et værk til en agent, som er ansvarlig for at skabe en ny anordning eller proces. @da
toolkit label: agent, som er opfinder @da
toolkit definition: Agent, som er ansvarlig for at skabe en ny anordning eller proces. @da
definition: Met une œuvre en relation avec un agent qui est responsable de la création d’un nouveau dispositif ou procédé. @fr
label: có người phát minh @vi
definition: Liên kết tác phẩm với tác nhân có trách nhiệm tạo lập sáng chế hoặc quy trình mới. @vi
toolkit label: người phát minh @vi
toolkit definition: Tác nhân có trách nhiệm tạo lập sáng chế hoặc quy trình mới. @vi
label: hat Erfinderin/Erfinder (Akteur) @de
definition: Setzt ein Werk in Beziehung zu einem Akteur, der für die Schaffung eines neuen Geräts oder Prozesses verantwortlich ist. @de
toolkit label: Erfinderin/Erfinder (Akteur) @de
toolkit definition: Ein Akteur, der für die Schaffung eines neuen Geräts oder Prozesses verantwortlich ist. @de
label: a pour agent inventeur @fr
definition: Liittää teoksen toimijaan, joka on vastuussa uuden välineen tai menetelmän luomisesta. @fi
toolkit label: keksijä (toimija) @fi
toolkit definition: Toimija, joka on vastuussa uuden välineen tai menetelmän luomisesta. @fi
toolkit label: oppfinner (agent) @no
toolkit definition: En agent som er ansvarlig for å skape en ny innretning eller prosess. @no
label: té com a agent inventor @ca
definition: Relaciona una obra amb un agent que és responsable de la creació d’un mecanisme o un procés nou. @ca
toolkit label: agent inventor @ca
toolkit definition: Agent que és responsable de la creació d’un mecanisme o un procés nou. @ca
has element type: 2
label: έχει εφευρέτη @el
definition: Συνδέει ένα έργο με έναν φορέα υπεύθυνο για τη δημιουργία μιας νέας συσκευής ή διαδικασίας. @el
toolkit label: εφευρέτης @el
toolkit definition: Ένας φορέας υπεύθυνος για τη δημιουργία μιας νέας συσκευής ή διαδικασίας. @el
label: feltaláló ágense a következő: @hu
definition: Hozzákapcsol egy művet egy ágenshez, amely felelős egy új eszköz vagy eljárás létrehozásáért. @hu
toolkit label: feltaláló ágens: @hu
toolkit definition: Egy ágens, amely felelős egy új eszköz vagy eljárás létrehozásáért. @hu
alternative label: inventor
alternative label: keksijä @fi
label: keksijä (toimija) @fi
label: har oppfinner (agent) @no
definition: Relaterer et verk til en agent som er ansvarlig for å skape en ny innretning eller prosess. @no
alternative label: oppfinner @no
label: heeft uitvinder-actor @nl
definition: Relateert een werk aan een actor die verantwoordelijk is voor het creëren van een nieuw apparaat of proces. @nl
toolkit label: uitvinder-actor @nl
toolkit definition: Een actor die verantwoordelijk is voor het creëren van een nieuw apparaat of proces. @nl
label: له وكيل مخترع @ar
definition: يربط بين عمل ووكيل مسئول عن إنشاء جهاز أو عملية جديدة. @ar
alternative label: مخترع @ar
toolkit label: وكيل مخترع @ar
toolkit definition: وكيل مسئول عن إنشاء جهاز أو عملية جديدة. @ar
alternative label: opfinder @da
label: leiutaja (tegija) @et
definition: Seostab teose tegijaga, kes vastutab uue seadme või protsessi loomise eest. @et
alternative label: leiutaja @et
toolkit label: leiutaja (tegija) @et
toolkit definition: Tegija, kes vastutab uue seadme või protsessi loomise eest. @et
alternative label: feltaláló: @hu
label: ha come inventore agente @it
definition: Correla un'opera a un agente responsabile della creazione di un nuovo dispositivo o procedimento. @it
alternative label: inventore @it
toolkit label: inventore agente @it
toolkit definition: Agente responsabile della creazione di un nuovo dispositivo o procedimento. @it
alternative label: inventeur @fr
label: izgudrotājs (aģents) @lv
definition: Sasaista darbu ar aģentu, kas ir atbildīgs par jaunas ierīces vai procesa radīšanu. @lv
toolkit label: izgudrotājs (aģents) @lv
toolkit definition: Aģents, kas ir atbildīgs par jaunas ierīces vai procesa radīšanu. @lv
alternative label: Erfinderin/Erfinder @de
alternative label: 发明者 @zh-hans
toolkit label: 发明者行为者 @zh-hans

has inventor collective agent
status: Published
lexical alias: inventorCollectiveAgent.en
definition: Relates a work to a collective agent who is responsible for creating a new device or process.
toolkit label: inventor collective agent
toolkit definition: A collective agent who is responsible for creating a new device or process.
type: Property
domain: C10001
has element type: 2
sub property of: has creator collective agent of work
sub property of: has inventor agent
label: keksijä (yhteistoimija) @fi
definition: Liittää teoksen yhteistoimijaan, joka on vastuussa uuden välineen tai menetelmän luomisesta. @fi
toolkit label: keksijä (yhteistoimija) @fi
toolkit definition: Yhteistoimija, joka on vastuussa uuden välineen tai menetelmän luomisesta. @fi
label: har oppfinner (kollektiv agent) @no
definition: Relaterer et verk til en kollektiv agent som er ansvarlig for å skape en ny innretning eller prosess. @no
toolkit label: oppfinner (kollektiv agent) @no
toolkit definition: En kollektiv agent som er ansvarlig for å skape en ny innretning eller prosess. @no
label: heeft uitvinder-collectieve actor @nl
definition: Relateert een werk aan een collectieve actor die verantwoordelijk is voor het creëren van een nieuw apparaat of proces. @nl
toolkit label: uitvinder-collectieve actor @nl
toolkit definition: Een collectieve actor die verantwoordelijk is voor het creëren van een nieuw apparaat of proces. @nl
label: له وكيل جماعي مخترع @ar
definition: يربط بين عمل ووكيل جماعي مسئول عن إنشاء جهاز جديد أو عملية جديدة. @ar
toolkit label: وكيل جماعي مخترع @ar
toolkit definition: وكيل جماعي مسئول عن إنشاء جهاز جديد أو عملية جديدة. @ar
label: té com a agent col·lectiu inventor @ca
definition: Relaciona una obra amb un agent col·lectiu que és responsable de la creació d’un mecanisme o procés nou. @ca
toolkit label: agent col·lectiu inventor @ca
toolkit definition: Agent col·lectiu que és responsable de la creació d’un mecanisme o procés nou. @ca
label: har kollektiv agent, som er opfinder @da
definition: Relaterer et værk til en kollektiv agent, som er ansvarlig for at skabe en ny anordning eller proces. @da
toolkit label: kollektiv agent, som er opfinder @da
toolkit definition: Kollektiv agent, som er ansvarlig for at skabe en ny anordning eller proces. @da
label: leiutaja (kollektiiv) @et
definition: Seostab teose kollektiiviga, kes vastutab uue seadme või protsessi loomise eest. @et
toolkit label: leiutaja (kollektiiv) @et
toolkit definition: Kollektiiv, kes vastutab uue seadme või protsessi loomise eest. @et
label: hat Erfinderin/Erfinder (Gemeinschaftlicher Akteur) @de
definition: Setzt ein Werk in Beziehung zu einem gemeinschaftlichen Akteur, der für die Schaffung eines neuen Geräts oder Prozesses verantwortlich ist. @de
toolkit label: Erfinderin/Erfinder (Gemeinschaftlicher Akteur) @de
toolkit definition: Ein gemeinschaftlicher Akteur, der für die Schaffung eines neuen Geräts oder Prozesses verantwortlich ist. @de
label: feltaláló kollektív ágense a következő: @hu
definition: Hozzákapcsol egy művet egy kollektív ágenshez, amely felelős egy új eszköz vagy eljárás létrehozásáért. @hu
toolkit label: feltaláló kollektív ágens: @hu
toolkit definition: Egy kollektív ágens, amely felelős egy új eszköz vagy eljárás létrehozásáért. @hu
label: ha come inventore agente collettivo @it
definition: Correla un'opera all'agente collettivo responsabile della creazione di un nuovo dispositivo o procedimento. @it
toolkit label: inventore agente collettivo @it
toolkit definition: Agente collettivo responsabile della creazione di un nuovo dispositivo o procedimento. @it
label: a pour agent collectif inventeur @fr
definition: Met une œuvre en relation avec un agent collectif qui est responsable de la création d’un nouveau dispositif ou procédé. @fr
toolkit label: agent collectif inventeur @fr
toolkit definition: Agent collectif qui est responsable de la création d’un nouveau dispositif ou procédé. @fr
label: izgudrotājs (grupa) @lv
definition: Sasaista darbu ar grupu, kas ir atbildīga par jaunas ierīces vai procesa radīšanu. @lv
toolkit label: izgudrotājs (grupa) @lv
toolkit definition: Grupa, kas ir atbildīga par jaunas ierīces vai procesa radīšanu. @lv
label: 有发明者集体行为者 @zh-hans
definition: 将一种作品与负责创建一种新装置或新过程的一个集体行为者关联起来。 @zh-hans
toolkit label: 发明者集体行为者 @zh-hans
toolkit definition: 负责创建一种新装置或新过程的一个集体行为者 @zh-hans
has subproperty: has inventor corporate body
has subproperty: has inventor family
has subproperty: P10490
label: mucit kolektif temsilcisi ile ilişkilidir @tr
definition: Bir eseri, yeni bir cihaz veya süreç oluşturmaktan sorumlu olan kolektif bir temsilci ile ilişkilendirir. @tr
toolkit label: mucit kolektif temsilcisi ile ilişkilidir @tr
toolkit definition: Yeni bir cihaz veya süreç oluşturmaktan sorumlu olan kolektif temsilci @tr

has inventor corporate body
status: Published
lexical alias: inventorCorporateBody.en
definition: Relates a work to a corporate body who is responsible for creating a new device or process.
toolkit label: inventor corporate body
toolkit definition: A corporate body who is responsible for creating a new device or process.
type: Property
domain: C10001
has element type: 2
sub property of: has creator corporate body of work
sub property of: has inventor collective agent
label: keksijä (yhteisö) @fi
definition: Liittää teoksen yhteisöön, joka on vastuussa uuden välineen tai menetelmän luomisesta. @fi
toolkit label: keksijä (yhteisö) @fi
toolkit definition: Yhteisö, joka on vastuussa uuden välineen tai menetelmän luomisesta. @fi
label: har oppfinner (korporasjon) @no
definition: Relaterer et verk til en korporasjon som er ansvarlig for å skape en ny innretning eller prosess. @no
toolkit label: oppfinner (korporasjon) @no
toolkit definition: En korporasjon som er ansvarlig for å skape en ny innretning eller prosess. @no
label: heeft uitvinder-corporatie @nl
definition: Relateert een werk aan een corporatie die verantwoordelijk is voor het creëren van een nieuw apparaat of proces. @nl
toolkit label: uitvinder-corporatie @nl
toolkit definition: Een corporatie die verantwoordelijk is voor het creëren van een nieuw apparaat of proces. @nl
label: له هيئة مخترعة @ar
definition: يربط بين عمل وهيئة مسئولة عن إنشاء جهاز جديد أو عملية جديدة. @ar
toolkit label: هيئة مخترعة @ar
toolkit definition: هيئة مسئولة عن إنشاء جهاز جديد أو عملية جديدة. @ar
label: té com a entitat corporativa inventora @ca
definition: Relaciona una obra amb una entitat corporativa que és responsable de la creació d’un mecanisme o procés nou. @ca
toolkit label: entitat corporativa inventora @ca
toolkit definition: Entitat corporativa que és responsable de la creació d’un mecanisme o procés nou. @ca
label: har korporation, som er opfinder @da
definition: Relaterer et værk til en korporation, som er ansvarlig for at skabe en ny anordning eller proces. @da
toolkit label: korporation, som er opfinder @da
toolkit definition: Korporation, som er ansvarlig for at skabe en ny anordning eller proces. @da
label: leiutaja (asutus) @et
definition: Seostab teose asutusega, kes vastutab uue seadme või protsessi loomise eest. @et
toolkit label: leiutaja (asutus) @et
toolkit definition: Asutus, kes vastutab uue seadme või protsessi loomise eest. @et
label: hat Erfinderin/Erfinder (Körperschaft) @de
definition: Setzt ein Werk in Beziehung zu einer Körperschaft, die für die Schaffung eines neuen Gerätes oder Prozesses verantwortlich ist. @de
toolkit label: Erfinderin/Erfinder (Körperschaft) @de
toolkit definition: Eine Körperschaft, die für die Schaffung eines neuen Gerätes oder Prozesses verantwortlich ist. @de
label: feltaláló testülete a következő: @hu
definition: Hozzákapcsol egy művet egy testülethez, amely felelős egy új eszköz vagy eljárás létrehozásáért. @hu
toolkit label: feltaláló testület: @hu
toolkit definition: Egy testület, amely felelős egy új eszköz vagy eljárás létrehozásáért. @hu
label: ha come inventore ente @it
definition: Correla un'opera a un ente responsabile della creazione di un nuovo dispositivo o procedimento. @it
toolkit label: inventore ente @it
toolkit definition: Ente responsabile della creazione di un nuovo dispositivo o procedimento. @it
label: a pour collectivité inventrice @fr
definition: Met une œuvre en relation avec une collectivité qui est responsable de la création d’un nouveau dispositif ou procédé. @fr
toolkit label: collectivité inventrice @fr
toolkit definition: Collectivité qui est responsable de la création d’un nouveau dispositif ou procédé. @fr
label: izgudrotājs (institūcija) @lv
definition: Sasaista darbu ar institūciju, kas ir atbildīga par jaunas ierīces vai procesa radīšanu. @lv
toolkit label: izgudrotājs (institūcija) @lv
toolkit definition: Institūcija, kas ir atbildīga par jaunas ierīces vai procesa radīšanu. @lv
label: 有发明者团体 @zh-hans
definition: 将一种作品与负责创建一种新装置或新过程的一个团体关联起来。 @zh-hans
toolkit label: 发明者团体 @zh-hans
toolkit definition: 负责创建一种新装置或新过程的一个团体 @zh-hans
has subproperty: P10537
label: mucit tüzel kişisi ile ilişkilidir @tr
definition: Bir eseri, yeni bir cihaz veya süreç oluşturmaktan sorumlu olan tüzel kişi ile ilişkilendirir. @tr
toolkit label: mucit tüzel kişisi ile ilişkilidir @tr
toolkit definition: Yeni bir cihaz veya süreç oluşturmaktan sorumlu olan bir tüzel kişi. @tr

has inventor family
status: Published
lexical alias: inventorFamily.en
definition: Relates a work to a family who is responsible for creating a new device or process.
toolkit label: inventor family
toolkit definition: A family who is responsible for creating a new device or process.
type: Property
domain: C10001
has element type: 2
sub property of: has creator family of work
sub property of: has inventor collective agent
label: keksijä (suku) @fi
definition: Liittää teoksen sukuun, joka on vastuussa uuden välineen tai menetelmän luomisesta. @fi
toolkit label: keksijä (suku) @fi
toolkit definition: Suku, joka on vastuussa uuden välineen tai menetelmän luomisesta. @fi
label: har oppfinner (familie) @no
definition: Relaterer et verk til en familie som er ansvarlig for å skape en ny innretning eller prosess. @no
toolkit label: oppfinner (familie) @no
toolkit definition: En familie som er ansvarlig for å skape en ny innretning eller prosess. @no
label: heeft uitvinder-familie @nl
definition: Relateert een werk aan een familie die verantwoordelijk is voor het creëren van een nieuw apparaat of proces. @nl
toolkit label: uitvinder-familie @nl
toolkit definition: Een familie die verantwoordelijk is voor het creëren van een nieuw apparaat of proces. @nl
label: له عائلة مخترعة @ar
definition: يربط بين عمل وعائلة مسئولة عن إنشاء جهاز جديد أو عملية جديدة. @ar
toolkit label: عائلة مخترعة @ar
toolkit definition: عائلة مسئولة عن إنشاء جهاز جديد أو عملية جديدة. @ar
label: té com a família inventora @ca
definition: Relaciona una obra amb una família que és responsable de la creació d’un mecanisme o un procés nou. @ca
toolkit label: família inventora @ca
toolkit definition: Família que és responsable de la creació d’un mecanisme o un procés nou. @ca
label: har familie, som er opfinder @da
definition: Relaterer et værk til en familie, som er ansvarlig for at skabe en ny anordning eller proces. @da
toolkit label: familie, som er opfinder @da
toolkit definition: Familie, som er ansvarlig for at skabe en ny anordning eller proces. @da
label: leiutaja (perekond) @et
definition: Seostab teose perekonnaga, kes vastutab uue seadme või protsessi loomise eest. @et
toolkit label: leiutaja (perekond) @et
toolkit definition: Perekond, kes vastutab uue seadme või protsessi loomise eest. @et
label: hat Erfinderin/Erfinder (Familie) @de
definition: Setzt ein Werk in Beziehung zu einer Familie, die für die Schaffung eines neuen Gerätes oder Prozesses verantwortlich ist. @de
toolkit label: Erfinderin/Erfinder (Familie) @de
toolkit definition: Eine Familie, die für die Schaffung eines neuen Gerätes oder Prozesses verantwortlich ist. @de
label: feltaláló családja a következő: @hu
definition: Hozzákapcsol egy művet egy családhoz, amely felelős egy új eszköz vagy eljárás létrehozásáért. @hu
toolkit label: feltaláló család: @hu
toolkit definition: Egy család, amely felelős egy új eszköz vagy eljárás létrehozásáért. @hu
label: ha come inventore famiglia @it
definition: Correla un'opera alla famiglia responsabile della creazione di un nuovo dispositivo o procedimento. @it
toolkit label: inventore famiglia @it
toolkit definition: Famiglia responsabile della creazione di un nuovo dispositivo o procedimento. @it
label: a pour famille inventrice @fr
definition: Met une œuvre en relation avec une famille qui est responsable de la création d’un nouveau dispositif ou procédé. @fr
toolkit label: famille inventrice @fr
toolkit definition: Famille qui est responsable de la création d’un nouveau dispositif ou procédé. @fr
label: izgudrotājs (dzimta/ģimene) @lv
definition: Sasaista darbu ar dzimtu/ģimeni, kas ir atbildīga par jaunas ierīces vai procesa radīšanu. @lv
toolkit label: izgudrotājs (dzimta/ģimene) @lv
toolkit definition: Dzimta/ģimene, kas ir atbildīga par jaunas ierīces vai procesa radīšanu. @lv
label: 有发明者家族 @zh-hans
definition: 将一种作品与负责创建一种新装置或新过程的一个家族关联起来。 @zh-hans
toolkit label: 发明者家族 @zh-hans
toolkit definition: 负责创建一种新装置或新过程的一个家族 @zh-hans
has subproperty: P10584
label: mucit ailesi ile ilişkilidir @tr
definition: Bir eseri, yeni bir cihaz veya işlem oluşturmaktan sorumlu olan bir aileyle ilişkilendirir. @tr
toolkit label: mucit ailesi ile ilişkilidir @tr
toolkit definition: Yeni bir cihaz veya işlem oluşturmaktan sorumlu bir aile. @tr

has inventor person
status: Published
lexical alias: inventorPerson.en
definition: Relates a work to a person who is responsible for creating a new device or process.
toolkit label: inventor person
toolkit definition: A person who is responsible for creating a new device or process.
type: Property
domain: C10001
has element type: 2
sub property of: has creator person of work
sub property of: has inventor agent
label: keksijä (henkilö) @fi
definition: Liittää teoksen henkilöön, joka on vastuussa uuden välineen tai menetelmän luomisesta. @fi
toolkit label: keksijä (henkilö) @fi
toolkit definition: Henkilö, joka on vastuussa uuden välineen tai menetelmän luomisesta. @fi
label: har oppfinner (person) @no
definition: Relaterer et verk til en person som er ansvarlig for å skape en ny innretning eller prosess. @no
toolkit label: oppfinner (person) @no
toolkit definition: En person som er ansvarlig for å skape en ny innretning eller prosess. @no
label: heeft uitvinder-persoon @nl
definition: Relateert een werk aan een persoon die verantwoordelijk is voor het creëren van een nieuw apparaat of proces. @nl
toolkit label: uitvinder-persoon @nl
toolkit definition: Een persoon die verantwoordelijk is voor het creëren van een nieuw apparaat of proces. @nl
label: له شخص مخترع @ar
definition: يربط بين عمل وشخص مسئول عن إنشاء جهاز أو عملية جديدة. @ar
toolkit label: شخص مخترع @ar
toolkit definition: شخص يكون مسئولاً عن إنشاء جهاز جديد أو عملية جديدة. @ar
label: té com a persona inventora @ca
definition: Relaciona una obra amb una persona que és responsable de la creació d’un mecanisme o procés nou. @ca
toolkit label: persona inventora @ca
toolkit definition: Persona que és responsable de la creació d’un mecanisme o procés nou. @ca
label: har person, som er opfinder @da
definition: Relaterer et værk til en person, som er ansvarlig for at skabe en ny anordning eller proces. @da
toolkit label: person, som er opfinder @da
toolkit definition: Person, som er ansvarlig for at skabe en ny anordning eller proces. @da
label: leiutaja (isik) @et
definition: Seostab teose isikuga, kes vastutab uue seadme või protsessi loomise eest. @et
toolkit label: leiutaja (isik) @et
toolkit definition: Isik, kes vastutab uue seadme või protsessi loomise eest. @et
label: hat Erfinderin/Erfinder (Person) @de
definition: Setzt ein Werk in Beziehung zu einer Person, die für die Schaffung eines neuen Gerätes oder Prozesses verantwortlich ist. @de
toolkit label: Erfinderin/Erfinder (Person) @de
toolkit definition: Eine Person, die für die Schaffung eines neuen Gerätes oder Prozesses verantwortlich ist. @de
label: feltaláló személye a következő: @hu
definition: Hozzákapcsol egy művet egy személyhez, aki felelős egy új eszköz vagy eljárás létrehozásáért. @hu
toolkit label: feltaláló személy: @hu
toolkit definition: Egy személy, aki felelős egy új eszköz vagy eljárás létrehozásáért. @hu
label: ha come inventore persona @it
definition: Correla un'opera alla persona responsabile della creazione di un nuovo dispositivo o procedimento. @it
toolkit label: inventore persona @it
toolkit definition: Persona responsabile della creazione di un nuovo dispositivo o procedimento. @it
label: a pour personne inventrice @fr
definition: Met une œuvre en relation avec une personne qui est responsable de la création d’un nouveau dispositif ou procédé. @fr
toolkit label: personne inventrice @fr
toolkit definition: Personne qui est responsable de la création d’un nouveau dispositif ou procédé. @fr
label: izgudrotājs (persona) @lv
definition: Sasaista darbu ar personu, kura ir atbildīga par jaunas ierīces vai procesa radīšanu. @lv
toolkit label: izgudrotājs (persona) @lv
toolkit definition: Persona, kura ir atbildīga par jaunas ierīces vai procesa radīšanu. @lv
label: 有发明者个人 @zh-hans
definition: 将一种作品与负责创建一种新装置或新过程的一个个人关联起来。 @zh-hans
toolkit label: 发明者个人 @zh-hans
toolkit definition: 负责创建一种新装置或新过程的一个个人 @zh-hans
has subproperty: P10443
label: mucit kişisi ile ilişkilidir @tr
definition: Bir eseri, yeni bir cihaz veya süreç oluşturmaktan sorumlu olan bir kişiyle ilişkilendirir. @tr
toolkit label: mucit kişisi ile ilişkilidir @tr
toolkit definition: Yeni bir cihaz veya süreç oluşturmaktan sorumlu kişi. @tr

has court governed
status: Published
definition: Relates a work to a corporate body that is a court governed by court rules, regardless of their official nature.
type: Property
domain: C10001
sub property of: has creator corporate body of work
lexical alias: courtGoverned.en
toolkit label: court governed
toolkit definition: A corporate body that is a court governed by court rules, regardless of their official nature.
toolkit label: tribunal régi @fr
toolkit definition: Collectivité qui consiste en un tribunal régi par des règles de pratique, sans égard à leur nature officielle. @fr
toolkit label: tribunal regido @es
toolkit definition: Un tribunal regido por reglamentos de tribunales, independientemente de su naturaleza oficial (por ej., leyes, disposiciones administrativas). @es
instruction number: 18.5
label: har retsinstans underlagt @da
definition: Relaterer et værk til en retsinstans, som er underlagt retsregler, uden hensyn til deres officielle status. @da
toolkit label: retsinstans underlagt @da
toolkit definition: Retsinstans, som er underlagt retsregler, uden hensyn til deres officielle status. @da
definition: Met une œuvre en relation avec une collectivité qui consiste en un tribunal régi par des règles de pratique, sans égard à leur nature officielle. @fr
label: có toà được điều hành @vi
definition: Liên kết tác phẩm với toà án được điều hành bởi các quy tắc toà án, không phân biệt bản chất chính thức của chúng, @vi
toolkit label: toà được điều hành @vi
toolkit definition: Toà án được điều hành bởi các quy tắc toà án, không phân biệt bản chất chính thức của chúng, @vi
label: hat durch Verfahrensvorschriften geregeltes Gericht @de
definition: Setzt ein Werk in Beziehung zu einem Gericht, das durch gerichtliche Verfahrensvorschriften geregelt wird, unabhängig von deren förmlicher Rechtsnatur. @de
toolkit label: durch Verfahrensvorschriften geregeltes Gericht @de
toolkit definition: Ein Gericht, das durch gerichtlichen Verfahrensvorschriften geregelt wird, unabhängig von deren förmlicher Rechtsnatur. @de
label: a pour tribunal régi @fr
definition: Liittää teoksen tuomioistuimeen, jota tuomioistuimen säännöt ohjaavat riippumatta niiden virallisesta luonteesta. @fi
toolkit label: sääntöjen ohjaama tuomioistuin @fi
toolkit definition: Tuomioistuin, jota tuomioistuimen säännöt ohjaavat riippumatta niiden virallisesta luonteesta. @fi
toolkit label: domstol som styres @no
toolkit definition: En domstol som styres av rettergangsregler, uavhengig av deres offisielle status. @no
label: té com a tribunal regit @ca
definition: Relaciona una obra amb un tribunal regit per regles de procediment, independentment de la seva natura oficial. @ca
toolkit label: tribunal regit @ca
toolkit definition: Entitat corporativa que és un ribunal regit per regles de procediment, independentment de la seva natura oficial. @ca
has element type: 2
label: έχει δικαστήριο που εφαρμόζει @el
definition: Συνδέει ένα έργο με ένα δικαστήριο, το οποίο εφαρμόζει δικαστικούς/δικονομικούς κανόνες, ανεξάρτητα από τον επίσημο χαρακτήρα τους. @el
toolkit label: δικαστήριο που εφαρμόζει @el
toolkit definition: Ένα δικαστήριο, το οποίο εφαρμόζει δικαστικούς/δικονομικούς κανόνες, ανεξάρτητα από τον επίσημο χαρακτήρα τους. @el
label: irányított bírósága a következő: @hu
definition: Hozzákapcsol egy művet egy testülethez, egy bírósági szabályzatok által irányított bírósághoz, függetlenül annak hivatalos természetétől. @hu
toolkit label: irányított bíróság: @hu
toolkit definition: Egy testület, egy bírósági szabályzatok által irányított bíróság, függetlenül annak hivatalos természetétől. @hu
label: sääntöjen ohjaama tuomioistuin @fi
label: har domstol som styres @no
definition: Relaterer et verk til en domstol som styres av rettergangsregler, uavhengig av deres offisielle status. @no
label: heeft hof geregeerd @nl
definition: Relateert een werk aan een hof geregeerd door rechtbankregels, ongeacht hun officiële aard. @nl
toolkit label: hof geregeerd @nl
toolkit definition: Een corporatie die is een hof geregeerd door rechtbankregels, ongeacht hun officiële aard. @nl
label: له محكمة خاضعة @ar
definition: يربط بين عمل وهيئة عبارة عن محكمة تخضع لقواعد محكمة، بغض النظر عن طبيعتها الرسمية. @ar
toolkit label: محكمة خاضعة @ar
toolkit definition: هيئة عبارة عن محكمة تخضع لقواعد محكمة، بغض النظر عن طبيعتها الرسمية. @ar
label: kohus @et
definition: Seostab teose asutusega, kes on menetluseeskirjadest (sõltumata nende vormilisest olemusest) juhinduv kohus. @et
toolkit label: kohus @et
toolkit definition: Asutus, kes on menetluseeskirjadest (sõltumata nende vormilisest olemusest) juhinduv kohus. @et
label: ha come tribunale governato @it
definition: Correla un’opera a un tribunale governato da procedure proprie, a prescindere dalla loro natura ufficiale. @it
toolkit label: tribunale governato @it
toolkit definition: Tribunale governato da procedure proprie, a prescindere dalla loro natura ufficiale. @it
label: reglamentēta tiesa @lv
definition: Sasaista darbu ar institūciju, kas ir tiesa, kuras darbību reglamentē noteikumi, neatkarīgi no to oficiālā rakstura. @lv
toolkit label: reglamentēta tiesa @lv
toolkit definition: Tiesa, kuras darbību reglamentē noteikumi, neatkarīgi no to oficiālā rakstura. @lv
label: 有受管辖的法院 @zh-hans
definition: 将一种作品与作为通过法院规则（不管其正式性质）受管辖的一个法院的一个团体关联起来。 @zh-hans
toolkit label: 受管辖的法院 @zh-hans
toolkit definition: 作为通过法院规则（不管其正式性质）受管辖的一个法院的一个团体 @zh-hans
has subproperty: P10011
label: mahkeme tarafından yönetilen ile ilişkilidir @tr
definition: Bir eseri, resmi niteliğine bakılmaksızın, mahkeme kuralları ile yönetilen bir mahkeme olan tüzel kişi ile ilişkilendirir. @tr
toolkit label: mahkeme tarafından yönetilen @tr
toolkit definition: Resmi niteliğine bakılmaksızın mahkeme kuralları ile yönetilen bir mahkeme olan tüzel kişilik. @tr

has ISSN
status: Published
lexical alias: issn.en
definition: Relates a work to a nomen that is an identifier for work that is assigned by an ISSN registration agency.
alternative label: International Standard Serial Number
toolkit label: ISSN
toolkit definition: A nomen that is an identifier for work that is assigned by an ISSN registration agency.
type: Property
domain: C10001
sub property of: has identifier for work
has element type: 2
alternative label: ISSN of subseries
alternative label: ISSN of series
label: ISSN @fi
definition: Liittää teoksen nomeniin, joka on teoksen tunniste, jonka on antanut ISSN-rekisteröintitoimisto. @fi
toolkit definition: Nomen, joka on teoksen tunniste, jonka on antanut ISSN-rekisteröintitoimisto. @fi
label: har ISSN @no
definition: Relaterer et verk til en identifikator for verk som er tildelt av et ISSN-kontor. @no
toolkit definition: En identifikator for verk som er tildelt av et ISSN-kontor. @no
label: heeft ISSN @nl
definition: Relateert een werk aan een nomen dat is een identificatie voor werk dat toegekend is door een ISSN-registratiebureau. @nl
toolkit definition: Een nomen dat is een identificatie voor werk dat toegekend is door een ISSN-registratiebureau. @nl
label: له ردمد @ar
definition: يربط بين عمل وتسمية عبارة عن معرف لعمل خصصته وكالة تسجيل ردمد. @ar
alternative label: الرقم المعياري الدولي للدوريات @ar
toolkit label: ردمد @ar
toolkit definition: تسمية عبارة عن معرف لعمل خصصته وكالة تسجيل ردمد. @ar
label: té com a ISSN @ca
definition: Relaciona una obra amb un nomen que és un identificador d’obra que és assignat per una agència de registre de l’ISSN. @ca
toolkit definition: Nomen que és un identificador d’obra que és assignat per una agència de registre de l’ISSN. @ca
definition: Seostab teose teose identifikaatoriga, mille on määranud ISSN registreerimise agentuur. @et
alternative label: rahvusvaheline jadaväljaande standardnumber @et
toolkit definition: Teose identifikaator, mille on määranud ISSN registreerimise agentuur. @et
label: hat ISSN einer Reihe @de
definition: Setzt ein Werk in Beziehung zu einem Identifikator für ein Werk, der durch eine ISSN-Registrierungsstelle zugewiesen wird. @de
toolkit label: ISSN einer Reihe @de
toolkit definition: Ein Identifikator für ein Werk, der durch eine ISSN-Registrierungsstelle zugewiesen wird. @de
label: ISSN-je a következő: @hu
definition: Hozzákapcsol egy művet egy műazonosító nomenhez, amelyet egy ISSN regisztrációs ügynökség jegyez. @hu
toolkit label: ISSN-je: @hu
toolkit definition: Egy műazonosító nomen, amelyet egy ISSN regisztrációs ügynökség jegyez. @hu
label: ha come ISSN @it
definition: Correla un’opera a un identificatore per l’opera che è assegnato da un’agenzia di registrazione ISSN. @it
toolkit definition: Identificatore per l’opera che è assegnato da un’agenzia di registrazione ISSN. @it
label: a pour ISSN @fr
definition: Met une œuvre en relation avec un nomen qui est un identifiant d’œuvre attribué par une agence d’enregistrement de l’ISSN. @fr
alternative label: ISSN de collection @fr
toolkit definition: Nomen qui est un identifiant d’œuvre attribué par une agence d’enregistrement de l’ISSN. @fr
definition: Sasaista darbu ar nomenu, kas ir identifikators darbam, ko piešķir ISSN reģistrācijas aģentūra. @lv
toolkit definition: Identifikators darbam, ko piešķir ISSN reģistrācijas aģentūra. @lv
alternative label: ISSN de sous-collection @fr
label: 有国际标准连续出版物号 @zh-hans
definition: 将一种作品与一个国际标准连续出版物号注册机构分配给一种作品的一个作为标识符的命名关联起来。 @zh-hans
toolkit label: 国际标准连续出版物号 @zh-hans
toolkit definition: 一个国际标准连续出版物号注册机构分配给一种作品的一个作为标识符的命名 @zh-hans
alternative label: 国际标准连续出版物号 @zh-hans
alternative label: 分丛编的国际标准连续出版物号 @zh-hans
alternative label: 丛编的国际标准连续出版物号 @zh-hans
alternative label: Időszaki kiadványok nemzetközi szabványos azonosító száma @hu
alternative label: alsorozat ISSN-je: @hu
alternative label: sorozat ISSN-je: @hu
has subproperty: P10366
label: ISSN ile ilişkilidir @tr
definition: Bir eseri, bir ISSN kayıt kuruluşu tarafından atanan eser için tanımlayıcı olan bir isimle ilişkilendirir. @tr
toolkit label: ISSN ile ilişkilidir @tr
toolkit definition: Bir ISSN kayıt ajansı tarafından atanan eser tanımlayıcısı olan bir isim. @tr

has issue
status: Published
definition: Relates a work to a work that is a static work that is inspired by the overall editorial policy, scope, and style of a successive aggregating work.
type: Property
domain: C10001
sub property of: is inspiration for
lexical alias: issue.en
toolkit label: issue
toolkit definition: A work that is a static work that is inspired by the overall editorial policy, scope, and style of a successive aggregating work.
toolkit label: livraison @fr
toolkit definition: Œuvre statique qui s’inspire de la politique éditoriale globale, de la portée et du style d’une œuvre agrégatrice successive. @fr
toolkit label: la serie incluye (obra) @es
toolkit definition: Una obra que se publicó como parte de una serie. @es
instruction number: 24.5
label: har udgivelse @da
definition: Relaterer et værk til et værk, som er et statisk værk, som er inspireret af den overgribende redaktionelle retningslinje, rækkevidde og stil for et fortløbende aggregerende værk. @da
toolkit label: udgivelse @da
toolkit definition: Værk, som er et statisk værk, som er inspireret af den overgribende redaktionelle retningslinje, rækkevidde og stil for et fortløbende aggregerende værk. @da
definition: Met une œuvre en relation avec une œuvre statique qui s’inspire de la politique éditoriale globale, de la portée et du style d’une œuvre agrégatrice successive. @fr
label: là vỏ chứa tùng thư của @vi
definition: Liên kết tác phẩm với tác phẩm đã được công bố như là phần của tùng thư. @vi
toolkit label: vỏ chứa tùng thư của @vi
toolkit definition: Tác phẩm đã được công bố như là phần của tùng thư. @vi
label: hat Ausgabe @de
definition: Setzt ein Werk in Beziehung zu einem statischen Werk, das an die allgemeine redaktionelle Vorgehensweise, den Geltungsbereich und den Stil eines sukzessiven, aggregierenden Werks angelehnt ist. @de
toolkit label: Ausgabe @de
toolkit definition: Ein statisches Werk, das an die allgemeine redaktionelle Vorgehensweise, den Geltungsbereich und den Stil eines sukzessiven, aggregierenden Werks angelehnt ist. @de
label: a pour livraison @fr
definition: Liittää teoksen teokseen, joka on staattinen teos, johon on vaikuttanut peräkkäin ilmestyvän aggregoivan teoksen yleinen toimituslinja, toiminta-ala ja tyyli. @fi
toolkit label: numero @fi
toolkit definition: Teos, joka on staattinen teos, johon on vaikuttanut peräkkäin ilmestyvän aggregoivan teoksen yleinen toimituslinja, toiminta-ala ja tyyli. @fi
toolkit label: hefte @no
toolkit definition: Et verk som er et statisk verk som er inspirert av den samlede redaksjonelle politikken, omfanget og stilen fra et påfølgende aggregert verk. @no
label: té com a número @ca
definition: Relaciona una obra amb una obra que és una obra estàtica que és inspirada per la política editorial general, l’abast i l’estil d’una obra agregadora successiva. @ca
toolkit label: número @ca
toolkit definition: Obra que és una obra estàtica que és inspirada per la política editorial general, l’abast i l’estil d’una obra agregadora successiva. @ca
has element type: 2
label: είναι περιέκτης σειράς του @el
definition: Συνδέει ένα έργο με ένα έργο το οποίο έχει εκδοθεί ως μέρος μιας σειράς. @el
toolkit label: περιέκτης σειράς του @el
toolkit definition: Ένα έργο το οποίο έχει εκδοθεί ως μέρος μιας σειράς. @el
label: száma a következő: @hu
definition: Hozzákapcsol egy művet egy statikus műhöz, amelyre egy folyamatos aggregáló mű szerkesztési elve, tárgyköre és stílusa volt hatással. @hu
toolkit label: száma: @hu
toolkit definition: Egy statikus mű, amelyre egy folyamatos aggregáló mű szerkesztési elve, tárgyköre és stílusa volt hatással. @hu
alternative label: series container of
scope note: An issue static work can be a single work or an aggregating work.
scope note: Staattisen teoksen numero voi olla yksittäisteos tai aggregoiva teos. @fi
alternative label: sarjan osa @fi
label: numero @fi
label: har hefte @no
definition: Relaterer et verk til et verk som er et statisk verk som er inspirert av den samlede redaksjonelle politikken, omfanget og stilen fra et påfølgende aggregert verk. @no
label: heeft aflevering @nl
definition: Relateert een werk aan een werk dat is een statisch werk dat geïnspireerd is door het algehele redactionele beleid, de scope en stijl van een successief aggregaatwerk. @nl
scope note: Een aflevering-statisch werk kan een enkel werk zijn of een aggregatiewerk. @nl
toolkit label: aflevering @nl
toolkit definition: Een werk dat is een statisch werk dat geïnspireerd is door het algehele redactionele beleid, de scope en stijl van een successief aggregaatwerk. @nl
label: له إصدارة @ar
definition: يربط عمل بعمل عبارة عن عمل ثابت مستوحى من السياسة التحريرية الشاملة، والمجال، والأسلوب لعمل تجميعي متتالٍ. @ar
scope note: إصدارة عمل ثابت يمكن أن تكون عملاً منفردًا أو عملًا مجمعًا. @ar
alternative label: حاوية سلسلة لـ @ar
toolkit label: إصدارة @ar
toolkit definition: عمل عبارة عن عمل ثابت مستوحى من السياسة التحريرية الشاملة، والمجال، والأسلوب لعمل تجميعي متتالٍ. @ar
scope note: Un número d’obra estàtica pot ser una obra sola o una obra agregadora. @ca
alternative label: col·lecció contenidor de @ca
scope note: En udgivelse af et statisk værk kan være et enkeltstående værk eller et aggregerende værk. @da
alternative label: seriecontainer af @da
label: number @et
definition: Seostab teose staatilise teosega, mille toimetamispõhimõtteid, käsitlusala ja stiili suunab liitev järgteos. @et
scope note: Number staatilise teosena võib olla üksikteos või liitev teos. @et
toolkit label: number @et
toolkit definition: Staatiline teos, mille toimetamispõhimõtteid, käsitlusala ja stiili suunab liitev järgteos. @et
scope note: Eine Ausgabe eines statischen Werks kann ein Einzelwerk oder ein aggregierendes Werk sein. @de
alternative label: Reihe enthält @de
scope note: A részegységet alkotó statikus mű önálló vagy aggregáló mű is lehet. @hu
label: ha come fascicolo @it
definition: Correla un'opera a un'opera statica che è ispirata dalla politica editoriale complessiva, dall’oggetto e dallo stile di un'opera aggregante consecutiva. @it
scope note: Un fascicolo di opera statica può essere un'opera singola o un'opera aggregante. @it
alternative label: serie contenitore di @it

is issue of
status: Published
definition: Relates a work to a work that is a successive aggregating work that inspires the editorial policy, scope, and style of a static work.
type: Property
domain: C10001
sub property of: is inspired by
lexical alias: issueOf.en
toolkit label: issue of
toolkit definition: A work that is a successive aggregating work that inspires the editorial policy, scope, and style of a static work.
toolkit label: livraison de @fr
toolkit definition: Œuvre agrégatrice successive qui inspire la politique éditoriale, la portée et le style d’une œuvre statique. @fr
toolkit label: en la serie (obra) @es
toolkit definition: Una obra en la cual se publica la parte; el título de la obra mayor aparece en la parte. @es
instruction number: 24.5
label: er udgivelse af @da
definition: Relaterer et værk til et værk, som er et fortløbende aggregerende værk, som inspirerer den redaktionelle retningslinje, rækkevidde og stil for et statisk værk. @da
toolkit label: udgivelse af @da
toolkit definition: Værk, som er et fortløbende aggregerende værk, som inspirerer den redaktionelle retningslinje, rækkevidde og stil for et statisk værk. @da
definition: Met une œuvre en relation avec une œuvre agrégatrice successive qui inspire la politique éditoriale, la portée et le style d’une œuvre statique. @fr
label: trong tùng thư @vi
definition: Liên kết tác phẩm với tác phẩm mà trong đó phần đã được công bố; nhan đề của tác phẩm lớn hơn xuất hiện trong phần đó. @vi
toolkit label: trong tùng thư @vi
toolkit definition: Tác phẩm mà trong đó phần đã được công bố; nhan đề của tác phẩm lớn hơn xuất hiện trong phần đó. @vi
label: ist Ausgabe von @de
definition: Setzt ein Werk in Beziehung zu einem sukzessiven, aggregierenden Werk, das die redaktionelle Vorgehensweise, den Geltungsbereich und den Stil eines statischen Werks beeinflusst. @de
toolkit label: Ausgabe von @de
toolkit definition: Ein sukzessives, aggregierendes Werk, das die redaktionelle Vorgehensweise, den Geltungsbereich und den Stil eines statischen Werks beeinflusst. @de
label: est une livraison de @fr
definition: Liittää teoksen teokseen, joka on peräkkäisesti ilmestyvä aggregoiva teos, joka vaikuttaa staattisen teoksen yleiseen toimituslinjaan, toiminta-alaan ja tyyliin. @fi
toolkit label: numero teoksessa @fi
toolkit definition: Teos, joka on peräkkäisesti ilmestyvä aggregoiva teos, joka vaikuttaa staattisen teoksen yleiseen toimituslinjaan, toiminta-alaan ja tyyliin. @fi
toolkit label: hefte i @no
toolkit definition: Et verk som er et påfølgende aggregert verk som er inspirert av den samlede redaksjonelle politikken, omfanget og stilen fra et statisk verk. @no
label: és número de @ca
definition: Relaciona una obra amb una obra que és una obra agregadora successiva que inspira la política editorial, l’abast i l’estil d’una obra estàtica. @ca
toolkit label: número de @ca
toolkit definition: Obra que és una obra agregadora successiva que inspira la política editorial, l’abast i l’estil d’una obra estàtica. @ca
has element type: 2
label: είναι στη σειρά @el
definition: Συνδέει ένα έργο με ένα έργο μέσα στο οποίο έχει κυκλοφορήσει το μέρος; ένας τίτλος του μεγαλύτερου έργου εμφανίζεται στο μέρος. @el
toolkit label: στη σειρά @el
toolkit definition: Ένα έργο μέσα στο οποίο έχει κυκλοφορήσει το μέρος; ένας τίτλος του μεγαλύτερου έργου εμφανίζεται στο μέρος. @el
label: száma a következőnek: @hu
definition: Hozzákapcsol egy művet egy folyamatos aggregáló műhöz, amely hatással van egy statikus mű szerkesztési elveire, tárgykörére és stílusára. @hu
alternative label: in series
scope note: An issue static work can be a single work or an aggregating work.
scope note: Staattisen teoksen numero voi olla yksittäisteos tai aggregoiva teos. @fi
alternative label: sisältyy sarjaan @fi
label: numero teoksessa @fi
label: er hefte i @no
definition: Relaterer et verk til et verk som er et påfølgende aggregert verk som er inspirert av den samlede redaksjonelle politikken, omfanget og stilen fra et statisk verk. @no
scope note: Et statisk verk av typen hefte kan være et enkeltverk eller et aggregert verk. @no
alternative label: i serie @no
label: is aflevering van @nl
definition: Relateert een werk aan een werk dat een successief aggregaatwerk is dat een statisch werk inspireert aangaande redactioneel beleid, scope en stijl. @nl
scope note: Een aflevering-statisch werk kan een enkel werk zijn of een aggregatiewerk. @nl
toolkit label: aflevering van @nl
toolkit definition: Een werk dat een successief aggregaatwerk is dat een statisch werk inspireert aangaande redactioneel beleid, scope en stijl. @nl
label: هو إصدارة لـ @ar
definition: يربط عمل بعمل تجميعي متتالٍ يلهِم السياسة التحريرية، والمجال، والأسلوب لعمل ثابت. @ar
scope note: إصدارة عمل ثابت يمكن أن تكون عملا منفردا أو عملا تجميعيا. @ar
alternative label: في سلسلة @ar
toolkit label: إصدارة لـ @ar
toolkit definition: عمل تجميعي متتالٍ يلهِم السياسة التحريرية، والمجال، والأسلوب لعمل ثابت. @ar
scope note: Un número d’obra estàtica pot ser una obra sola o una obra agregadora. @ca
alternative label: en una col·lecció @ca
scope note: En udgivelse af et statisk værk kan være et enkeltstående værk eller et aggregerende værk. @da
label: number seerias @et
definition: Seostab teose teosega, mis on staatilise teose toimetamispõhimõtteid, käsitlusala ja stiili suunav liitev järgteos. @et
scope note: Number staatilise teosena võib olla üksikteos või liitev teos. @et
toolkit label: number seerias @et
toolkit definition: Teos, mis on staatilise teose toimetamispõhimõtteid, käsitlusala ja stiili suunav liitev järgteos. @et
scope note: Eine Ausgabe eines statischen Werks kann ein Einzelwerk oder ein aggregierendes Werk sein. @de
alternative label: In einer Reihe @de
scope note: A részegységet alkotó statikus mű önálló vagy aggregáló mű is lehet. @hu
toolkit label: száma a következőnek: @hu
toolkit definition: Egy folyamatos aggregáló mű, amely hatással van egy statikus mű szerkesztési elveire, tárgykörére és stílusára. @hu
label: è fascicolo di @it
definition: Correla un'opera a un'opera aggregante consecutiva che ispira la politica editoriale complessiva, l’oggetto e lo stile di un'opera statica. @it
scope note: Un fascicolo di opera statica può essere un'opera singola o un'opera aggregante. @it

has issuing agent
status: Published
definition: Relates a work to an agent who issues a work.
type: Property
domain: C10001
toolkit label: issuing agent
toolkit definition: An agent who issues a work.
toolkit label: agent émetteur @fr
toolkit definition: Agent qui publie une œuvre. @fr
toolkit label: entidad editora @es
toolkit definition: Una persona, familia o entidad corporativa que publica una obra, tal como el órgano oficial de una entidad. @es
instruction number: 18.5
label: har agent, som er udstedende organ @da
definition: Relaterer et værk til en agent, som udgiver et værk. @da
toolkit label: agent, som er udstedende organ @da
toolkit definition: Agent, som udgiver et værk. @da
definition: Met une œuvre en relation avec un agent qui publie une œuvre. @fr
label: có tập thể công bố @vi
definition: Liên kết tác phẩm với tác nhân công bố tác phẩm, như là cơ quan chính thức của tập thể. @vi
toolkit label: tập thể công bố @vi
toolkit definition: Tác nhân công bố tác phẩm, như là cơ quan chính thức của tập thể. @vi
label: hat herausgebenden Akteur @de
definition: Setzt ein Werk in Beziehung zu einem Akteur, der ein Werk heraus gibt. @de
toolkit label: Herausgebender Akteur @de
toolkit definition: Ein Akteur, der ein Werk heraus gibt. @de
label: a pour agent émetteur @fr
definition: Liittää teoksen toimijaan, joka julkaisee teoksen. @fi
toolkit label: julkaisija (toimija) @fi
toolkit definition: Toimija, joka julkaisee teoksen. @fi
toolkit label: utgiver (agent) @no
toolkit definition: En agent som utgir et verk. @no
label: té com a agent d’entitat editora @ca
definition: Relaciona una obra amb un agent que publica una obra. @ca
toolkit label: agent d’entitat editora @ca
toolkit definition: Agent que publica una obra. @ca
has element type: 2
label: έχει οργανισμό έκδοσης @el
definition: Συνδέει ένα έργο με έναν φορέα, ο οποίος εκδίδει ένα έργο, όπως ένα επίσημο όργανο του οργάνου. @el
toolkit label: οργανισμός έκδοσης @el
toolkit definition: Ένας φορέας, ο οποίος εκδίδει ένα έργο, όπως ένα επίσημο όργανο του οργάνου. @el
label: kibocsátó ágense a következő: @hu
definition: Hozzákapcsol egy művet egy ágenshez, amely kibocsát egy művet. @hu
toolkit label: kibocsátó ágens: @hu
toolkit definition: Egy ágens, amely kibocsát egy művet. @hu
alternative label: issuing body
alternative label: julkaisija @fi
label: julkaisija (toimija) @fi
label: har utgiver (agent) @no
definition: Relaterer et verk til en agent som utgir et verk. @no
alternative label: utgiverorgan @no
sub property of: has related agent of work
lexical alias: issuingAgent.en
label: heeft uitvaardiger-actor @nl
definition: Relateert een werk aan een actor die een werk uitvaardigt. @nl
toolkit label: uitvaardiger-actor @nl
toolkit definition: Een actor die een werk uitvaardigt. @nl
label: له وكيل جهة إصدار @ar
definition: يربط بين عمل ووكيل يصدر عملا. @ar
alternative label: جهة إصدار @ar
toolkit label: وكيل جهة إصدار @ar
toolkit definition: وكيل يصدر عملا. @ar
alternative label: entitat editora @ca
alternative label: ansvarlig institution @da
label: väljaandja (tegija) @et
definition: Seostab teose tegijaga, kes annab teose välja. @et
alternative label: väljaandja @et
toolkit label: väljaandja (tegija) @et
toolkit definition: Tegija, kes annab teose välja. @et
alternative label: kibocsátó: @hu
label: ha come emittente agente @it
definition: Correla un'opera a un agente che emette un'opera. @it
alternative label: emittente @it
toolkit label: emittente agente @it
toolkit definition: Agente che emette un'opera. @it
alternative label: organisme de publication @fr
label: turpinājumizdevuma izdevējs (aģents) @lv
definition: Sasaista darbu ar aģentu, kas izdevis turpinājumizdevumu. @lv
toolkit label: turpinājumizdevuma izdevējs (aģents) @lv
toolkit definition: Aģents, kas izdevis turpinājumizdevumu. @lv
alternative label: Herausgebendes Organ @de
toolkit label: 颁布行为者 @zh-hans

has issuing collective agent
status: Published
definition: Relates a work to a collective agent who issues a work.
toolkit label: issuing collective agent
toolkit definition: A collective agent who issues a work.
type: Property
domain: C10001
has element type: 2
sub property of: has issuing agent
label: julkaisija (yhteistoimija) @fi
definition: Liittää teoksen yhteistoimijaan, joka julkaisee teoksen. @fi
toolkit label: julkaisija (yhteistoimija) @fi
toolkit definition: Yhteistoimija, joka julkaisee teoksen. @fi
label: har utgiver (kollektiv agent) @no
definition: Relaterer et verk til en kollektiv agent som utgir et verk. @no
toolkit label: utgiver (kollektiv agent) @no
toolkit definition: En kollektiv agent som utgir et verk. @no
sub property of: has related collective agent of work
lexical alias: issuingCollectiveAgent.en
label: heeft uitvaardiger-collectieve actor @nl
definition: Relateert een werk aan een collectieve actor die een werk uitvaardigt. @nl
toolkit label: uitvaardiger-collectieve actor @nl
toolkit definition: Een collectieve actor die een werk uitvaardigt. @nl
label: له وكيل جماعي جهة إصدار @ar
definition: يربط بين عمل ووكيل جماعي يصدر عملاً. @ar
toolkit label: وكيل جماعي جهة إصدار @ar
toolkit definition: وكيل جماعي يصدر عملاً. @ar
label: té com a agent col·lectiu d’entitat editora @ca
definition: Relaciona una obra amb un agent col·lectiu que publica una obra. @ca
toolkit label: agent col·lectiu d’entitat editora @ca
toolkit definition: Agent col·lectiu que publica una obra. @ca
label: har kollektiv agent, som er udstedende organ @da
definition: Relaterer et værk til en kollektiv agent, som udgiver et værk. @da
toolkit label: kollektiv agent, som er udstedende organ @da
toolkit definition: Kollektiv agent, som udgiver et værk. @da
label: väljaandja (kollektiiv) @et
definition: Seostab teose kollektiiviga, kes annab teose välja. @et
toolkit label: väljaandja (kollektiiv) @et
toolkit definition: Kollektiiv, kes annab teose välja. @et
label: hat herausgebenden gemeinschaftlichen Akteur @de
definition: Setzt ein Werk in Beziehung zu einem gemeinschaftlichen Akteur, der ein Werk heraus gibt. @de
toolkit label: Herausgebender gemeinschaftlicher Akteur @de
toolkit definition: Ein gemeinschaftlicher Akteur, der ein Werk heraus gibt. @de
label: kibocsátó kollektív ágense a következő: @hu
definition: Hozzákapcsol egy művet egy kollektív ágenshez, amely kibocsát egy művet. @hu
toolkit label: kibocsátó kollektív ágens: @hu
toolkit definition: Egy kollektív ágens, amely kibocsát egy művet. @hu
label: ha come emittente agente collettivo @it
definition: Correla un'opera a un agente collettivo che emette un'opera. @it
toolkit label: emittente agente collettivo @it
toolkit definition: Agente collettivo che emette un'opera. @it
label: a pour agent collectif émetteur @fr
definition: Met une œuvre en relation avec un agent collectif qui publie une œuvre. @fr
toolkit label: agent collectif émetteur @fr
toolkit definition: Agent collectif qui publie une œuvre. @fr
label: turpinājumizdevuma izdevējs (grupa) @lv
definition: Sasaista darbu ar grupu, kas izdevusi darbu. @lv
toolkit label: turpinājumizdevuma izdevējs (grupa) @lv
toolkit definition: Grupa, kas izdevusi darbu. @lv
label: 有颁布集体行为者 @zh-hans
definition: 将一种作品与颁布一种作品的一个集体行为者关联起来。 @zh-hans
toolkit label: 颁布集体行为者 @zh-hans
toolkit definition: 颁布一种作品的一个集体行为者 @zh-hans
has subproperty: has issuing corporate body
has subproperty: has issuing family
has subproperty: P10503
label: piyasaya çıkaran kolektif temsilcisi ile ilişkilidir @tr
definition: Bir eseri, bir eser yayınlayan kolektif bir temsilci ile ilişkilendirir. @tr
toolkit label: Yayınlayan kolektif temsilci @tr
toolkit definition: Bir eser yayınlayan kolektif bir temsilci. @tr

has issuing corporate body
status: Published
definition: Relates a work to a corporate body who issues a work.
toolkit label: issuing corporate body
toolkit definition: A corporate body who issues a work.
type: Property
domain: C10001
has element type: 2
sub property of: has issuing collective agent
label: julkaisija (yhteisö) @fi
definition: Liittää teoksen yhteisöön, joka julkaisee teoksen. @fi
toolkit label: julkaisija (yhteisö) @fi
toolkit definition: Yhteisö, joka julkaisee teoksen. @fi
label: har utgiver (korporasjon) @no
definition: Relaterer et verk til en korporasjon som utgir et verk. @no
toolkit label: utgiver (korporasjon) @no
toolkit definition: En korporasjon som utgir et verk. @no
sub property of: has related corporate body of work
lexical alias: issuingCorporateBody.en
label: heeft uitvaardiger-corporatie @nl
definition: Relateert een werk aan een corporatie die een werk uitvaardigt. @nl
toolkit label: uitvaardiger-corporatie @nl
toolkit definition: Een corporatie die een werk uitvaardigt. @nl
label: له هيئة جهة إصدار @ar
definition: يربط بين عمل وهيئة تصدر عملاً. @ar
toolkit label: هيئة جهة إصدار @ar
toolkit definition: هيئة تصدر عملاً. @ar
label: té com a entitat corporativa d’entitat editora @ca
definition: Relaciona una obra amb una entitat corporativa que publica una obra. @ca
toolkit label: entitat corporativa d’entitat editora @ca
toolkit definition: Entitat corporativa que publica una obra. @ca
label: har korporation, som er udstedende organ @da
definition: Relaterer et værk til en korporation, som udgiver et værk. @da
toolkit label: korporation, som er udstedende organ @da
toolkit definition: Korporation, som udgiver et værk. @da
label: väljaandja (asutus) @et
definition: Seostab teose asutusega, kes annab teose välja. @et
toolkit label: väljaandja (asutus) @et
toolkit definition: Asutus, kes annab teose välja. @et
label: hat herausgebende Körperschaft @de
definition: Setzt ein Werk in Beziehung zu einer Körperschaft, die ein Werk heraus gibt. @de
toolkit label: Herausgebende Körperschaft @de
toolkit definition: Eine Körperschaft, die ein Werk heraus gibt. @de
label: kibocsátó testülete a következő: @hu
definition: Hozzákapcsol egy művet egy testülethez, amely kibocsát egy művet. @hu
toolkit label: kibocsátó testület: @hu
toolkit definition: Egy testület, amely kibocsát egy művet. @hu
label: ha come emittente ente @it
definition: Correla un'opera a un ente che emette un'opera. @it
toolkit label: emittente ente @it
toolkit definition: Ente che emette un'opera. @it
label: a pour collectivité émettrice @fr
definition: Met une œuvre en relation avec une collectivité qui publie une œuvre. @fr
toolkit label: collectivité émettrice @fr
toolkit definition: Collectivité qui publie une œuvre. @fr
label: turpinājumizdevuma izdevējs (institūcija) @lv
definition: Sasaista darbu ar institūciju, kas izdevusi darbu. @lv
toolkit label: turpinājumizdevuma izdevējs (institūcija) @lv
toolkit definition: Institūcija, kas izdevusi darbu. @lv
label: 有颁布团体 @zh-hans
definition: 将一种作品与颁布一种作品的一个团体关联起来。 @zh-hans
toolkit label: 颁布团体 @zh-hans
toolkit definition: 颁布一种作品的一个团体 @zh-hans
has subproperty: P10550
label: piyasaya çıkaran tüzel kişisi ile ilişkilidir @tr
definition: Bir eseri, eser yayınlayan tüzel kişi ilişkilendirir. @tr
toolkit label: Yayınlan tüzel kişi @tr
toolkit definition: Bir eseri yayınlayan tüzel kişi. @tr

has issuing family
status: Published
definition: Relates a work to a family who issues a work.
toolkit label: issuing family
toolkit definition: A family who issues a work.
type: Property
domain: C10001
has element type: 2
sub property of: has issuing collective agent
label: julkaisija (suku) @fi
definition: Liittää teoksen sukuun, joka julkaisee teoksen. @fi
toolkit label: julkaisija (suku) @fi
toolkit definition: Suku, joka julkaisee teoksen. @fi
label: har utgiver (familie) @no
definition: Relaterer et verk til en familie som utgir et verk. @no
toolkit label: utgiver (familie) @no
toolkit definition: En familie som utgir et verk. @no
sub property of: has related family of work
lexical alias: issuingFamily.en
label: heeft uitvaardiger-familie @nl
definition: Relateert een werk aan een familie die een werk uitvaardigt. @nl
toolkit label: uitvaardiger-familie @nl
toolkit definition: Een familie die een werk uitvaardigt. @nl
label: له عائلة جهة إصدار @ar
definition: يربط بين عمل وعائلة تصدر عملاً. @ar
toolkit label: عائلة جهة إصدار @ar
toolkit definition: عائلة تصدر عملاً. @ar
label: té com a família d’entitat editora @ca
definition: Relaciona una obra amb una família que publica una obra. @ca
toolkit label: família d’entitat editora @ca
toolkit definition: Família que publica una obra. @ca
label: har familie, som er udstedende organ @da
definition: Relaterer et værk til en familie, som udgiver et værk. @da
toolkit label: familie, som er udstedende organ @da
toolkit definition: Familie, som udgiver et værk. @da
label: väljaandja (perekond) @et
definition: Seostab teose perekonnaga, kes annab teose välja. @et
toolkit label: väljaandja (perekond) @et
toolkit definition: Perekond, kes annab teose välja. @et
label: hat herausgebende Familie @de
definition: Setzt ein Werk in Beziehung zu einer Familie, die ein Werk heraus gibt. @de
toolkit label: Herausgebende Familie @de
toolkit definition: Eine Familie, die ein Werk heraus gibt. @de
label: kibocsátó családja a következő: @hu
definition: Hozzákapcsol egy művet egy családhoz, amely kibocsát egy művet. @hu
toolkit label: kibocsátó család: @hu
toolkit definition: Egy család, amely kibocsát egy művet. @hu
label: ha come emittente famiglia @it
definition: Correla un'opera a una famiglia che emette un'opera. @it
toolkit label: emittente famiglia @it
toolkit definition: Famiglia che emette un'opera. @it
label: a pour famille émettrice @fr
definition: Met une œuvre en relation avec une famille qui publie une œuvre. @fr
toolkit label: famille émettrice @fr
toolkit definition: Famille qui publie une œuvre. @fr
label: turpinājumizdevuma izdevējs (dzimta/ģimene) @lv
definition: Sasaista darbu ar dzimtu/ģimeni, kas izdevusi darbu. @lv
toolkit label: turpinājumizdevuma izdevējs (dzimta/ģimene) @lv
toolkit definition: Dzimta/ģimene, kas izdevusi darbu. @lv
label: 有颁布家族 @zh-hans
definition: 将一种作品与颁布一种作品的一个家族关联起来。 @zh-hans
toolkit label: 颁布家族 @zh-hans
toolkit definition: 颁布一种作品的一个家族 @zh-hans
has subproperty: P10597
label: piyasaya çıkaran ailesi ile ilişkilidir @tr
definition: Bir eseri, eser yayınlayan bir aileyle ilişkilendirir. @tr
toolkit label: Yayınlayan aile @tr
toolkit definition: Bir eseri düzenleyen bir aile. @tr

has issuing person
status: Published
definition: Relates a work to a person who issues a work.
toolkit label: issuing person
toolkit definition: A person who issues a work.
type: Property
domain: C10001
has element type: 2
sub property of: has issuing agent
label: julkaisija (henkilö) @fi
definition: Liittää teoksen henkilöön, joka julkaisee teoksen. @fi
toolkit label: julkaisija (henkilö) @fi
toolkit definition: Henkilö, joka julkaisee teoksen. @fi
label: har utgiver (person) @no
definition: Relaterer et verk til en person som utgir et verk. @no
toolkit label: utgiver (person) @no
toolkit definition: En person som utgir et verk. @no
sub property of: has related person of work
lexical alias: issuingPerson.en
label: heeft uitvaardiger-persoon @nl
definition: Relateert een werk aan een persoon die een werk uitvaardigt. @nl
toolkit label: uitvaardiger-persoon @nl
toolkit definition: Een persoon die een werk uitvaardigt. @nl
label: له شخص جهة إصدار @ar
definition: يربط بين عمل وشخص يصدر عملاً. @ar
toolkit label: شخص جهة إصدار @ar
toolkit definition: شخص يصدر عملاً. @ar
label: té com a persona d’entitat editora @ca
definition: Relaciona una obra amb una persona que publica una obra. @ca
toolkit label: persona d’entitat editora @ca
toolkit definition: Persona que publica una obra. @ca
label: har person, som er udstedende organ @da
definition: Relaterer et værk til en person, som udgiver et værk. @da
toolkit label: person, som er udstedende organ @da
toolkit definition: Person, som udgiver et værk. @da
label: väljaandja (isik) @et
definition: Seostab teose isikuga, kes annab teose välja. @et
toolkit label: väljaandja (isik) @et
toolkit definition: Isik, kes annab teose välja. @et
label: hat herausgebende Person @de
definition: Setzt ein Werk in Beziehung zu einer Person, die ein Werk heraus gibt. @de
toolkit label: Herausgebende Person @de
toolkit definition: Eine Person, die ein Werk heraus gibt. @de
label: kibocsátó személye a következő: @hu
definition: Hozzákapcsol egy művet egy személyhez, aki kibocsát egy művet. @hu
toolkit label: kibocsátó személy: @hu
toolkit definition: Egy személy, aki kibocsát egy művet. @hu
label: ha come emittente persona @it
definition: Correla un'opera a una persona che emette un'opera. @it
toolkit label: distributore persona @it
toolkit definition: Persona che distribuisce un'opera. @it
label: a pour personne émettrice @fr
definition: Met une œuvre en relation avec une personne qui publie une œuvre. @fr
toolkit label: personne émettrice @fr
toolkit definition: Personne qui publie une œuvre. @fr
label: turpinājumizdevuma izdevējs (persona) @lv
definition: Sasaista darbu ar personu, kura izdevusi darbu. @lv
toolkit label: turpinājumizdevuma izdevējs (persona) @lv
toolkit definition: Persona, kura izdevusi darbu. @lv
label: 有颁布个人 @zh-hans
definition: 将一种作品与颁布一种作品的一个个人关联起来。 @zh-hans
toolkit label: 颁布个人 @zh-hans
toolkit definition: 颁布一种作品的一个个人 @zh-hans
has subproperty: P10456
label: piyasaya çıkaran kişisi ile ilişkilidir @tr
definition: Bir eseri, bir eseri yayıınlayan kişiyle ilişkilendirir. @tr
toolkit label: Yayınlayan kişi @tr
toolkit definition: Bir eser yayınlayan kişi. @tr

has right ascension
status: Published
type: Property
lexical alias: rightAscension.en
definition: Relates a work to the angular distance of a celestial body that is measured eastward on the equator from the vernal equinox to the hour circle through the body, from 0 to 24 hours.
domain: C10001
toolkit label: right ascension
toolkit definition: The angular distance of a celestial body that is measured eastward on the equator from the vernal equinox to the hour circle through the body, from 0 to 24 hours.
instruction number: 7.4.4
label: har rektascension @da
definition: Relaterer et værk til en vinkelafstand målt mod øst ved ækvator fra forårsjævndøgn til timekransen gennem et himmellegeme, fra 0 til 24 timer. @da
toolkit label: rektascension @da
toolkit definition: Vinkelafstand målt mod øst ved ækvator fra forårsjævndøgn til timekransen gennem et himmellegeme, fra 0 til 24 timer. @da
label: có độ xích kinh @vi
definition: Liên kết tác phẩm với khoảng cách góc được đo theo hướng đông trên xích đạo từ điểm xuân phân tới vòng cung giờ qua vật thể bầu trời, từ 0 đến 24 giờ. @vi
toolkit label: độ xích kinh @vi
toolkit definition: Khoảng cách góc được đo theo hướng đông trên xích đạo từ điểm xuân phân tới vòng cung giờ qua vật thể bầu trời, từ 0 đến 24 giờ. @vi
label: hat Rektaszension @de
definition: Setzt ein Werk in Beziehung zu dem Winkelabstand eines Himmelskörpers zwischen dem Frühlingspunkt und dem Längenkreis, der auf der Äquatorebene gegen den Uhrzeigersinn gemessen und in einem Maß von 0 bis 24 Stunden angegeben wird. @de
toolkit label: Rektaszension @de
toolkit definition: Der Winkelabstand eines Himmelskörpers zwischen dem Frühlingspunkt und dem Längenkreis, der auf der Äquatorebene gegen den Uhrzeigersinn gemessen und in einem Maß von 0 bis 24 Stunden angegeben wird. @de
definition: Liittää teoksen taivaankappaleen kulmaetäisyyteen, joka on mitattu aikamitoissa taivaanekvaattoria pitkin kevättasauspisteestä vastapäivään. @fi
toolkit label: rektaskensio @fi
toolkit definition: Taivaankappaleen kulmaetäisyys, joka on mitattu aikamitoissa taivaanekvaattoria pitkin kevättasauspisteestä vastapäivään. @fi
toolkit label: rektascensjon @no
toolkit definition: En vinkelavstand til et himmellegeme målt østover langs ekvator fra vårjevndøgn til deklinasjonssirkelen gjennom et himmellegeme, fra 0 til 24 timer. @no
label: té com a ascensió recta @ca
definition: Relaciona una obra amb la distància angular d’un cos celeste que es mesura de 0 a 24 h, al llarg de l’equador en direcció est, des de l’equinocci vernal al cercle horari passant pel cos celeste. @ca
toolkit label: ascensió recta @ca
toolkit definition: La distància angular d’un cos celeste que es mesura de 0 a 24 h, al llarg de l’equador en direcció est, des de l’equinocci vernal al cercle horari passant pel cos celeste. @ca
label: a pour ascension droite @fr
definition: Met une œuvre en relation avec une distance angulaire d’un corps céleste qui est mesurée de 0 h à 24 h, le long de l’équateur en direction de l’est, du point vernal de l’équinoxe au cercle horaire passant par le corps. @fr
toolkit label: ascension droite @fr
toolkit definition: Distance angulaire d’un corps céleste qui est mesurée de 0 h à 24 h, le long de l’équateur en direction de l’est, du point vernal de l’équinoxe au cercle horaire passant par le corps. @fr
has element type: 6
label: έχει ορθή αναφορά @el
definition: Συνδέει ένα έργο με μια γωνιακή απόσταση που μετριέται στο εαρινό σημείο πάνω στον ισημερινό από την εαρινή ισημερία μέχρι τον ωρικό κύκλο του ουράνιου σώματος, από 0 μέχρι 24 ώρες. @el
toolkit label: ορθή αναφορά @el
toolkit definition: Μια γωνιακή απόσταση που μετριέται στο εαρινό σημείο πάνω στον ισημερινό από την εαρινή ισημερία μέχρι τον ωρικό κύκλο του ουράνιου σώματος, από 0 μέχρι 24 ώρες. @el
label: rektaszcenziója a következő: @hu
definition: Hozzákapcsol egy művet az egyenlítőtől keletre mért szögtávolsághoz a tavaszi napéjegyenlőségtől az órakörig egy égitesten keresztül, 0-tól 24 óráig. @hu
toolkit label: rektaszcenziója: @hu
toolkit definition: Az egyenlítőtől keletre mért szögtávolság a tavaszi napéjegyenlőségtől az órakörig egy égitesten keresztül, 0-tól 24 óráig. @hu
label: rektaskensio @fi
label: har rektascensjon @no
definition: Relaterer et verk til en vinkelavstand til et himmellegeme målt østover langs ekvator fra vårjevndøgn til deklinasjonssirkelen gjennom et himmellegeme, fra 0 til 24 timer. @no
label: heeft rechte klimming @nl
definition: geen nieuwe vert nodig, bevatte tikfout in Engelse versie, geen inhoudelijke wijziging. @nl
toolkit label: rechte klimming @nl
toolkit definition: geen nieuwe vert nodig, bevatte tikfout in Engelse versie, geen inhoudelijke wijziging. @nl
label: له صعود مستقيم @ar
definition: يربط بين عمل ومسافة زاوية لجرم سماوي مقاسة باتجاه الشرق على خط الاستواء من الاعتدال الربيعي إلى دائرة الساعة عبر الجرم السماوي، من 0 إلى 24 ساعة. @ar
toolkit label: صعود مستقيم @ar
toolkit definition: مسافة زاوية لجرم سماوي مقاسة باتجاه الشرق على خط الاستواء من الاعتدال الربيعي إلى دائرة الساعة عبر الجرم السماوي، من 0 إلى 24 ساعة. @ar
label: otsetõus @et
definition: Seostab teose nurkkaugusega, mis on mõõdetud tundides, minutites ja sekundites taevaekvaatoril kevadpunktist ida suunas taevakeha käänderingini. @et
toolkit label: otsetõus @et
toolkit definition: Nurkkaugus, mis on mõõdetud tundides, minutites ja sekundites taevaekvaatoril kevadpunktist ida suunas taevakeha käänderingini. @et
label: ha come ascensione retta @it
definition: Correla un’opera a una distanza angolare misurata a Est sull’equatore dall’equinozio invernale al circolo dell’ora mediante un corpo celeste, da 0 a 24 ore. @it
toolkit label: ascensione retta @it
toolkit definition: Distanza angolare misurata a Est sull’equatore dall’equinozio invernale al circolo dell’ora mediante un corpo celeste, da 0 a 24 ore. @it
label: rektascensija @lv
definition: Sasaista darbu ar koordinātēm ekvatoriālajā koordinātu sistēmā, ko skaita pa debess ekvatoru no pavasara punkta pretēji pulksteņrādītāja virzienam līdz spīdekļa deklināciju riņķim. Rektascensija mainās robežās no 0h līdz 24h. (Letonika.lv). @lv
toolkit label: rektascensija @lv
toolkit definition: Koordināta ekvatoriālajā koordinātu sistēmā, ko skaita pa debess ekvatoru no pavasara punkta pretēji pulksteņrādītāja virzienam līdz spīdekļa deklināciju riņķim. Rektascensija mainās robežās no 0h līdz 24h. (Letonika.lv) @lv
label: 有赤经 @zh-hans
definition: 将一种作品与天体赤道上从春分点到时圈向东度量的角距离（从0到24小时）关联起来。 @zh-hans
toolkit label: 赤经 @zh-hans
toolkit definition: 天体赤道上从春分点到时圈向东度量的角距离（从0到24小时） @zh-hans
has subproperty: P10302
label: yükseliş ile ilişkilidir @tr
definition: Bir eseri, bir gök cisminin ilkbahar ekinoksundan ekvator üzerinde doğuya doğru ölçülen açısal mesafesini, 0'dan 24 saate kadar cismin içinden geçen saat çemberiyle ilişkilendirir. @tr
toolkit label: yükseliş @tr
toolkit definition: Bir cismin ilkbahar ekinoksundan 0'dan 24 saate kadar içinden geçen saat dairesine kadar ekvator üzerinde doğuya doğru ölçülen bir gök cisminin açısal mesafesi. @tr

has right ascension and declination
status: Published
definition: Relates a work to a place that is the location of a celestial body that is the coverage of a cartographic work and is identified using the angles of right ascension and declination.
type: Property
domain: C10001
sub property of: has coordinates of cartographic content
lexical alias: rightAscensionAndDeclination.en
instruction number: 7.4.4
toolkit label: right ascension and declination
toolkit definition: A place that is the location of a celestial body that is the coverage of a cartographic work and is identified using the angles of right ascension and declination.
toolkit label: ascension droite et déclinaison @fr
toolkit definition: Lieu qui constitue l’emplacement d’un corps céleste constituant la couverture d’une œuvre cartographique et identifié à l’aide des angles d’ascension droite et de déclinaison. @fr
toolkit label: ascensión recta y declinación @es
toolkit definition: Un sistema para identificar la localización de un objeto celeste en el firmamento que está incluido en el contenido cartográfico de un recurso que utiliza los ángulos de ascensión directa y de declinación. @es
label: har rektascension och deklination @sv
toolkit label: rektascension och deklination @sv
label: har rektascension og deklination @da
definition: Relaterer et værk til et system til identificering af placeringen af et himmellegeme på himlen, som dækkes af et værks kartografiske indhold, ved anvendelse af vinklerne for rektascension og deklination. @da
toolkit label: rektascension og deklination @da
toolkit definition: System til identificering af placeringen af et himmellegeme på himlen, som dækkes af et værks kartografiske indhold, ved anvendelse af vinklerne for rektascension og deklination. @da
definition: Met une œuvre en relation avec un lieu qui constitue l’emplacement d’un corps céleste constituant la couverture d’une œuvre cartographique et identifié à l’aide des angles d’ascension droite et de déclinaison. @fr
label: có độ xích kinh và độ lệch @vi
definition: Liên kết tác phẩm với hệ thống để nhận dạng địa điểm của vật thể vũ trụ trong bầu trời bằng cách bao quát bằng nội dung bản đồ của tác phẩm dùng góc của độ xích kinh và độ lệch. @vi
toolkit label: độ xích kinh và độ lệch @vi
toolkit definition: Hệ thống để nhận dạng địa điểm của vật thể vũ trụ trong bầu trời bằng cách bao quát bằng nội dung bản đồ của tác phẩm dùng góc của độ xích kinh và độ lệch. @vi
label: hat Rektaszension und Deklination @de
definition: Setzt ein Werk in Beziehung zu einem Ort, bei dem es sich um die Position eines Himmelskörpers handelt, der Gegenstand eines kartografischen Werks ist, und anhand der Winkel der Rektaszension und der Deklination identifiziert wird. @de
toolkit label: Rektaszension und Deklination @de
toolkit definition: Ein Ort, bei dem es sich um die Position eines Himmelskörpers handelt, der Gegenstand eines kartografischen Werks ist, und anhand der Winkel der Rektaszension und der Deklination identifiziert wird. @de
label: a pour ascension droite et déclinaison @fr
definition: Liittää teoksen paikkaan, joka on taivaankappaleen sijainti, jonka kartografinen teos kattaa ja joka on identifioitu käyttämällä rektaskension ja deklinaation kulmamittoja. @fi
toolkit label: rektaskensio ja deklinaatio @fi
toolkit definition: Paikka, joka on taivaankappaleen sijainti, jonka kartografinen teos kattaa ja joka on identifioitu käyttämällä rektaskension ja deklinaation kulmamittoja. @fi
toolkit label: rektascensjon og deklinasjon @no
toolkit definition: Et system for å identifisere plasseringen til et himmellegeme som dekkes av det kartografiske innholdet til et verk, ved hjelp av vinklene for rektascensjon og deklinasjon. @no
label: té com a ascensió recta i declinació @ca
definition: Relaciona una obra amb un lloc que és la localització d’un cos celeste que és la cobertura d’una obra cartogràfica i s’identifica mitjançant els angles d’ascensió recta i de declinació. @ca
toolkit label: ascensió recta i declinació @ca
toolkit definition: Lloc que és la localització d’un cos celeste que és la cobertura d’una obra cartogràfica i s’identifica mitjançant els angles d’ascensió recta i de declinació. @ca
has element type: 3
label: έχει ορθή αναφορά και απόκλιση @el
definition: Συνδέει ένα έργο με ένα σύστημα για την ταύτιση της τοποθεσίας ενός ουράνιου αντικειμένου στον ουρανό που καλύπτεται από το χαρτογραφικό περιεχόμενο ενός έργου χρησιμοποιώντας τις γωνίες της ορθής αναφοράς και απόκλισης. @el
toolkit label: ορθή αναφορά και απόκλιση @el
toolkit definition: Ένα σύστημα για την ταύτιση της τοποθεσίας του ουράνιου αντικειμένου στον ουρανό που καλύπτεται από το χαρτογραφικό περιεχόμενο ενός έργου χρησιμοποιώντας τις γωνίες της ορθής αναφοράς και απόκλισης. @el
label: rektaszcenziója és deklinációja a következő: @hu
definition: Hozzákapcsol egy művet egy helyhez, amely egy kartográfiai mű által, rektaszcenzió és deklináció szögei segítségével, meghatározott égitest helyzete az égbolton. @hu
toolkit label: rektaszcenziója és deklinációja: @hu
toolkit definition: Egy hely, amely egy kartográfiai mű által, rektaszcenzió és deklináció szögei segítségével, meghatározott égitest helyzete az égbolton. @hu
label: rektaskensio ja deklinaatio @fi
label: har rektascensjon og deklinasjon @no
definition: Relaterer et verk til et system for å identifisere plasseringen til et himmellegeme som dekkes av det kartografiske innholdet til et verk, ved hjelp av vinklene for rektascensjon og deklinasjon. @no
label: heeft rechte klimming en declinatie @nl
definition: Relateert een werk aan een plaats die is de locatie van een hemellichaam dat is de dekking van een cartografisch werk en is geïdentificeerd met gebruikmaking van de hoeken voor rechte klimming en declinatie. @nl
toolkit label: rechte klimming en declinatie @nl
toolkit definition: Een plaats die is de locatie van een hemellichaam dat is de dekking van een cartografisch werk en is geïdentificeerd met gebruikmaking van de hoeken voor rechte klimming en declinatie. @nl
label: له صعود مستقيم وانحراف @ar
definition: يربط بين عمل ومكان عبارة عن موقع جسم سماوي هو نطاق تغطية محتوى خرائطي لعمل ومحدد باستخدام زوايا الصعود المستقيم والانحراف. @ar
toolkit label: صعود مستقيم وانحراف @ar
toolkit definition: مكان عبارة عن موقع جسم سماوي هو نطاق تغطية محتوى خرائطي لعمل ومحدد باستخدام زوايا الصعود المستقيم والانحراف. @ar
label: otsetõus ja kääne @et
definition: Seostab teose süsteemiga, mille abil tuvastatakse teose kartograafilises sisus hõlmatud taevakeha asukoht taevas, kasutades otsetõusu ja käände nurgamõõte. @et
toolkit label: otsetõus ja kääne @et
toolkit definition: Süsteem, mille abil tuvastatakse teose kartograafilises sisus hõlmatud taevakeha asukoht taevas, kasutades otsetõusu ja käände nurgamõõte. @et
label: ha come ascensione retta e declinazione @it
definition: Correla un’opera a un sistema per identificare l’ubicazione di un oggetto celeste nel cielo coperto dal contenuto cartografico di un’opera che utilizza gli angoli di ascensione retta e declinazione. @it
toolkit label: ascensione retta e declinazione @it
toolkit definition: Sistema per identificare l’ubicazione di un oggetto celeste nel cielo coperto dal contenuto cartografico di un’opera che utilizza gli angoli di ascensione retta e declinazione. @it
label: rektascensija un deklinācija @lv
definition: Sasaista darbu ar vietu, kas ir teritorija identifikācijas sistēmas debess objekta vietas noteikšanai resursa kartogrāfiskajā saturā ietvertajā debess juma attēlojumā, izmantojot rektascensijas un deklinācijas leņķus. @lv
toolkit label: rektascensija un deklinācija @lv
toolkit definition: Identifikācijas sistēma debess objekta vietas noteikšanai resursa kartogrāfiskajā saturā ietvertajā debess juma attēlojumā, izmantojot rektascensijas un deklinācijas leņķus. @lv
label: 有赤经和赤纬 @zh-hans
definition: 将一种作品与作为一个天体的位置并作为一种地图作品的覆盖范围并用赤经和赤纬的角度标识的一个地点关联起来。 @zh-hans
toolkit label: 赤经和赤纬 @zh-hans
toolkit definition: 作为一个天体的位置并作为一种地图作品的覆盖范围并用赤经和赤纬的角度标识的一个地点 @zh-hans
has subproperty: P10082
label: yükseliş ve sapma ile ilişkilidir @tr
definition: Bir eseri, kartografik bir çalışmanın kapsamı olan ve dik yükseliş ve eğim açıları kullanılarak tanımlanan bir gök cisminin konumu olan bir yerle ilişkilendirir. @tr
toolkit label: yükseliş ve sapma @tr
toolkit definition: Kartografik bir çalışmanın kapsamı olan ve dik yükseliş ve eğim açıları kullanılarak tanımlanan bir gök cisminin konumu olan bir yer. @tr

har jurisdiktion underlagt
status: Deprecated
type: Property
domain: C10001
sub property of: has other agent associated with work (Deprecated)
lexical alias: jurisdictionGoverned.en
toolkit label: juridiction régie @fr
toolkit definition: Juridiction régie par une loi, un règlement, etc. qui a été promulgué par une autre juridiction. @fr
toolkit label: jurisdicción regulada @es
toolkit definition: Una jurisdicción en la que se aplica una ley, disposición, etc., que fue promulgada por otra jurisdicción. @es
instruction number: 18.5
definition: Relaterer et værk til en domsmyndighed, der er underlagt en lov, forordning etc., der er vedtaget af en anden domsmyndighed. @da
toolkit label: jurisdiktion underlagt @da
toolkit definition: Domsmyndighed, der er underlagt en lov, forordning etc., der er vedtaget af en anden domsmyndighed. @da
definition: Met une œuvre en relation avec une juridiction régie par une loi, un règlement, etc. qui a été promulgué par une autre juridiction. @fr
label: có thẩm quyền được điều hành @vi
definition: Liên kết tác phẩm với khu vực pháp quyền được điều hành bởi luật, quyết định, v.v... được công bố bởi khu vực pháp quyền khác. @vi
toolkit label: thẩm quyền được điều hành @vi
toolkit definition: Khu vực pháp quyền được điều hành bởi luật, quyết định, v.v... Được công bố bởi khu vực pháp quyền khác. @vi
label: hat geregelte Gebietskörperschaft @de
definition: Setzt ein Werk mit einer Gebietskörperschaft, die durch ein Gesetz, eine Verordnung usw. geregelt wird, das/die von einer anderen Gebietskörperschaft erlassen wurde, in Beziehung. @de
toolkit label: Geregelte Gebietskörperschaft @de
toolkit definition: Eine Gebietskörperschaft, die durch ein Gesetz, eine Verordnung usw. geregelt wird, das/die von einer anderen Gebietskörperschaft erlassen wurde. @de
label: a pour juridiction régie @fr
label: soveltava lainkäyttöalue @fi
definition: Liittää teoksen lainkäyttöalueeseen, jossa sovelletaan toisessa lainkäyttöalueessa säädettyä lakia, asetusta tms @fi
toolkit label: soveltava lainkäyttöalue @fi
toolkit definition: Lainkäyttöalue, jossa sovelletaan toisessa lainkäyttöalueessa säädettyä lakia, asetusta tms @fi
toolkit label: jurisdiksjon som styres @no
toolkit definition: En jurisdiksjon som styres av en lov, vedtekt, etc. som ble vedtatt i en annen jurisdiksjon. @no
label: té com a jurisdicció regida @ca
definition: Relaciona una obra amb una jurisdicció regida per una llei, un reglament, etc., promulgat per una altra jurisdicció. @ca
toolkit label: jurisdicció regida @ca
toolkit definition: Jurisdicció regida per una llei, un reglament, etc., promulgat per una altra jurisdicció. @ca
label: έχει δικαιοδοσία που κυβερνάται από @el
definition: Συνδέει ένα έργο με μια δικαιοδοσία, που διέπεται από έναν νόμο, κανονισμό κ.λπ., που θεσπίζεται από κάποια άλλη δικαιοδοσία. @el
toolkit label: δικαιοδοσία κυβερνάται από @el
toolkit definition: Mια δικαιοδοσία, που διέπεται από έναν νόμο, κανονισμό κ.λπ., που θεσπίζεται από κάποια άλλη δικαιοδοσία. @el
has subproperty: P10018

has cadenza work
status: Published
definition: Relates a work to a work that is a musical work that is an ornamental passage for a soloist added to a musical work, such as a concerto, by the same or a different composer.
type: Property
domain: C10001
sub property of: is augmented by work
lexical alias: cadenzaWork.en
toolkit label: cadenza work
toolkit definition: A work that is a musical work that is an ornamental passage for a soloist added to a musical work, such as a concerto, by the same or a different composer.
toolkit label: cadence (œuvre) @fr
toolkit definition: Œuvre musicale qui consiste en un passage ornemental pour soliste ajouté à une œuvre musicale, telle qu’un concerto, du même compositeur ou d’un compositeur différent. @fr
toolkit label: cadencia (obra) @es
toolkit definition: Una obra musical que consiste en un pasaje ornamental para solista, agregada a una obra musical como un concierto, por igual o diferente compositor. @es
instruction number: 24.5
label: har kadenceværk @da
definition: Relaterer et værk til et musikværk, der består af en ornamental passage for solist, som er tilføjet et musikværk såsom en koncert, enten af den samme komponist eller af en anden. @da
toolkit label: kadenceværk @da
toolkit definition: Musikværk, der består af en ornamental passage for en solist, som er tilføjet et musikværk såsom en koncert, enten af den samme komponist eller af en anden. @da
definition: Met une œuvre en relation avec une œuvre musicale qui consiste en un passage ornemental pour soliste ajouté à une œuvre musicale, telle qu’un concerto, du même compositeur ou d’un compositeur différent. @fr
label: là cadenza (tác phẩm) @vi
definition: Liên kết tác phẩm với tác phẩm âm nhạc có chứa đoạn trang hoàng cho người độc tấu, thêm vào tác phẩm âm nhạc như là côngxéctô, bất kể cùng hoặc khác người soạn. @vi
toolkit label: tác phẩm cadenza @vi
toolkit definition: Tác phẩm âm nhạc có chứa đoạn trang hoàng cho người độc tấu, thêm vào tác phẩm âm nhạc như là côngxéctô, bất kể cùng hoặc khác người soạn. @vi
label: ist Kadenz (Werk) @de
definition: Setzt ein Werk in Beziehung zu einem Musikwerk, das aus einer ausgeschmückten Passage für eine Solistin/einen Solisten besteht, die einem Musikwerk, wie zum Beispiel einem Konzert, entweder von derselben/demselben oder einer/einem anderen Komponistin/Komponisten hinzugefügt wird. @de
toolkit label: Kadenz (Werk) @de
toolkit definition: Ein Musikwerk, das aus einer ausgeschmückten Passage für eine Solistin/einen Solisten besteht, die einem Musikwerk, wie zum Beispiel einem Konzert, entweder von derselben/demselben oder einer/einem anderen Komponistin/Komponisten hinzugefügt wird. @de
label: a pour cadence (œuvre) @fr
definition: Liittää teoksen musiikkiteokseen, joka on solistille tarkoitettu koristeellinen osa ja on lisätty saman tai eri säveltäjän musiikkiteokseen, kuten konserttoon. @fi
toolkit label: kadenssi (teos) @fi
toolkit definition: Musiikkiteos, joka on solistille tarkoitettu koristeellinen osa ja on lisätty saman tai eri säveltäjän musiikkiteokseen, kuten konserttoon. @fi
toolkit label: kadens (verk) @no
toolkit definition: Et musikalsk verk som en konsert, som enten den samme komponisten eller en annen komponist har komponert en solistisk passasje for. @no
label: té com a obra de cadència @ca
definition: Relaciona una obra amb una obra que és una obra musical que és un passatge ornamental per a un solista afegit a una obra musical, com ara un concert, del mateix compositor o d’un compositor diferent. @ca
toolkit label: obra de cadència @ca
toolkit definition: Obra que és una obra musical que és un passatge ornamental per a un solista afegit a una obra musical, com ara un concert, del mateix compositor o d’un compositor diferent. @ca
has element type: 2
label: είναι καντέντσα (έργο) @el
definition: Συνδέει ένα έργο με ένα μουσικό έργο που συνίσταται από ένα διακοσμητικό πέρασμα για έναν σολίστα, το οποίο προστίθεται σε ένα μουσικό έργο όπως ένα κοντσέρτο είτε επό τον ίδιο είτε από έναν διαφορετικό συνθέτη. @el
toolkit label: καντέντσα (έργο) @el
toolkit definition: Ένα μουσικό έργο που συνίσταται από ένα διακοσμητικό πέρασμα για έναν σολίστα, το οποίο προστίθεται σε ένα μουσικό έργο όπως ένα κοντσέρτο είτε επό τον ίδιο είτε από έναν διαφορετικό συνθέτη. @el
label: kádencia műve a következő: @hu
definition: Hozzákapcsol egy művet egy zeneműhöz, amely egy szólista számára alkotott díszítő szakaszból áll, amelyet egy versenyműhöz hasonló zeneműhöz ad hozzá ugyanaz vagy egy másik zeneszerző. @hu
toolkit label: kadenciamű @hu
toolkit definition: Egy zenemű, amely egy szólista számára alkotott díszítő szakaszból áll, amelyet egy versenyműhöz hasonló zeneműhöz ad hozzá ugyanaz vagy egy másik zeneszerző. @hu
label: kadenssi (teos) @fi
label: har kadens (verk) @no
definition: Relaterer et verk til et musikalsk verk som en konsert, som enten den samme komponisten eller en annen komponist har komponert en solistisk passasje for. @no
label: heeft cadens-werk @nl
definition: Relateert een werk aan een muziekwerk dat een versierende passage is voor een soloïst toegevoegd aan een muziekwerk, zoals een concerto, door dezelfde of een andere componist. @nl
toolkit label: cadens-werk @nl
toolkit definition: Een muziekwerk dat een versierende passage is voor een soloïst toegevoegd aan een muziekwerk, zoals een concerto, door dezelfde of een andere componist. @nl
label: له عمل موسيقى كادنزا @ar
definition: يربط عمل بعمل موسيقي عبارة عن فقرة مصاحبة لعازف منفرد مضافة إلى عمل موسيقي؛ مثل كونشرتو للملحن نفسه أو لملحن مختلف. @ar
toolkit label: عمل موسيقى كادنزا @ar
toolkit definition: عمل موسيقي عبارة عن فقرة مصاحبة لعازف منفرد مضافة إلى عمل موسيقي، مثل كونشرتو للملحن نفسة أو لملحن مختلف. @ar
label: kadents (teos) @et
definition: Seostab teose muusikateosega, milleks on muusikateosele, nt instrumentaalkontserdile lisatud ornamentaalne soololõik samalt või teiselt heliloojalt. @et
toolkit label: kadents (teos) @et
toolkit definition: Muusikateos, milleks on muusikateosele, nt instrumentaalkontserdile lisatud ornamentaalne soololõik samalt või teiselt heliloojalt. @et
label: ha come cadenza opera @it
definition: Correla un’opera a un’opera musicale che consiste di un abbellimento per solista, aggiunta a un'opera musicale, come per esempio un concerto, dello stesso compositore o di uno diverso. @it
toolkit label: cadenza opera @it
toolkit definition: Opera musicale che consiste di un abbellimento per solista, aggiunta a un'opera musicale, come per esempio un concerto, dello stesso compositore o di uno diverso. @it
label: darbs: kadence @lv
definition: Sasaista darbu ar mūzikas darbu, kas ir solistam komponēta ornamentāla pasāža, kas pievienota citam muzikas darbam, piemēram, koncertam, kas ir vai nu tā paša, vai cita komponista radīts. @lv
toolkit label: darbs: kadence @lv
toolkit definition: Mūzikas darbs, kas ir solistam komponēta ornamentāla pasāža, kas pievienota citam muzikas darbam, piemēram, koncertam, kas ir vai nu tā paša, vai cita komponista radīts. @lv
label: 有华彩作品 @zh-hans
definition: 将一种作品与作为由同一个或不同的作曲家附加在诸如协奏曲等一种音乐作品中的独奏（唱）表演的装饰性乐段的一种音乐作品的一种作品关联起来。 @zh-hans
toolkit label: 华彩作品 @zh-hans
toolkit definition: 作为由同一个或不同的作曲家附加在诸如协奏曲等一种音乐作品中的独奏（唱）表演的装饰性乐段的一种音乐作品的一种作品 @zh-hans
has subproperty: P10026
label: kadans eseri ile ilişkilidir @tr
definition: Bir eseri, aynı veya farklı bir bestecinin konçerto benzeri bir müzik eserine solist için eklenmiş süsleyici bir pasajı olan müzik eseriyle ilişkilendirir. @tr
toolkit label: kadans eseri @tr
toolkit definition: Bir konçerto gibi bir müzik eserine, aynı ya da farklı bir besteci tarafından eklenen, solist için süsleyici bir pasaj içeren bir müzik eseri. @tr

is cadenza composed for work
status: Published
definition: Relates a work to a work that is a musical work, such as a concerto, to which is added a musical work that is an ornamental passage for a soloist by the same or a different composer.
type: Property
domain: C10001
sub property of: is augmentation of work
lexical alias: cadenzaComposedForWork.en
toolkit label: cadenza composed for work
toolkit definition: A work that is a musical work, such as a concerto, to which is added a musical work that is an ornamental passage for a soloist by the same or a different composer.
toolkit label: cadence composée pour une œuvre @fr
toolkit definition: Œuvre musicale telle qu’un concerto à laquelle est ajoutée une œuvre musicale consistant en un passage ornemental pour soliste du même compositeur ou d’un compositeur différent. @fr
toolkit label: cadencia compuesta para (obra) @es
toolkit definition: Una obra musical como un concierto para el cual se compuso un pasaje ornamental para solista, por igual o diferente compositor. @es
instruction number: 24.5
label: er kadence komponeret til værk @da
definition: Relaterer et værk til et musikværk, såsom en koncert, hvortil der er tilføjet et musikværk, som er en ornamental passage for en solist, enten af den samme komponist eller af en anden. @da
toolkit label: kadence komponeret til værk @da
toolkit definition: Musikværk, såsom en koncert, hvortil der er tilføjet et musikværk, som er en ornamental passage for en solist, enten af den samme komponist eller af en anden. @da
definition: Met une œuvre en relation avec une œuvre musicale telle qu’un concerto à laquelle est ajoutée une œuvre musicale consistant en un passage ornemental pour soliste du même compositeur ou d’un compositeur différent. @fr
label: là cadenza được soạn cho (tác phẩm) @vi
definition: Liên kết tác phẩm với tác phẩm âm nhạc như là côngxéctô mà đoạn trang hoàng cho người độc tấu được soạn, bất kể cùng hoặc khác người soạn. @vi
toolkit label: cadenza được soạn cho (tác phẩm) @vi
toolkit definition: Tác phẩm âm nhạc như là côngxéctô mà đoạn trang hoàng cho người độc tấu được soạn, bất kể cùng hoặc khác người soạn. @vi
label: ist Kadenz komponiert für (Werk) @de
definition: Setzt ein Werk in Beziehung zu einem Musikwerk, zum Beispiel einem Konzert, dem ein Musikwerk, das aus einer ausgeschmückten Passage für eine Solistin/einen Solisten besteht, entweder von derselben/demselben oder einer/einem anderen Komponistin/Komponisten hinzugefügt wird. @de
toolkit label: Kadenz komponiert für (Werk) @de
toolkit definition: Ein Musikwerk, zum Beispiel ein Konzert, dem ein Musikwerk, das aus einer ausgeschmückten Passage für eine Solistin/einen Solisten besteht, entweder von derselben/demselben oder einer/einem anderen Komponistin/Komponisten hinzugefügt wird. @de
label: est une cadence composée pour une œuvre @fr
definition: Liittää teoksen musiikkiteokseen, kuten konserttoon, johon on lisätty musiikkiteos, joka on solistille tarkoitettu koristeellinen osa samalta tai eri säveltäjältä. @fi
toolkit label: kadenssi teokseen @fi
toolkit definition: Musiikkiteos, kuten konsertto, johon on lisätty musiikkiteos, joka on solistille tarkoitettu koristeellinen osa samalta tai eri säveltäjältä. @fi
toolkit label: kadens komponert for verk @no
toolkit definition: Et musikalsk verk som en konsert, som enten den samme eller en annen komponist har lagt til en solistisk passasje for. @no
label: és cadència composta per a una obra @ca
definition: Relaciona una obra amb una obra que és una obra musical, com ara un concert, a la qual s’afegeix una obra musical que és un passatge ornamental per a un solista, del mateix compositor o d’un compositor diferent. @ca
toolkit label: cadència composta per a una obra @ca
toolkit definition: Obra que és una obra musical, com ara un concert, a la qual s’afegeix una obra musical que és un passatge ornamental per a un solista, del mateix compositor o d’un compositor diferent. @ca
has element type: 2
label: είναι καντέντσα που συντέθηκε ως (έργο) @el
definition: Συνδέει ένα έργο με ένα μουσικό έργο, όπως ένα κοντσέρτο, για το οποίο έχει συντεθεί ένα διακοσμητικό πέρασμα για έναν σολίστα είτε από τον ίδιο είτε από έναν διαφορετικό συνθέτη. @el
toolkit label: καντέντσα που συντέθηκε ως (έργο) @el
toolkit definition: Ένα μουσικό έργο, όπως ένα κοντσέρτο, για το οποίο έχει συντεθεί ένα διακοσμητικό πέρασμα για έναν σολίστα είτε από τον ίδιο είτε από έναν διαφορετικό συνθέτη. @el
label: kadencia a következő műhöz komponálva: @hu
definition: Hozzákapcsol egy művet egy versenyműhöz hasonló zeneműhöz, amelyhez egy szólistának szánt díszítő szakaszt alkotott ugyanaz vagy egy másik zeneszerző. @hu
toolkit label: kadenciával ellátott mű @hu
toolkit definition: Egy versenyműhöz hasonló zenemű, amelyhez egy szólistának szánt díszítő szakaszt alkotott ugyanaz vagy egy másik zeneszerző. @hu
label: kadenssi teokseen @fi
label: er kadens komponert for verk @no
definition: Relaterer et verk til et musikalsk verk som en konsert, som enten den samme eller en annen komponist har lagt til en solistisk passasje for. @no
label: is cadens gecomponeerd voor werk @nl
definition: Relateert een werk aan een muziekwerk zoals een concerto, waaraan een muziekwerk is toegevoegd dat een versierende passage is voor een soloïst door dezelfde of een andere componist. @nl
toolkit label: cadens gecomponeerd voor werk @nl
toolkit definition: Een muziekwerk zoals een concerto, waaraan een muziekwerk is toegevoegd dat een versierende passage is voor een soloïst door dezelfde of een andere componist. @nl
label: هو كادنزا مؤلَفة لعمل @ar
definition: يربط عمل بعمل موسيقي؛ مثل كونشرتو يضاف إلي عمل موسيقي متمثل في فقرة مصاحبة لعازف منفرد للملحن نفسه أو لملحن مختلف. @ar
toolkit label: كادنزا مؤلَفة لعمل @ar
toolkit definition: عمل موسيقي؛ مثل كونشرتو مضاف إليه عمل موسيقي متمثل في فقرة مصاحبة لعازف منفرد للملحن نفسه أو لملحن مختلف. @ar
label: kadents teosele @et
definition: Seostab teose muusikateosega, nt instrumentaalkontserdiga, millele on lisatud sama või teise helilooja muusikateos, milleks on ornamentaalne soololõik. @et
toolkit label: kadents teosele @et
toolkit definition: Muusikateos, nt instrumentaalkontsert, millele on lisatud sama või teise helilooja muusikateos, milleks on ornamentaalne soololõik. @et
label: è cadenza composta per opera @it
definition: Correla un’opera a un’opera musicale, come per esempio un concerto, a cui è aggiunta un’opera musicale che consiste di un abbellimento per solista dello stesso compositore o di uno diverso. @it
toolkit label: cadenza composta per opera @it
toolkit definition: Opera musicale - come per esempio un concerto – a cui è aggiunta un’opera musicale che consiste di un abbellimento per solista dello stesso compositore o di uno diverso. @it
label: ir kadence papildina darbu @lv
definition: Sasaista darbu ar mūzikas darbu, piemēram, koncerts, kam komponēta ornamentāla pasāža solistam, kas ir vai nu tā paša, vai cita komponista radīta. @lv
toolkit label: kadence papildina darbu @lv
toolkit definition: Mūzikas darbs, piemēram, koncerts, kam komponēta ornamentāla pasāža solistam, kas ir vai nu tā paša, vai cita komponista radīta. @lv
label: 是为作品作曲的华彩段 @zh-hans
definition: 将一种作品与由同一个或不同的作曲家附加作为独奏（唱）表演的装饰性乐段的一种音乐作品于其中的诸如协奏曲等作为一种音乐作品的一种作品关联起来。 @zh-hans
toolkit label: 为作品作曲的华彩段 @zh-hans
toolkit definition: 由同一个或不同的作曲家附加作为独奏（唱）表演的装饰性乐段的一种音乐作品于其中的诸如协奏曲等作为一种音乐作品的一种作品 @zh-hans
has subproperty: P10029
label: eser için bestelenmiş kadanstır @tr
definition: Bir eseri, aynı veya farklı bir bestecinin solist için süsleyici bir pasajı olan bir müzik eserinin eklendiği konçerto benzeri bir müzik eseriyle ilişkilendirir. @tr
toolkit label: eser için bestelenen kadans @tr
toolkit definition: Bir konçerto gibi bir müzik eserine, aynı ya da farklı bir besteci tarafından solist için süsleyici bir pasaj eklenen bir müzik eseri. @tr

has related agent of work
status: Published
sub property of: has related RDA entity of work
type: Property
lexical alias: relatedAgentOfWork.en
definition: Relates a work to an agent who is associated with a work.
domain: C10001
label: har agent relateret til værk @da
definition: Relaterer et værk til en agent, som er knyttet til et værk. @da
label: có tác nhân có liên quan (tác phẩm) @vi
definition: Liên kết tác phẩm với tác nhân liên quan tới tác phẩm đang được mô tả. @vi
toolkit definition: Tác nhân liên quan tới tác phẩm đang được mô tả. @vi
definition: Liittää teoksen toimijaan, joka liittyy teokseen. @fi
toolkit label: teokseen liittyvä toimija @fi
toolkit definition: Toimija, joka liittyy teokseen. @fi
label: té com a agent relacionat amb una obra @ca
definition: Relaciona una obra amb un agent que s’associa amb una obra. @ca
label: a pour agent en relation avec une œuvre @fr
definition: Met une œuvre en relation avec un agent qui est associé à une œuvre. @fr
toolkit label: related agent of work
toolkit definition: An agent who is associated with a work.
has element type: 1
label: έχει σχετικό φορέα (έργο) @el
definition: Συνδέει ένα έργο με έναν φορέα που συνδέεται με ένα περιγραφόμενο έργο. @el
sub property of: P00006
label: műhöz kapcsolódó ágens a következő: @hu
definition: Hozzákapcsol egy művet egy műhöz kapcsolódó ágenshez. @hu
alternative label: other agent associated with work
label: teokseen liittyvä toimija @fi
label: har agent relatert til verk @no
definition: Relaterer et verk til en agent som forbindes med et verk. @no
toolkit label: agent relatert til verk @no
toolkit definition: En agent som forbindes med et verk. @no
label: heeft gerelateerde actor van werk @nl
definition: Relateert een werk aan een actor die is geassocieerd met een werk. @nl
toolkit label: gerelateerde actor van werk @nl
toolkit definition: Een actor die is geassocieerd met een werk. @nl
alternative label: muu teokseen liittyvä toimija @fi
label: له وكيل مرتبط بعمل @ar
definition: يربط بين عمل ووكيل مرتبط بعمل. @ar
toolkit label: وكيل مرتبط بعمل @ar
toolkit definition: وكيل مرتبط بعمل. @ar
toolkit label: agent relacionat amb una obra @ca
toolkit definition: Agent que s’associa amb una obra. @ca
toolkit label: agent relateret til værk @da
toolkit definition: Agent, som er knyttet til et værk. @da
label: teosega seotud tegija @et
definition: Seostab teose teosega seotud tegijaga. @et
toolkit label: teosega seotud tegija @et
toolkit definition: Teosega seotud tegija. @et
label: hat mit Werk in Beziehung stehenden Akteur @de
definition: Setzt ein Werk in Beziehung zu einem Akteur, der mit einem Werk in Verbindung steht. @de
toolkit label: mit Werk in Beziehung stehender Akteur @de
toolkit definition: Ein Akteur, der mit einem Werk in Verbindung steht. @de
toolkit label: műhöz kapcsolódó ágens: @hu
toolkit definition: Egy műhöz kapcsolódó ágens. @hu
label: ha come agente correlato a opera @it
definition: Correla un'opera a un agente che è associato a un'opera. @it
toolkit label: agente correlato a opera @it
toolkit definition: Agente che è associato a un'opera. @it
toolkit label: agent en relation avec une œuvre @fr
toolkit definition: Agent qui est associé à une œuvre. @fr
label: ar darbu saistītais aģents @lv
definition: Sasaista darbu ar aģentu, kas saistīts ar darbu. @lv
toolkit label: ar darbu saistītais aģents @lv
toolkit definition: Aģents, kas saistīts ar darbu. @lv
alternative label: وكيل آخر مرتبط بعمل @ar
alternative label: Sonstiger Akteur, der mit einem Werk in Verbindung steht @de
alternative label: altre agent associat amb una obra @ca
alternative label: 和作品有关的其他行为者 @zh-hans
label: 有作品的关联行为者 @zh-hans
definition: 将一种作品与和一种作品有关的一个行为者关联起来。 @zh-hans
toolkit label: 作品的关联行为者 @zh-hans
toolkit definition: 和一种作品有关的一个行为者 @zh-hans
alternative label: autre agent associé à une œuvre @fr
alternative label: műhoz társított más ágens: @hu
has subproperty: has addressee agent
has subproperty: has granting institution or faculty (Deprecated)
has subproperty: has commissioning agent
has subproperty: has creator agent of work

has related family of work
status: Published
sub property of: has related collective agent of work
type: Property
lexical alias: relatedFamilyOfWork.en
definition: Relates a work to a family who is associated with a work.
domain: C10001
label: har familie relateret til værk @da
definition: Relaterer et værk til en familie, som er knyttet til et værk. @da
label: có gia đình có liên quan (tác phẩm) @vi
definition: Liên kết tác phẩm với gia đình liên quan tới tác phẩm đang được mô tả. @vi
toolkit definition: Gia đình liên quan tới tác phẩm đang được mô tả. @vi
definition: Liittää teoksen sukuun, joka liittyy teokseen. @fi
toolkit label: teokseen liittyvä suku @fi
toolkit definition: Suku, joka liittyy teokseen. @fi
label: té com a família relacionada amb una obra @ca
definition: Relaciona una obra amb una família que s’associa amb una obra. @ca
label: a pour famille en relation avec une œuvre @fr
definition: Met une œuvre en relation avec une famille qui est associée à une œuvre. @fr
toolkit label: related family of work
toolkit definition: A family who is associated with a work.
has element type: 1
label: έχει σχετική οικογένεια (έργο) @el
definition: Συνδέει ένα έργο με μια οικογένεια που συνδέεται με ένα περιγραφόμενο έργο. @el
sub property of: P00008
label: műhöz kapcsolódó család a következő: @hu
definition: Hozzákapcsol egy művet egy műhöz kapcsolódó családhoz. @hu
label: teokseen liittyvä suku @fi
label: har familie relatert til verk @no
definition: Relaterer et verk til en familie som forbindes med et verk. @no
toolkit label: familie relatert til verk @no
toolkit definition: En familie som forbindes med et verk. @no
label: heeft gerelateerde familie van werk @nl
definition: Relateert een werk aan een familie die is geassocieerd met een werk. @nl
toolkit label: gerelateerde familie van werk @nl
toolkit definition: Een familie die is geassocieerd met een werk. @nl
label: له عائلة مرتبطة بعمل @ar
definition: يربط بين عمل وعائلة مرتبطة بعمل. @ar
toolkit label: عائلة مرتبطة بعمل @ar
toolkit definition: عائلة مرتبطة بعمل. @ar
toolkit label: família relacionada amb una obra @ca
toolkit definition: Família que s’associa amb una obra. @ca
toolkit label: familie relateret til værk @da
toolkit definition: Familie, som er knyttet til et værk. @da
label: teosega seotud perekond @et
definition: Seostab teose teosega seotud perekonnaga. @et
toolkit label: teosega seotud perekond @et
toolkit definition: Teosega seotud perekond. @et
label: hat mit Werk in Beziehung stehende Familie @de
definition: Setzt ein Werk in Beziehung zu einer Familie, die mit einem Werk in Verbindung steht. @de
toolkit label: mit Werk in Beziehung stehende Familie @de
toolkit definition: Eine Familie, die mit einem Werk in Verbindung steht. @de
toolkit label: műhöz kapcsolódó család: @hu
toolkit definition: Egy műhöz kapcsolódó család. @hu
label: ha come famiglia correlata a opera @it
definition: Correla un'opera a una famiglia che è associata a un'opera. @it
toolkit label: famiglia correlata a opera @it
toolkit definition: Famiglia che è associata a un'opera. @it
toolkit label: famille en relation avec une œuvre @fr
toolkit definition: Famille qui est associée à une œuvre. @fr
label: ar darbu saistītā dzimta/ģimene @lv
definition: Sasaista darbu ar dzimtu/ģimeni, kas saistīta ar darbu. @lv
toolkit label: ar darbu saistītā dzimta/ģimene @lv
toolkit definition: Dzimta/ģimene, kas saistīta ar darbu. @lv
label: 有作品的关联家族 @zh-hans
definition: 将一种作品与和一种作品有关的一个家族关联起来。 @zh-hans
toolkit label: 作品的关联家族 @zh-hans
toolkit definition: 和一种作品有关的一个家族 @zh-hans
has subproperty: has addressee family
has subproperty: has commissioning family
has subproperty: has creator family of work
has subproperty: has dedicatee family of work
has subproperty: has honouree family of work
has subproperty: has issuing family
has subproperty: has sponsoring family of work
has subproperty: has subject family
has subproperty: P10313
label: eserin ilgili ailesi ile ilişkilidir @tr
definition: Bir eseri, eserle bağlantılı olan bir aileyle ilişkilendirir. @tr
toolkit label: Eserle ilişkili aile @tr

has related place of work
status: Published
sub property of: has related RDA entity of work
type: Property
lexical alias: relatedPlaceOfWork.en
definition: Relates a work to a place that is associated with a work.
domain: C10001
label: har sted relateret til værk @da
definition: Relaterer et værk til et sted, som er knyttet til et værk. @da
label: có địa điểm có liên quan (tác phẩm) @vi
definition: Liên kết tác phẩm với địa điểm liên quan tới tác phẩm đang được mô tả. @vi
toolkit definition: Địa điểm liên quan tới tác phẩm đang được mô tả. @vi
definition: Liittää teoksen paikkaan, joka liittyy teokseen. @fi
toolkit label: teokseen liittyvä paikka @fi
toolkit definition: Paikka, joka liittyy teokseen. @fi
label: té com a lloc relacionat amb una obra @ca
definition: Relaciona una obra amb un lloc que s’associa amb una obra. @ca
label: a pour lieu en relation avec une œuvre @fr
definition: Met une œuvre en relation avec un lieu qui est associé à une œuvre. @fr
toolkit label: related place of work
toolkit definition: A place that is associated with a work.
has element type: 1
label: έχει σχετικό τόπο (έργο) @el
definition: Συνδέει ένα έργο με έναν τόπο που συνδέεται με ένα περιγραφόμενο έργο. @el
sub property of: P00010
label: műhöz kapcsolódó hely a következő: @hu
definition: Hozzákapcsol egy művet egy műhöz kapcsolódó helyhez. @hu
label: teokseen liittyvä paikka @fi
label: har sted relatert til verk @no
definition: Relaterer et verk til et sted som forbindes med et verk. @no
toolkit label: sted relatert til verk @no
toolkit definition: Et sted som forbindes med et verk. @no
label: heeft gerelateerde plaats van werk @nl
definition: Relateert een werk aan een plaats die is geassocieerd met een werk. @nl
toolkit label: gerelateerde plaats van werk @nl
toolkit definition: Een plaats die is geassocieerd met een werk. @nl
label: له مكان مرتبط بعمل @ar
definition: يربط بين عمل ومكان مرتبط بعمل. @ar
toolkit label: مكان مرتبط بعمل @ar
toolkit definition: مكان مرتبط بعمل. @ar
toolkit label: lloc relacionat amb una obra @ca
toolkit definition: Lloc que s’associa amb una obra. @ca
toolkit label: sted relateret til værk @da
toolkit definition: Sted, som er knyttet til et værk. @da
label: teosega seotud koht @et
definition: Seostab teose teosega seotud kohaga. @et
toolkit label: teosega seotud koht @et
toolkit definition: Teosega seotud koht. @et
label: hat mit Werk in Beziehung stehendes Geografikum @de
definition: Setzt ein Werk in Beziehung zu einem Geografikum, das mit einem Werk in Verbindung steht. @de
toolkit label: mit Werk in Beziehung stehendes Geografikum @de
toolkit definition: Ein Geografikum, das mit einem Werk in Verbindung steht. @de
toolkit label: műhöz kapcsolódó hely: @hu
toolkit definition: Egy műhöz kapcsolódó hely. @hu
label: ha come luogo correlato a opera @it
definition: Correla un'opera a un luogo che è associato a un'opera. @it
toolkit label: luogo correlato a opera @it
toolkit definition: Luogo che è associato a un'opera. @it
toolkit label: lieu en relation avec une œuvre @fr
toolkit definition: Lieu qui est associé à une œuvre. @fr
label: ar darbu saistītā vieta @lv
definition: Sasaista darbu ar vietu, kas saistīta ar darbu. @lv
toolkit label: ar darbu saistītā vieta @lv
toolkit definition: Vieta, kas saistīta ar darbu. @lv
label: 有作品的关联地点 @zh-hans
definition: 将一种作品与和一种作品有关的一个地点关联起来。 @zh-hans
toolkit label: 作品的关联地点 @zh-hans
toolkit definition: 和一种作品有关的一个地点 @zh-hans
has subproperty: has place of origin of work
has subproperty: has place of capture of representative expression
has subproperty: has subject place
has subproperty: has coordinates of cartographic content
has subproperty: P10316
label: eserin ilgili yeri ile ilişkilidir @tr
definition: Bir eseri, eserle bağlantılı olan bir yerle ilişkilendirir. @tr
toolkit label: Eserle ilişkili yer @tr
toolkit definition: Bir eserle bağlantılı olan bir yer. @tr

has related timespan of work
status: Published
sub property of: has related RDA entity of work
type: Property
lexical alias: relatedTimespanOfWork.en
definition: Relates a work to a timespan that is associated with a work.
domain: C10001
label: har tidsperiode relateret til værk @da
definition: Relaterer et værk til en tidsperiode, som er knyttet til et værk. @da
label: có khoảng thời gian có liên quan (tác phẩm) @vi
definition: Liên kết tác phẩm với khoảng thời gian liên quan tới tác phẩm đang được mô tả. @vi
toolkit definition: Khoảng thời gian liên quan tới tác phẩm đang được mô tả. @vi
definition: Liittää teoksen ajanjaksoon, joka liittyy teokseen. @fi
toolkit label: teokseen liittyvä ajanjakso @fi
toolkit definition: Ajanjakso, joka liittyy teokseen. @fi
label: té com a interval de temps relacionat amb una obra @ca
definition: Relaciona una obra amb un interval de temps que s’associa amb una obra. @ca
label: a pour laps de temps en relation avec une œuvre @fr
definition: Met une œuvre en relation avec un laps de temps qui est associé à une œuvre. @fr
toolkit label: related timespan of work
toolkit definition: A timespan that is associated with a work.
has element type: 1
label: έχει σχετικό χρονικό διάστημα (έργο) @el
definition: Συνδέει ένα έργο με ένα χρονικό διάστημα το οποίο συνδέεται με ένα περιγραφόμενο έργο. @el
sub property of: P00011
label: műhöz kapcsolódó időtartam a következő: @hu
definition: Hozzákapcsol egy művet egy műhöz kapcsolódó időtartamhoz. @hu
label: teokseen liittyvä ajanjakso @fi
label: har tidrom relatert til verk @no
definition: Relaterer et verk til et tidsrom som forbindes med et verk. @no
toolkit label: tidrom relatert til verk @no
toolkit definition: Et tidsrom som forbindes med et verk. @no
label: heeft gerelateerde tijdspanne van werk @nl
definition: Relateert een werk aan een tijdspanne die is geassocieerd met een werk. @nl
toolkit label: gerelateerde tijdspanne van werk @nl
toolkit definition: Een tijdspanne die is geassocieerd met een werk. @nl
label: له فترة زمنية مرتبطة بعمل @ar
definition: يربط بين عمل وفترة زمنية مرتبطة بعمل. @ar
toolkit label: فترة زمنية مرتبطة بعمل @ar
toolkit definition: فترة زمنية مرتبطة بعمل @ar
toolkit label: interval de temps relacionat amb una obra @ca
toolkit definition: Interval de temps que s’associa amb una obra. @ca
toolkit label: tidsperiode relateret til værk @da
toolkit definition: Tidsperiode, som er knyttet til et værk. @da
label: teosega seotud ajavahemik @et
definition: Seostab teose teosega seotud ajavahemikuga. @et
toolkit label: teosega seotud ajavahemik @et
toolkit definition: Teosega seotud ajavahemik. @et
label: hat mit Werk in Beziehung stehenden Zeitraum @de
definition: Setzt ein Werk in Beziehung zu einem Zeitraum, der mit einem Werk in Verbindung steht. @de
toolkit label: mit Werk in Beziehung stehender Zeitraum @de
toolkit definition: Ein Zeitraum, der mit einem Werk in Verbindung steht. @de
toolkit label: műhöz kapcsolódó időtartam: @hu
toolkit definition: Egy műhöz kapcsolódó időtartam. @hu
label: ha come intervallo di tempo correlato a opera @it
definition: Correla un'opera a un intervallo di tempo che è associato a un'opera. @it
toolkit label: intervallo di tempo correlato a opera @it
toolkit definition: Intervallo di tempo che è associato a un'opera. @it
toolkit label: laps de temps en relation avec une œuvre @fr
toolkit definition: Laps de temps qui est associé à une œuvre. @fr
label: ar darbu saistītais laikposms @lv
definition: Sasaista darbu ar laikposmu, kas saistīts ar darbu. @lv
toolkit label: ar darbu saistītais laikposms @lv
toolkit definition: Laikposms, kas saistīts ar darbu. @lv
label: 有作品的关联时间段 @zh-hans
definition: 将一种作品与和一种作品有关的一个时间段关联起来。 @zh-hans
toolkit label: 作品的关联时间段 @zh-hans
toolkit definition: 和一种作品有关的一个时间段 @zh-hans
has subproperty: has date of representative expression
has subproperty: has date of work
has subproperty: has duration of representative expression
has subproperty: has epoch
has subproperty: has equinox
has subproperty: has subject timespan
has subproperty: P10317
label: eserin ilgili zaman aralığı ile ilişkilidir @tr
definition: Bir eseri, eserle bağlantılı olan bir zaman aralığıyla ilişkilendirir. @tr
toolkit label: Eserin zaman aralığıyla ilişkisi @tr
toolkit definition: Bir eserle bağlantılı olan bir zaman aralığı. @tr

has related expression of work
status: Published
sub property of: has related RDA entity of work
type: Property
lexical alias: relatedExpressionOfWork.en
definition: Relates a work to an expression that is associated with a work.
domain: C10001
label: har udtryk relateret til værk @da
definition: Relaterer et værk til et udtryk, som er knyttet til et værk. @da
label: có biểu hiện có liên quan (tác phẩm) @vi
definition: Liên kết tác phẩm với biểu hiện liên quan tới tác phẩm đang được mô tả. @vi
toolkit definition: Biểu hiện liên quan tới tác phẩm đang được mô tả. @vi
definition: Liittää teoksen ekspressioon, joka liittyy teokseen. @fi
toolkit label: teokseen liittyvä ekspressio @fi
toolkit definition: Ekspressio, joka liittyy teokseen. @fi
label: té com a expressió relacionada amb una obra @ca
definition: Relaciona una obra amb una expressió que s’associa amb una obra. @ca
label: a pour expression en relation avec une œuvre @fr
definition: Met une œuvre en relation avec une expression qui est associée à une œuvre. @fr
toolkit label: related expression of work
toolkit definition: An expression that is associated with a work.
has element type: 1
label: έχει σχετική έκφραση (έργο) @el
definition: Συνδέει ένα έργο με μια έκφραση που συνδέεται με ένα περιγραφόμενο έργο. @el
sub property of: P00003
label: mű kapcsolódó kifejezési forma a következő: @hu
definition: Hozzákapcsol egy művet egy műhöz kapcsolódó kifejezési formához. @hu
label: teokseen liittyvä ekspressio @fi
label: har uttrykk relatert til verk @no
definition: Relaterer et verk til et uttrykk som forbindes med et verk. @no
toolkit label: uttrykk relatert til verk @no
toolkit definition: Et uttrykk som forbindes med et verk. @no
label: heeft gerelateerde expressie van werk @nl
definition: Relateert een werk aan een expressie die is geassocieerd met een werk. @nl
toolkit label: gerelateerde expressie van werk @nl
toolkit definition: Een expressie die is geassocieerd met een werk. @nl
label: له تعبيرة مرتبطة بعمل @ar
definition: يربط بين عمل وتعبيرة مرتبطة بعمل. @ar
toolkit label: تعبيرة مرتبطة بعمل @ar
toolkit definition: تعبيرة مرتبطة بعمل. @ar
toolkit label: expressió relacionada amb una obra @ca
toolkit definition: Expressió que s’associa amb una obra. @ca
toolkit label: udtryk relateret til værk @da
toolkit definition: Udtryk, som er knyttet til et værk. @da
label: teosega seotud väljendus @et
definition: Seostab teose teosega seotud väljendusega. @et
toolkit label: teosega seotud väljendus @et
toolkit definition: Teosega seotud väljendus. @et
label: hat mit Werk in Beziehung stehende Expression @de
definition: Setzt ein Werk in Beziehung zu einer Expression, die mit einem Werk in Verbindung steht. @de
toolkit label: mit Werk in Beziehung stehende Expression @de
toolkit definition: Eine Expression, die mit einem Werk in Verbindung steht. @de
toolkit label: műhöz kapcsolódó kifejezési forma: @hu
toolkit definition: Egy műhöz kapcsolódó kifejezési forma: @hu
label: ha come espressione correlata a opera @it
definition: Correla un'opera a un'espressione che è associata a un'opera. @it
toolkit label: espressione correlata a opera @it
toolkit definition: Espressione che è associata a un'opera. @it
toolkit label: expression en relation avec une œuvre @fr
toolkit definition: Expression qui est associée à une œuvre. @fr
label: ar darbu saistītā izteiksme @lv
definition: Sasaista darbu ar izteiksmi, kas ir saistīta ar darbu. @lv
toolkit label: ar darbu saistītā izteiksme @lv
toolkit definition: Izteiksme, kas ir saistīta ar darbu. @lv
label: 有作品的关联内容表达 @zh-hans
definition: 将一种作品与和一种作品有关的一种内容表达关联起来。 @zh-hans
toolkit label: 作品的关联内容表达 @zh-hans
toolkit definition: 和一种作品有关的一种内容表达 @zh-hans
has subproperty: has expression of work
has subproperty: has subject expression
has subproperty: is concordance work for
has subproperty: P10308
label: eserin ilgili anlatımı ile ilişkilidir @tr
definition: Bir eseri, bir eserle bağlantılı olan bir anlatımla ilişkilendirir. @tr
toolkit label: Eserin ilişkili anlatımı @tr
toolkit definition: Bir çalışmayla bağlantılı olan bir anlatım. @tr

has related collective agent of work
status: Published
sub property of: has related agent of work
type: Property
lexical alias: relatedCollectiveAgentOfWork.en
definition: Relates a work to a collective agent who is associated with a work.
domain: C10001
label: har kollektiv agent relateret til værk @da
definition: Relaterer et værk til en kollektiv agent, som er knyttet til et værk. @da
label: có tác nhân tập thể có liên quan (tác phẩm) @vi
definition: Liên kết tác phẩm với tác nhân tập thể liên quan tới tác phẩm đang được mô tả. @vi
toolkit definition: Tác nhân tập thể liên quan tới tác phẩm đang được mô tả. @vi
definition: Liittää teoksen yhteistoimijaan, joka liittyy teokseen. @fi
toolkit label: teokseen liittyvä yhteistoimija @fi
toolkit definition: Yhteistoimija, joka liittyy teokseen. @fi
label: té com a agent col·lectiu relacionat amb una obra @ca
definition: Relaciona una obra amb un agent col·lectiu que s’associa amb una obra. @ca
label: a pour agent collectif en relation avec une œuvre @fr
definition: Met une œuvre en relation avec un agent collectif qui est associé à une œuvre. @fr
toolkit label: related collective agent of work
toolkit definition: A collective agent who is associated with a work.
has element type: 1
label: έχει σχετικό συλλογικό φορέα (έργο) @el
definition: Συνδέει ένα έργο με έναν συλλογικό φορέα που συνδέεται με ένα περιγραφόμενο έργο. @el
sub property of: P00012
label: műhöz kapcsolódó kollektív ágens a következő: @hu
definition: Hozzákapcsol egy művet egy műhöz kapcsolódó kollektív ágenshez. @hu
label: teokseen liittyvä yhteistoimija @fi
label: har kollektiv agent relatert til verk @no
definition: Relaterer et verk til en kollektiv agent som forbindes med et verk. @no
toolkit label: kollektiv agent relatert til verk @no
toolkit definition: En kollektiv agent som forbindes med et verk. @no
label: heeft gerelateerde collectieve actor van werk @nl
definition: Relateert een werk aan een collectieve actor die is geassocieerd met een werk. @nl
toolkit label: gerelateerde collectieve actor van werk @nl
toolkit definition: Een collectieve actor die is geassocieerd met een werk. @nl
label: له وكيل جماعي مرتبط بعمل @ar
definition: يربط بين عمل ووكيل جماعي مرتبط بعمل. @ar
toolkit label: وكيل جماعي مرتبط بعمل @ar
toolkit definition: وكيل جماعي مرتبط بعمل. @ar
toolkit label: agent col·lectiu relacionat amb una obra @ca
toolkit definition: Agent col·lectiu que s’associa amb una obra. @ca
toolkit label: kollektiv agent relateret til værk @da
toolkit definition: Kollektiv agent, som er knyttet til et værk. @da
label: teosega seotud kollektiiv @et
definition: Seostab teose teosega seotud kollektiiviga. @et
toolkit label: teosega seotud kollektiiv @et
toolkit definition: Teosega seotud kollektiiv. @et
label: hat mit Werk in Beziehung stehenden gemeinschaftlichen Akteur @de
definition: Setzt ein Werk in Beziehung zu einem gemeinschaftlichen Akteur, der mit einem Werk in Verbindung steht. @de
toolkit label: mit Werk in Beziehung stehender gemeinschaftlicher Akteur @de
toolkit definition: Ein gemeinschaftlicher Akteur, der mit einem Werk in Verbindung steht. @de
toolkit label: műhöz kapcsolódó kollektív ágens: @hu
toolkit definition: Egy műhöz kapcsolódó kollektív ágens. @hu
label: ha come agente collettivo correlato a opera @it
definition: Correla un'opera a un agente collettivo che è associato a un'opera. @it
toolkit label: agente collettivo correlato a opera @it
toolkit definition: Agente collettivo che è associato a un'opera. @it
toolkit label: agent collectif en relation avec une œuvre @fr
toolkit definition: Agent collectif qui est associé à une œuvre. @fr
label: ar darbu saistītā grupa @lv
definition: Sasaista darbu ar grupu, kas saistīta ar darbu. @lv
toolkit label: ar darbu saistītā grupa @lv
toolkit definition: Grupa, kas saistīta ar darbu. @lv
label: 有作品的关联集体行为者 @zh-hans
definition: 将一种作品与和一种作品有关的一个集体行为者关联起来。 @zh-hans
toolkit label: 作品的关联集体行为者 @zh-hans
toolkit definition: 和一种作品有关的一个集体行为者 @zh-hans
has subproperty: has addressee collective agent
has subproperty: has commissioning collective agent
has subproperty: has creator collective agent of work
has subproperty: has dedicatee collective agent of work
has subproperty: has honouree collective agent of work
has subproperty: has issuing collective agent
has subproperty: has related family of work
has subproperty: has related corporate body of work
has subproperty: has sponsoring collective agent of work
has subproperty: has subject collective agent
has subproperty: P10315
label: eserin ilgili kolektif temsilcisi ile ilişkilidir @tr

has related manifestation of work
status: Published
sub property of: has related RDA entity of work
type: Property
lexical alias: relatedManifestationOfWork.en
definition: Relates a work to a manifestation that is associated with a work.
domain: C10001
label: har manifestation relateret til værk @da
definition: Relaterer et værk til en manifestation, som er knyttet til et værk. @da
label: có biểu thị có liên quan (tác phẩm) @vi
definition: Liên kết tác phẩm với biểu thị liên quan tới tác phẩm đang được mô tả. @vi
toolkit definition: Biểu thị liên quan tới tác phẩm đang được mô tả. @vi
definition: Liittää teoksen manifestaatioon, joka liittyy teokseen. @fi
toolkit label: teokseen liittyvä manifestaatio @fi
toolkit definition: Manifestaatio, joka liittyy teokseen. @fi
label: té com a manifestació relacionada amb una obra @ca
definition: Relaciona una obra amb una manifestació que s’associa amb una obra. @ca
label: a pour manifestation en relation avec une œuvre @fr
definition: Met une œuvre en relation avec une manifestation qui est associée à une œuvre. @fr
toolkit label: related manifestation of work
toolkit definition: A manifestation that is associated with a work.
has element type: 1
label: έχει σχετική εκδήλωση (έργο) @el
definition: Συνδέει ένα έργο με μια εκδήλωση που συνδέεται με ένα περιγραφόμενο έργο. @el
sub property of: P00004
label: műhöz kapcsolódó megjelenési forma a következő: @hu
definition: Hozzákapcsol egy művet egy műhöz kapcsolódó megjelenési formához. @hu
label: teokseen liittyvä manifestaatio @fi
label: har manifestasjon relatert til verk @no
definition: Relaterer et verk til en manifestasjon som forbindes med et verk. @no
toolkit label: manifestasjon relatert til verk @no
toolkit definition: En manifestasjon som forbindes med et verk. @no
label: heeft gerelateerde manifestatie van werk @nl
definition: Relateert een werk aan een manifestatie die is geassocieerd met een werk. @nl
toolkit label: gerelateerde manifestatie van werk @nl
toolkit definition: Een manifestatie die is geassocieerd met een werk. @nl
label: له تجسيدة مرتبطة بعمل @ar
definition: يربط بين عمل وتجسيدة مرتبطة بعمل. @ar
toolkit label: تجسيدة مرتبطة بعمل @ar
toolkit definition: تجسيدة مرتبطة بعمل. @ar
toolkit label: manifestació relacionada amb una obra @ca
toolkit definition: Manifestació que s’associa amb una obra. @ca
toolkit label: manifestation relateret til værk @da
toolkit definition: Manifestation, som er knyttet til et værk. @da
label: teosega seotud kehastus @et
definition: Seostab teose teosega seotud kehastusega. @et
toolkit label: teosega seotud kehastus @et
toolkit definition: Teosega seotud kehastus. @et
label: hat mit Werk in Beziehung stehende Manifestation @de
definition: Setzt ein Werk in Beziehung zu einer Manifestation, die mit einem Werk in Verbindung steht. @de
toolkit label: mit Werk in Beziehung stehende Manifestation @de
toolkit definition: Eine Manifestation, die mit einem Werk in Verbindung steht. @de
toolkit label: műhöz kapcsolódó megjelenési forma: @hu
toolkit definition: Egy műhöz kapcsolódó megjelenési forma. @hu
label: ha come manifestazione correlata a opera @it
definition: Correla un'opera a una manifestazione che è associata a un'opera. @it
toolkit label: manifestazione correlata a opera @it
toolkit definition: Manifestazione che è associata a un'opera. @it
toolkit label: manifestation en relation avec une œuvre @fr
toolkit definition: Manifestation qui est associée à une œuvre. @fr
label: ar darbu saistītā manifestācija @lv
definition: Sasaista darbu ar manifestāciju, kas ir saistīta ar darbu. @lv
toolkit label: ar darbu saistītā manifestācija @lv
toolkit definition: Manifestācija, kas ir saistīta ar darbu. @lv
label: 有作品的关联载体表现 @zh-hans
definition: 将一种作品与和一种作品有关的一种载体表现关联起来。 @zh-hans
toolkit label: 作品的关联载体表现 @zh-hans
toolkit definition: 和一种作品有关的一种载体表现 @zh-hans
has subproperty: is binding of manifestation of
has subproperty: has manifestation of work
has subproperty: has source consulted
has subproperty: has subject manifestation
has subproperty: is index for
has subproperty: P10309
label: eserin ilgili gösterimi ile ilişkilidir @tr
definition: Bir eseri, eserle bağlantılı olan bir gösterimle ilişkilendirir. @tr
toolkit label: Eserin ilişkili gösterimi @tr
toolkit definition: Bir eserle bağlantılı olan bir gösterim. @tr

has related nomen of work
status: Published
sub property of: has related RDA entity of work
type: Property
lexical alias: relatedNomenOfWork.en
definition: Relates a work to a nomen that is associated with a work.
domain: C10001
label: har nomen relateret til værk @da
definition: Relaterer et værk til et nomen, som er knyttet til et værk. @da
label: có danh pháp có liên quan (tác phẩm) @vi
definition: Liên kết tác phẩm với danh pháp liên quan tới tác phẩm đang được mô tả. @vi
toolkit definition: Danh pháp liên quan tới tác phẩm đang được mô tả. @vi
definition: Liittää teoksen nomeniin, joka liittyy teokseen. @fi
toolkit label: teokseen liittyvä nomen @fi
toolkit definition: Nomen, joka liittyy teokseen. @fi
label: té com a nomen relacionat amb una obra @ca
definition: Relaciona una obra amb un nomen que s’associa amb una obra. @ca
label: a pour nomen en relation avec une œuvre @fr
definition: Met une œuvre en relation avec un nomen qui est associé à une œuvre. @fr
toolkit label: related nomen of work
toolkit definition: A nomen that is associated with a work.
has element type: 1
label: έχει σχετικό όνομα (έργο) @el
definition: Συνδέει ένα έργο με ένα όνομα το οποίο συνδέεται με ένα περιγραφόμενο έργο. @el
sub property of: P00013
label: műhöz kapcsolódó nomen a következő: @hu
definition: Hozzákapcsol egy művet egy műhöz kapcsolódó nomenhez. @hu
label: teokseen liittyvä nomen @fi
label: har nomen relatert til verk @no
definition: Relaterer et verk til et nomen som forbindes med et verk. @no
toolkit label: nomen relatert til verk @no
toolkit definition: Et nomen som forbindes med et verk. @no
label: heeft gerelateerde nomen van werk @nl
definition: Relateert een werk aan een nomen dat is geassocieerd met een werk. @nl
toolkit label: gerelateerde nomen van werk @nl
toolkit definition: Een nomen dat is geassocieerd met een werk. @nl
label: له تسمية مرتبطة بعمل @ar
definition: يربط بين عمل وتسمية مرتبطة بعمل. @ar
toolkit label: تسمية مرتبطة بعمل @ar
toolkit definition: تسمية مرتبطة بعمل. @ar
toolkit label: nomen relacionat amb una obra @ca
toolkit definition: Nomen que s’associa amb una obra. @ca
toolkit label: nomen relateret til værk @da
toolkit definition: Nomen, som er knyttet til et værk. @da
label: teosega seotud nomen @et
definition: Seostab teose teosega seotud nomen'iga. @et
toolkit label: teosega seotud nomen @et
toolkit definition: Teosega seotud nomen. @et
label: hat mit Werk in Beziehung stehendes Nomen @de
definition: Setzt ein Werk in Beziehung zu einem Nomen, das mit einem Werk in Verbindung steht. @de
toolkit label: mit Werk in Beziehung stehendes Nomen @de
toolkit definition: Ein Nomen, das mit einem Werk in Verbindung steht. @de
toolkit label: műhöz kapcsolódó nomen: @hu
toolkit definition: Egy műhöz kapcsolódó nomen. @hu
label: ha come nomen correlato a opera @it
definition: Correla un'opera a un nomen che è associato a un'opera. @it
toolkit label: nomen correlato a opera @it
toolkit definition: Nomen che è associato a un'opera. @it
toolkit label: nomen en relation avec une œuvre @fr
toolkit definition: Nomen qui est associé à une œuvre. @fr
label: ar darbu saistītais nomens @lv
definition: Sasaista darbu ar nomenu, kas saistīts ar darbu. @lv
toolkit label: ar darbu saistītais nomens @lv
toolkit definition: Nomens, kas saistīts ar darbu. @lv
label: 有作品的关联命名 @zh-hans
definition: 将一种作品与和一种作品有关的一个命名关联起来。 @zh-hans
toolkit label: 作品的关联命名 @zh-hans
toolkit definition: 和一种作品有关的一个命名 @zh-hans
has subproperty: has appellation of work
has subproperty: has subject nomen
has subproperty: P10318
label: eserin ilgili ismi ile ilişkilidir @tr
definition: Bir eseri, bir eserle bağlantılı olan bir isimle ilişkilendirir. @tr
toolkit label: Eserin ilişkili ismi @tr
toolkit definition: Bir eser ile bağlantılı olan isim. @tr

has related item of work
status: Published
sub property of: has related RDA entity of work
type: Property
lexical alias: relatedItemOfWork.en
definition: Relates a work to an item that is associated with a work.
domain: C10001
label: har eksemplar relateret til værk @da
definition: Relaterer et værk til et eksemplar, som er knyttet til et værk. @da
label: có bản có liên quan (tác phẩm) @vi
definition: Liên kết tác phẩm với bản liên quan tới tác phẩm đang được mô tả. @vi
toolkit definition: Bản liên quan tới tác phẩm đang được mô tả. @vi
definition: Liittää teoksen kappaleeseen, joka liittyy teokseen. @fi
toolkit label: teokseen liittyvä kappale @fi
toolkit definition: Kappale, joka liittyy teokseen. @fi
label: té com a ítem relacionat amb una obra @ca
definition: Relaciona una obra amb un ítem que s’associa amb una obra. @ca
label: a pour item en relation avec une œuvre @fr
definition: Met une œuvre en relation avec un item qui est associé à une œuvre. @fr
toolkit label: related item of work
toolkit definition: An item that is associated with a work.
has element type: 1
label: έχει σχετικό αντίτυπο (έργου) @el
definition: Συνδέει ένα έργο με ένα αντίτυπο που συνδέεται με ένα περιγραφόμενο έργο. @el
sub property of: P00005
label: műhöz kapcsolódó példány a következő: @hu
definition: Hozzákapcsol egy művet egy példányhoz, amelyet egy műhöz társítanak. @hu
label: teokseen liittyvä kappale @fi
label: har eksemplar relatert til verk @no
definition: Relaterer et verk til et eksemplar som forbindes med et verk. @no
toolkit label: eksemplar relatert til verk @no
toolkit definition: Et eksemplar som forbindes med et verk. @no
label: heeft gerelateerd item van werk @nl
definition: Relateert een werk aan een item dat is geassocieerd met een werk. @nl
toolkit label: gerelateerd item van werk @nl
toolkit definition: Een item dat is geassocieerd met een werk. @nl
label: له مفردة مرتبطة بعمل @ar
definition: يربط بين عمل ومفردة مرتبطة بعمل. @ar
toolkit label: مفردة مرتبطة بعمل @ar
toolkit definition: مفردة مرتبطة بعمل. @ar
toolkit label: ítem relacionat amb una obra @ca
toolkit definition: Ítem que s’associa amb una obra. @ca
toolkit label: eksemplar relateret til værk @da
toolkit definition: Eksemplar, som er knyttet til et værk. @da
label: teosega seotud eksemplar @et
definition: Seostab teose teosega seotud eksemplariga. @et
toolkit label: teosega seotud eksemplar @et
toolkit definition: Teosega seotud eksemplar. @et
label: hat mit Werk in Beziehung stehendes Exemplar @de
definition: Setzt ein Werk in Beziehung zu einem Exemplar, das mit einem Werk in Verbindung steht. @de
toolkit label: mit Werk in Beziehung stehendes Exemplar @de
toolkit definition: Ein Exemplar, das mit einem Werk in Verbindung steht. @de
toolkit label: műhöz kapcsolódó példány: @hu
toolkit definition: Egy példány, amelyet egy műhöz társítanak. @hu
label: ha come item correlato a opera @it
definition: Correla un'opera a un item che è associato a un'opera. @it
toolkit label: item correlato a opera @it
toolkit definition: Item che è associato a un'opera. @it
toolkit label: item en relation avec une œuvre @fr
toolkit definition: Item qui est associé à une œuvre. @fr
label: ar darbu saistītā vienība @lv
definition: Sasaista darbu ar vienību, kas ir saistīta ar darbu. @lv
toolkit label: ar darbu saistītā vienība @lv
toolkit definition: Vienība, kas ir saistīta ar darbu. @lv
label: 有作品的关联单件 @zh-hans
definition: 将一种作品与和一种作品有关的一个单件关联起来。 @zh-hans
toolkit label: 作品的关联单件 @zh-hans
toolkit definition: 和一种作品有关的一个单件 @zh-hans
has subproperty: is binding of item of
has subproperty: has subject item
has subproperty: P10310
label: eserin ilgili kopyası ile ilişkilidir @tr
definition: Bir eseri, bir eserle bağlantılı olan bir kopyayla ilişkilendirir. @tr
toolkit label: Eserle ilişkili kopya @tr
toolkit definition: Bir eserle bağlantılı olan bir kopya. @tr

has related person of work
status: Published
sub property of: has related agent of work
type: Property
lexical alias: relatedPersonOfWork.en
definition: Relates a work to a person who is associated with a work.
domain: C10001
label: har person relateret til værk @da
definition: Relaterer et værk til en person, som er knyttet til et værk. @da
label: có cá nhân có liên quan (tác phẩm) @vi
definition: Liên kết tác phẩm với cá nhân liên quan tới tác phẩm đang được mô tả. @vi
toolkit definition: Cá nhân liên quan tới tác phẩm đang được mô tả. @vi
definition: Liittää teoksen henkilöön, joka liittyy teokseen. @fi
toolkit label: teokseen liittyvä henkilö @fi
toolkit definition: Henkilö, joka liittyy teokseen. @fi
label: té com a persona relacionada amb una obra @ca
definition: Relaciona una obra amb una persona que s’associa amb una obra. @ca
label: a pour personne en relation avec une œuvre @fr
definition: Met une œuvre en relation avec une personne qui est associée à une œuvre. @fr
toolkit label: related person of work
toolkit definition: A person who is associated with a work.
has element type: 1
label: έχει σχετικό φυσικό πρόσωπο (έργο) @el
definition: Συνδέεει ένα έργο με ένα φυσικό πρόσωπο που συνδέεται με ένα περιγραφόμενο έργο. @el
sub property of: P00007
label: műhöz kapcsolódó személy a következő: @hu
definition: Hozzákapcsol egy művet egy műhöz kapcsolódó személyhez. @hu
label: teokseen liittyvä henkilö @fi
label: har person relatert til verk @no
definition: Relaterer et verk til en person som forbindes med et verk. @no
toolkit label: person relatert til verk @no
toolkit definition: En person som forbindes med et verk. @no
label: heeft gerelateerde persoon van werk @nl
definition: Relateert een werk aan een persoon die is geassocieerd met een werk. @nl
toolkit label: gerelateerde persoon van werk @nl
toolkit definition: Een persoon die is geassocieerd met een werk. @nl
label: له شخص مرتبط بعمل @ar
definition: يربط بين عمل وشخص مرتبط بعمل. @ar
toolkit label: شخص مرتبط بعمل @ar
toolkit definition: شخص مرتبط بعمل. @ar
toolkit label: persona relacionada amb una obra @ca
toolkit definition: Persona que s’associa amb una obra. @ca
toolkit label: person relateret til værk @da
toolkit definition: Person, som er knyttet til et værk. @da
label: teosega seotud isik @et
definition: Seostab teose teosega seotud isikuga. @et
toolkit label: teosega seotud isik @et
toolkit definition: Teosega seotud isik. @et
label: hat mit Werk in Beziehung stehende Person @de
definition: Setzt ein Werk in Beziehung zu einer Person, die mit einem Werk in Verbindung steht. @de
toolkit label: mit Werk in Beziehung stehende Person @de
toolkit definition: Eine Person, die mit einem Werk in Verbindung steht. @de
toolkit label: műhöz kapcsolódó személy: @hu
toolkit definition: Egy műhöz kapcsolódó személy. @hu
label: ha come persona correlata a opera @it
definition: Correla un'opera a una persona che è associata a un'opera. @it
toolkit label: persona correlata a opera @it
toolkit definition: Persona che è associata a un'opera. @it
toolkit label: personne en relation avec une œuvre @fr
toolkit definition: Personne qui est associée à une œuvre. @fr
label: ar darbu saistītā persona @lv
definition: Sasaista darbu ar personu, kura saistīta ar darbu. @lv
toolkit label: ar darbu saistītā persona @lv
toolkit definition: Persona, kura saistīta ar darbu. @lv
label: 有作品的关联个人 @zh-hans
definition: 将一种作品与和一种作品有关的一个个人关联起来。 @zh-hans
toolkit label: 作品的关联个人 @zh-hans
toolkit definition: 和一种作品有关的一个个人 @zh-hans
has subproperty: has addressee person
has subproperty: has commissioning person
has subproperty: has creator person of work
has subproperty: has dedicatee person of work
has subproperty: has honouree person of work
has subproperty: has issuing person
has subproperty: has sponsoring person of work
has subproperty: has subject person
has subproperty: P10312
label: eserin ilgili kişisi ile ilişkilidir @tr
definition: Bir eseri, eserle bağlantılı olan bir kişiyle ilişkilendirir. @tr
toolkit label: Eserle ilişkili kişi @tr

has related corporate body of work
status: Published
sub property of: has related collective agent of work
type: Property
lexical alias: relatedCorporateBodyOfWork.en
definition: Relates a work to a corporate body who is associated with a work.
domain: C10001
label: har korporation relateret til værk @da
definition: Relaterer et værk til en korporation, som er knyttet til et værk. @da
label: có tập thể có liên quan (tác phẩm) @vi
definition: Liên kết tác phẩm với tập thể liên quan tới tác phẩm đang được mô tả. @vi
toolkit definition: Tập thể liên quan tới tác phẩm đang được mô tả. @vi
definition: Liittää teoksen yhteisöön, joka liittyy teokseen. @fi
toolkit label: teokseen liittyvä yhteisö @fi
toolkit definition: Yhteisö, joka liittyy teokseen. @fi
label: té com a entitat corporativa relacionada amb una obra @ca
definition: Relaciona una obra amb una entitat corporativa que s’associa amb una obra. @ca
label: a pour collectivité en relation avec une œuvre @fr
definition: Met une œuvre en relation avec une collectivité qui est associée à une œuvre. @fr
toolkit label: related corporate body of work
toolkit definition: A corporate body who is associated with a work.
has element type: 1
label: έχει σχετικό συλλογικό όργανο (έργο) @el
definition: Συνδέει ένα έργο με ένα συλλογικό όργανο που συνδέεται με ένα περιγραφόμενο έργο. @el
sub property of: P00009
label: műhöz kapcsolódó testület a következő: @hu
definition: Hozzákapcsol egy művet egy műhöz kapcsolódó testülethez. @hu
label: teokseen liittyvä yhteisö @fi
label: har korporasjon relatert til verk @no
definition: Relaterer et verk til en korporasjon som forbindes med et verk. @no
toolkit label: korporasjon relatert til verk @no
toolkit definition: En korporasjon som forbindes med et verk. @no
label: heeft gerelateerde corporatie van werk @nl
definition: Relateert een werk aan een corporatie die is geassocieerd met een werk. @nl
toolkit label: gerelateerde corporatie van werk @nl
toolkit definition: Een corporatie die is geassocieerd met een werk. @nl
label: له هيئة مرتبطة بعمل @ar
definition: يربط بين عمل وهيئة مرتبطة بعمل. @ar
toolkit label: هيئة مرتبطة بعمل @ar
toolkit definition: هيئة مرتبطة بعمل. @ar
toolkit label: entitat corporativa relacionada amb una obra @ca
toolkit definition: Entitat corporativa que s’associa amb una obra. @ca
toolkit label: korporation relateret til værk @da
toolkit definition: Korporation, som er knyttet til et værk. @da
label: teosega seotud asutus @et
definition: Seostab teose teosega seotud asutusega. @et
toolkit label: teosega seotud asutus @et
toolkit definition: Teosega seotud asutus. @et
label: hat mit Werk in Beziehung stehende Körperschaft @de
definition: Setzt ein Werk in Beziehung zu einer Körperschaft, die mit einem Werk in Verbindung steht. @de
toolkit label: mit Werk in Beziehung stehende Körperschaft @de
toolkit definition: Eine Körperschaft, die mit einem Werk in Verbindung steht. @de
toolkit label: műhöz kapcsolódó testület: @hu
toolkit definition: Egy műhöz kapcsolódó testület. @hu
label: ha come ente correlato a opera @it
definition: Correla un'opera a un ente che è associato a un'opera. @it
toolkit label: ente correlato a opera @it
toolkit definition: Ente che è associato a un'opera. @it
toolkit label: collectivité en relation avec une œuvre @fr
toolkit definition: Collectivité qui est associée à une œuvre. @fr
label: ar darbu saistītā institūcija @lv
definition: Sasaista darbu ar institūciju, kas saistīta ar darbu. @lv
toolkit label: ar darbu saistītā institūcija @lv
toolkit definition: Institūcija, kas saistīta ar darbu. @lv
label: 有作品的关联团体 @zh-hans
definition: 将一种作品与和一种作品有关的一个团体关联起来。 @zh-hans
toolkit label: 作品的关联团体 @zh-hans
toolkit definition: 和一种作品有关的一个团体 @zh-hans
has subproperty: has addressee corporate body
has subproperty: has commissioning corporate body
has subproperty: has creator corporate body of work
has subproperty: has dedicatee corporate body of work
has subproperty: has honouree corporate body of work
has subproperty: has hosting institution
has subproperty: has issuing corporate body
has subproperty: has sponsoring corporate body of work
has subproperty: has subject corporate body
has subproperty: P10314
label: eserin ilgili tüzel kişisi ile ilişkilidir @tr
definition: Bir eseri, eserle bağlantılı olan tüzel kişi ile ilişkilendirir. @tr

has catalogue work (Deprecated)
definition: Relates a work to a work that consists of a complete enumeration of items arranged systematically. (Deprecated)
type: Property
domain: C10001
sub property of: is augmented by work
lexical alias: catalogueWork.en
toolkit label: catalogue work (Deprecated)
toolkit definition: A work that consists of a complete enumeration of items arranged systematically. (Deprecated)
toolkit label: catalogue (œuvre) @fr
toolkit definition: Œuvre qui consiste en une énumération complète d’items classés systématiquement. @fr
toolkit label: catálogo (obra) @es
toolkit definition: Una obra que contiene una enumeración completa de ítems ordenados sistemáticamente. @es
instruction number: 24.5
label: har katalogværk @da
definition: Relaterer et værk til et værk, som består af en komplet fortegnelse over eksemplarer, som er arrangeret systematisk. @da
toolkit label: katalogværk @da
toolkit definition: Værk, som består af en komplet fortegnelse over eksemplarer, som er arrangeret systematisk. @da
definition: Met une œuvre en relation avec une œuvre qui consiste en une énumération complète d’items classés systématiquement. @fr
label: là mục lục (tác phẩm) @vi
definition: Liên kết tác phẩm với tác phẩm có chứa liệt kê hoàn chỉnh các bản được sắp xếp có hệ thống. @vi
toolkit label: mục lục (tác phẩm) @vi
toolkit definition: Tác phẩm có chứa liệt kê hoàn chỉnh các bản được sắp xếp có hệ thống. @vi
label: hat Katalog (Werk) @de
definition: Setzt ein Werk in Beziehung zu einem Werk, das aus einer vollständigen Aufzählung von Exemplaren besteht, die systematisch angeordnet sind. @de
toolkit label: Katalog (Werk) @de
toolkit definition: Ein Werk, das aus einer vollständigen Aufzählung von Exemplaren besteht, die systematisch angeordnet sind. @de
label: a pour catalogue (œuvre) @fr
definition: Liittää teoksen teokseen, joka koostuu täydellisestä systemaattisesti järjestetystä yksiköiden listauksesta. @fi
toolkit label: luettelo (teos) @fi
toolkit definition: Teos, joka koostuu täydellisestä systemaattisesti järjestetystä yksiköiden listauksesta. @fi
toolkit label: katalog (verk) @no
toolkit definition: Et verk som består av en fullstendig og systematisk ordnet liste over eksemplarer. @no
label: té com a obra de catàleg @ca
definition: Relaciona una obra amb una obra que consisteix en una enumeració completa d’ítems arranjats sistemàticament. @ca
toolkit label: obra de catàleg @ca
toolkit definition: Obra que consisteix en una enumeració completa d’ítems arranjats sistemàticament. @ca
has element type: 2
label: είναι κατάλογος (έργο) @el
definition: Συνδέει ένα έργο με ένα έργο, το οποίο συνιστά μια πλήρη απαρίθμηση οργανωμένων συστηματικά αντιτύπων. @el
toolkit label: κατάλογος (έργο) @el
toolkit definition: Ένα έργο το οποίο συνιστά μια πλήρη απαρίθμηση οργανωμένων συστηματικά αντιτύπων. @el
label: katalógusa a következő mű: @hu
definition: Hozzákapcsol egy művet egy műhöz, amely szisztematikusan elrendezett példányok teljes felsorolásából áll. @hu
toolkit label: katalógusmű @hu
toolkit definition: Egy mű, amely szisztematikusan elrendezett példányok teljes felsorolásából áll. @hu
label: luettelo (teos) @fi
label: har katalog (verk) @no
definition: Relaterer et verk til et verk som består av en fullstendig og systematisk ordnet liste over eksemplarer. @no
label: heeft cataloguswerk @nl
definition: Relateert een werk aan een werk dat bestaat uit een complete opsomming van systematisch geordende items. @nl
toolkit label: cataloguswerk @nl
toolkit definition: Een werk dat bestaat uit een complete opsomming van systematisch geordende items. @nl
label: له عمل فهرس @ar
definition: يربط عمل بعمل يتكون من حصر كامل لمفردات مرتبة ترتيبا منهجيا. @ar
toolkit label: عمل فهرس @ar
toolkit definition: عمل يتكون من حصر كامل لمفردات مرتبة ترتيبا منهجيا. @ar
label: kataloog (teos) @et
definition: Seostab teose teosega, mis sisaldab tervikliku loetelu süstematiseeritud sissekandeid. @et
toolkit label: kataloog (teos) @et
toolkit definition: Teos, mis sisaldab tervikliku loetelu süstematiseeritud sissekandeid. @et
label: ha come catalogo opera @it
definition: Correla un’opera a un’opera che consiste di un’enumerazione completa di item organizzati in modo sistematico. @it
toolkit label: catalogo opera @it
toolkit definition: Opera che consiste di un’enumerazione completa di item organizzati in modo sistematico. @it
status: Deprecated
label: darbs: katalogs @lv
definition: Sasaista darbu ar darbu - pilnīgs sistemātiski kārtots vienību uzskaitījums. @lv
toolkit label: darbs: katalogs @lv
toolkit definition: Darbs - pilnīgs sistemātiski kārtots vienību uzskaitījums. @lv
has subproperty: P10110

is adapted as graphic novel work
status: Published
type: Property
lexical alias: adaptedAsGraphicNovelWork.en
definition: Relates a work to a work that is a graphic novel based on another work.
domain: C10001
toolkit label: adapted as graphic novel work
toolkit definition: A work that is a graphic novel based on another work.
toolkit label: adapté en roman graphique (œuvre) @fr
toolkit definition: Œuvre qui consiste en un roman graphique basé sur une autre œuvre. @fr
sub property of: is adapted as work
toolkit label: adaptada como novela gráfica (obra) @es
toolkit definition: Una novela gráfica basada en la obra fuente @es
instruction number: 24.5
label: er bearbejdet til graphic novel-værk @da
definition: Relaterer et værk til en graphic novel, baseret på et andet værk. @da
toolkit label: bearbejdet til graphic novel-værk @da
toolkit definition: Graphic novel, baseret på et andet værk. @da
definition: Met une œuvre en relation avec une œuvre qui consiste en un roman graphique basé sur une autre œuvre. @fr
label: được phỏng theo như là tiểu thuyết đồ hoạ (tác phẩm) @vi
definition: Liên kết tác phẩm với tiểu thuyết đồ hình dựa trên tác phẩm nguồn. @vi
toolkit label: được phỏng theo như là tiểu thuyết đồ hoạ (tác phẩm) @vi
toolkit definition: Tiểu thuyết đồ hình dựa trên tác phẩm nguồn. @vi
label: ist bearbeitet als Graphic Novel (Werk) @de
definition: Setzt ein Werk in Beziehung zu einer Graphic Novel (Werk), die auf einem anderen Werk basiert. @de
toolkit label: Bearbeitet als Graphic Novel (Werk) @de
toolkit definition: Eine Graphic Novel (Werk), die auf einem anderen Werk basiert. @de
label: est adapté en roman graphique (œuvre) @fr
definition: Liittää teoksen teokseen, joka on toiseen teokseen perustuva sarjakuvaromaani. @fi
toolkit label: sarjakuvaversio (teos) @fi
toolkit definition: Teos, joka on toiseen teokseen perustuva sarjakuvaromaani. @fi
toolkit label: bearbeidet som tegneserieroman (verk) @no
toolkit definition: En tegneserieroman basert på et annet verk. @no
label: és adaptat com a obra de novel·la gràfica @ca
definition: Relaciona una obra amb una obra que és una novel·la gràfica que es basa en una altra obra. @ca
toolkit label: adaptat com a obra de novel·la gràfica @ca
toolkit definition: Obra que és una novel·la gràfica que es basa en una altra obra. @ca
has element type: 2
label: είναι προσαρμοσμένο ως μυθιστόρημα σε μορφή κόμικ (έργο) @el
definition: Συνδέει ένα έργο με ένα μυθιστόρημα σε μορφή κόμικ βασισμένο σε ένα έργο-πηγή. @el
toolkit label: προσαρμοσμένο ως μυθιστήρημα σε μορφή κόμικ (έργο) @el
toolkit definition: Ένα μυθιστόρημα σε μορφή κόμικ βασισμένο σε ένα έργο-πηγή. @el
label: képregény-feldolgozása a következőként: @hu
definition: Hozzákapcsol egy művet egy képregény műhöz, amely egy másik művön alapul. @hu
toolkit label: képregénymű-feldolgozása: @hu
toolkit definition: Egy képregény mű, amely egy másik művön alapul. @hu
label: sarjakuvaversio (teos) @fi
label: er bearbeidet som tegneserieroman (verk) @no
definition: Relaterer et verk til en tegneserieroman basert på et annet verk. @no
label: is bewerkt als stripboekwerk @nl
definition: Relateert een werk aan een werk dat is een stripboek gebaseerd op een ander werk. @nl
toolkit label: bewerkt als stripboekwerk @nl
toolkit definition: Een werk dat is een stripboek gebaseerd op een ander werk. @nl
label: هو معالج كعمل رواية مصورة @ar
definition: يربط عمل بعمل عبارة عن رواية مصورة تستند إلى عمل آخر. @ar
toolkit label: معالج كعمل رواية مصورة @ar
toolkit definition: عمل عبارة عن رواية مصورة تستند إلى عمل آخر. @ar
label: adapteeritud graafilise romaanina (teos) @et
definition: Seostab teose graafilise romaaniga, mis põhineb teisel teosel. @et
toolkit label: adapteeritud graafilise romaanina (teos) @et
toolkit definition: Graafiline romaan, mis põhineb teisel teosel. @et
label: è adattata come opera graphic novel @it
definition: Correla un’opera a un graphic novel basato su un’altra opera. @it
toolkit label: adattato coem opera graphic novel @it
toolkit definition: Graphic novel basato su un’altra opera. @it
label: ir adaptēts kā grafisks romāns (darbs) @lv
definition: Sasaista darbu ar darbu, kas ir romāns izdots grafiskā variantā, veidots pēc pamatdarba. @lv
toolkit label: adaptēts kā darbs: grafisks romāns @lv
toolkit definition: Romāns izdots grafiskā variantā, veidots pēc pamatdarba. @lv
label: 被改编为图解小说作品 @zh-hans
definition: 将一种作品与作为一种图解小说并基于另一种作品的一种作品关联起来。 @zh-hans
toolkit label: 被改编为图解小说作品 @zh-hans
toolkit definition: 作为一种图解小说并基于另一种作品的一种作品 @zh-hans
has subproperty: P10251
label: çizgi roman eseri olarak uyarlanmıştır @tr
definition: Bir eseri, başka bir eserden uyarlanan bir çizgi roman olan bir eserle ilişkilendirir. @tr
toolkit label: Çizgi roman çalışması olarak uyarlanan @tr
toolkit definition: Başka bir eserden uyarlanmış bir çizgi roman çalışması. @tr

has finding aid work (Deprecated)
definition: Relates a work to a work that provides a guide to the organization, arrangement, and contents of an archival collection. (Deprecated)
type: Property
domain: C10001
sub property of: is augmented by work
lexical alias: findingAidWork.en
toolkit label: finding aid work (Deprecated)
toolkit definition: A work that provides a guide to the organization, arrangement, and contents of an archival collection. (Deprecated)
toolkit label: instrument de recherche (œuvre) @fr
toolkit definition: Œuvre qui fournit un guide de l’organisation, du classement et du contenu d’une collection ou d’un fonds d’archives. @fr
toolkit label: guía de búsqueda de (obra) @es
toolkit definition: Una obra que proporciona una guía para la organización, ordenación y contenido de una colección archivística @es
instruction number: 24.5
label: har hjælpeværktøjsværk @da
definition: Relaterer et værk til et værk, som giver en vejledning til organiseringen, opsætningen og indholdet af en arkivsamling. @da
toolkit label: hjælpeværktøjsværk @da
toolkit definition: Værk, som giver en vejledning til organiseringen, opsætningen og indholdet af en arkivsamling. @da
definition: Met une œuvre en relation avec une œuvre qui fournit un guide de l’organisation, du classement et du contenu d’une collection ou d’un fonds d’archives. @fr
label: là hỗ trợ tìm kiếm (tác phẩm) @vi
definition: Liên kết tác phẩm với tác phẩm cung cấp chỉ dẫn về tổ chức, sắp xếp, và nội dung của bộ sưu tập lưu trữ. @vi
toolkit label: hỗ trợ tìm kiếm (tác phẩm) @vi
toolkit definition: Tác phẩm cung cấp chỉ dẫn về tổ chức, sắp xếp, và nội dung của bộ sưu tập lưu trữ. @vi
label: hat Findmittel (Werk) @de
definition: Setzt ein Werk in Beziehung zu einem Werk, das eine Orientierungshilfe zum Aufbau, zur Anordnung und zu den Inhalten einer Archivsammlung enthält. @de
toolkit label: Findmittel (Werk) @de
toolkit definition: Ein Werk, das eine Orientierungshilfe zum Aufbau, zur Anordnung und zu den Inhalten einer Archivsammlung enthält. @de
label: a pour instrument de recherche (œuvre) @fr
definition: Liittää teoksen teokseen, joka opastaa arkistokokoelman järjestämisperiaatteisiin ja sisältöön. @fi
toolkit label: arkistokokoelman hakemisto (teos) @fi
toolkit definition: Teos, joka opastaa arkistokokoelman järjestämisperiaatteisiin ja sisältöön. @fi
toolkit label: veiledning (verk) @no
toolkit definition: Et verk som gir veiledning til innholdet i en arkivsamling og hvordan den er organisert. @no
label: té com a obra d’instrument de descripció @ca
definition: Relaciona una obra amb una obra que proporciona una guia a l’organització, l’arranjament i els continguts d’una col·lecció arxivística. @ca
toolkit label: obra d’instrument de descripció @ca
toolkit definition: Obra que proporciona una guia a l’organització, l’arranjament i els continguts d’una col·lecció arxivística. @ca
has element type: 2
label: είναι εργαλείο έρευνας (έργο) @el
definition: Συνδέει ένα έργο με ένα έργο το οποίο παρέχει έναν οδηγό για την οργάνωση, την κατάταξη και τα περιεχόμενα μιας αρχειακής συλλογής. @el
toolkit label: εργαλείο έρευνας (έργο) @el
toolkit definition: Ένα έργο το οποίο παρέχει έναν οδηγό για την οργάνωση, την κατάταξη και τα περιεχόμενα μιας αρχειακής συλλογής. @el
label: keresési segédlete a következő mű: @hu
definition: Hozzákapcsol egy művet egy műhöz, amely útmutató egy levéltári gyűjtemény szervezetéhez, elrendezéséhez és tartalmához. @hu
toolkit label: keresésisegédlet-mű @hu
toolkit definition: Egy mű, amely útmutató egy levéltári gyűjtemény szervezetéhez, elrendezéséhez és tartalmához. @hu
label: arkistokokoelman hakemisto (teos) @fi
label: har veiledning (verk) @no
definition: Relaterer et verk til et verk som gir veiledning til innholdet i en arkivsamling og hvordan den er organisert. @no
label: heeft vind-hulpmiddel-werk @nl
definition: Relateert een werk aan een werk dat een gids biedt voor de organisatie, ordening en inhoud van een archiefcollectie. @nl
toolkit label: vind-hulpmiddel-werk @nl
toolkit definition: Een werk dat een gids biedt voor de organisatie, ordening en inhoud van een archiefcollectie. @nl
label: له عمل معينات بحث @ar
definition: يربط عمل بعمل يوفر دليلًا إرشاديا لتنظيم مجموعة أرشيفية، وترتيبها، ومحتوياتها. @ar
toolkit label: عمل معينات بحث @ar
toolkit definition: عمل يوفر دليلًا إرشاديا لتنظيم مجموعة أرشيفية، وترتيبها، ومحتوياتها. @ar
label: arhiivinimistu (teos) @et
definition: Seostab teose teosega, mis tutvustab arhiivikogu korrastuspõhimõtteid ja sisu. @et
toolkit label: arhiivinimistu (teos) @et
toolkit definition: Teos, mis tutvustab arhiivikogu korrastuspõhimõtteid ja sisu. @et
label: ha come aiuto alla ricerca opera @it
definition: Correla un’opera a un’opera che fornisce una guida all’organizzazione, ordinamento e contenuti di una collezione archivistica. @it
toolkit label: aiuto alla ricerca opera @it
toolkit definition: Opera che fornisce una guida all’organizzazione, ordinamento e contenuti di una collezione archivistica. @it
status: Deprecated
label: darbs: meklēšanas palīglīdzeklis @lv
definition: Sasaista darbu ar darbu, kas ir meklēšanas palīglīdzeklis arhīva kolekcijā. @lv
toolkit label: darbs: meklēšanas palīglīdzeklis @lv
toolkit definition: Darbs, kas ir meklēšanas palīglīdzeklis arhīva kolekcijā. @lv
has subproperty: P10157

is finding aid for work (Deprecated)
definition: Relates a work to a work that is an archival collection described by a guide to the organization, arrangement, and contents of the collection. (Deprecated)
type: Property
domain: C10001
sub property of: is augmentation of work
lexical alias: findingAidForWork.en
toolkit label: finding aid for work (Deprecated)
toolkit definition: A work that is an archival collection described by a guide to the organization, arrangement, and contents of the collection. (Deprecated)
toolkit label: instrument de recherche pour une œuvre @fr
toolkit definition: Œuvre qui consiste en une collection ou un fonds d’archives décrit dans un guide de l’organisation, du classement et du contenu de la collection ou du fonds. @fr
toolkit label: guía de búsqueda de (obra) @es
toolkit definition: Una colección de archivo que está descrita en una ayuda de búsqueda, i.e., una guía a la organización, ordenación y contenido de la colección. @es
instruction number: 24.5
label: er hjælpeværktøj til værk @da
definition: Relaterer et værk til et værk, som er en arkivsamling beskrevet i en vejledning om organisering, opsætning og indhold. @da
toolkit label: hjælpeværktøj til værk @da
toolkit definition: Værk, som er en arkivsamling beskrevet i en vejledning om organisering, opsætning og indhold. @da
definition: Met une œuvre en relation avec une œuvre qui consiste en une collection ou un fonds d’archives décrit dans un guide de l’organisation, du classement et du contenu de la collection ou du fonds. @fr
label: có hỗ trợ tìm kiếm của (tác phẩm) @vi
definition: Liên kết tác phẩm với bộ sưu tập lưu trữ được mô tả trong hỗ trợ tìm kiếm, nghĩa là, chỉ dẫn về tổ chức, sắp xếp, và nội dung của bộ sưu tập. @vi
toolkit label: hỗ trợ tìm kiếm của (tác phẩm) @vi
toolkit definition: Bộ sưu tập lưu trữ được mô tả trong hỗ trợ tìm kiếm, nghĩa là, chỉ dẫn về tổ chức, sắp xếp, và nội dung của bộ sưu tập. @vi
label: ist Findmittel für (Werk) @de
definition: Setzt ein Werk in Beziehung zu einer Archivsammlung, die in einer Orientierungshilfe zum Aufbau, zur Anordnung und zu den Inhalten der Sammlung beschrieben ist. @de
toolkit label: Findmittel für (Werk) @de
toolkit definition: Eine Archivsammlung, die in einer Orientierungshilfe zum Aufbau, zur Anordnung und zu den Inhalten der Sammlung beschrieben ist. @de
label: est un instrument de recherche pour une œuvre @fr
definition: Liittää teoksen teokseen, joka on kokoelman järjestelyä ja sisältöä käsittelevän oppaan kuvaama arkistokokoelma. @fi
toolkit label: arkistokokoelman hakemisto teokselle @fi
toolkit definition: Teos, joka on kokoelman järjestelyä ja sisältöä käsittelevän oppaan kuvaama arkistokokoelma. @fi
toolkit label: veiledning til verk @no
toolkit definition: Et verk som er en arkivsamling som beskrives i en veiledning, dvs. en veiledning til innholdet i en samling og hvordan den er organisert. @no
label: és instrument de descripció per a una obra @ca
definition: Relaciona una obra amb una obra que és una col·lecció arxivística descrita per una guia a l’organització, l’arranjament i els continguts de la col·lecció. @ca
toolkit label: instrument de descripció per a una obra @ca
toolkit definition: Obra que és una col·lecció arxivística descrita per una guia a l’organització, l’arranjament i els continguts de la col·lecció. @ca
has element type: 2
label: είναι εργαλείο έρευνας για (έργο) @el
definition: Συνδέει ένα έργο με μια αρχειακή συλλογή η οποία περιγράφεται σε ένα εργαλείο έρευνας, δηλαδή έναν οδηγό για τον οργανισμό, την οργάνωση και τα περιεχόμενα μιας συλλογής. @el
toolkit label: εργαλείο έρευνας για (έργο) @el
toolkit definition: Μια αρχειακή συλλογή η οποία περιγράφεται σε ένα εργαλείο έρευνας, δηλαδή έναν οδηγό για τον οργανισμό, την οργάνωση και τα περιεχόμενα μιας συλλογής. @el
label: keresési segédlete a következő műnek: @hu
definition: Hozzákapcsol egy művet egy műhöz, egy levéltári gyűjteményhez, amelyet leírnak a gyűjtemény szervezetének, elrendezésének és tartalmának a kalauzában. @hu
toolkit label: keresési segédlettel ellátott mű @hu
toolkit definition: Egy mű, egy levéltári gyűjtemény, amelyet leírnak a gyűjtemény szervezetének, elrendezésének és tartalmának a kalauzában. @hu
label: arkistokokoelman hakemisto teokselle @fi
label: er veiledning til verk @no
definition: Relaterer et verk til et verk som er en arkivsamling som beskrives i en veiledning, dvs. en veiledning til innholdet i en samling og hvordan den er organisert. @no
label: is vind-hulpmiddel voor werk @nl
definition: Relateert een werk aan een werk dat een archiefcollectie is, beschreven door een gids voor de organisatie, ordening en inhoud van de collectie. @nl
toolkit label: vind-hulpmiddel voor werk @nl
toolkit definition: Een werk dat een archiefcollectie is, beschreven door een gids voor de organisatie, ordening en inhoud van de collectie. @nl
label: هو معين بحث لعمل @ar
definition: يربط عمل بعمل عبارة عن مجموعة أرشيفية موصوفة في دليل لتنظيم المجموعة، وترتيبها، ومحتوياتها. @ar
toolkit label: معين بحث لعمل @ar
toolkit definition: عمل عبارة عن مجموعة أرشيفية موصوفة في دليل لتنظيم المجموعة، وترتيبها، ومحتوياتها. @ar
label: arhiivinimistu teosele @et
definition: Seostab teose teosega, mis on arhiivikogu, mille korrastuspõhimõtteid ja sisu tutvustatakse teatmikus. @et
toolkit label: arhiivinimistu teosele @et
toolkit definition: Teos, mis on arhiivikogu, mille korrastuspõhimõtteid ja sisu tutvustatakse teatmikus. @et
label: è opera di aiuto alla ricerca @it
definition: Correla un’opera a un’opera che è una collezione archivistica descritta da una guida all’organizzazione, all’ordinamento e ai contenuti. @it
toolkit label: opera di aiuto alla ricerca @it
toolkit definition: Opera che è una collezione archivistica descritta da una guida all’organizzazione, all’ordinamento e ai contenuti. @it
status: Deprecated
label: ir meklēšanas palīglīdzeklis darbam @lv
definition: Sasaista darbu ar darbu, kas ir arhīvu kolekcija, kurai izveidots meklēšanas palīglīdzeklis. @lv
toolkit label: meklēšanas palīglīdzeklis darbam @lv
toolkit definition: Arhīvu kolekcija, kurai izveidots meklēšanas palīglīdzeklis. @lv
has subproperty: P10201

has key title
status: Published
lexical alias: keyTitle.en
definition: Relates a work to a nomen that is a title of work that is assigned by an ISSN registration agency.
toolkit label: key title
toolkit definition: A nomen that is a title of work that is assigned by an ISSN registration agency.
type: Property
domain: C10001
sub property of: has title of work
has element type: 2
label: avainnimeke @fi
definition: Liittää teoksen nomeniin, joka on teoksen nimeke, jonka on antanut ISSN-rekisteröintitoimisto. @fi
toolkit label: avainnimeke @fi
toolkit definition: Nomen, joka on teoksen nimeke, jonka on antanut ISSN-rekisteröintitoimisto. @fi
label: har nøkkeltittel @no
definition: Relaterer et verk til en tittel for verk som er tildelt av et ISSN-kontor. @no
toolkit label: nøkkeltittel @no
toolkit definition: En tittel for verk som er tildelt av et ISSN-kontor. @no
label: heeft key title @nl
definition: Relateert een werk aan een nomen dat is een titel van een werk dat toegekend is door een ISSN-registratiebureau. @nl
toolkit definition: Een nomen dat is een titel van een werk dat toegekend is door een ISSN-registratiebureau. @nl
label: له عنوان مفتاحي @ar
definition: يربط بين عمل وتسمية عبارة عن عنوان عمل خصصته وكالة تسجيل ردمد. @ar
toolkit label: عنوان مفتاحي @ar
toolkit definition: تسمية عبارة عن عنوان عمل خصصته وكالة تسجيل ردمد. @ar
label: té com a títol clau @ca
definition: Relaciona una obra amb un nomen que és un títol d’obra que és assignat per una agència de registre de l’ISSN. @ca
toolkit label: títol clau @ca
toolkit definition: Relaciona una obra amb un nomen que és un títol d’obra que és assignat per una agència de registre de l’ISSN. @ca
label: har nøgletitel @da
definition: Relaterer et værk til en titel på værk, som er tildelt af et ISSN-kontor. @da
toolkit label: nøgletitel @da
toolkit definition: Titel på værk, som er tildelt af et ISSN-kontor. @da
label: võtmepealkiri @et
definition: Seostab teose teose pealkirjaga, mille on määranud ISSN registreerimise agentuur. @et
toolkit label: võtmepealkiri @et
toolkit definition: Teose pealkiri, mille on määranud ISSN registreerimise agentuur. @et
label: hat Key Title @de
definition: Setzt ein Werk in Beziehung zu einem Titel eines Werks, der durch eine ISSN-Registrierungsstelle zugewiesen wird. @de
toolkit label: Key Title @de
toolkit definition: Ein Titel eines Werks, der durch eine ISSN-Registrierungsstelle zugewiesen wird. @de
label: kulcscíme a következő: @hu
definition: Hozzákapcsol egy művet egy nomenhez, egy olyan műcímhez, amelyet egy ISSN regisztrációs ügynökség jegyez. @hu
toolkit label: kulcscíme: @hu
toolkit definition: Egy nomen, egy olyan műcím, amelyet egy ISSN regisztrációs ügynökség jegyez. @hu
label: ha come titolo chiave @it
definition: Correla un’opera a un titolo dell'opera che è assegnato da un’agenzia di registrazione ISSN. @it
toolkit label: titolo chiave @it
toolkit definition: Titolo dell'opera che è assegnato da un’agenzia di registrazione ISSN. @it
label: a pour titre-clé @fr
definition: Met une œuvre en relation avec un nomen qui est un titre d’œuvre attribué par une agence d’enregistrement de l’ISSN. @fr
toolkit label: titre-clé @fr
toolkit definition: Nomen qui est un titre d’œuvre attribué par une agence d’enregistrement de l’ISSN. @fr
label: atslēgnosaukums @lv
definition: Sasaista darbu ar nomenu, kas ir unikāls nosaukums, ko resursam piešķīrusi starptautiskā ISSN aģentūra. @lv
toolkit label: atslēgnosaukums @lv
toolkit definition: Unikāls nosaukums, ko resursam piešķīrusi starptautiskā ISSN aģentūra. @lv
label: 有识别题名 @zh-hans
definition: 将一种作品与作为被国际标准连续出版物号一个注册机构分配之作品的一个题名的一个命名关联起来。 @zh-hans
toolkit label: 识别题名 @zh-hans
toolkit definition: 作为被国际标准连续出版物号一个注册机构分配之作品的一个题名的一个命名 @zh-hans
has subproperty: P10367
label: ana başlık ile ilişkilidir @tr
definition: Bir eseri, bir ISSN kayıt kuruluşu tarafından atanan bir eser başlığı olan bir isimle ilişkilendirir. @tr
toolkit label: anahtar başlık @tr
toolkit definition: Bir ISSN kayıt ajansı tarafından atanan bir eser başlığı olan bir isim. @tr

is critique of expression
status: Published
type: Property
lexical alias: critiqueOfExpression.en
definition: Relates a work to an expression that is critically evaluated by a work.
domain: C10001
toolkit label: critique of expression
toolkit definition: An expression that is critically evaluated by a work.
toolkit label: critique d’une expression @fr
toolkit definition: Expression qui fait l’objet d’une évaluation critique par une œuvre. @fr
toolkit label: crítica de (expresión) @es
toolkit definition: Una expresión usada como base para una evaluación crítica. @es
instruction number: 23.5
label: er kritik af udtryk @da
definition: Relaterer et værk til et udtryk, som anvendes som grundlag for en kritisk evaluering. @da
toolkit label: kritik af udtryk @da
toolkit definition: Udtryk, som anvendes som grundlag for en kritisk evaluering. @da
definition: Met une œuvre en relation avec une expression qui fait l’objet d’une évaluation critique par une œuvre. @fr
label: là phê bình của (biểu hiện) @vi
definition: Liên kết tác phẩm với biểu thị được dùng như là cơ sở cho đánh giá phê bình. @vi
toolkit label: phê bình của (biểu hiện) @vi
toolkit definition: Biểu thị được dùng như là cơ sở cho đánh giá phê bình. @vi
label: ist Kritik von (Expression) @de
definition: Setzt ein Werk in Beziehung zu einer Expression, die als Grundlage für eine kritische Untersuchung verwendet wird. @de
toolkit label: Kritik von (Expression) @de
toolkit definition: Eine Expression, die als Grundlage für eine kritische Untersuchung verwendet wird. @de
label: est une critique d’une expression @fr
definition: Liittää teoksen ekspressioon, johon kriittinen arviointi perustuu. @fi
toolkit label: kritiikki ekspressiosta @fi
toolkit definition: Ekspressio, johon kriittinen arviointi perustuu. @fi
toolkit label: kritikk av uttrykk @no
toolkit definition: Et uttrykk brukt som utgangspunkt for en kritisk evaluering. @no
label: és crítica d’una expressió @ca
definition: Relaciona una obra amb una expressió que és avaluada críticament per una obra. @ca
toolkit label: crítica d’una expressió @ca
toolkit definition: Expressió que és avaluada críticament per una obra. @ca
has element type: 2
label: είναι κρίση της (έκφραση) @el
definition: Συνδέει ένα έργο με μια έκφραση που χρησιμοποιείται ως η βάση για μια κριτική αξιολόγηση. @el
toolkit label: κρίση της (έκφραση) @el
toolkit definition: Μια έκφραση που χρησιμοποιείται ως η βάση για μια κριτική αξιολόγηση. @el
label: bírálata a következő kifejezési formának: @hu
definition: Hozzákapcsol egy művet egy kifejezési formához, amelyet egy kritikai kiértékelés alapjaként használnak. @hu
toolkit label: bírált kifejezési forma @hu
toolkit definition: Egy kifejezési forma, amelyet egy kritikai kiértékelés alapjaként használnak. @hu
label: kritiikki ekspressiosta @fi
label: er kritikk av uttrykk @no
definition: Relaterer et verk til et uttrykk brukt som utgangspunkt for en kritisk evaluering. @no
label: is kritiek van expressie @nl
definition: Relateert een werk aan een expressie gebruikt als een basis voor een kritische beschouwing. @nl
toolkit label: kritiek van expressie @nl
toolkit definition: Een expressie gebruikt als een basis voor een kritische beschouwing. @nl
label: هو نقد لتعبيرة @ar
definition: يربط بين عمل وتعبيرة تستخدم كأساس لتقييم نقدي. @ar
toolkit label: نقد لتعبيرة @ar
toolkit definition: تعبيرة تستخدم كأساس لتقييم نقدي. @ar
label: arvustatud väljendus @et
definition: Seostab teose väljendusega, mis on aluseks kriitilisele hinnangule. @et
toolkit label: arvustatud väljendus @et
toolkit definition: Väljendus, mis on aluseks kriitilisele hinnangule. @et
label: è critica di espressione @it
definition: Correla un'opera a un'espressione usata come base per una valutazione critica. @it
toolkit label: critica di espressione @it
toolkit definition: Espressione usata come base per una valutazione critica. @it
sub property of: is evaluation of expression
label: ir kritika izteiksmei @lv
definition: Sasaista darbu ar izteiksmi, kas izmantota par pamatu kritikai. @lv
toolkit label: kritika izteiksmei @lv
toolkit definition: Izteiksme, kas izmantota par pamatu kritikai. @lv
label: 是内容表达的批评 @zh-hans
definition: 将一种作品与被一种作品批评性评价的一种内容表达关联起来。 @zh-hans
toolkit label: 内容表达的批评 @zh-hans
toolkit definition: 被一种作品批评性评价的一种内容表达 @zh-hans
has subproperty: P10281
label: anlatımın eleştirisidir @tr
definition: Bir eseri, bir eser tarafından eleştirel olarak değerlendirilen bir anlatımla ilişkilendirir. @tr
toolkit label: anlatımın eleştirisi @tr
toolkit definition: Bir eser tarafından eleştirel olarak değerlendirilen bir anlatım. @tr

is analysis of expression
status: Published
type: Property
lexical alias: analysisOfExpression.en
definition: Relates a work to an expression whose structure is described by a work.
domain: C10001
toolkit label: analysis of expression
toolkit definition: An expression whose structure is described by a work.
toolkit label: analyse d’une expression @fr
toolkit definition: Expression dont la structure est décrite par une œuvre. @fr
sub property of: is description of expression
toolkit label: análisis de (expresión) @es
toolkit definition: Una expresión que ha sido examinada para identificar sus componentes y sus relaciones. @es
instruction number: 23.5
label: er analyse af udtryk @da
definition: Relaterer et værk til et udtryk, hvis struktur er beskrevet af et værk. @da
toolkit label: analyse af udtryk @da
toolkit definition: Udtryk, hvis struktur er beskrevet af et værk. @da
definition: Met une œuvre en relation avec une expression dont la structure est décrite par une œuvre. @fr
label: là phân tích của (biểu hiện) @vi
definition: Liên kết tác phẩm với biểu hiện đã được kiểm tra để nhận dạng các thành phần và quan hệ của chúng. @vi
toolkit label: phân tích của (biểu hiện) @vi
toolkit definition: Biểu hiện đã được kiểm tra để nhận dạng các thành phần và quan hệ của chúng. @vi
label: ist Analyse von (Expression) @de
definition: Setzt ein Werk in Beziehung zu einer Expression, deren Struktur von einem Werk beschrieben wird. @de
toolkit label: Analyse von (Expression) @de
toolkit definition: Eine Expression, deren Struktur von einem Werk beschrieben wird. @de
label: est une analyse d’une expression @fr
definition: Liittää teoksen ekspressioon, jonka rakennetta teos kuvaa. @fi
toolkit label: analyysi ekspressiosta @fi
toolkit definition: Ekspressio, jonka osia ja niiden välisiä suhteita on tutkittu analyyttisesti. @fi
toolkit label: analyse av uttrykk @no
toolkit definition: Et uttrykk som har en struktur som beskrives av et verk. @no
label: és anàlisi d’una expressió @ca
definition: Relaciona una obra amb una expressió l’estructura de la qual és descrita per una obra. @ca
toolkit label: anàlisi d’una expressió @ca
toolkit definition: Expressió l’estructura de la qual és descrita per una obra. @ca
has element type: 2
label: είναι ανάλυση της (έκφραση) @el
definition: Συνδέει ένα έργο με μια έκφραση που έχει εξεταστεί για την ταύτιση των συστατικών της και των σχέσεων τους. @el
toolkit label: ανάλυση της (έκφραση) @el
toolkit definition: Μια έκφραση που έχει εξεταστεί για την ταύτιση των συστατικών της και των σχέσεών τους. @el
label: elemzése a következő kifejezési formának: @hu
definition: Hozzákapcsol egy művet egy kifejezési formához, amelynek alkotóelemeit leírja egy mű. @hu
toolkit label: elemzett kifejezési forma @hu
toolkit definition: Egy kifejezési forma, amelynek alkotóelemeit leírja egy mű. @hu
label: analyysi ekspressiosta @fi
label: er analyse av uttrykk @no
definition: Relaterer et verk til et uttrykk som har en struktur som beskrives av et verk. @no
label: is analyse van expressie @nl
definition: Relateert een werk aan een expressie waarvan de structuur beschreven wordt door een werk. @nl
toolkit label: analyse van expressie @nl
toolkit definition: Een expressie waarvan de structuur beschreven wordt door een werk. @nl
label: هو تحليل لتعبيرة @ar
definition: يربط بين عمل وتعبيرة يوصف هيكلها في عمل. @ar
toolkit label: تحليل لتعبيرة @ar
toolkit definition: تعبيرة يوصف هيكلها في عمل. @ar
label: analüüsitud väljendus @et
definition: Seostab teose väljendusega, mille struktuuri on teoses kirjeldatud. @et
toolkit label: analüüsitud väljendus @et
toolkit definition: Väljendus, mille struktuuri on teoses kirjeldatud. @et
label: è analisi di espressione @it
definition: Correla un’opera a un'espressione la cui struttura è descritta da un’opera. @it
toolkit label: analisi di espressione @it
toolkit definition: Espressione la cui struttura è descritta da un’opera. @it
label: ir analīze izteiksmei @lv
definition: Sasaista darbu ar izteiksmi, kuras struktūra aprakstīta darbā. @lv
toolkit label: analīze izteiksmei @lv
toolkit definition: Izteiksme, kuras struktūra aprakstīta darbā. @lv
label: 是内容表达的分析 @zh-hans
definition: 将一种作品与其结构被一种作品描述的一种内容表达关联起来。 @zh-hans
toolkit label: 内容表达的分析 @zh-hans
toolkit definition: 其结构被一种作品描述的一种内容表达 @zh-hans
has subproperty: P10278
label: anlatımın analizidir @tr
definition: Bir eseri, yapısının bir eser tarafından tanımlandığı bir anlatımla ilişkilendirir. @tr
toolkit label: anlatımın analzi @tr
toolkit definition: Bir eser tarafından yapısı tanımlanan bir anlatım. @tr

is evaluation of expression
status: Published
type: Property
lexical alias: evaluationOfExpression.en
definition: Relates a work to an expression that is examined or judged by a work.
domain: C10001
toolkit label: evaluation of expression
toolkit definition: An expression that is examined or judged by a work.
toolkit label: évaluation d’une expression @fr
toolkit definition: Expression qui est examinée ou jugée par une œuvre. @fr
toolkit label: evaluación de (expresión) @es
toolkit definition: Una expresión que es examinada o juzgada. @es
instruction number: 23.5
label: er evaluering af udtryk @da
definition: Relaterer et værk til et udtryk, som er undersøgt eller bedømt. @da
toolkit label: evaluering af udtryk @da
toolkit definition: Udtryk, som er undersøgt eller bedømt. @da
definition: Met une œuvre en relation avec une expression qui est examinée ou jugée par une œuvre. @fr
label: là đánh giá của (biểu hiện) @vi
definition: Liên kết tác phẩm với biểu hiện được kiểm tra hoặc đánh giá. @vi
toolkit label: đánh giá của (biểu hiện) @vi
toolkit definition: Biểu hiện được kiểm tra hoặc đánh giá. @vi
label: ist Evaluierung von (Expression) @de
definition: Setzt ein Werk in Beziehung zu einer Expression, die untersucht oder beurteilt wird. @de
toolkit label: Evaluierung von (Expression) @de
toolkit definition: Eine Expression, die untersucht oder beurteilt wird. @de
label: est une évaluation d’une expression @fr
definition: Liittää teoksen ekspressioon, jota on tutkittu tai arvioitu. @fi
toolkit label: arviointi ekspressiosta @fi
toolkit definition: Ekspressio, jota on tutkittu tai arvioitu. @fi
toolkit label: evaluering av uttrykk @no
toolkit definition: Et uttrykk som utforskes eller vurderes. @no
label: és avaluació d’una expressió @ca
definition: Relaciona una obra amb una expressió que és examinada o jutjada per una obra. @ca
toolkit label: avaluació d’una expressió @ca
toolkit definition: Expressió que és examinada o jutjada per una obra. @ca
has element type: 2
label: είναι αξιολόγηση της (έκφραση) @el
definition: Συνδέει ένα έργο με μια έκφραση που εξετάζεται ή κρίνεται. @el
toolkit label: αξιολόγηση της (έκφραση) @el
toolkit definition: Μια έκφραση που εξετάζεται ή κρίνεται. @el
label: értékelése a következő kifejezési formának: @hu
definition: Hozzákapcsol egy művet egy kifejezési formához, amelyet elemeznek és megítélnek. @hu
toolkit label: értékelt kifejezési forma @hu
toolkit definition: Egy kifejezési forma, amelyet elemeznek és megítélnek. @hu
label: arviointi ekspressiosta @fi
label: er evaluering av uttrykk @no
definition: Relaterer et verk til et uttrykk som utforskes eller vurderes. @no
label: is beschouwing van expressie @nl
definition: Relateert een werk aan een expressie die onderzocht of beoordeeld wordt. @nl
toolkit label: beschouwing van expressie @nl
toolkit definition: Een expressie die onderzocht of beoordeeld wordt. @nl
label: هو تقييم لتعبيرة @ar
definition: يربط بين عمل وتعبيرة يتم فحصها أو الحكم عليها. @ar
toolkit label: تقييم لتعبيرة @ar
toolkit definition: تعبيرة يتم فحصها أو الحكم عليها. @ar
label: hinnang väljendusele @et
definition: Seostab teose väljendusega, mida on kontrollitud või hinnatud. @et
toolkit label: hinnang väljendusele @et
toolkit definition: Väljendus, mida on kontrollitud või hinnatud. @et
label: è valutazione di espressione @it
definition: Correla un’opera a un'espressione che è esaminata o valutata. @it
toolkit label: valutazione di espressione @it
toolkit definition: Espressione che è esaminata o valutata. @it
sub property of: has subject expression
label: ir novērtējums izteiksmei @lv
definition: Sasaista darbu ar izteiksmi, kas tiek pārbaudīta vai vērtēta. @lv
toolkit label: novērtējums izteiksmei @lv
toolkit definition: Izteiksme, kas tiek pārbaudīta vai vērtēta. @lv
label: 是内容表达的评价 @zh-hans
definition: 将一种作品与被一种作品检查或评判的一种内容表达关联起来。 @zh-hans
toolkit label: 内容表达的评价 @zh-hans
toolkit definition: 被一种作品检查或评判的一种内容表达 @zh-hans
has subproperty: is critique of expression
has subproperty: is review of expression
has subproperty: P10279
label: anlatımın değerlendirmesidir @tr
definition: Bir eseri, bir eser tarafından incelenen veya değerlendirilen bir anlatımla ilişkilendirir. @tr
toolkit label: anlatımın değerlendirilmesi @tr
toolkit definition: Bir eser tarafından incelenen veya değerlendirilen bir anlatım. @tr

is description of expression
status: Published
type: Property
lexical alias: descriptionOfExpression.en
definition: Relates a work to an expression that is described by a work.
domain: C10001
toolkit label: description of expression
toolkit definition: An expression that is described by a work.
toolkit label: description d’une expression @fr
toolkit definition: Expression qui est décrite par une œuvre. @fr
sub property of: has subject expression
toolkit label: descripción de (expresión) @es
toolkit definition: Una expresión descrita por una obra que describe. @es
instruction number: 23.5
label: er beskrivelse af udtryk @da
definition: Relaterer et værk til et udtryk, som er beskrevet af et værk. @da
toolkit label: beskrivelse af udtryk @da
toolkit definition: Udtryk, som er beskrevet af et værk. @da
definition: Met une œuvre en relation avec une expression qui est décrite par une œuvre. @fr
label: là mô tả của (biểu hiện) @vi
definition: Liên kết tác phẩm với biểu hiện được mô tả bởi tác phẩm mô tả. @vi
toolkit label: mô tả của (biểu hiện) @vi
toolkit definition: Biểu hiện được mô tả bởi tác phẩm mô tả. @vi
label: ist Beschreibung von (Expression) @de
definition: Setzt ein Werk in Beziehung zu einer Expression, die von einem Werk beschrieben wird. @de
toolkit label: Beschreibung von (Expression) @de
toolkit definition: Eine Expression, die von einem Werk beschrieben wird. @de
label: est une description d’une expression @fr
definition: Liittää teoksen ekspressioon, jota teos kuvaa. @fi
toolkit label: kuvaus ekspressiosta @fi
toolkit definition: Ekspressio, jota teos kuvaa. @fi
toolkit label: beskrivelse av uttrykk @no
toolkit definition: Et uttrykk som beskrives av et verk. @no
label: és descripció d’una expressió @ca
definition: Relaciona una obra amb una expressió que és descrita per una obra. @ca
toolkit label: descripció d’una expressió @ca
toolkit definition: Expressió que és descrita per una obra. @ca
has element type: 2
label: είναι περιγραφή της (έκφραση) @el
definition: Συνδέει ένα έργο με μια έκφραση που περιγράφεται από ένα περιγραφικό έργο. @el
toolkit label: περιγραφή της (έκφραση) @el
toolkit definition: Μια έκφραση που περιγράφεται από ένα περιγραφικό έργο. @el
label: leírása a következő kifejezési formának: @hu
definition: Hozzákapcsol egy művet egy kifejezési formához, amelyet egy mű leír. @hu
toolkit label: leírt kifejezési forma @hu
toolkit definition: Egy kifejezési forma, amelyet egy mű leír. @hu
sub property of: is description of RDA entity
label: kuvaus ekspressiosta @fi
label: er beskrivelse av uttrykk @no
definition: Relaterer et verk til et uttrykk som beskrives av et verk. @no
label: is beschrijving van expressie @nl
definition: Relateert een werk aan een expressie die beschreven wordt door een werk. @nl
toolkit label: beschrijving van expressie @nl
toolkit definition: Een expressie die beschreven wordt door een werk. @nl
label: هو وصف لتعبيرة @ar
definition: يربط بين عمل وتعبيرة موصوفة في عمل. @ar
toolkit label: وصف لتعبيرة @ar
toolkit definition: تعبيرة موصوفة في عمل. @ar
label: kirjeldatud väljendus @et
definition: Seostab teose väljendusega, mida teoses on kirjeldatud. @et
toolkit label: kirjeldatud väljendus @et
toolkit definition: Väljendus, mida teoses on kirjeldatud @et
label: è descrizione di espressione @it
definition: Correla un’opera a una espressione che è descritta da un’opera. @it
toolkit label: descrizione di espressione @it
toolkit definition: Espressione che è descritta da un’opera. @it
label: ir apraksts izteiksmei @lv
definition: Sasaista darbu ar izteiksmi, kura aprakstīta darbā. @lv
toolkit label: apraksts izteiksmei @lv
toolkit definition: Izteiksme, kura aprakstīta darbā. @lv
label: 是内容表达的描述 @zh-hans
definition: 将一种作品与被一种作品描述的一种内容表达关联起来。 @zh-hans
toolkit label: 内容表达的描述 @zh-hans
toolkit definition: 被一种作品描述的一种内容表达 @zh-hans
has subproperty: is analysis of expression
has subproperty: is commentary on expression
has subproperty: is metadata description of expression
has subproperty: P10277
label: anlatımın tanımıdır @tr
definition: Bir eseri, bir eser tarafından tanımlanan bir anlatımla ilişkilendirir. @tr

is review of expression
status: Published
type: Property
lexical alias: reviewOfExpression.en
definition: Relates a work to an expression that is briefly evaluated by a work.
domain: C10001
toolkit label: review of expression
toolkit definition: An expression that is briefly evaluated by a work.
toolkit label: recension d’une expression @fr
toolkit definition: Expression qui est brièvement évaluée par une œuvre. @fr
toolkit label: reseña de (expresión) @es
toolkit definition: Una expresión usada como base para una evaluación breve. @es
instruction number: 23.5
label: er anmeldelse af udtryk @da
definition: Relaterer et værk til et udtryk, som anvendes som grundlag for en kortfattet evaluering. @da
toolkit label: anmeldelse af udtryk @da
toolkit definition: Udtryk, som anvendes som grundlag for en kortfattet evaluering. @da
definition: Met une œuvre en relation avec une expression qui est brièvement évaluée par une œuvre. @fr
label: là tổng quan của (biểu hiện) @vi
definition: Liên kết tác phẩm với biểu thị được dùng như là cơ sở cho đánh giá ngắn gọn. @vi
toolkit label: tổng quan của (biểu hiện) @vi
toolkit definition: Biểu thị được dùng như là cơ sở cho đánh giá ngắn gọn. @vi
label: ist Rezension von (Expression) @de
definition: Setzt ein Werk in Beziehung zu einer Expression, die als Grundlage für eine kurze Untersuchung verwendet wird. @de
toolkit label: Rezension von (Expression) @de
toolkit definition: Eine Expression, die als Grundlage für eine kurze Untersuchung verwendet wird. @de
label: est une recension d’une expression @fr
definition: Liittää teoksen ekspressioon, jota on käytetty lyhyen arvioinnin perustana. @fi
toolkit label: arvostelu ekspressiosta @fi
toolkit definition: Ekspressio, jota on käytetty lyhyen arvioinnin perustana. @fi
toolkit label: anmeldelse av uttrykk @no
toolkit definition: Et uttrykk brukt som utgangspunkt for en kortfattet evaluering. @no
label: és revisió d’una expressió @ca
definition: Relaciona una obra amb una expressió que és avaluada breument per una obra. @ca
toolkit label: revisió d’una expressió @ca
toolkit definition: Expressió que és avaluada breument per una obra. @ca
has element type: 2
label: είναι εξέταση της (έκφρασης) @el
definition: Συνδέει ένα έργο με μια έκφραση που χρησιμοποιείται ως η βάση για μια σύντομη αξιολόγηση. @el
toolkit label: εξέταση της (έκφραση) @el
toolkit definition: Μια έκφραση που χρησιμοποιείται ως η βάση για μια σύντομη αξιολόγηση. @el
label: szemlézi a következő kifejezési formát: @hu
definition: Hozzákapcsol egy művet egy kifejezési formához, amelyet egy rövid kiértékelés alapjaként használnak. @hu
toolkit label: szemlézett kifejezési forma @hu
toolkit definition: Egy kifejezési forma, amelyet egy rövid kiértékelés alapjaként használnak. @hu
label: arvostelu ekspressiosta @fi
label: er anmeldelse av uttrykk @no
definition: Relaterer et verk til et uttrykk brukt som utgangspunkt for en kortfattet evaluering. @no
label: is recensie van expressie @nl
definition: Relateert een werk aan een expressie die gebruikt is als een basis voor een korte beschouwing. @nl
toolkit label: recensie van expressie @nl
toolkit definition: Een expressie die gebruikt is als een basis voor een korte beschouwing. @nl
label: هو مراجعة لتعبيرة @ar
definition: يربط بين عمل وتعبيرة تستخدم كأساس لتقييم موجز. @ar
toolkit label: مراجعة لتعبيرة @ar
toolkit definition: تعبيرة تستخدم كأساس لتقييم موجز. @ar
label: ülevaade väljendusest @et
definition: Seostab teose väljendusega, mis on lühihinnangu aluseks. @et
toolkit label: ülevaade väljendusest @et
toolkit definition: Väljendus, mis on lühihinnangu aluseks. @et
label: è recensione di espressione @it
definition: Correla un'opera a un'espressione usata come base per una breve valutazione. @it
toolkit label: recensione di espressione @it
toolkit definition: Espressione usata come base per una breve valutazione. @it
sub property of: is evaluation of expression
label: ir recenzija izteiksmei @lv
definition: Sasaista darbu ar izteiksmi, kas izmantota par pamatu īsam novērtējumam. @lv
toolkit label: recenzija izteiksmei @lv
toolkit definition: Izteiksme, kas izmantota par pamatu īsam novērtējumam. @lv
label: 是内容表达的评论 @zh-hans
definition: 将一种作品与被一种作品简要评价的一种内容表达关联起来。 @zh-hans
toolkit label: 内容表达的评论 @zh-hans
toolkit definition: 被一种作品简要评价的一种内容表达 @zh-hans
has subproperty: P10280
label: Anlatımın incelemesidir @tr
definition: Bir eseri, bir eseri tarafından kısaca değerlendirilen bir anlatımla ilişkilendirir. @tr
toolkit label: anlatımın incelenmesi @tr
toolkit definition: Bir çalışma tarafından kısaca değerlendirilen bir anlatım. @tr

is commentary on expression
status: Published
type: Property
lexical alias: commentaryOnExpression.en
definition: Relates a work to an expression used as a basis for a set of explanatory or critical notes.
domain: C10001
toolkit label: commentary on expression
toolkit definition: An expression used as a basis for a set of explanatory or critical notes.
toolkit label: commentaire sur une expression @fr
toolkit definition: Expression qui sert de base à un ensemble de notes explicatives ou critiques. @fr
sub property of: is description of expression
toolkit label: comentario sobre (expresión) @es
toolkit definition: Una expresión usada como base para un conjunto de notas explicativas o críticas. @es
instruction number: 23.5
label: er kommentar til udtryk @da
definition: Relaterer et værk til et udtryk, som anvendes som grundlag for et sæt af forklarende eller kritiske kommentarer. @da
toolkit label: kommentar til udtryk @da
toolkit definition: Udtryk, som anvendes som grundlag for et sæt af forklarende eller kritiske kommentarer. @da
definition: Met une œuvre en relation avec une expression qui sert de base à un ensemble de notes explicatives ou critiques. @fr
label: là bình luận về (biểu hiện) @vi
definition: Liên kết tác phẩm với biểu thị được dùng như là chuỗi các ghi chú giải thích hoặc phê bình. @vi
toolkit label: bình luận về (biểu hiện) @vi
toolkit definition: Biểu thị được dùng như là chuỗi các ghi chú giải thích hoặc phê bình. @vi
label: ist Kommentar zu (Expression) @de
definition: Setzt ein Werk in Beziehung zu einer Expression, die als Grundlage für eine Reihe von erläuternden oder kritischen Anmerkungen verwendet wird. @de
toolkit label: Kommentar zu (Expression) @de
toolkit definition: Eine Expression, die als Grundlage für eine Reihe von erläuternden oder kritischen Anmerkungen verwendet wird. @de
label: est un commentaire sur une expression @fr
definition: Liittää teoksen selittävien tai kriittisten huomautusten joukon perustana käytettyyn ekspressioon. @fi
toolkit label: kommentaari ekspressiosta @fi
toolkit definition: Selittävien tai kriittisten huomautusten joukon perustana käytetty ekspressio. @fi
toolkit label: kommentar til uttrykk @no
toolkit definition: Et uttrykk brukt som utgangspunkt for et sett med forklarende eller kritiske noter. @no
label: és comentari sobre una expressió @ca
definition: Relaciona una obra amb una expressió usada com a base d’un conjunt de notes explicatives o crítiques. @ca
toolkit label: comentari sobre una expressió @ca
toolkit definition: Expressió usada com a base d’un conjunt de notes explicatives o crítiques. @ca
has element type: 2
label: είναι σχόλια στην (έκφραση) @el
definition: Συνδέει ένα έργο με μια έκφραση που χρησιμοποιείται ως η βάση για ένα σύνολο από επεξηγηματικές ή κριτικές σημειώσεις. @el
toolkit label: σχόλια στην (έκφραση) @el
toolkit definition: Μια έκφραση που χρησιμοποιείται ως η βάση για ένα σύνολο από επεξηγηματικές ή κριτικές σημειώσεις. @el
label: kommentárja a következő kifejezési formának @hu
definition: Hozzákapcsol egy művet egy kifejezési formához, amelyet magyarázó vagy kritikai jegyzetek halmazának alapjaként használnak. @hu
toolkit label: kommentált kifejezési forma @hu
toolkit definition: Egy kifejezési forma, amelyet magyarázó vagy kritikai jegyzetek halmazának alapjaként használnak. @hu
label: kommentaari ekspressiosta @fi
label: er kommentar til uttrykk @no
definition: Relaterer et verk til et uttrykk brukt som utgangspunkt for et sett med forklarende eller kritiske noter. @no
label: is commentaar op expressie @nl
definition: Relateert een werk aan een expressie gebruikt als een basis voor een verzameling van verklarende of kritische noten. @nl
toolkit label: commentaar op expressie @nl
toolkit definition: Een expressie gebruikt als een basis voor een verzameling van verklarende of kritische noten. @nl
label: هو تعليق على تعبيرة @ar
definition: يربط بين عمل وتعبيرة تستخدم كأساس لمجموعة ملاحظات شارحة أو نقدية. @ar
toolkit label: تعليق على تعبيرة @ar
toolkit definition: تعبيرة تستخدم كأساس لمجموعة ملاحظات شارحة أو نقدية. @ar
label: kommenteeritud väljendus @et
definition: Seostab teose väljendusega, mis on aluseks selgitavate või kriitiliste märkuste kogumile. @et
toolkit label: kommenteeritud väljendus @et
toolkit definition: Väljendus, mis on aluseks selgitavate või kriitiliste märkuste kogumile. @et
label: è commento su espressione @it
definition: Correla un’opera a un'espressione utilizzata come base per un insieme di note esplicative o critiche. @it
toolkit label: commento di espressione @it
toolkit definition: Espressione utilizzata come base per un insieme di note esplicative o critiche. @it
label: ir komentārs izteiksmei @lv
definition: Sasaista darbu ar izteiksmi, kas izmantota par pamatu virknei paskaidrojošu vai kritisku piezīmju. @lv
toolkit label: komentārs izteiksmei @lv
toolkit definition: Izteiksme, kas izmantota par pamatu virknei paskaidrojošu vai kritisku piezīmju. @lv
label: 是关于内容表达的评注 @zh-hans
definition: 将一种作品与被用作一个解释性或评论性附注之集合的基础的一种内容表达关联起来。 @zh-hans
toolkit label: 关于内容表达的评注 @zh-hans
toolkit definition: 被用作一个解释性或评论性附注之集合的基础的一种内容表达 @zh-hans
has subproperty: P10282
label: anlatım hakkında yorumdur @tr
definition: Bir eseri, bir dizi açıklayıcı veya eleştirel not için temel olarak kullanılan bir anlatımla ilişkilendirir. @tr
toolkit label: anlatıma ilişkin yorum @tr
toolkit definition: Bir dizi açıklayıcı veya eleştirel not için temel olarak kullanılan bir anlatım. @tr

is commentary on manifestation
status: Published
type: Property
lexical alias: commentaryOnManifestation.en
definition: Relates a work to a manifestation used as a basis for a set of explanatory or critical notes.
domain: C10001
toolkit label: commentary on manifestation
toolkit definition: A manifestation used as a basis for a set of explanatory or critical notes.
toolkit label: commentaire sur une manifestation @fr
toolkit definition: Manifestation qui sert de base à un ensemble de notes explicatives ou critiques. @fr
sub property of: is description of manifestation
toolkit label: comentario sobre (manifestación) @es
toolkit definition: Una manifestación usada como base para un conjunto de notas explicativas o críticas. @es
instruction number: 23.5
label: er kommentar til manifestation @da
definition: Relaterer et værk til en manifestation, som anvendes som grundlag for et sæt af forklarende eller kritiske kommentarer. @da
toolkit label: kommentar til manifestation @da
toolkit definition: Manifestation, som anvendes som grundlag for et sæt af forklarende eller kritiske kommentarer. @da
definition: Met une œuvre en relation avec une manifestation qui sert de base à un ensemble de notes explicatives ou critiques. @fr
label: là bình luận về (biểu thị) @vi
definition: Liên kết tác phẩm với biểu thị được dùng như là cơ sở cho chuỗi các ghi chú giải thích hoặc phê bình. @vi
toolkit label: bình luận về (biểu thị) @vi
toolkit definition: Biểu thị được dùng như là cơ sở cho chuỗi các ghi chú giải thích hoặc phê bình. @vi
label: ist Kommentar zu (Manifestation) @de
definition: Setzt ein Werk in Beziehung zu einer Manifestation, die als Grundlage für eine Reihe von erläuternden oder kritischen Anmerkungen verwendet wird. @de
toolkit label: Kommentar zu (Manifestation) @de
toolkit definition: Eine Manifestation, die als Grundlage für eine Reihe von erläuternden oder kritischen Anmerkungen verwendet wird. @de
label: est un commentaire sur une manifestation @fr
definition: Liittää teoksen selittävien tai kriittisten huomautusten joukon perustana käytettyyn manifestaatioon. @fi
toolkit label: kommentaari manifestaatiosta @fi
toolkit definition: Selittävien tai kriittisten huomautusten joukon perustana käytetty manifestaation. @fi
toolkit label: kommentar til manifestasjon @no
toolkit definition: En manifestasjon brukt som utgangspunkt for et sett med forklarende eller kritiske noter. @no
label: és comentari sobre una manifestació @ca
definition: Relaciona una obra amb una manifestació usada com a base d’un conjunt de notes explicatives o crítiques. @ca
toolkit label: comentari sobre una manifestació @ca
toolkit definition: Manifestació usada com a base d’un conjunt de notes explicatives o crítiques. @ca
has element type: 2
label: είναι σχόλια στην (εκδήλωση) @el
definition: Συνδέει ένα έργο με μια εκδήλωση που χρησιμοποιείται ως η βάση για ένα σύνολο από επεξηγηματικές ή κριτικές σημειώσεις. @el
toolkit label: σχόλια στην (εκδήλωση) @el
toolkit definition: Μια εκδήλωση που χρησιμοποιείται ως η βάση για ένα σύνολο από επεξηγηματικές ή κριτικές σημειώσεις. @el
label: kommentárja a következő megjelenési formának: @hu
definition: Hozzákapcsol egy művet egy megjelenési formához, amelyet magyarázó vagy kritikai jegyzetek halmazának alapjaként használnak. @hu
toolkit label: kommentált megjelenési forma @hu
toolkit definition: Egy megjelenési forma, amelyet magyarázó vagy kritikai jegyzetek halmazának alapjaként használnak. @hu
label: kommentaari manifestaatiosta @fi
label: er kommentar til manifestasjon @no
definition: Relaterer et verk til en manifestasjon brukt som utgangspunkt for et sett med forklarende eller kritiske noter. @no
label: is commentaar op manifestatie @nl
definition: Relateert een werk aan een manifestatie gebruikt als een basis voor een verzameling van verklarende of kritische noten. @nl
toolkit label: commentaar op manifestatie @nl
toolkit definition: Een manifestatie gebruikt als een basis voor een verzameling van verklarende of kritische noten. @nl
label: هو تعليق على تجسيدة @ar
definition: يربط بين عمل وتجسيدة تستخدم كأساس لمجموعة ملاحظات شارحة أو نقدية. @ar
toolkit label: تعليق على تجسيدة @ar
toolkit definition: تجسيدة تستخدم كأساس لمجموعة ملاحظات شارحة أو نقدية. @ar
label: kommenteeritud kehastus @et
definition: Seostab teose kehastusega, mis on aluseks selgitavate või kriitiliste märkuste kogumile. @et
toolkit label: kommenteeritud kehastus @et
toolkit definition: Kehastus, mis on aluseks selgitavate või kriitiliste märkuste kogumile. @et
label: è commento su manifestazione @it
definition: Correla un’opera a una manifestazione utilizzata come base per un insieme di note esplicative o critiche. @it
toolkit label: commento su manifestazione @it
toolkit definition: Manifestazione utilizzata come base per un insieme di note esplicative o critiche. @it
label: ir komentārs manifestācijai @lv
definition: Sasaista darbu ar manifestāciju, kas izmantota par pamatu virknei paskaidrojošu vai kritisku piezīmju. @lv
toolkit label: komentārs manifestācijai @lv
toolkit definition: Manifestācija, kas izmantota par pamatu virknei paskaidrojošu vai kritisku piezīmju. @lv
label: 是关于载体表现的评注 @zh-hans
definition: 将一种作品与被用作一个解释性或评论性附注之集合的基础的一种载体表现关联起来。 @zh-hans
toolkit label: 关于载体表现的评注 @zh-hans
toolkit definition: 被用作一个解释性或评论性附注之集合的基础的一种载体表现 @zh-hans
has subproperty: P10276
label: gösterim hakkında yorumdur @tr
definition: Bir eseri, bir dizi açıklayıcı veya eleştirel not için temel olarak kullanılan bir gösterimle ilişkilendirir. @tr
toolkit label: gösterime ilişkin yorum @tr
toolkit definition: Bir dizi açıklayıcı veya eleştirel not için temel olarak kullanılan gösterim. @tr

is commentary on item
status: Published
type: Property
lexical alias: commentaryOnItem.en
definition: Relates a work to an item used as a basis for a set of explanatory or critical notes.
domain: C10001
toolkit label: commentary on item
toolkit definition: An item used as a basis for a set of explanatory or critical notes.
toolkit label: commentaire sur un item @fr
toolkit definition: Item qui sert de base à un ensemble de notes explicatives ou critiques. @fr
sub property of: is description of item
toolkit label: comentario sobre (ítem) @es
toolkit definition: Un ítem usado como base para un conjunto de notas explicativas o críticas. @es
instruction number: 23.5
label: er kommentar til eksemplar @da
definition: Relaterer et værk til et eksemplar, som anvendes som grundlag for et sæt af forklarende eller kritiske kommentarer. @da
toolkit label: kommentar til eksemplar @da
toolkit definition: Eksemplar, som anvendes som grundlag for et sæt af forklarende eller kritiske kommentarer. @da
definition: Met une œuvre en relation avec un item qui sert de base à un ensemble de notes explicatives ou critiques. @fr
label: là bình luận về (bản) @vi
definition: Liên kết tác phẩm với bản được dùng như là cơ sở cho chuỗi các ghi chú giải thích hoặc phê bình. @vi
toolkit label: bình luận về (bản) @vi
toolkit definition: Bản được dùng như là cơ sở cho chuỗi các ghi chú giải thích hoặc phê bình. @vi
label: ist Kommentar zu (Exemplar) @de
definition: Setzt ein Werk in Beziehung zu einem Exemplar, das als Grundlage für eine Reihe von erläuternden oder kritischen Anmerkungen verwendet wird. @de
toolkit label: Kommentar zu (Exemplar) @de
toolkit definition: Ein Exemplar, das als Grundlage für eine Reihe von erläuternden oder kritischen Anmerkungen verwendet wird. @de
label: est un commentaire sur un item @fr
definition: Liittää teoksen selittävien tai kriittisten huomautusten joukon perustana käytettyyn kappaleeseen. @fi
toolkit label: kommentaari kappaleesta @fi
toolkit definition: Selittävien tai kriittisten huomautusten joukon perustana käytetty kappale. @fi
toolkit definition: Et eksemplar brukt som utgangspunkt for et sett med forklarende eller kritiske noter. @no
label: és comentari sobre un ítem @ca
definition: Relaciona una obra amb un ítem usat com a base d’un conjunt de notes explicatives o crítiques. @ca
toolkit label: comentari sobre un ítem @ca
toolkit definition: Ítem usat com a base d’un conjunt de notes explicatives o crítiques. @ca
has element type: 2
label: είναι σχόλια στο (αντίτυπο) @el
definition: Συνδέει ένα έργο με ένα αντίτυπο που χρησιμοποιείται ως η βάση για ένα σύνολο από επεξηγηματικές ή κριτικές σημειώσεις. @el
toolkit label: σχόλια στο (αντίτυπο) @el
toolkit definition: Ένα αντίτυπο που χρησιμοποιείται ως η βάση για ένα σύνολο από επεξηγηματικές ή κριτικές σημειώσεις. @el
label: kommentárja a következő példánynak: @hu
definition: Hozzákapcsol egy művet egy példányhoz, amelyet magyarázó vagy kritikai jegyzetek halmazának alapjaként használnak. @hu
toolkit label: kommentált példány @hu
toolkit definition: Egy példány, amelyet magyarázó vagy kritikai jegyzetek halmazának alapjaként használnak. @hu
label: kommentaari kappaleesta @fi
definition: Relaterer et verk til et eksemplar brukt som utgangspunkt for et sett med forklarende eller kritiske noter. @no
label: is commentaar op item @nl
definition: Relateert een werk aan een item gebruikt als een basis voor een verzameling van verklarende of kritische noten. @nl
toolkit label: commentaar op item @nl
toolkit definition: Een item gebruikt als een basis voor een verzameling van verklarende of kritische noten. @nl
label: هو تعليق على مفردة @ar
definition: يربط بين عمل ومفردة تستخدم كأساس لمجموعة ملاحظات شارحة أو نقدية. @ar
toolkit label: تعليق على مفردة @ar
toolkit definition: مفردة تستخدم كأساس لمجموعة ملاحظات شارحة أو نقدية. @ar
label: kommenteeritud eksemplar @et
definition: Seostab teose eksemplariga, mis on aluseks selgitavate või kriitiliste märkuste kogumile. @et
toolkit label: kommenteeritud eksemplar @et
toolkit definition: Eksemplar, mis on aluseks selgitavate või kriitiliste märkuste kogumile. @et
label: è commento su item @it
definition: Correla un’opera a un item utilizzato come base per un insieme di note esplicative o critiche. @it
toolkit label: commentario su item @it
toolkit definition: Item utilizzato come base per un insieme di note esplicative o critiche. @it
label: ir komentārs vienībai @lv
definition: Sasaista darbu ar vienību, kas izmantota par pamatu virknei paskaidrojošu vai kritisku piezīmju. @lv
toolkit label: komentārs vienībai @lv
toolkit definition: Vienība, kas izmantota par pamatu virknei paskaidrojošu vai kritisku piezīmju. @lv
label: 是关于单件的评注 @zh-hans
definition: 将一种作品与被用作一个解释性或评论性附注之集合的基础的一个单件关联起来。 @zh-hans
toolkit label: 关于单件的评注 @zh-hans
toolkit definition: 被用作一个解释性或评论性附注之集合的基础的一个单件 @zh-hans
has subproperty: P10270
label: kopya hakkında yorumdur @tr
definition: Bir eseri, bir dizi açıklayıcı veya eleştirel notlar seti için temel olarak kullanılan bir kopyayla ilişkilendirir. @tr
toolkit label: kopyaya ilişkin yorum @tr
toolkit definition: Bir dizi açıklayıcı veya eleştirel bilgiye temel olarak kullanılan bir kopya. @tr

has concordance work (Deprecated)
definition: Relates a work to a work that consists of an index of all or selected words that occur in a realization of a textual work. (Deprecated)
type: Property
domain: C10001
sub property of: is augmented by work
lexical alias: concordanceWork.en
toolkit label: concordance work (Deprecated)
toolkit definition: A work that consists of an index of all or selected words that occur in a realization of a textual work. (Deprecated)
toolkit label: concordance (œuvre) @fr
toolkit definition: Œuvre qui consiste en un index de la totalité ou d’une partie des mots qui apparaissent dans une réalisation d’une œuvre textuelle. @fr
toolkit label: concordancia (obra) @es
toolkit definition: Una obra que consiste en un indice de todas las palabras en la obra principal. @es
instruction number: 24.5
label: har konkordansværk @da
definition: Relaterer et værk til et værk, som består af et indeks over alle ordene i et værk. @da
toolkit label: konkordansværk @da
toolkit definition: Værk, som består af et indeks over alle ordene i et værk. @da
definition: Met une œuvre en relation avec une œuvre qui consiste en un index de la totalité ou d’une partie des mots qui apparaissent dans une réalisation d’une œuvre textuelle. @fr
label: là sách dẫn (tác phẩm) @vi
definition: Liên kết tác phẩm với tác phẩm có chứa chỉ mục của tất cả các từ của tác phẩm nổi trội. @vi
toolkit label: sách dẫn (tác phẩm) @vi
toolkit definition: Tác phẩm có chứa chỉ mục của tất cả các từ của tác phẩm nổi trội. @vi
label: hat Konkordanz (Werk) @de
definition: Setzt ein Werk in Beziehung zu einem Werk, das aus einem Index aller oder ausgewählter Wörter besteht, die in einer Realisierung eines textlichen Werks vorkommen. @de
toolkit label: Konkordanz (Werk) @de
toolkit definition: Ein Werk, das aus einem Index aller oder ausgewählter Wörter besteht, die in einer Realisierung eines textlichen Werks vorkommen. @de
label: a pour concordance (œuvre) @fr
definition: Liittää teoksen teokseen, joka koostuu kaikkien tai valikoitujen tekstiteoksen toteutuksessa esiintyvien sanojen hakemistosta. @fi
toolkit label: konkordanssihakemisto (teos) @fi
toolkit definition: Teos, joka koostuu kaikkien tai valikoitujen tekstiteoksen toteutuksessa esiintyvien sanojen hakemistosta. @fi
toolkit label: konkordans (verk) @no
toolkit definition: Et verk som består av et register over alle ordene i et verk. @no
label: té com a obra de concordança @ca
definition: Relaciona una obra amb una obra que consisteix en un índex de totes les paraules o de les seleccionades que apareixen en una realització d’una obra textual. @ca
toolkit label: obra de concordança @ca
toolkit definition: Obra que consisteix en un índex de totes les paraules o de les seleccionades que apareixen en una realització d’una obra textual. @ca
has element type: 2
label: είναι συμφραστικός πίνακας λέξεων (έργο) @el
definition: Συνδέει ένα έργο με ένα έργο, το οποίο συνίσταται από ένα ευρετήριο όλων των λέξεων σε ένα κύριο έργο. @el
toolkit label: συμφραστικός πίνακας λέξεων (έργο) @el
toolkit definition: Ένα έργο το οποίο συνίσταται από ένα ευρετήριο όλων των λέξεων σε ένα κύριο έργο. @el
label: konkordanciája a következő mű: @hu
definition: Hozzákapcsol egy művet egy műhöz, amely egy szöveges mű összes szavának vagy válogatott szavak mutatójából áll. @hu
toolkit label: konkordanciamű @hu
toolkit definition: Egy mű, amely egy szöveges mű összes szavának vagy válogatott szavak mutatójából áll. @hu
label: konkordanssihakemisto (teos) @fi
label: har konkordans (verk) @no
definition: Relaterer et verk til et verk som består av et register over alle ordene i et verk. @no
label: heeft concordantiewerk @nl
definition: Realiseert een werk aan een werk dat bestaat uit een index van alle of geselecteerde woorden die voorkomen in een realisatie van een tekstwerk. @nl
toolkit label: concordantiewerk @nl
toolkit definition: Een werk dat bestaat uit een index van alle of geselecteerde woorden die voorkomen in een realisatie van een tekstwerk. @nl
label: له عمل كشاف نصوص @ar
definition: يربط عمل بعمل يتكون من كشاف لكل الكلمات أو كالكلمات المختارة المتحققة في عمل نصي. @ar
toolkit label: عمل كشاف نصوص @ar
toolkit definition: عمل يتكون من كشاف لكل الكلمات أو الكلمات المختارة المتحققة في عمل نصي. @ar
label: konkordants (teos) @et
definition: Seostab teose teosega, mis sisaldab teose kõigi sõnade registri. @et
toolkit label: konkordants (teos) @et
toolkit definition: Teos, mis sisaldab teose kõigi sõnade registri. @et
label: ha come concordanza opera @it
definition: Correla un’opera a un’opera che consiste di un indice di tutte le parole di un’opera. @it
toolkit label: concordanza opera @it
toolkit definition: Opera che consiste di un indice di tutte le parole di un’opera. @it
status: Deprecated
label: darbs: konkordance @lv
definition: Sasaista darbu ar darbu - alfabētisks vārdu/izteicienu saraksts. @lv
toolkit label: darbs: konkordance @lv
toolkit definition: Darbs - alfabētisks vārdu/izteicienu saraksts. @lv
has subproperty: P10111

has strings of coordinate pairs
status: Published
definition: Relates a work to a place that is the area of coverage of a cartographic work that is identified by a polygon using coordinates for each vertex.
type: Property
domain: C10001
sub property of: has coordinates of cartographic content
lexical alias: stringsOfCoordinatePairs.en
instruction number: 7.4.3
toolkit label: strings of coordinate pairs
toolkit definition: A place that is the area of coverage of a cartographic work that is identified by a polygon using coordinates for each vertex.
toolkit label: chaînes de paires de coordonnées @fr
toolkit definition: Lieu qui constitue la zone de couverture d’une œuvre cartographique identifiée par un polygone à l’aide des coordonnées de chaque sommet. @fr
toolkit label: cadenas de pares de coordenadas @es
toolkit definition: Un sistema para identificar el área precisa incluida en el contenido cartográfico de un recurso utilizando coordenadas para cada vértice de un polígono. @es
label: har strenge med koordinatpar @da
definition: Relaterer et værk til et system til identificering af det præcise areal, som dækkes af et værks kartografiske indhold, ved anvendelse af koordinater for hvert af en polygons toppunkter. @da
toolkit label: strenge med koordinatpar @da
toolkit definition: System til identificering af det præcise areal, som dækkes af et værks kartografiske indhold, ved anvendelse af koordinater for hvert af en polygons toppunkter. @da
definition: Met une œuvre en relation avec un lieu qui constitue la zone de couverture d’une œuvre cartographique identifiée par un polygone à l’aide des coordonnées de chaque sommet. @fr
label: có chuỗi các cặp toạ độ @vi
definition: Liên kết tác phẩm với hệ thống để nhận dạng khu vực chính xác được bao quát bằng nội dung bản đồ của tác phẩm sử dụng các toạ độ cho mỗi đỉnh của đa giác. @vi
toolkit label: chuỗi các cặp toạ độ @vi
toolkit definition: Hệ thống để nhận dạng khu vực chính xác được bao quát bằng nội dung bản đồ của tác phẩm sử dụng các toạ độ cho mỗi đỉnh của đa giác. @vi
label: hat Reihen von Koordinatenpaaren @de
definition: Setzt ein Werk in Beziehung zu einem Gebiet, das den Abdeckungsbereich eines kartografischen Werks darstellt und durch ein Vieleck mit Koordinaten für jeden Eckpunkt identifiziert wird. @de
toolkit label: Reihen von Koordinatenpaaren @de
toolkit definition: Ein Gebiet, das den Abdeckungsbereich eines kartografischen Werks darstellt und durch ein Vieleck mit Koordinaten für jeden Eckpunkt identifiziert wird. @de
label: a pour chaînes de paires de coordonnées @fr
definition: Liittää teoksen paikkaan, joka on kartografisen teoksen kattama alue, joka on identifioitu jokaisen kärjen koordinaatteja käyttävällä monikulmiolla. @fi
toolkit label: koordinaattiparit @fi
toolkit definition: Paikka, joka on kartografisen teoksen kattama alue, joka on identifioitu jokaisen kärjen koordinaatteja käyttävällä monikulmiolla. @fi
toolkit label: strenger med koordinatpar @no
toolkit definition: Et system for å identifisere det eksakte området som dekkes av det kartografiske innholdet til et verk, ved hjelp av koordinater for hvert hjørne av et polygon. @no
label: té com a cadenes de parells de coordenades @ca
definition: Relaciona una obra amb un lloc que és l’àrea de cobertura d’una obra cartogràfica que s’identifica per un polígon mitjançant les coordenades de cada vèrtex. @ca
toolkit label: cadenes de parells de coordenades @ca
toolkit definition: Lloc que és l’àrea de cobertura d’una obra cartogràfica que s’identifica per un polígon mitjançant les coordenades de cada vèrtex. @ca
has element type: 3
label: έχει αλφαριθμητικά των ζευγών συντεταγμένων @el
definition: Συνδέει ένα έργο με ένα σύστημα για την ταύτιση της ακριβούς περιοχής που καλύπτεται από το χαρτογραφικό περιεχόμενο ενός έργου που χρησιμοποιεί συντεταγμένες για κάθε κορυφή ενός πολύγωνου. @el
toolkit label: αλφαριθμητικά των ζευγών συντεταγμένων @el
toolkit definition: Ένα σύστημα για την ταύτιση της ακριβούς περιοχής που καλύπτεται από το χαρτογραφικό περιεχόμενο ενός έργου που χρησιμοποιεί συντεταγμένες για κάθε κορυφή ενός πολύγωνου. @el
label: koordinátapár-láncai a következők: @hu
definition: Hozzákapcsol egy művet egy helyhez, egy kartográfiai mű által lefedett területhez, amely meghatározásához az a poligon csúcsainak koordinátáit használja. @hu
toolkit label: koordinátapár-láncai: @hu
toolkit definition: Egy hely, egy kartográfiai mű által lefedett terület, amely meghatározásához az a poligon csúcsainak koordinátáit használja. @hu
label: koordinaattiparit @fi
label: har strenger med koordinatpar @no
definition: Relaterer et verk til et system for å identifisere det eksakte området som dekkes av det kartografiske innholdet til et verk, ved hjelp av koordinater for hvert hjørne av et polygon. @no
label: heeft tekenreeksen van coördinatenparen @nl
definition: Relateert een werk aan een systeem voor het identificeren van een exact gebied bestreken door de cartografische content van een werk waarbij coördinaten gebruikt worden voor elk hoekpunt van een veelhoek. @nl
toolkit label: tekenreeksen van coördinatenparen @nl
toolkit definition: Een systeem voor het identificeren van een exact gebied bestreken door de cartografische content van een werk waarbij coördinaten gebruikt worden voor elk hoekpunt van een veelhoek. @nl
label: له خطوط إحداثيات مزدوجة @ar
definition: يربط بين عمل ومكان عبارة عن نطاق تغطية محتوى خرائطي لعمل محدد من خلال مضلع باستخدام إحداثيات لكل قمة مضلع. @ar
toolkit label: خطوط إحداثيات مزدوجة @ar
toolkit definition: مكان عبارة عن نطاق تغطية محتوى خرائطي لعمل محدد من خلال مضلع باستخدام إحداثيات لكل قمة مضلع. @ar
label: koordinaatide paaride rida @et
definition: Seostab teose süsteemiga, mille abil tuvastatakse teose kartograafilises sisus hõlmatud täpne ala, kasutades hulknurga iga tipu koordinaate. @et
toolkit label: koordinaatide paaride rida @et
toolkit definition: Süsteem, mille abil tuvastatakse teose kartograafilises sisus hõlmatud täpne ala, kasutades hulknurga iga tipu koordinaate. @et
label: ha come stringhe di coppie di coordinate @it
definition: Correla un’opera a un sistema per identificare l’area precisa coperta dal contenuto cartografico di un’opera che utilizza coordinate per ciascun vertice di un poligono. @it
toolkit label: stringhe di coppie di coordinate @it
toolkit definition: Sistema per identificare l’area precisa coperta dal contenuto cartografico di un’opera che utilizza coordinate per ciascun vertice di un poligono. @it
label: koordinātu pāru virknes @lv
definition: Sasaista darbu ar vietu, kas ir teritorija sistēmas precīzai teritorijas noteikšanai, izmantojot koordinātas katrai daudzstūra virsotnei. @lv
toolkit label: koordinātu pāru virknes @lv
toolkit definition: Sistēma precīzas teritorijas noteikšanai, izmantojot koordinātas katrai daudzstūra virsotnei. @lv
label: 有坐标对串 @zh-hans
definition: 将一种作品与作为使用一个多边形每个角的坐标标识一种地图作品所覆盖范围的一个地点关联起来。 @zh-hans
toolkit label: 坐标对串 @zh-hans
toolkit definition: 作为使用一个多边形每个角的坐标标识一种地图作品所覆盖范围的一个地点 @zh-hans
has subproperty: P10083
label: koordinat çifti dizgesi ile ilişkilidir @tr
definition: Bir eseri, her bir köşe için koordinatlar kullanılarak bir çokgenle tanımlanan bir kartografik eserin kapsama alanı olan bir yerle ilişkilendirir. @tr
toolkit label: koordinat çiftleri dizgesi @tr
toolkit definition: Her bir köşe için koordinatlar kullanılarak bir çokgenle tanımlanan bir kartografik çalışmanın kapsama alanı olan bir yer. @tr

is adapted as choreography work
status: Published
definition: Relates a work to a work that is a choreographic work based on another work.
type: Property
domain: C10001
sub property of: is adapted as work
lexical alias: adaptedAsChoreographyWork.en
toolkit label: adapted as choreography work
toolkit definition: A work that is a choreographic work based on another work.
toolkit label: adapté en chorégraphie (œuvre) @fr
toolkit definition: Œuvre chorégraphique qui est basée sur une autre œuvre. @fr
toolkit label: adaptada como coreografía (obra) @es
toolkit definition: Una obra que consiste en movimiento (p. ej., danza) basada en la obra fuente. @es
instruction number: 24.5
label: er bearbejdet til koreografiværk @da
definition: Relaterer et værk til et koreografisk værk, baseret på et relateret værk. @da
toolkit label: bearbejdet til koreografiværk @da
toolkit definition: Koreografisk værk, baseret på et relateret værk. @da
definition: Met une œuvre en relation avec une œuvre chorégraphique qui est basée sur une autre œuvre. @fr
label: được phỏng theo như là dàn dựng (tác phẩm) @vi
definition: Liên kết tác phẩm với tác phẩm có chứa động thái dựa trên tác phẩm nguồn. @vi
toolkit label: được phỏng theo như là dàn dựng (tác phẩm) @vi
toolkit definition: Tác phẩm có chứa động thái dựa trên tác phẩm nguồn. @vi
label: ist bearbeitet als Choreografie (Werk) @de
definition: Setzt ein Werk in Beziehung zu einem choreografischen Werk, das auf einem anderen Werk basiert. @de
toolkit label: Bearbeitet als Choreografie (Werk) @de
toolkit definition: Ein choreografischen Werk, das auf einem anderen Werk basiert. @de
label: est adapté en chorégraphie (œuvre) @fr
definition: Liittää teoksen teokseen, joka on toiseen teokseen perustuva koreografinen teos. @fi
toolkit label: sovitettu koreografiaksi (teos) @fi
toolkit definition: Teos, joka on toiseen teokseen perustuva koreografinen teos. @fi
toolkit label: bearbeidet som koreografisk verk @no
toolkit definition: Et koreografisk verk basert på et relatert verk. @no
label: és adaptat com a obra de coreografia @ca
definition: Relaciona una obra amb una obra que és una obra coreogràfica basada en una altra obra. @ca
toolkit label: adaptat com a obra de coreografia @ca
toolkit definition: Obra que és una obra coreogràfica basada en una altra obra. @ca
has element type: 2
label: είναι προσαρμοσμένο ως χορογραφία (έργο) @el
definition: Συνδέει ένα έργο με ένα έργο που συνίσταται από κίνηση βασισμένη σε ένα έργο-πηγή. @el
toolkit label: προσαρμοσμένο ως χορογραφία (έργο) @el
toolkit definition: Ένα έργο που συνίσταται από κίνηση βασισμένη σε ένα έργο-πηγή. @el
label: koreográfiamű-átdolgozása a következő: @hu
definition: Egy művet hozzákapcsol egy forrásművön alapuló műhöz, amely mozgásból áll. @hu
toolkit label: koreográfiamű-átdolgozás @hu
toolkit definition: Egy mozgásból álló mű, amely egy forrásművön alapul. @hu
label: sovitettu koreografiaksi (teos) @fi
label: er bearbeidet som koreografisk verk @no
definition: Relaterer et verk til et koreografisk verk basert på et relatert verk. @no
label: is bewerkt als choreografisch werk @nl
definition: Relateert een werk aan een werk dat is een choreografisch werk gebaseerd op een ander werk. @nl
toolkit label: bewerkt als choreografisch werk @nl
toolkit definition: Een werk dat is een choreografisch werk gebaseerd op een ander werk. @nl
label: هو معالج كعمل راقص @ar
definition: يربط عمل بعمل عبارة عن عمل راقص مبني على عمل آخر. @ar
toolkit label: معالج كعمل راقص @ar
toolkit definition: عمل عبارة عن عمل راقص مبني على عمل آخر. @ar
label: adapteeritud koreograafilise teosena @et
definition: Seostab teose koreograafilise teosega, mis põhineb seotud teosel. @et
toolkit label: adapteeritud koreograafilise teosena @et
toolkit definition: Koreograafiline teos, mis põhineb seotud teosel. @et
alternative label: Bearbeitet als Choreographie (Werk) @de
label: è adattata come opera in forma di coreografia @it
definition: Correla un’opera a un’opera coreografica basata su un’opera correlata. @it
toolkit label: adattata come opera in forma di coreografia @it
toolkit definition: Opera coreografica basata su un’opera correlata. @it
label: ir adaptēts kā horeogrāfija (darbs) @lv
definition: Sasaista darbu ar darbu, kas ir darba pārstrādājums horeogrāfijā. @lv
toolkit label: adaptēts kā darbs: horeogrāfija @lv
toolkit definition: Darba pārstrādājums horeogrāfijā. @lv
label: 被改编为编舞作品 @zh-hans
definition: 将一种作品与作为基于另一种作品的一种编舞作品的一种作品关联起来。 @zh-hans
toolkit label: 被改编为编舞作品 @zh-hans
toolkit definition: 作为基于另一种作品的一种编舞作品的一种作品 @zh-hans
has subproperty: P10091
label: koreografi eseri olarak uyarlanmıştır @tr
definition: Bir eseri, başka bir eserden uyarlanmış koreografi bir eseri olan bir eserle ilişkilendirir. @tr
toolkit label: Koreografi çalışması olarak uyarlanan @tr
toolkit definition: Başka bir eserden uyarlanmış koreografik çalışma olan bir eser. @tr

has choreography work
status: Published
type: Property
lexical alias: choreographyWork.en
definition: Relates a work to a work that is a choreographic work that complements a work.
domain: C10001
toolkit label: choreography work
toolkit definition: A work that is a choreographic work that complements a work.
toolkit label: chorégraphie (œuvre) @fr
toolkit definition: Œuvre chorégraphique qui complète une œuvre. @fr
sub property of: is complemented by work
toolkit label: coreografía (obra) @es
toolkit definition: Una obra que proporciona la coreografía para una obra relacionada. @es
instruction number: 24.5
label: har koreografiværk @da
definition: Relaterer et værk til et værk, som er et koreografisk værk, som komplementerer et værk. @da
toolkit label: koreografiværk @da
toolkit definition: Værk, som er et koreografisk værk, som komplementerer et værk. @da
definition: Met une œuvre en relation avec une œuvre chorégraphique qui complète une œuvre. @fr
label: là nghệ thuật bố trí (tác phẩm) @vi
definition: Liên kết tác phẩm với tác phẩm cung cấp nghệ thuật bố trí để sử dụng trong tác phẩm có liên quan. @vi
toolkit label: nghệ thuật bố trí (tác phẩm) @vi
toolkit definition: Tác phẩm cung cấp nghệ thuật bố trí để sử dụng trong tác phẩm có liên quan. @vi
label: hat Choreografie (Werk) @de
definition: Setzt ein Werk in Beziehung zu einem choreografischen Werk, das ein Werk ergänzt. @de
toolkit label: Choreografie (Werk) @de
toolkit definition: Ein choreografisches Werk, das ein Werk ergänzt. @de
label: a pour chorégraphie (œuvre) @fr
definition: Liittää teoksen teokseen, joka on koreografinen teos, joka täydentää teosta. @fi
toolkit label: koreografia (teos) @fi
toolkit definition: Teos, joka on koreografinen teos, joka täydentää teosta. @fi
toolkit label: koreografi (verk) @no
toolkit definition: Et verk som er et koreografisk verk som utfyller et verk. @no
label: té com a obra de coreografia @ca
definition: Relaciona una obra amb una obra que és una obra coreogràfica que complementa una obra. @ca
toolkit label: obra de coreografia @ca
toolkit definition: Obra que és una obra coreogràfica que complementa una obra. @ca
has element type: 2
label: είναι χορογραφία (έργο) @el
definition: Συνδέει ένα έργο με ένα έργο το οποίο παρέχει χορογραφία για χρήση σε ένα σχετικό έργο. @el
toolkit label: χορογραφία (έργο) @el
toolkit definition: Ένα έργο το οποίο παρέχει χορογραφία για χρήση σε ένα σχετικό έργο. @el
label: koreográfia-műve a következő: @hu
definition: Hozzákapcsol egy művet egy szöveges műhöz, amely egy művet egészít ki. @hu
toolkit label: koreográfiamű @hu
toolkit definition: Egy szöveges mű, amely egy művet egészít ki. @hu
label: koreografia (teos) @fi
label: har koreografi (verk) @no
definition: Relaterer et verk til et verk som er et koreografisk verk som utfyller et verk. @no
label: heeft choreografie-werk @nl
definition: Relateert een werk aan een werk dat een choreografisch werk is dat een werk aanvult. @nl
toolkit label: choreografie-werk @nl
toolkit definition: Een werk dat een choreografisch werk is dat een werk aanvult. @nl
label: له عمل راقص @ar
definition: يربط عمل بعمل عبارة عن عمل راقص يكمل عملا. @ar
toolkit label: عمل راقص @ar
toolkit definition: عمل عبارة عن عمل راقص يكمل عملا. @ar
label: koreograafia (teos) @et
definition: Seostab teose teost täiendava koreograafilise teosega. @et
toolkit label: koreograafia (teos) @et
toolkit definition: Teost täiendav koreograafiline teos. @et
alternative label: Choreographie (Werk) @de
label: ha come coreografia opera @it
definition: Correla un’opera a un’opera coreografica che completa un’opera. @it
toolkit label: coreografia opera @it
toolkit definition: Opera coreografica che completa un’opera. @it
label: darbs: horeogrāfija @lv
definition: Sasaista darbu ar darbu, kas ir realizēts kā horeogrāfija, kas papildina citu darbu. @lv
toolkit label: darbs: horeogrāfija @lv
toolkit definition: Darbs, kas ir realizēts kā horeogrāfija, kas papildina citu darbu. @lv
label: 有编舞作品 @zh-hans
definition: 将一种作品与作为一种编舞作品并补充一种作品的一种作品关联起来。 @zh-hans
toolkit label: 编舞作品 @zh-hans
toolkit definition: 作为一种编舞作品并补充一种作品的一种作品 @zh-hans
has subproperty: P10247
label: koreografi eseri ile ilişkilidir @tr
definition: Bir eseri, bir eseri tamamlayan koreografik bir eser olan bir eserle ilişkilendirir. @tr
toolkit label: koreografi eseri @tr
toolkit definition: Bir eseri tamamlayan koreografik bir eser. @tr

is choreography for work
status: Published
type: Property
lexical alias: choreographyForWork.en
definition: Relates a work to a work that is complemented by a choreographic work.
domain: C10001
toolkit label: choreography for work
toolkit definition: A work that is complemented by a choreographic work.
toolkit label: chorégraphie pour une œuvre @fr
toolkit definition: Œuvre qui est complétée par une œuvre chorégraphique. @fr
sub property of: is complemented by work
toolkit label: coreografía de (obra) @es
toolkit definition: Una obra que usa la coreografía de una obra relacionada. @es
instruction number: 24.5
label: er koreografi til værk @da
definition: Relaterer et værk til et værk, som er komplementeret af et koreografisk værk. @da
toolkit label: koreografi til værk @da
toolkit definition: Værk, som er komplementeret af et koreografisk værk. @da
definition: Met une œuvre en relation avec une œuvre qui est complétée par une œuvre chorégraphique. @fr
label: là nghệ thuật bố trí của (tác phẩm) @vi
definition: Liên kết tác phẩm với tác phẩm sử dụng nghệ thuật bố trí của tác phẩm có liên quan. @vi
toolkit label: nghệ thuật bố trí của (tác phẩm) @vi
toolkit definition: Tác phẩm sử dụng nghệ thuật bố trí của tác phẩm có liên quan. @vi
label: ist Choreografie für (Werk) @de
definition: Setzt ein Werk in Beziehung zu einem Werk, das durch ein choreografisches Werk vervollständigt wird. @de
toolkit label: Choreografie für (Werk) @de
toolkit definition: Ein Werk, das durch ein choreografisches Werk vervollständigt wird. @de
label: est une chorégraphie pour une œuvre @fr
definition: Liittää teoksen teokseen, jota täydentää koreografinen teos. @fi
toolkit label: koreografia teokseen @fi
toolkit definition: Teos, jota täydentää koreografinen teos. @fi
toolkit label: koreografi for verk @no
toolkit definition: Et verk som ufylles av et koreografisk verk. @no
label: és coreografia per a una obra @ca
definition: Relaciona una obra amb una obra que es complementa amb una obra coreogràfica. @ca
toolkit label: coreografia per a una obra @ca
toolkit definition: Obra que es complementa amb una obra coreogràfica. @ca
has element type: 2
label: είναι χορογραφία για (έργο) @el
definition: Συνδέει ένα έργο με ένα έργο το οποίο χρησιμοποιεί χορογραφία για ένα σχετικό έργο. @el
toolkit label: χορογραφία για (έργο) @el
toolkit definition: Ένα έργο το οποίο χρησιμοποιεί χορογραφία για ένα σχετικό έργο. @el
label: koreográfiája a következő műnek @hu
definition: Hozzákapcsol egy művet egy műhöz, amelyet egy koreografikus mű egészít ki. @hu
toolkit label: koreográfiával ellátott mű @hu
toolkit definition: Egy mű, amelyet egy koreografikus mű egészít ki. @hu
label: koreografia teokseen @fi
label: er koreografi for verk @no
definition: Relaterer et verk til et verk som ufylles av et koreografisk verk. @no
label: is choreografie voor werk @nl
definition: Relateert een werk aan een werk dat is gecomplementeerd met een choreografisch werk. @nl
toolkit label: choreografie voor werk @nl
toolkit definition: Een werk dat is gecomplementeerd met een choreografisch werk. @nl
label: هو تصميم راقص لعمل @ar
definition: يربط عمل بعمل يكمله عمل راقص. @ar
toolkit label: تصميم راقص لعمل @ar
toolkit definition: عمل يكمله عمل راقص. @ar
label: koreograafia teosele @et
definition: Seostab teose teosega, mida on täiendatud koreograafilise teosega. @et
toolkit label: koreograafia teosele @et
toolkit definition: Teos, mida on täiendatud koreograafilise teosega. @et
alternative label: Choreographie für (Werk) @de
label: è coreografia per opera @it
definition: Correla un’opera a un’opera che è completata da una coreografia. @it
toolkit label: coreografia per opera @it
toolkit definition: Opera che è completata da una coreografia. @it
label: ir horeogrāfija darbam @lv
definition: Sasaista darbu ar darbu, kas ir papildināts ar darbu, kas realizēts kā horeogrāfija. @lv
toolkit label: horeogrāfija darbam @lv
toolkit definition: Darbs, kas ir papildināts ar darbu, kas realizēts kā horeogrāfija. @lv
label: 是用于作品的编舞 @zh-hans
definition: 将一种作品与被一种编舞作品补充的一种作品关联起来。 @zh-hans
toolkit label: 用于作品的编舞 @zh-hans
toolkit definition: 被一种编舞作品补充的一种作品 @zh-hans
has subproperty: P10248
label: eserin koreografisidir @tr
definition: Bir eseri, koreografik bir eserle tamamlanan bir eserle ilişkilendirir. @tr
toolkit label: eser için koreografi @tr
toolkit definition: Bir koreografik bir eserle tamamlanan bir çalışma. @tr

has epoch
status: Published
definition: Relates a work to a timespan to which measurements of position for a body or orientation for an orbit are referred.
type: Property
domain: C10001
lexical alias: epoch.en
instruction number: 7.6
toolkit label: epoch
toolkit definition: A timespan to which measurements of position for a body or orientation for an orbit are referred.
toolkit label: époque @fr
toolkit definition: Laps de temps auquel les mesures de position pour un corps céleste ou l’orientation pour une orbite font référence. @fr
toolkit label: época @es
toolkit definition: Un momento arbitrario en el tiempo al cual hacen referencia las medidas de posición de un cuerpo o de orientación de una órbita. @es
label: har epok @sv
toolkit label: epok @sv
label: har epoke @da
definition: Relaterer et værk til en tidperiode, som målene for et legemes position eller en banes retning henviser til. @da
toolkit label: epoke @da
toolkit definition: Tidsperiode, som målene for et legemes position eller en banes retning henviser til. @da
definition: Met une œuvre en relation avec un laps de temps auquel les mesures de position pour un corps céleste ou l’orientation pour une orbite font référence. @fr
label: có thời đại @vi
definition: Liên kết tác phẩm với thời điểm bất kỳ theo thời gian mà độ đo vị trí của vật thể hoặc hướng của quỹ đạo được đề cập. @vi
toolkit label: thời đại @vi
toolkit definition: Thời điểm bất kỳ theo thời gian mà độ đo vị trí của vật thể hoặc hướng của quỹ đạo được đề cập. @vi
label: hat Epoche @de
definition: Setzt ein Werk in Beziehung zu einem Zeitraum, auf den sich Positionsmessungen für einen Körper oder die Orientierung einer Umlaufbahn beziehen. @de
toolkit label: Epoche @de
toolkit definition: Ein Zeitraum, auf den sich Positionsmessungen für einen Körper oder die Orientierung einer Umlaufbahn beziehen. @de
label: a pour époque @fr
definition: Liittää teoksen ajanjaksoon, jonka mukaan tähtitaivaan kohteiden sijainnit ja ratojen suunnat on annettu. @fi
toolkit label: epookki @fi
toolkit definition: Ajanjakso, jonka mukaan tähtitaivaan kohteiden sijainnit ja ratojen suunnat on annettu. @fi
toolkit definition: Et tidsrom som målene for himmellegemers posisjon eller baneretning angis i forhold til. @no
label: té com a època @ca
definition: Relaciona una obra amb un interval de temps al qual es refereixen les mesures de posició d’un cos celeste o l’orientació d’una òrbita. @ca
toolkit label: època @ca
toolkit definition: Interval de temps al qual es refereixen les mesures de posició d’un cos celeste o l’orientació d’una òrbita. @ca
sub property of: has related timespan of work
has element type: 2
label: έχει εποχή @el
definition: Συνδέει ένα έργο με μια τυχαία χρονική στιγμή στην οποία αναφέρονται οι μετρήσεις της θέσης για ένα σώμα ή του προσανατολισμού σε μια τροχιά. @el
toolkit label: εποχή @el
toolkit definition: Μια τυχαία χρονική στιγμή στην οποία αναφέρονται οι μετρήσεις της θέσης για ένα σώμα ή του προσανατολισμού σε μια τροχιά. @el
label: korszaka a következő: @hu
definition: Hozzákapcsol egy művet egy időtartamhoz, amelyre egy test mérési pozíciója vagy egy keringési pálya orientációja utal. @hu
toolkit label: korszaka: @hu
toolkit definition: Egy időtartam, amelyre egy test mérési pozíciója vagy egy keringési pálya orientációja utal. @hu
label: epookki @fi
definition: Relaterer et verk til et tidsrom som målene for himmellegemers posisjon eller baneretning angis i forhold til. @no
label: heeft tijdperk @nl
definition: Relateert een werk aan een tijdspanne waaraan metingen van positie zijn gerefereerd voor een lichaam of oriëntatie voor een baan. @nl
toolkit label: tijdperk @nl
toolkit definition: Een tijdspanne waaraan metingen van positie zijn gerefereerd voor een lichaam of oriëntatie voor een baan. @nl
label: له مدة زمنية @ar
definition: يربط بين عمل وفترة زمنية تحال إليه قياسات وضع لجسم أو اتجاه لمدار. @ar
toolkit label: مدة زمنية @ar
toolkit definition: فترة زمنية تحال إليه قياسات وضع لجسم أو اتجاه لمدار. @ar
label: epohh @et
definition: Seostab teose ajavahemikuga, mille kohta on määratud taevakeha asukoht või orbiidi orientatsioon. @et
toolkit label: epohh @et
toolkit definition: Ajavahemik, mille kohta on määratud taevakeha asukoht või orbiidi orientatsioon. @et
label: ha come epoca @it
definition: Correla un’opera a un arco di tempo al quale si rapportano la misurazione della posizione di un corpo o dell’orientamento di un’orbita. @it
toolkit label: epoca @it
toolkit definition: Arco di tempo al quale si rapportano la misurazione della posizione di un corpo o dell’orientamento di un’orbita. @it
label: epoha (astronomijā) @lv
definition: Sasaista darbu ar laikposmu, kam atbilst astronomisko novērojumu vai aprēķinu dati, kuri raksturo debess spīdekļu stāvokli. (letonika.lv). @lv
toolkit label: epoha (astronomijā) @lv
toolkit definition: Laika moments, kam atbilst astronomisko novērojumu vai aprēķinu dati, kuri raksturo debess spīdekļu stāvokli. (letonika.lv) @lv
label: 有历元 @zh-hans
definition: 将一种作品与提及物体位置或运行轨道方位之测量的一个时间段关联起来。 @zh-hans
toolkit label: 历元 @zh-hans
toolkit definition: 提及物体位置或运行轨道方位之测量的一个时间段 @zh-hans
has subproperty: P10199
label: epok ile ilişkilidir @tr
definition: Bir eseri, bir cisim için konum veya bir yörünge için yönelim ölçümlerine atıfta bulunulan bir zaman aralığıyla ilişkilendirir. @tr
toolkit label: dönem @tr
toolkit definition: Bir cismin konum veya yörüngesinin yönelim ölçümlerinin referans alındığı zaman aralığı. @tr

has key of representative expression
status: Published
definition: Relates a work to a set of pitch relationships that establishes the tonal centre, or principal tonal centre, used, or intended to be used, for performance of musical content of a representative expression.
type: Property
domain: C10001
lexical alias: keyOfRepresentativeExpression.en
instruction number: 6.17
toolkit label: key of representative expression
toolkit definition: A set of pitch relationships that establishes the tonal centre, or principal tonal centre, used, or intended to be used, for performance of musical content of a representative expression of a work.
toolkit label: tonalité d’une expression représentative @fr
toolkit definition: Ensemble des rapports entre les hauteurs de sons qui détermine le centre tonal ou le principal centre tonal utilisé ou destiné à être utilisé dans une exécution d’un contenu musical d’une expression représentative d’une œuvre. @fr
toolkit label: tonalidad @es
toolkit definition: El conjunto de relaciones tonales que establece el centro tonal, o el centro tonal principal, de una obra musical. @es
label: har tonart @sv
toolkit label: tonart @sv
label: har toneart af repræsentativt udtryk @da
definition: Relaterer et værk til et sæt af intervaller, som fastlægger et musikværks tonale eller væsentligste tonale centrum, som er brugt eller som er beregnet til brug, til opførelse af et repræsentativt udtryks musikalske indhold. @da
toolkit label: toneart af repræsentativt udtryk @da
toolkit definition: Sæt af intervaller, som fastlægger et musikværks tonale eller væsentligste tonale centrum, som er brugt eller som er beregnet til brug, til opførelse af et repræsentativt udtryks musikalske indhold. @da
definition: Met une œuvre en relation avec un ensemble des rapports entre les hauteurs de sons qui détermine le centre tonal ou le principal centre tonal utilisé ou destiné à être utilisé dans une exécution d’un contenu musical d’une expression représentative d’une œuvre. @fr
label: có khoá @vi
definition: Liên kết tác phẩm với bộ mối quan hệ độ cao thấp tạo thành trung tâm âm, hoặc trung tâm âm chính, của tác phẩm âm nhạc. @vi
toolkit label: khoá @vi
toolkit definition: Bộ mối quan hệ độ cao thấp tạo thành trung tâm âm, hoặc trung tâm âm chính, của tác phẩm âm nhạc. @vi
label: hat Tonart einer repräsentativen Expression @de
definition: Setzt ein Werk in Beziehung zu einem Satz an Tonhöhenbeziehungen, der das tonale Zentrum oder das hauptsächliche tonale Zentrum begründet, das für eine Darbietung eines musikalischen Inhalts einer repräsentativen Expression eines Werks verwendet wird oder verwendet werden soll. @de
toolkit label: Tonart einer repräsentativen Expression @de
toolkit definition: Ein Satz an Tonhöhenbeziehungen, der das tonale Zentrum oder das hauptsächliche tonale Zentrum begründet, das für eine Darbietung eines musikalischen Inhalts einer repräsentativen Expression eines Werks verwendet wird oder verwendet werden soll. @de
label: a pour tonalité d’une expression représentative @fr
definition: Liittää teoksen sävelsuhteiden joukkoon, johon edustavan ekspression musiikillisen sisällön esityksessä käytetty tai käytettäväksi tarkoitettu tonaalinen keskus tai pääasiallinen tonaalinen keskus perustuu. @fi
toolkit label: edustavan ekspression sävellaji @fi
toolkit definition: Sävelsuhteiden joukko, johon teoksen edustavan ekspression musiikillisen sisällön esityksessä käytetty tai käytettäväksi tarkoitettu tonaalinen keskus tai pääasiallinen tonaalinen keskus perustuu. @fi
toolkit label: toneart for et representativt uttrykk @no
toolkit definition: Et sett med forhold mellom tonehøyder som bestemmer sentraltonen som er brukt eller tenkt brukt for framføring av musikalsk innhold av et representativt uttrykk av av et verk. @no
label: té com a tonalitat d’una expressió representativa @ca
definition: Relaciona una obra amb un conjunt de relacions entre les altures de sons que determina el centre tonal, o el centre tonal principal, usat o concebut per ser usat, per a l’execució d’un contingut musical d’una expressió representativa d’una obra. @ca
toolkit label: tonalitat d’una expressió representativa @ca
toolkit definition: Conjunt de relacions entre les altures de sons que determina el centre tonal, o el centre tonal principal, usat o concebut per ser usat, per a l’execució d’un contingut musical d’una expressió representativa d’una obra. @ca
has element type: 5
label: έχει κλειδί @el
definition: Συνδέει ένα έργο με ένα σύνολο τονικών σχέσεων που διαμορφώνει ένα τονικό κέντρο ή κύριο τονικό κέντρο ενός μουσικού έργου. @el
toolkit label: κλειδί @el
toolkit definition: Ένα σύνολο τονικών σχέσεων που διαμορφώνει ένα τονικό κέντρο ή κύριο τονικό κέντρο ενός μουσικού έργου. @el
label: reprezentatív kifejezési forma zenei kulcsa a következő: @hu
definition: Hozzákapcsol egy művet hangmagassági kapcsolatok halmazához, amely tonális központot vagy fő tonális központot hoz létre, amelyet egy reprezentatív kifejezési forma zenei tartalmának előadásához használnak vagy használni kívánnak. @hu
toolkit label: reprezentatív kifejezési formához tartozó zenei kulcs @hu
toolkit definition: Hangmagassági kapcsolatok halmaza, amely tonális központot vagy fő tonális központot hoz létre, amelyet egy reprezentatív kifejezési forma zenei tartalmának előadásához használnak vagy használni kívánnak. @hu
scope note: Sävellaji merkitään sävelen nimellä ja moodilla, kun tämä on duuri tai molli. @fi
label: edustavan ekspression sävellaji @fi
label: har toneart for et representativt uttrykk @no
definition: Relaterer et verk til et sett med forhold mellom tonehøyder som bestemmer sentraltonen som er brukt eller tenkt brukt for framføring av musikalsk innhold av et representativt uttrykk av av et verk. @no
scope note: Tonearten angis av navnet på tonen og om den er i dur eller moll. @no
label: heeft toonsoort van representatieve expressie @nl
definition: Relateert een werk aan een verzameling van toonsoortrelaties die het tonale centrum vormen, of belangrijkste tonale centrum, gebruikt of bedoeld om gebruikt te worden, voor uitvoering van muziekcontent van een representatieve expressie van een werk. @nl
scope note: Toonsoort wordt aangegeven door de toonhoogte en diens modus, wanneer het majeur of mineur is. @nl
toolkit label: toonsoort van representatieve expressie @nl
toolkit definition: Een verzameling van toonsoortrelaties die het tonale centrum vormen, of belangrijkste tonale centrum, gebruikt of bedoeld om gebruikt te worden, voor uitvoering van muziekcontent van een representatieve expressie van een werk. @nl
label: له مفتاح موسيقي لتعبيرة ممثِلة @ar
definition: يربط بين عمل ومجموعة من علاقات النغمات التي تؤسس مركز النغمات أو مركز النغمات الرئيسي المستخدم أو المزمع استخدامه لأداء محتوى موسيقي لتعبيرة ممثِلة. @ar
scope note: يُشار إلى المفتاح باسم النغمة ووضعها، عندما يكون كبيرًا أو ثانويًا. @ar
toolkit label: مفتاح موسيقي لتعبيرة ممثِلة @ar
toolkit definition: مجموعة من علاقات النغمات التي تؤسس مركز النغمات أو مركز النغمات الرئيسي المستخدم أو المزمع استخدامه لأداء محتوى موسيقي لتعبيرة ممثِلة. @ar
scope note: La tonalitat s’indica pel seu nom d’altura i el seu mode, quan és major o menor. @ca
scope note: Toneart er angivet ved sit tonehøjdenavn og sit modus, når den er i dur eller mol. @da
label: iseloomuliku väljenduse helistik @et
definition: Seostab teose helikõrguste suhete kogumiga, mis määrab iseloomuliku väljenduse muusikalise sisu esitamiseks kasutatud või esitamiseks mõeldud toonika või peamise toonika. @et
scope note: Helistikku tähistatakse helikõrguse nimetuse ja helilaadiga, kui on tegemist mažoori või minooriga. @et
toolkit label: iseloomuliku väljenduse helistik @et
toolkit definition: Helikõrguste suhete kogum, mis määrab iseloomuliku väljenduse muusikalise sisu esitamiseks kasutatud või esitamiseks mõeldud toonika või peamise toonika. @et
scope note: Die Tonart wird durch die Bezeichnung der Tonhöhe und deren Modus angegeben, wenn es sich um Dur oder Moll handelt. @de
scope note: A kulcsot annak hangmagassági neve és hangneme jelzi, amikor az dur vagy moll. @hu
label: ha come chiave di espressione rappresentativa @it
definition: Correla un’opera a un insieme di relazioni tra le altezze dei suoni che stabilisce il centro tonale o il principale centro tonale di un’opera musicale utilizzato o destinato ad essere utilizzato, per l’interpretazione del contenuto musicale di un’espressione rappresentativa. @it
scope note: La chiave è identficata dal nome della sua altezza e dal suo modo, se maggiore o minore. @it
toolkit label: chiave di espressione rappresentativa @it
toolkit definition: Insieme di relazioni tra le altezze dei suoni che stabilisce il centro tonale o il principale centro tonale di un’opera musicale utilizzato o destinato ad essere utilizzato, per l’interpretazione del contenuto musicale di un’espressione rappresentativa. @it
scope note: La tonalité est indiquée par son nom de hauteur et son mode, lorsqu’il est majeur ou mineur. @fr
scope note: Το κλειδί δηλώνεται με το όνομα του τόνου και της κλίμακας, όταν αυτή είναι μείζονα ή ελάσσονα. @el
label: reprezentatīvas izteiksmes tonalitāte @lv
definition: Sasaista darbu ar reprezentatīvas izteiksmes skaņkārtu ar noteiktu toniku. Tonalitāte iegūst nosaukumu no savas tonikas un vārda, kas apzīmē skaņkārtu. (Mūzikas elementārteorija, 1981 Krasinska, Utkins). @lv

has landscape architect agent
status: Published
definition: Relates a work to an agent who is an architect who is responsible for creating landscape works.
type: Property
domain: C10001
sub property of: has architect agent
lexical alias: landscapeArchitectAgent.en
toolkit label: landscape architect agent
toolkit definition: An agent who is an architect who is responsible for creating landscape works.
toolkit label: agent architecte paysagiste @fr
toolkit definition: Agent architecte qui est responsable de la création d’œuvres paysagères. @fr
toolkit label: arquitecto paisajista @es
toolkit definition: Un arquitecto responsable de la creación de obras paisajísticas. @es
instruction number: 18.5
label: har agent, som er landskabsarkitekt @da
definition: Relaterer et værk til en agent, som er en arkitekt, som er ansvarlig for at skabe landskabsværker. @da
toolkit label: agent, som er landskabsarkitekt @da
toolkit definition: Agent, som er en arkitekt, som er ansvarlig for at skabe landskabsværker. @da
definition: Met une œuvre en relation avec un agent architecte qui est responsable de la création d’œuvres paysagères. @fr
label: có kiến trúc sư phong cảnh @vi
definition: Liên kết tác phẩm với kiến trúc sư có trách nhiệm tạo lập tác phẩm phong cảnh. @vi
toolkit label: kiến trúc sư phong cảnh @vi
toolkit definition: Kiến trúc sư có trách nhiệm tạo lập tác phẩm phong cảnh. @vi
label: hat Landschaftsarchitektin/Landschaftsarchitekten (Akteur) @de
definition: Setzt ein Werk in Beziehung zu einer Architektin/einem Architekten (Akteur), die/der für die Erschaffung landschaftlicher Werke verantwortlich ist. @de
toolkit label: Landschaftsarchitektin/Landschaftsarchitekt (Akteur) @de
toolkit definition: Eine Architektin/Ein Architekt (Akteur), die/der für die Erschaffung landschaftlicher Werke verantwortlich ist. @de
label: a pour agent architecte paysagiste @fr
definition: Liittää teoksen toimijaan, joka on arkkitehti, joka on vastuussa maisemateosten luomisesta. @fi
toolkit label: maisema-arkkitehti (toimija) @fi
toolkit definition: Toimija, joka on arkkitehti, joka on vastuussa maisemateosten luomisesta. @fi
toolkit label: landskapsarkitekt (agent) @no
toolkit definition: En agent som er en arkitekt med ansvar for å skape landskapsverk. @no
label: té com a agent arquitecte paisatgista @ca
definition: Relaciona una obra amb un agent que és un arquitecte que és responsable de la creació d’obres paisatgístiques. @ca
toolkit label: agent arquitecte paisatgista @ca
toolkit definition: Agent que és un arquitecte que és responsable de la creació d’obres paisatgístiques. @ca
has element type: 2
label: έχει αρχιτέκτονα τοπίου @el
definition: Συνδέει ένα έργο με έναν αρχιτέκτονα, υπεύθυνο για τη δημιουργία τοπίων. @el
toolkit label: αρχιτέκτονας τοπίου @el
toolkit definition: Ένας αρχιτέκτονας, υπεύθυνος για τη δημιουργία τοπίων. @el
label: tájépítész ágense a következő: @hu
definition: Hozzákapcsol egy művet egy építész ágenshez, amely felelős tájépítészeti művek létrehozásáért. @hu
toolkit label: tájépítész ágens: @hu
toolkit definition: Egy építész ágens, amely felelős tájépítészeti művek létrehozásáért. @hu
alternative label: landscape architect
alternative label: maisema-arkkitehti @fi
label: maisema-arkkitehti (toimija) @fi
label: har landskapsarkitekt (agent) @no
definition: Relaterer et verk til en agent som er en arkitekt med ansvar for å skape landskapsverk. @no
alternative label: landskapsarkitekt @no
label: heeft landschapsarchitect-actor @nl
definition: Relateert een werk aan een actor die een architect is die verantwoordelijk is voor het creëren van landschapswerken. @nl
toolkit label: landschapsarchitect-actor @nl
toolkit definition: Een actor die een architect is die verantwoordelijk is voor het creëren van landschapswerken. @nl
label: له وكيل مهندس تنسيق مواقع @ar
definition: يربط بين عمل ووكيل يكون مهندسا معماريا مسئول عن إنشاء أعمال تنسيق المواقع. @ar
alternative label: مهندس تنسيق مواقع @ar
toolkit label: وكيل مهندس تنسيق مواقع @ar
toolkit definition: وكيل يكون مهندسا معماريا مسئول عن إنشاء أعمال تنسيق المواقع. @ar
alternative label: arquitecte paisatgista @ca
alternative label: landskabsarkitekt @da
label: maastikuarhitekt (tegija) @et
definition: Seostab teose tegijaga, kes arhitektina vastutab maastikuteoste loomise eest. @et
alternative label: maastikuarhitekt @et
toolkit label: maastikuarhitekt (tegija) @et
toolkit definition: Tegija, kes arhitektina vastutab maastikuteoste loomise eest @et
alternative label: tájépítész: @hu
label: ha come architetto del paesaggio agente @it
definition: Correla un’opera all'agente architetto responsabile di opere paesaggistiche. @it
alternative label: architetto del paesaggio @it
toolkit label: architetto del paesaggio agente @it
toolkit definition: Agente architetto responsabile di opere paesaggistiche. @it
alternative label: architecte paysagiste @fr
label: ainavu arhitekts (aģents) @lv
definition: Sasaista darbu ar arhitektu, kurš ir atbildīgs par ainavu darbu veidošanu. @lv
toolkit label: ainavu arhitekts (aģents) @lv
toolkit definition: Arhitekts, kurš ir atbildīgs par ainavu darbu veidošanu. @lv
alternative label: Landschaftsarchitekt @de
toolkit label: 景观设计师行为者 @zh-hans

has landscape architect collective agent
status: Published
lexical alias: landscapeArchitectCollectiveAgent.en
definition: Relates a work to a collective agent who is an architect who is responsible for creating landscape works.
toolkit label: landscape architect collective agent
toolkit definition: A collective agent who is an architect who is responsible for creating landscape works.
type: Property
domain: C10001
has element type: 2
sub property of: has architect collective agent
sub property of: has landscape architect agent
label: maisema-arkkitehti (yhteistoimija) @fi
definition: Liittää teoksen yhteistoimijaan, joka on arkkitehti, joka on vastuussa maisemateosten luomisesta. @fi
toolkit label: maisema-arkkitehti (yhteistoimija) @fi
toolkit definition: Yhteistoimija, joka on arkkitehti, joka on vastuussa maisemateosten luomisesta. @fi
label: har landskapsarkitekt (kollektiv agent) @no
definition: Relaterer et verk til en kollektiv agent som er en arkitekt med ansvar for å skape landskapsverk. @no
toolkit label: landskapsarkitekt (kollektiv agent) @no
toolkit definition: En kollektiv agent som er en arkitekt med ansvar for å skape landskapsverk. @no
label: heeft landschapsarchitect-collectieve actor @nl
definition: Relateert een werk aan een collectieve actor die een architect is die verantwoordelijk is voor het creëren van landschapswerken. @nl
toolkit label: landschapsarchitect-collectieve actor @nl
toolkit definition: Een collectieve actor die een architect is die verantwoordelijk is voor het creëren van landschapswerken. @nl
label: له وكيل جماعي مهندس تنسيق مواقع @ar
definition: يربط بين عمل ووكيل جماعي يكون مهندسا معماريا مسئولاً عن إنشاء أعمال تنسيق المواقع. @ar
toolkit label: وكيل جماعي مهندس تنسيق مواقع @ar
toolkit definition: وكيل جماعي يكون مهندسا معماريا مسئولاً عن إنشاء أعمال تنسيق المواقع. @ar
label: té com a agent col·lectiu arquitecte paisatgista @ca
definition: Relaciona una obra amb un agent col·lectiu que és un arquitecte que és responsable de la creació d’obres paisatgístiques. @ca
toolkit label: agent col·lectiu arquitecte paisatgista @ca
toolkit definition: Agent col·lectiu que és un arquitecte que és responsable de la creació d’obres paisatgístiques. @ca
label: har kollektiv agent, som er landskabsarkitekt @da
definition: Relaterer et værk til en kollektiv agent, som er en arkitekt, som er ansvarlig for at skabe landskabsværker. @da
toolkit label: kollektiv agent, som er landskabsarkitekt @da
toolkit definition: Kollektiv agent, som er en arkitekt, som er ansvarlig for at skabe landskabsværker. @da
label: maastikuarhitekt (kollektiiv) @et
definition: Seostab teose kollektiiviga, kes arhitektina vastutab maastikuteoste loomise eest. @et
toolkit label: maastikuarhitekt (kollektiiv) @et
toolkit definition: Kollektiiv, kes arhitektina vastutab maastikuteoste loomise eest. @et
label: hat Landschaftsarchitektin/Landschaftsarchitekten (Gemeinschaftlicher Akteur) @de
definition: Setzt ein Werk in Beziehung zu einer Architektin/einem Architekten (Gemeinschaftlicher Akteur), die/der für die Schaffung landschaftlicher Werke verantwortlich ist. @de
toolkit label: Landschaftsarchitektin/Landschaftsarchitekt (Gemeinschaftlicher Akteur) @de
toolkit definition: Eine Architektin/Ein Architekt (Gemeinschaftlicher Akteur), die/der für die Schaffung landschaftlicher Werke verantwortlich ist. @de
label: tájépítész kollektív ágense a következő: @hu
definition: Hozzákapcsol egy művet egy építész kollektív ágenshez, amely felelős tájépítészeti művek létrehozásáért. @hu
toolkit label: tájépítész kollektív ágens: @hu
toolkit definition: Egy építész kollektív ágens, amely felelős tájépítészeti művek létrehozásáért. @hu
label: ha come architetto del paesaggio agente collettivo @it
definition: Correla un'opera all'agente collettivo architetto responsabile della creazione di opere paesaggistiche. @it
toolkit label: architetto del paesaggio agente collettivo @it
toolkit definition: Agente collettivo architetto responsabile della creazione di opere paesaggistiche. @it
label: a pour agent collectif architecte paysagiste @fr
definition: Met une œuvre en relation avec un agent collectif qui est responsable de la création d’œuvres paysagères. @fr
toolkit label: agent collectif architecte paysagiste @fr
toolkit definition: Agent collectif qui est responsable de la création d’œuvres paysagères. @fr
label: ainavu arhitekts (grupa) @lv
definition: Sasaista darbu ar grupu, kas ir atbildīga par ainavu darbu veidošanu. @lv
toolkit label: ainavu arhitekts (grupa) @lv
toolkit definition: Grupa, kas ir atbildīga par ainavu darbu veidošanu. @lv
label: 有景观设计师集体行为者 @zh-hans
definition: 将一种作品与作为建筑师并负责创建景观作品的一个集体行为者关联起来。 @zh-hans
toolkit label: 景观设计师集体行为者 @zh-hans
toolkit definition: 作为建筑师并负责创建景观作品的一个集体行为者 @zh-hans
has subproperty: has landscape architect corporate body
has subproperty: has landscape architect family
has subproperty: P10472
label: peyzaj mimarı kolektif temsilcisi ile ilişkilidir @tr
definition: Bir eseri, peyzaj işleri yaratmaktan sorumlu mimar olan kolektif bir temsilci ile ilişkilendirir. @tr
toolkit label: peyzaj mimarı kolektif temsilci @tr
toolkit definition: Peyzaj işleri oluşturmaktan sorumlu bir mimar olan kolektif bir temsilci. @tr

has landscape architect corporate body
status: Published
lexical alias: landscapeArchitectCorporateBody.en
definition: Relates a work to a corporate body who is an architect who is responsible for creating landscape works.
toolkit label: landscape architect corporate body
toolkit definition: A corporate body who is an architect who is responsible for creating landscape works.
type: Property
domain: C10001
has element type: 2
sub property of: has architect corporate body
sub property of: has landscape architect collective agent
label: maisema-arkkitehti (yhteisö) @fi
definition: Liittää teoksen yhteisöön, joka on arkkitehti, joka on vastuussa maisemateosten luomisesta. @fi
toolkit label: maisema-arkkitehti (yhteisö) @fi
toolkit definition: Yhteisö, joka on arkkitehti, joka on vastuussa maisemateosten luomisesta. @fi
label: har landskapsarkitekt (korporasjon) @no
definition: Relaterer et verk til en korporasjon som er en arkitekt med ansvar for å skape landskapsverk. @no
toolkit label: landskapsarkitekt (korporasjon) @no
toolkit definition: En korporasjon som er en arkitekt med ansvar for å skape landskapsverk. @no
label: heeft landschapsarchitect-corporatie @nl
definition: Relateert een werk aan een corporatie die een architect is die verantwoordelijk is voor het creëren van landschapswerken. @nl
toolkit label: landschapsarchitect-corporatie @nl
toolkit definition: Een corporatie die een architect is die verantwoordelijk is voor het creëren van landschapswerken. @nl
label: له هيئة مهندسة تنسيق مواقع @ar
definition: يربط بين عمل وهيئة تكون مهندسة معمارية مسئولة عن إنشاء أعمال تنسيق المواقع. @ar
toolkit label: هيئة مهندسة تنسيق مواقع @ar
toolkit definition: هيئة تكون مهندسة معمارية مسئولة عن إنشاء أعمال تنسيق المواقع. @ar
label: té com a entitat corporativa arquitecta paisatgista @ca
definition: Relaciona una obra amb una entitat corporativa que és un arquitecte que és responsable de la creació d’obres paisatgístiques. @ca
toolkit label: entitat corporativa arquitecta paisatgista @ca
toolkit definition: Entitat corporativa que és un arquitecte que és responsable de la creació d’obres paisatgístiques. @ca
label: har korporation, som er landskabsarkitekt @da
definition: Relaterer et værk til en korporation, som er en arkitekt, som er ansvarlig for at skabe landskabsværker. @da
toolkit label: korporation, som er landskabsarkitekt @da
toolkit definition: Korporation, som er en arkitekt, som er ansvarlig for at skabe landskabsværker. @da
label: maastikuarhitekt (asutus) @et
definition: Seostab teose asutusega, kes arhitektina vastutab maastikuteoste loomise eest. @et
toolkit label: maastikuarhitekt (asutus) @et
toolkit definition: Asutus, kes arhitektina vastutab maastikuteoste loomise eest. @et
label: hat Landschaftsarchitektin/Landschaftsarchitekten (Körperschaft) @de
definition: Setzt ein Werk in Beziehung zu einer Architektin/einem Architekten (Körperschaft), die/der für die Schaffung landschaftlicher Werke verantwortlich ist. @de
toolkit label: Landschaftsarchitektin/Landschaftsarchitekt (Körperschaft) @de
toolkit definition: Eine Architektin/Ein Architekt (Körperschaft), die/der für die Schaffung landschaftlicher Werke verantwortlich ist. @de
label: tájépítész testülete a következő: @hu
definition: Hozzákapcsol egy művet egy építész testülethez, amely felelős tájépítészeti művek létrehozásáért. @hu
toolkit label: tájépítész testület: @hu
toolkit definition: Egy építész testület, amely felelős tájépítészeti művek létrehozásáért. @hu
label: ha come architetto del paesaggio ente @it
definition: Correla un'opera a un ente architetto responsabile della creazione di opere paesaggistiche. @it
toolkit label: architetto del paesaggio ente @it
toolkit definition: Ente architetto responsabile della creazione di opere paesaggistiche. @it
label: a pour collectivité architecte paysagiste @fr
definition: Met une œuvre en relation avec une collectivité qui est responsable de la création d’œuvres paysagères. @fr
toolkit label: collectivité architecte paysagiste @fr
toolkit definition: Collectivité qui est responsable de la création d’œuvres paysagères. @fr
label: ainavu arhitekts (institūcija) @lv
definition: Sasaista darbu ar institūciju, kas ir atbildīga par ainavu darbu veidošanu. @lv
toolkit label: ainavu arhitekts (institūcija) @lv
toolkit definition: Institūcija, kas ir atbildīga par ainavu darbu veidošanu. @lv
label: 有景观设计师团体 @zh-hans
definition: 将一种作品与作为建筑师并负责创建景观作品的一个团体关联起来。 @zh-hans
toolkit label: 景观设计师团体 @zh-hans
toolkit definition: 作为建筑师并负责创建景观作品的一个团体 @zh-hans
has subproperty: P10519
label: peyzaj mimarı tüzel kişisi ile ilişkilidir @tr
definition: Bir eseri, peyzaj işleri yapmaktan sorumlu bir mimar olan tüzel kişi ile ilişkilendirir. @tr
toolkit label: peyzaj mimarı tüzel kişisidir @tr
toolkit definition: Peyzaj çalışmaları oluşturmaktan sorumlu bir mimar olan tüzel kişi. @tr

has landscape architect family
status: Published
lexical alias: landscapeArchitectFamily.en
definition: Relates a work to a family who is an architect who is responsible for creating landscape works.
toolkit label: landscape architect family
toolkit definition: A family who is an architect who is responsible for creating landscape works.
type: Property
domain: C10001
has element type: 2
sub property of: has architect family
sub property of: has landscape architect collective agent
label: maisema-arkkitehti (suku) @fi
definition: Liittää teoksen sukuun, joka on arkkitehti, joka on vastuussa maisemateosten luomisesta. @fi
toolkit label: maisema-arkkitehti (suku) @fi
toolkit definition: Suku, joka on arkkitehti, joka on vastuussa maisemateosten luomisesta. @fi
label: har landskapsarkitekt (familie) @no
definition: Relaterer et verk til en familie som er en arkitekt med ansvar for å skape landskapsverk. @no
toolkit label: landskapsarkitekt (familie) @no
toolkit definition: En familie som er en arkitekt med ansvar for å skape landskapsverk. @no
label: heeft landschapsarchitect-familie @nl
definition: Relateert een werk aan een familie die een architect is die verantwoordelijk is voor het creëren van landschapswerken. @nl
toolkit label: landschapsarchitect-familie @nl
toolkit definition: Een familie die een architect is die verantwoordelijk is voor het creëren van landschapswerken. @nl
label: له عائلة مهندسة تنسيق مواقع @ar
definition: يربط بين عمل وعائلة تكون مهندسة معمارية مسئولة عن إنشاء أعمال تنسيق المواقع. @ar
toolkit label: عائلة مهندسة تنسيق مواقع @ar
toolkit definition: عائلة تكون مهندسة معمارية مسئولة عن إنشاء أعمال تنسيق المواقع. @ar
label: té com a família arquitecta paisatgista @ca
definition: Relaciona una obra amb una família que és un arquitecte que és responsable de la creació d’obres paisatgístiques. @ca
toolkit label: família arquitecta paisatgista @ca
toolkit definition: Família que és un arquitecte que és responsable de la creació d’obres paisatgístiques. @ca
label: har familie, som er landskabsarkitekt @da
definition: Relaterer et værk til en familie, som er en arkitekt, som er ansvarlig for at skabe landskabsværker. @da
toolkit label: familie, som er landskabsarkitekt @da
toolkit definition: Familie, som er en arkitekt, som er ansvarlig for at skabe landskabsværker. @da
label: maastikuarhitekt (perekond) @et
definition: Seostab teose perekonnaga, kes arhitektina vastutab maastikuteoste loomise eest. @et
toolkit label: maastikuarhitekt (perekond) @et
toolkit definition: Perekond, kes arhitektina vastutab maastikuteoste loomise eest. @et
label: hat Landschaftsarchitektin/Landschaftsarchitekten (Familie) @de
definition: Setzt ein Werk in Beziehung zu einer Architektin/einem Architekten (Familie), die/der für die Erstellung landschaftlicher Werke verantwortlich ist. @de
toolkit label: Landschaftsarchitektin/Landschaftsarchitekt (Familie) @de
toolkit definition: Eine Architektin/Ein Architekt (Familie), die/der für die Schaffung landschaftlicher Werke verantwortlich ist. @de
label: tájépítész családja a következő: @hu
definition: Hozzákapcsol egy művet egy építész családhoz, amely felelős tájépítészeti művek létrehozásáért. @hu
toolkit label: tájépítész család: @hu
toolkit definition: Egy építész család, amely felelős tájépítészeti művek létrehozásáért. @hu
label: ha come architetto del paesaggio famiglia @it
definition: Correla un'opera alla famiglia architetto responsabile della creazione di opere paesaggistiche. @it
toolkit label: architetto del paesaggio famiglia @it
toolkit definition: Famiglia architetto responsabile della creazione di opere paesaggistiche. @it
label: a pour famille architecte paysagiste @fr
definition: Met une œuvre en relation avec une famille qui est responsable de la création d’œuvres paysagères. @fr
toolkit label: famille architecte paysagiste @fr
toolkit definition: Famille qui est responsable de la création d’œuvres paysagères. @fr
label: ainavu arhitekts (dzimta/ģimene) @lv
definition: Sasaista darbu ar dzimtu/ģimeni, kas ir atbildīga par ainavu darbu veidošanu. @lv
toolkit label: ainavu arhitekts (dzimta/ģimene) @lv
toolkit definition: Dzimta/ģimene, kas ir atbildīga par ainavu darbu veidošanu. @lv
label: 有景观设计师家族 @zh-hans
definition: 将一种作品与作为建筑师并负责创建景观作品的一个家族关联起来。 @zh-hans
toolkit label: 景观设计师家族 @zh-hans
toolkit definition: 作为建筑师并负责创建景观作品的一个家族 @zh-hans
has subproperty: P10566
label: peyzaj mimarı ailesi ile ilişkilidir @tr
definition: Bir eseri, peyzaj çalışmaları yapmakla yükümlü mimar olan bir aileyle ilişkilendirir. @tr
toolkit label: peyzaj mimarı ailesi @tr
toolkit definition: Peyzaj çalışmaları yapmaktan sorumlu mimar olan bir aile. @tr

has landscape architect person
status: Published
lexical alias: landscapeArchitectPerson.en
definition: Relates a work to a person who is an architect who is responsible for creating landscape works.
toolkit label: landscape architect person
toolkit definition: A person who is an architect who is responsible for creating landscape works.
type: Property
domain: C10001
has element type: 2
sub property of: has architect person
sub property of: has landscape architect agent
label: maisema-arkkitehti (henkilö) @fi
definition: Liittää teoksen henkilöön, joka on arkkitehti, joka on vastuussa maisemateosten luomisesta. @fi
toolkit label: maisema-arkkitehti (henkilö) @fi
toolkit definition: Henkilö, joka on arkkitehti, joka on vastuussa maisemateosten luomisesta. @fi
label: har landskapsarkitekt (person) @no
definition: Relaterer et verk til en person som er en arkitekt med ansvar for å skape landskapsverk. @no
toolkit label: landskapsarkitekt (person) @no
toolkit definition: En person som er en arkitekt med ansvar for å skape landskapsverk. @no
label: heeft landschapsarchitect-persoon @nl
definition: Relateert een werk aan een persoon die een architect is die verantwoordelijk is voor het creëren van landschapswerken. @nl
toolkit label: landschapsarchitect-persoon @nl
toolkit definition: Een persoon die een architect is die verantwoordelijk is voor het creëren van landschapswerken. @nl
label: له شخص مهندس تنسيق مواقع @ar
definition: يربط بين عمل وشخص يكون مهندسا معماريا مسئولاً عن إنشاء أعمال تنسيق المواقع. @ar
toolkit label: شخص مهندس تنسيق مواقع @ar
toolkit definition: شخص يكون مهندسا معماريا مسئولاً عن إنشاء أعمال تنسيق المواقع. @ar
label: té com a persona arquitecta paisatgista @ca
definition: Relaciona una obra amb una persona que és un arquitecte que és responsable de la creació d’obres paisatgístiques. @ca
toolkit label: persona arquitecta paisatgista @ca
toolkit definition: Persona que és un arquitecte que és responsable de la creació d’obres paisatgístiques. @ca
label: har person, som er landskabsarkitekt @da
definition: Relaterer et værk til en person, som er en arkitekt, som er ansvarlig for at skabe landskabsværker. @da
toolkit label: person, som er landskabsarkitekt @da
toolkit definition: Person, som er en arkitekt, som er ansvarlig for at skabe landskabsværker. @da
label: maastikuarhitekt (isik) @et
definition: Seostab teose isikuga, kes arhitektina vastutab maastikuteoste loomise eest. @et
toolkit label: maastikuarhitekt (isik) @et
toolkit definition: Isik, kes arhitektina vastutab maastikuteoste loomise eest. @et
label: hat Landschaftsarchitektin/Landschaftsarchitekten (Person) @de
definition: Setzt ein Werk in Beziehung zu einer Architektin/einem Architekten (Person), die/der für die Schaffung landschaftlicher Werke verantwortlich ist. @de
toolkit label: Landschaftsarchitektin/Landschaftsarchitekt (Person) @de
toolkit definition: Eine Architektin/Ein Architekt (Person), die/der für die Schaffung landschaftlicher Werke verantwortlich ist. @de
label: tájépítész személye a következő: @hu
definition: Hozzákapcsol egy művet egy építész személyhez, aki felelős tájépítészeti művek létrehozásáért. @hu
toolkit label: tájépítész személy: @hu
toolkit definition: Egy építész személy, aki felelős tájépítészeti művek létrehozásáért. @hu
label: ha come architetto del paesaggio persona @it
definition: Correla un'opera alla persona architetto responsabile della creazione di opere paesaggistiche. @it
toolkit label: architetto del paesaggio persona @it
toolkit definition: Persona architetto responsabile della creazione di opere paesaggistiche. @it
label: a pour personne architecte paysagiste @fr
definition: Met une œuvre en relation avec une personne architecte qui est responsable de la création d’œuvres paysagères. @fr
toolkit label: personne architecte paysagiste @fr
toolkit definition: Personne architecte qui est responsable de la création d’œuvres paysagères. @fr
label: ainavu arhitekts (persona) @lv
definition: Sasaista darbu ar personu, kura ir atbildīga par ainavu darbu veidošanu. @lv
toolkit label: ainavu arhitekts (persona) @lv
toolkit definition: Persona, kura ir atbildīga par ainavu darbu veidošanu. @lv
label: 有景观设计师个人 @zh-hans
definition: 将一种作品与作为建筑师并负责创建景观作品的一个个人关联起来。 @zh-hans
toolkit label: 景观设计师个人 @zh-hans
toolkit definition: 作为建筑师并负责创建景观作品的一个个人 @zh-hans
has subproperty: P10425
label: peyzaj mimarı kişisi ile ilişkilidir @tr
definition: Bir eseri peyzaj çalışmaları yapmaktan sorumlu mimar olan kişi ile ilişkilendirir. @tr
toolkit label: peyzaj mimarı olan kişi @tr
toolkit definition: Peyzaj çalışmaları yapmaktan sorumlu mimar olan kişi. @tr

has language of representative expression
status: Published
type: Property
lexical alias: languageOfRepresentativeExpression.en
definition: Relates a work to a language used for the content of a representative expression of a work.
domain: C10001
toolkit label: language of representative expression
has element type: 5
toolkit definition: A language used for the content of a representative expression of a work.
label: edustavan ekspression kieli @fi
definition: Liittää teoksen teoksen edustavan ekspression sisällössä käytettyyn kieleen. @fi
toolkit label: edustavan ekspression kieli @fi
toolkit definition: Teoksen edustavan ekspression sisällössä käytetty kieli. @fi
label: har språk for representativt uttrykk @no
definition: Relaterer et verk til et språk som er brukt for innholdet av et representativt uttrykk av et verk. @no
toolkit label: språk for representativt uttrykk @no
toolkit definition: Et språk som er brukt for innholdet av et representativt uttrykk av et verk. @no
label: heeft taal van representatieve expressie @nl
definition: Relateert een werk aan een taal gebruikt voor de content van een representatieve expressie van een werk. @nl
toolkit label: taal van representatieve expressie @nl
toolkit definition: Een taal gebruikt voor de content van een representatieve expressie van een werk. @nl
label: له لغة تعبيرة ممثِلة @ar
definition: يربط بين عمل ولغة مستخدمة لمحتوى تعبيرة ممثِلة لعمل. @ar
toolkit label: لغة تعبيرة ممثِلة @ar
toolkit definition: لغة مستخدمة لمحتوى تعبيرة ممثِلة لعمل. @ar
label: té com a llengua d’una expressió representativa @ca
definition: Relaciona una obra amb una llengua usada en el contingut d’una expressió representativa d’una obra. @ca
toolkit label: llengua d’una expressió representativa @ca
toolkit definition: Llengua usada en el contingut d’una expressió representativa d’una obra. @ca
label: har sprog for repræsentativt udtryk @da
definition: Relaterer et værk til et sprog, som er brugt til et værks repræsentative udtryks indhold. @da
toolkit label: sprog for repræsentativt udtryk @da
toolkit definition: Sprog, som er brugt til et værks repræsentative udtryks indhold. @da
label: iseloomuliku väljenduse keel @et
definition: Seostab teose keelega, mida on kasutatud teose iseloomuliku väljenduse sisus. @et
toolkit label: iseloomuliku väljenduse keel @et
toolkit definition: Keel, mida on kasutatud teose iseloomuliku väljenduse sisus. @et
label: hat Sprache einer repräsentativen Expression @de
definition: Setzt ein Werk in Beziehung zu einer Sprache, die für den Inhalt einer repräsentativen Expression eines Werks verwendet wird. @de
toolkit label: Sprache einer repräsentativen Expression @de
toolkit definition: Eine Sprache, die für den Inhalt einer repräsentativen Expression eines Werks verwendet wird. @de
label: reprezentatív kifejezési forma nyelve a következő: @hu
definition: Hozzákapcsol egy művet egy nyelvhez, amelyet egy mű reprezentatív kifejezési formájának tartalmához használnak. @hu
toolkit label: reprezentatív kifejezési formához tartozó nyelv @hu
toolkit definition: Egy nyelv, amelyet egy mű reprezentatív kifejezési formájának tartalmához használnak. @hu
label: ha come lingua dell'espressione rappresentativa @it
definition: Correla un’opera a una lingua usata per il contenuto di un’espressione rappresentativa di un’opera. @it
toolkit label: lingua dell'espressione rappresentativa @it
toolkit definition: Lingua usata per il contenuto di un’espressione rappresentativa di un’opera. @it
label: a pour langue d’une expression représentative @fr
definition: Met une œuvre en relation avec une langue utilisée pour le contenu d’une expression représentative d’une œuvre. @fr
toolkit label: langue d’une expression représentative @fr
toolkit definition: Langue utilisée pour le contenu d’une expression représentative d’une œuvre. @fr
label: reprezentatīvās izteiksmes valoda @lv
definition: Sasaista darbu ar valodu, kas izmantota darba reprezentatīvas izteiksmes saturā. @lv
toolkit label: reprezentatīvās izteiksmes valoda @lv
toolkit definition: Valoda, kas izmantota darba reprezentatīvas izteiksmes saturā. @lv
label: 有代表性内容表达的语言 @zh-hans
definition: 将一种作品与一种作品的代表性内容表达的内容所用的语言关联起来。 @zh-hans
toolkit label: 代表性内容表达的语言 @zh-hans
toolkit definition: 一种作品的代表性内容表达的内容所用的语言 @zh-hans
has subproperty: P10353
label: temsili anlatımın dili ile ilişkilidir @tr
definition: Bir eseri, eserin temsili bir anlatımının içeriği için kullanılan bir dille ilişkilendirir. @tr
toolkit label: temsili ifade dili @tr
toolkit definition: Bir eserin temsili anlatımının içeriği için kullanılan bir dil. @tr

has language version
status: Published
lexical alias: languageVersion.en
definition: Relates a work to a work that is created by changing the language audience of a work.
toolkit label: language version
toolkit definition: A work that is created by changing the language audience of a work.
type: Property
domain: C10001
sub property of: has transformation by audience
has element type: 2
label: kieliversio @fi
definition: Liittää teoksen teokseen, joka on luotu muuttamalla teoksen kieliyleisöä. @fi
toolkit label: kieliversio @fi
toolkit definition: Teos, joka on luotu muuttamalla teoksen kieliyleisöä. @fi
label: har språklig versjon @no
definition: Relaterer et verk til et verk som er skapt ved endring av den språklige målgruppen for et verk. @no
toolkit label: språklig versjon @no
toolkit definition: Et verk som er skapt ved endring av den språklige målgruppen for et verk. @no
label: heeft taalversie @nl
definition: Relateert een werk aan een werk dat is gecreëerd door het wijzigen van de taaldoelgroep van een werk. @nl
toolkit label: taalversie @nl
toolkit definition: Een werk dat is gecreëerd door het wijzigen van de taaldoelgroep van een werk. @nl
label: له إصدارة لغة @ar
definition: يربط عمل بعمل يتم إنشاؤه عن طريق تغيير جمهور لغة عمل. @ar
toolkit label: إصدارة لغة @ar
toolkit definition: عمل يتم إنشاؤه عن طريق تغيير جمهور لغة عمل. @ar
label: té com a versió de llengua @ca
definition: Relaciona una obra amb una obra que es crea canviant la llengua dels destinataris d’una obra. @ca
toolkit label: versió de llengua @ca
toolkit definition: Obra que es crea canviant la llengua dels destinataris d’una obra. @ca
label: har sproglig version @da
definition: Relaterer et værk til et værk, som er skabt ved at ændre et værks sproglige målgruppe. @da
toolkit label: sproglig version @da
toolkit definition: Værk, som er skabt ved at ændre et værks sproglige målgruppe. @da
label: keeleversioon @et
definition: Seostab teose teosega, mis on loodud, muutes teose keelelist sihtrühma. @et
toolkit label: keeleversioon @et
toolkit definition: Teos, mis on loodud, muutes teose keelelist sihtrühma. @et
label: hat Sprachversion @de
definition: Setzt ein Werk in Beziehung zu einem Werk, das durch Änderung der sprachlichen Zielgruppe eines Werks erstellt wird. @de
toolkit label: Sprachversion @de
toolkit definition: Ein Werk, das durch Änderung der sprachlichen Zielgruppe eines Werks erstellt wird. @de
label: nyelvi változata a következő: @hu
definition: Hozzákapcsol egy művet egy műhöz, amely egy műközönség nyelvének megváltozása következtében jött létre. @hu
toolkit label: nyelvi változata: @hu
toolkit definition: Egy mű, amely egy műközönség nyelvének megváltozása következtében jött létre. @hu
label: ha come versione linguistica @it
definition: Correla un'opera a un'opera creata cambiando la lingua dei destinatari di un'opera. @it
toolkit label: versione linguistica @it
toolkit definition: Opera creata cambiando la lingua dei destinatari di un'opera. @it
label: a pour version linguistique @fr
definition: Met une œuvre en relation avec une œuvre qui est créée en modifiant le public linguistique d’une œuvre. @fr
toolkit label: version linguistique @fr
toolkit definition: Œuvre qui est créée en modifiant le public linguistique d’une œuvre. @fr
label: valodas versija @lv
definition: Sasaista darbu ar darbu, kas radīts, mainot darba valodu citvalodu auditorijas vajadzībām. @lv
toolkit label: valodas versija @lv
toolkit definition: Darbs, kas radīts, mainot darba valodu citvalodu auditorijas vajadzībām. @lv
label: 有语言版本 @zh-hans
definition: 将一种作品与通过改变一种作品的语言受众而被创建的一种作品关联起来。 @zh-hans
toolkit label: 语言版本 @zh-hans
toolkit definition: 通过改变一种作品的语言受众而被创建的一种作品 @zh-hans
has subproperty: P10385
label: dil uyarlaması ile ilişkilidir @tr
definition: Bir eseri, bir eserin dil kitlesi değiştirilerek oluşturulmuş bir eserle ilişkilendirir. @tr
toolkit label: dil versiyonu @tr
toolkit definition: Bir eserin dil kitlesinin değiştirilmesiyle oluşturulan bir eser. @tr

is language version of
status: Published
lexical alias: languageVersionOf.en
definition: Relates a work to a work that has a language audience that is changed to create a work.
toolkit label: language version of
toolkit definition: A work that has a language audience that is changed to create a work.
type: Property
domain: C10001
sub property of: is transformation by audience of
has element type: 2
label: kieliversio teoksesta @fi
definition: Liittää teoksen teokseen, jolla on kieliyleisö, jota on muutettu teoksen luomiseksi. @fi
toolkit label: kieliversio teoksesta @fi
toolkit definition: Teos, jolla on kieliyleisö, jota on muutettu teoksen luomiseksi. @fi
label: er språklig versjon av @no
definition: Relaterer et verk til et verk som har en språklig målgruppe som er endret for å skape et verk. @no
toolkit label: språklig versjon av @no
toolkit definition: Et verk som har en språklig målgruppe som er endret for å skape et verk. @no
label: is taalversie van @nl
definition: Relateert een werk aan een werk dat een taaldoelgroep heeft die gewijzigd wordt om een werk te creëren. @nl
toolkit label: taalversie van @nl
toolkit definition: Een werk dat een taaldoelgroep heeft die gewijzigd wordt om een werk te creëren. @nl
label: هو إصدارة لغة لـ @ar
definition: يربط عمل بعمل له جمهور لغة يتم تغييره لإنشاء عمل. @ar
toolkit label: إصدارة لغة لـ @ar
toolkit definition: عمل له جمهور لغة يتم تغييره لإنشاء عمل. @ar
label: és versió de llengua de @ca
definition: Relaciona una obra amb una obra que té uns destinataris d’una llengua que es canvien per crear una obra. @ca
toolkit label: versió de llengua de @ca
toolkit definition: Obra que té uns destinataris d’una llengua que es canvien per crear una obra. @ca
label: er sproglig version af @da
definition: Relaterer et værk til et værk, som har en sproglig målgruppe, som ændres for at skabe et værk. @da
toolkit label: sproglig version af @da
toolkit definition: Værk, som har en sproglig målgruppe, som ændres for at skabe et værk. @da
label: keeleversioon teosest @et
definition: Seostab teose teosega, mille keelelist sihtrühma on teose loomiseks muudetud. @et
toolkit label: keeleversioon teosest @et
toolkit definition: Teos, mille keelelist sihtrühma on teose loomiseks muudetud. @et
label: ist Sprachversion von @de
definition: Setzt ein Werk in Beziehung zu einem Werk, dessen sprachlichen Zielgruppe geändert wird, um ein Werk zu schaffen. @de
toolkit label: Sprachversion von @de
toolkit definition: Ein Werk, dessen sprachlichen Zielgruppe geändert wird, um ein Werk zu schaffen. @de
label: nyelvi változata a következőnek: @hu
definition: Hozzákapcsol egy művet egy műűhöz, amely közönségének a nyelve megváltozott egy mű létrejövetele érdekében. @hu
toolkit label: nyelvi változata: @hu
toolkit definition: Egy mű, amely közönségének a nyelve megváltozott egy mű létrejövetele érdekében. @hu
label: è versione linguistica di @it
definition: Correla un'opera a un'opera la cui lingua dei destinatari è cambiata per creare un'opera @it
toolkit label: versione linguistica di @it
toolkit definition: Opera la cui lingua dei destinatari è cambiata per creare un'opera. @it
label: est une version linguistique de @fr
definition: Met une œuvre en relation avec une œuvre dont le public cible linguistique est modifié pour créer une œuvre. @fr
toolkit label: version linguistique de @fr
toolkit definition: Œuvre dont le public cible linguistique est modifié pour créer une œuvre. @fr
label: ir valodas versija no @lv
definition: Sasaista darbu ar darbu, kam valoda tika mainīta, pielāgojot citvalodu auditorijas vajadzībām. @lv
toolkit label: valodas versija no @lv
toolkit definition: Darbs, kam valoda tika mainīta, pielāgojot citvalodu auditorijas vajadzībām. @lv
label: 是……的语言版本 @zh-hans
definition: 将一种作品与有语言受众并被改变以创建一种作品的一种作品关联起来。 @zh-hans
toolkit label: ……的语言版本 @zh-hans
toolkit definition: 有语言受众并被改变以创建一种作品的一种作品 @zh-hans
has subproperty: P10388
label: dil uyarlamasıdır @tr
definition: Bir eseri, bir eser oluşturmak için değiştirilen bir dil kitlesine sahip bir eser ile ilişkilendirir. @tr
toolkit label: Dil versiyonu @tr
toolkit definition: Bir eserin, dil hedef kitlesi değiştirilerek oluşturulduğu bir eser. @tr

has librettist agent
status: Published
definition: Relates a work to an agent who is an author of the words of a musical or choreographic work such as an opera, a ballet, or other work for the musical stage, or an oratorio.
type: Property
domain: C10001
sub property of: has author agent
lexical alias: librettistAgent.en
toolkit label: librettist agent
toolkit definition: An agent who is an author of the words of a musical or choreographic work such as an opera, a ballet, or other work for the musical stage, or an oratorio.
toolkit label: agent librettiste @fr
toolkit definition: Agent auteur des paroles d’une œuvre musicale ou chorégraphique telle qu’un opéra, un ballet ou une autre œuvre pour la scène musicale, ou telle qu’un oratorio. @fr
toolkit label: libretista @es
toolkit definition: Un autor de las palabras de una ópera u otra obra escénica musical, o de un oratorio. @es
scope note: Authoring of the words of only the songs from a musical is excluded.
see also: has lyricist agent
instruction number: 18.5
label: har agent, som er librettist @da
definition: Relaterer et værk til en agent, som er forfatter af teksten til et musikalsk- eller koreografisk værk, såsom en opera, en ballet eller andet værk til en musikalsk scene, eller et oratorium. @da
scope note: Forfatter til kun sangteksterne i en musical er ikke omfattet. @da
toolkit label: agent, som er librettist @da
toolkit definition: Agent, som er forfatter af teksten til et musikalsk- eller koreografisk værk, såsom en opera, en ballet eller andet værk til en musikalsk scene, eller et oratorium. @da
definition: Met une œuvre en relation avec un agent auteur des paroles d’une œuvre musicale ou chorégraphique telle qu’un opéra, un ballet ou une autre œuvre pour la scène musicale, ou telle qu’un oratorio. @fr
label: có người viết lời nhạc kịch @vi
definition: Liên kết tác phẩm với tác giả của lời của opera hoặc tác phẩm sân khấu âm nhạc khác, hoặc oratorio. @vi
scope note: Tác giả của lời chỉ các bài hát từ âm nhạc, không được bao gồm. @vi
toolkit label: người viết lời nhạc kịch @vi
toolkit definition: Tác giả của lời của opera hoặc tác phẩm sân khấu âm nhạc khác, hoặc oratorio. @vi
label: hat Librettistin/Librettist (Akteur) @de
definition: Setzt ein Werk in Beziehung zu einer Verfasserin/einem Verfasser (Akteur) des Texts für ein Musikwerk oder choreografisches Werk, wie zum Beispiel einer Oper, einem Ballett oder einem anderen Musikwerk für die Bühne, oder für ein Oratorium. @de
scope note: Nur das Verfassen der Liedtexte eines Musicals fällt nicht darunter. @de
toolkit label: Librettistin/Librettist (Akteur) @de
toolkit definition: Eine Verfasserin/Ein Verfasser (Akteur) des Texts für ein Musikwerk oder choreografisches Werk, wie zum Beispiel einer Oper, einem Ballett oder einem anderen Musikwerk für die Bühne, oder für ein Oratorium. @de
label: a pour agent librettiste @fr
definition: Liittää teoksen toimijaan, joka on musiikki- tai koreografisen teoksen, kuten oopperan, baletin tai muun musiikillisen näyttämöteoksen tai oratorion sanojen kirjoittaja. @fi
toolkit label: libretisti (toimija) @fi
toolkit definition: Toimija, joka on musiikki- tai koreografisen teoksen, kuten oopperan, baletin tai muun musiikillisen näyttämöteoksen tai oratorion sanojen kirjoittaja. @fi
toolkit label: librettist (agent) @no
toolkit definition: En agent som er en forfatter av ordene i et musikalsk eller koreografisk verk som en opera, en ballett eller ennet verk for en musikalsk scene, eller et oratorium. @no
label: té com a agent llibretista @ca
definition: Relaciona una obra amb un agent que és un autor de les paraules d’una obra musical o coreogràfica com ara una òpera, un ballet o qualsevol altra obra escènica musical o d’un oratori. @ca
scope note: S’exclou l’autoria de només les paraules de les cançons d’un musical. @ca
toolkit label: agent llibretista @ca
toolkit definition: Agent que és un autor de les paraules d’una obra musical o coreogràfica com ara una òpera, un ballet o qualsevol altra obra escènica musical o d’un oratori. @ca
scope note: Le fait d’être l’auteur uniquement des paroles des chansons d’une comédie musicale est exclu. @fr
has element type: 2
label: έχει λιμπρετίστα @el
definition: Συνδέει ένα έργο με έναν συγγραφέα των στίχων μιας όπερας ή κάποιου άλλου μουσικού σκηνικού έργου ή ενός ορατορίου. @el
scope note: Δεν περιλαμβάνεται η συγγραφή των στίχων μόνο των τραγουδιών ενός musical. @el
toolkit label: λιμπρετίστας @el
toolkit definition: Ένας συγγραφέας των στίχων μιας όπερας ή κάποιου άλλου μουσικού σκηνικού έργου ή ενός ορατορίου. @el
label: librettista ágense a következő: @hu
definition: Hozzákapcsol egy művet egy szerző ágenshez, amely olyan zenei vagy koreografikus mű szövegét szerzi, mint egy opera, balett, oratórium, vagy más zenés színpadi mű. @hu
scope note: librettista: @hu
toolkit label: librettista ágens: @hu
toolkit definition: Egy szerző ágens, amely olyan zenei vagy koreografikus mű szövegét szerzi, mint egy opera, balett, oratórium, vagy más zenés színpadi mű. @hu
alternative label: librettist
scope note: Ei kata pelkkien musikaalilaulujen sanojen kirjoittajaa. @fi
alternative label: libretisti @fi
label: libretisti (toimija) @fi
label: har librettist (agent) @no
definition: Relaterer et verk til en agent som er en forfatter av ordene i et musikalsk eller koreografisk verk som en opera, en ballett eller ennet verk for en musikalsk scene, eller et oratorium. @no
scope note: Det å kun skrive ordene til bare sangene fra en musikal, er ikke inkludert. @no
label: heeft librettist-actor @nl
definition: Relateert een werk aan een actor die een auteur is van de woorden van een muziek- of choreografisch werk zoals een opera, een ballet of ander muzikaal podiumwerk of een oratorium. @nl
scope note: Het schrijven van alleen de woorden van de liedjes uit een musical is uitgesloten. @nl
toolkit label: librettist-actor @nl
toolkit definition: Een actor die een auteur is van de woorden van een muziek- of choreografisch werk zoals een opera, een ballet of ander muzikaal podiumwerk of een oratorium. @nl
label: له وكيل مؤلف أوبرالي @ar
definition: يربط بين عمل ووكيل يكون مؤلف كلمات عمل موسيقي، أو راقص مثل الأوبرا أو الباليه، أو أي عمل آخر للمسرح الموسيقي، أو موسيقى دينية. @ar
scope note: يُستبعد تأليف كلمات الأغاني فقط من مسرحية موسيقية. @ar
alternative label: مؤلف أوبرالي @ar
toolkit label: وكيل مؤلف أوبرالي @ar
toolkit definition: وكيل يكون مؤلف كلمات عمل موسيقي، أو راقص مثل الأوبرا أو الباليه، أو أي عمل آخر للمسرح الموسيقي، أو موسيقى دينية. @ar
alternative label: llibretista @ca
label: libretist (tegija) @et
definition: Seostab teose tegijaga, kes on muusikalise või koreograafilise lavateose (nt ooper, ballett) või oratooriumi sõnade autor. @et
scope note: Ei hõlma üksnes muusikali laulusõnade kirjutamist. @et
alternative label: libretist @et
toolkit label: libretist (tegija) @et
toolkit definition: Tegija, kes on muusikalise või koreograafilise lavateose (nt ooper, ballett) või oratooriumi sõnade autor. @et

has librettist collective agent
status: Published
lexical alias: librettistCollectiveAgent.en
definition: Relates a work to a collective agent who is an author of the words of a musical or choreographic work such as an opera, a ballet, or other work for the musical stage, or an oratorio.
toolkit label: librettist collective agent
toolkit definition: A collective agent who is an author of the words of a musical or choreographic work such as an opera, a ballet, or other work for the musical stage, or an oratorio.
type: Property
domain: C10001
has element type: 2
sub property of: has author collective agent
sub property of: has librettist agent
scope note: Authoring of the words of only the songs from a musical is excluded.
label: libretisti (yhteistoimija) @fi
definition: Liittää teoksen yhteistoimijaan, joka on musiikki- tai koreografisen teoksen, kuten oopperan, baletin tai muun musiikillisen näyttämöteoksen tai oratorion sanojen kirjoittaja. @fi
scope note: Ei kata pelkkien musikaalilaulujen sanojen kirjoittajaa. @fi
toolkit label: libretisti (yhteistoimija) @fi
toolkit definition: Yhteistoimija, joka on musiikki- tai koreografisen teoksen, kuten oopperan, baletin tai muun musiikillisen näyttämöteoksen tai oratorion sanojen kirjoittaja. @fi
label: har librettist (kollektiv agent) @no
definition: Relaterer et verk til en kollektiv agent som er en forfatter av ordene i et musikalsk eller koreografisk verk som en opera, en ballett eller ennet verk for en musikalsk scene, eller et oratorium. @no
scope note: Det å kun skrive ordene til bare sangene fra en musikal, er ikke inkludert. @no
toolkit label: librettist (kollektiv agent) @no
toolkit definition: En kollektiv agent som er en forfatter av ordene i et musikalsk eller koreografisk verk som en opera, en ballett eller ennet verk for en musikalsk scene, eller et oratorium. @no
label: heeft librettist-collectieve actor @nl
definition: Relateert een werk aan een collectieve actor die een auteur is van de woorden van een muziek- of choreografisch werk zoals een opera, een ballet of ander muzikaal podiumwerk of een oratorium. @nl
scope note: Het schrijven van alleen de woorden van de liedjes uit een musical is uitgesloten. @nl
toolkit label: librettist-collectieve actor @nl
toolkit definition: Een collectieve actor die een auteur is van de woorden van een muziek- of choreografisch werk zoals een opera, een ballet of ander muzikaal podiumwerk of een oratorium. @nl
label: له وكيل جماعي مؤلف أوبرالي @ar
definition: يربط بين عمل ووكيل جماعي يكون مؤلف كلمات عمل موسيقي، أو راقص مثل الأوبرا أو الباليه، أو أي عمل آخر للمسرح الموسيقي، أو موسيقى دينية. @ar
scope note: يُستبعد تأليف كلمات الأغاني فقط من مسرحية موسيقية. @ar
toolkit label: وكيل جماعي مؤلف أوبرالي @ar
toolkit definition: وكيل جماعي يكون مؤلف كلمات عمل موسيقي، أو راقص مثل الأوبرا أو الباليه، أو أي عمل آخر للمسرح الموسيقي، أو موسيقى دينية. @ar
label: té com a agent col·lectiu llibretista @ca
definition: Relaciona una obra amb un agent que és un autor de les paraules d’un musical o una obra coreogràfica com ara una òpera, un ballet o qualsevol altra obra escènica musical o d’un oratori. @ca
scope note: S’exclou l’autoria de només les paraules de les cançons d’un musical. @ca
toolkit label: agent col·lectiu llibretista @ca
toolkit definition: Agent que és un autor de les paraules d’un musical o una obra coreogràfica com ara una òpera, un ballet o qualsevol altra obra escènica musical o d’un oratori. @ca
label: har kollektiv agent, som er librettist @da
definition: Relaterer et værk til en kollektiv agent, som er forfatter af teksten til et musikalsk- eller koreografisk værk, såsom en opera, en ballet eller andet værk til en musikalsk scene, eller et oratorium. @da
scope note: Forfatter til kun sangteksterne i en musical er ikke omfattet. @da
toolkit label: Kollektiv agent, som er librettist @da
toolkit definition: Kollektiv agent, som er forfatter af teksten til et musikalsk- eller koreografisk værk, såsom en opera, en ballet eller andet værk til en musikalsk scene, eller et oratorium. @da
label: libretist (kollektiiv) @et
definition: Seostab teose kollektiiviga, kes on muusikalise või koreograafilise lavateose (nt ooper, ballett) või oratooriumi sõnade autor. @et
scope note: Ei hõlma üksnes muusikali laulusõnade kirjutamist. @et
toolkit label: libretist (kollektiiv) @et
toolkit definition: Kollektiiv, kes on muusikalise või koreograafilise lavateose (nt ooper, ballett) või oratooriumi sõnade autor. @et
label: hat Librettistin/Librettisten (Gemeinschaftlicher Akteur) @de
definition: Setzt ein Werk in Beziehung zu einer Verfasserin/einem Verfasser (Gemeinschaftlicher Akteur) des Texts für ein Musical oder choreografisches Werk, wie zum Beispiel einer Oper, einem Ballett oder einem anderen Musikwerk für die Bühne, oder für ein Oratorium. @de
scope note: Nur das Verfassen der Liedtexte eines Musicals fällt nicht darunter. @de
toolkit label: Librettistin/Librettist (Gemeinschaftlicher Akteur) @de
toolkit definition: Eine Verfasserin/Ein Verfasser (Gemeinschaftlicher Akteur) des Texts für ein Musical oder choreografisches Werk, wie zum Beispiel einer Oper, einem Ballett oder einem anderen Musikwerk für die Bühne, oder für ein Oratorium. @de
label: librettista kollektív ágense a következő: @hu
definition: Hozzákapcsol egy művet egy szerző kollektív ágenshez, amely olyan zenei vagy koreografikus mű szövegét szerzi, mint egy opera, balett, oratórium, vagy más zenés színpadi mű. @hu
scope note: Musicaldalok szövegírója nem tartozik ide. @hu
toolkit label: librettista kollektív ágens: @hu
toolkit definition: Egy szerző kollektív ágens, amely olyan zenei vagy koreografikus mű szövegét szerzi, mint egy opera, balett, oratórium, vagy más zenés színpadi mű. @hu
label: ha come librettista agente collettivo @it
definition: Correla un'opera a un agente collettivo autore delle parole di un musical o opera coreografica, come un'opera, balletto, o altra opera per il teatro musicale, o per un oratorio. @it
scope note: E' escluso essere autore delle parole delle sole canzoni di un musical. @it
toolkit label: librettista agente collettivo @it
toolkit definition: Agente collettivo autore delle parole di un musical o opera coreografica, come un'opera, balletto, o altra opera per il teatro musicale, o per un oratorio. @it
label: a pour agent collectif librettiste @fr
definition: Met une œuvre en relation avec un agent collectif auteur des paroles d’une œuvre musicale ou chorégraphique telle qu’un opéra, un ballet ou une autre œuvre pour la scène musicale, ou telle qu’un oratorio. @fr
scope note: Le fait d’être l’auteur uniquement des paroles des chansons d’une comédie musicale est exclu. @fr
toolkit label: agent collectif librettiste @fr
toolkit definition: Agent collectif auteur des paroles d’une œuvre musicale ou chorégraphique telle qu’un opéra, un ballet ou une autre œuvre pour la scène musicale, ou telle qu’un oratorio. @fr
label: libretists (grupa) @lv
definition: Sasaista darbu ar grupu, kas ir teksta autors mūzikas vai horeogrāfiskam darbam, piemēram, operai, baletam, citam muzikālam skatuves darbam vai oratorijai. @lv
toolkit label: libretists (grupa) @lv
toolkit definition: Grupa, kas ir teksta autors mūzikas vai horeogrāfiskam darbam, piemēram, operai, baletam, citam muzikālam skatuves darbam vai oratorijai. @lv
scope note: Neietver atsevišķu dziesmu tekstus mūziklos. @lv
label: 有台本作者集体行为者 @zh-hans
definition: 将一种作品与作为歌剧、芭蕾等音乐或编舞作品或其他舞台音乐作品或者清唱剧的歌词的著者的一个集体行为者关联起来。 @zh-hans
toolkit label: 台本作者集体行为者 @zh-hans
toolkit definition: 作为歌剧、芭蕾等音乐或编舞作品或其他舞台音乐作品或者清唱剧的歌词的著者的一个集体行为者 @zh-hans
scope note: 不包括音乐剧中只是歌曲的词著者。 @zh-hans
has subproperty: has librettist corporate body
has subproperty: has librettist family
has subproperty: P10478

has librettist corporate body
status: Published
lexical alias: librettistCorporateBody.en
definition: Relates a work to a corporate body who is an author of the words of a musical or choreographic work such as an opera, a ballet, or other work for the musical stage, or an oratorio.
toolkit label: librettist corporate body
toolkit definition: A corporate body who is an author of the words of a musical or choreographic work such as an opera, a ballet, or other work for the musical stage, or an oratorio.
type: Property
domain: C10001
has element type: 2
sub property of: has author corporate body
sub property of: has librettist collective agent
scope note: Authoring of the words of only the songs from a musical is excluded.
label: libretisti (yhteisö) @fi
definition: Liittää teoksen yhteisöön, joka on musiikki- tai koreografisen teoksen, kuten oopperan, baletin tai muun musiikillisen näyttämöteoksen tai oratorion sanojen kirjoittaja. @fi
scope note: Ei kata pelkkien musikaalilaulujen sanojen kirjoittajaa. @fi
toolkit label: libretisti (yhteisö) @fi
toolkit definition: Yhteisö, joka on musiikki- tai koreografisen teoksen, kuten oopperan, baletin tai muun musiikillisen näyttämöteoksen tai oratorion sanojen kirjoittaja. @fi
label: har librettist (korporasjon) @no
definition: Relaterer et verk til en korporasjon som er en forfatter av ordene i et musikalsk eller koreografisk verk som en opera, en ballett eller ennet verk for en musikalsk scene, eller et oratorium. @no
scope note: Det å kun skrive ordene til bare sangene fra en musikal, er ikke inkludert. @no
toolkit label: librettist (korporasjon) @no
toolkit definition: En korporasjon som er en forfatter av ordene i et musikalsk eller koreografisk verk som en opera, en ballett eller ennet verk for en musikalsk scene, eller et oratorium. @no
label: heeft librettist-corporatie @nl
definition: Relateert een werk aan een corporatie die een auteur is van de woorden van een muziek- of choreografisch werk zoals een opera, een ballet of ander muzikaal podiumwerk of een oratorium. @nl
scope note: Het schrijven van alleen de woorden van de liedjes uit een musical is uitgesloten. @nl
toolkit label: librettist-corporatie @nl
toolkit definition: Een corporatie die een auteur is van de woorden van een muziek- of choreografisch werk zoals een opera, een ballet of ander muzikaal podiumwerk of een oratorium. @nl
label: له هيئة مؤلفة أوبرالية @ar
definition: يربط بين عمل وهيئة مؤلفة لكلمات عمل موسيقي، أو راقص مثل الأوبرا أو الباليه، أو أي عمل آخر للمسرح الموسيقي، أو موسيقى دينية. @ar
scope note: يُستبعد تأليف كلمات الأغاني فقط من مسرحية موسيقية. @ar
toolkit label: هيئة مؤلفة أوبرالية @ar
toolkit definition: هيئة تكون مؤلفة لكلمات عمل موسيقي، أو راقص مثل الأوبرا أو الباليه، أو أي عمل آخر للمسرح الموسيقي، أو موسيقى دينية. @ar
label: té com a entitat corporativa llibretista @ca
definition: Relaciona una obra amb una entitat corporativa que és un autor de les paraules d’un musical o una obra coreogràfica com ara una òpera, un ballet o qualsevol altra obra escènica musical o d’un oratori. @ca
scope note: S’exclou l’autoria de només les paraules de les cançons d’un musical. @ca
toolkit label: entitat corporativa llibretista @ca
toolkit definition: Entitat corporativa que és un autor de les paraules d’un musical o una obra coreogràfica com ara una òpera, un ballet o qualsevol altra obra escènica musical o d’un oratori. @ca
label: har korporation, som er librettist @da
definition: Relaterer et værk til en korporation, som er forfatter af teksten til et musikalsk- eller koreografisk værk, såsom en opera, en ballet eller andet værk til en musikalsk scene, eller et oratorium. @da
scope note: Forfatter til kun sangteksterne i en musical er ikke omfattet. @da
toolkit label: korporation, som er librettist @da
toolkit definition: Korporation, som er forfatter af teksten til et musikalsk- eller koreografisk værk, såsom en opera, en ballet eller andet værk til en musikalsk scene, eller et oratorium. @da
label: libretist (asutus) @et
definition: Seostab teose asutusega, kes on muusikalise või koreograafilise lavateose (nt ooper, ballett) või oratooriumi sõnade autor. @et
scope note: Ei hõlma üksnes muusikali laulusõnade kirjutamist. @et
toolkit label: libretist (asutus) @et
toolkit definition: Asutus, kes on muusikalise või koreograafilise lavateose (nt ooper, ballett) või oratooriumi sõnade autor. @et
label: hat Librettistin/Librettisten (Körperschaft) @de
definition: Setzt ein Werk in Beziehung zu einer Verfasserin/einem Verfasser (Körperschaft) des Texts für ein Musical oder choreografisches Werk, wie zum Beispiel einer Oper, einem Ballett oder einem anderen Musikwerk für die Bühne, oder für ein Oratorium. @de
scope note: Nur das Verfassen der Liedtexte eines Musicals fällt nicht darunter. @de
toolkit label: Librettistin/Librettist (Körperschaft) @de
toolkit definition: Eine Verfasserin/Ein Verfasser (Körperschaft)des Texts für ein Musical oder choreografisches Werk, wie zum Beispiel einer Oper, einem Ballett oder einem anderen Musikwerk für die Bühne, oder für ein Oratorium. @de
label: librettista testülete a következő: @hu
definition: Hozzákapcsol egy művet egy szerző testülethez, amely olyan zenei vagy koreografikus mű szövegét szerzi, mint egy opera, balett, oratórium, vagy más zenés színpadi mű. @hu
scope note: Musicaldalok szövegírója nem tartozik ide. @hu
toolkit label: librettista testület: @hu
toolkit definition: Egy szerző testület, amely olyan zenei vagy koreografikus mű szövegét szerzi, mint egy opera, balett, oratórium, vagy más zenés színpadi mű. @hu
label: ha come librettista ente @it
definition: Correla un'opera a un ente autore delle parole di un musical o opera coreografica, come un'opera, balletto, o altra opera per il teatro musicale, o per un oratorio. @it
scope note: E' escluso essere autore delle parole delle sole canzoni di un musical. @it
toolkit label: librettista ente @it
toolkit definition: Ente autore delle parole di un musical o opera coreografica, come un'opera, balletto, o altra opera per il teatro musicale, o per un oratorio. @it
label: a pour collectivité librettiste @fr
definition: Met une œuvre en relation avec une collectivité autrice des paroles d’une œuvre musicale ou chorégraphique telle qu’un opéra, un ballet ou une autre œuvre pour la scène musicale, ou telle qu’un oratorio. @fr
scope note: Le fait d’être l’auteur uniquement des paroles des chansons d’une comédie musicale est exclu. @fr
toolkit label: collectivité librettiste @fr
toolkit definition: Collectivité autrice des paroles d’une œuvre musicale ou chorégraphique telle qu’un opéra, un ballet ou une autre œuvre pour la scène musicale, ou telle qu’un oratorio. @fr
label: libretists (institūcija) @lv
definition: Sasaista darbu ar institūciju, kas ir teksta autors mūzikas vai horeogrāfiskam darbam, piemēram, operai, baletam, citam muzikālam skatuves darbam vai oratorijai. @lv
toolkit label: libretists (institūcija) @lv
toolkit definition: Institūcija, kas ir teksta autors mūzikas vai horeogrāfiskam darbam, piemēram, operai, baletam, citam muzikālam skatuves darbam vai oratorijai. @lv
scope note: Neietver atsevišķu dziesmu tekstus mūziklos. @lv
label: 有台本作者团体 @zh-hans
definition: 将一种作品与作为歌剧、芭蕾等音乐或编舞作品或其他舞台音乐作品或者清唱剧的歌词的著者的一个团体关联起来。 @zh-hans
toolkit label: 台本作者团体 @zh-hans
toolkit definition: 作为歌剧、芭蕾等音乐或编舞作品或其他舞台音乐作品或者清唱剧的歌词的著者的一个团体 @zh-hans
scope note: 不包括音乐剧中只是歌曲的词著者。 @zh-hans
has subproperty: P10525
label: libretto yazarı tüzel kişisi ile ilişkilidir @tr
definition: Bir eseri, opera, bale veya müzikal sahne için başka bir eser veya oratoryo gibi müzikal veya koreografik bir eserin sözlerinin yazarı olan tüzel kişi ile ilişkilendirir. @tr

has librettist family
status: Published
lexical alias: librettistFamily.en
definition: Relates a work to a family who is an author of the words of a musical or choreographic work such as an opera, a ballet, or other work for the musical stage, or an oratorio.
toolkit label: librettist family
toolkit definition: A family who is an author of the words of a musical or choreographic work such as an opera, a ballet, or other work for the musical stage, or an oratorio.
type: Property
domain: C10001
has element type: 2
sub property of: has author family
sub property of: has librettist collective agent
scope note: Authoring of the words of only the songs from a musical is excluded.
label: libretisti (suku) @fi
definition: Liittää teoksen sukuun, joka on musiikki- tai koreografisen teoksen, kuten oopperan, baletin tai muun musiikillisen näyttämöteoksen tai oratorion sanojen kirjoittaja. @fi
scope note: Ei kata pelkkien musikaalilaulujen sanojen kirjoittajaa. @fi
toolkit label: libretisti (suku) @fi
toolkit definition: Suku, joka on musiikki- tai koreografisen teoksen, kuten oopperan, baletin tai muun musiikillisen näyttämöteoksen tai oratorion sanojen kirjoittaja. @fi
label: har librettist (familie) @no
definition: Relaterer et verk til en famile som er en forfatter av ordene i et musikalsk eller koreografisk verk som en opera, en ballett eller ennet verk for en musikalsk scene, eller et oratorium. @no
scope note: Det å kun skrive ordene til bare sangene fra en musikal, er ikke inkludert. @no
toolkit label: librettist (familie) @no
toolkit definition: En famile som er en forfatter av ordene i et musikalsk eller koreografisk verk som en opera, en ballett eller ennet verk for en musikalsk scene, eller et oratorium. @no
label: heeft librettist-familie @nl
definition: Relateert een werk aan een familie die een auteur is van de woorden van een muziek- of choreografisch werk zoals een opera, een ballet of ander muzikaal podiumwerk of een oratorium. @nl
scope note: Het schrijven van alleen de woorden van de liedjes uit een musical is uitgesloten. @nl
toolkit label: librettist-familie @nl
toolkit definition: Een familie die een auteur is van de woorden van een muziek- of choreografisch werk zoals een opera, een ballet of ander muzikaal podiumwerk of een oratorium. @nl
label: له عائلة مؤلفة أوبرالية @ar
definition: يربط بين عمل وعائلة تكون مؤلفة كلمات عمل موسيقي، أو راقص مثل الأوبرا أو الباليه، أو أي عمل آخر للمسرح الموسيقي، أو موسيقى دينية. @ar
scope note: يُستبعد تأليف كلمات الأغاني فقط من مسرحية موسيقية. @ar
toolkit label: عائلة مؤلفة أوبرالية @ar
toolkit definition: عائلة تكون مؤلفة كلمات عمل موسيقي، أو راقص مثل الأوبرا أو الباليه، أو أي عمل آخر للمسرح الموسيقي، أو موسيقى دينية. @ar
label: té com a família llibretista @ca
definition: Relaciona una obra amb una família que és un autor de les paraules d’una obra musical o coreogràfica com ara una òpera, un ballet o una qualsevol altra escènica musical o d’un oratori. @ca
scope note: S’exclou l’autoria de només les paraules de les cançons d’un musical. @ca
toolkit label: família llibretista @ca
toolkit definition: Família que és un autor de les paraules d’una obra musical o coreogràfica com ara una òpera, un ballet o qualsevol altra obra escènica musical o d’un oratori. @ca
label: har familie, som er librettist @da
definition: Relaterer et værk til en familie, som er forfatter af teksten til et musikalsk- eller koreografisk værk, såsom en opera, en ballet eller andet værk til en musikalsk scene, eller et oratorium. @da
scope note: Forfatter til kun sangteksterne i en musical er ikke omfattet. @da
toolkit label: familie, som er librettist @da
toolkit definition: Familie, som er forfatter af teksten til et musikalsk- eller koreografisk værk, såsom en opera, en ballet eller andet værk til en musikalsk scene, eller et oratorium. @da
label: libretist (perekond) @et
definition: Seostab teose perekonnaga, kes on muusikalise või koreograafilise lavateose (nt ooper, ballett) või oratooriumi sõnade autor. @et
scope note: Ei hõlma üksnes muusikali laulusõnade kirjutamist. @et
toolkit label: libretist (perekond) @et
toolkit definition: Perekond, kes on muusikalise või koreograafilise lavateose (nt ooper, ballett) või oratooriumi sõnade autor. @et
label: hat Librettistin/Librettisten (Familie) @de
definition: Setzt ein Werk in Beziehung zu einer Verfasserin/einem Verfasser (Familie) des Texts für ein Musical oder choreografisches Werk, wie zum Beispiel einer Oper, einem Ballett oder einem anderen Musikwerk für die Bühne, oder für ein Oratorium. @de
scope note: Nur das Verfassen der Liedtexte eines Musicals fällt nicht darunter. @de
toolkit label: Librettistin/Librettist (Familie) @de
toolkit definition: Eine Verfasserin/Ein Verfasser (Familie) des Texts für ein Musical oder choreografisches Werk, wie zum Beispiel einer Oper, einem Ballett oder einem anderen Musikwerk für die Bühne, oder für ein Oratorium. @de
label: librettista családja a következő: @hu
definition: Hozzákapcsol egy művet egy szerző családhoz, amely olyan zenei vagy koreografikus mű szövegét szerzi, mint egy opera, balett, oratórium, vagy más zenés színpadi mű. @hu
scope note: Musicaldalok szövegírója nem tartozik ide. @hu
toolkit label: librettista család: @hu
toolkit definition: Egy szerző család, amely olyan zenei vagy koreografikus mű szövegét szerzi, mint egy opera, balett, oratórium, vagy más zenés színpadi mű. @hu
label: ha come librettista famiglia @it
definition: Correla un'opera a una famiglia autore delle parole di un musical o opera coreografica, come un'opera, balletto, o altra opera per il teatro musicale, o per un oratorio. @it
scope note: E' escluso essere autore delle parole delle sole canzoni di un musical. @it
toolkit label: librettista famiglia @it
toolkit definition: Famiglia autore delle parole di un musical o opera coreografica, come un'opera, balletto, o altra opera per il teatro musicale, o per un oratorio. @it
label: a pour famille librettiste @fr
definition: Met une œuvre en relation avec une famille autrice des paroles d’une œuvre musicale ou chorégraphique telle qu’un opéra, un ballet ou une autre œuvre pour la scène musicale, ou telle qu’un oratorio. @fr
scope note: Le fait d’être l’auteur uniquement des paroles des chansons d’une comédie musicale est exclu. @fr
toolkit label: famille librettiste @fr
toolkit definition: Famille autrice des paroles d’une œuvre musicale ou chorégraphique telle qu’un opéra, un ballet ou une autre œuvre pour la scène musicale, ou telle qu’un oratorio. @fr
label: libretists (dzimta/ģimene) @lv
definition: Sasaista darbu ar dzimtu/ģimeni, kas ir teksta autors mūzikas vai horeogrāfiskam darbam, piemēram, operai, baletam, citam muzikālam skatuves darbam vai oratorijai. @lv
toolkit label: libretists (dzimta/ģimene) @lv
toolkit definition: Dzimta/ģimene, kas ir teksta autors mūzikas vai horeogrāfiskam darbam, piemēram, operai, baletam, citam muzikālam skatuves darbam vai oratorijai. @lv
scope note: Neietver atsevišķu dziesmu tekstus mūziklos. @lv
label: 有台本作者家族 @zh-hans
definition: 将一种作品与作为歌剧、芭蕾等音乐或编舞作品或其他舞台音乐作品或者清唱剧的歌词的著者的一个家族关联起来。 @zh-hans
toolkit label: 台本作者家族 @zh-hans
toolkit definition: 作为歌剧、芭蕾等音乐或编舞作品或其他舞台音乐作品或者清唱剧的歌词的著者的一个家族 @zh-hans
scope note: 不包括音乐剧中只是歌曲的词著者。 @zh-hans
has subproperty: P10572
label: libretto yazarı ailesi ile ilişkilidir @tr
definition: Bir eseri, opera, bale veya müzikal sahne için başka bir eser veya oratoryo gibi müzikal veya koreografik bir eserin sözlerinin yazarı olan bir aileyle ilişkilendirir. @tr

has librettist person
status: Published
lexical alias: librettistPerson.en
definition: Relates a work to a person who is an author of the words of a musical or choreographic work such as an opera, a ballet, or other work for the musical stage, or an oratorio.
toolkit label: librettist person
toolkit definition: A person who is an author of the words of a musical or choreographic work such as an opera, a ballet, or other work for the musical stage, or an oratorio.
type: Property
domain: C10001
has element type: 2
sub property of: has author person
sub property of: has librettist agent
scope note: Authoring of the words of only the songs from a musical is excluded.
label: libretisti (henkilö) @fi
definition: Liittää teoksen henkilöön, joka on musiikki- tai koreografisen teoksen, kuten oopperan, baletin tai muun musiikillisen näyttämöteoksen tai oratorion sanojen kirjoittaja. @fi
scope note: Ei kata pelkkien musikaalilaulujen sanojen kirjoittajaa. @fi
toolkit label: libretisti (henkilö) @fi
toolkit definition: Henkilö, joka on musiikki- tai koreografisen teoksen, kuten oopperan, baletin tai muun musiikillisen näyttämöteoksen tai oratorion sanojen kirjoittaja. @fi
label: har librettist (person) @no
definition: Relaterer et verk til en person som er en forfatter av ordene i et musikalsk eller koreografisk verk som en opera, en ballett eller ennet verk for en musikalsk scene, eller et oratorium. @no
scope note: Det å kun skrive ordene til bare sangene fra en musikal, er ikke inkludert. @no
toolkit label: librettist (person) @no
toolkit definition: En person som er en forfatter av ordene i et musikalsk eller koreografisk verk som en opera, en ballett eller ennet verk for en musikalsk scene, eller et oratorium. @no
label: heeft librettist-persoon @nl
definition: Relateert een werk aan een persoon die een auteur is van de woorden van een muziek- of choreografisch werk zoals een opera, een ballet of ander muzikaal podiumwerk of een oratorium. @nl
scope note: Het schrijven van alleen de woorden van de liedjes uit een musical is uitgesloten. @nl
toolkit label: librettist-persoon @nl
toolkit definition: Een persoon die een auteur is van de woorden van een muziek- of choreografisch werk zoals een opera, een ballet of ander muzikaal podiumwerk of een oratorium. @nl
label: له شخص مؤلف أوبرالي @ar
definition: يربط بين عمل وشخص يكون مؤلف كلمات عمل موسيقي، أو راقص مثل الأوبرا أو الباليه، أو أي عمل آخر للمسرح الموسيقي، أو موسيقى دينية. @ar
scope note: يُستبعد تأليف كلمات الأغاني فقط من مسرحية موسيقية. @ar
toolkit label: شخص مؤلف أوبرالي @ar
toolkit definition: شخص يكون مؤلف كلمات عمل موسيقي، أو راقص مثل الأوبرا أو الباليه، أو أي عمل آخر للمسرح الموسيقي، أو موسيقى دينية. @ar
label: té com a persona llibretista @ca
definition: Relaciona una obra amb una persona que és un autor de les paraules d’una obra musical o coreogràfica com ara una òpera, un ballet o qualsevol altra obra escènica musical o d’un oratori. @ca
scope note: S’exclou l’autoria de només les paraules de les cançons d’un musical. @ca
toolkit label: persona llibretista @ca
toolkit definition: Persona que és un autor de les paraules d’una obra musical o coreogràfica com ara una òpera, un ballet o qualsevol altra obra escènica musical o d’un oratori. @ca
label: har person, som er librettist @da
definition: Relaterer et værk til en person, som er forfatter af teksten til et musikalsk- eller koreografisk værk, såsom en opera, en ballet eller andet værk til en musikalsk scene, eller et oratorium. @da
scope note: Forfatter til kun sangteksterne i en musical er ikke omfattet. @da
toolkit label: person, som er librettist @da
toolkit definition: Person, som er forfatter af teksten til et musikalsk- eller koreografisk værk, såsom en opera, en ballet eller andet værk til en musikalsk scene, eller et oratorium. @da
label: libretist (isik) @et
definition: Seostab teose isikuga, kes on muusikalise või koreograafilise lavateose (nt ooper, ballett) või oratooriumi sõnade autor. @et
scope note: Ei hõlma üksnes muusikali laulusõnade kirjutamist. @et
toolkit label: libretist (isik) @et
toolkit definition: Isik, kes on muusikalise või koreograafilise lavateose (nt ooper, ballett) või oratooriumi sõnade autor. @et
label: hat Librettistin/Librettisten (Person) @de
definition: Setzt ein Werk in Beziehung zu einer Verfasserin/einem Verfasser (Person) des Texts für ein Musical oder choreografisches Werk, wie zum Beispiel einer Oper, einem Ballett oder einem anderen Musikwerk für die Bühne, oder für ein Oratorium. @de
scope note: Nur das Verfassen der Liedtexte eines Musicals fällt nicht darunter. @de
toolkit label: Librettistin/Librettist (Person) @de
toolkit definition: Eine Verfasserin/Ein Verfasser (Person) des Texts für ein Musical oder choreografisches Werk, wie zum Beispiel einer Oper, einem Ballett oder einem anderen Musikwerk für die Bühne, oder für ein Oratorium. @de
label: librettista személye a következő: @hu
definition: Hozzákapcsol egy művet egy szerző személyhez, aki olyan zenei vagy koreografikus mű szövegét szerzi, mint egy opera, balett, oratórium, vagy más zenés színpadi mű. @hu
scope note: Musicaldalok szövegírója nem tartozik ide. @hu
toolkit label: librettista személy: @hu
toolkit definition: Egy szerző személy, aki olyan zenei vagy koreografikus mű szövegét szerzi, mint egy opera, balett, oratórium, vagy más zenés színpadi mű. @hu
label: ha come librettista persona @it
definition: Correla un'opera a una persona autore delle parole di un musical o un'opera coreografica, come un'opera, balletto o un'altra opera per il teatro musicale, o per un oratorio. @it
scope note: E' escluso essere autore delle parole delle sole canzoni di un musical. @it
toolkit label: librettista persona @it
toolkit definition: Persona autore delle parole di un musical o un'opera coreografica, come un'opera, un balletto o un'altra opera per il teatro musicale, o per un oratorio. @it
label: a pour personne librettiste @fr
definition: Met une œuvre en relation avec une personne autrice des paroles d’une œuvre musicale ou chorégraphique telle qu’un opéra, un ballet ou une autre œuvre pour la scène musicale, ou telle qu’un oratorio. @fr
scope note: Le fait d’être l’auteur uniquement des paroles des chansons d’une comédie musicale est exclu. @fr
toolkit label: personne librettiste @fr
toolkit definition: Personne autrice des paroles d’une œuvre musicale ou chorégraphique telle qu’un opéra, un ballet ou une autre œuvre pour la scène musicale, ou telle qu’un oratorio. @fr
label: libretists (persona) @lv
definition: Sasaista darbu ar personu, kura ir teksta autors mūzikas vai horeogrāfiskam darbam, piemēram, operai, baletam, citam muzikālam skatuves darbam vai oratorijai. @lv
toolkit label: libretists (persona) @lv
toolkit definition: Persona, kura ir teksta autors mūzikas vai horeogrāfiskam darbam, piemēram, operai, baletam, citam muzikālam skatuves darbam vai oratorijai. @lv
scope note: Neietver atsevišķu dziesmu tekstus mūziklos. @lv
label: 有台本作者个人 @zh-hans
definition: 将一种作品与作为歌剧、芭蕾等音乐或编舞作品或其他舞台音乐作品或者清唱剧的歌词的著者的一个个人关联起来。 @zh-hans
toolkit label: 台本作者个人 @zh-hans
toolkit definition: 作为歌剧、芭蕾等音乐或编舞作品或其他舞台音乐作品或者清唱剧的歌词的著者的一个个人 @zh-hans
scope note: 不包括音乐剧中只是歌曲的词著者。 @zh-hans
has subproperty: P10431
label: libretto yazarı kişisi ile ilişkilidir @tr
definition: Bir eseri, opera, bale veya müzikal sahnesi için başka bir eser veya oratoryo gibi müzikal veya koreografik bir eserin sözlerinin yazarı olan kişiyle ilişkilendirir @tr

has libretto work
status: Published
definition: Relates a work to a work that is a textual work that complements a work that is a musical or choreographic work such as an opera, a ballet, or other work for the musical stage, or an oratorio.
type: Property
domain: C10001
sub property of: has text work
lexical alias: librettoWork.en
toolkit label: libretto work
toolkit definition: A work that is a textual work that complements a work that is a musical or choreographic work such as an opera, a ballet, or other work for the musical stage, or an oratorio.
toolkit label: livret (œuvre) @fr
toolkit definition: Œuvre textuelle qui complète une œuvre musicale ou chorégraphique telle qu’un opéra, un ballet ou une autre œuvre pour la scène musicale, ou telle qu’un oratorio. @fr
toolkit label: libreto (obra) @es
toolkit definition: Una obra que proporciona el texto de una ópera u otra obra para representación musical, o un oratorio. @es
instruction number: 24.5
label: har librettoværk @da
definition: Relaterer et værk til et værk, som er et tekstværk, som komplementerer et værk, som er et musikalsk- eller koreografisk værk, som en opera, ballet eller andet værk til en musikalsk scene, eller et oratorium. @da
toolkit label: librettoværk @da
toolkit definition: Relaterer et værk til et værk, som er et tekstværk, som komplementerer et værk, som er et musikalsk- eller koreografisk værk, som en opera, ballet eller andet værk til en musikalsk scene, eller et oratorium. @da
definition: Met une œuvre en relation avec une œuvre textuelle qui complète une œuvre musicale ou chorégraphique telle qu’un opéra, un ballet ou une autre œuvre pour la scène musicale, ou telle qu’un oratorio. @fr
label: là lời nhạc kịch (tác phẩm) @vi
definition: Liên kết tác phẩm với tác phẩm cung cấp văn bản cho opera hoặc tác phẩm khác cho sân khấu âm nhạc, hoặc oratorio. @vi
toolkit label: lời nhạc kịch (tác phẩm) @vi
toolkit definition: Tác phẩm cung cấp văn bản cho opera hoặc tác phẩm khác cho sân khấu âm nhạc, hoặc oratorio. @vi
label: hat Libretto (Werk) @de
definition: Setzt ein Werk in Beziehung zu einem textlichen Werk, das ein Musikwerk oder ein choreografisches Werk, wie zum Beispiel eine Oper, ein Ballett oder ein anderes Werk für die Bühne, oder ein Oratorium ergänzt. @de
toolkit label: Libretto (Werk) @de
toolkit definition: Ein Werk, das ein Musikwerk oder ein choreografisches Werk, wie zum Beispiel eine Oper, ein Ballett oder ein anderes Werk für die Bühne, oder ein Oratorium ergänzt. @de
label: a pour livret (œuvre) @fr
definition: Liittää teoksen teokseen, joka on tekstiteos, joka täydentää teosta, joka on musiikki- tai koreografinen teos, kuten ooppera, baletti tai muu musiikillinen näyttämöteos tai oratorio. @fi
toolkit label: libretto (teos) @fi
toolkit definition: Teos, joka joka on tekstiteos, joka täydentää teosta, joka on musiikki- tai koreografinen teos, kuten ooppera, baletti tai muu musiikillinen näyttämöteos tai oratorio. @fi
toolkit label: libretto (verk) @no
toolkit definition: Et verk som er et tekstlig verk som utfyller et verk som er et musikalsk eller koreografisk verk som en opera, en ballett eller et annet verk for en musikalsk scene, eller et oratorium. @no
label: té com a obra de llibret @ca
definition: Relaciona una obra amb una obra que és una obra textual que complementa una obra que és una obra musical o coreogràfica com ara una opera, un ballet o qualsevol altra obra escènica musical o un oratori. @ca
toolkit label: obra de llibret @ca
toolkit definition: Obra que és una obra textual que complementa una obra que és una obra musical o coreogràfica com ara una opera, un ballet o qualsevol altra obra escènica musical o un oratori. @ca
has element type: 2
label: είναι λιμπρέτο (έργο) @el
definition: Συνδέει ένα έργο με ένα έργο το οποίο παρέχει το κείμενο μιας όπερας ή άλλο έργο για τη μουσική σκηνή ή ένα ορατόριο. @el
toolkit label: λιμπρέτο (έργο) @el
toolkit definition: Ένα έργο το οποίο παρέχει το κείμενο μιας όπερας ή άλλο έργο για τη μουσική σκηνή ή ένα ορατόριο. @el
label: librettóműve a következő: @hu
definition: Hozzákapcsol egy művett egy szöveges műhöz, amely kiegészíti egy olyan zene- vagy koreografikus művet, mint egy opera, balett, oratórium, vagy más zenés színpadi mű. @hu
toolkit label: librettómű @hu
toolkit definition: Egy szöveges mű, amely kiegészíti egy olyan zene- vagy koreografikus művet, mint egy opera, balett, oratórium, vagy más zenés színpadi mű. @hu
label: libretto (teos) @fi
label: har libretto (verk) @no
definition: Relaterer et verk til et verk som er et tekstlig verk som utfyller et verk som er et musikalsk eller koreografisk verk som en opera, en ballett eller et annet verk for en musikalsk scene, eller et oratorium. @no
label: heeft librettowerk @nl
definition: Relateert een werk aan een werk dat een tekstwerk is dat een werk complementeert dat een muziek- of choreografisch werk is zoals een opera, een ballet of ander muzikaal podiumwerk of een oratorium. @nl
toolkit label: librettowerk @nl
toolkit definition: Een werk dat een tekstwerk is dat een werk complementeert dat een muziek- of choreografisch werk is zoals een opera, een ballet of ander muzikaal podiumwerk of een oratorium. @nl
label: له عمل نص أوبرالي @ar
definition: يربط عمل بعمل عبارة عن عمل نصي يكمل عملاً موسيقيًا أو عملًا راقصًا مثل الأوبرا، أو الباليه، أو أي عمل آخر للمسرح الموسيقي أو لموسيقى دينية. @ar
toolkit label: عمل نص أوبرالي @ar
toolkit definition: عمل عبارة عن عمل نصي يكمل عملاً موسيقيًا، أو عملًا راقصًا مثل الأوبرا، أو الباليه، أو أي عمل آخر للمسرح الموسيقي أو لموسيقى دينية. @ar
label: libreto (teos) @et
definition: Seostab teose tekstteosega, mis täiendab muusikalist või koreograafilist lavateost (nt ooperit, balletti) või oratooriumit. @et
toolkit label: libreto (teos) @et
toolkit definition: Tekstteos, mis täiendab muusikalist või koreograafilist lavateost (nt ooperit, balletti) või oratooriumit. @et
label: ha libretto opera @it
definition: Correla un’opera a un’opera testuale che completa un’opera musicale o coreografica come un’opera, balletto o altra opera per il teatro musicale, o un oratorio. @it
toolkit label: libretto opera @it
toolkit definition: Opera testuale che completa un’opera musicale o coreografica come un’opera, balletto o altra opera per il teatro musicale, o un oratorio. @it
label: darbs: librets @lv
definition: Sasaista darbu ar darbu, kas ir realizēts kā teksts, kas papildina darbu, kas ir opera vai cits mūzikas darbs skatuvei vai oratorija. @lv
toolkit label: darbs: librets @lv
toolkit definition: Darbs, kas ir realizēts kā teksts, kas papildina darbu, kas ir opera vai cits mūzikas darbs skatuvei vai oratorija. @lv
label: 有台本作品 @zh-hans
definition: 将一种作品与补充诸如歌剧、芭蕾或其他舞台音乐作品或清唱剧之类的作为一种音乐或编舞作品的一种作品的作为一种文字作品的一种作品关联起来。 @zh-hans
toolkit label: 台本作品 @zh-hans
toolkit definition: 补充诸如歌剧、芭蕾或其他舞台音乐作品或清唱剧之类的作为一种音乐或编舞作品的一种作品的作为一种文字作品的一种作品 @zh-hans
has subproperty: P10165
label: libretto eseri ile ilişkilidir @tr
definition: Bir eseri, opera, bale veya müzik sahnesi için başka bir eser veya oratoryo gibi müzikal veya koreografik bir eseri tamamlayan metinsel bir eser olan bir eserle ilişkilendirir. @tr
toolkit label: opera metni çalışması @tr
toolkit definition: Opera, bale veya müzikal sahne için başka bir eser veya oratoryo gibi müzikal veya koreografik bir çalışmayı tamamlayan metinsel bir eser olan çalışma. @tr

has lyricist agent
status: Published
definition: Relates a work to an agent who is an author of the words of a popular song, including a song from a musical.
type: Property
domain: C10001
sub property of: has author agent
lexical alias: lyricistAgent.en
toolkit label: lyricist agent
toolkit definition: An agent who is an author of the words of a popular song, including a song from a musical.
toolkit label: agent parolier @fr
toolkit definition: Agent auteur des paroles d’une chanson populaire, y compris une chanson d’une comédie musicale. @fr
toolkit label: letrista @es
toolkit definition: Un autor de las palabras de una obra canción popular, incluyendo una canción o canciones de un musical. @es
scope note: Authoring of only the dialogue from a musical is excluded.
see also: has librettist agent
instruction number: 18.5
label: har agent, som er tekstforfatter @da
definition: Relaterer et værk til en agent, som er forfatter til sangteksten til en populær sang, inklusiv en sang fra en musical. @da
scope note: Forfatter til kun dialogen i en musical er ikke omfattet. @da
toolkit label: agent, som er tekstforfatter @da
toolkit definition: Agent, som er forfatter til sangteksten til en populær sang, inklusiv en sang fra en musical. @da
definition: Met une œuvre en relation avec un agent auteur des paroles d’une chanson populaire, y compris une chanson d’une comédie musicale. @fr
label: có nhà thơ trữ tình @vi
definition: Liên kết tác phẩm với tác giả của lời của bài hát bình dân, bao gồm cả bài hát hoặc các bài hát từ âm nhạc. @vi
scope note: Tác giả của chỉ phần hội thoại từ âm nhạc, không được bao gồm. @vi
toolkit label: nhà thơ trữ tình @vi
toolkit definition: Tác giả của lời của bài hát bình dân, bao gồm cả bài hát hoặc các bài hát từ âm nhạc. @vi
label: hat Textdichterin/Textdichter (Akteur) @de
definition: Setzt ein Werk in Beziehung zu einer Verfasserin/einem Verfasser (Akteur) des Texts eines populären Lieds, einschließlich eines Lieds aus einem Musical. @de
scope note: Nur das Verfassen des Dialogs eines Musicals fällt nicht darunter. @de
toolkit label: Textdichterin/Textdichter (Akteur) @de
toolkit definition: Eine Verfasserin/Ein Verfasser (Akteur) des Texts eines populären Lieds, einschließlich eines Lieds aus einem Musical. @de
label: a pour agent parolier @fr
definition: Liittää teoksen toimijaan, joka on populaarimusiikkiin kuuluvan laulun, mukaan lukien musikaalilaulun, sanojen kirjoittaja. @fi
toolkit label: sanoittaja (toimija) @fi
toolkit definition: Toimija, joka on populaarimusiikkiin kuuluvan laulun, mukaan lukien musikaalilaulun, sanojen kirjoittaja. @fi
toolkit label: sangtekstforfatter (agent) @no
toolkit definition: En agent som er en forfatter av teksten til en populær sang, inkludert én eller flere sanger fra en musikal. @no
label: té com a agent lletrista @ca
definition: Relaciona una obra amb un agent que és un autor de les paraules d’una cançó popular, inclosa una cançó d’un musical. @ca
scope note: S’exclou l’autoria de només el diàleg d’un musical. @ca
toolkit label: agent lletrista @ca
toolkit definition: Agent que és un autor de les paraules d’una cançó popular, inclosa una cançó d’un musical. @ca
scope note: Le fait d’être l’auteur uniquement des dialogues d’une comédie musicale est exclu. @fr
has element type: 2
label: έχει στιχουργό @el
definition: Συνδέει ένα έργο με έναν συγγραφέα των στίχων ενός δημοφιλούς τραγουδιού, περιλαμβανομένων του τραγουδιού ή των τραγουδιών ενός μιούζικαλ. @el
scope note: Δεν περιλαμβάνεται η συγγραφή μόνο του διαλόγου ενός musical. @el
toolkit label: στιχουργός @el
toolkit definition: Ένας συγγραφέας των στίχων ενός δημοφιλούς τραγουδιού, περιλαμβανομένων του τραγουδιού ή των τραγουδιών ενός μιούζικαλ. @el
label: dalszövegíró ágense a következő: @hu
definition: Hozzákapcsol egy művet egy ágenshez, amely egy könnyűzenei dal szövegének szerzője, beleértve a musicaldalokat is. @hu
scope note: dalszövegíró: @hu
toolkit label: dalszövegíró ágens: @hu
toolkit definition: Egy ágens, amely egy könnyűzenei dal szövegének szerzője, beleértve a musicaldalokat is. @hu
alternative label: lyricist
scope note: Ei kata pelkän musikaalin dialogin kirjoittajaa. @fi
alternative label: sanoittaja @fi
label: sanoittaja (toimija) @fi
label: har sangtekstforfatter (agent) @no
definition: Relaterer et verk til en agent som er en forfatter av teksten til en populær sang, inkludert én eller flere sanger fra en musikal. @no
scope note: Det å bare skrive dialogen fra en musikal, er ikke inkludert. @no
label: heeft liedtekstschrijver-actor @nl
definition: Relateert een werk aan een actor die een auteur is van de woorden van een populair lied, inclusief een lied uit een musical. @nl
scope note: Het schrijven van alleen de dialogen uit een musical is uitgesloten. @nl
toolkit label: liedtekstschrijver-actor @nl
toolkit definition: Een actor die een auteur is van de woorden van een populair lied, inclusief een lied uit een musical. @nl
label: له وكيل مؤلف أغاني @ar
definition: يربط بين عمل ووكيل يكون مؤلف كلمات أغنية شعبية، بما في ذلك أغنية من مسرحية موسيقية. @ar
scope note: يُستبعد تأليف الحوار فقط من مسرحية موسيقية. @ar
alternative label: مؤلف أغاني @ar
toolkit label: وكيل مؤلف أغاني @ar
toolkit definition: وكيل يكون مؤلف كلمات أغنية شعبية، بما في ذلك أغنية من مسرحية موسيقية. @ar
alternative label: lletrista @ca
alternative label: tekstforfatter @da
label: sõnade autor (tegija) @et
definition: Seostab teose tegijaga, kes on levilaulu (k.a laul muusikalist) sõnade autor. @et
scope note: Ei hõlma üksnes muusikali dialoogide kirjutamist. @et
alternative label: sõnade autor @et
toolkit label: sõnade autor (tegija) @et

has lyricist collective agent
status: Published
lexical alias: lyricistCollectiveAgent.en
definition: Relates a work to a collective agent who is an author of the words of a popular song, including a song from a musical.
toolkit label: lyricist collective agent
toolkit definition: A collective agent who is an author of the words of a popular song, including a song from a musical.
type: Property
domain: C10001
has element type: 2
sub property of: has author collective agent
sub property of: has lyricist agent
scope note: Authoring of only the dialogue from a musical is excluded.
label: sanoittaja (yhteistoimija) @fi
definition: Liittää teoksen yhteistoimijaan, joka on populaarimusiikkiin kuuluvan laulun, mukaan lukien musikaalilaulun, sanojen kirjoittaja. @fi
scope note: Ei kata pelkän musikaalin dialogin kirjoittajaa. @fi
toolkit label: sanoittaja (yhteistoimija) @fi
toolkit definition: Yhteistoimija, joka on populaarimusiikkiin kuuluvan laulun, mukaan lukien musikaalilaulun, sanojen kirjoittaja. @fi
label: har sangtekstforfatter (kollektiv agent) @no
definition: Relaterer et verk til en kollektiv agent som er en forfatter av teksten til en populær sang, inkludert én eller flere sanger fra en musikal. @no
scope note: Det å bare skrive dialogen fra en musikal, er ikke inkludert. @no
toolkit label: sangtekstforfatter (kollektiv agent) @no
toolkit definition: En kollektiv agent som er en forfatter av teksten til en populær sang, inkludert én eller flere sanger fra en musikal. @no
label: heeft liedtekstschrijver-collectieve actor @nl
definition: Relateert een werk aan een collectieve actor die een auteur is van de woorden van een populair lied, inclusief een lied uit een musical. @nl
scope note: Het schrijven van alleen de dialogen uit een musical is uitgesloten. @nl
toolkit label: liedtekstschrijver-collectieve actor @nl
toolkit definition: Een collectieve actor die een auteur is van de woorden van een populair lied, inclusief een lied uit een musical. @nl
label: له وكيل جماعي مؤلف أغاني @ar
definition: يربط بين عمل ووكيل جماعي يكون مؤلف كلمات أغنية شعبية، بما في ذلك أغنية من مسرحية موسيقية. @ar
scope note: يُستبعد تأليف الحوار فقط من مسرحية موسيقية. @ar
toolkit label: وكيل جماعي مؤلف أغاني @ar
toolkit definition: وكيل جماعي يكون مؤلف كلمات أغنية شعبية، بما في ذلك أغنية من مسرحية موسيقية. @ar
label: té com a agent col·lectiu lletrista @ca
definition: Relaciona una obra amb un agent col·lectiu que és un autor de les paraules d’una cançó popular, inclosa una cançó d’un musical. @ca
scope note: S’exclou l’autoria de només el diàleg d’un musical. @ca
toolkit label: agent col·lectiu lletrista @ca
toolkit definition: Agent col·lectiu que és un autor de les paraules d’una cançó popular, inclosa una cançó d’un musical. @ca
label: har kollektiv agent, som er tekstforfatter @da
definition: Relaterer et værk til en kollektiv agent, som er forfatter til sangteksten til en populær sang, inklusiv en sang fra en musical. @da
scope note: Forfatter til kun dialogen i en musical er ikke omfattet. @da
toolkit label: kollektiv agent, som er tekstforfatter @da
toolkit definition: Kollektiv agent, som er forfatter til sangteksten til en populær sang, inklusiv en sang fra en musical. @da
label: sõnade autor (kollektiiv) @et
definition: Seostab teose kollektiiviga, kes on levilaulu (k.a laul muusikalist) sõnade autor. @et
scope note: Ei hõlma üksnes muusikali dialoogide kirjutamist. @et
toolkit label: sõnade autor (kollektiiv) @et
toolkit definition: Kollektiiv, kes on levilaulu (k.a laul muusikalist) sõnade autor. @et
label: hat Textdichterin/Textdichter (Gemeinschaftlicher Akteur) @de
definition: Setzt ein Werk in Beziehung zu einer Verfasserin/einem Verfasser (Gemeinschaftlicher Akteur) des Texts eines populären Lieds, einschließlich eines Lieds aus einem Musical. @de
scope note: Nur das Verfassen des Dialogs eines Musicals fällt nicht darunter. @de
toolkit label: Textdichterin/Textdichter (Gemeinschaftlicher Akteur) @de
toolkit definition: Eine Verfasserin/Ein Verfasser (Gemeinschaftlicher Akteur) des Texts eines populären Lieds, einschließlich eines Lieds aus einem Musical. @de
label: dalszövegíró kollektív ágense a következő: @hu
definition: Hozzákapcsol egy művet egy kollektív ágenshez, amely egy könnyűzenei dal szövegének szerzője, beleértve a musicaldalokat is. @hu
scope note: Musical párbeszédeinek szerzősége nem tartozik ide. @hu
toolkit label: dalszövegíró kollektív ágens: @hu
toolkit definition: Egy kollektív ágens, amely egy könnyűzenei dal szövegének szerzője, beleértve a musicaldalokat is. @hu
label: ha come paroliere agente collettivo @it
definition: Correla un'opera a un agente collettivo autore delle parole di una canzone pop, inclusa una canzone di un musical. @it
scope note: E' escluso essere autore dei soli dialoghi di un musical. @it
toolkit label: paroliere agente collettivo @it
toolkit definition: Agente collettivo autore delle parole di una canzone pop, inclusa una canzone di un musical. @it
label: a pour agent collectif parolier @fr
definition: Met une œuvre en relation avec un agent collectif auteur des paroles d’une chanson populaire, y compris une chanson d’une comédie musicale. @fr
scope note: Le fait d’être l’auteur uniquement des dialogues d’une comédie musicale est exclu. @fr
toolkit label: agent collectif parolier @fr
toolkit definition: Agent collectif auteur des paroles d’une chanson populaire, y compris une chanson d’une comédie musicale. @fr
label: dziesmas teksta autors (grupa) @lv
definition: Sasaista darbu ar grupu, kas ir dziesmas vārdu autors, ieskaitot dziesmas no mūzikla. @lv
toolkit label: dziesmas teksta autors (grupa) @lv
toolkit definition: Grupa, kas ir dziesmas vārdu autors, ieskaitot dziesmas no mūzikla. @lv
scope note: Neietver mūzikla dialogus. @lv
label: 有作词者集体行为者 @zh-hans
definition: 将一种作品与作为一首流行歌曲（包括音乐剧中的歌曲）歌词的著者的一个集体行为者关联起来。 @zh-hans
toolkit label: 作词者集体行为者 @zh-hans
toolkit definition: 作为一首流行歌曲（包括音乐剧中的歌曲）歌词的著者的一个集体行为者 @zh-hans
scope note: 不包括音乐剧中只是对话的著者。 @zh-hans
has subproperty: has lyricist corporate body
has subproperty: has lyricist family
has subproperty: P10477

has lyricist corporate body
status: Published
lexical alias: lyricistCorporateBody.en
definition: Relates a work to a corporate body who is an author of the words of a popular song, including a song from a musical.
toolkit label: lyricist corporate body
toolkit definition: A corporate body who is an author of the words of a popular song, including a song from a musical.
type: Property
domain: C10001
has element type: 2
sub property of: has author corporate body
sub property of: has lyricist collective agent
scope note: Authoring of only the dialogue from a musical is excluded.
label: sanoittaja (yhteisö) @fi
definition: Liittää teoksen yhteisöön, joka on populaarimusiikkiin kuuluvan laulun, mukaan lukien musikaalilaulun, sanojen kirjoittaja. @fi
scope note: Ei kata pelkän musikaalin dialogin kirjoittajaa. @fi
toolkit label: sanoittaja (yhteisö) @fi
toolkit definition: Yhteisö, joka on populaarimusiikkiin kuuluvan laulun, mukaan lukien musikaalilaulun, sanojen kirjoittaja. @fi
label: har sangtekstforfatter (korporasjon) @no
definition: Relaterer et verk til en korporasjon som er en forfatter av teksten til en populær sang, inkludert én eller flere sanger fra en musikal. @no
scope note: Det å bare skrive dialogen fra en musikal, er ikke inkludert. @no
toolkit label: sangtekstforfatter (korporasjon) @no
toolkit definition: En korporasjon som er en forfatter av teksten til en populær sang, inkludert én eller flere sanger fra en musikal. @no
label: heeft liedtekstschrijver-corporatie @nl
definition: Relateert een werk aan een corporatie die een auteur is van de woorden van een populair lied, inclusief een lied uit een musical. @nl
scope note: Het schrijven van alleen de dialogen uit een musical is uitgesloten. @nl
toolkit label: liedtekstschrijver-corporatie @nl
toolkit definition: Een corporatie die een auteur is van de woorden van een populair lied, inclusief een lied uit een musical. @nl
label: له هيئة مؤلفة أغاني @ar
definition: يربط بين عمل وهيئة تكون مؤلفة لكلمات أغنية مشهورة، بما في ذلك أغنية من مسرحية موسيقية. @ar
scope note: يُستبعد تأليف الحوار فقط من مسرحية موسيقية. @ar
toolkit label: هيئة مؤلفة أغاني @ar
toolkit definition: هيئة تكون مؤلفة لكلمات أغنية مشهورة، بما في ذلك أغنية من مسرحية موسيقية. @ar
label: té com a entitat corporativa lletrista @ca
definition: Relaciona una obra amb una entitat corporativa que és un autor de les paraules d’una cançó popular, inclosa una cançó d’un musical. @ca
scope note: S’exclou l’autoria de només el diàleg d’un musical. @ca
toolkit label: entitat corporativa lletrista @ca
toolkit definition: Entitat corporativa que és un autor de les paraules d’una cançó popular, inclosa una cançó d’un musical. @ca
label: har korporation, som er tekstforfatter @da
definition: Relaterer et værk til en korporation, som er forfatter til sangteksten til en populær sang, inklusiv en sang fra en musical. @da
scope note: Forfatter til kun dialogen i en musical er ikke omfattet. @da
toolkit label: korporation, som er tekstforfatter @da
toolkit definition: Korporation, som er forfatter til sangteksten til en populær sang, inklusiv en sang fra en musical. @da
label: sõnade autor (asutus) @et
definition: Seostab teose asutusega, kes on levilaulu (k.a laul muusikalist) sõnade autor. @et
scope note: Ei hõlma üksnes muusikali dialoogide kirjutamist. @et
toolkit label: sõnade autor (asutus) @et
toolkit definition: Asutus, kes on levilaulu (k.a laul muusikalist) sõnade autor. @et
label: hat Textdichterin/Textdichter (Körperschaft) @de
definition: Setzt ein Werk in Beziehung zu einer Verfasserin/einem Verfasser (Körperschaft) des Texts eines populären Lieds, einschließlich eines Lieds aus einem Musical. @de
scope note: Nur das Verfassen des Dialogs eines Musicals fällt nicht darunter. @de
toolkit label: Textdichterin/Textdichter (Körperschaft) @de
toolkit definition: Eine Verfasserin/Ein Verfasser (Körperschaft) des Texts eines populären Lieds, einschließlich eines Lieds aus einem Musical. @de
label: dalszövegíró testülete a következő: @hu
definition: Hozzákapcsol egy művet egy testülethez, amely egy könnyűzenei dal szövegének szerzője, beleértve a musicaldalokat is. @hu
scope note: Musical párbeszédeinek szerzősége nem tartozik ide. @hu
toolkit label: dalszövegíró testület: @hu
toolkit definition: Egy testület, amely egy könnyűzenei dal szövegének szerzője, beleértve a musicaldalokat is. @hu
label: ha come paroliere ente @it
definition: Correla un'opera a un ente autore delle parole di una canzone pop, inclusa una canzone di un musical. @it
scope note: E' escluso essere autore dei soli dialoghi di un musical. @it
toolkit label: paroliere ente @it
toolkit definition: Ente autore delle parole di una canzone pop, inclusa una canzone di un musical. @it
label: a pour collectivité parolière @fr
definition: Met une œuvre en relation avec une collectivité autrice des paroles d’une chanson populaire, y compris une chanson d’une comédie musicale. @fr
scope note: Le fait d’être l’auteur uniquement des dialogues d’une comédie musicale est exclu. @fr
toolkit label: collectivité parolière @fr
toolkit definition: Collectivité autrice des paroles d’une chanson populaire, y compris une chanson d’une comédie musicale. @fr
label: dziesmas teksta autors (institūcija) @lv
definition: Sasaista darbu ar institūciju, kas ir dziesmas vārdu autors, ieskaitot dziesmas no mūzikla. @lv
toolkit label: dziesmas teksta autors (institūcija) @lv
toolkit definition: Institūcija, kas ir dziesmas vārdu autors, ieskaitot dziesmas no mūzikla. @lv
scope note: Neietver mūzikla dialogus. @lv
label: 有作词者团体 @zh-hans
definition: 将一种作品与作为一首流行歌曲（包括音乐剧中的歌曲）歌词的著者的一个团体关联起来。 @zh-hans
toolkit label: 作词者团体 @zh-hans
toolkit definition: 作为一首流行歌曲（包括音乐剧中的歌曲）歌词的著者的一个团体 @zh-hans
scope note: 不包括音乐剧中只是对话的著者。 @zh-hans
has subproperty: P10524
label: söz yazarı tüzel kişisi ile ilişkilidir @tr
definition: Bir eseri, bir müzikalden bir şarkı dahil olmak üzere popüler bir şarkının sözlerinin yazarı olan tüzel kişi ile ilişkilendirir. @tr

has lyricist family
status: Published
lexical alias: lyricistFamily.en
definition: Relates a work to a family who is an author of the words of a popular song, including a song from a musical.
toolkit label: lyricist family
toolkit definition: A family who is an author of the words of a popular song, including a song from a musical.
type: Property
domain: C10001
has element type: 2
sub property of: has author family
sub property of: has lyricist collective agent
scope note: Authoring of only the dialogue from a musical is excluded.
label: sanoittaja (suku) @fi
definition: Liittää teoksen sukuun, joka on populaarimusiikkiin kuuluvan laulun, mukaan lukien musikaalilaulun, sanojen kirjoittaja. @fi
scope note: Ei kata pelkän musikaalin dialogin kirjoittajaa. @fi
toolkit label: sanoittaja (suku) @fi
toolkit definition: Suku, joka on populaarimusiikkiin kuuluvan laulun, mukaan lukien musikaalilaulun, sanojen kirjoittaja. @fi
label: har sangtekstforfatter (familie) @no
definition: Relaterer et verk til en familie som er en forfatter av teksten til en populær sang, inkludert én eller flere sanger fra en musikal. @no
scope note: Det å bare skrive dialogen fra en musikal, er ikke inkludert. @no
toolkit label: sangtekstforfatter (familie) @no
toolkit definition: En familie som er en forfatter av teksten til en populær sang, inkludert én eller flere sanger fra en musikal. @no
label: heeft liedtekstschrijver-familie @nl
definition: Relateert een werk aan een familie die een auteur is van de woorden van een populair lied, inclusief een lied uit een musical. @nl
scope note: Het schrijven van alleen de dialogen uit een musical is uitgesloten. @nl
toolkit label: liedtekstschrijver-familie @nl
toolkit definition: Een familie die een auteur is van de woorden van een populair lied, inclusief een lied uit een musical. @nl
label: له عائلة مؤلفة أغاني @ar
definition: يربط بين عمل وعائلة تكون مؤلفة كلمات أغنية مشهورة، بما في ذلك أغنية من مسرحية موسيقية. @ar
scope note: يُستبعد تأليف الحوار فقط من مسرحية موسيقية. @ar
toolkit label: عائلة مؤلفة أغاني @ar
toolkit definition: عائلة تكون مؤلفة كلمات أغنية مشهورة، بما في ذلك أغنية من مسرحية موسيقية. @ar
label: té com a família lletrista @ca
definition: Relaciona una obra amb una família que és un autor de les paraules d’una cançó popular, inclosa una cançó d’un musical. @ca
scope note: S’exclou l’autoria de només el diàleg d’un musical. @ca
toolkit label: família lletrista @ca
toolkit definition: Família que és un autor de les paraules d’una cançó popular, inclosa una cançó d’un musical. @ca
label: har familie, som er tekstforfatter @da
definition: Relaterer et værk til en familie, som er forfatter til sangteksten til en populær sang, inklusiv en sang fra en musical. @da
scope note: Forfatter til kun dialogen i en musical er ikke omfattet. @da
toolkit label: familie, som er tekstforfatter @da
toolkit definition: Familie, som er forfatter til sangteksten til en populær sang, inklusiv en sang fra en musical. @da
label: sõnade autor (perekond) @et
definition: Seostab teose perekonnaga, kes on levilaulu (k.a laul muusikalist) sõnade autor. @et
scope note: Ei hõlma üksnes muusikali dialoogide kirjutamist. @et
toolkit label: sõnade autor (perekond) @et
toolkit definition: Perekond, kes on levilaulu (k.a laul muusikalist) sõnade autor. @et
label: hat Textdichterin/Textdichter (Familie) @de
definition: Setzt ein Werk in Beziehung zu einer Verfasserin/einem Verfasser (Familie) des Texts eines populären Lieds, einschließlich eines Lieds aus einem Musical. @de
scope note: Nur das Verfassen des Dialogs eines Musicals fällt nicht darunter. @de
toolkit label: Textdichterin/Textdichter (Familie) @de
toolkit definition: Eine Verfasserin/Ein Verfasser (Familie) des Texts eines populären Lieds, einschließlich eines Lieds aus einem Musical. @de
label: dalszövegíró családja a következő: @hu
definition: Hozzákapcsol egy művet egy családhoz, amely egy könnyűzenei dal szövegének szerzője, beleértve a musicaldalokat is. @hu
scope note: Musical párbeszédeinek szerzősége nem tartozik ide. @hu
toolkit label: dalszövegíró család: @hu
toolkit definition: Egy család, amely egy könnyűzenei dal szövegének szerzője, beleértve a musicaldalokat is. @hu
label: ha come paroliere famiglia @it
definition: Correla un'opera a una famiglia autore delle parole di una canzone pop, inclusa una canzone di un musical. @it
scope note: E' escluso essere autore dei soli dialoghi di un musical. @it
toolkit label: paroliere famiglia @it
toolkit definition: Famiglia autore delle parole di una canzone pop, inclusa una canzone di un musical. @it
label: a pour famille parolière @fr
definition: Met une œuvre en relation avec une famille autrice auteur des paroles d’une chanson populaire, y compris une chanson d’une comédie musicale. @fr
scope note: Le fait d’être l’auteur uniquement des dialogues d’une comédie musicale est exclu. @fr
toolkit label: famille parolière @fr
toolkit definition: Famille autrice auteur des paroles d’une chanson populaire, y compris une chanson d’une comédie musicale. @fr
label: dziesmas teksta autors (dzimta/ģimene) @lv
definition: Sasaista darbu ar dzimtu/ģimeni, kas ir dziesmas vārdu autors, ieskaitot dziesmas no mūzikla. @lv
toolkit label: dziesmas teksta autors (dzimta/ģimene) @lv
toolkit definition: Dzimta/ģimene, kas ir dziesmas vārdu autors, ieskaitot dziesmas no mūzikla. @lv
scope note: Neietver mūzikla dialogus. @lv
label: 有作词者家族 @zh-hans
definition: 将一种作品与作为一首流行歌曲（包括音乐剧中的歌曲）歌词的著者的一个家族关联起来。 @zh-hans
toolkit label: 作词者家族 @zh-hans
toolkit definition: 作为一首流行歌曲（包括音乐剧中的歌曲）歌词的著者的一个家族 @zh-hans
scope note: 不包括音乐剧中只是对话的著者。 @zh-hans
has subproperty: P10571
label: söz yazarı ailesi ile ilişkilidir @tr
definition: Bir eseri, bir müzikalden bir şarkı da dahil olmak üzere popüler bir şarkının sözlerinin yazarı olan bir aileyle ilişkilendirir. @tr

has lyricist person
status: Published
lexical alias: lyricistPerson.en
definition: Relates a work to a person who is an author of the words of a popular song, including a song from a musical.
toolkit label: lyricist person
toolkit definition: A person who is an author of the words of a popular song, including a song from a musical.
type: Property
domain: C10001
has element type: 2
sub property of: has author person
sub property of: has lyricist agent
scope note: Authoring of only the dialogue from a musical is excluded.
label: sanoittaja (henkilö) @fi
definition: Liittää teoksen henkilöön, joka on populaarimusiikkiin kuuluvan laulun, mukaan lukien musikaalilaulun, sanojen kirjoittaja. @fi
scope note: Ei kata pelkän musikaalin dialogin kirjoittajaa. @fi
toolkit label: sanoittaja (henkilö) @fi
toolkit definition: Henkilö, joka on populaarimusiikkiin kuuluvan laulun, mukaan lukien musikaalilaulun, sanojen kirjoittaja. @fi
label: har sangtekstforfatter (person) @no
definition: Relaterer et verk til en person som er en forfatter av teksten til en populær sang, inkludert én eller flere sanger fra en musikal. @no
scope note: Det å bare skrive dialogen fra en musikal, er ikke inkludert. @no
toolkit label: sangtekstforfatter (person) @no
toolkit definition: En person som er en forfatter av teksten til en populær sang, inkludert én eller flere sanger fra en musikal. @no
label: heeft liedtekstschrijver-persoon @nl
definition: Relateert een werk aan een persoon die een auteur is van de woorden van een populair lied, inclusief een lied uit een musical. @nl
scope note: Het schrijven van alleen de dialogen uit een musical is uitgesloten. @nl
toolkit label: liedtekstschrijver-persoon @nl
toolkit definition: Een persoon die een auteur is van de woorden van een populair lied, inclusief een lied uit een musical. @nl
label: له شخص مؤلف أغاني @ar
definition: يربط بين عمل وشخص يكون مؤلف كلمات أغنية مشهورة، بما في ذلك أغنية من مسرحية موسيقية. @ar
scope note: يُستبعد تأليف الحوار فقط من مسرحية موسيقية. @ar
toolkit label: شخص مؤلف أغاني @ar
toolkit definition: شخص يكون مؤلف كلمات أغنية مشهورة، بما في ذلك أغنية من مسرحية موسيقية. @ar
label: té com a persona lletrista @ca
definition: Relaciona una obra amb una persona que és un autor de les paraules d’una cançó popular, inclosa una cançó d’un musical. @ca
scope note: S’exclou l’autoria de només el diàleg d’un musical. @ca
toolkit label: persona lletrista @ca
toolkit definition: Persona que és un autor de les paraules d’una cançó popular, inclosa una cançó d’un musical. @ca
label: har person, som er tekstforfatter @da
definition: Relaterer et værk til en person, som er forfatter til sangteksten til en populær sang, inklusiv en sang fra en musical. @da
scope note: Forfatter til kun dialogen i en musical er ikke omfattet. @da
toolkit label: person, som er tekstforfatter @da
toolkit definition: Person, som er forfatter til sangteksten til en populær sang, inklusiv en sang fra en musical. @da
label: sõnade autor (isik) @et
definition: Seostab teose isikuga, kes on levilaulu (k.a laul muusikalist) sõnade autor. @et
scope note: Ei hõlma üksnes muusikali dialoogide kirjutamist. @et
toolkit label: sõnade autor (isik) @et
toolkit definition: Isik, kes on levilaulu (k.a laul muusikalist) sõnade autor. @et
label: hat Textdichterin/Textdichter (Person) @de
definition: Setzt ein Werk in Beziehung zu einer Verfasserin/einem Verfasser (Person) des Texts eines populären Lieds, einschließlich eines Lieds aus einem Musical. @de
scope note: Nur das Verfassen des Dialogs eines Musicals fällt nicht darunter. @de
toolkit label: Textdichterin/Textdichter (Person) @de
toolkit definition: Eine Verfasserin/Ein Verfasser (Person) des Texts eines populären Lieds, einschließlich eines Lieds aus einem Musical. @de
label: dalszövegíró személye a következő: @hu
definition: Hozzákapcsol egy művet egy személyhez, aki egy könnyűzenei dal szövegének szerzője, beleértve a musicaldalokat is. @hu
scope note: Musical párbeszédeinek szerzősége nem tartozik ide. @hu
toolkit label: dalszövegíró személy: @hu
toolkit definition: Egy személy, aki egy könnyűzenei dal szövegének szerzője, beleértve a musicaldalokat is. @hu
label: ha come paroliere persona @it
definition: Correla un'opera a una persona autore delle parole di una canzone pop, inclusa una canzone di un musical. @it
scope note: E' escluso essere autore dei soli dialoghi di un musical. @it
toolkit label: paroliere persona @it
toolkit definition: Persona autore delle parole di una canzone pop, inclusa una canzone di un musical. @it
label: a pour personne parolière @fr
definition: Met une œuvre en relation avec une personne autrice des paroles d’une chanson populaire, y compris une chanson d’une comédie musicale. @fr
scope note: Le fait d’être l’auteur uniquement des dialogues d’une comédie musicale est exclu. @fr
toolkit label: personne parolière @fr
toolkit definition: Personne autrice des paroles d’une chanson populaire, y compris une chanson d’une comédie musicale. @fr
label: dziesmas teksta autors (persona) @lv
definition: Sasaista darbu ar personu, kura ir dziesmas vārdu autors, ieskaitot dziesmas no mūzikla. @lv
toolkit label: dziesmas teksta autors (persona) @lv
toolkit definition: Persona, kura ir dziesmas vārdu autors, ieskaitot dziesmas no mūzikla. @lv
scope note: Neietver mūzikla dialogus. @lv
label: 有作词者个人 @zh-hans
definition: 将一种作品与作为一首流行歌曲（包括音乐剧中的歌曲）歌词的著者的一个个人关联起来。 @zh-hans
toolkit label: 作词者个人 @zh-hans
toolkit definition: 作为一首流行歌曲（包括音乐剧中的歌曲）歌词的著者的一个个人 @zh-hans
scope note: 不包括音乐剧中只是对话的著者。 @zh-hans
has subproperty: P10430
label: söz yazarı kişisi ile ilişkilidir @tr
definition: Bir eseri, bir müzikalin şarkısı da dahil olmak üzere popüler bir şarkının sözlerinin yazarı olan kişiyle ilişkilendirir. @tr

is lyrics for work
status: Published
lexical alias: lyricsForWork.en
toolkit label: lyrics for work
type: Property
domain: C10001
sub property of: is text for work
has element type: 2
definition: Relates a work to a work that is a musical work that is complemented by a textual work.
scope note: Lyrics exclude text for an opera or other work for the musical stage, or an oratorio,
toolkit definition: A work that is a musical work that is complemented by a textual work.
label: sanoitus teokseen @fi
definition: Liittää teoksen musiikkiteokseen, jota tekstiteos täydentää. @fi
scope note: Sanoitus ei kata oopperan tai muun musiikillisen näyttämöteoksen tai oratorion tekstiä. @fi
toolkit label: sanoitus teokseen @fi
toolkit definition: Musiikkiteos, jota tekstiteos täydentää. @fi
label: har sangtekst for verk @no
definition: Relaterer et verk til et musikalsk verk som utfylles av et tekstlig verk. @no
scope note: Tekst for en opera eller et annet verk for en muskalsk scene eller et oratorium er ikke inkludert. @no
toolkit label: sangtekst for verk @no
toolkit definition: Et musikalsk verk som utfylles av et tekstlig verk. @no
label: is liedteksten voor werk @nl
definition: Relateert een werk aan een muziekwerk dat is gecomplementeerd door een tekstwerk. @nl
scope note: Liedteksten omvat niet tekst voor een opera of ander werk voor het muzikale podium, of een oratorium. @nl
toolkit label: liedteksten voor werk @nl
toolkit definition: Een muziekwerk dat is gecomplementeerd door een tekstwerk. @nl
label: هو كلمات أغنية لعمل @ar
definition: يربط عمل بعمل موسيقي يكمله عمل نصي. @ar
scope note: تستبعد كلمات غنائية نصًا لعمل أوبرالي، أو عمل آخر للمسرح الموسيقي، أو موسيقى دينية، @ar
toolkit label: كلمات أغنية لعمل @ar
toolkit definition: عمل موسيقي يكمله عمل نصي. @ar
label: és lletres de cançons per a una obra @ca
definition: Relaciona una obra amb una obra que és una obra musical que es complementa amb una obra textual. @ca
scope note: Les lletres de cançons exclouen el text d’una òpera o qualsevol altra obra escènica musical o d’un oratori. @ca
toolkit label: lletres de cançons per a una obra @ca
toolkit definition: Obra que és una obra musical que es complementa amb una obra textual. @ca
label: er sangtekst til værk @da
definition: Relaterer et værk til et musikværk, som er komplementeret af et tekstværk. @da
scope note: Sangtekst omfatter ikke tekst til en opera eller andet værk til en musikalsk scene, eller et oratorium. @da
toolkit label: sangtekster til værk @da
toolkit definition: Musikværk, som er komplementeret af et tekstværk. @da
label: laulusõnad teosele @et
definition: Seostab teose muusikateosega, mis on täiendatud tekstteosega. @et
scope note: Laulusõnad ei hõlma ooperile või muule muusikalisele lavateosele ega oratooriumile loodud teksti. @et
toolkit label: laulusõnad teosele @et
toolkit definition: Muusikateos, mis on täiendatud tekstteosega. @et
label: ist Lyrics für (Werk) @de
definition: Setzt ein Werk in Beziehung zu einem Musikwerk, das durch ein textliches Werk vervollständigt wird. @de
scope note: Darunter fallen nicht Texte einer Oper oder eines anderen Musikwerks für die Bühne oder ein Oratorium. @de
toolkit label: Lyrics für (Werk) @de
toolkit definition: Ein Musikwerk, das durch ein textliches Werk vervollständigt wird. @de
label: dalszövege a következő műnek: @hu
definition: Hozzákapcsol egy művet egy zeneműhöz, amelyet egy szöveges mű egészít ki. @hu
scope note: A dalszöveg nem foglalja magában egy opera vagy más zenei színpadi mű, vagy egy oratórium szövegét. @hu
toolkit label: szöveggel ellátott mű @hu
toolkit definition: Egy zenemű, amelyet egy szöveges forrás egészít ki. @hu
label: è parole per opera @it
definition: Correla un'opera a un'opera musicale completata da un'opera testuale. @it
scope note: Le parole escludono il testo di un'opera musicale o di altra opera per il teatro musicale, o un oratorio. @it
toolkit label: parole per opera @it
toolkit definition: Opera musicale completata da un'opera testuale. @it
label: consiste en paroles pour une œuvre @fr
definition: Met une œuvre en relation avec une œuvre musicale qui est complétée par une œuvre textuelle. @fr
scope note: Les paroles excluent le texte d’un opéra ou d’une autre œuvre pour la scène musicale, ou bien d’un oratorio. @fr
toolkit label: paroles pour une œuvre @fr
toolkit definition: Œuvre musicale qui est complétée par une œuvre textuelle. @fr
label: ir dziesmu teksti darbam @lv
toolkit label: dziesmu teksti darbam @lv
definition: Sasaista darbu ar mūzikas darbu, kas ir papildināts ar darbu, kas ir realizēts kā teksts. @lv
scope note: Šeit neietilpst teksti operai vai citam muzikālam uzvedumam, ieskaitot oratorijas. @lv
toolkit definition: Mūzikas darbs, kas ir papildināts ar darbu, kas ir realizēts kā teksts. @lv
label: 是作品的歌词 @zh-hans
toolkit label: 作品的歌词 @zh-hans
definition: 将一种作品与被一种文字作品补充的作为一种音乐作品的一种作品关联起来。 @zh-hans
scope note: 歌词不包括为歌剧或舞台音乐作品或者清唱剧提供的文本。 @zh-hans
toolkit definition: 被一种文字作品补充的作为一种音乐作品的一种作品 @zh-hans
has subproperty: P10369
label: eserin sözleridir @tr
toolkit label: Eser için şarkı sözleri @tr
definition: Bir eseri, metinsel bir eserle tamamlanan bir müzik eseri olan bir eserle ilişkilendirir. @tr

has lyrics work
status: Published
lexical alias: lyricsWork.en
toolkit label: lyrics work
type: Property
domain: C10001
sub property of: has text work
has element type: 2
definition: Relates a work to a work that is a textual work that complements a musical work.
scope note: Lyrics exclude text for an opera or other work for the musical stage, or an oratorio.
toolkit definition: A work that is a textual work that complements a musical work.
label: sanoitusteos @fi
definition: Liittää teoksen teokseen, joka on tekstiteos, joka täydentää musiikkiteosta. @fi
scope note: Sanoitus ei kata oopperan tai muun musiikillisen näyttämöteoksen tai oratorion tekstiä. @fi
toolkit label: sanoitusteos @fi
toolkit definition: Teos, joka on tekstiteos, joka täydentää musiikkiteosta. @fi
label: har sangtekst (verk) @no
definition: Relaterer et verk til et verk som er et tekstlig verk som utfyller et musikalsk verk. @no
scope note: Tekst for en opera eller et annet verk for en muskalsk scene eller et oratorium er ikke inkludert. @no
toolkit label: sangtekst (verk) @no
toolkit definition: Et verk som er et tekstlig verk som utfyller et musikalsk verk. @no
label: heeft liedtekstenwerk @nl
definition: Relateert een werk aan een werk dat is een tekstwerk dat een muziekwerk complementeert. @nl
scope note: Liedteksten omvat niet tekst voor een opera of ander werk voor het muzikale podium, of een oratorium. @nl
toolkit label: liedtekstenwerk @nl
toolkit definition: Een werk dat is een tekstwerk dat een muziekwerk complementeert. @nl
label: له عمل كلمات غنائية @ar
definition: يربط عمل بعمل عبارة عن عمل نصي يكمل عملا موسيقيا. @ar
scope note: تستبعد كلمات غنائية نصًا لعمل أوبرالي، أو عمل آخر للمسرح الموسيقي، أو موسيقى دينية، @ar
toolkit label: عمل كلمات غنائية @ar
toolkit definition: عمل عبارة عن عمل نصي يكمل عملا موسيقيا. @ar
label: té com a obra de lletres de cançons @ca
definition: Relaciona una obra amb una obra que és una obra textual que complementa una obra musical. @ca
scope note: Les lletres de cançons exclouen el text d’una òpera o qualsevol altra obra escènica musical o d’un oratori. @ca
toolkit label: obra de lletres de cançons @ca
toolkit definition: Obra que és una obra textual que complementa una obra musical. @ca
label: har sangtekstværk @da
definition: Relaterer et værk til et værk, som er et tekstværk, som komplementerer et musikværk. @da
scope note: Sangtekst omfatter ikke tekst til en opera eller andet værk til en musikalsk scene, eller et oratorium. @da
toolkit label: sangtekstværk @da
toolkit definition: Værk, som er et tekstværk, som komplementerer et musikværk. @da
label: laulusõnad (teos) @et
definition: Seostab teose tekstteosega, mis täiendab muusikateost. @et
scope note: Laulusõnad ei hõlma ooperile või muule muusikalisele lavateosele ega oratooriumile loodud teksti. @et
toolkit label: laulusõnad (teos) @et
toolkit definition: Tekstteos, mis täiendab muusikateost. @et
label: hat Lyrics (Werk) @de
definition: Setzt ein Werk in Beziehung zu einem textlichen Werk, das ein Musikwerk ergänzt. @de
scope note: Darunter fallen nicht Texte einer Oper oder eines anderen Musikwerks für die Bühne oder ein Oratorium. @de
toolkit label: Lyrics (Werk) @de
toolkit definition: Ein textliches Werk, das ein Musikwerk ergänzt. @de
label: dalszövege a következő mű: @hu
definition: Hozzákapcsol egy művet egy szöveges műhöz, amelyet egy zenemű egészít ki. @hu
scope note: A dalszöveg nem foglalja magában egy opera vagy más zenei színpadi mű, vagy egy oratórium szövegét. @hu
toolkit label: dalszövegmű @hu
toolkit definition: Egy szöveges mű, amelyet egy zenemű egészít ki. @hu
label: ha come parole opera @it
definition: Correla un'opera a un'opera testuale che completa un'opera musicale. @it
scope note: Le parole escludono il testo di un'opera musicale o di altra opera per il teatro musicale, o un oratorio. @it
toolkit label: parole opera @it
toolkit definition: Opera testuale che completa un'opera musicale. @it
label: a pour paroles (œuvre) @fr
definition: Met une œuvre en relation avec une œuvre textuelle qui complète une œuvre musicale. @fr
scope note: Les paroles excluent le texte d’un opéra ou d’une autre œuvre pour la scène musicale, ou bien d’un oratorio. @fr
toolkit label: paroles (œuvre) @fr
toolkit definition: Œuvre textuelle qui complète une œuvre musicale. @fr
label: darbs: dziesmas teksts @lv
toolkit label: darbs: dziesmas teksts @lv
definition: Sasaista darbu ar darbu, kas ir realizēts kā teksts, kas papildina mūzikas darbu. @lv
scope note: Šeit neietilpst teksti operai vai citam muzikālam uzvedumam, ieskaitot oratorijas. @lv
toolkit definition: Darbs, kas ir realizēts kā teksts, kas papildina mūzikas darbu. @lv
label: 有歌词作品 @zh-hans
toolkit label: 歌词作品 @zh-hans
definition: 将一种作品与作为一种文字作品并补充一种音乐作品的一种作品关联起来。 @zh-hans
scope note: 歌词不包括为歌剧或舞台音乐作品或者清唱剧提供的文本。 @zh-hans
toolkit definition: 作为一种文字作品并补充一种音乐作品的一种作品 @zh-hans
has subproperty: P10370
label: söz eseri ile ilişkilidir @tr
toolkit label: şarkı sözü çalışması @tr
definition: Bir eseri, bir müzik eserini tamamlayan metinsel bir eser olan bir eserle ilişkilendirir. @tr

has other agent associated with work (Deprecated)
status: Deprecated
definition: Relates a work to an agent other than a creator associated with a work. (Deprecated)
type: Property
domain: C10001
lexical alias: otherAgentWork.en
instruction number: 19.3
toolkit label: other agent associated with work (Deprecated)
toolkit definition: An agent other than a creator associated with a work. (Deprecated)
toolkit label: autre agent associé à une œuvre @fr
toolkit definition: Agent, autre qu’un créateur, associé à une œuvre. @fr
toolkit label: otra persona, familia o entidad corporativa asociada con una obra @es
toolkit definition: Una persona, familia o entidad corporativa asociada con una obra en una relación diferente de la del creador. @es
scope note: Agents to whom correspondence is addressed, agents honoured by a festschrift, directors, cinematographers, sponsoring bodies, production companies, institutions, etc., hosting an exhibition or event, etc., are included.
label: har övrig person, familj/släkt eller institution knuten till ett verk @sv
toolkit label: övrig person, familj/släkt eller institution knuten till ett verk @sv
sub property of: has related agent of work
label: har en anden agent knyttet til værket @da
definition: Relaterer et værk til en agent forskellig fra ophav knyttet til et værk. @da
toolkit label: anden agent knyttet til værket @da
toolkit definition: Agent forskellig fra ophav knyttet til et værk. @da
definition: Met une œuvre en relation avec un agent, autre qu’un créateur, associé à une œuvre. @fr
label: có tác phẩm tác nhân khác @vi
definition: Liên kết tác phẩm với tác nhân khác với người sáng tạo liên quan tới tác phẩm. @vi
scope note: Tác nhân mà thư từ gửi đến, tác nhân được kính trọng bởi sách kỷ niệm, giám đốc, nhà điện ảnh, tập thể tài trợ, công ty sản xuất, học viện, v.v... là chủ nhà triển lãm hoặc sự kiện, v.v..., được bao gồm. @vi
toolkit label: tác nhân khác liên quan tới tác phẩm @vi
toolkit definition: Tác nhân khác với người sáng tạo liên quan tới tác phẩm. @vi
label: hat sonstigen Akteur, der mit einem Werk in Verbindung steht @de
definition: Setzt ein Werk mit einem Akteur, der mit einem Werk in Verbindung steht, aber nicht geistiger Schöpfer ist, in Beziehung. @de
scope note: Dazu gehören Personen usw., an die Korrespondenz gerichtet ist, Personen usw., die durch eine Festschrift geehrt werden, Regisseure, Kameraleute, fördernde Körperschaften, Produktionsfirmen, Institutionen usw., die eine Ausstellung oder ein Ereignis hosten usw. @de
toolkit label: Sonstiger Akteur, der mit einem Werk in Verbindung steht @de
toolkit definition: Ein Akteur, der mit einem Werk in Verbindung steht, aber nicht geistiger Schöpfer ist. @de
label: a pour autre agent associé à une œuvre @fr
label: teokseen liittyvä muu toimija @fi
definition: Liittää teoksen toimijaan, jonka suhde teokseen on muu kuin tekijä-suhde @fi
toolkit label: teokseen liittyvä muu toimija @fi
toolkit definition: Toimija, jonka suhde teokseen on muu kuin tekijä-suhde @fi
toolkit label: annen agent som forbindes med verk @no
toolkit definition: En agent som forbindes med et verk og som ikke er opphavspersonen. @no
label: té com a altre agent associat amb una obra @ca
definition: Relaciona una obra amb un agent diferent d’un creador associat amb una obra. @ca
scope note: Inclou els agents a qui s’adreça una correspondència, els agents homenatjats en una obra d’homenatge, els directors, els directors de fotografia, les entitats patrocinadores, les companyies de producció, les institucions, etc., que acullen una exposició o un esdeveniment, etc. @ca
toolkit label: altre agent associat amb una obra @ca
toolkit definition: Agent diferent d’un creador associat amb una obra. @ca
scope note: Sont inclus les agents à qui une correspondance est adressée, les agents à qui sont offerts des mélanges, les réalisateurs, les directeurs de la photographie, les commanditaires, les sociétés de production, les institutions, etc. accueillant une exposition ou un événement, etc. @fr
has element type: 3
label: έχει άλλον φορέα που συνδέεται με το έργο @el
definition: Συνδέει ένα έργο με έναν φορέα άλλον από έναν δημιουργό που συνδέεται με ένα έργο. @el
scope note: Περιλαμβάνονται φορείς προς τους οποίους απευθύνεται η αλληλογραφία, φορείς τιμώμενοι σε έναν επετειακό τόμο, σκηνοθέτες, κινηματογραφιστές, χορηγοί, εταιρίες παραγωγής κ.λπ. που φιλοξενούν μια έκθεση ή ένα συμβάν κ.λπ. @el
toolkit label: άλλος φορέας που συνδέεται με το έργο @el
toolkit definition: Ένας φορέας άλλος από ένα δημιουργό που συνδέεται με ένα έργο. @el
label: van műhöz kötődő más ágense @hu
definition: Egy művet hozzákapcsol egy ágenshez (személyhez, családhoz vagy testülethez), aki/amely más, mint egy műhöz kötődő alkotó. @hu
scope note: Beletartoznak azok az ágensek, akik levelezés címzettjei, akiket egy emlékkönyvvel (Festschrift) tiszteltek meg, igazgatók, operatőrök, szponzoráló szervezetek, produkciós vállalatok, intézmények stb., amelyek/akik egy kiállítást vagy eseményt stb. rendeznek. @hu
toolkit label: műhöz kötődő más ágens @hu
toolkit definition: Egy ágens (személy, család vagy testület), aki/amely más, mint egy alkotó, aki egy műhöz kötődik. @hu
has subproperty: har appellant
has subproperty: har indstævnet
has subproperty: har sagsøgte
has subproperty: har jurisdiktion underlagt
has subproperty: har sagsøger
has subproperty: P10047

has medium
status: Published
definition: Relates a work to a person who claims to be a channel of communication with a world of spirits.
type: Property
domain: C10001
sub property of: has creator person of work
lexical alias: medium.en
toolkit label: medium
toolkit definition: A person who claims to be a channel of communication with a world of spirits.
toolkit label: médium @fr
toolkit definition: Personne qui prétend être un canal de communication avec un monde d’esprits. @fr
toolkit definition: Una persona tenida como una canal de comunicación entre el mundo terrenal y el mundo de los espíritus. @es
instruction number: 18.5
label: har medie @da
definition: Relaterer et værk til en person, som hævder at være en kanal for kommunikation med en åndelig verden. @da
toolkit label: medie @da
toolkit definition: Person, som hævder at være en kanal for kommunikation med en åndelig verden. @da
definition: Met une œuvre en relation avec une personne qui prétend être un canal de communication avec un monde d’esprits. @fr
label: có đồng cốt @vi
definition: Liên kết tác phẩm với cá nhân nắm giữ kênh liên lạc giữa thế giới thực và thế giới thần linh. @vi
toolkit label: đồng cốt @vi
toolkit definition: Cá nhân nắm giữ kênh liên lạc giữa thế giới thực và thế giới thần linh. @vi
label: hat Channel @de
definition: Setzt ein Werk in Beziehung zu einer Person, die sich für einen Kommunikationskanal zwischen der irdischen Welt und einer Geisterwelt hält. @de
toolkit label: Channel @de
toolkit definition: Eine Person, die sich für einen Kommunikationskanal zwischen der irdischen Welt und einer Geisterwelt hält. @de
label: a pour médium @fr
definition: Liittää teoksen henkilöön, joka vakuuttaa olevansa viestintäkanava henkien maailmaan. @fi
toolkit label: meedio @fi
toolkit definition: Henkilö, joka vakuuttaa olevansa viestintäkanava henkien maailmaan. @fi
toolkit definition: En person som hevder å være en kommunikasjonskanal mot en åndeverden. @no
label: té com a mèdium @ca
definition: Relaciona una obra amb una persona que s’atribueix ser un canal de comunicació amb un món d’esperits. @ca
toolkit label: mèdium @ca
toolkit definition: Persona que s’atribueix ser un canal de comunicació amb un món d’esperits. @ca
has element type: 2
label: έχει μέσο μετάδοσης @el
definition: Συνδέει ένα έργο με ένα φυσικό πρόσωπο, το οποίο χρησιμοποιείται ως ενδιάμεσο κανάλι επικοινωνίας μεταξύ του γήινου κόσμου και του κόσμου των πνευμάτων. @el
toolkit label: μέσο μετάδοσης @el
toolkit definition: Ένα φυσικό πρόσωπο, το οποίο χρησιμοποιείται ως ενδιάμεσο κανάλι επικοινωνίας μεταξύ του γήινου κόσμου και του κόσμου των πνευμάτων. @el
label: médiuma a következő: @hu
definition: Hozzákapcsol egy művet egy személyhez, akit a szellemek világával folytatott kommunikáció csatornájának tartanak. @hu
toolkit label: médium: @hu
toolkit definition: Egy személy, akit a szellemek világával folytatott kommunikáció csatornájának tartanak. @hu
label: meedio @fi
label: har medium @no
definition: Relaterer et verk til en person som hevder å være en kommunikasjonskanal mot en åndeverden. @no
label: heeft medium @nl
definition: Relateert een werk aan een persoon die beweert een communicatiekanaal te zijn met een geestenwereld. @nl
toolkit definition: Een persoon die beweert een communicatiekanaal te zijn met een geestenwereld. @nl
label: له وسيط روحاني @ar
definition: يربط بين عمل وشخص يدعي أنه حلقة وصل مع عالم الأرواح. @ar
toolkit label: وسيط روحاني @ar
toolkit definition: شخص يدعي أنه حلقة وصل مع عالم الأرواح. @ar
label: meedium @et
definition: Seostab teose isikuga, kes väidab end olevat suhtluskanal vaimude maailmaga. @et
toolkit label: meedium @et
toolkit definition: Isik, kes väidab end olevat suhtluskanal vaimude maailmaga. @et
label: ha come medium @it
definition: Correla un’opera a una persona che sostiene di essere un canale di comunicazione tra il mondo terreno e il mondo degli spiriti. @it
toolkit definition: Persona che sostiene di essere un canale di comunicazione tra il mondo terreno e il mondo degli spiriti. @it
label: medijs @lv
definition: Sasaista darbu ar personu, kura sevi uzskata par saziņas kanālu starp zemes pasauli un garu pasauli. @lv
toolkit label: medijs @lv
toolkit definition: Persona, kura sevi uzskata par saziņas kanālu starp zemes pasauli un garu pasauli. @lv
label: 有通灵者 @zh-hans
definition: 将一种作品与声称是和精神世界之间通讯渠道的一个个人关联起来。 @zh-hans
toolkit label: 通灵者 @zh-hans
toolkit definition: 声称是和精神世界之间通讯渠道的一个个人 @zh-hans
has subproperty: P10036
label: medyum ile ilişkilidir @tr
definition: Bir eseri, ruhlar dünyasıyla iletişimde olduğunu iddia eden bir kişiyle ilişkilendirir. @tr
toolkit label: medyum @tr
toolkit definition: Ruhlar dünyasıyla iletişimde olduğunu iddia eden kişi. @tr

has medium of performance of choreographic content of representative expression
status: Published
lexical alias: mediumOfPerformanceOfChoreographicContentOfRepresentativeExpression.en
definition: Relates a work to a type of performer or group of performers participating, or intended to participate, in a performance of choreographic or non-musical dramatic content of a representative expression.
toolkit label: medium of performance of choreographic content of representative expression
toolkit definition: A type of performer or group of performers participating, or intended to participate, in a performance of choreographic or non-musical dramatic content of a representative expression.
type: Property
domain: C10001
has element type: 5
label: edustavan ekspression koreografisen sisällön esityskokoonpano @fi
definition: Liittää teoksen edustavan ekspression koreografiseen tai ei-musiikilliseen draamasisältöön osallistuvan tai osallistuvaksi tarkoitetun esittäjän tai esittäjien ryhmän tyyppiin. @fi
toolkit label: edustavan ekspression koreografisen sisällön esityskokoonpano @fi
toolkit definition: Edustavan ekspression koreografiseen tai ei-musiikilliseen draamasisältöön osallistuvan tai osallistuvaksi tarkoitetun esittäjän tai esittäjien ryhmän tyyppi. @fi
label: har besetning eller koreografisk innhold i representativt uttrykk @no
definition: Relaterer et verk til en type utøver eller gruppe av utøvere som deltar, eller er ment å delta, i en framføring av koreografisk eller ikke-musikalsk dramatisk innhold i et representativt uttrykk. @no
toolkit label: besetning eller koreografisk innhold i representativt uttrykk @no
toolkit definition: En type utøver eller gruppe av utøvere som deltar, eller er ment å delta, i en framføring av koreografisk eller ikke-musikalsk dramatisk innhold i et representativt uttrykk. @no
label: heeft uitvoeringsmedium van choreografische content van representatieve expressie @nl
definition: Relateert een werk aan een type uitvoerder of groep van uitvoerders die deelnemen aan, of van plan zijn deel te nemen aan, een voorstelling van choreografische of niet-muzikale dramatische content van een representatieve expressie. @nl
toolkit label: uitvoeringsmedium van choreografische content van representatieve expressie @nl
toolkit definition: Een type uitvoerder of groep van uitvoerders die deelnemen aan, of van plan zijn deel te nemen aan, een voorstelling van choreografische of niet-muzikale dramatische content van een representatieve expressie. @nl
label: له وسيط أداء محتوى الرقصات لتعبيرة ممثِلة @ar
definition: يربط بين عمل ونوع من فناني الأداء أو مجموعة من المؤدين الذين يشاركون، أو يعتزمون المشاركة، في أداء محتوى دراما راقصة أو غير موسيقية لتعبيرة ممثِلة. @ar
toolkit label: وسيط أداء محتوى الرقصات لتعبيرة ممثِلة @ar
toolkit definition: نوع من فناني الأداء أو مجموعة من المؤدين الذين يشاركون، أو يعتزمون المشاركة، في أداء محتوى دراما راقصة أو غير موسيقية لتعبيرة ممثِلة. @ar
label: té com a repartiment d’execució d’un contingut coreogràfic d’una expressió representativa @ca
definition: Relaciona una obra amb un tipus d’intèrpret o grup d’intèrprets participant, o concebut per participar, en una representació de contingut coreogràfic o dramàtic no musical d’una expressió representativa. @ca
toolkit label: repartiment d’execució d’un contingut coreogràfic d’una expressió representativa @ca
toolkit definition: Tipus d’intèrpret o grup d’intèrprets participant, o concebut per participar, en una representació de contingut coreogràfic o dramàtic no musical d’una expressió representativa. @ca
label: har besætning for koreografisk indhold af repræsentativt udtryk @da
definition: Relaterer et værk til en type udøver eller gruppe af udøvere, som deltager, eller er tiltænkt at deltage, i en forestilling af koreografisk eller ikke-musikalsk dramatisk indhold i et repræsentativt udtryk. @da
toolkit label: besætning for koreografisk indhold af repræsentativt udtryk @da
toolkit definition: Type udøver eller gruppe af udøvere, som deltager, eller er tiltænkt at deltage, i en forestilling af koreografisk eller ikke-musikalsk dramatisk indhold i et repræsentativt udtryk. @da
label: iseloomuliku väljenduse koreograafilise sisu esituskoosseis @et
definition: Seostab teose esitaja või esitajate rühmaga, kes osalevad või on mõeldud osalema iseloomuliku väljenduse koreograafilise või mittemuusikalise draamavormis sisu ettekandes. @et
toolkit label: iseloomuliku väljenduse koreograafilise sisu esituskoosseis @et
toolkit definition: Esitaja või esitajate rühm, kes osalevad või on mõeldud osalema iseloomuliku väljenduse koreograafilise või mittemuusikalise draamavormis sisu ettekandes. @et
label: hat Besetzung für choreografischen Inhalt einer repräsentativen Expression @de
definition: Setzt ein Werk in Beziehung zu einer Kategorisierung der Ausführenden/des Ausführenden oder einer Gruppe von Ausführenden, die/der an einer Darbietung des choreografischen oder nicht musikalischen, dramatischen Inhalts einer repräsentativen Expression teilnimmt/teilnehmen oder teilnehmen sollen. @de
toolkit label: Besetzung für choreografischen Inhalt einer repräsentativen Expression @de
toolkit definition: Eine Kategorisierung der Ausführenden/des Ausführenden oder einer Gruppe von Ausführenden, die/der an einer Darbietung des choreografischen oder nicht musikalischen, dramatischen Inhalts einer repräsentativen Expression teilnimmt/teilnehmen oder teilnehmen sollen. @de
label: reprezentatív kifejezési forma koreografikus előadás médiuma a következő: @hu
definition: Hozzákapcsol egy művet egy reprezentatív kifejezési forma koreográfiai vagy nem zenei drámai tartalmának előadásában részt vevő vagy részt venni szándékozó előadói típushoz vagy előadói csoporthoz. @hu
toolkit label: reprezentatív kifejezési forma koreografikus tartalmához tartozó előadási médium @hu
toolkit definition: Egy reprezentatív kifejezési forma koreográfiai vagy nem zenei drámai tartalmának előadásában részt vevő vagy részt venni szándékozó előadói típus vagy előadói csoport. @hu
label: ha come mezzo d'interpretazione di contenuto coreografico di espressione rappresentativa @it
definition: Correla un'opera a un tipo di interprete o gruppo di interpreti, che partecipano, o che sono destinati a partecipare, a un'interpretazione del contenuto coreografico o drammatico non musicale di un'espressione rappresentativa. @it
toolkit label: mezzo d'interpretazione di contenuto coreografico di espressione rappresentativa @it
toolkit definition: Tipo di interprete o gruppo di interpreti, che partecipano, o che sono destinati a partecipare, a un'interpretazione del contenuto coreografico o drammatico non musicale di un'espressione rappresentativa. @it
label: a pour distribution d’exécution d’un contenu chorégraphique d’une expression représentative @fr
definition: Met une œuvre en relation avec un type d’interprète ou de groupe d’interprètes qui participe ou est destiné à participer à une prestation d’un contenu chorégraphique ou dramatique non musical d’une expression représentative. @fr
toolkit label: distribution d’exécution d’un contenu chorégraphique d’une expression représentative @fr
toolkit definition: Type d’interprète ou de groupe d’interprètes qui participe ou est destiné à participer à une prestation d’un contenu chorégraphique ou dramatique non musical d’une expression représentative. @fr
label: horeogrāfiskā satura reprezentatīvās izteiksmes izpildījuma veids @lv
definition: Sasaista darbu ar izpildītāju vai izpildītāju grupu, kas piedalās vai kam ir paredzēts piedalīties horeogrāfiska vai ar mūziku nesaistīta reprezentatīvas izteiksmes dramatiska satura uzvedumā. @lv
toolkit label: horeogrāfiskā satura reprezentatīvās izteiksmes izpildījuma veids @lv
toolkit definition: Izpildītājs vai izpildītāju grupa, kas piedalās vai kam ir paredzēts piedalīties horeogrāfiska vai ar mūziku nesaistīta reprezentatīvas izteiksmes dramatiska satura uzvedumā. @lv
label: 有代表性内容表达的编舞内容的表演媒介 @zh-hans
definition: 将一种作品与在代表性内容表达的编舞或非音乐戏剧内容的一种表演中参与或计划参与的表演者或表演者群体的类型关联起来。 @zh-hans
toolkit label: 代表性内容表达的编舞内容的表演媒介 @zh-hans
toolkit definition: 在代表性内容表达的编舞或非音乐戏剧内容的一种表演中参与或计划参与的表演者或表演者群体的类型 @zh-hans
has subproperty: P10603
label: koreografik içeriğin performans ortamı ile ilişkilidir @tr
definition: Bir eseri, temsili bir anlatımın koreografik olan veya müzikal olmayan dramatik içeriğinin bir performansına katılan veya katılmayı amaçlayan bir sanatçı türü veya sanatçı grubuyla ilişkilendirir. @tr
toolkit label: temsili ifadenin koreografik içeriğinin performans ortamı @tr
toolkit definition: Temsili bir anlatımın koreografik veya müzikal olmayan dramatik içeriğine katılan veya katılmayı amaçlayan bir tür sanatçı veya sanatçı grubu. @tr

has medium of performance of musical content of representative expression
status: Published
definition: Relates a work to an instrument, voice, or ensemble used, or intended to be used, for performance of musical content of a representative expression of a work.
type: Property
domain: C10001
lexical alias: mediumOfPerformanceOfMusicalContentOfRepresentativeExpression.en
instruction number: 6.15
toolkit label: medium of performance of musical content of representative expression
toolkit definition: An instrument, voice, or ensemble used, or intended to be used, for performance of musical content of a representative expression of a work.
toolkit label: distribution d’exécution d’un contenu musical d’une expression représentative @fr
toolkit definition: Instrument, voix ou ensemble utilisé ou destiné à être utilisé dans une exécution d’un contenu musical d’une expression représentative d’une œuvre. @fr
toolkit label: medio de interpretación @es
toolkit definition: El instrumento, instrumentos, voz, voces, etc., para los cuales fue originalmente concebida una obra musical. @es
label: har besætning for musikalsk indhold af repræsentativt udtryk @da
definition: Relaterer et værk til et instrument, sangstemme eller ensemble, som bruges eller det var til hensigt at bruge for opførelse af musikalsk indhold af et repræsentativt udtryk af et værk. @da
toolkit label: besætning for musikalsk indhold af repræsentativt udtryk @da
toolkit definition: Instrument, sangstemme eller ensemble, som bruges eller det var til hensigt at bruge for opførelse af musikalsk indhold af et repræsentativt udtryk af et værk. @da
definition: Met une œuvre en relation avec un instrument, une voix ou un ensemble utilisé ou destiné à être utilisé dans une exécution d’un contenu musical d’une expression représentative d’une œuvre. @fr
label: có phương tiện biểu diễn @vi
definition: Liên kết tác phẩm với dụng cụ, giọng, hoặc dàn đồng diễn mà tác phẩm âm nhạc được hình thành nguyên gốc. @vi
toolkit label: phương tiện biểu diễn @vi
toolkit definition: Dụng cụ, giọng, hoặc dàn đồng diễn mà tác phẩm âm nhạc được hình thành nguyên gốc. @vi
label: hat Besetzung für musikalischen Inhalt einer repräsentativen Expression @de
definition: Setzt ein Werk in Beziehung zu einem Instrument, einer Singstimme oder einem Ensemble, das/die für die Darbietung des musikalischen Inhalts einer repräsentativen Expression eines Werks verwendet wird oder verwendet werden soll. @de
toolkit label: Besetzung für musikalischen Inhalt einer repräsentativen Expression @de
toolkit definition: Ein Instrument, eine Singstimme oder ein Ensemble das/die für die Darbietung des musikalischen Inhalts einer repräsentativen Expression eines Werks verwendet wird oder verwendet werden soll. @de
label: a pour distribution d’exécution d’un contenu musical d’une expression représentative @fr
definition: Liittää teoksen teoksen edustavan ekspression musiikillisen sisällön esittämiseen käytettyyn tai käytettäväksi tarkoitettuun soittimeen, lauluääneen tai esittäjäryhmään. @fi
toolkit label: edustavan ekspression musiikin esityskokoonpano @fi
toolkit definition: Teoksen edustavan ekspression musiikillisen sisällön esittämiseen käytetty tai käytettäväksi tarkoitettu soitin, lauluääni tai esittäjäryhmä. @fi
toolkit label: besetning for musikalsk innhold i et representativt uttrykk @no
toolkit definition: Et instrument, en stemme eller et ensemble som er brukt eller tenkt brukt for framføring av det musikalske innholdet av et representativt uttrykk av et verk. @no
label: té com a repartiment d’execució de contingut musical d’una expressió representativa @ca
definition: Relaciona una obra amb un instrument, veu o conjunt usat, o concebut per ser usat, per a l’execució d’un contingut musical d’una expressió representativa d’una obra. @ca
toolkit label: repartiment d’execució de contingut musical d’una expressió representativa @ca
toolkit definition: Instrument, veu o conjunt usat, o concebut per ser usat, per a l’execució d’un contingut musical d’una expressió representativa d’una obra. @ca
has element type: 5
label: έχει μέσο εκτέλεσης @el
definition: Συνδέει ένα έργο με ένα όργανο, μια φωνή ή ένα σύνολο για το οποίο επινοήθηκε αρχικά ένα μουσικό έργο. @el
toolkit label: μέσο εκτέλεσης @el
toolkit definition: Ένα όργανο, μια φωνή ή/και ένα σύνολο για τα οποία επινοήθηκε αρχικά ένα μουσικό έργο. @el
label: reprezentatív kifejezési forma hangszerelése a következő: @hu
definition: Egy művet hozzákapcsol egy hangszerhez, hanghoz, vagy együtteshez, amelyre egy zeneművet eredetileg elgondoltak. @hu
toolkit label: reprezentatív kifejezési forma zenei tartalmához tartozó előadási médium @hu
toolkit definition: Egy hangszer, hang és/vagy együttes, amelyre egy zeneművet eredetileg kigondoltak. @hu
label: edustavan ekspression musiikin esityskokoonpano @fi
label: har besetning for musikalsk innhold i et representativt uttrykk @no
definition: Relaterer et verk til et instrument, en stemme eller et ensemble som er brukt eller tenkt brukt for framføring av det musikalske innholdet av et representativt uttrykk av et verk. @no
label: heeft uitvoeringsmedium van muzikale content van representatieve expressie @nl
definition: Relateert een werk aan een instrument, stem of ensemble, gebruikt of bedoeld om te gebruiken, voor het uitvoeren van muziekcontent van een representatieve expressie van een werk. @nl
toolkit label: uitvoeringsmedium van muziekcontent van representatieve expressie @nl
toolkit definition: Een instrument, stem of ensemble, gebruikt of bedoeld om te gebruiken, voor het uitvoeren van muziekcontent van een representatieve expressie van een werk. @nl
label: له وسيط لأداء محتوى موسيقي لتعبيرة ممثِلة @ar
definition: يربط بين عمل وآلة، أو صوت، أو مجموعة مستخدمة أو يعتزم استخدامها لأداء محتوى موسيقي لتعبيرة ممثِلة لعمل. @ar
toolkit label: وسيط لأداء محتوى موسيقي لتعبيرة ممثِلة @ar
toolkit definition: آلة، أو صوت، أو مجموعة مستخدمة أو يعتزم استخدامها لأداء محتوى موسيقي لتعبيرة ممثِلة لعمل. @ar
label: iseloomuliku väljenduse muusikalise sisu esituskoosseis @et
definition: Seostab teose teose iseloomuliku väljenduse muusikalise sisu esitamiseks kasutatud või esitamiseks mõeldud muusikainstrumendi, lauluhääle või ansambliga. @et
toolkit label: iseloomuliku väljenduse muusikalise sisu esituskoosseis @et
toolkit definition: Teose iseloomuliku väljenduse muusikalise sisu esitamiseks kasutatud või esitamiseks mõeldud muusikainstrument, lauluhääl või ansambel. @et
label: ha come mezzo di interpretazione del contuenuto musicale di espressione rappresentativa @it
definition: Correla un’opera a uno strumento, voce o ensemble utilizzati, o destinati a essere utilizzati, per l’interpretazione di un contenuto musicale di un’espressione rappresentativa di un’opera. @it
toolkit label: mezzo di interpretazione del contuenuto musicale di espressione rappresentativa @it
toolkit definition: Strumento, voce o ensemble utilizzati, o destinati a essere utilizzati, per l’interpretazione di un contenuto musicale di un’espressione rappresentativa di un’opera. @it
label: mūzikas satura reprezentatīvās izteiksmes izpildījuma veids @lv
definition: Sasaista darbu ar mūzikas instrumentu, balsi vai ansambli, ko lieto (vai ko paredzēts lietot), lai izpildītu darba reprezentatīvas izteiksmes muzikālo saturu.?. @lv
toolkit label: mūzikas satura reprezentatīvās izteiksmes izpildījuma veids @lv
toolkit definition: Mūzikas instruments, balss vai ansamblis, ko lieto (vai ko paredzēts lietot), lai izpildītu darba reprezentatīvas izteiksmes muzikālo saturu.? @lv
label: 有代表性内容表达的音乐内容的表演媒介 @zh-hans
definition: 将一种作品与一种作品的代表性内容表达的音乐内容之表演所用或构想所用的乐器、人声或组合关联起来。 @zh-hans
toolkit label: 代表性内容表达的音乐内容的表演媒介 @zh-hans
toolkit definition: 一种作品的代表性内容表达的音乐内容之表演所用或构想所用的乐器、人声或组合 @zh-hans
has subproperty: P10220
label: temsili anlatımın müzikal içeriğinin performans ortamı ile ilişkilidir @tr
definition: Bir eseri, eserin temsili bir anlatımının müzikal içeriğinin performansı için kullanılan veya kullanılması amaçlanan bir enstrüman, ses veya toplulukla ilişkilendirir. @tr
toolkit label: Temsili ifadenin müzikal içeriğinin performans ortamı @tr
toolkit definition: Bir eserin temsili anlatımının müzikal içeriğinin icrası için kullanılan veya kullanılması amaçlanan bir enstrüman, ses veya topluluk. @tr

has commemoration
status: Published
type: Property
lexical alias: commemoration.en
definition: Relates a work to a work that is created to commemorate an earlier work.
domain: C10001
toolkit label: commemoration
toolkit definition: A work that is created to commemorate an earlier work.
sub property of: has related work of work
toolkit label: conmemoración @es
toolkit definition: Una obra conmemorada por otra obra. @es
instruction number: 24.5
label: har mindemarkering @da
definition: Relaterer et værk til et værk, som er skabt for at mindes et tidligere værk. @da
toolkit label: mindemarkering @da
toolkit definition: Værk, som er skabt for at mindes et tidligere værk. @da
label: có tưởng niệm @vi
definition: Liên kết tác phẩm với tác phẩm được tạo ra để tưởng niệm tác phẩm trước đây. @vi
toolkit label: tưởng niệm @vi
toolkit definition: Tác phẩm được tạo ra để tưởng niệm tác phẩm trước đây. @vi
label: hat Gedenkschrift @de
definition: Setzt ein Werk in Beziehung zu einem Werk, das geschaffen wurde, um einem früheren Werk zu gedenken. @de
toolkit label: Gedenkschrift @de
toolkit definition: Ein Werk, das geschaffen wurde, um einem früheren Werk zu gedenken. @de
definition: Liittää teoksen teokseen, joka on luotu aiemman teoksen muistoksi. @fi
toolkit label: muistoteos @fi
toolkit definition: Teos, joka on luotu aiemman teoksen muistoksi. @fi
toolkit label: minneskrift @no
toolkit definition: Et verk som er skapt til minne om et tidligere verk. @no
label: té com a commemoració @ca
definition: Relaciona una obra amb una obra que es crea per commemorar una obra anterior. @ca
toolkit label: commemoració @ca
toolkit definition: Obra que es crea per commemorar una obra anterior. @ca
label: a pour commémoration @fr
definition: Met une œuvre en relation avec une œuvre qui est créée pour commémorer une œuvre antérieure. @fr
toolkit label: commémoration @fr
toolkit definition: Œuvre qui est créée pour commémorer une œuvre antérieure. @fr
has element type: 2
label: έχει μνεία @el
definition: Συνδέει ένα έργο με ένα έργο που δημιουργήθηκε για να τιμήσει ένα προηγούμενο έργο. @el
toolkit label: μνεία @el
toolkit definition: Ένα έργο που δημιουργήθηκε για να τιμήσει ένα προηγούμενο έργο. @el
label: megemlékezik róla a következő: @hu
definition: Hozzákapcsol egy művet egy műhöz, amelyet egy korábbi műre való megemlékezés céljából hoztak létre. @hu
toolkit label: megemlékezik róla: @hu
toolkit definition: Egy mű, amelyet egy korábbi műre való megemlékezés céljából hoztak létre. @hu
label: muistoteos @fi
label: har minneskrift @no
definition: Relaterer et verk til et verk som er skapt til minne om et tidligere verk. @no
label: heeft herdenking @nl
definition: Relateert een werk aan een werk dat gemaakt is om een eerder werk te herdenken. @nl
toolkit label: herdenking @nl
toolkit definition: Een werk dat gemaakt is om een eerder werk te herdenken. @nl
label: له إحياء ذكرى أو تكريم @ar
definition: يربط عمل بعمل تم إنشاؤه للاحتفاء بعمل سابق. @ar
toolkit label: إحياء ذكرى أو تكريم @ar
toolkit definition: عمل تم إنشاؤه للاحتفاء بعمل سابق. @ar
label: mälestusteos @et
definition: Seostab teose teosega, mis on loodud varasema teose mälestamiseks. @et
toolkit label: mälestusteos @et
toolkit definition: Teos, mis on loodud varasema teose mälestamiseks. @et
label: ha come celebrazione @it
definition: Correla un’opera a un’opera che è creata per celebrare un’opera precedente. @it
toolkit label: celebrazione @it
toolkit definition: Opera che è creata per celebrare un’opera precedente. @it
label: piemiņas darbs @lv
definition: Sasaista darbu ar darbu, kas radīts agrāka darba piemiņai. @lv
toolkit label: piemiņas darbs @lv
toolkit definition: Darbs, kas radīts agrāka darba piemiņai. @lv
label: 有纪念 @zh-hans
definition: 将一种作品与被创建以纪念一种较早作品的一种作品关联起来。 @zh-hans
toolkit label: 纪念 @zh-hans
toolkit definition: 被创建以纪念一种较早作品的一种作品 @zh-hans
has subproperty: P10294
label: anma ile ilişkilidir @tr
definition: Bir eseri, daha önceki bir eserde bahsedilen bir eserle ilişkilendirir. @tr
toolkit label: anma @tr
toolkit definition: Daha önceki bir eseri anmak için yaratılan bir eser. @tr

is commemoration of
status: Published
type: Property
lexical alias: commemorationOf.en
definition: Relates a work to a work that is commemorated in a later work.
domain: C10001
toolkit label: commemoration of
toolkit definition: A work that is commemorated in a later work.
sub property of: has related work of work
toolkit label: conmemoración de @es
toolkit definition: Una obra creada para conmemorar otra obra. @es
instruction number: 24.5
label: er mindemarkering af @da
definition: Relaterer et værk til et værk, som mindes i et senere værk. @da
toolkit label: mindemarkering af @da
toolkit definition: Værk, som mindes i et senere værk. @da
label: có tưởng niệm của @vi
definition: Liên kết tác phẩm với tác phẩm được tưởng niệm trong tác phẩm sau này. @vi
toolkit label: tưởng niệm của @vi
toolkit definition: Tác phẩm được tưởng niệm trong tác phẩm sau này. @vi
label: ist Gedenkschrift für @de
definition: Setzt ein Werk in Beziehung zu einem Werk, dem durch ein späteres Werk gedacht wird. @de
toolkit label: Gedenkschrift für @de
toolkit definition: Ein Werk, dem durch ein späteres Werk gedacht wird. @de
definition: Liittää teoksen teokseen, jonka muistona myöhempi teos on. @fi
toolkit label: muistoteos teokselle @fi
toolkit definition: Teos, jonka muistona myöhempi teos on. @fi
toolkit label: minneskrift for @no
toolkit definition: Et verk som et senere verk er skapt til minne om. @no
label: és commemoració de @ca
definition: Relaciona una obra amb una obra que es commemora en una obra posterior. @ca
toolkit label: commemoració de @ca
toolkit definition: Obra que es commemora en una obra posterior. @ca
label: est une commémoration de @fr
definition: Met une œuvre en relation avec une œuvre qui est commémorée dans une œuvre ultérieure. @fr
toolkit label: commémoration de @fr
toolkit definition: Œuvre qui est commémorée dans une œuvre ultérieure. @fr
has element type: 2
label: είναι μνεία του @el
definition: Συνδέει ένα έργο με ένα έργο που μνημονεύεται σε ένα μεταγενέστερο έργο. @el
toolkit label: μνεία του @el
toolkit definition: Ένα έργο που μνημονεύεται σε ένα μεταγενέστερο έργο. @el
label: megemlékezés a következőről: @hu
definition: Egy művet hozzákapcsol egy műhöz, amelyről egy későbbi műben megemlékeznek. @hu
toolkit label: megemlékezés a következőről: @hu
toolkit definition: Egy mű, amelyről egy későbbi mű megemlékezik. @hu
label: muistoteos teokselle @fi
label: er minneskrift for @no
definition: Relaterer et verk til et verk som et senere verk er skapt til minne om. @no
label: is herdenking van @nl
definition: Relateert een werk aan een werk dat is herdacht in een later werk. @nl
toolkit label: herdenking van @nl
toolkit definition: Een werk dat is herdacht in een later werk. @nl
label: هو إحياء ذكرى أو تكريم لـ @ar
definition: يربط عمل بعمل تم الاحتفاء به في عمل لاحق. @ar
toolkit label: إحياء ذكرى أو تكريم لـ @ar
toolkit definition: عمل تم الاحتفاء به في عمل لاحق. @ar
label: mälestusteos teosele @et
definition: Seostab teose teosega, mida hilisemas teoses mälestatakse. @et
toolkit label: mälestusteos teosele @et
toolkit definition: Teos, mida hilisemas teoses mälestatakse. @et
label: è celebrazione di @it
definition: Correla un’opera a un’opera celebrata in un’opera successiva. @it
toolkit label: celebrazione di @it
toolkit definition: Opera celebrata in un’opera successiva. @it
label: ir radīts piemiņai @lv
definition: Sasaista darbu ar darbu, kura piemiņai radīts vēlākais darbs. @lv
toolkit label: radīts piemiņai @lv
toolkit definition: Darbs, kura piemiņai radīts vēlākais darbs. @lv
label: 是……的纪念 @zh-hans
definition: 将一种作品与被一种较晚作品纪念的一种作品关联起来。 @zh-hans
toolkit label: ……的纪念 @zh-hans
toolkit definition: 被一种较晚作品纪念的一种作品 @zh-hans
has subproperty: P10295
label: anılmasıdır @tr
definition: Bir eseri, daha sonraki bir eserde anılan bir eserle ilişkilendirir. @tr
toolkit label: anılması @tr
toolkit definition: Sonraki bir eserde anılan bir eser @tr

is critique of manifestation
status: Published
type: Property
lexical alias: critiqueOfManifestation.en
definition: Relates a work to a manifestation that is critically evaluated by a work.
domain: C10001
toolkit label: critique of manifestation
toolkit definition: A manifestation that is critically evaluated by a work.
toolkit label: critique d’une manifestation @fr
toolkit definition: Manifestation qui fait l’objet d’une évaluation critique par une œuvre. @fr
toolkit label: crítica de (manifestación) @es
toolkit definition: Una manifestación usada como base para una evaluación crítica. @es
instruction number: 23.5
label: er kritik af manifestation @da
definition: Relaterer et værk til en manifestation, som anvendes som grundlag for en kritisk evaluering. @da
toolkit label: kritik af manifestation @da
toolkit definition: Manifestation, som anvendes som grundlag for en kritisk evaluering. @da
definition: Met une œuvre en relation avec une manifestation qui fait l’objet d’une évaluation critique par une œuvre. @fr
label: là phê bình của (biểu thị) @vi
definition: Liên kết tác phẩm với biểu thị được dùng như là cơ sở cho đánh giá phê bình. @vi
toolkit label: phê bình của (biểu thị) @vi
toolkit definition: Biểu thị được dùng như là cơ sở cho đánh giá phê bình. @vi
label: ist Kritik von (Manifestation) @de
definition: Setzt ein Werk in Beziehung zu einer Manifestation, die als Grundlage für eine kritische Untersuchung verwendet wird. @de
toolkit label: Kritik von (Manifestation) @de
toolkit definition: Eine Manifestation, die als Grundlage für eine kritische Untersuchung verwendet wird. @de
label: est une critique d’une manifestation @fr
definition: Liittää teoksen manifestaatioon, johon kriittinen arviointi perustuu. @fi
toolkit label: kritiikki manifestaatiosta @fi
toolkit definition: Manifestaatio, johon kriittinen arviointi perustuu. @fi
toolkit label: kritikk av manifestasjon @no
toolkit definition: En manifestasjon brukt som utgangspunkt for en kritisk evaluering. @no
label: és crítica d’una manifestació @ca
definition: Relaciona una obra amb una manifestació que és avaluada críticament per una obra. @ca
toolkit label: crítica d’una manifestació @ca
toolkit definition: Manifestació que és avaluada críticament per una obra. @ca
has element type: 2
label: είναι κριτική της (εκδήλωση) @el
definition: Συνδέει ένα έργο με μια εκδήλωση που χρησιμοποιείται ως η βάση για μια κριτική αξιολόγηση. @el
toolkit label: κριτική της (εκδήλωση) @el
toolkit definition: Μια εκδήλωση που χρησιμοποιείται ως η βάση για μια κριτική αξιολόγηση. @el
label: bírálata a következő megjelenési formának: @hu
definition: Hozzákapcsol egy művet egy megjelenési formához, amelyet egy kritikai kiértékelés alapjaként használnak. @hu
toolkit label: bírált megjelenési forma @hu
toolkit definition: Egy megjelenési forma, amelyet egy kritikai kiértékelés alapjaként használnak. @hu
label: kritiikki manifestaatiosta @fi
label: er kritikk av manifestasjon @no
definition: Relaterer et verk til en manifestasjon brukt som utgangspunkt for en kritisk evaluering. @no
label: is kritiek van manifestatie @nl
definition: Relateert een werk aan een manifestatie gebruikt als een basis voor een kritische beschouwing. @nl
toolkit label: kritiek van manifestatie @nl
toolkit definition: Een manifestatie gebruikt als een basis voor een kritische beschouwing. @nl
label: هو نقد لتجسيدة @ar
definition: يربط بين عمل وتجسيدة تستخدم كأساس لتقييم نقدي. @ar
toolkit label: نقد لتجسيدة @ar
toolkit definition: تجسيدة تستخدم كأساس لتقييم نقدي. @ar
label: arvustatud kehastus @et
definition: Seostab teose kehastusega, mis on aluseks kriitilisele hinnangule. @et
toolkit label: arvustatud kehastus @et
toolkit definition: Kehastus, mis on aluseks kriitilisele hinnangule. @et
label: è critica di manifestazione @it
definition: Correla un'opera a una manifestazione usata come base per una valutazione critica. @it
toolkit label: critica di manifestazione @it
toolkit definition: Manifestazione usata come base per una valutazione critica. @it
sub property of: is evaluation of manifestation
label: ir kritika manifestācijai @lv
definition: Sasaista darbu ar manifestāciju, kas izmantota par pamatu kritikai. @lv
toolkit label: kritika manifestācijai @lv
toolkit definition: Manifestācija, kas izmantota par pamatu kritikai. @lv
label: 是载体表现的批评 @zh-hans
definition: 将一种作品与被一种作品批评性评价的一种载体表现关联起来。 @zh-hans
toolkit label: 载体表现的批评 @zh-hans
toolkit definition: 被一种作品批评性评价的一种载体表现 @zh-hans
has subproperty: P10275
label: gösterimin eleştirisidir @tr
definition: Bir eseri, bir eser tarafından eleştirel olarak değerlendirilen bir gösterimle ilişkilendirir. @tr
toolkit label: gösterimin eleştirisi @tr
toolkit definition: Bir eser tarafından eleştirel olarak değerlendirilen gösterim. @tr

is analysis of manifestation
status: Published
type: Property
lexical alias: analysisOfManifestation.en
definition: Relates a work to a manifestation whose structure is described by a work.
domain: C10001
toolkit label: analysis of manifestation
toolkit definition: A manifestation whose structure is described by a work.
toolkit label: analyse d’une manifestation @fr
toolkit definition: Manifestation dont la structure est décrite par une œuvre. @fr
sub property of: is description of manifestation
toolkit label: análisis de (manifestación) @es
toolkit definition: Una manifestación que ha sido examinada para identificar sus componentes y sus relaciones. @es
instruction number: 23.5
label: er analyse af manifestation @da
definition: Relaterer et værk til en manifestation, hvis struktur er beskrevet af et værk. @da
toolkit label: analyse af manifestation @da
toolkit definition: Manifestation, hvis struktur er beskrevet af et værk. @da
definition: Met une œuvre en relation avec une manifestation dont la structure est décrite par une œuvre. @fr
label: là phân tích của (biểu thị) @vi
definition: Liên kết tác phẩm với biểu thị đã được kiểm tra để nhận dạng các thành phần và quan hệ của chúng. @vi
toolkit label: phân tích của (biểu thị) @vi
toolkit definition: Biểu thị đã được kiểm tra để nhận dạng các thành phần và quan hệ của chúng. @vi
label: ist Analyse von (Manifestation) @de
definition: Setzt ein Werk in Beziehung zu einer Manifestation, deren Struktur von einem Werk beschrieben wird. @de
toolkit label: Analyse von (Manifestation) @de
toolkit definition: Eine Manifestation, deren Struktur von einem Werk beschrieben wird. @de
label: est une analyse d’une manifestation @fr
definition: Liittää teoksen manifestaatioon, jonka rakennetta teos kuvaa. @fi
toolkit label: analyysi manifestaatiosta @fi
toolkit definition: Manifestaatio, jonka rakennetta teos kuvaa. @fi
toolkit label: analyse av manifestasjon @no
toolkit definition: En manifestasjon som har en struktur som beskrives av et verk. @no
label: és anàlisi d’una manifestació @ca
definition: Relaciona una obra amb una manifestació l’estructura de la qual és descrita per una obra. @ca
toolkit label: anàlisi d’una manifestació @ca
toolkit definition: Manifestació l’estructura de la qual és descrita per una obra. @ca
has element type: 2
label: είναι ανάλυση της (εκδήλωση) @el
definition: Συνδέει ένα έργο με μια εκδήλωση που έχει εξεταστεί για την ταύτιση των συστατικών του και των σχέσεων τους. @el
toolkit label: ανάλυση της (εκδήλωση) @el
toolkit definition: Μια εκδήλωση που έχει εξεταστεί για την ταύτιση των συστατικών του και των σχέσεών τους. @el
label: elemzése a következő megjelenési formának: @hu
definition: Hozzákapcsol egy művet egy megjelenési formához, amelynek alkotóelemeit leírja egy mű. @hu
toolkit label: elemzett megjelenési forma @hu
toolkit definition: Egy megjelenési forma, amelynek alkotóelemeit leírja egy mű. @hu
label: analyysi manifestaatiosta @fi
label: er analyse av manifestasjon @no
definition: Relaterer et verk til en manifestasjon som har en struktur som beskrives av et verk. @no
label: is analyse van manifestatie @nl
definition: Relateert een werk aan een manifestatie waarvan de structuur beschreven wordt door een werk. @nl
toolkit label: analyse van manifestatie @nl
toolkit definition: Een manifestatie waarvan de structuur beschreven wordt door een werk. @nl
label: هو تحليل لتجسيدة @ar
definition: يربط بين عمل وتجسيدة يوصف هيكلها في عمل. @ar
toolkit label: تحليل لتجسيدة @ar
toolkit definition: تجسيدة يوصف هيكلها في عمل. @ar
label: analüüsitud kehastus @et
definition: Seostab teose kehastusega, mille struktuuri on teoses kirjeldatud. @et
toolkit label: analüüsitud kehastus @et
toolkit definition: Kehastus, mille struktuuri on teoses kirjeldatud. @et
label: è analisi di manifestazione @it
definition: Correla un’opera a una manifestazione la cui struttura è descritta da un’opera. @it
toolkit label: analisi di manifestazione @it
toolkit definition: Manifestazione la cui struttura è descritta da un’opera. @it
label: ir analīze manifestācijai @lv
definition: Sasaista darbu ar manifestāciju, kas ir pārbaudīta, lai identificētu tās sastāvdaļas un to savstarpējās attiecības. @lv
toolkit label: ir analīze manifestācijai @lv
toolkit definition: Manifestācija, kas ir pārbaudīta, lai identificētu tās sastāvdaļas un to savstarpējās attiecības. @lv
label: 是载体表现的分析 @zh-hans
definition: 将一种作品与其结构被一种作品描述的一种载体表现关联起来。 @zh-hans
toolkit label: 载体表现的分析 @zh-hans
toolkit definition: 其结构被一种作品描述的一种载体表现 @zh-hans
has subproperty: P10272
label: gösterimin analizidir @tr
definition: Bir eseri, yapısının bir eser tarafından tanımlandığı bir gösterimle ilişkilendirir. @tr
toolkit label: gösterimin analizi @tr
toolkit definition: Yapısı bir eser tarafından tanımlanan bir gösterim. @tr

is evaluation of manifestation
status: Published
type: Property
lexical alias: evaluationOfManifestation.en
definition: Relates a work to a manifestation that is examined or judged by a work.
domain: C10001
toolkit label: evaluation of manifestation
toolkit definition: A manifestation that is examined or judged by a work.
toolkit label: évaluation d’une manifestation @fr
toolkit definition: Manifestation qui est examinée ou jugée par une œuvre. @fr
toolkit label: evaluación de (manifestación) @es
toolkit definition: Una manifestación que es examinada o juzgada. @es
instruction number: 23.5
label: er evaluering af manifestation @da
definition: Relaterer et værk til en manifestation, som er undersøgt eller bedømt. @da
toolkit label: evaluering af manifestation @da
toolkit definition: Manifestation, som er undersøgt eller bedømt. @da
definition: Met une œuvre en relation avec une manifestation qui est examinée ou jugée par une œuvre. @fr
label: là đánh giá của (biểu thị) @vi
definition: Liên kết tác phẩm với biểu thị được kiểm tra hoặc đánh giá. @vi
toolkit label: đánh giá của (biểu thị) @vi
toolkit definition: Biểu thị được kiểm tra hoặc đánh giá. @vi
label: ist Evaluierung von (Manifestation) @de
definition: Setzt ein Werk in Beziehung zu einer Manifestation, die untersucht oder beurteilt wird. @de
toolkit label: Evaluierung von (Manifestation) @de
toolkit definition: Eine Manifestation, die untersucht oder beurteilt wird. @de
label: est une évaluation d’une manifestation @fr
definition: Liittää teoksen manifestaatioon, jota on tutkittu tai arvioitu. @fi
toolkit label: arviointi manifestaatiosta @fi
toolkit definition: Manifestaatio, jota on tutkittu tai arvioitu. @fi
toolkit label: evaluering av manifestasjon @no
toolkit definition: En manifestasjon som utforskes eller vurderes. @no
label: és avaluació d’una manifestació @ca
definition: Relaciona una obra amb una manifestació que és examinada o jutjada per una obra. @ca
toolkit label: avaluació d’una manifestació @ca
toolkit definition: Manifestació que és examinada o jutjada per una obra. @ca
has element type: 2
label: είναι αξιολόγηση της (εκδήλωση) @el
definition: Συνδέει ένα έργο με μια εκδήλωση που εξετάζεται ή κρίνεται. @el
toolkit label: αξιολόγηση της (εκδήλωση) @el
toolkit definition: Μια εκδήλωση που εξετάζεται ή κρίνεται. @el
label: értékelése a következő megjelenési formának: @hu
definition: Hozzákapcsol egy művet egy megjelenési formához, amelyet elemeznek és megítélnek. @hu
toolkit label: értékelt megjelenési forma @hu
toolkit definition: Egy megjelenési forma, amelyet elemeznek és megítélnek. @hu
label: arviointi manifestaatiosta @fi
label: er evaluering av manifestasjon @no
definition: Relaterer et verk til en manifestasjon som utforskes eller vurderes. @no
label: is beschouwing van manifestatie @nl
definition: Relateert een werk aan een manifestatie die onderzocht of beoordeeld wordt. @nl
toolkit label: beschouwing van manifestatie @nl
toolkit definition: Een manifestatie die onderzocht of beoordeeld wordt. @nl
label: هو تقييم لتجسيدة @ar
definition: يربط بين عمل وتجسيدة يتم فحصها أو الحكم عليها. @ar
toolkit label: تقييم لتجسيدة @ar
toolkit definition: تجسيدة يتم فحصها أو الحكم عليها. @ar
label: hinnang kehastusele @et
definition: Seostab teose kehastusega, mida on kontrollitud või hinnatud. @et
toolkit label: hinnang kehastusele @et
toolkit definition: Kehastus, mida on kontrollitud või hinnatud. @et
label: è valutazione di manifestazione @it
definition: Correla un’opera a una manifestazione che è esaminata o valutata. @it
toolkit label: valutazione di manifestazione @it
toolkit definition: Manifestazione che è esaminata o valutata. @it
sub property of: has subject manifestation
label: ir novērtējums manifestācijai @lv
definition: Sasaista darbu ar manifestāciju, kas ir pārbaudīta vai vērtēta. @lv
toolkit label: ir novērtējums manifestācijai @lv
toolkit definition: Manifestācija, kas ir pārbaudīta vai vērtēta. @lv
label: 是载体表现的评价 @zh-hans
definition: 将一种作品与被一种作品检查或评判的一种载体表现关联起来。 @zh-hans
toolkit label: 载体表现的评价 @zh-hans
toolkit definition: 被一种作品检查或评判的一种载体表现 @zh-hans
has subproperty: is critique of manifestation
has subproperty: is review of manifestation
has subproperty: P10273
label: gösterimin değerlendirmesidir @tr
definition: Bir eseri, bir eser tarafından incelenen veya değerlendirilen bir gösterimle ilişkilendirir. @tr
toolkit label: gösterimin değerlendirilmesi @tr
toolkit definition: Bir eser tarafından incelenen veya değerlendirilen bir gösterim. @tr

is description of manifestation
status: Published
type: Property
lexical alias: descriptionOfManifestation.en
definition: Relates a work to a manifestation that is described by a work.
domain: C10001
toolkit label: description of manifestation
toolkit definition: A manifestation that is described by a work.
toolkit label: description d’une manifestation @fr
toolkit definition: Manifestation qui est décrite par une œuvre. @fr
sub property of: has subject manifestation
toolkit label: descripción de (manifestación) @es
toolkit definition: Una manifestación descrita por una obra que describe. @es
instruction number: 23.5
label: er beskrivelse af manifestation @da
definition: Relaterer et værk til en manifestation, som er beskrevet af et værk. @da
toolkit label: beskrivelse af manifestation @da
toolkit definition: Manifestation, som er beskrevet af et værk. @da
definition: Met une œuvre en relation avec une manifestation qui est décrite par une œuvre. @fr
label: là mô tả của (biểu thị) @vi
definition: Liên kết tác phẩm với biểu thị được mô tả bởi tác phẩm mô tả. @vi
toolkit label: mô tả của (biểu thị) @vi
toolkit definition: Biểu thị được mô tả bởi tác phẩm mô tả. @vi
label: ist Beschreibung von (Manifestation) @de
definition: Setzt ein Werk in Beziehung zu einer Manifestation, die von einem Werk beschrieben wird. @de
toolkit label: Beschreibung von (Manifestation) @de
toolkit definition: Eine Manifestation, die von einem Werk beschrieben wird. @de
label: est une description d’une manifestation @fr
definition: Liittää teoksen manifestaatioon, jota teos kuvaa. @fi
toolkit label: kuvaus manifestaatiosta @fi
toolkit definition: Manifestaatio, jota teos kuvaa. @fi
toolkit label: beskrivelse av manifestasjon @no
toolkit definition: En manifestasjon som beskrives av et verk. @no
label: és descripció d’una manifestació @ca
definition: Relaciona una obra amb una manifestació que és descrita per una obra. @ca
toolkit label: descripció d’una manifestació @ca
toolkit definition: Manifestació que és descrita per una obra. @ca
has element type: 2
label: είναι περιγραφή της (εκδήλωση) @el
definition: Συνδέει ένα έργο με μια εκδήλωση που περιγράφεται σε ένα περιγραφικό έργο. @el
toolkit label: περιγραφή της (εκδήλωση) @el
toolkit definition: Μια εκδήλωση που περιγράφεται σε ένα περιγραφικό έργο. @el
label: leírása a következő megjelenési formának: @hu
definition: Hozzákapcsol egy művet egy megjelenési formához, amelyet egy mű leír. @hu
toolkit label: leírt megjelenési forma @hu
toolkit definition: Egy megjelenési forma, amelyet egy mű leír. @hu
sub property of: is description of RDA entity
label: kuvaus manifestaatiosta @fi
label: er beskrivelse av manifestasjon @no
definition: Relaterer et verk til en manifestasjon som beskrives av et verk. @no
label: is beschrijving van manifestatie @nl
definition: Relateert een werk aan een manifestatie die beschreven wordt door een werk. @nl
toolkit label: beschrijving van manifestatie @nl
toolkit definition: Een manifestatie die beschreven wordt door een werk. @nl
label: هو وصف لتجسيدة @ar
definition: يربط بين عمل وتجسيدة موصوفة في عمل. @ar
toolkit label: وصف لتجسيدة @ar
toolkit definition: تجسيدة موصوفة في عمل. @ar
label: kirjeldatud kehastus @et
definition: Seostab teose kehastusega, mida teoses on kirjeldatud. @et
toolkit label: kirjeldatud kehastus @et
toolkit definition: Kehastus, mida teoses on kirjeldatud. @et
label: è descrizione di manifestazione @it
definition: Correla un’opera a una manifestazione che è descritta da un’opera. @it
toolkit label: descrizione di manifestazione @it
toolkit definition: Manifestazione che è descritta da un’opera. @it
label: ir apraksts manifestācijai @lv
definition: Sasaista darbu ar manifestāciju, kas ir aprakstīta darbā. @lv
toolkit label: ir apraksts manifestācijai @lv
toolkit definition: Manifestācija, kas ir aprakstīta darbā. @lv
label: 是载体表现的描述 @zh-hans
definition: 将一种作品与被一种作品描述的一种载体表现关联起来。 @zh-hans
toolkit label: 载体表现的描述 @zh-hans
toolkit definition: 被一种作品描述的一种载体表现 @zh-hans
has subproperty: is commentary on manifestation
has subproperty: is analysis of manifestation
has subproperty: is metadata description of manifestation
has subproperty: P10271
label: gösterimin tanımıdır @tr
definition: Bir eseri, bir eser tarafından tanımlanan bir gösterimle ilişkilendirir. @tr

is review of manifestation
status: Published
type: Property
lexical alias: reviewOfManifestation.en
definition: Relates a work to a manifestation that is briefly evaluated by a work.
domain: C10001
toolkit label: review of manifestation
toolkit definition: A manifestation that is briefly evaluated by a work.
toolkit label: recension d’une manifestation @fr
toolkit definition: Manifestation qui est brièvement évaluée par une œuvre. @fr
toolkit label: reseña de (manifestación) @es
toolkit definition: Una manifestación usada como base para una evaluacion breve. @es
instruction number: 23.5
label: er anmeldelse af manifestation @da
definition: Relaterer et værk til en manifestation, som anvendes som grundlag for en kortfattet evaluering. @da
toolkit label: anmeldelse af manifestation @da
toolkit definition: Manifestation, som anvendes som grundlag for en kortfattet evaluering. @da
definition: Met une œuvre en relation avec une manifestation qui est brièvement évaluée par une œuvre. @fr
label: là tổng quan của (biểu thị) @vi
definition: Liên kết tác phẩm với biểu thị được dùng như là cơ sở cho đánh giá ngắn gọn. @vi
toolkit label: tổng quan của (biểu thị) @vi
toolkit definition: Biểu thị được dùng như là cơ sở cho đánh giá ngắn gọn. @vi
label: ist Rezension von (Manifestation) @de
definition: Setzt ein Werk in Beziehung zu einer Manifestation, die als Grundlage für eine kurze Untersuchung verwendet wird. @de
toolkit label: Rezension von (Manifestation) @de
toolkit definition: Eine Manifestation, die als Grundlage für eine kurze Untersuchung verwendet wird. @de
label: est une recension d’une manifestation @fr
definition: Liittää teoksen lyhyen arvioinnin perustana käytettyyn manifestaatioon. @fi
toolkit label: arvostelu manifestaatiosta @fi
toolkit definition: Lyhyen arvioinnin perustana käytetty manifestaatio. @fi
toolkit label: anmeldelse av manifestasjon @no
toolkit definition: En manifestasjon brukt som utgangspunkt for en kortfattet evaluering. @no
label: és revisió d’una manifestació @ca
definition: Relaciona una obra amb una manifestació que és avaluada breument per una obra. @ca
toolkit label: revisió d’una manifestació @ca
toolkit definition: Manifestació que és avaluada breument per una obra. @ca
has element type: 2
label: είναι εξέταση της (εκδήλωση) @el
definition: Συνδέει ένα έργο με μια εκδήλωση που χρησιμοποιείται ως η βάση για μια σύντομη αξιολόγηση. @el
toolkit label: εξέταση της (εκδήλωση) @el
toolkit definition: Μια εκδήλωση που χρησιμοποιείται ως η βάση για μια σύντομη αξιολόγηση. @el
label: szemlézi a következő megjelenési formát @hu
definition: Hozzákapcsol egy művet egy megjelenési formához, amelyet egy rövid kiértékelés alapjaként használnak. @hu
toolkit label: szemlézett megjelenési forma @hu
toolkit definition: Egy megjelenési forma, amelyet egy rövid kiértékelés alapjaként használnak. @hu
label: arvostelu manifestaatiosta @fi
label: er anmeldelse av manifestasjon @no
definition: Relaterer et verk til en manifestasjon brukt som utgangspunkt for en kortfattet evaluering. @no
label: is recensie van manifestatie @nl
definition: Relateert een werk aan een manifestatie gebruikt als een basis voor een korte beschouwing. @nl
toolkit label: recensie van manifestatie @nl
toolkit definition: Een manifestatie gebruikt als een basis voor een korte beschouwing. @nl
label: هو مراجعة لتجسيدة @ar
definition: يربط بين عمل وتجسيدة تستخدم كأساس لتقييم موجز. @ar
toolkit label: مراجعة لتجسيدة @ar
toolkit definition: تجسيدة تستخدم كأساس لتقييم موجز. @ar
label: ülevaade kehastusest @et
definition: Seostab teose kehastusega, mis on lühihinnangu aluseks. @et
toolkit label: ülevaade kehastusest @et
toolkit definition: Kehastus, mis on lühihinnangu aluseks. @et
label: è recensione di manifestazione @it
definition: Correla un'opera a una manifestazione usata come base per una breve valutazione. @it
toolkit label: recensione di manifestazione @it
toolkit definition: Manifestazione usata come base per una breve valutazione. @it
sub property of: is evaluation of manifestation
label: ir recenzija manifestācijai @lv
definition: Sasaista darbu ar manifestāciju, kas izmantota par pamatu īsam novērtējumam. @lv
toolkit label: recenzija manifestācijai @lv
toolkit definition: Manifestācija, kas izmantota par pamatu īsam novērtējumam. @lv
label: 是载体表现的评论 @zh-hans
definition: 将一种作品与被一种作品简要评价的一种载体表现关联起来。 @zh-hans
toolkit label: 载体表现的评论 @zh-hans
toolkit definition: 被一种作品简要评价的一种载体表现 @zh-hans
has subproperty: P10274
label: gösterimin incelemesidir @tr
definition: Bir eseri, bir eser tarafından kısaca değerlendirilen bir gösterimle ilişkilendirir. @tr
toolkit label: gösterimin incelenmesi @tr
toolkit definition: Bir esertarafından kısaca değerlendirilen bir gösterim. @tr

is adapted as motion picture work
status: Published
definition: Relates a work to a work that is a motion picture that is based on another work.
type: Property
domain: C10001
sub property of: is adapted as work
lexical alias: adaptedAsMotionPictureWork.en
toolkit label: adapted as motion picture work
toolkit definition: A work that is a motion picture that is based on another work.
toolkit label: adapté en film (œuvre) @fr
toolkit definition: Œuvre cinématographique qui est basée sur une autre œuvre. @fr
toolkit label: adaptada como película cinematográfica (obra) @es
toolkit definition: Una película cinematográfica basada en la obra fuente. @es
instruction number: 24.5
label: er bearbejdet til filmværk @da
definition: Relaterer et værk til et filmværk, som er baseret på et andet værk. @da
toolkit label: bearbejdet til filmværk @da
toolkit definition: Filmværk, som er baseret på et andet værk. @da
definition: Met une œuvre en relation avec une œuvre cinématographique qui est basée sur une autre œuvre. @fr
label: được phỏng theo như là điện ảnh (tác phẩm) @vi
definition: Liên kết tác phẩm với phim điện ảnh được dựa trên tác phẩm nguồn. @vi
toolkit label: được phỏng theo như là điện ảnh (tác phẩm) @vi
toolkit definition: Phim điện ảnh được dựa trên tác phẩm nguồn. @vi
label: ist bearbeitet als Film (Werk) @de
definition: Setzt ein Werk in Beziehung zu einem Filmwerk, das auf einem anderen Werk basiert. @de
toolkit label: Bearbeitet als Film (Werk) @de
toolkit definition: Ein Filmwerk, das auf einem anderen Werk basiert. @de
label: est adapté en film (œuvre) @fr
definition: Liittää teoksen elokuvateokseen, joka perustuu toiseen teokseen. @fi
toolkit label: elokuvaversio (teos) @fi
toolkit definition: Elokuvateos, joka perustuu toiseen teokseen. @fi
toolkit label: bearbeidet som spillefilm (verk) @no
toolkit definition: Et spillefilmverk som er basert på et annet verk. @no
label: és adaptat com a obra de pel·lícula cinematogràfica @ca
definition: Relaciona una obra amb una obra que és una pel·lícula cinematogràfica que es basa en una altra obra. @ca
toolkit label: adaptat com a obra de pel·lícula cinematogràfica @ca
toolkit definition: Obra que és una pel·lícula cinematogràfica que es basa en una altra obra. @ca
has element type: 2
label: είναι προσαρμοσμένο ως κινηματογραφική ταινία (έργο) @el
definition: Συνδέει ένα έργο με μια κινηματογραφική ταινία βασισμένη σε ένα έργο-πηγή. @el
toolkit label: προσαρμοσμένο ως κινηματογραφική ταινία (έργο) @el
toolkit definition: Μια κινηματογραφική ταινία βασισμένη σε ένα έργο-πηγή. @el
label: mozgóképmű-feldolgozása a következő: @hu
definition: Hozzákapcsol egy művet egy mozgóképműhöz, amely egy másik művön alapul. @hu
toolkit label: mozgóképmű-feldolgozása: @hu
toolkit definition: Egy mozgóképmű, amely egy másik művön alapul. @hu
label: elokuvaversio (teos) @fi
label: er bearbeidet som spillefilm (verk) @no
definition: Relaterer et verk til et spillefilmverk som er basert på et annet verk. @no
label: is bewerkt als speelfilmwerk @nl
definition: Relateert een werk aan een speelfilmwerk dat is gebaseerd op een ander werk. @nl
toolkit label: bewerkt als speelfilmwerk @nl
toolkit definition: Een speelfilmwerk dat is gebaseerd op een ander werk. @nl
label: هو معالج كعمل فيلم سينمائي @ar
definition: يربط عمل بعمل فيلم سينمائي يعتمد على عمل آخر. @ar
toolkit label: معالج كعمل فيلم سينمائي @ar
toolkit definition: عمل فيلم سينمائي مبني على عمل آخر. @ar
label: adapteeritud filmiteosena @et
definition: Seostab teose filmiteosega, mis põhineb teisel teosel. @et
toolkit label: adapteeritud filmiteosena @et
toolkit definition: Filmiteos, mis põhineb teisel teosel. @et
label: è adattata come opera cinematografica @it
definition: Correla un’opera a un'opera cinematografica basata su un’altra opera. @it
toolkit label: adattata come come opera cinematografica @it
toolkit definition: Opera cinematografica basata su un’altra opera. @it
label: ir adaptēts kā kinofilma (darbs) @lv
definition: Sasaista darbu ar kinofilmu, kas veidota pēc cita darba. @lv
toolkit label: adaptēts kā darbs: kinofilma @lv
toolkit definition: Kinofilma veidota pēc cita darba. @lv
label: 被改编成电影作品 @zh-hans
definition: 将一种作品与基于另一种作品的一种动态图像作品关联起来。 @zh-hans
toolkit label: 被改编成电影作品 @zh-hans
toolkit definition: 基于另一种作品的一种动态图像作品 @zh-hans
has subproperty: P10025
label: sinema filmi eseri olarak uyarlanmıştır @tr
definition: Bir eseri, başka bir eserden uyarlanan bir eser olan sinema filmi olan bir eserle ilişkilendirir. @tr
toolkit label: sinema filmi eseri olarak uyarlanan @tr
toolkit definition: Başka bir eserden uyarlanan bir sinema filmi olan bir eser. @tr

has motion picture music work
status: Published
definition: Relates a work to A work that is a musical work that complements a work that is a motion picture.
type: Property
domain: C10001
sub property of: has music work
lexical alias: motionPictureMusicWork.en
toolkit label: motion picture music work
toolkit definition: A work that is a musical work that complements a work that is a motion picture.
toolkit label: musique de film (œuvre) @fr
toolkit definition: Œuvre musicale qui complète une œuvre cinématographique. @fr
toolkit label: música de película cinematográfica @es
toolkit definition: Una obra musical que es utlizada en una película cinematográfica @es
instruction number: 24.5
label: har filmmusikværk @da
definition: Relaterer et værk til et musikværk, som komplementerer et værk, som er en spillefilm. @da
toolkit label: filmmusikværk @da
toolkit definition: Musikværk, som komplementerer et værk, som er en spillefilm. @da
definition: Met une œuvre en relation avec une œuvre musicale qui complète une œuvre cinématographique. @fr
label: là âm nhạc điện ảnh (tác phẩm) @vi
definition: Liên kết tác phẩm với tác phẩm sử dụng tác phẩm âm nhạc trong phim điện ảnh. @vi
toolkit label: âm nhạc điện ảnh (tác phẩm) @vi
toolkit definition: Tác phẩm sử dụng tác phẩm âm nhạc trong phim điện ảnh. @vi
label: ist Filmmusik (Werk) @de
definition: Setzt ein Werk in Beziehung zu einem Musikwerk, das ein Filmwerk ergänzt. @de
toolkit label: Filmmusik (Werk) @de
toolkit definition: Ein Musikwerk, das ein Filmwerk ergänzt. @de
label: a pour musique de film (œuvre) @fr
definition: Liittää teoksen musiikkiteokseen, joka täydentää teosta, joka on elokuva. @fi
toolkit label: elokuvamusiikki (teos) @fi
toolkit definition: Musiikkiteos, joka täydentää teosta, joka on elokuva. @fi
toolkit label: filmmusikk (verk) @no
toolkit definition: Et musikalsk verk som utfyller en spillefilm. @no
label: té com a obra de música de pel·lícula cinematogràfica @ca
definition: Relaciona una obra amb una obra que és una obra musical que complementa una obra que és una pel·lícula cinematogràfica. @ca
toolkit label: obra de música de pel·lícula cinematogràfica @ca
toolkit definition: Obra que és una obra musical que complementa una obra que és una pel·lícula cinematogràfica. @ca
has element type: 2
label: είναι μουσική κινηματογράφου (έργο) @el
definition: Συνδέει ένα έργο με ένα μουσικό έργο το οποίο χρησιμοποιείται σε μια κινηματογραφική ταινία. @el
toolkit label: μουσική κινηματογράφου (έργο) @el
toolkit definition: Ένα μουσικό έργο το οποίο χρησιμοποιείται σε μια κινηματογραφική ταινία. @el
label: mozgókép zenéje a következő: @hu
definition: Hozzákapcsol egy művet egy zeneműhöz, amely kiegészít egy mozgóképművet. @hu
toolkit label: filmzenemű @hu
toolkit definition: Egy zenemű, amely kiegészít egy mozgóképművet. @hu
label: elokuvamusiikki (teos) @fi
label: har filmmusikk (verk) @no
definition: Relaterer et verk til et musikalsk verk som utfyller en spillefilm. @no
label: heeft speelfilmmuziek-werk @nl
definition: Relateert een werk aan een muziekwerk dat een werk complementeert dat een speelfilm is. @nl
toolkit label: speelfilm-muziekwerk @nl
toolkit definition: Een muziekwerk dat een werk complementeert dat een speelfilm is. @nl
label: له عمل موسيقى لفيلم سينمائي @ar
definition: يربط عمل بعمل موسيقي يكمل عملًا عبارة عن فيلم سينمائي. @ar
toolkit label: عمل موسيقى لفيلم سينمائي @ar
toolkit definition: عمل موسيقي يكمل عملًا عبارة عن فيلم سينمائي. @ar
label: filmimuusika (teos) @et
definition: Seostab teose muusikateosega, mis täiendab filmiteost. @et
toolkit label: filmimuusika (teos) @et
toolkit definition: Muusikateos, mis täiendab filmiteost. @et
label: ha come musica per film opera @it
definition: Correla un’opera a un’opera musicale che completa un’opera che è un film. @it
toolkit label: musica per film opera @it
toolkit definition: Opera musicale che completa un’opera che è un film. @it
label: darbs: kinomūzika @lv
definition: Sasaista darbu ar mūzikas darbu, kas papildina darbu, kas ir kinofilma. @lv
toolkit label: darbs: kinomūzika @lv
toolkit definition: Mūzikas darbs, kas papildina darbu, kas ir kinofilma. @lv
label: 有电影音乐作品 @zh-hans
definition: 将一种作品与作为一种音乐作品并补充作为一种电影的一种作品的一种作品关联起来。 @zh-hans
toolkit label: 电影音乐作品 @zh-hans
toolkit definition: 作为一种音乐作品并补充作为一种电影的一种作品的一种作品 @zh-hans
has subproperty: P10246
label: sinema filmi müziği eseri ile ilişkilidir @tr
definition: Bir eseri, sinema filmi olan bir eseri tamamlayan bir müzik eseri olan eserle ilişkilendirir. @tr
toolkit label: sinema filmi müziği çalışması @tr
toolkit definition: Bir sinema filmini tamamlayan bir müzik eseri olan bir eser @tr

is adaptation of work
status: Published
definition: Relates a work to a work that is modified for a purpose, use, or medium other than that for which it was originally intended.
type: Property
domain: C10001
sub property of: has source work
lexical alias: adaptationOfWork.en
scope note: This element applies to changes in form or to works completely rewritten in the same form.
toolkit label: adaptation of work
toolkit definition: A work that is modified for a purpose, use, or medium other than that for which it was originally intended.
toolkit label: adaptation d’une œuvre @fr
toolkit definition: Œuvre qui est modifiée pour une fin, une utilisation ou un mode d’expression autre que celui auquel elle était destinée à l’origine. @fr
toolkit label: adaptación de (obra) @es
toolkit definition: Una obra que ha sido modificada para un propósito, uso o medio diferente de los previstos originalmente. @es
instruction number: 24.5
label: er bearbejdelse af værk @da
definition: Relaterer et værk til et værk, som er tilpasset til et andet formål, en anden brug eller et andet medium end det, det oprindeligt var beregnet til. @da
scope note: Dette element gælder for ændringer i form eller for værker, som er omskrevet fuldstændigt i samme form. @da
toolkit label: bearbejdelse af værk @da
toolkit definition: Værk, som er tilpasset til et andet formål, en anden brug eller et andet medium end det, det oprindeligt var beregnet til. @da
definition: Met une œuvre en relation avec une œuvre qui est modifiée pour une fin, une utilisation ou un mode d’expression autre que celui auquel elle était destinée à l’origine. @fr
label: là phỏng theo của (tác phẩm) @vi
definition: Liên kết tác phẩm với tác phẩm đã được sửa đổi cho mục đích, sử dụng, hoặc phương tiện khác với ý định nguyên gốc. @vi
scope note: Nối quan hệ này áp dụng đối với thay đổi về hình thái hoặc đối cới tác phẩm được viết lại toàn bộ dưới cùng hình thái. @vi
toolkit label: phỏng theo của (tác phẩm) @vi
toolkit definition: Tác phẩm đã được sửa đổi cho mục đích, sử dụng, hoặc phương tiện khác với ý định nguyên gốc. @vi
label: ist Bearbeitung von (Werk) @de
definition: Setzt ein Werk in Beziehung zu einem Werk, das für einen anderen Zweck, eine andere Nutzung oder ein anderes Medium, als den/die/das, wofür es ursprünglich konzipiert wurde, bearbeitet ist. @de
scope note: Dies Element bezieht sich auf Änderungen der Form oder auf Werke, die in derselben Form vollständig neu geschrieben sind. @de
toolkit label: Bearbeitung von (Werk) @de
toolkit definition: Ein Werk, das für einen anderen Zweck, eine andere Nutzung oder ein anderes Medium, als den/die/das, wofür es ursprünglich konzipiert wurde, bearbeitet ist. @de
label: est une adaptation d’une œuvre @fr
definition: Liittää teoksen teokseen, jota on muokattu jotain muuta kuin alkuperäistä tarkoitusta, käyttöä tai esitysmuotoa varten. @fi
toolkit label: mukaelma teoksesta @fi
toolkit definition: Teos, jota on muokattu jotain muuta kuin alkuperäistä tarkoitusta, käyttöä tai esitysmuotoa varten. @fi
toolkit label: bearbeidelse av verk @no
toolkit definition: Et verk som er bearbeidet til et annet formål, bruksområde eller medium enn det opprinnelig var ment for. @no
label: és adaptació d’una obra @ca
definition: Relaciona una obra amb una obra que es modifica per a un objectiu, un ús o un suport diferent d’aquell per al qual es va concebre originalment. @ca
scope note: Aquest element s’aplica a canvis en la forma o a obres que han estat reescrites completament en la mateixa forma. @ca
toolkit label: adaptació d’una obra @ca
toolkit definition: Obra que es modifica per a un objectiu, un ús o un suport diferent d’aquell per al qual es va concebre originalment. @ca
scope note: Cette relation s’applique aux changements dans la forme ou aux œuvres complètement réécrites dans la même forme. @fr
has element type: 2
label: είναι προσαρμογή του (έργο) @el
definition: Συνδέει ένα έργο με ένα έργο το οποίο έχει τροποποιηθεί για έναν σκοπό, μια χρήση ή ένα μέσο άλλο από εκείνο για το οποίο αρχικά προοριζόταν. @el
scope note: Αυτή η σχέση βρίσκει εφαρμογή στις αλλαγές στη μορφή ή στα έργα που έχουν ξαναγραφτεί ολοκληρωτικά στην ίδια μορφή. @el
toolkit label: προσαρμογή του (έργο) @el
toolkit definition: Ένα έργο το οποίο έχει τροποποιηθεί για έναν σκοπό, μια χρήση ή ένα μέσο άλλο από εκείνο για το οποίο αρχικά προοριζόταν. @el
label: adaptációja a következő műnek: @hu
definition: Hozzákapcsol egy művet egy műhöz, amelyet olyan célra, használatra vagy médiumra módosítottak, amely eltér az eredetileg tervezettől @hu
scope note: mű adaptációja @hu
toolkit label: Egy mű, amelyet olyan célra, használatra vagy médiumra módosítottak, amely eltér az eredetileg tervezettől @hu
toolkit definition: Ez az elem érvényes a formai változásokra, vagy az ugyanabban a formában teljesen újraírt művekre. @hu
scope note: Tämä elementti soveltuu muutoksiin muodossa tai samassa muodossa kokonaan uudelleenmuokattuihin teoksiin. @fi
label: mukaelma teoksesta @fi
label: er bearbeidelse av verk @no
definition: Relaterer et verk til et verk som er bearbeidet til et annet formål, bruksområde eller medium enn det opprinnelig var ment for. @no
scope note: Dette elementet gjelder endringer i form eller eller i verk som er totalt omskrevet i samme form. @no
label: is bewerking van werk @nl
definition: Relateert een werk aan een werk dat aangepast is voor een doel, gebruik of medium anders dan dat waarvoor het oorspronkelijk bedoeld was. @nl
scope note: Dit element is over het algemeen van toepassing op veranderingen in vorm of op werken die compleet herschreven zijn in dezelfde vorm. @nl
toolkit label: bewerking van werk @nl
toolkit definition: Een werk dat aangepast is voor een doel, gebruik of medium anders dan dat waarvoor het oorspronkelijk bedoeld was. @nl
label: هو تكييف لعمل @ar
definition: يربط عمل بعمل معدَّل لغرض، أو استخدام، أو وسيلة أخرى غير ما كان معنيًّا في الأصل. @ar
scope note: ينطبق هذا العنصر على التغييرات في الشكل أو في الأعمال المعاد كتابتها بالكامل بنفس الشكل. @ar
toolkit label: تكييف لعمل @ar
toolkit definition: عمل معدَّل لغرض، أو استخدام، أو وسيلة أخرى غير ما كان معنيًّا في الأصل. @ar
label: adapteeritud teosest @et
definition: Seostab teose teosega, mida on muudetud algupärasest erineva otstarbe, kasutusviisi või meediumi jaoks. @et
scope note: Elementi rakendatakse muutuste puhul vormis või teoste puhul, mis on täielikult ümber kirjutatud samas vormis. @et
toolkit label: adapteeritud teosest @et
toolkit definition: Teos, mida on muudetud algupärasest erineva otstarbe, kasutusviisi või meediumi jaoks. @et
label: è adattamento di opera @it
definition: Correla un’opera a un’opera che è modificata per uno scopo, utilizzo o mezzo diversi da quelli per cui era stata pensata in origine. @it
scope note: Questo elemento si applica ai cambiamenti di forma o a opere completamente riscritte nella stessa forma . @it
toolkit label: adattamento di opera @it
toolkit definition: Opera modificata per uno scopo, utilizzo o mezzo diversi da quelli per cui era stata pensata in origine. @it
label: ir adaptētais darbs @lv

is augmented by work
status: Published
definition: Relates a work to a work that adds to the content of a predominant work.
type: Property
domain: C10001
sub property of: has related work of work
lexical alias: augmentedByWork.en
toolkit label: augmented by work
toolkit definition: A work that adds to the content of a predominant work.
toolkit label: augmenté par une œuvre @fr
toolkit definition: Œuvre qui ajoute au contenu d’une œuvre prédominante. @fr
toolkit label: ampliada por (obra) @es
toolkit definition: Una obra que agrega al contenido de la obra principal. @es
instruction number: 24.5
label: er beriget med værk @da
definition: Relaterer et værk til et værk, som føjer noget til et fremtrædende værks indhold. @da
toolkit label: beriget med værk @da
toolkit definition: Værk, som føjer noget til et fremtrædende værks indhold. @da
definition: Met une œuvre en relation avec une œuvre qui ajoute au contenu d’une œuvre prédominante. @fr
label: được gia tăng bởi (tác phẩm) @vi
definition: Liên kết tác phẩm với tác phẩm têm vào nội dung của tác phẩm nổi trội. @vi
toolkit label: được gia tăng bởi (tác phẩm) @vi
toolkit definition: Tác phẩm têm vào nội dung của tác phẩm nổi trội. @vi
label: ist erweitert durch (Werk) @de
definition: Setzt ein Werk in Beziehung zu einem Werk, das den Inhalt eines Hauptwerks ergänzt. @de
toolkit label: Erweitert durch (Werk) @de
toolkit definition: Ein Werk, das den Inhalt eines Hauptwerks ergänzt. @de
label: est augmenté par une œuvre @fr
definition: Liittää teoksen teokseen, joka täydentää pääteoksen sisältöä. @fi
toolkit label: laajennettu teoksella @fi
toolkit definition: Teos, joka täydentää pääteoksen sisältöä. @fi
toolkit label: utvidet av verk @no
toolkit definition: Et verk som utvider innholdet av et mer fremtredende verk. @no
label: és augmentat per una obra @ca
definition: Relaciona una obra amb una obra que afegeix el contingut d’una obra predominant. @ca
toolkit label: augmentat per una obra @ca
toolkit definition: Obra que afegeix el contingut d’una obra predominant. @ca
has element type: 2
label: είναι επαυξημένο από (έργο) @el
definition: Συνδέει ένα έργο με ένα έργο, το οποίο αυξάνει το περιεχόμενο του κύριου έργου. @el
toolkit label: επαυξημένο από (έργο) @el
toolkit definition: Ένα έργο το οποίο αυξάνει το περιεχόμενο του κύριου έργου. @el
label: bővíti a következő mű: @hu
definition: Hozzákapcsol egy művet egy műhöz, amely egy domináns mű tartalmát gyarapítja. @hu
toolkit label: bővítő mű @hu
toolkit definition: Egy mű, amely egy domináns mű tartalmát gyarapítja. @hu
label: laajennettu teoksella @fi
label: er utvidet av verk @no
definition: Relaterer et verk til et verk som utvider innholdet av et mer fremtredende verk. @no
label: is aangevuld door werk @nl
definition: Relateert een werk aan een werk dat toevoegt aan de content van een hoofdwerk. @nl
toolkit label: aangevuld door werk @nl
toolkit definition: Een werk dat toevoegt aan de content van een hoofdwerk. @nl
label: هو مزيد بعمل @ar
definition: يربط عمل بعمل يضيف إلى محتوى عمل سائد. @ar
toolkit label: مزيد بعمل @ar
toolkit definition: عمل يضيف إلى محتوى عمل سائد. @ar
label: laiendatud teosega @et
definition: Seostab teose teosega, mis lisab midagi dominantse teose sisule. @et
toolkit label: laiendatud teosega @et
toolkit definition: Teos, mis lisab midagi dominantse teose sisule. @et
label: è ampliata da opera @it
definition: Correla un’opera a un’opera che aumenta il contenuto di un’opera predominante. @it
toolkit label: ampliata da opera @it
toolkit definition: Opera che amplia il contenuto di un’opera predominante. @it
label: darba papildinājums @lv
definition: Sasaista darbu ar darbu, kas pievienots pamatdarba saturam. @lv
toolkit label: darbs: papildinājums @lv
toolkit definition: Darbs, kas pievienots pamatdarba saturam. @lv
label: 被作品附增 @zh-hans
definition: 将一种作品与增加到一种主要作品之内容中去的一种作品关联起来。 @zh-hans
toolkit label: 被作品附增 @zh-hans
toolkit definition: 增加到一种主要作品之内容中去的一种作品 @zh-hans
has subproperty: has appendix work
has subproperty: has index work (Deprecated)
has subproperty: has cadenza work
has subproperty: has catalogue work (Deprecated)
has subproperty: has finding aid work (Deprecated)
has subproperty: has concordance work (Deprecated)
has subproperty: has errata work

is succeeded by work
status: Published
definition: Relates a work to a work whose chronological coverage is after that of another work.
type: Property
domain: C10001
sub property of: has transformation by policy
lexical alias: succeededByWork.en
toolkit label: succeeded by work
toolkit definition: A work whose chronological coverage is after that of another work.
toolkit label: suivi d’une œuvre @fr
toolkit definition: Œuvre dont la couverture chronologique est postérieure à celle d’une autre œuvre. @fr
toolkit label: reemplazada por (obra) @es
toolkit definition: Una obra que reemplaza (por ej., más tarde en el tiempo o después en una narración) la obra anterior. @es
instruction number: 24.5
label: er efterfulgt af (værk) @da
definition: Relaterer et værk til et værk, der følger efter det forudgående værk, dvs. på et senere tidspunkt eller efter noget i en fortælling. @da
toolkit label: efterfulgt af (værk) @da
toolkit definition: Værk, der følger efter det forudgående værk, dvs. på et senere tidspunkt eller efter noget i en fortælling. @da
definition: Met une œuvre en relation avec une œuvre dont la couverture chronologique est postérieure à celle d’une autre œuvre. @fr
label: được kế tiếp bởi (tác phẩm) @vi
definition: Liên kết tác phẩm với tác phẩm tiếp theo, nghĩa là, sau này theo thời gian hoặc sau theo câu chuyện kể, v.v... tác phẩm đi trước. @vi
toolkit label: được kế tiếp bởi (tác phẩm) @vi
toolkit definition: Tác phẩm tiếp theo, nghĩa là, sau này theo thời gian hoặc sau theo câu chuyện kể, v.v... Tác phẩm đi trước. @vi
label: ist gefolgt von (Werk) @de
definition: Setzt ein Werk in Beziehung zu einem Werk, dessen zeitliches Geschehen nach dem eines anderen Werks liegt. @de
toolkit label: Gefolgt von (Werk) @de
toolkit definition: Ein Werk, dessen zeitliches Geschehen nach dem eines anderen Werks liegt. @de
label: est suivi d’une œuvre @fr
definition: Liittää teoksen teokseen, jolla on toista teosta myöhäisempi ajallinen kattavuus. @fi
toolkit label: myöhempi teos @fi
toolkit definition: Teos, jolla on toista teosta myöhäisempi ajallinen kattavuus. @fi
toolkit label: avløst av verk @no
toolkit definition: Et verk som følger kronologisk etter et annet verk. @no
label: és seguit d’una obra @ca
definition: Relaciona una obra amb una obra la cobertura cronològica de la qual és posterior a aquella d’una altra obra. @ca
toolkit label: seguit d’una obra @ca
toolkit definition: Obra la cobertura cronològica de la qual és posterior a aquella d’una altra obra. @ca
has element type: 2
label: ακολουθείται από (έργο) @el
definition: Συνδέει ένα έργο με ένα έργο που έπεται, ακολουθεί δηλαδή χρονικά σε μια αφήγηση κ.λπ. ένα προηγούμενο έργο. @el
toolkit label: ακολουθείται από (έργο) @el
toolkit definition: Ένα έργο που έπεται, ακολουθεί δηλαδή χρονικά σε μια αφήγηση κ.λπ. ένα προηγούμενο έργο. @el
label: folytatja a következő mű: @hu
definition: Hozzákapcsol egy művet egy műhöz, amely kronológiai narratívában követ egy másik művet, azaz időben későbbi vagy azutáni. @hu
toolkit label: folytató mű @hu
toolkit definition: Egy mű, amely kronológiai narratívában követ egy másik művet, azaz időben későbbi vagy azutáni. @hu
label: myöhempi teos @fi
label: er avløst av verk @no
definition: Relaterer et verk til et verk som følger kronologisk etter et annet verk. @no
label: is gevolgd door werk @nl
definition: Relateert een werk aan een werk waarvan het chronologisch bereik is na dat van een ander werk. @nl
toolkit label: gevolgd door werk @nl
toolkit definition: Een werk waarvan het chronologisch bereik is na dat van een ander werk. @nl
label: هو متبوع بعمل @ar
definition: يربط عمل بعمل تكون تغطيته الزمنية بعد التغطية الخاصة بعمل آخر. @ar
toolkit label: متبوع بعمل @ar
toolkit definition: عمل تكون تغطيته الزمنية بعد التغطية الخاصة بعمل آخر. @ar
label: järgnev teos @et
definition: Seostab teose teosega, mille kronoloogiline ulatus on hilisem kui teisel teosel. @et
toolkit label: järgnev teos @et
toolkit definition: Teos, mille kronoloogiline ulatus on hilisem kui teisel teosel. @et
label: è seguita da opera @it
definition: Correla un’opera a un’opera la cui copertura cronologica è successiva a quella di un’altra opera. @it
toolkit label: seguita da opera @it
toolkit definition: Opera la cui copertura cronologica è successiva a quella di un’altra opera. @it
label: darba vēlāki notikumi @lv
definition: Sasaista darbu ar darbu, kas turpina (piemēram, ir vēlāks laika vai notikumu ziņā) par iepriekšējo darbu. @lv
toolkit label: darbs: vēlāki notikumi @lv
toolkit definition: Darbs, kas turpina (piemēram, ir vēlāks laika vai notikumu ziņā) par iepriekšējo darbu. @lv
label: 被作品后继 @zh-hans
definition: 将一种作品与其时间覆盖面在另一种作品之后的一种作品关联起来。 @zh-hans
toolkit label: 被作品后继 @zh-hans
toolkit definition: 其时间覆盖面在另一种作品之后的一种作品 @zh-hans
has subproperty: is prequel to (Deprecated)
has subproperty: is continued by work
has subproperty: is absorbed by work
has subproperty: is absorbed in part by work
has subproperty: is replaced by work
has subproperty: is split into work
has subproperty: is replaced in part by work

is continued by work
status: Published
definition: Relates a work to a work that is a diachronic work that continues the content of another diachronic work that is completed.
type: Property
domain: C10001
sub property of: is succeeded by work
lexical alias: continuedByWork.en
toolkit label: continued by work
toolkit definition: A work that is a diachronic work that continues the content of another diachronic work that is completed.
toolkit label: continué par une œuvre @fr
toolkit definition: Œuvre diachronique qui continue le contenu d’une autre œuvre diachronique qui est terminée. @fr
toolkit label: continuada por (obra) @es
toolkit definition: Una obra cuyo contenido continúa una obra anterior bajo un título nuevo. @es
scope note: This element applies in general to a successive work.
instruction number: 24.5
label: er fortsat af værk @da
definition: Relaterer et værk til et værk, som er et diakronisk værk, som fortsætter indholdet af et andet diakronisk værk, som er fuldstændigt. @da
scope note: Dette element gælder generelt for et fortløbende værk. @da
toolkit label: fortsat af værk @da
toolkit definition: Værk, som er et diakronisk værk, som fortsætter indholdet af et andet diakronisk værk, som er fuldstændigt. @da
definition: Met une œuvre en relation avec une œuvre diachronique qui continue le contenu d’une autre œuvre diachronique qui est terminée. @fr
label: được tiếp tục bằng (tác phẩm) @vi
definition: Liên kết tác phẩm với tác phẩm mà nội dung của nó tiếp tục tác phẩm trước đây. @vi
scope note: Mối quan hệ này áp dụng tổng quát cho ấn phẩm nhiều kỳ. @vi
toolkit label: được tiếp tục bằng (tác phẩm) @vi
toolkit definition: Tác phẩm mà nội dung của nó tiếp tục tác phẩm trước đây. @vi
label: ist fortgesetzt durch (Werk) @de
definition: Setzt ein Werk in Beziehung zu einem diachronen Werk, das den Inhalt eines anderen abgeschlossenen diachronen Werks fortführt. @de
scope note: Im Allgemeinen trifft dieses Element auf ein sukzessives Werk zu. @de
toolkit label: Fortgesetzt durch (Werk) @de
toolkit definition: Ein diachrones Werk, das den Inhalt eines anderen abgeschlossenen diachronen Werks fortführt. @de
label: est continué par une œuvre @fr
definition: Liittää teoksen teokseen, joka on diakroninen teos, joka jatkaa toisen, valmiin diakronisen teoksen sisältöä. @fi
toolkit label: seuraaja (teos) @fi
toolkit definition: Teos, joka on diakroninen teos, joka jatkaa toisen, valmiin diakronisen teoksen sisältöä. @fi
toolkit label: fortsettes i verk @no
toolkit definition: Et verk som er et diakronisk verk som fortsetter innholdet av et annet diakronisk verk som er komplett. @no
label: és continuat per una obra @ca
definition: Relaciona una obra amb una obra que és una obra diacrònica que continua el contingut d’una altra obra diacrònica completa. @ca
scope note: En general, aquest element s’aplica a una obra successiva. @ca
toolkit label: continuat per una obra @ca
toolkit definition: Obra que és una obra diacrònica que continua el contingut d’una altra obra diacrònica completa. @ca
scope note: Cet élément s’applique généralement à une œuvre successive. @fr
has element type: 2
label: συνεχίζεται από (έργο) @el
definition: Συνδέει ένα έργο με ένα έργο του οποίου το περιεχόμενο συνεχίζει ένα προηγούμενο έργο. @el
scope note: Αυτή η σχέση βρίσκει γενική εφαρμογή στα περιοδικά. @el
toolkit label: συνεχίζεται από (έργο) @el
toolkit definition: Ένα έργο του οποίου το περιεχόμενο συνεχίζει ένα προηγούμενο έργο. @el
label: folytatja a következő mű: @hu
definition: Hozzákapcsol egy művet egy diakronikus műhöz, amely egy másik, befejezett diakronikus mű tartalmát folytatja. @hu
scope note: Ez az elem általában a folyamatos művekre vonatkozik. @hu
toolkit label: folytató mű @hu
toolkit definition: Egy mű, amely egy másik, befejezett diakronikus mű tartalmát folytatja. @hu
scope note: Tämä elementti soveltuu yleensä peräkkäisesti ilmestyvään teokseen. @fi
label: seuraaja (teos) @fi
label: er fortsatt i verk @no
definition: Relaterer et verk til et verk som er et diakronisk verk som fortsetter innholdet av et annet diakronisk verk som er komplett. @no
scope note: Dette elementet gjelder som oftest for et påfølgende verk. @no
label: is voortgezet door werk @nl
definition: Relateert een werk aan een werk dat een diachronisch werk is dat de content voortzet van een ander diachronisch werk dat is afgesloten. @nl
scope note: Dit element is over het algemeen van toepassing op een successief werk. @nl
toolkit label: voortgezet door werk @nl
toolkit definition: Een werk dat een diachronisch werk is dat de content voortzet van een ander diachronisch werk dat is afgesloten. @nl
label: هو مستمر عن طريق عمل @ar
definition: يربط عمل بعمل عبارة عن عمل ممتد زمنيًا ومستمر في محتوى عمل آخر ممتد زمنيًا ومكتمل. @ar
scope note: هذا العنصر ينطبق عامة على عمل متتالٍ. @ar
toolkit label: مستمر عن طريق عمل @ar
toolkit definition: عمل عبارة عن عمل ممتد زمنيًا ومستمر في محتوى عمل آخر ممتد زمنيًا ومكتمل. @ar
label: jätkub teosena @et
definition: Seostab teose diakroonilise teosega, mis jätkab teise, lõpetatud diakroonilise teose sisu. @et
scope note: Elementi rakendatakse peamiselt järgteose puhul. @et
toolkit label: jätkub teosena @et
toolkit definition: Diakrooniline teos, mis jätkab teise, lõpetatud diakroonilise teose sisu. @et
label: è continuata da opera @it
definition: Correla un’opera a un’opera diacronica che continua il contenuto di un’altra opera diacronica completa. @it
scope note: Generalmente questo elemento si applica a un'opera successiva. @it
toolkit label: continuata da opera @it
toolkit definition: Opera diacronica che continua il contenuto di un’altra opera diacronica completa. @it
label: ir turpinājumdarbs @lv

is complemented by work
status: Published
definition: Relates a work to a work that is paired with a related work without either work being considered to be predominant.
type: Property
domain: C10001
sub property of: has related work of work
lexical alias: complementedByWork.en
toolkit label: complemented by work
toolkit definition: A work that is paired with a related work without either work being considered to be predominant.
toolkit label: complété par une œuvre @fr
toolkit definition: Œuvre qui est jumelée à une œuvre en relation sans qu’aucune des deux œuvres ne soit considérée comme prédominante. @fr
toolkit label: complementada por (obra) @es
toolkit definition: Una obra emparejada con otra sin que ninguna se considere predominante. @es
instruction number: 24.5
label: er komplementeret af værk @da
definition: Relaterer et værk til et værk, som er parret med et relateret værk, uden at ét af værkerne betragtes som det fremtrædende. @da
toolkit label: komplementeret af værk @da
toolkit definition: Værk, som er parret med et relateret værk, uden at ét af værkerne betragtes som det fremtrædende. @da
definition: Met une œuvre en relation avec une œuvre qui est jumelée à une œuvre en relation sans qu’aucune des deux œuvres ne soit considérée comme prédominante. @fr
label: được bổ sung bởi (tác phẩm) @vi
definition: Liên kết tác phẩm với tác phẩm cặp đôi với tác phẩm khác mà không có tác phẩm nào được xem là nổi trội. @vi
toolkit label: được bổ sung bởi (tác phẩm) @vi
toolkit definition: Tác phẩm cặp đôi với tác phẩm khác mà không có tác phẩm nào được xem là nổi trội. @vi
label: ist vervollständigt durch (Werk) @de
definition: Setzt ein Werk in Beziehung zu einem Werk, das mit einem in Beziehung stehenden Werk zusammengebracht wird, ohne dass eines der beiden als Hauptwerk angesehen wird. @de
toolkit label: Vervollständigt durch (Werk) @de
toolkit definition: Ein Werk, das mit einem in Beziehung stehenden Werk zusammengebracht wird, ohne dass eines der beiden als Hauptwerk angesehen wird. @de
label: est complété par une œuvre @fr
definition: Liittää teoksen teokseen, joka on yhdistetty siihen liittyvään teokseen ilman, että kumpaakaan teosta pidetään ensisijaisena. @fi
toolkit label: täydentävä teos @fi
toolkit definition: Teos, joka on yhdistetty siihen liittyvään teokseen ilman, että kumpaakaan teosta pidetään ensisijaisena. @fi
toolkit label: utfylt av verk @no
toolkit definition: Et verk som er kombinert med annet verk uten at ett av verkene dominerer. @no
label: és complementat per una obra @ca
definition: Relaciona una obra amb una obra que està aparellada amb una obra relacionada sense que cap es consideri predominant. @ca
toolkit label: complementat per una obra @ca
toolkit definition: Obra que està aparellada amb una obra relacionada sense que cap es consideri predominant. @ca
has element type: 2
label: είναι συμπληρωμένο από (έργο) @el
definition: Συνδέει ένα έργο με ένα έργο, συνταιριασμένο με ένα άλλο έργο, χωρίς κάποιο από τα δύο έργα να θεωρείται ότι δεσπόζει. @el
toolkit label: συμπληρωμένο από (έργο) @el
toolkit definition: Ένα έργο, συνταιριασμένο με ένα άλλο έργο, χωρίς κάποιο από τα δύο έργα να θεωρείται ότι δεσπόζει. @el
label: kiegészíti a következő mű: @hu
definition: Hozzákapcsol egy művet egy kapcsolódó művel párosított műhöz, anélkül, hogy bármelyiket dominánsnak kellene tekinteni. @hu
toolkit label: kiegészítésmű @hu
toolkit definition: Egy kapcsolódó művel anélkül párosított mű, hogy bármelyiket dominánsnak kellene tekinteni. @hu
label: täydentävä teos @fi
label: er utfylt av verk @no
definition: Relaterer et verk til et verk som er kombinert med annet verk uten at ett av verkene dominerer. @no
label: is gecomplementeerd door werk @nl
definition: Relateert een werk aan een werk dat een paar vormt met een gerelateerd werk zonder dat één van de werken als voornaamste gezien wordt. @nl
toolkit label: gecomplementeerd door werk @nl
toolkit definition: Een werk dat een paar vormt met een gerelateerd werk zonder dat één van de werken als voornaamste gezien wordt. @nl
label: هو متمم بعمل @ar
definition: يربط عمل بعمل مقترن بعمل ذي صلة دون اعتبار أحدهما كعمل سائد. @ar
toolkit label: متمم بعمل @ar
toolkit definition: عمل مقترن بعمل ذي صلة دون اعتبار أحدهما كعمل سائد. @ar
label: täiendatud teosega @et
definition: Seostab teose teosega, mis on paaristatud seotud teosega, ilma et kumbagi teost peetaks dominantseks. @et
toolkit label: täiendatud teosega @et
toolkit definition: Teos, mis on paaristatud seotud teosega, ilma et kumbagi teost peetaks dominantseks. @et
label: è completata a opera @it
definition: Correla un’opera a un’opera presentata insieme a un’opera correlata senza che nessuna delle due venga presentata come principale. @it
toolkit label: completata a opera @it
toolkit definition: Opera presentata insieme a un’opera correlata senza che nessuna delle due venga presentata come principale. @it
label: ir kopā ar darbu @lv
definition: Sasaista darbu ar darbu saistīts ar citu darbu, kur neviens no darbiem nav uzskatāms par dominējošu. @lv
toolkit label: kopā ar darbu @lv
toolkit definition: Darbs saistīts ar citu darbu, kur neviens no darbiem nav uzskatāms par dominējošu. @lv
label: 被一种作品补充 @zh-hans
definition: 将一种作品与和一种相关作品配对而两者都不被认为占主导地位的一种作品关联起来。 @zh-hans
toolkit label: 被一种作品补充 @zh-hans
toolkit definition: 和一种相关作品配对而两者都不被认为占主导地位的一种作品 @zh-hans
has subproperty: has choreography work
has subproperty: is choreography for work
has subproperty: is music for work
has subproperty: is sounds for work
has subproperty: has sounds work
has subproperty: is spoken word for work
has subproperty: has spoken word work

is absorbed by work
status: Published
definition: Relates a work to a work whose content incorporates the content of another work.
type: Property
domain: C10001
sub property of: is succeeded by work
lexical alias: absorbedByWork.en
toolkit label: absorbed by work
toolkit definition: A work whose content incorporates the content of another work.
toolkit label: absorbé par une œuvre @fr
toolkit definition: Œuvre dont le contenu intègre celui d’une autre œuvre. @fr
toolkit label: absorbida por (obra) @es
toolkit definition: Una obra que incorpora otra obra. @es
instruction number: 24.5
label: er indlemmet af værk @da
definition: Relaterer et værk til et værk, hvis indhold inkorporerer et andet værks indhold. @da
toolkit label: indlemmet af værk @da
toolkit definition: Værk, hvis indhold inkorporerer et andet værks indhold. @da
definition: Met une œuvre en relation avec une œuvre dont le contenu intègre celui d’une autre œuvre. @fr
label: được hấp thụ bởi (tác phẩm) @vi
definition: Liên kết tác phẩm với tác phẩm sáp nhập tác phẩm khác. @vi
toolkit label: được hấp thụ bởi (tác phẩm) @vi
toolkit definition: Tác phẩm sáp nhập tác phẩm khác. @vi
label: ist aufgegangen in (Werk) @de
definition: Setzt ein Werk in Beziehung zu einem Werk, dessen Inhalt den Inhalt eines anderen Werks umfasst. @de
toolkit label: Aufgegangen in (Werk) @de
toolkit definition: Ein Werk, dessen Inhalt den Inhalt eines anderen Werks umfasst. @de
label: est absorbé par une œuvre @fr
definition: Liittää teoksen teokseen, jonka sisältöön toisen teoksen sisältö on yhdistynyt. @fi
toolkit label: sulautunut teokseen @fi
toolkit definition: Teos, jonka sisältöön toisen teoksen sisältö on yhdistynyt. @fi
toolkit label: innlemmet i verk @no
toolkit definition: Et verk hvis innhold er innlemmet i et annet verk. @no
label: és absorbit per una obra @ca
definition: Relaciona una obra amb una obra el contingut de la qual incorpora el contingut d’una altra obra. @ca
toolkit label: absorbit per una obra @ca
toolkit definition: Obra el contingut de la qual incorpora el contingut d’una altra obra. @ca
has element type: 2
label: απορροφήθηκε από (έργο) @el
definition: Συνδέει ένα έργο με ένα έργο το οποίο ενσωματώνει ένα άλλο έργο. @el
toolkit label: απορροφήθηκε από (έργο) @el
toolkit definition: Ένα έργο το οποίο ενσωματώνει ένα άλλο έργο. @el
label: beolvasztja a következő mű: @hu
definition: Hozzákapcsol egy művet egy műhöz, amelynek tartalma egy másik mű tartalmát magába olvasztja. @hu
toolkit label: beolvasztó mű @hu
toolkit definition: Egy mű, amelynek egy másik mű tartalmát magába olvasztja. @hu
label: sulautunut teokseen @fi
label: er innlemmet i verk @no
definition: Relaterer et verk til et verk hvis innhold er innlemmet i et annet verk. @no
label: is opgenomen door werk @nl
definition: Relateert een werk aan een werk waarvan de content, de content van een ander werk opneemt. @nl
toolkit label: opgenomen door werk @nl
toolkit definition: Een werk waarvan de content, de content van een ander werk opneemt. @nl
label: هو مستوعَب عن طريق عمل @ar
definition: يربط عمل بعمل يشتمل محتواه على محتوى عمل آخر. @ar
toolkit label: احتوي بعمل @ar
toolkit definition: عمل يشتمل محتواه على محتوى عمل آخر. @ar
label: sulandunud teosega @et
definition: Seostab teose teosega, mille sisu haarab endasse teise teose sisu. @et
toolkit label: sulandunud teosega @et
toolkit definition: Teos, mille sisu haarab endasse teise teose sisu. @et
label: è assorbita da opera @it
definition: Correla un'opera a un'opera il cui contenuto incorpora il contenuto di un’altra opera. @it
toolkit label: assorbita da opera @it
toolkit definition: Opera il cui contenuto incorpora il contenuto di un’altra opera. @it
label: ir iekļaujošais darbs @lv
definition: Sasaista darbu ar darbu, kas iekļauj cita darba saturu. @lv
toolkit label: iekļaujošais darbs @lv
toolkit definition: Darbs, kas iekļauj cita darba saturu. @lv
label: 被作品吸收 @zh-hans
definition: 将一种作品与其内容纳入另一种作品之内容的一种作品关联起来。 @zh-hans
toolkit label: 被作品吸收 @zh-hans
toolkit definition: 其内容纳入另一种作品之内容的一种作品 @zh-hans
has subproperty: P10145
label: eser tarafından kapsanmıştır @tr
definition: Bir eseri, içeriği başka bir eserin içeriğini içeren bir eserle ilişkilendirir. @tr
toolkit label: eser tarafından kapsanan @tr
toolkit definition: İçeriği başka bir eserin içeriğini içeren bir çalışma. @tr

is preceded by work
status: Published
definition: Relates a work to a work whose chronological coverage is before that of another work.
type: Property
domain: C10001
sub property of: is transformation by policy of
lexical alias: precededByWork.en
toolkit label: preceded by work
toolkit definition: A work whose chronological coverage is before that of another work.
toolkit label: précédé d’une œuvre @fr
toolkit definition: Œuvre dont la couverture chronologique est antérieure à celle d’une autre œuvre. @fr
toolkit label: precedida por (obra) @es
toolkit definition: Una obra que precede (por ej., es anterior en el tiempo en una narración) a otra que la sigue. @es
instruction number: 24.5
label: er forudgået af @da
definition: Relaterer et værk til et værk, der går forud for det efterfølgende værk, fx på et tidligere tidspunkt eller før noget i en fortælling. @da
toolkit label: forudgået af (værk) @da
toolkit definition: Værk, der går forud for det efterfølgende værk, fx på et tidligere tidspunkt eller før noget i en fortælling. @da
definition: Met une œuvre en relation avec une œuvre dont la couverture chronologique est antérieure à celle d’une autre œuvre. @fr
label: được đi trước bởi (tác phẩm) @vi
definition: Liên kết tác phẩm với tác phẩm đi trước, nghĩa là, là trước đây theo thời gian hoặc trước theo câu chuyện kể, v.v..., tác phẩm tiếp theo. @vi
toolkit label: được đi trước bởi (tác phẩm) @vi
toolkit definition: Tác phẩm đi trước, nghĩa là, là trước đây theo thời gian hoặc trước theo câu chuyện kể, v.v..., tác phẩm tiếp theo. @vi
label: ist vorangegangen ist (Werk) @de
definition: Setzt ein Werk in Beziehung zu einem Werk, dessen zeitliches Geschehen vor dem eines anderen Werks liegt. @de
toolkit label: Vorangegangen ist (Werk) @de
toolkit definition: Ein Werk, dessen zeitliches Geschehen vor dem eines anderen Werks liegt. @de
label: est précédé d’une œuvre @fr
definition: Liittää teoksen teokseen, jonka kronologinen kattavuus on varhaisempi kuin toisella teoksella. @fi
toolkit label: edeltävä teos @fi
toolkit definition: Teos, jonka kronologinen kattavuus on varhaisempi kuin toisella teoksella. @fi
toolkit label: etterfølger verk @no
toolkit definition: Et verk som kommer før, enten i tid eller i historien, et påfølgende verk. @no
label: és precedit d’una obra @ca
definition: Relaciona una obra amb una obra la cobertura cronològica de la qual és anterior a la d’una altra obra. @ca
toolkit label: precedit d’una obra @ca
toolkit definition: Obra la cobertura cronològica de la qual és anterior a la d’una altra obra. @ca
has element type: 2
label: προηγείται από (έργο) @el
definition: Συνδέει ένα έργο με ένα έργο το οποίο προηγείται, δηλαδή είναι προγενέστερο χρονικά ή αφηγηματικά κ.λπ. ενός έργου που ακολουθεί. @el
toolkit label: προηγείται από (έργο) @el
toolkit definition: Ένα έργο το οποίο προηγείται, δηλαδή είναι προγενέστερο χρονικά ή αφηγηματικά κ.λπ. ενός έργου που ακολουθεί. @el
label: megelőzi a következő mű: @hu
definition: Hozzákapcsol egy művet egy műhöz, amely kronológiai narratívában megelőz egy rákövetkező művet. @hu
toolkit label: előzménymű @hu
toolkit definition: Egy mű, amely kronológiai narratívában megelőz egy rákövetkező művet. @hu
label: edeltävä teos @fi
label: etterfølger verk @no
definition: Relaterer et verk til et verk som kommer før, enten i tid eller i historien, et påfølgende verk. @no
label: is voorafgegaan door werk @nl
definition: Relateert een werk aan een werk waarvan het chronologisch bereik is voor dat van een ander werk. @nl
toolkit label: voorafgegaan door werk @nl
toolkit definition: Een werk waarvan het chronologisch bereik is voor dat van een ander werk. @nl
label: هو مسبوق بعمل @ar
definition: يربط عمل بعمل تكون تغطيته الزمنية قبل التغطية الخاصة بعمل آخر. @ar
toolkit label: مسبوق بعمل @ar
toolkit definition: عمل تكون تغطيته الزمنية قبل التغطية الخاصة بعمل آخر. @ar
label: eelnev teos @et
definition: Seostab teose teosega, mille kronoloogiline ulatus on varasem kui teisel teosel. @et
toolkit label: eelnev teos @et
toolkit definition: Teos, mille kronoloogiline ulatus on varasem kui teisel teosel. @et
label: è preceduta da opera @it
definition: Correla un’opera a un’opera la cui copertura cronologica è precedente a quella di un’altra opera. @it
toolkit label: preceduta da opera @it
toolkit definition: Opera la cui copertura cronologica è precedente a quella di un’altra opera. @it
label: darba agrāki notikumi @lv
definition: Sasaista darbu ar darbu, kas ievada tālāk sekojošo darbu, piemēram, ir agrāks laika ziņā vai notikumu ziņā. @lv
toolkit label: darbs: agrāki notikumi @lv
toolkit definition: Darbs, kas ievada tālāk sekojošo darbu, piemēram, ir agrāks laika ziņā vai notikumu ziņā. @lv
label: 被作品作为先前 @zh-hans
definition: 将一种作品与其时间覆盖面在另一种作品之前的一种作品关联起来。 @zh-hans
toolkit label: 被作品作为先前 @zh-hans
toolkit definition: 其时间覆盖面在另一种作品之前的一种作品 @zh-hans
has subproperty: is sequel to (Deprecated)
has subproperty: is absorption of work
has subproperty: is continuation of work
has subproperty: is replacement of work
has subproperty: is merger of work
has subproperty: is absorption in part of work
has subproperty: is replacement in part of work

is absorbed in part by work
status: Published
definition: Relates a work to a work whose content incorporates the partial content of another work.
type: Property
domain: C10001
sub property of: is succeeded by work
lexical alias: absorbedInPartByWork.en
toolkit label: absorbed in part by work
toolkit definition: A work whose content incorporates the partial content of another work.
toolkit label: absorbé en partie par une œuvre @fr
toolkit definition: Œuvre dont le contenu intègre le contenu partiel d’une autre œuvre. @fr
toolkit label: absorbida en parte por (obra) @es
toolkit definition: Una obra que incorpora parte del contenido de otra obra. @es
instruction number: 24.5
label: er delvis indlemmet af værk @da
definition: Relaterer et værk til et værk, hvis indhold inkorporerer et andet værks delvise indhold. @da
toolkit label: delvis indlemmet af værk @da
toolkit definition: Værk, hvis indhold inkorporerer et andet værks delvise indhold. @da
definition: Met une œuvre en relation avec une œuvre dont le contenu intègre le contenu partiel d’une autre œuvre. @fr
label: được hấp thụ một phần bởi (tác phẩm) @vi
definition: Liên kết tác phẩm với tác phẩm sáp nhập phần của nội dung của tác phẩm khác. @vi
toolkit label: được hấp thụ một phần bởi t(tác phẩm) @vi
toolkit definition: Tác phẩm sáp nhập phần của nội dung của tác phẩm khác. @vi
label: ist teilweise aufgegangen in (Werk) @de
definition: Setzt ein Werk in Beziehung zu einem Werk, dessen Inhalt teilweise den Inhalt eines anderen Werks umfasst. @de
toolkit label: Teilweise aufgegangen in (Werk) @de
toolkit definition: Ein Werk, dessen Inhalt teilweise den Inhalt eines anderen Werks umfasst. @de
label: est absorbé en partie par une œuvre @fr
definition: Liittää teoksen teokseen, jonka sisältöön toisen teoksen osittainen sisältö on yhdistynyt. @fi
toolkit label: sulautunut osittain teokseen @fi
toolkit definition: Teos, jonka sisältöön toisen teoksen osittainen sisältö on yhdistynyt. @fi
toolkit label: delvis innlemmet i verk @no
toolkit definition: Et verk som omfatter en del av innholdet i et annet verk. @no
label: és absorbit en part per una obra @ca
definition: Relaciona una obra amb una obra el contingut de la qual incorpora el contingut parcial d’una altra obra. @ca
toolkit label: absorbit en part per una obra @ca
toolkit definition: Obra el contingut de la qual incorpora el contingut parcial d’una altra obra. @ca
has element type: 2
label: απορροφήθηκε μερικώς από (έργο) @el
definition: Συνδέει ένα έργο με ένα έργο το οποίο ενσωματώνει μέρος του περιεχομένου ενός άλλου έργου. @el
toolkit label: απορροφήθηκε μερικώς από (έργο) @el
toolkit definition: Ένα έργο το οποίο ενσωματώνει μέρος του περιεχομένου ενός άλλου έργου. @el
label: részben beolvasztja a következő mű: @hu
definition: Hozzákapcsol egy művet egy műhöz, amelynek tartalma egy másik mű tartalmának egy részét magába olvasztja. @hu
toolkit label: részben beolvasztó mű @hu
toolkit definition: Egy mű, amely egy másik mű tartalmának egy részét magába olvasztja. @hu
label: sulautunut osittain teokseen @fi
label: er delvis innlemmet i verk @no
definition: Relaterer et verk til et verk som omfatter en del av innholdet i et annet verk. @no
label: is deels opgenomen door werk @nl
definition: Relateert een werk aan een werk waarvan de content de gedeeltelijke content van een ander werk opneemt. @nl
toolkit label: deels opgenomen door werk @nl
toolkit definition: Een werk waarvan de content de gedeeltelijke content van een ander werk opneemt. @nl
label: هو مستوعب جزئيا عن طريق عمل @ar
definition: يربط عمل بعمل يتضمن محتواه المحتوى الجزئي لعمل آخر. @ar
toolkit label: مستوعب جزئيا عن طريق عمل @ar
toolkit definition: عمل يتضمن محتواه المحتوى الجزئي لعمل آخر. @ar
label: sulandunud osaliselt teosega @et
definition: Seostab teose teosega, mille sisu haarab osaliselt endasse teise teose sisu. @et
toolkit label: sulandunud osaliselt teosega @et
toolkit definition: Seostab teose teosega, mille sisu haarab osaliselt endasse teise teose sisu. @et
label: è parzialmente assorbita da opera @it
definition: Correla un'opera a un'opera il cui contenuto incorpora parzialmente il contenuto di un’altra opera. @it
toolkit label: assorbita in parte da opera @it
toolkit definition: Opera il cui contenuto incorpora parzialmente il contenuto di un’altra opera. @it
label: ir daļēji iekļaujošais darbs @lv
definition: Sasaista darbu ar darbu, kas iekļauj saistītā darba satura daļu. @lv
toolkit label: daļēji iekļaujošais darbs @lv
toolkit definition: Darbs, kas iekļauj saistītā darba satura daļu. @lv
label: 被作品部分吸收 @zh-hans
definition: 将一种作品与其内容纳入另一种作品之部分内容的一种作品关联起来。 @zh-hans
toolkit label: 被作品部分吸收 @zh-hans
toolkit definition: 其内容纳入另一种作品之部分内容的一种作品 @zh-hans
has subproperty: P10146
label: eser tarafından kısmen kapsanmıştır @tr
definition: Bir eseri, içeriği başka bir eserin kısmi içeriğini içeren bir eserle ilişkilendirir. @tr
toolkit label: eser tarafından kısmen kapsanan @tr
toolkit definition: İçeriği başka bir eserin kısmi içeriğini içeren bir çalışma. @tr

is paraphrase of work
status: Published
definition: Relates a work to a work used as a basis for a restating of the content of another work in a different form.
type: Property
domain: C10001
sub property of: is transformation by style of
lexical alias: paraphraseOfWork.en
toolkit label: paraphrase of work
toolkit definition: A work used as a basis for a restating of the content of another work in a different form.
toolkit label: paraphrase d’une œuvre @fr
toolkit definition: Œuvre qui sert de base à une reprise du contenu d’une autre œuvre sous une formulation différente. @fr
toolkit label: paráfrasis de (obra) @es
toolkit definition: Una obra utilizada como base para una paráfrasis, i.e., un replanteamiento del contenido de la obra fuente en una forma diferente. @es
instruction number: 24.5
label: er parafrase over værk @da
definition: Relaterer et værk til et værk, som anvendes som grundlag for en gentagelse af indholdet af et oprindeligt værk i en anden form. @da
toolkit label: parafrase over værk @da
toolkit definition: Værk, som anvendes som grundlag for en gentagelse af indholdet af et oprindeligt værk i en anden form. @da
definition: Met une œuvre en relation avec une œuvre qui sert de base à une reprise du contenu d’une autre œuvre sous une formulation différente. @fr
label: là diễn giải của (tác phẩm) @vi
definition: Liên kết tác phẩm với tác phẩm được sử dụng như là cơ sở cho diễn giải, nghĩa là, trình bày lại nội dung của tác phẩm nguồn dưới hình thái khác. @vi
toolkit label: diễn giải của (tác phẩm) @vi
toolkit definition: Tác phẩm được sử dụng như là cơ sở cho diễn giải, nghĩa là, trình bày lại nội dung của tác phẩm nguồn dưới hình thái khác. @vi
label: ist Paraphrase von (Werk) @de
definition: Setzt ein Werk in Beziehung zu einem Werk, das als Grundlage für eine Neuformulierung des Inhalts eines anderen Werks in einer anderen Form verwendet wird. @de
toolkit label: Paraphrase von (Werk) @de
toolkit definition: Ein Werk, das als Grundlage für eine Neuformulierung des Inhalts eines anderen Werks in einer anderen Form verwendet wird. @de
label: est une paraphrase d’une œuvre @fr
definition: Liittää teoksen teokseen, jota on käytetty toisen teoksen sisällön eri muodossa tapahtuvan toisintamisen perustana. @fi
toolkit label: parafraasi teoksesta @fi
toolkit definition: Teos, jota on käytetty toisen teoksen sisällön eri muodossa tapahtuvan toisintamisen perustana. @fi
toolkit label: omskriving av verk @no
toolkit definition: Et verk som brukes som utgangspunkt for en gjentakelse av et kildeverks innhold i en annen form. @no
label: és paràfrasi d’una obra @ca
definition: Relaciona una obra amb una obra usada com a base d’un replantejament del contingut d’una altra obra en una forma diferent. @ca
toolkit label: paràfrasi d’una obra @ca
toolkit definition: Obra usada com a base d’un replantejament del contingut d’una altra obra en una forma diferent. @ca
has element type: 2
label: είναι παράφραση του (έργο) @el
definition: Συνδέει ένα έργο με ένα έργο το οποίο χρησιμοποιείται ως η βάση για μια παράφραση, δηλαδή μια επαναδιατύπωση του περιεχομένου ενός έργου-πηγής σε μια διαφορετική μορφή. @el
toolkit label: παράφραση του (έργο) @el
toolkit definition: Ένα έργο το οποίο χρησιμοποιείται ως η βάση για μια παράφραση, δηλαδή μια επαναδιατύπωση του περιεχομένου ενός έργου-πηγής σε μια διαφορετική μορφή. @el
label: parafrázisa a következő műnek: @hu
definition: Hozzákapcsol egy művet egy műhöz, amelyet alapként használnak egy parafrázishoz, azaz egy másik mű tartalmának újrafogalmazásához eltérő formában. @hu
toolkit label: parafrazeált mű @hu
toolkit definition: Egy mű, amelyet alapként használnak egy parafrázishoz, azaz egy másik mű tartalmának újrafogalmazásához eltérő formában. @hu
label: parafraasi teoksesta @fi
label: er omskriving av verk @no
definition: Relaterer et verk til et verk som brukes som utgangspunkt for en gjentakelse av et kildeverks innhold i en annen form. @no
label: is parafrase van werk @nl
definition: Relateert een werk aan een werk gebruikt als een basis voor een herformulering van de content van een ander werk in een andere vorm. @nl
toolkit label: parafrase van werk @nl
toolkit definition: Een werk gebruikt als een basis voor een herformulering van de content van een ander werk in een andere vorm. @nl
label: هو إعادة صياغة لعمل @ar
definition: يربط عمل بعمل يُستخدم كأساس لإعادة صياغة محتوى عمل آخر في شكل مختلف. @ar
toolkit label: إعادة صياغة لعمل @ar
toolkit definition: عمل يُستخدم كأساس لإعادة صياغة محتوى عمل آخر في شكل مختلف. @ar
label: parafraseeritud teos @et
definition: Seostab teose teosega, mis on aluseks allikteose sisu väljendamisele teises vormis. @et
toolkit label: parafraseeritud teos @et
toolkit definition: Teos, mis on aluseks allikteose sisu väljendamisele teises vormis. @et
label: è parafrasi di opera @it
definition: Correla un’opera a un’opera utilizzata come base per una riesposizione del contenuto di un’opera di partenza in una forma differente. @it
toolkit label: parafrasi di opera @it
toolkit definition: Opera utilizzata come base per una riesposizione del contenuto di un’opera di partenza in una forma differente. @it
label: ir parafrāze darbam @lv
definition: Sasaista darbu ar darbu, kas izmantots par pamatu parafrāzei, t.i., pamatdarba satura izteiktšanai citā veidā. @lv
toolkit label: parafrāze darbam @lv
toolkit definition: Darbs, kas izmantots par pamatu parafrāzei, t.i., pamatdarba satura izteiktšanai citā veidā. @lv
label: 是作品的演绎 @zh-hans
definition: 将一种作品与被用来作为以不同形式重述另一种作品之内容的基础的一种作品关联起来。 @zh-hans
toolkit label: 作品的演绎 @zh-hans
toolkit definition: 被用来作为以不同形式重述另一种作品之内容的基础的一种作品 @zh-hans
has subproperty: P10186
label: eserin yeniden yorumlanmasıdır @tr
definition: Bir eseri, başka bir eserin içeriğinin farklı bir biçimde yeniden ifade edilmesi için temel olarak kullanılan bir eserle ilişkilendirir. @tr
toolkit label: Eserin yorumlanması @tr
toolkit definition: Başka bir çalışmanın içeriğinin farklı bir biçimde yeniden ifade edilmesi için temel olarak kullanılan bir çalışma. @tr

has identifier for work
status: Published
definition: Relates a work to a nomen that is an appellation of work that consists of a code, number, or other string, usually independent of natural language and social naming conventions, used to identify a work.
type: Property
domain: C10001
lexical alias: identifierForWork.en
instruction number: 6.8
toolkit label: identifier for work
toolkit definition: A nomen that is an appellation of work that consists of a code, number, or other string, usually independent of natural language and social naming conventions, used to identify a work.
scope note: L’identifiant sert à différencier une œuvre d’autres œuvres. @fr
toolkit label: identifiant d’œuvre @fr
toolkit definition: Nomen qui est une appellation d’œuvre consistant en un code, un nombre ou une autre chaîne, généralement indépendante du langage naturel et des conventions sociales de dénomination, utilisée pour identifier une œuvre. @fr
toolkit label: identificador de la obra @es
toolkit definition: Una cadena de caracteres asociada con una obra, o un substituto de una obra (p.ej., un registro de autoridad). @es
label: har identifikator for værk @da
definition: Relaterer et værk til en benævnelse på værk, som består af en kode, nummer eller anden streng, sædvanligvis upåvirket af normalsprog og sociale navngivningskonventioner, brugt til at identificere et værk. @da
scope note: Identifikatoren tjener til at skelne et værk fra andre værker. @da
toolkit label: identifikator for værk @da
toolkit definition: Benævnelse på værk, som består af en kode, nummer eller anden streng, sædvanligvis upåvirket af normalsprog og sociale navngivningskonventioner, brugt til at identificere et værk. @da
definition: Met une œuvre en relation avec un nomen qui est une appellation d’œuvre consistant en un code, un nombre ou une autre chaîne, généralement indépendante du langage naturel et des conventions sociales de dénomination, utilisée pour identifier une œuvre. @fr
label: có chỉ số nhận dạng của tác phẩm @vi
definition: Liên kết tác phẩm với chuỗi ký tự duy nhất liên quan tới tác phẩm hoặc với vật thay thế như là biểu ghi chuẩn của tác phẩm. @vi
scope note: Chỉ số nhận dạng dùng để phân biệt một tác phẩm với các tác phẩm khác. @vi
toolkit label: chỉ số nhận dạng của tác phẩm @vi
toolkit definition: Chuỗi ký tự duy nhất liên quan tới tác phẩm hoặc với vật thay thế như là biểu ghi chuẩn của tác phẩm. @vi
label: hat Identifikator für ein Werk @de
definition: Setzt ein Werk in Beziehung zu einer Bezeichnung für ein Werk, die aus einem Code, einer Nummer oder einer anderen Zeichenkette besteht, der/die normalerweise nicht in natürlicher Sprache und unabhängig von den sozialen Benennungskonventionen ist und zur Identifizierung eines Werks verwendet wird. @de
scope note: Der Identifikator dient dazu, dieses Werk von anderen Werken zu unterscheiden. @de
toolkit label: Identifikator für ein Werk @de
toolkit definition: Eine Bezeichnung für ein Werk, die aus einem Code, einer Nummer oder einer anderen Zeichenkette besteht, der/die normalerweise nicht in natürlicher Sprache und unabhängig von den sozialen Benennungskonventionen ist und zur Identifizierung eines Werks verwendet wird. @de
label: a pour identifiant d’œuvre @fr
definition: Liittää teoksen nomeniin, joka on teoksen nimitys, joka koostuu koodista, luvusta tai muusta tavallisesti luonnollisesta kielestä ja yleisistä nimeämiskäytännöistä riippumattomasta merkkijonosta, jota käytetään teoksen identifiointiin. @fi
toolkit label: teoksen tunniste @fi
toolkit definition: Nomen, joka on teoksen nimitys, joka koostuu koodista, luvusta tai muusta tavallisesti luonnollisesta kielestä ja yleisistä nimeämiskäytännöistä riippumattomasta merkkijonosta, jota käytetään teoksen identifiointiin. @fi
toolkit label: identifikator for verk @no
toolkit definition: En betegnelse for verk som består av en kode, et nummer eller en annen streng, vanligvis uavhengig av et naturlig språk og sosiale navnekonvensjoner, brukt for å identifisere et verk. @no
label: té com a identificador d’obra @ca
definition: Relaciona una obra amb un nomen que és una apel·lació d’obra que consisteix en un codi, un número o qualsevol altra cadena, normalment independent del llenguatge natural i de les convencions lingüístiques socials, usada per identificar una obra. @ca
scope note: L’identificador serveix per diferenciar una obra d’altres obres. @ca
toolkit label: identificador d’obra @ca
toolkit definition: Nomen que és una apel·lació d’obra que consisteix en un codi, un número o qualsevol altra cadena, normalment independent del llenguatge natural i de les convencions lingüístiques socials, usada per identificar una obra. @ca
sub property of: has appellation of work
has element type: 3
label: έχει αναγνωριστικό για το έργο @el
definition: Συνδέει ένα έργο με έναν αλφαριθμητικό χαρακτήρα μοναδικά συνδεδεμένο με ένα έργο ή με ένα υποκατάστατο όπως μια καθιερωμένη εγγραφή για ένα έργο. @el
scope note: Το αναγνωριστικό εξυπηρετεί τον σκοπό της διαφοροποίησης ενός έργου από άλλα έργα. @el
toolkit label: αναγνωριστικό για το έργο @el
toolkit definition: Ένας αλφαριθμητικός χαρακτήρας μοναδικά συνδεδεμένος με ένα έργο ή με ένα υποκατάστατο, όπως μια καθιερωμένη εγγραφή για ένα έργο. @el
label: műazonosítója a következő: @hu
definition: Hozzákapcsol egy művet egy nomenhez, egy időtartam megnevezéséhez, amely kódból, számból vagy egyéb karakterláncból áll, általában a természetes nyelvtől és társadalmi elnevezési konvencióktól független, egy mű azonosítására használják. @hu
toolkit label: műazonosító @hu
toolkit definition: Egy nomen, egy időtartam megnevezése, amely kódból, számból vagy egyéb karakterláncból áll, általában a természetes nyelvtől és társadalmi elnevezési konvencióktól független, egy mű azonosítására használják. @hu
sub property of: P00018
label: teoksen tunniste @fi
label: har identifikator for verk @no
definition: Relaterer et verk til en betegnelse for verk som består av en kode, et nummer eller en annen streng, vanligvis uavhengig av et naturlig språk og sosiale navnekonvensjoner, brukt for å identifisere et verk. @no
label: heeft identificatie voor werk @nl
definition: Relateert een werk aan een nomen dat is een benaming van werk die bestaat uit een code, nummer of andere string, meestal onafhankelijk van natuurlijke taal en gewoonlijke naamgevingsconventies, gebruikt om een werk te identificeren. @nl
toolkit label: identificatie voor werk @nl
toolkit definition: Een nomen dat is een benaming van werk die bestaat uit een code, nummer of andere string, meestal onafhankelijk van natuurlijke taal en gewoonlijke naamgevingsconventies, gebruikt om een werk te identificeren. @nl
label: له معرف لعمل @ar
definition: يربط بين عمل وتسمية عبارة عن اسم تعريفي لعمل يتكون من رمز، أو رقم، أو سلسلة تمثيلات أخرى، مستقلة عادة عن اللغة الطبيعية والتسميات المتعارف عليها اجتماعيا، ومستخدمة لتعريف عمل. @ar
toolkit label: معرف لعمل @ar
toolkit definition: تسمية عبارة عن اسم تعريفي لعمل يتكون من رمز، أو رقم، أو سلسلة تمثيلات أخرى، مستقلة عادة عن اللغة الطبيعية والتسميات المتعارف عليها اجتماعيا، ومستخدمة لتعريف عمل. @ar
label: teose identifikaator @et
definition: Seostab teose teose nimetusega, mis koosneb teost identifitseerivast koodist, numbrist või muust loomulikust keelest ja üldtuntud nimetamistavadest sõltumatust stringist. @et
toolkit label: teose identifikaator @et
toolkit definition: Teose nimetus, mis koosneb teost identifitseerivast koodist, numbrist või muust loomulikust keelest ja üldtuntud nimetamistavadest sõltumatust stringist. @et
label: ha come identificatore per opera @it
definition: Correla un’opera a una denominazione di un'opera che consiste di un codice, numero o altra stringa di caratteri, di solito indipendente dal linguaggio naturale e dalle convenzioni sociali di denominazione, utilizzate per assegnare i nomi, utilizzato per identificare un'opera. @it
toolkit label: identificatore per opera @it
toolkit definition: Denominazione di un’opera che consiste di un codice, numero o altra stringa di caratteri, di solito indipendente dal linguaggio naturale e dalle convenzioni sociali di denominazione, utilizzate per assegnare i nomi, utilizzato per identificarla. @it
label: darba identifikators @lv
definition: Sasaista darbu ar nomenu, kas ir darba apzīmējums, kas sastāv no koda, skaitļa vai citas virknes, kas parasti ir neatkarīgs no dabiskas valodas vai sabiedrībā pieņemtām nosaukšanas tradīcijām, ko izmanto, lai identificētu darbu. @lv
toolkit label: darba identifikators @lv
toolkit definition: Darba apzīmējums, kas sastāv no koda, skaitļa vai citas virknes, kas parasti ir neatkarīgs no dabiskas valodas vai sabiedrībā pieņemtām nosaukšanas tradīcijām, ko izmanto, lai identificētu darbu. @lv
label: 有作品的标识符 @zh-hans
definition: 将一种作品与作为一个由代码、数字、或其他串构成的称谓、通常独立于自然语言和社会命名惯例、用以标识一种作品的作品称谓的命名关蓝起来。 @zh-hans
toolkit label: 作品的标识符 @zh-hans
toolkit definition: 作为一个由代码、数字、或其他串构成的称谓、通常独立于自然语言和社会命名惯例、用以标识一种作品的作品称谓的命名 @zh-hans

is work critiqued by
status: Published
definition: Relates a work to a work that is a critical evaluation of a work.
type: Property
domain: C10001
toolkit label: work critiqued by
toolkit definition: A work that is a critical evaluation of a work.
toolkit label: œuvre critiquée par @fr
toolkit definition: Œuvre qui consiste en une évaluation critique d’une œuvre. @fr
toolkit label: criticada en (obra) @es
toolkit definition: Una obra que contiene una evaluación crítica de la obra descrita. @es
instruction number: 23.5
label: er værk kritiseret i @da
definition: Relaterer et værk til et værk, som indeholder en kritisk vurdering af et værk. @da
toolkit label: værk kritiseret i @da
toolkit definition: Værk, som indeholder en kritisk vurdering af et værk. @da
definition: Met une œuvre en relation avec une œuvre qui consiste en une évaluation critique d’une œuvre. @fr
label: được phê bình trong (tác phẩm) @vi
definition: Liên kết tác phẩm với tác phẩm có chứa đánh giá phê bình tác phẩm được mô tả. @vi
toolkit label: được phê bình trong (tác phẩm) @vi
toolkit definition: Tác phẩm có chứa đánh giá phê bình tác phẩm được mô tả. @vi
label: ist Kritik eines Werks in @de
definition: Setzt ein Werk in Beziehung zu einem Werk, bei dem es sich um eine kritische Untersuchung eines Werks handelt. @de
toolkit label: Kritik eines Werks in @de
toolkit definition: Ein Werk, bei dem es sich um eine kritische Untersuchung eines Werks handelt. @de
label: est une œuvre critiquée par @fr
definition: Liittää teoksen teokseen, joka on teoksen kriittinen arviointi. @fi
toolkit label: teoksen kritiikki @fi
toolkit definition: Teos, joka on teoksen kriittinen arviointi. @fi
toolkit label: verk kritisert i @no
toolkit definition: Et verk som inneholder en kritisk evaluering av et verk. @no
label: és obra criticada per @ca
definition: Relaciona una obra amb una obra que és una avaluació crítica d’una obra. @ca
toolkit label: obra criticada per @ca
toolkit definition: Obra que és una avaluació crítica d’una obra. @ca
has element type: 2
alternative label: critiqued in (work)
label: κρίνεται στο (έργο) @el
definition: Συνδέει ένα έργο με ένα έργο το οποίο περιέχει μια κριτική αξιολόγηση ενός περιγραφόμενου έργου. @el
toolkit label: κρίνεται στο (έργο) @el
toolkit definition: Ένα έργο το οποίο περιέχει μια κριτική αξιολόγηση ενός περιγραφόμενου έργου. @el
label: mű bírálva a következőben: @hu
definition: Hozzákapcsol egy művet egy műhöz, amely egy mű kritikai értékelése. @hu
toolkit label: mű bírálva a következőben: @hu
toolkit definition: Egy mű, amely egy mű kritikai értékelése. @hu
alternative label: kritisoitu teoksessa @fi
label: teoksen kritiikki @fi
label: er verk kritisert i @no
definition: Relaterer et verk til et verk som inneholder en kritisk evaluering av et verk. @no
alternative label: kritikk i (verk) @no
label: is werk bekritiseerd in @nl
definition: Relateert een werk aan een werk dat een kritische beschouwing is van een werk. @nl
toolkit label: werk bekritiseerd in @nl
toolkit definition: Een werk dat een kritische beschouwing is van een werk. @nl
label: هو عمل منتقد في @ar
definition: يربط عمل بعمل عبارة عن تقييم نقدي لعمل. @ar
alternative label: منتقد في (عمل) @ar
toolkit label: عمل منتقد في @ar
toolkit definition: عمل عبارة عن تقييم نقدي لعمل. @ar
alternative label: criticat en (obra) @ca
alternative label: kritiseret i værk @da
label: teose arvustus @et
definition: Seostab teose teosega, mis sisaldab kriitilist hinnangut teosele. @et
toolkit label: teose arvustus @et
toolkit definition: Teos, mis sisaldab kriitilist hinnangut teosele. @et
alternative label: bírálva a következőben (mű): @hu
label: è opera sottoposta a critica in @it
definition: Correla un’opera a un’opera che è una valutazione critica di un’opera. @it
alternative label: sottoposta a critica in (opera) @it
toolkit label: opera sottoposta a critica in @it
toolkit definition: Opera che è una valutazione critica di un’opera. @it
sub property of: is work evaluated by
lexical alias: workCritiquedBy.en
label: ir darba kritika @lv
definition: Sasaista darbu ar darbu, kas ir kritisks darba vērtējums. @lv
toolkit label: darba kritika @lv
toolkit definition: Darbs, kas ir kritisks darba vērtējums. @lv
alternative label: Kritik in (Werk) @de
alternative label: 被批评于（作品） @zh-hans
label: 是被……批评的作品 @zh-hans
toolkit label: 被……批评的作品 @zh-hans

is indexed in work (Deprecated)
definition: Relates a work to a work that indexes the contents of a related work. (Deprecated)
type: Property
domain: C10001
sub property of: has derivative work
lexical alias: indexedInWork.en
toolkit label: indexed in work (Deprecated)
toolkit definition: A work that indexes the contents of a related work. (Deprecated)
toolkit label: indexé dans une œuvre @fr
toolkit definition: Œuvre qui indexe le contenu d’une œuvre en relation. @fr
toolkit label: indizada en (obra) @es
toolkit definition: Una obra (un servicio de indización y resúmenes) que indiza el contenido de la obra fuente. @es
instruction number: 24.5
label: er indekseret i værk @da
definition: Relaterer et værk til et værk, som indekserer et relateret værks indhold. @da
toolkit label: indekseret i værk @da
toolkit definition: Værk, som indekserer et relateret værks indhold. @da
definition: Met une œuvre en relation avec une œuvre qui indexe le contenu d’une œuvre en relation. @fr
label: được chỉ mục trong (tác phẩm) @vi
definition: Liên kết tác phẩm với tác phẩm mà dịch vụ tóm tắt và định chỉ mục định chỉ mục nội dung của tác phẩm nguồn. @vi
toolkit label: được chỉ mục trong (tác phẩm) @vi
toolkit definition: Tác phẩm mà dịch vụ tóm tắt và định chỉ mục định chỉ mục nội dung của tác phẩm nguồn. @vi
label: ist indexiert in (Werk) @de
definition: Setzt ein Werk in Beziehung zu einem Werk, das den Inhalt eines in Beziehung stehenden Werks indexiert. @de
toolkit label: Indexiert in (Werk) @de
toolkit definition: Ein Werk, das den Inhalt eines in Beziehung stehenden Werks indexiert. @de
label: est indexé dans une œuvre @fr
definition: Liittää teoksen teokseen, joka indeksoi siihen liittyvän teoksen sisällön. @fi
toolkit label: indeksointi (teos) @fi
toolkit definition: Teos, joka indeksoi siihen liittyvän teoksen sisällön. @fi
toolkit label: indeksert i verk @no
toolkit definition: Et verk som indekserer innholdet i et relatert verk. @no
label: és indexat en una obra @ca
definition: Relaciona una obra amb una obra que indexa els continguts d’una obra relacionada. @ca
toolkit label: indexat en una obra @ca
toolkit definition: Obra que indexa els continguts d’una obra relacionada. @ca
has element type: 2
label: είναι ευρετήριο σε (έργο) @el
definition: Συνδέει ένα έργο με ένα έργο που λειτουργεί ως υπηρεσία επιτομής και ευρετηρίασης, η οποία ευρετηριάζει τα περιεχόμενα ενός έργου-πηγής. @el
toolkit label: ευρετήριο σε (έργο) @el
toolkit definition: Ένα έργο που λειτουργεί ως υπηρεσία επιτομής και ευρετηρίασης, η οποία ευρετηριάζει τα περιεχόμενα ενός έργου-πηγής. @el
label: indexelve a következő műben: @hu
definition: Hozzákapcsol egy művet egy műhöz, amely egy kapcsolódó mű tartalmait absztrahálja. @hu
toolkit label: indexelő mű @hu
toolkit definition: Egy mű, amely egy kapcsolódó mű tartalmait absztrahálja. @hu
label: indeksointi (teos) @fi
label: er indeksert i verk @no
definition: Relaterer et verk til et verk som indekserer innholdet i et relatert verk. @no
label: is geïndexeerd in werk @nl
definition: Relateert een werk aan een werk dat de content van een gerelateerd werk indexeert. @nl
toolkit label: geïndexeerd in werk @nl
toolkit definition: Een werk dat de content van een gerelateerd werk indexeert. @nl
label: هو مكشف في عمل @ar
definition: يربط عمل بعمل يقوم بتكشيف محتويات عمل ذي صلة. @ar
toolkit label: مكشف في عمل @ar
toolkit definition: عمل يقوم بتكشيف محتويات عمل ذي صلة. @ar
label: indekseeritud teoses @et
definition: Seostab teose teosega, milles on indekseeritud seotud teose sisu. @et
toolkit label: indekseeritud teoses @et
toolkit definition: Teos, milles on indekseeritud seotud teose sisu. @et
label: è indicizzata in opera @it
definition: Correla un’opera a un’opera che indicizza il contenuto di un’opera correlata. @it
toolkit label: indicizzata in opera @it
toolkit definition: Opera che indicizza il contenuto di un’opera correlata. @it
status: Deprecated
label: darba indeksējums @lv
definition: Sasaista darbu ar darbu, kas indeksē saistītā darba saturu. @lv
toolkit label: darbs: indeksējums @lv
toolkit definition: Darbs, kas indeksē saistītā darba saturu. @lv
has subproperty: P10090

is work evaluated by
status: Published
definition: Relates a work to a work that is an examination or judgement of a work.
type: Property
domain: C10001
toolkit label: work evaluated by
toolkit definition: A work that is an examination or judgement of a work.
toolkit label: œuvre évaluée par @fr
toolkit definition: Œuvre qui consiste en un examen ou en un jugement d’une œuvre. @fr
toolkit label: evaluada en (obra) @es
toolkit definition: Una obra que examina o juzga la obra descrita. @es
instruction number: 23.5
label: er værk evalueret i @da
definition: Relaterer et værk til et værk, som undersøger eller bedømmer et værk. @da
toolkit label: værk evalueret i @da
toolkit definition: Værk, som undersøger eller bedømmer et værk. @da
definition: Met une œuvre en relation avec une œuvre qui consiste en un examen ou en un jugement d’une œuvre. @fr
label: được đánh giá trong (tác phẩm) @vi
definition: Liên kết tác phẩm với tác phẩm kiểm tra hoặc đánh giá rác phẩm được mô tả. @vi
toolkit label: được đánh giá trong (tác phẩm) @vi
toolkit definition: Tác phẩm kiểm tra hoặc đánh giá rác phẩm được mô tả. @vi
label: ist Werk evaluiert in @de
definition: Setzt ein Werk in Beziehung zu einem Werk, das ein Werk untersucht oder beurteilt. @de
toolkit label: Werk evaluiert in @de
toolkit definition: Ein Werk, das ein Werk untersucht oder beurteilt. @de
label: est une œuvre évaluée par @fr
definition: Liittää teoksen teokseen, joka tutkii tai arvioi teosta. @fi
toolkit label: teoksen arviointi @fi
toolkit definition: Teos, joka tutkii tai arvioi teosta. @fi
toolkit label: verk evaluert i @no
toolkit definition: Et verk som utforsker eller vurderer et verk. @no
label: és obra avaluada per @ca
definition: Relaciona una obra amb una obra que és un examen o un judici d’una obra. @ca
toolkit label: obra avaluada per @ca
toolkit definition: Obra que és un examen o un judici d’una obra. @ca
has element type: 2
alternative label: evaluated in (work)
label: αξιολογείται στο (έργο) @el
definition: Συνδέει ένα έργο με ένα έργο το οποίο εξετάζει ή κρίνει ένα περιγραφόμενο έργο. @el
toolkit label: αξιολογείται στο (έργο) @el
toolkit definition: Ένα έργο το οποίο εξετάζει ή κρίνει ένα περιγραφόμενο έργο. @el
label: mű értékelve a következőben: @hu
definition: Hozzákapcsol egy művet egy műhöz, amely egy művet vizsgál és ítél meg. @hu
toolkit label: mű értékelve a következőben: @hu
toolkit definition: Egy mű, amely egy művet vizsgál és ítél meg. @hu
alternative label: arvioitu teoksessa @fi
label: teoksen arviointi @fi
label: er verk evaluert i @no
definition: Relaterer et verk til et verk som utforsker eller vurderer et verk. @no
alternative label: evaluert i (verk) @no
label: is werk beschouwd in @nl
definition: Relateert een werk aan een werk dat een werk onderzoekt of beoordeelt. @nl
toolkit label: werk beschouwd in @nl
toolkit definition: Een werk dat een werk onderzoekt of beoordeelt. @nl
label: هو عمل مقيَّم في @ar
definition: يربط عمل بعمل يفحص عمل أو يحكم عليه. @ar
alternative label: مقيَّم في (عمل) @ar
toolkit label: عمل مقيَّم في @ar
toolkit definition: عمل يفحص عمل أو يحكم عليه. @ar
alternative label: avaluat en (obra) @ca
alternative label: evalueret i værk @da
label: teose hinnang @et
definition: Seostab teose teosega, milles kontrollitakse või hinnatakse teost. @et
toolkit label: teose hinnang @et
toolkit definition: Teos, milles kontrollitakse või hinnatakse teost. @et
alternative label: értékelve a következőben (mű): @hu
label: è opera valutata in @it
definition: Correla un’opera a un’opera che esamina o giudica un'opera. @it
alternative label: valutata in (opera) @it
toolkit label: opera valutata in @it
toolkit definition: Opera che esamina o giudica un'opera. @it
sub property of: is subject work of
lexical alias: workEvaluatedBy.en
label: ir darba novērtējums @lv
definition: Sasaista darbu ar darbu, kas analizē vai novērtē darbu. @lv
toolkit label: darba novērtējums @lv
toolkit definition: Darbs, kas analizē vai novērtē darbu. @lv
alternative label: Evaluiert in (Werk) @de
alternative label: 被评价于（作品） @zh-hans
label: 是被……评价的作品 @zh-hans
toolkit label: 被……评价的作品 @zh-hans

is abstracted in work
status: Published
definition: Relates a work to a work that abstracts the contents of another work.
type: Property
domain: C10001
sub property of: has derivative work
lexical alias: abstractedInWork.en
toolkit label: abstracted in work
toolkit definition: A work that abstracts the contents of another work.
toolkit label: résumé analytiquement dans une œuvre @fr
toolkit definition: Œuvre qui résume analytiquement le contenu d’une autre œuvre. @fr
toolkit label: resumida en (obra) @es
toolkit definition: Una obra (un servicio de indización y resúmenes) que resume el contenido de una entidad fuente. @es
instruction number: 24.5
label: er sammenfattet i værk @da
definition: Relaterer et værk til et værk, som sammenfatter et andet værks indhold. @da
toolkit label: sammenfattet i værk @da
toolkit definition: Værk, som sammenfatter et andet værks indhold. @da
definition: Met une œuvre en relation avec une œuvre qui résume analytiquement le contenu d’une autre œuvre. @fr
label: được tóm tắt trong (tác phẩm) @vi
definition: Liên kết tác phẩm với tác phẩm mà dịch vụ tóm tắt và định chỉ mục tóm tắt nội dung của tác phẩm nguồn. @vi
toolkit label: được tóm tắt trong (tác phẩm) @vi
toolkit definition: Tác phẩm mà dịch vụ tóm tắt và định chỉ mục tóm tắt nội dung của tác phẩm nguồn. @vi
label: ist Abstract in (Werk) @de
definition: Setzt ein Werk in Beziehung zu einem Werk, das den Inhalt eines anderen Werks zusammenfasst. @de
toolkit label: Abstract in (Werk) @de
toolkit definition: Ein Werk, das den Inhalt eines anderen Werks zusammenfasst. @de
label: est résumé analytiquement dans une œuvre @fr
definition: Liittää teoksen teokseen, joka tiivistää toisen teoksen sisällön. @fi
toolkit label: abstraktit (teos) @fi
toolkit definition: Teos, joka tiivistää toisen teoksen sisällön. @fi
toolkit label: sammendrag av verk @no
toolkit definition: Et verk som er et sammendrag av innholdet i annet verk. @no
label: és resumit en una obra @ca
definition: Relaciona una obra amb una obra que resumeix els continguts d’una altra obra. @ca
toolkit label: resumit en una obra @ca
toolkit definition: Obra que resumeix els continguts d’una altra obra. @ca
has element type: 2
label: είναι επιτομή σε (έργο) @el
definition: Συνδέει ένα έργο με ένα έργο που λειτουργεί ως υπηρεσία επιτομής και ευρετηρίασης, η οποία συνοψίζει τα περιεχόμενα ενός έργου-πηγής. @el
toolkit label: επιτομή σε (έργο) @el
toolkit definition: Ένα έργο που λειτουργεί ως υπηρεσία επιτομής και ευρετηρίασης, η οποία συνοψίζει τα περιεχόμενα ενός έργου-πηγής. @el
label: absztraktja a következő műben: @hu
definition: Hozzákapcsol egy művet egy műhöz, amely egy másik mű tartalmait absztrahálja. @hu
toolkit label: absztraktbefoglaló mű @hu
toolkit definition: Egy mű, amely egy másik mű tartalmait absztrahálja. @hu
label: abstraktit (teos) @fi
label: har sammendrag av verk @no
definition: Relaterer et verk til et verk som er et sammendrag av innholdet i annet verk. @no
label: is geabstraheerd in werk @nl
definition: Relateert een werk aan een werk dat de content van een ander werk abstraheert. @nl
toolkit label: geabstraheerd in werk @nl
toolkit definition: Een werk dat de content van een ander werk abstraheert. @nl
label: هو مستخلص في عمل @ar
definition: يربط عمل بعمل يستخلص محتويات عمل آخر. @ar
toolkit label: مستخلص في عمل @ar
toolkit definition: عمل يستخلص محتويات عمل آخر. @ar
label: annoteeritud teoses @et
definition: Seostab teose teosega, milles on annoteeritud teise teose sisu. @et
toolkit label: annoteeritud teoses @et
toolkit definition: Teos, milles on annoteeritud teise teose sisu. @et
label: ha abstract in opera @it
definition: Correla un’opera a un’opera che è un abstract dei contenuti di un’altra opera. @it
toolkit label: riassunta in opera @it
toolkit definition: Opera che è un abstract dei contenuti di un’altra opera. @it
label: ir rezumējuma darbs @lv
definition: Sasaista darbu ar darbu, kurā rezumēts cita darba saturs. @lv
toolkit label: rezumējuma darbs @lv
toolkit definition: Darbs, kurā rezumēts cita darba saturs. @lv
label: 被摘要于作品 @zh-hans
definition: 将一种作品与为另一种作品的内容编制摘要的一种作品关联起来。 @zh-hans
toolkit label: 被摘要于作品 @zh-hans
toolkit definition: 为另一种作品的内容编制摘要的一种作品 @zh-hans
has subproperty: P10089
label: eserde özetlenmiştir @tr
definition: Bir eseri, başka bir eserin içeriğini özetleyen bir eserle ilişkilendirir. @tr
toolkit label: eserde özetlenen @tr
toolkit definition: Başka bir eserin içeriğini özetleyen eser. @tr

is work commentary in
status: Published
definition: Relates a work to a work that is a set of explanatory or critical notes on a work.
type: Property
domain: C10001
sub property of: is work described by
lexical alias: workCommentaryIn.en
toolkit label: work commentary in
toolkit definition: A work that is a set of explanatory or critical notes on a work
toolkit label: œuvre commentée dans @fr
toolkit definition: Œuvre qui consiste en un ensemble de notes explicatives ou critiques sur une œuvre. @fr
toolkit label: comentario en (obra) @es
toolkit definition: Una obra que contiene un conjunto de notas explicativas o críticas sobre la obra descrita. @es
instruction number: 23.5
label: er værk kommenteret i @da
definition: Relaterer et værk til et værk, som er et sæt af forklarende eller kritiske noter om et værk. @da
toolkit label: værk kommenteret i @da
toolkit definition: Værk, som er et sæt af forklarende eller kritiske noter om et værk. @da
definition: Met une œuvre en relation avec une œuvre qui consiste en un ensemble de notes explicatives ou critiques sur une œuvre. @fr
label: bình luận trong (tác phẩm) @vi
definition: Liên kết tác phẩm với tác phẩm có chứa chuỗi các ghi chú giải thích hoặc phê bình về tác phẩm được mô tả @vi
toolkit label: bình luận trong (tác phẩm) @vi
toolkit definition: Tác phẩm có chứa chuỗi các ghi chú giải thích hoặc phê bình về tác phẩm được mô tả @vi
label: ist Werk kommentiert in @de
definition: Setzt ein Werk in Beziehung zu einem Werk, bei dem es sich um eine Reihe von erläuternden oder kritischen Anmerkungen zu einem Werk handelt. @de
toolkit label: Werk kommentiert in @de
toolkit definition: Ein Werk, bei dem es sich um eine Reihe von erläuternden oder kritischen Anmerkungen zu einem Werk handelt. @de
label: est une œuvre commentée dans @fr
definition: Liittää teoksen teokseen, joka on joukko selittäviä tai kriittisiä huomautuksia teoksesta. @fi
toolkit label: teoksen kommentaari @fi
toolkit definition: Teos, joka on joukko selittäviä tai kriittisiä huomautuksia teoksesta. @fi
toolkit label: verk kommentert i @no
toolkit definition: Et verk som inneholder et sett med forklarende eller kritiske noter til et verk. @no
label: és comentari d’obra en @ca
definition: Relaciona una obra amb una obra que és un conjunt de notes explicatives o crítiques sobre una obra. @ca
toolkit label: comentari d’obra en @ca
toolkit definition: Obra que és un conjunt de notes explicatives o crítiques sobre una obra. @ca
has element type: 2
label: είναι σχόλια στο (έργο) @el
definition: Συνδέει ένα έργο με ένα έργο το οποίο περιέχει ένα σύνολο από επεξηγηματικές ή κριτικές σημειώσεις σε ένα περιγραφόμενο έργο. @el
toolkit label: σχόλια στο (έργο) @el
toolkit definition: Ένα έργο το οποίο περιέχει ένα σύνολο από επεξηγηματικές ή κριτικές σημειώσεις σε ένα περιγραφόμενο έργο. @el
alternative label: commentary in (work)
label: mű kommentálva a következőben: @hu
definition: Hozzákapcsol egy művet egy műhöz, amely egy mű magyarázó vagy kritikai jegyzeteinek a halmaza. @hu
toolkit label: kommentáló mű @hu
toolkit definition: Egy mű, amely egy mű magyarázó vagy kritikai jegyzeteinek a halmaza. @hu
alternative label: kommentaari teoksessa @fi
label: teoksen kommentaari @fi
label: er verk kommentert i @no
definition: Relaterer et verk til et verk som inneholder et sett med forklarende eller kritiske noter til et verk. @no
alternative label: kommentar i (verk) @no
label: is werk-commentaar in @nl
definition: Relateert een werk aan een werk dat is een verzameling van verklarende of kritische noten op een werk. @nl
toolkit label: werk-commentaar in @nl
toolkit definition: Een werk dat is een verzameling van verklarende of kritische noten op een werk. @nl
label: هو تعليق على عمل في @ar
definition: يربط عمل بعمل عبارة عن مجموعة من الملاحظات الشارحة أو الناقدة لعمل. @ar
alternative label: تعليق في (عمل) @ar
toolkit label: تعليق على عمل في @ar
toolkit definition: عمل عبارة عن مجموعة من الملاحظات الشارحة أو الناقدة لعمل. @ar
alternative label: comentari en (obra) @ca
alternative label: kommentar i værk @da
label: teose kommentaar @et
definition: Seostab teose teosega, mis sisaldab kogumi selgitavaid või kriitilisi märkusi teose kohta. @et
toolkit label: teose kommentaar @et
toolkit definition: Teos, mis sisaldab kogumi selgitavaid või kriitilisi märkusi teose kohta. @et
alternative label: kommentálva a következőben (mű): @hu
label: è opera commento in @it
definition: Correla un’opera a un’opera che è un insieme di note esplicative o critiche su un’opera. @it
alternative label: commento in (opera) @it
toolkit label: opera commento in @it
toolkit definition: Opera che è un insieme di note esplicative o critiche su un’opera. @it
alternative label: commentaire dans (œuvre) @fr
label: ir darbs komentēts @lv
definition: Sasaista darbu ar darbu, kas ir paskaidrojošu vai kritisku piezīmju kopums par darbu. @lv
toolkit label: darbs komentēts @lv
toolkit definition: Darbs, kas ir paskaidrojošu vai kritisku piezīmju kopums par darbu. @lv
alternative label: Kommentar in (Werk) @de
alternative label: ……中的评注（作品） @zh-hans
toolkit label: ……中的作品评注 @zh-hans

is work described by
status: Published
definition: Relates a work to a work that is a description of a work.
type: Property
domain: C10001
sub property of: is subject work of
toolkit label: work described by
toolkit definition: A work that is a description of a work.
toolkit label: œuvre décrite par @fr
toolkit definition: Œuvre qui consiste en une description d’une œuvre. @fr
toolkit label: descrita en (obra) @es
toolkit definition: Una obra que describe una obra descrita. @es
instruction number: 23.5
label: er værk beskrevet i @da
definition: Relaterer et værk til et værk, som beskriver et værk. @da
toolkit label: værk beskrevet i @da
toolkit definition: Værk, som beskriver et værk. @da
definition: Met une œuvre en relation avec une œuvre qui consiste en une description d’une œuvre. @fr
label: được mô tả trong (tác phẩm) @vi
definition: Liên kết tác phẩm với tác phẩm mô tả tác phẩm được mô tả. @vi
toolkit label: được mô tả trong (tác phẩm) @vi
toolkit definition: Tác phẩm mô tả tác phẩm được mô tả. @vi
label: ist Werk beschrieben in @de
definition: Setzt ein Werk in Beziehung zu einem Werk, das ein Werk beschreibt. @de
toolkit label: Werk beschrieben in @de
toolkit definition: Ein Werk, das ein Werk beschreibt. @de
label: est une œuvre décrite par @fr
definition: Liittää teoksen teokseen, joka on teoksen kuvaus. @fi
toolkit label: teosta kuvaava teos @fi
toolkit definition: Teos, joka on teoksen kuvaus. @fi
toolkit label: verk beskrevet i @no
toolkit definition: Et verk som beskriver et verk. @no
label: és obra descrita per @ca
definition: Relaciona una obra amb una obra que és una descripció d’una obra. @ca
toolkit label: obra descrita per @ca
toolkit definition: Obra que és una descripció d’una obra. @ca
has element type: 2
alternative label: described in (work)
label: περιγράφεται στο (έργο) @el
definition: Συνδέει ένα έργο με ένα έργο το οποίο περιγράφει ένα περιγραφόμενο έργο. @el
toolkit label: περιγράφεται στο (έργο) @el
toolkit definition: Ένα έργο το οποίο περιγράφει ένα περιγραφόμενο έργο. @el
label: mű leírva a következőben: @hu
definition: Hozzákapcsol egy művet egy műhöz, amely egy művet ír le. @hu
toolkit label: mű leírva a következőben: @hu
toolkit definition: Egy mű, amely egy művet ír le. @hu
alternative label: kuvattu teoksessa @fi
label: teosta kuvaava teos @fi
label: er verk beskrevet i @no
definition: Relaterer et verk til et verk som beskriver et verk. @no
alternative label: beskrevet i (verk) @no
label: is werk beschreven in @nl
definition: Relateert een werk aan een werk dat een werk beschrijft. @nl
toolkit label: werk beschreven in @nl
toolkit definition: Een werk dat een werk beschrijft. @nl
label: هو عمل وُصف في @ar
definition: يربط عمل بعمل يصف عمل. @ar
alternative label: وُصف في (عمل) @ar
toolkit label: عمل وُصف في @ar
toolkit definition: عمل يصف عمل. @ar
alternative label: descrit en (obra) @ca
alternative label: beskrevet i værk @da
label: teose kirjeldus @et
definition: Seostab teose teosega, mis kirjeldab teost. @et
toolkit label: teose kirjeldus @et
toolkit definition: Teos, mis kirjeldab teost. @et
alternative label: leírva a következőben (mű): @hu
label: è opera descritta in @it
definition: Correla un'opera a un'opera che descrive un'opera. @it
alternative label: descritta in (opera) @it
toolkit label: opera descrittta in @it
toolkit definition: Opera che descrive un'opera. @it
lexical alias: workDescribedBy.en
label: ir darba apraksts @lv
definition: Sasaista darbu ar darbu, kurā aprakstīts konkrētais darbs. @lv
toolkit label: darba apraksts @lv
toolkit definition: Darbs, kurā aprakstīts konkrētais darbs. @lv
alternative label: Beschrieben in (Werk) @de
alternative label: 被描述于（作品） @zh-hans
label: 是被……描述的作品 @zh-hans
toolkit label: 被……描述的作品 @zh-hans

is work reviewed by
status: Published
definition: Relates a work to a work that is a brief evaluation of a work.
type: Property
domain: C10001
toolkit label: work reviewed by
toolkit definition: A work that is a brief evaluation of a work.
toolkit label: œuvre recensée par @fr
toolkit definition: Œuvre qui consiste en une brève évaluation d’une œuvre. @fr
toolkit label: reseñada en (obra) @es
toolkit definition: Una obra que contiene una evaluación breve de la obra descrita. @es
instruction number: 23.5
label: er værk anmeldt i @da
definition: Relaterer et værk til et værk, som indeholder en kort evaluering af et værk. @da
toolkit label: værk anmeldt i @da
toolkit definition: Værk, som indeholder en kort evaluering af et værk. @da
definition: Met une œuvre en relation avec une œuvre qui consiste en une brève évaluation d’une œuvre. @fr
label: được tổng thuật trong (tác phẩm) @vi
definition: Liên kết tác phẩm với tác phẩm có chứa đánh giá vắn tắt tác phẩm được mô tả. @vi
toolkit label: được tổng thuật trong (tác phẩm) @vi
toolkit definition: Tác phẩm có chứa đánh giá vắn tắt tác phẩm được mô tả. @vi
label: ist Werk rezensiert in @de
definition: Setzt ein Werk in Beziehung zu einem Werk, bei dem es sich um eine kurze Untersuchung eines Werks handelt. @de
toolkit label: Werk rezensiert in @de
toolkit definition: Ein Werk, bei dem es sich um eine kurze Untersuchung eines Werks handelt. @de
label: est une œuvre recensée par @fr
definition: Liittää teoksen teokseen, joka on teoksen lyhyt arviointi. @fi
toolkit label: teoksen arvostelu @fi
toolkit definition: Teos, joka on teoksen lyhyt arviointi. @fi
toolkit label: verk anmeldt i @no
toolkit definition: Et verk som inneholder en kortfattet evaluering av et verk. @no
label: és obra revisada per @ca
definition: Relaciona una obra amb una obra que és una avaluació breu d’una obra. @ca
toolkit label: obra revisada per @ca
toolkit definition: Obra que és una avaluació breu d’una obra. @ca
has element type: 2
alternative label: reviewed in (work)
label: εξετάζεται στο (έργο) @el
definition: Συνδέει ένα έργο με ένα έργο το οποίο περιέχει μια σύντομη αξιολόγηση του περιγραφόμενου έργου. @el
toolkit label: εξετάζεται στο (έργο) @el
toolkit definition: Ένα έργο το οποίο περιέχει μια σύντομη αξιολόγηση του περιγραφόμενου έργου. @el
label: mű szemlézve a következőben: @hu
definition: Hozzákapcsol egy művet egy műhöz, amely egy mű rövid értékelése. @hu
toolkit label: mű szemlézve a következőben: @hu
toolkit definition: Egy mű, amely egy mű rövid értékelése. @hu
alternative label: arvosteltu teoksessa @fi
label: teoksen arvostelu @fi
label: er verk anmeldt i @no
definition: Relaterer et verk til et verk som inneholder en kortfattet evaluering av et verk. @no
alternative label: anmeldt i (verk) @no
label: is werk gerecenseerd in @nl
definition: Relateert een werk aan een werk dat is korte beschouwing van een werk. @nl
toolkit label: werk gerecenseerd in @nl
toolkit definition: Een werk dat is een korte beschouwing van een werk. @nl
label: هو عمل مراجَع في @ar
definition: يربط عمل بعمل عبارة عن تقييم موجز لعمل. @ar
alternative label: مراجَع في (عمل) @ar
toolkit label: عمل مراجَع في @ar
toolkit definition: عمل عبارة عن تقييم موجز لعمل. @ar
alternative label: revisat en (obra) @ca
alternative label: anmeldt i værk @da
label: teose ülevaade @et
definition: Seostab teose teosega, mis sisaldab lühikest hinnangut teosele. @et
toolkit label: teose ülevaade @et
toolkit definition: Teos, mis sisaldab lühikest hinnangut teosele. @et
alternative label: szemlézve a következőben (mű): @hu
label: è opera recensita in @it
definition: Correla un'opera a un'opera che contiene una breve valutazione di un'opera. @it
alternative label: recensita in (opera) @it
toolkit label: opera recensita in @it
toolkit definition: Opera che contiene una breve valutazione di un'opera. @it
sub property of: is work evaluated by
lexical alias: workReviewedBy.en
label: ir darba recenzija @lv
definition: Sasaista darbu ar darbu, kas satur īsu darba novērtējumu. @lv
toolkit label: darba recenzija @lv
toolkit definition: Darbs, kas satur īsu darba novērtējumu. @lv
alternative label: Rezensiert in (Werk) @de
alternative label: 被评论于（作品） @zh-hans
label: 是被……评论的作品 @zh-hans
toolkit label: 被……评论的作品 @zh-hans

is absorption of work
status: Published
definition: Relates a work to a work whose content is incorporated in the content of another work.
type: Property
domain: C10001
sub property of: is preceded by work
lexical alias: absorptionOfWork.en
toolkit label: absorption of work
toolkit definition: A work whose content is incorporated in the content of another work.
toolkit label: absorption d’une œuvre @fr
toolkit definition: Œuvre dont le contenu est intégré dans celui d’une autre œuvre. @fr
toolkit label: absorbida (obra) @es
toolkit definition: La obra que se ha incorporado en otra obra. @es
instruction number: 24.5
label: er indlemmelse af værk @da
definition: Relaterer et værk til et værk, hvis indhold er inkorporeret i et andet værks indhold. @da
toolkit label: indlemmelse af værk @da
toolkit definition: Værk, hvis indhold er inkorporeret i et andet værks indhold. @da
definition: Met une œuvre en relation avec une œuvre dont le contenu est intégré dans celui d’une autre œuvre. @fr
label: là hấp thụ của (tác phẩm) @vi
definition: Liên kết tác phẩm với tác phẩm đã được kết hợp vào tác phẩm khác. @vi
toolkit label: hấp thụ của (tác phẩm) @vi
toolkit definition: Tác phẩm đã được kết hợp vào tác phẩm khác. @vi
label: ist darin aufgegangen (Werk) @de
definition: Setzt ein Werk in Beziehung zu einem Werk, dessen Inhalt in den Inhalt eines anderen Werks eingeflossen ist. @de
toolkit label: Darin aufgegangen (Werk) @de
toolkit definition: Ein Werk, dessen Inhalt in den Inhalt eines anderen Werks eingeflossen ist. @de
label: est une absorption d’une œuvre @fr
definition: Liittää teoksen teokseen, jonka sisältö on yhdistynyt toisen teoksen sisältöön. @fi
toolkit label: sulautunut teos @fi
toolkit definition: Teos, jonka sisältö on yhdistynyt toisen teoksen sisältöön. @fi
toolkit label: innlemmelse av verk @no
toolkit definition: Et verk hvis innhold er innlemmet i innholdet i et annet verk. @no
label: és absorció d’una obra @ca
definition: Relaciona una obra amb una obra el contingut de la qual s’incorpora en el contingut d’una altra obra. @ca
toolkit label: absorció d’una obra @ca
toolkit definition: Obra el contingut de la qual s’incorpora en el contingut d’una altra obra. @ca
has element type: 2
label: είναι απορρόφηση του (έργο) @el
definition: Συνδέει ένα έργο με ένα έργο το οποίο έχει ενσωματωθεί σε ένα άλλο έργο. @el
toolkit label: απορρόφηση του (έργο) @el
toolkit definition: Ένα έργο το οποίο έχει ενσωματωθεί σε ένα άλλο έργο. @el
label: beolvasztja a következő művet: @hu
definition: Hozzákapcsol egy művet egy műhöz, amelynek tartalma beolvad egy másik mű tartalmába. @hu
toolkit label: beolvasztott mű @hu
toolkit definition: Egy mű, amelynek tartalma beolvad egy másik mű tartalmába. @hu
label: sulautunut teos @fi
label: er innlemmelse av verk @no
definition: Relaterer et verk til et verk hvis innhold er innlemmet i innholdet i et annet verk. @no
label: is opname van werk @nl
definition: Relateert een werk aan een werk waarvan de content opgenomen is in de content van een ander werk. @nl
toolkit label: opname van werk @nl
toolkit definition: Een werk waarvan de content opgenomen is in de content van een ander werk. @nl
label: هو احتواء لعمل @ar
definition: يربط عمل بعمل يكون محتواه مدمجًا في محتوى عمل آخر. @ar
toolkit label: احتواء لعمل @ar
toolkit definition: عمل يكون محتواه مدمجًا في محتوى عمل آخر. @ar
label: sulandunud teos @et
definition: Seostab teose teosega, mille sisu on haaratud teise teose sisusse. @et
toolkit label: sulandunud teos @et
toolkit definition: Teos, mille sisu on haaratud teise teose sisusse. @et
label: è assorbimento di opera @it
definition: Correla un’opera a un'opera il cui contenuto è incorporato nel contenuto di un’altra opera. @it
toolkit label: assorbimento di opera @it
toolkit definition: Opera il cui contenuto è incorporato nel contenuto di un’altra opera. @it
label: ir iekļautais darbs @lv
definition: Sasaista darbu ar darbu, kas iekļauts saistītajā darbā. @lv
toolkit label: iekļautais darbs @lv
toolkit definition: Darbs, kas iekļauts saistītajā darbā. @lv
label: 是作品的吸收 @zh-hans
definition: 将一种作品与其内容被纳入另一种作品之内容的一种作品关联起来。 @zh-hans
toolkit label: 作品的吸收 @zh-hans
toolkit definition: 其内容被纳入另一种作品之内容的一种作品 @zh-hans
has subproperty: P10224
label: eserin kapsanmasıdır @tr
definition: Bir eseri, içeriği başka bir eserin içeriğine dahil edilen bir eserle ilişkilendirir. @tr
toolkit label: eserin kapsaması @tr
toolkit definition: Bir içeriği başka bir eserin içeriğine dahil edilen çalışma. @tr

is critique of work
status: Published
definition: Relates a work to a work that is critically evaluated by a work.
type: Property
domain: C10001
lexical alias: critiqueOfWork.en
toolkit label: critique of work
toolkit definition: A work that is critically evaluated by a work.
toolkit label: critique d’une œuvre @fr
toolkit definition: Œuvre qui fait l’objet d’une évaluation critique par une œuvre. @fr
toolkit label: crítica de (obra) @es
toolkit definition: Una obra usada como base de una evaluación crítica. @es
instruction number: 23.5
label: er kritik af værk @da
definition: Relaterer et værk til et værk, som anvendes som grundlag for en kritisk evaluering. @da
toolkit label: kritik af værk @da
toolkit definition: Værk, som anvendes som grundlag for en kritisk evaluering. @da
definition: Met une œuvre en relation avec une œuvre qui fait l’objet d’une évaluation critique par une œuvre. @fr
label: phê bình của (tác phẩm) @vi
definition: Liên kết tác phẩm với tác phẩm được sử dụng như là cơ sở cho đánh giá phê bình. @vi
toolkit label: phê bình của (tác phẩm) @vi
toolkit definition: Tác phẩm được sử dụng như là cơ sở cho đánh giá phê bình. @vi
label: ist Kritik von (Werk) @de
definition: Setzt ein Werk in Beziehung zu einem Werk, das als Grundlage für eine kritische Untersuchung verwendet wird. @de
toolkit label: Kritik von (Werk) @de
toolkit definition: Ein Werk, das als Grundlage für eine kritische Untersuchung verwendet wird. @de
label: est une critique d’une œuvre @fr
definition: Liittää teoksen teokseen, johon kriittinen arviointi perustuu. @fi
toolkit label: kritiikki teoksesta @fi
toolkit definition: Teos, johon kriittinen arviointi perustuu. @fi
toolkit label: kritikk av verk @no
toolkit definition: Et verk brukt som utgangspunkt for en kritisk evaluering. @no
label: és crítica d’una obra @ca
definition: Relaciona una obra amb una obra que és avaluada críticament per una obra. @ca
toolkit label: crítica d’una obra @ca
toolkit definition: Obra que és avaluada críticament per una obra. @ca
has element type: 2
label: είναι κριτική του (έργο) @el
definition: Συνδέει ένα έργο με ένα έργο το οποίο χρησιμοποιείται ως η βάση για μια κριτική αξιολόγηση. @el
toolkit label: κριτική του (έργο) @el
toolkit definition: Ένα έργο το οποίο χρησιμοποιείται ως η βάση για μια κριτική αξιολόγηση. @el
label: bírálata a következő műnek: @hu
definition: Hozzákapcsol egy művet egy műhöz, amelyet egy kritikai kiértékelés alapjaként használnak. @hu
toolkit label: bírált mű @hu
toolkit definition: Egy mű, amelyet egy kritikai kiértékelés alapjaként használnak. @hu
label: kritiikki teoksesta @fi
label: er kritikk av verk @no
definition: Relaterer et verk til et verk brukt som utgangspunkt for en kritisk evaluering. @no
label: is kritiek van werk @nl
definition: Relateert een werk aan een werk gebruikt als een basis voor een kritische beschouwing. @nl
toolkit label: kritiek van werk @nl
toolkit definition: Een werk gebruikt als een basis voor een kritische beschouwing. @nl
label: هو نقد لعمل @ar
definition: يربط عمل بعمل يُستخدم كأساس لتقييم نقدي. @ar
toolkit label: نقد لعمل @ar
toolkit definition: عمل يُستخدم كأساس لتقييم نقدي. @ar
label: arvustatud teos @et
definition: Seostab teose teosega, mis on aluseks kriitilisele hinnangule. @et
toolkit label: arvustatud teos @et
toolkit definition: Teos, mis on aluseks kriitilisele hinnangule. @et
label: è critica di opera @it
definition: Correla un'opera a un'opera usata come base per una valutazione critica. @it
toolkit label: critica di opera @it
toolkit definition: Opera usata come base per una valutazione critica. @it
sub property of: is evaluation of work
label: ir kritika darbam @lv
definition: Sasaista darbu ar darbu, kas izmantots par pamatu kritikai. @lv
toolkit label: kritika darbam @lv
toolkit definition: Darbs, kas izmantots par pamatu kritikai. @lv
label: 是作品的批评 @zh-hans
definition: 将一种作品与被被一种作品批评性评价的一种作品关联起来。 @zh-hans
toolkit label: 作品的批评 @zh-hans
toolkit definition: 被一种作品批评性评价的一种作品 @zh-hans
has subproperty: P10182
label: eserin eleştirisidir @tr
definition: Bir eseri, bir çalışma tarafından eleştirel olarak değerlendirilen bir eserle ilişkilendirir. @tr
toolkit label: eserin eleştirisi @tr
toolkit definition: Bir çalışma tarafından eleştirel olarak değerlendirilen bir çalışma. @tr

is expanded version of work
status: Published
definition: Relates a work to a work used as a basis for a derivative work that enlarges upon the content of another work.
type: Property
domain: C10001
sub property of: has source work
lexical alias: expandedVersionOfWork.en
toolkit label: expanded version of work
toolkit definition: A work used as a basis for a derivative work that enlarges upon the content of another work.
toolkit label: version augmentée d’une œuvre @fr
toolkit definition: Œuvre qui sert de base à une œuvre dérivée qui accroît le contenu d’une autre œuvre. @fr
toolkit label: versión ampliada de (obra) @es
toolkit definition: Una obra utilizada como base para una obra derivada que aumenta el contenido de la obra fuente. @es
instruction number: 24.5
label: er udvidet version af værk @da
definition: Relaterer et værk til et værk, som anvendes som grundlag for et afledt værk, som uddyber et oprindeligt værks indhold. @da
toolkit label: udvidet version af værk @da
toolkit definition: Værk, som anvendes som grundlag for et afledt værk, som uddyber et oprindeligt værks indhold. @da
definition: Met une œuvre en relation avec une œuvre qui sert de base à une œuvre dérivée qui accroît le contenu d’une autre œuvre. @fr
label: là phiên bản mở rộng của (tác phẩm) @vi
definition: Liên kết tác phẩm với tác phẩm được sử dụng như là cơ sở cho tác phẩm dẫn xuất mở rộng nội dung của tác phẩm nguồn. @vi
toolkit label: phiên bản mở rộng của (tác phẩm) @vi
toolkit definition: Tác phẩm được sử dụng như là cơ sở cho tác phẩm dẫn xuất mở rộng nội dung của tác phẩm nguồn. @vi
label: ist erweiterte Ausgabe von (Werk) @de
definition: Setzt ein Werk in Beziehung zu einem Werk, das als Grundlage für ein abgeleitetes Werk verwendet wird, die den Inhalt eines anderen Werks näher erläutert. @de
toolkit label: Erweiterte Ausgabe von (Werk) @de
toolkit definition: Ein Werk, das als Grundlage für ein abgeleitetes Werk verwendet wird, die den Inhalt eines anderen Werks näher erläutert. @de
label: est une version augmentée d’une œuvre @fr
definition: Liittää teoksen teokseen, jota on käytetty toisen teoksen sisältöä laajentavan johdannaisteoksen perustana. @fi
toolkit label: laajennettu versio teoksesta @fi
toolkit definition: Teos, jota on käytetty toisen teoksen sisältöä laajentavan johdannaisteoksen perustana. @fi
toolkit label: utvidet versjon av verk @no
toolkit definition: Et verk som brukes som utgangspunkt for et avledet verk som utvider innholdet fra et kildeverk. @no
label: és versió ampliada d’una obra @ca
definition: Relaciona una obra amb una obra usada com a base d’una obra derivada que amplia el contingut d’una altra obra. @ca
toolkit label: versió ampliada d’una obra @ca
toolkit definition: Obra usada com a base d’una obra derivada que amplia el contingut d’una altra obra. @ca
has element type: 2
label: είναι εκτεταμένη εκδοχή του (έργο) @el
definition: Συνδέει ένα έργο με ένα έργο που χρησιμοποιείται ως η βάση για ένα παράγωγο έργο το οποίο αυξάνει την έκταση του περιεχομένου ενός έργου-πηγής. @el
toolkit label: εκτεταμένη εκδοχή του (έργο) @el
toolkit definition: Ένα έργο που χρησιμοποιείται ως η βάση για ένα παράγωγο έργο το οποίο αυξάνει την έκταση του περιεχομένου ενός έργου-πηγής. @el
label: bővített változata a következő műnek: @hu
definition: Hozzákapcsol egy művet egy műhöz, amelyet alapként használnak egy másik mű tartalmát tágító származékos műhöz. @hu
toolkit label: bővített mű @hu
toolkit definition: Egy mű, amelyet alapként használnak egy másik mű tartalmát tágító származékos műhöz. @hu
label: laajennettu versio teoksesta @fi
label: er utvidet versjon av verk @no
definition: Relaterer et verk til et verk som brukes som utgangspunkt for et avledet verk som utvider innholdet fra et kildeverk. @no
label: is uitgebreide versie van werk @nl
definition: Relateert een werk aan een werk gebruikt als een basis voor een afgeleid werk dat de content van een ander werk uitbreidt. @nl
toolkit label: uitgebreide versie van werk @nl
toolkit definition: Een werk gebruikt als een basis voor een afgeleid werk dat de content van een ander werk uitbreidt. @nl
label: هو إصدارة موسعة لعمل @ar
definition: يربط عمل بعمل يُستخدم كأساس لعمل مشتق يتوسع في محتوى عمل آخر. @ar
toolkit label: إصدارة موسعة لعمل @ar
toolkit definition: عمل يُستخدم كأساس لعمل مشتق يتوسع في محتوى عمل آخر. @ar
label: laiendatud versioon teosest @et
definition: Seostab teose teosega, mis on aluseks tuletatud teosele, milles on avardatud allikteose sisu. @et
toolkit label: laiendatud versioon teosest @et
toolkit definition: Teos, mis on aluseks tuletatud teosele, milles on avardatud allikteose sisu. @et
label: è versione estesa di opera @it
definition: Correla un’opera a un’opera utilizzata come base per un’opera derivata che amplia il contenuto di un’opera di partenza. @it
toolkit label: versione estesa di opera @it
toolkit definition: Opera utilizzata come base per un’opera derivata che amplia il contenuto di un’opera di partenza. @it
label: ir paplašinājums darbam @lv
definition: Sasaista darbu ar darbu, kas izmantots par pamatu atvasinātam darbam, kas ir saturisks paplašinājums pamatdarbam. @lv
toolkit label: paplašinājums darbam @lv
toolkit definition: Darbs, kas izmantots par pamatu atvasinātam darbam, kas ir saturisks paplašinājums pamatdarbam. @lv
label: 是作品的扩充版 @zh-hans
definition: 将一种作品与被用作在另一种作品之内容基础上扩充的一种衍生作品的基础的一种作品关联起来。 @zh-hans
toolkit label: 作品的扩充版 @zh-hans
toolkit definition: 被用作在另一种作品之内容基础上扩充的一种衍生作品的基础的一种作品 @zh-hans
has subproperty: P10184
label: eserin genişletilmiş sürümüdür @tr
definition: Bir eseri, başka bir eserin içeriğini genişleten türev bir eser için temel olarak kullanılan bir eserle ilişkilendirir. @tr
toolkit label: eserin genişletilmiş hali @tr
toolkit definition: Başka bir çalışmanın içeriğini genişleten türetilmiş bir eser için temel olarak kullanılan bir çalışma. @tr

has title of work
status: Published
definition: Relates a work to a nomen that is an appellation of work in natural language and phrasing used in common discourse.
type: Property
domain: C10001
lexical alias: titleOfWork.en
instruction number: 6.2
toolkit label: title of work
toolkit definition: A nomen that is an appellation of work in natural language and phrasing used in common discourse.
toolkit label: titre d’œuvre @fr
toolkit definition: Nomen qui est une appellation d’œuvre exprimée dans un langage et une formulation naturels et utilisée dans le langage courant. @fr
toolkit label: título de la obra @es
toolkit definition: Una palabra, carácter o grupo de palabras y/o caracteres mediante las cuales se conoce una obra. @es
label: har verktitel @sv
toolkit label: verktitel @sv
label: har titel på værk @da
definition: Relaterer et værk til en benævnelse på værk på normalsprog og med formuleringer, som bruges alment. @da
toolkit label: titel på værk @da
toolkit definition: Benævnelse på værk på normalsprog og med formuleringer, som bruges alment. @da
definition: Met une œuvre en relation avec un nomen qui est une appellation d’œuvre exprimée dans un langage et une formulation naturels et utilisée dans le langage courant. @fr
label: có nhan đề của tác phẩm @vi
definition: Liên kết tác phẩm với từ, ký tự, hoặc nhóm từ và/hoặc ký tự mà theo đó tác phẩm được biết tới. @vi
toolkit label: nhan đề của tác phẩm @vi
toolkit definition: Từ, ký tự, hoặc nhóm từ và/hoặc ký tự mà theo đó tác phẩm được biết tới. @vi
label: hat Titel eines Werks @de
definition: Setzt ein Werk in Beziehung zu einer Bezeichnung für ein Werk in natürlicher Sprache und Ausdrucksweise, die beim normalen Sprechen und Schreiben verwendet wird. @de
toolkit label: Titel eines Werks @de
toolkit definition: Eine Bezeichnung für ein Werk in natürlicher Sprache und Ausdrucksweise, die beim normalen Sprechen und Schreiben verwendet wird. @de
label: a pour titre d’œuvre @fr
definition: Liittää teoksen nomeniin, joka on luonnollisella kielellä ja sanamuodolla oleva, yleisessä diskurssissa käytetty teoksen nimitykseen. @fi
toolkit label: teoksen nimeke @fi
toolkit definition: Nomen, joka on luonnollisella kielellä ja sanamuodolla oleva, yleisessä diskurssissa käytetty teoksen nimitys. @fi
toolkit label: tittel på verk @no
toolkit definition: En betegnelse på et verk på et naturlig språk og med en frasering som brukes i vanlig diskurs. @no
label: té com a títol d’obra @ca
definition: Relaciona una obra amb un nomen que és una apel·lació d’obra en llenguatge i frases naturals usada en el discurs comú. @ca
toolkit label: títol d’obra @ca
toolkit definition: Nomen que és una apel·lació d’obra en llenguatge i frases naturals usada en el discurs comú. @ca
sub property of: has appellation of work
has element type: 3
label: έχει τίτλο του έργου @el
definition: Συνδέει ένα έργο με μια λέξη, έναν χαρακτήρα ή μια ομάδα λέξεων ή/και χαρακτήρων με τους οποίους είναι γνωστό ένα έργο. @el
toolkit label: τίτλος του έργου @el
toolkit definition: Μια λέξη, ένας χαρακτήρας ή μια ομάδα λέξεων ή/και χαρακτήρων με τους οποίους είναι γνωστό ένα έργο. @el
label: mű címe a következő: @hu
definition: Hozzákapcsol egy művet egy nomenhez, amely egy a műhöz tartozó természetes nyelvű megnevezés és a közbeszédben használt megfogalmazás. @hu
toolkit label: műcím @hu
toolkit definition: Egy nomen, amely egy a műhöz tartozó természetes nyelvű megnevezés és a közbeszédben használt megfogalmazás. @hu
sub property of: P00019
label: teoksen nimeke @fi
label: har tittel på verk @no
definition: Relaterer et verk til en betegnelse på et verk på et naturlig språk og med en frasering som brukes i vanlig diskurs. @no
label: heeft titel van werk @nl
definition: Relateert een werk aan een nomen dat is een benaming van werk in natuurlijke taal en terminologie in gebruikelijke bewoording. @nl
toolkit label: titel van werk @nl
toolkit definition: Een nomen dat is een benaming van werk in natuurlijke taal en terminologie in gebruikelijke bewoording. @nl
label: له عنوان لعمل @ar
definition: يربط بين عمل وتسمية عبارة عن اسم تعريفي لعمل باللغة الطبيعية والصياغة المستخدمة في الخطاب العام. @ar
toolkit label: عنوان عمل @ar
toolkit definition: تسمية عبارة عن اسم تعريفي لعمل باللغة الطبيعية والصياغة المستخدمة في الخطاب العام. @ar
label: teose pealkiri @et
definition: Seostab teose teose nimetusega loomulikus keeles ja sõnastuses, mida kasutatakse ühises diskursuses. @et
toolkit label: teose pealkiri @et
toolkit definition: Teose nimetus loomulikus keeles ja sõnastuses, mida kasutatakse ühises diskursuses. @et
label: ha come titolo di opera @it
definition: Correla un’opera a una denominazione dell’opera in linguaggio e frasi naturali usati nel discorso comune. @it
toolkit label: titolo di opera @it
toolkit definition: Denominazione dell’opera in linguaggio e frasi naturali usati nel discorso comune. @it
label: darba nosaukums @lv
definition: Sasaista darbu ar nomenu, kas ir darba apzīmējums dabiskajā valodā un frāzē, ko lieto kopējā diskursā. @lv
toolkit label: darba nosaukums @lv
toolkit definition: Darba apzīmējums dabiskajā valodā un frāzē, ko lieto kopējā diskursā. @lv
label: 有作品的题名 @zh-hans
definition: 将一种作品与作为用自然语言和普通话语措词表达的作品的称谓的一个命名关联起来。 @zh-hans
toolkit label: 作品的题名 @zh-hans
toolkit definition: 作为用自然语言和普通话语措词表达的作品的称谓的一个命名 @zh-hans
has subproperty: has key title
has subproperty: has variant title of work
has subproperty: has preferred title of work
has subproperty: P10088

has variant title of work
status: Published
definition: Relates a work to a nomen that is a title of work that is not selected for preference in a specific application or context.
type: Property
domain: C10001
sub property of: has title of work
lexical alias: variantTitleOfWork.en
instruction number: 6.2.3
toolkit label: variant title of work
toolkit definition: A nomen that is a title of work that is not selected for preference in a specific application or context.
toolkit label: variante de titre d’œuvre @fr
toolkit definition: Nomen qui est un titre d’œuvre ne faisant pas l’objet d’un choix privilégié dans une application ou un contexte spécifiques. @fr
toolkit label: variante de título de una obra @es
toolkit definition: Un título o una forma del título, por la que se conoce una obra que difiere del título o de la forma del título elegida como el título preferido de la obra. @es
label: har varianttitel för verket @sv
toolkit label: varianttitel för verket @sv
scope note: A variant title of work includes a title or form of title appearing on a manifestation of the work or found in reference sources, a title resulting from a different transliteration of a title, etc.
label: har variant af titel på værk @da
definition: Relaterer et værk til en titel på værk, som ikke er valgt som præference i en specifik anvendelse eller kontekst. @da
toolkit label: variant af titel på værk @da
toolkit definition: Titel på værk, som ikke er valgt som præference i en specifik anvendelse eller kontekst. @da
definition: Met une œuvre en relation avec un nomen qui est un titre d’œuvre ne faisant pas l’objet d’un choix privilégié dans une application ou un contexte spécifiques. @fr
label: có nhan đề khác của tác phẩm @vi
definition: Liên kết tác phẩm với nhan đề hoặc hình thái của nhan đề mà theo đó tác phẩm được biết tới nhưng khác với nhan đề hoặc hình thái của nhan đề được chọn như là nhan đề ưu tiên của tác phẩm. @vi
scope note: Nhan đè khác của tác phẩm bao gồm cả nhan đề hoặc hình thái của nhan đề xuất hiện trên biểu hiện của tác phẩm hoặc được tìm thấy trong các nguồn tham khảo, nhan đề là kết quả của việc chuyển tự khác nhau của nhan đề, v.v... @vi
toolkit label: nhan đề khác của tác phẩm @vi
toolkit definition: Nhan đề hoặc hình thái của nhan đề mà theo đó tác phẩm được biết tới nhưng khác với nhan đề hoặc hình thái của nhan đề được chọn như là nhan đề ưu tiên của tác phẩm. @vi
label: hat abweichenden Titel eines Werks @de
definition: Setzt ein Werk in Beziehung zu einem Titel eines Werks, der in einer bestimmten Anwendung oder in einem bestimmten Kontext nicht als Vorzugsform bestimmt wird. @de
scope note: Darunter fallen Titel oder Titelformen, die in einer Manifestation des Werks erscheinen oder in Nachschlagewerken zu finden sind, Titel, die sich aus einer abweichenden Transliteration ergeben, und so weiter. @de
toolkit label: Abweichender Titel eines Werks @de
toolkit definition: Ein Titel eines Werks, der in einer bestimmten Anwendung oder in einem bestimmten Kontext nicht als Vorzugsform bestimmt wird. @de
label: a pour variante de titre d’œuvre @fr
definition: Liittää teoksen nomeniin, joka on teoksen nimeke, jota ei ole valittu ensisijaiseksi tietyssä sovelluksessa tai kontekstissa. @fi
toolkit label: teoksen varianttinimeke @fi
toolkit definition: Nomen, joka on teoksen nimeke, jota ei ole valittu ensisijaiseksi tietyssä sovelluksessa tai kontekstissa. @fi
toolkit label: tittelvariant for verk @no
toolkit definition: En tittel på verk som ikke er valgt som preferanse i en spesifikk applikasjon eller sammenheng. @no
label: té com a variant de títol d’obra @ca
definition: Relaciona una obra amb un nomen que és un títol d’obra que no se selecciona com a preferent en una aplicació o un context específic. @ca
scope note: Una variant de títol d’obra inclou un títol o una forma de títol que figura a una manifestació de l’obra o trobat en fonts de referència, un títol que és el resultat d’una transliteració diferent del títol, etc. @ca
toolkit label: variant de títol d’obra @ca
toolkit definition: Nomen que és un títol d’obra que no se selecciona com a preferent en una aplicació o un context específic. @ca
scope note: Une variante de titre d’œuvre comprend un titre ou une forme de titre figurant sur une manifestation de l’œuvre ou trouvée dans les sources de référence, un titre qui résulte d’une translittération différente d’un titre, etc. @fr
has element type: 3
label: έχει εναλλακτικό τίτλο για το έργο @el
definition: Συνδέει ένα έργο με έναν τίτλο ή μορφή τίτλου με τον (-ην) οποίο (-α) το έργο είναι γνωστό, που διαφέρει από έναν τίτλο ή μορφή τίτλου που έχει επιλεγεί ως ο προτιμώμενος τίτλος για το έργο. @el
scope note: Ο εναλλακτικός τίτλος για το έργο περιλαμβάνει έναν τίτλο ή μια μορφή τίτλου που εμφανίζεται στην εκδήλωση του έργου ή εντοπίζεται στις πηγές αναφοράς, έναν τίτλο που προκύπτει από έναν διαφορετικό μεταγραμματισμό ενός τίτλου κ.λπ. @el
toolkit label: εναλλακτικός τίτλος για το έργο @el
toolkit definition: Ένας τίτλος ή μορφή τίτλου με τον (-ην) οποίο (-α) το έργο είναι γνωστό, που διαφέρει από έναν τίτλο ή μορφή τίτλου που έχει επιλεγεί ως ο προτιμώμενος τίτλος για το έργο. @el
label: műhöz tartozó címváltozat a következő: @hu
definition: Hozzákapcsol egy művet egy nomenhez, amely egy olyan műcím, amelyet egy adott alkalmazásban vagy kontextusban nem részesítenek előnyben. @hu
scope note: műhöz tartozó címváltozat: @hu
toolkit label: műhöz tartozó címváltozat: @hu
toolkit definition: Egy nomen, amely egy olyan műcím, amelyet egy adott alkalmazásban vagy kontextusban nem részesítenek előnyben. @hu
sub property of: P00023
alternative label: variant title for work
scope note: Teoksen varianttinimeke kattaa nimekkeen tai nimekkeen muodon, joka esiintyy teoksen manifestaatiossa tai tietolähteissä sekä nimekkeen eri translitteroinnit tms. @fi
label: teoksen varianttinimeke @fi
label: har tittelvariant for verk @no
definition: Relaterer et verk til en tittel på verk som ikke er valgt som preferanse i en spesifikk applikasjon eller sammenheng. @no
scope note: En tittelvariant for verk inkluderer en tittel eller tittelform som forekommer på en manifestasjon av verket eller som finnes i referanseverk, en tittel som er resultat av en annen transkripsjon av en tittel, etc. @no
label: heeft variant titel van werk @nl
definition: Relateert een werk aan een nomen dat is een titel van werk die niet bij voorkeur geselecteerd is in een specifieke applicatie of context. @nl
scope note: Een variant titel van werk omvat een titel of vorm van titel die verschijnt op een manifestatie van een werk of die gevonden wordt in naslagwerken, een titel die resulteert uit een verschillende transliteratie van een titel etc. @nl
toolkit label: variant titel van werk @nl
toolkit definition: Een nomen dat is een titel van werk die niet bij voorkeur geselecteerd is in een specifieke applicatie of context. @nl
label: له عنوان عمل متغير @ar
definition: يربط بين عمل وعنوان عمل لم يتم اختياره بتفضيل استخدامه في تطبيق محدد أو سياق محدد. @ar
scope note: يتضمن العنوان المغاير لعمل عنوانًا أو شكل عنوان يظهر على تجسيدة للعمل، أو موجود في مصادر مرجعية، أو عنوان ناتج عن نقحرة مختلفة لعنوان، إلخ. @ar
toolkit label: عنوان عمل متغير @ar
toolkit definition: تسمية عبارة عن عنوان عمل لم يتم اختياره بتفضيل استخدامه في تطبيق محدد أو سياق محدد. @ar
scope note: Variant af titel på værk omfatter en titel eller form for titel, som forekommer på en manifestation for værket eller findes i referenceværker, en titel, som er et resultat af en anden translitteration af en titel, etc. @da
label: teose variantpealkiri @et
definition: Seostab teose teose pealkirjaga, mis kindlas rakenduses või kontekstis ei ole valitud eelistatuks. @et
scope note: Teose variantpealkirjaks võib olla teose kehastuses või teatmeallikates leiduv pealkiri või pealkirjavorm, pealkirja erinevast translitereerimisest tulenev pealkiri vms. @et
toolkit label: teose variantpealkiri @et
toolkit definition: Teose pealkiri, mis kindlas rakenduses või kontekstis ei ole valitud eelistatuks. @et
label: ha come titolo variante di opera @it
definition: Correla un’opera a un titolo dell’opera che non è scelto come preferito in un’applicazione o contesto specifici. @it

is dramatization of work
status: Published
definition: Relates a work to a work that is adapted as a drama.
type: Property
domain: C10001
sub property of: is adaptation of work
lexical alias: dramatizationOfWork.en
toolkit label: dramatization of work
toolkit definition: A work that is adapted as a drama.
toolkit label: adaptation au théâtre d’une œuvre @fr
toolkit definition: Œuvre qui est adaptée en pièce de théâtre. @fr
toolkit label: dramatización de (obra) @es
toolkit definition: Una obra que ha sido adaptada como drama. @es
instruction number: 24.5
label: er dramatisering af værk @da
definition: Relaterer et værk til et værk, som er bearbejdet til et drama. @da
toolkit label: dramatisering af værk @da
toolkit definition: Værk, som er bearbejdet til et drama. @da
definition: Met une œuvre en relation avec une œuvre qui est adaptée en pièce de théâtre. @fr
label: là kịch hoá của (tác phẩm) @vi
definition: Liên kết tác phẩm với tác phẩm được phỏng theo như là kịch. @vi
toolkit label: kịch hoá của (tác phẩm) @vi
toolkit definition: Tác phẩm được phỏng theo như là kịch. @vi
label: ist Bühnenbearbeitung von (Werk) @de
definition: Setzt ein Werk in Beziehung zu einem Werk, das als Theaterstück bearbeitet ist. @de
toolkit label: Bühnenbearbeitung von (Werk) @de
toolkit definition: Ein Werk, das als Theaterstück bearbeitet ist. @de
label: est une adaptation au théâtre d’une œuvre @fr
definition: Liittää teoksen teokseen, joka on sovitettu näytelmäksi. @fi
toolkit label: dramatisointi teoksesta @fi
toolkit definition: Teos, joka on sovitettu näytelmäksi. @fi
toolkit label: dramatisering av verk @no
toolkit definition: Et verk som er bearbeidet til et drama. @no
label: és dramatització d’una obra @ca
definition: Relaciona una obra amb una obra que s’adapta al teatre. @ca
toolkit label: dramatització d’una obra @ca
toolkit definition: Obra que s’adapta al teatre. @ca
has element type: 2
label: είναι δραματοποίηση του (έργο) @el
definition: Συνδέει ένα έργο με ένα έργο το οποίο έχει προσαρμοστεί ως δράμα. @el
toolkit label: δραματοποίηση του (έργο) @el
toolkit definition: Ένα έργο το οποίο έχει προσαρμοστεί ως δράμα. @el
label: dramatizált változata a következő műnek: @hu
definition: Hozzákapcsol egy művet egy műhöz, amelyet drámaként adaptáltak. @hu
toolkit label: dramatizált mű @hu
toolkit definition: Egy mű, amelyet drámaként adaptáltak. @hu
label: dramatisointi teoksesta @fi
label: er dramatisering av verk @no
definition: Relaterer et verk til et verk som er bearbeidet til et drama. @no
label: is dramatisering van werk @nl
definition: Relateert een werk aan een werk dat is bewerkt als een theaterstuk. @nl
toolkit label: dramatisering van werk @nl
toolkit definition: Een werk dat is bewerkt als een theaterstuk. @nl
label: هو اقتباس مسرحي لعمل @ar
definition: يربط عمل بعمل تمت معالجته كمسرحية. @ar
toolkit label: تحوير مسرحي لعمل @ar
toolkit definition: عمل تمت معالجته كمسرحية. @ar
label: dramatiseering teosest @et
definition: Seostab teose teosega, mis on adapteeritud draamana. @et
toolkit label: dramatiseering teosest @et
toolkit definition: Teos, mis on adapteeritud draamana. @et
label: è drammatizzazione di opera @it
definition: è adattata in forma di opera @it
toolkit label: drammatizzazione di opera @it
toolkit definition: Opera adattata in forma teatrale. @it
label: kā luga adaptētais darbs @lv
definition: Sasaista darbu ar darbu, kas ir adaptēts kā luga. @lv
toolkit label: kā luga adaptētais darbs @lv
toolkit definition: Darbs, kas ir adaptēts kā luga. @lv
label: 是作品的戏剧化 @zh-hans
definition: 将一种作品与被改编为戏剧的一种作品关联起来。 @zh-hans
toolkit label: 作品的戏剧化 @zh-hans
toolkit definition: 被改编为戏剧的一种作品 @zh-hans
has subproperty: P10127
label: eserin dramatize edilmesidir @tr
definition: Bir eseri, oyun olarak uyarlanan bir eserle ilişkilendirir. @tr
toolkit label: eserin dramatize edilmesi @tr
toolkit definition: Tiyatro oyunu olarak uyarlanan bir eser. @tr

has other distinguishing characteristic of work (Deprecated)
status: Deprecated
definition: Relates a work to a characteristic, other than form of work, date of work, or place of origin of the work, that serves to differentiate a work from another work with the same preferred title of work. (Deprecated)
type: Property
domain: C10001
lexical alias: otherDistinguishingCharacteristicOfWork.en
instruction number: 6.6
toolkit label: other distinguishing characteristic of work (Deprecated)
toolkit definition: A characteristic, other than form of work, date of work, or place of origin of the work, that serves to differentiate a work from another work with the same preferred title of work. (Deprecated)
toolkit label: autre caractéristique distinctive d’une œuvre @fr
toolkit definition: Caractéristique autre qu’une forme d’une œuvre, une date d’une œuvre ou un lieu d’origine d’une œuvre. @fr
toolkit label: otra característica distintiva de la obra @es
toolkit definition: Una característica distintiva de la forma de la obra, de la fecha de la obra o del lugar de origen de la obra. @es
label: har andra särskiljande egenskaper för verket @sv
toolkit label: andra särskiljande egenskaper för verket @sv
label: har andet særligt kendetegn ved værket @da
definition: Relaterer et værk til et kendetegn, bortset fra værkform, originalår eller værkets oprindelsessted. @da
toolkit label: andet særligt kendetegn ved værket @da
toolkit definition: Kendetegn, bortset fra værkform, originalår eller værkets oprindelsessted. @da
definition: Met une œuvre en relation avec une caractéristique autre qu’une forme d’une œuvre, une date d’une œuvre ou un lieu d’origine d’une œuvre. @fr
label: có đặc trưng phân biệt khác của tác phẩm @vi
definition: Liên kết tác phẩm với đặc trưng khác với hình thái của tác phẩm, ngày của tác phẩm, hoặc địa điểm nguyên gốc của tác phẩm. @vi
toolkit label: đặc trưng phân biệt khác của tác phẩm @vi
toolkit definition: Đặc trưng khác với hình thái của tác phẩm, ngày của tác phẩm, hoặc địa điểm nguyên gốc của tác phẩm. @vi
label: hat sonstige unterscheidende Eigenschaft eines Werks @de
definition: Setzt ein Werk mit einer Eigenschaft, außer Form eines Werks, Datum eines Werks oder Entstehungsort eines Werks, in Beziehung. @de
toolkit label: Sonstige unterscheidende Eigenschaft eines Werks @de
toolkit definition: Eine Eigenschaft, außer Form eines Werks, Datum eines Werks oder Entstehungsort eines Werks. @de
label: a pour autre caractéristique distinctive d’une œuvre @fr
label: teoksen muut erottavat ominaispiirteet @fi
definition: Liittää teoksen muihin ominaispiirteisiin kuin teoksen lajityyppiin, teoksen ajankohtaan tai teoksen alkuperään liittyvään paikkaan @fi
toolkit label: teoksen muut erottavat ominaispiirteet @fi
toolkit definition: Muut ominaispiirteet kuin teoksen lajityyppi, teoksen ajankohta tai teoksen alkuperään liittyvä paikka. Muiden ominaispiirteiden tarkoitus on erottaa samannimiset teokset toisistaan tai erottaa teos samannimisestä toimijasta @fi
toolkit label: annet skillende kjennetegn ved verk @no
toolkit definition: Et kjennetegn som ikke er verkets form, tidspunkt eller opprinnelsessted. @no
label: té com a altra característica distintiva d’obra @ca
definition: Relaciona una obra amb una característica diferent de la forma d’obra, la data d’obra o el lloc d’origen de l’obra. @ca
scope note: La característica serveix per diferenciar una obra d’una altra obra amb el mateix títol o per diferenciar-la del nom d’un agent. @ca
toolkit label: altra característica distintiva d’obra @ca
toolkit definition: Característica diferent de la forma d’obra, la data d’obra o el lloc d’origen de l’obra. @ca
has element type: 3
label: έχει άλλο διακριτό χαρακτηριστικό του έργου @el
definition: Συνδέει ένα έργο με ένα χαρακτηριστικό άλλο από τη μορφή του έργου, τη χρονολογία του έργου ή τον τόπο προέλευσης του έργου. @el
scope note: Το αναγνωριστικό εξυπηρετεί τον σκοπό της διαφοροποίησης ενός έργου από ένα άλλο έργο με τον ίδιο τίτλο ή από το όνομα ενός φορέα. @el
toolkit label: άλλο διακριτό χαρακτηριστικό του έργου @el
toolkit definition: Ένα χαρακτηριστικό άλλο από τη μορφή του έργου, τη χρονολογία του έργου ή τον τόπο προέλευσης του έργου. @el
label: van mű egyéb megkülönböztető jellemzője @hu
definition: Egy művet hozzákapcsol egy jellemzőhöz, amely más, mint a mű formája, a mű időpontja, vagy a mű származási helye. @hu
toolkit label: mű egyéb megkülönböztető jegye @hu
toolkit definition: Egy jellemző, amely más, mint a mű formája, a mű időpontja vagy a mű származási helye. @hu
has subproperty: P10003

is analysis of work
status: Published
definition: Relates a work to a work whose structure is described by another work.
type: Property
domain: C10001
sub property of: is description of work
lexical alias: analysisOfWork.en
toolkit label: analysis of work
toolkit definition: A work whose structure is described by another work.
toolkit label: analyse d’une œuvre @fr
toolkit definition: Œuvre dont la structure est décrite par une autre œuvre. @fr
toolkit label: análisis de (obra) @es
toolkit definition: Una obra que ha sido examinada para identificar sus componentes y sus relaciones. @es
instruction number: 23.5
label: er analyse af værk @da
definition: Relaterer et værk til et værk, hvis struktur er beskrevet af et andet værk. @da
toolkit label: analyse af værk @da
toolkit definition: Værk, hvis struktur er beskrevet af et andet værk. @da
definition: Met une œuvre en relation avec une œuvre dont la structure est décrite par une autre œuvre. @fr
label: là phân tích của (tác phẩm) @vi
definition: Liên kết tác phẩm với tác phẩm đã được kiểm tra để nhận dạng các bộ phận cấu thành và liên quan của chúng. @vi
toolkit label: phân tích của (tác phẩm) @vi
toolkit definition: Tác phẩm đã được kiểm tra để nhận dạng các bộ phận cấu thành và liên quan của chúng. @vi
label: ist Analyse von (Werk) @de
definition: Setzt ein Werk in Beziehung zu einem Werk, dessen Aufbau durch ein anderes Werk beschrieben wird. @de
toolkit label: Analyse von (Werk) @de
toolkit definition: Ein Werk, dessen Aufbau durch ein anderes Werk beschrieben wird. @de
label: est une analyse d’une œuvre @fr
definition: Liittää teoksen teokseen, jonka rakennetta kuvaa toinen teos. @fi
toolkit label: analyysi teoksesta @fi
toolkit definition: Teos, jonka rakennetta kuvaa toinen teos. @fi
toolkit label: analyse av verk @no
toolkit definition: Et verk hvis struktur er beskrevet av et annet verk. @no
label: és anàlisi d’una obra @ca
definition: Relaciona una obra amb una obra l’estructura de la qual és descrita per una altra obra. @ca
toolkit label: anàlisi d’una obra @ca
toolkit definition: Obra l’estructura de la qual és descrita per una altra obra. @ca
has element type: 2
label: είναι ανάλυση του (έργο) @el
definition: Συνδέει ένα έργο με ένα έργο το οποίο έχει εξεταστεί για την ταύτιση των συστατικών του και των σχέσεών τους. @el
toolkit label: ανάλυση του (έργο) @el
toolkit definition: Ένα έργο το οποίο έχει εξεταστεί για την ταύτιση των συστατικών του και των σχέσεών τους. @el
label: elemzése a következő műnek @hu
definition: Hozzákapcsol egy művet egy műhöz, amelynek alkotóelemeit leírja egy másik mű. @hu
toolkit label: elemzett mű @hu
toolkit definition: Egy mű, amelynek alkotóelemeit leírja egy másik mű. @hu
label: analyysi teoksesta @fi
label: er analyse av verk @no
definition: Relaterer et verk til et verk hvis struktur er beskrevet av et annet verk. @no
label: is analyse van werk @nl
definition: Relateert een werk aan een werk waarvan de structuur beschreven wordt door een ander werk. @nl
toolkit label: analyse van werk @nl
toolkit definition: Een werk waarvan de structuur beschreven wordt door een ander werk. @nl
label: هو تحليل لعمل @ar
definition: يربط عمل بعمل تم وصف بنائه بعمل آخر. @ar
toolkit label: تحليل لعمل @ar
toolkit definition: عمل تم وصف بنائه بعمل آخر. @ar
label: analüüsitud teos @et
definition: Seostab teose teosega, mille struktuuri on kirjeldatud teises teoses. @et
toolkit label: analüüsitud teos @et
toolkit definition: Teos, mille struktuuri on kirjeldatud teises teoses. @et
label: è analisi di opera @it
definition: Correla un’opera a un’opera la cui struttura è descritta da un’altra opera. @it
toolkit label: analisi di opera @it
toolkit definition: Opera la cui struttura è descritta da un’altra opera. @it
label: ir analīze darbam @lv
definition: Sasaista darbu ar darba struktūru, kas tiek skaidrota ar citu darbu. @lv
toolkit label: analīze darbam @lv
toolkit definition: Darba struktūra tiek skaidrota ar citu darbu @lv
label: 是作品的分析 @zh-hans
definition: 将一种作品与其结构被一种作品描述的一种作品关联起来。 @zh-hans
toolkit label: 作品的分析 @zh-hans
toolkit definition: 其结构被一种作品描述的一种作品 @zh-hans
has subproperty: P10140
label: eserin analizidir @tr
definition: Bir eseri, yapısı başka bir eser tarafından tanımlanan bir eserle ilişkilendirir. @tr
toolkit label: eserin analizi @tr
toolkit definition: Yapısı başka bir çalışma tarafından tanımlanan bir çalışma. @tr

has place of origin of work
status: Published
definition: Relates a work to a place from which a work originated.
type: Property
domain: C10001
lexical alias: placeOfOriginOfWork.en
instruction number: 6.5
toolkit label: place of origin of work
toolkit definition: A place from which a work originated.
toolkit label: lieu d’origine d’une œuvre @fr
toolkit definition: Lieu d’où une œuvre est originaire. @fr
toolkit label: lugar de origen de la obra @es
toolkit definition: El país u otra jurisdicción territorial en la cual se originó la obra. @es
label: har ursprungsort för verket @sv
toolkit label: ursprungsort för verket @sv
label: har oprindelsessted for værk @da
definition: Relaterer et værk til et sted, hvorfra et værk stammer. @da
toolkit label: oprindelsessted for værk @da
toolkit definition: Sted, hvorfra et værk stammer. @da
definition: Met une œuvre en relation avec un lieu d’où une œuvre est originaire. @fr
label: có địa điểm nguyên gốc của tác phẩm @vi
definition: Liên kết tác phẩm với quốc gia hoặc khu vực pháp quyền lãnh thổ khác từ đó tác phẩm được tạo ra. @vi
toolkit label: địa điểm nguyên gốc của tác phẩm @vi
toolkit definition: Quốc gia hoặc khu vực pháp quyền lãnh thổ khác từ đó tác phẩm được tạo ra. @vi
label: hat Ursprungsort eines Werks @de
definition: Setzt ein Werk in Beziehung zu einem Geografikum, aus dem ein Werk stammt. @de
toolkit label: Ursprungsort eines Werks @de
toolkit definition: Ein Geografikum, aus dem ein Werk stammt. @de
label: a pour lieu d’origine d’une œuvre @fr
definition: Liittää teoksen paikkaan, josta teos on lähtöisin. @fi
toolkit label: teoksen alkuperään liittyvä paikka @fi
toolkit definition: Paikka, josta teos on lähtöisin. @fi
toolkit label: opprinnelsessted for verk @no
toolkit definition: Et sted der et verk stammer fra. @no
label: té com a lloc d’origen d’una obra @ca
definition: Relaciona una obra amb un lloc on una obra es va originar. @ca
toolkit label: lloc d’origen d’una obra @ca
toolkit definition: Lloc on una obra es va originar. @ca
sub property of: has related place of work
has element type: 2
label: έχει τόπο της προέλευσης του έργου @el
definition: Συνδέει ένα έργο με μια χώρα ή άλλη γεωγραφική δικαιοδοσία από την οποία προήλθε ένα έργο. @el
toolkit label: τόπος της προέλευσης του έργου @el
toolkit definition: Μια χώρα ή άλλη γεωγραφική δικαιοδοσία από την οποία προήλθε ένα έργο. @el
label: mű származási helye a következő: @hu
definition: Hozzákapcsol egy művet egy helyhez, ahonnan egy mű származik. @hu
toolkit label: műhöz tartozó származási hely @hu
toolkit definition: Egy hely, ahonnan egy mű származik. @hu
label: teoksen alkuperään liittyvä paikka @fi
label: har opprinnelsessted for verk @no
definition: Relaterer et verk til et sted der et verk stammer fra. @no
label: heeft plaats van herkomst van werk @nl
definition: Relateert een werk aan een plaats waar een werk ontstaan is. @nl
toolkit label: plaats van herkomst van werk @nl
toolkit definition: Een plaats waar een werk ontstaan is. @nl
label: له مكان أصل لعمل @ar
definition: يربط بين عمل ومكان نشأ منه عمل. @ar
toolkit label: مكان أصل لعمل @ar
toolkit definition: مكان نشأ منه عمل. @ar
label: teose päritoluga seotud koht @et
definition: Seostab teose kohaga, kust teos pärineb. @et
toolkit label: teose päritoluga seotud koht @et
toolkit definition: Koht, kust teos pärineb. @et
label: ha come luogo di origine di opera @it
definition: Correla un’opera con un luogo da cui un’opera ha avuto origine. @it
toolkit label: luogo di origine di opera @it
toolkit definition: Luogo da cui un’opera ha avuto origine. @it
label: darba izcelsmes vieta @lv
definition: Sasaista darbu ar vietu, kurā darbs ir radīts. @lv
toolkit label: darba izcelsmes vieta @lv
toolkit definition: Vieta, kurā darbs ir radīts. @lv
label: 有作品的原地点 @zh-hans
definition: 将一种作品与一种作品起源的一个地点关联起来。 @zh-hans
toolkit label: 作品的原地点 @zh-hans
toolkit definition: 一种作品起源的一个地点 @zh-hans
has subproperty: P10218
label: eserin menşei yeri ile ilişkilidir @tr
definition: Bir eseri, eseri ortaya çıktığı bir yerle ilişkilendirir. @tr
toolkit label: Eserin menşei yeri @tr
toolkit definition: Eserin ortaya çıktığı yer. @tr

is continuation of work
status: Published
definition: Relates a work to a work that is a diachronic work that is completed whose content is continued by another diachronic work.
type: Property
domain: C10001
sub property of: is preceded by work
lexical alias: continuationOfWork.en
toolkit label: continuation of work
toolkit definition: A work that is a diachronic work that is completed whose content is continued by another diachronic work.
toolkit label: continuation d’une œuvre @fr
toolkit definition: Œuvre diachronique qui est terminée et dont le contenu est continué par une autre œuvre diachronique. @fr
toolkit label: continuación de(obra) @es
toolkit definition: La obra que es continuada por el contenido de una obra posterior. @es
scope note: This element applies in general to a successive work.
instruction number: 24.5
label: er fortsættelse af værk @da
definition: Relaterer et værk til et værk, som er et diakronisk værk, som er fuldstændigt, hvis indhold fortsættes af et andet diakronisk værk. @da
scope note: Dette element gælder generelt for et fortløbende værk. @da
toolkit label: fortsættelse af værk @da
toolkit definition: Værk, som er et diakronisk værk, som er fuldstændigt, hvis indhold fortsættes af et andet diakronisk værk. @da
definition: Met une œuvre en relation avec une œuvre diachronique qui est terminée et dont le contenu est continué par une autre œuvre diachronique. @fr
label: là tiếp tục của (tác phẩm) @vi
definition: Liên kết tác phẩm với tác phẩm được tiếp tục bởi nội dung của tác phẩm sau này. @vi
scope note: Mối quan hệ này áp dụng tổng quát cho ấn phẩm nhiều kỳ. @vi
toolkit label: tiếp tục của (tác phẩm) @vi
toolkit definition: Tác phẩm được tiếp tục bởi nội dung của tác phẩm sau này. @vi
label: ist Fortsetzung von (Werk) @de
definition: Setzt ein Werk in Beziehung zu einem abgeschlossenen diachronen Werk, dessen Inhalt durch ein anderes diachrones Werk fortgesetzt wird. @de
scope note: Im Allgemeinen trifft dieses Element auf ein sukzessives Werk zu. @de
toolkit label: Fortsetzung von (Werk) @de
toolkit definition: Ein abgeschlossenes diachrones Werk, dessen Inhalt durch ein anderes diachrones Werk fortgesetzt wird. @de
label: est une continuation d’une œuvre @fr
definition: Liittää teoksen teokseen, joka on valmis diakroninen teos, jonka sisältöä jatkaa toinen diakroninen teoso. @fi
toolkit label: jatkoa teokselle @fi
toolkit definition: Teos, joka on valmis diakroninen teos, jonka sisältöä jatkaa toinen diakroninen teoso. @fi
toolkit label: fortsettelse av verk @no
toolkit definition: Et verk som er et komplett diakronisk verk hvis innhold fortsettes i et annet diakronisk verk. @no
label: és continuació d’una obra @ca
definition: Relaciona una obra amb una obra que és una obra diacrònica que és completa, el contingut de la qual és continuat per una altra obra diacrònica. @ca
scope note: En general, aquest element s’aplica a una obra successiva. @ca
toolkit label: continuació d’una obra @ca
toolkit definition: Obra que és una obra diacrònica que és completa, el contingut de la qual és continuat per una altra obra diacrònica. @ca
scope note: Cet élément s’applique généralement à une œuvre successive. @fr
has element type: 2
label: είναι συνέχεια του (έργο) @el
definition: Συνδέει ένα έργο με ένα έργο το οποίο συνεχίζεται από το περιεχόμενο ενός μεταγενέστερου έργου. @el
scope note: Αυτή η σχέση βρίσκει γενική εφαρμογή στα περιοδικά. @el
toolkit label: συνέχεια του (έργο) @el
toolkit definition: Ένα έργο το οποίο συνεχίζεται από το περιεχόμενο ενός μεταγενέστερου έργου. @el
label: folytatása a következő műnek: @hu
definition: Hozzákapcsol egy művet egy befejezett diakronikus műhöz, amelynek tartalmát egy másik diakronikus mű folytatja. @hu
scope note: Ez az elem általában a folyamatos művekre vonatkozik. @hu
toolkit label: folytatott mű @hu
toolkit definition: Egy befejezett diakronikus mű, amelynek tartalmát egy másik diakronikus mű folytatja. @hu
scope note: Tämä elementti soveltuu yleensä peräkkäisesti ilmestyvään teokseen. @fi
label: jatkoa teokselle @fi
label: er fortsettelse av verk @no
definition: Relaterer et verk til et verk som er et komplett diakronisk verk hvis innhold fortsettes i et annet diakronisk verk. @no
scope note: Dette elementet gjelder som oftest for et påfølgende verk. @no
label: is voortzetting van werk @nl
definition: Relateert een werk aan een werk dat een diachronisch werk is dat afgesloten is waarvan de content is voortgezet door een ander diachronisch werk. @nl
scope note: Dit element is over het algemeen van toepassing op een successief werk. @nl
toolkit label: voortzetting van werk @nl
toolkit definition: Een werk dat een diachronisch werk is dat afgesloten is waarvan de content is voortgezet door een ander diachronisch werk. @nl
label: هو استمرار لعمل @ar
definition: يربط عمل بعمل ممتد زمنيًا ومكتمل، ومحتواه مستمر من خلال عمل آخر ممتد زمنيًا. @ar
scope note: هذا العنصر ينطبق عامة على عمل متتالٍ. @ar
toolkit label: استمرار لعمل @ar
toolkit definition: عمل عبارة عن عمل ممتد زمنيًا ومكتمل، ومحتواه مستمر من خلال عمل آخر ممتد زمنيًا. @ar
label: jätk teosele @et
definition: Seostab teose diakroonilise lõpetatud teosega, mille sisu jätkab teine diakrooniline teos. @et
scope note: Elementi rakendatakse peamiselt järgteose puhul. @et
toolkit label: jätk teosele @et
toolkit definition: Diakrooniline lõpetatud teos, mille sisu jätkab teine diakrooniline teos. @et
label: è continuazione di opera @it
definition: Correla un’opera a un’opera diacronica completa il cui contenuto è continuato da un’altra opera diacronica. @it
scope note: Generalmente questo elemento si applica a un'opera successiva. @it
toolkit label: continuazione di opera @it
toolkit definition: Opera diacronica completa il cui contenuto è continuato da un’altra opera diacronica. @it
label: ir turpinājums darbam @lv

is screenplay for work
status: Published
definition: Relates a work to a work that uses a screenplay and that is complemented by a textual work.
type: Property
domain: C10001
sub property of: is text for work
lexical alias: screenplayForWork.en
toolkit label: screenplay for work
toolkit definition: A work that uses a screenplay and that is complemented by a textual work.
toolkit label: scénario pour une œuvre @fr
toolkit definition: Œuvre qui utilise un scénario et qui est complétée par une œuvre textuelle. @fr
toolkit label: guión para (obra) @es
toolkit definition: Una obra tal como una película cinematográfica, programa de televisión o vídeo, que utiliza el texto de la obra como guión. @es
instruction number: 24.5
label: er manuskript til værk @da
definition: Relaterer et værk til et værk, som bruger et manuskript, som er komplementeret af et tekstværk. @da
toolkit label: manuskript til værk @da
toolkit definition: Værk, som bruger et manuskript, som er komplementeret af et tekstværk. @da
definition: Met une œuvre en relation avec une œuvre qui utilise un scénario et qui est complétée par une œuvre textuelle. @fr
label: là kịch bản của (tác phẩm) @vi
definition: Liên kết tác phẩm với tác phẩm như là phim điện ảnh, chương trình truyền hình, hoặc video sử dụng văn bản của tác phẩm như là kịch bản. @vi
toolkit label: kịch bản của (tác phẩm) @vi
toolkit definition: Tác phẩm như là phim điện ảnh, chương trình truyền hình, hoặc video sử dụng văn bản của tác phẩm như là kịch bản. @vi
label: ist Drehbuch für (Werk) @de
definition: Setzt ein Werk in Beziehung zu einem Werk, das ein Drehbuch verwendet und durch ein textliches Werk vervollständigt wird. @de
toolkit label: Drehbuch für (Werk) @de
toolkit definition: Ein Werk, das ein Drehbuch verwendet und durch ein textliches Werk vervollständigt wird. @de
label: est un scénario pour une œuvre @fr
definition: Liittää teoksen teokseen, joka käyttää käsikirjoitusta ja jota on täydennetty tekstiteoksella. @fi
toolkit label: käsikirjoitus teokseen @fi
toolkit definition: Teos, joka käyttää käsikirjoitusta ja jota on täydennetty tekstiteoksella. @fi
toolkit label: manus for verk @no
toolkit definition: Et verk som bruker et manus som er supplert av et tekstlig verk. @no
label: és guió per a una obra @ca
definition: Relaciona una obra amb una obra que usa un guió i que es complementa amb una obra textual. @ca
toolkit label: guió per a una obra @ca
toolkit definition: Obra que usa un guió i que es complementa amb una obra textual. @ca
has element type: 2
label: είναι σενάριο για (έργο) @el
definition: Συνδέει ένα έργο με ένα έργο, όπως μια κινηματογραφική ταινία, ένα τηλεοπτικό πρόγραμμα ή βίντεο, το οποίο χρησιμοποιεί το κείμενο ενός έργου ως σενάριο. @el
toolkit label: σενάριο για (έργο) @el
toolkit definition: Ένα έργο, όπως μια κινηματογραφική ταινία, ένα τηλεοπτικό πρόγραμμα ή βίντεο, το οποίο χρησιμοποιεί το κείμενο ενός έργου ως σενάριο. @el
label: forgatókönyve a következő műnek: @hu
definition: Hozzákapcsol egy művet egy forgatókönyvet használó műhöz, amelyet egy szöveges mű egészít ki. @hu
toolkit label: forgatókönyvvel ellátott mű @hu
toolkit definition: Egy forgatókönyvet használó mű, amelyet egy szöveges mű egészít ki. @hu
label: käsikirjoitus teokseen @fi
label: er manus for verk @no
definition: Relaterer et verk til et verk som bruker et manus som er supplert av et tekstlig verk. @no
label: is scenario voor werk @nl
definition: Relateert een werk aan een werk dat een scenario gebruikt en dat gecomplementeerd wordt door een tekstwerk. @nl
toolkit label: scenario voor werk @nl
toolkit definition: Een werk dat een scenario gebruikt en dat gecomplementeerd wordt door een tekstwerk. @nl
label: هو سيناريو لعمل @ar
definition: يربط عمل بعمل يستخدم سيناريو ويكمله عمل نصي. @ar
toolkit label: سيناريو لعمل @ar
toolkit definition: عمل يستخدم سيناريو ويكمله عمل نصي. @ar
label: stsenaarium teosele @et
definition: Seostab teose teosega, milles on kasutatud stsenaariumi, mida on täiendatud tekstteosega. @et
toolkit label: stsenaarium teosele @et
toolkit definition: Teos, milles on kasutatud stsenaariumi, mida on täiendatud tekstteosega. @et
label: è una sceneggiatura per opera @it
definition: Correla un’opera a un’opera che usa una sceneggiatura che è completata da un’opera testuale. @it
toolkit label: sceneggiatura per opera @it
toolkit definition: Opera con un’opera che usa una sceneggiatura che è completata da un’opera testuale. @it
label: ir scenārijs darbam @lv
definition: Sasaista darbu ar darbu - kinofilma, televīzijas raidījums vai video, kurā tiek izmantots tekstuālā darba teksts kā scenārijs. @lv
toolkit label: scenārijs darbam @lv
toolkit definition: Darbs - kinofilma, televīzijas raidījums vai video, kurā tiek izmantots tekstuālā darba teksts kā scenārijs. @lv
label: 是作品的影视剧剧本 @zh-hans
definition: 将一种作品与使用一种影视剧剧本并被一种文字作品补充的一种作品关联起来。 @zh-hans
toolkit label: 作品的影视剧剧本 @zh-hans
toolkit definition: 使用一种影视剧剧本并被一种文字作品补充的一种作品 @zh-hans
has subproperty: is screenplay for motion picture work
has subproperty: is screenplay for television program work
has subproperty: is screenplay for video work
has subproperty: P10105
label: eser için senaryodur @tr
definition: Bir eseri, senaryo kullanan ve metinsel bir eserle tamamlanan bir eserle ilişkilendirir. @tr
toolkit label: eser için senaryo @tr

is replacement of work
status: Published
definition: Relates a work to a work whose content is superseded and rendered obsolete by the content of another work.
type: Property
domain: C10001
sub property of: is preceded by work
lexical alias: replacementOfWork.en
toolkit label: replacement of work
toolkit definition: A work whose content is superseded and rendered obsolete by the content of another work.
toolkit label: remplacement d’une œuvre @fr
toolkit definition: Œuvre dont le contenu est remplacé et rendu périmé par le contenu d’une autre œuvre. @fr
toolkit label: reemplazo de (obra) @es
toolkit definition: Una obra anterior cuyo contenido ha sido reemplazado por una obra posterior, generalmente porque la obra posterior contiene información actualizada o nueva que hace obsoleta la obra anterior. @es
scope note: This element applies in general to a static work or an integrating work.
instruction number: 24.5
label: er erstatning for værk @da
definition: Relaterer et værk til et værk, hvis indhold er overflødiggjort og forældet af indholdet af indholdet af et andet værk. @da
scope note: Dette element gælder generelt for et statisk værk eller et integrerende værk. @da
toolkit label: erstatning for værk @da
toolkit definition: Værk, hvis indhold er overflødiggjort og forældet af indholdet af indholdet af et andet værk. @da
definition: Met une œuvre en relation avec une œuvre dont le contenu est remplacé et rendu périmé par le contenu d’une autre œuvre. @fr
label: là thay thế của (tác phẩm) @vi
definition: Liên kết tác phẩm với tác phẩm trước đây mà nội dung của nó đã được thay thế bởi tác phẩm sau này, thường là vì tác phẩm sau này có chứa thông tin cập nhật hoặc mới làm cho phần của tác phẩm trước đây bị lỗi thời. @vi
scope note: Mối quan hệ này áp dụng tổng quát cho đơn vị một phần, chuyên khảo nhiều phần, và tài nguyên tích hợp. @vi
toolkit label: thay thế của (tác phẩm) @vi
toolkit definition: Tác phẩm trước đây mà nội dung của nó đã được thay thế bởi tác phẩm sau này, thường là vì tác phẩm sau này có chứa thông tin cập nhật hoặc mới làm cho phần của tác phẩm trước đây bị lỗi thời. @vi
label: ist Ersatz von (Werk) @de
definition: Setzt ein Werk in Beziehung zu einem Werk, dessen Inhalt durch den Inhalt eines anderen Werks ersetzt und überflüssig wird. @de
scope note: Im Allgemeinen trifft dieses Element auf ein statisches Werk oder ein integrierendes Werks zu. @de
toolkit label: Ersatz von (Werk) @de
toolkit definition: Ein Werk, dessen Inhalt durch den Inhalt eines anderen Werks ersetzt und überflüssig wird. @de
label: est un remplacement d’une œuvre @fr
definition: Liittää teoksen teokseen, jonka sisällön toisen teoksen sisältö korvaa ja tekee vanhentuneeksi. @fi
toolkit label: korvaa teoksen @fi
toolkit definition: Teos, jonka sisällön toisen teoksen sisältö korvaa ja tekee vanhentuneeksi. @fi
toolkit label: erstatning av verk @no
toolkit definition: Et verk med innhold som er erstattet og foreldet av innholdet av et annet verk. @no
label: és reemplaçament d’una obra @ca
definition: Relaciona una obra amb una obra el contingut de la qual és substituït i convertit en obsolet pel contingut d’una altra obra. @ca
scope note: En general, aquest element s’aplica a una obra estàtica o una obra integrant. @ca
toolkit label: reemplaçament d’una obra @ca
toolkit definition: Obra el contingut de la qual és substituït i convertit en obsolet pel contingut d’una altra obra. @ca
scope note: Cet élément s’applique généralement à une œuvre statique ou à une œuvre intégratrice. @fr
has element type: 2
label: είναι αντικατάσταση του (έργο) @el
definition: Συνδέει ένα έργο με ένα προηγούμενο έργο του οποίου το περιεχόμενο έχει αντικατασταθεί από ένα μεταγενέστερο έργο, συνήθως γιατί το μεταγενέστερο έργο περιέχει ενημερωμένη ή νέα πληροφόρηση η οποία καθιστά το προηγούμενο έργο παρωχημένο. @el
scope note: Αυτή η σχέση βρίσκει γενική εφαρμογή σε μονομερείς μονάδες, πολυμερείς μονογραφίες και ενσωματωμένους πόρους. @el
toolkit label: αντικατάσταση του (έργο) @el
toolkit definition: Ένα προηγούμενο έργο του οποίου το περιεχόμενο έχει αντικατασταθεί από ένα μεταγενέστερο έργο, συνήθως γιατί το μεταγενέστερο έργο περιέχει ενημερωμένη ή νέα πληροφόρηση η οποία καθιστά το προηγούμενο έργο παρωχημένο. @el
label: helyettesíti a következő művet: @hu
definition: Hozzákapcsol egy művet egy műhöz, amelynek tartalmát túlhaladja és elavulttá teszi egy másik mű tartalma. @hu
scope note: Ezt az elemet általában a statikus, vagy integráló művekre alkalmazzák. @hu
toolkit label: helyettesített mű @hu
toolkit definition: Egy mű, amelynek tartalmát túlhaladja és elavulttá teszi egy másik mű tartalma. @hu
scope note: Tämä elementti soveltuu yleensä staattiseen teokseen tai päivittyvään teokseen. @fi
label: korvaa teoksen @fi
label: er erstatning av verk @no
definition: Relaterer et verk til et verk med innhold som er erstattet og foreldet av innholdet av et annet verk. @no
scope note: Dette elementet gjelder som oftest for et statisk verk eller et integrerende verk. @no
label: is vervanging van werk @nl
definition: Relateert een werk aan een werk waarvan de content overschreven en achterhaald is door de content van een ander werk. @nl
scope note: Dit element is over het algemeen van toepassing op een statisch werk of een geïntegreerd werk. @nl
toolkit label: vervanging van werk @nl
toolkit definition: Een werk waarvan de content overschreven en achterhaald is door de content van een ander werk. @nl
label: هو استبدال لعمل @ar
definition: يربط عمل بعمل يتم استبدال محتواه ويصبح متقادمًا في وجود محتوى عمل آخر. @ar
scope note: هذا العنصر ينطبق عامة على عمل ثابت أو عمل متكامل. @ar
toolkit label: استبدال لعمل @ar
toolkit definition: عمل يتم استبدال محتواه ويصبح متقادمًا في وجود محتوى عمل آخر. @ar
label: asendab teose @et
definition: Seostab teose teosega, mille sisu on asendatud ja tühistatud teise teose sisuga. @et
scope note: Elementi rakendatakse tavaliselt staatilise teose või lõimteose puhul. @et
toolkit label: asendab teose @et
toolkit definition: Teos, mille sisu on asendatud ja tühistatud teise teose sisuga. @et
label: è sostituzione di opera @it
definition: Correla un’opera a un’opera il cui contenuto è sostituito e reso obsoleto dal contenuto di un’altra opera. @it
scope note: Generalemtne questo elemento si applica di solito a un'opera statica o a un'opera integrativa. @it
toolkit label: sostituzione di opera @it
toolkit definition: Opera il cui contenuto è sostituito e reso obsoleto dal contenuto di un’altra opera. @it
label: ir aizstātais darbs @lv

is replaced by work
status: Published
definition: Relates a work to a work whose content supersedes and renders obsolete the content of another work.
type: Property
domain: C10001
sub property of: is succeeded by work
lexical alias: replacedByWork.en
toolkit label: replaced by work
toolkit definition: A work whose content supersedes and renders obsolete the content of another work.
toolkit label: remplacé par une œuvre @fr
toolkit definition: Œuvre dont le contenu remplace et rend périmé le contenu d’une autre œuvre. @fr
toolkit label: reemplazada por (obra) @es
toolkit definition: Una obra posterior usada en lugar de una obra anterior, generalmente porque la obra posterior contiene información actualizada o nueva que hace obsoleta la obra anterior. @es
scope note: This element applies in general to a static work or an integrating work.
instruction number: 24.5
label: er erstattet af værk @da
definition: Relaterer et værk til et værk, hvis indhold overflødiggør og forælder indholdet af et andet værk. @da
scope note: Dette element gælder generelt for et statisk værk eller et integrerende værk. @da
toolkit label: erstattet af værk @da
toolkit definition: Relaterer et værk til et værk, hvis indhold overflødiggør og forælder indholdet af et andet værk. @da
definition: Met une œuvre en relation avec une œuvre dont le contenu remplace et rend périmé le contenu d’une autre œuvre. @fr
label: được thay thế bởi (tác phẩm) @vi
definition: Liên kết tác phẩm với tác phẩm sau này sử dụng để thay thế tác phẩm trước đây, thường là vì tác phẩm sau này có chứa thông tin cập nhật hoặc mới làm cho tác phẩm trước đây bị lỗi thời. @vi
scope note: Mối quan hệ này áp dụng tổng quá đối với đơn vị một phần, chuyên khảo nhiều phần, và tài nguyên tích hợp. @vi
toolkit label: được thay thế bởi (tác phẩm) @vi
toolkit definition: Tác phẩm sau này sử dụng để thay thế tác phẩm trước đây, thường là vì tác phẩm sau này có chứa thông tin cập nhật hoặc mới làm cho tác phẩm trước đây bị lỗi thời. @vi
label: ist ersetzt durch (Werk) @de
definition: Setzt ein Werk in Beziehung zu einem Werk, dessen Inhalt den Inhalt eines anderen Werks ersetzt und obsolet macht. @de
scope note: Im Allgemeinen trifft dieses Element auf ein statisches Werk oder ein integrierendes Werks zu. @de
toolkit label: Ersetzt durch (Werk) @de
toolkit definition: Ein Werk, dessen Inhalt den Inhalt eines anderen Werks ersetzt und obsolet macht. @de
label: est remplacé par une œuvre @fr
definition: Liittää teoksen teokseen, jonka sisältö korvaa ja tekee vanhentuneeksi toisen teoksen sisällön. @fi
toolkit label: korvaava teos @fi
toolkit definition: Teos, jonka sisältö korvaa ja tekee vanhentuneeksi toisen teoksen sisällön. @fi
toolkit label: erstattet av verk @no
toolkit definition: Et verk hvis innhold erstatter og gjør innholdet i et annet verk foreldet. @no
label: és reemplaçat per una obra @ca
definition: Relaciona una obra amb una obra el contingut de la qual substitueix i converteix en obsolet el contingut d’una altra obra. @ca
scope note: En general, aquest element s’aplica a una obra estàtica o a una obra integrant. @ca
toolkit label: reemplaçat per una obra @ca
toolkit definition: Obra el contingut de la qual substitueix i converteix en obsolet el contingut d’una altra obra. @ca
scope note: Cet élément s’applique généralement à une œuvre statique ou à une œuvre intégratrice. @fr
has element type: 2
label: αντικαθίσταται από (έργο) @el
definition: Συνδέει ένα έργο με ένα μεταγενέστερο έργο το οποίο χρησιμοποιείται στη θέση ενός προηγούμενου έργου, συνήθως λόγω του ότι το μεταγενέστερο έργο περιέχει ενημερωμένη/ανανεωμένη ή νέα πληροφορία, η οποία καθιστά το προηγούμενο έργο παρωχημένο. @el
scope note: Αυτή η σχέση βρίσκει γενική εφαρμογή σε μονομερείς μονάδες, πολυμερείς μονογραφίες και ενσωματωμένους πόρους. @el
toolkit label: αντικαθίσταται από (έργο) @el
toolkit definition: Ένα μεταγενέστερο έργο το οποίο χρησιμοποιείται στη θέση ενός προηγούμενου έργου, συνήθως λόγω του ότι το μεταγενέστερο έργο περιέχει ενημερωμένη/ανανεωμένη ή νέα πληροφορία, η οποία καθιστά το προηγούμενο έργο παρωχημένο. @el
label: helyettesítője a következő mű: @hu
definition: Hozzákapcsol egy művet egy műhöz, amelynek tartalma túlhaladja és elavulttá teszi egy másik mű tartalmát. @hu
scope note: Ezt az elemet általában az statikus vagy integráló művekre alkalmazzák. @hu
toolkit label: helyettesítő mű @hu
toolkit definition: Egy mű, amelynek tartalma túlhaladja és elavulttá teszi egy másik mű tartalmát. @hu
scope note: Tämä elementti soveltuu yleensä staattiseen teokseen tai päivittyvään teokseen. @fi
label: korvaava teos @fi
label: er erstattet av verk @no
definition: Relaterer et verk til et verk hvis innhold erstatter og gjør innholdet i et annet verk foreldet. @no
scope note: Dette elementet gjelder som regel for et statisk verk eller et integrerende verk. @no
label: is vervangen door werk @nl
definition: Relateert een werk aan een werk waarvan de content overschrijft en achterhaald maakt de content van een ander werk. @nl
scope note: Dit element is over het algemeen van toepassing op een statisch werk of een geïntegreerd werk. @nl
toolkit label: vervangen door werk @nl
toolkit definition: Een werk waarvan de content overschrijft en achterhaald maakt de content van een ander werk. @nl
label: هو مستبدَل بعمل @ar
definition: يربط عمل بعمل يحل محتواه محل محتوى عمل آخر ويجعله متقادما. @ar
scope note: ينطبق هذا العنصر عامة على عمل ثابت أو عمل متكامل. @ar
toolkit label: مستبدَل بعمل @ar
toolkit definition: عمل يحل محتواه محل محتوى عمل آخر ويجعله متقادما. @ar
label: asendatud teosega @et
definition: Seostab teose teosega, mille sisu asendab ja tühistab teise teose sisu. @et
scope note: Elementi rakendatakse tavaliselt staatilise teose või lõimteose puhul. @et
toolkit label: asendatud teosega @et
toolkit definition: Teos, mille sisu asendab ja tühistab teise teose sisu. @et
label: è sostituita da opera @it
definition: Correla un’opera a un’opera il cui contenuto sostituisce e rende obsoleto il contenuto di un’altra opera. @it
scope note: Questo elemento si applica in genere a un'opera statica o a un'opera integrativa @it
toolkit label: sostituita da opera @it
toolkit definition: Opera il cui contenuto sostituisce e rende obsoleto il contenuto di un’altra opera. @it
label: ir aizstājošais darbs @lv

has errata work
status: Published
definition: Relates a work to a work that consists of errors discovered after the publication of a predominant work, with their corrections.
type: Property
domain: C10001
sub property of: is augmented by work
lexical alias: errataWork.en
toolkit label: errata work
toolkit definition: A work that consists of errors discovered after the publication of a predominant work, with their corrections.
toolkit label: errata (œuvre) @fr
toolkit definition: Œuvre qui consiste en erreurs découvertes après la publication d’une œuvre prédominante, avec leurs corrections. @fr
toolkit label: fe de erratas (obra) @es
toolkit definition: Una obra que consiste en errores descubiertos después de la publicación de la obra principal, con sus correcciones. @es
instruction number: 24.5
label: har errataværk @da
definition: Relaterer et værk til et værk, som består af rettelser af fejl, som er opdaget efter publicering af et fremtrædende værk, sammen med rettelserne. @da
toolkit label: errataværk @da
toolkit definition: Værk, som består af rettelser af fejl, som er opdaget efter publicering af et fremtrædende værk, sammen med rettelserne. @da
definition: Met une œuvre en relation avec une œuvre qui consiste en erreurs découvertes après la publication d’une œuvre prédominante, avec leurs corrections. @fr
label: lỗi in (tác phẩm) @vi
definition: Liên kết tác phẩm với tác phẩm có chứa các lỗi được phát hiện sau khi xuất bản tác phẩm nổi trội, với bản sửa các lỗi đó. @vi
toolkit label: lỗi in (tác phẩm) @vi
toolkit definition: Tác phẩm có chứa các lỗi được phát hiện sau khi xuất bản tác phẩm nổi trội, với bản sửa các lỗi đó. @vi
label: hat Errata (Werk) @de
definition: Setzt ein Werk in Beziehung zu einem Werk, das aus Fehlern und deren Korrekturen besteht, die nach der Veröffentlichung des Hauptwerks entdeckt wurden. @de
toolkit label: Errata (Werk) @de
toolkit definition: Ein Werk, das aus Fehlern und deren Korrekturen besteht, die nach der Veröffentlichung des Hauptwerks entdeckt wurden. @de
label: a pour errata (œuvre) @fr
definition: Liittää teoksen teokseen, joka koostuu julkaisemisen jälkeen löytyneistä virheistä ja niiden korjauksista. @fi
toolkit label: painovirheluettelo (teos) @fi
toolkit definition: Teos, joka koostuu julkaisemisen jälkeen löytyneistä virheistä ja niiden korjauksista. @fi
toolkit label: errata (verk) @no
toolkit definition: Et verk som består av feil oppdaget etter utgivelsen av et mer fremtredende verk, sammen med rettelsene. @no
label: té com a obra d’errata @ca
definition: Relaciona una obra amb una obra que consisteix en els errors descoberts després de la publicació d’una obra predominant, amb les esmenes corresponents. @ca
toolkit label: obra d’errata @ca
toolkit definition: Obra que consisteix en els errors descoberts després de la publicació d’una obra predominant, amb les esmenes corresponents. @ca
has element type: 2
label: είναι παροράματα (έργο) @el
definition: Συνδέει ένα έργο με ένα έργο που συνίσταται από λάθη που εντοπίζονται μετά τη δημοσίευση ενός κύριου έργου με τις διορθώσεις τους. @el
toolkit label: παροράματα (έργο) @el
toolkit definition: Ένα έργο που συνίσταται από λάθη που εντοπίζονται μετά τη δημοσίευση ενός κύριου έργου με τις διορθώσεις τους. @el
label: hibajegyzék-műve a következő: @hu
definition: Hozzákapcsol egy művet egy műhöz, amely egy domináns mű megjelentetése után felfedezett hibákból és azok javításaiból áll. @hu
toolkit label: hibajegyzékmű @hu
toolkit definition: Egy mű, amely egy domináns mű megjelentetése után felfedezett hibákból és azok javításaiból áll. @hu
label: painovirheluettelo (teos) @fi
label: har errata (verk) @no
definition: Relaterer et verk til et verk som består av feil oppdaget etter utgivelsen av et mer fremtredende verk, sammen med rettelsene. @no
label: heeft errata-werk @nl
definition: Relateert een werk aan een werk dat bestaat uit fouten ontdekt na de publicatie van een hoofdwerk, met hun correcties. @nl
toolkit label: errata-werk @nl
toolkit definition: Een werk dat bestaat uit fouten ontdekt na de publicatie van een hoofdwerk, met hun correcties. @nl
label: له عمل تصويبات @ar
definition: يربط عمل بعمل يتكون من أخطاء تم اكتشافها بعد نشر عمل سائد، مع تصويباتها. @ar
toolkit label: عمل تصويبات @ar
toolkit definition: عمل يتكون من أخطاء تم اكتشافها بعد نشر عمل سائد، مع تصويباتها. @ar
label: vigade loetelu teoses @et
definition: Seostab teose teosega, mis sisaldab pärast dominantse teose avaldamist leitud vigu ja nende parandusi. @et
toolkit label: vigade loetelu teoses @et
toolkit definition: Teos, mis sisaldab pärast dominantse teose avaldamist leitud vigu ja nende parandusi. @et
label: ha come errata corrige opera @it
definition: Correla un’opera a un’opera che consiste di errori scoperti dopo la pubblicazione di un’opera predominante, con le loro correzioni. @it
toolkit label: errata corrige opera @it
toolkit definition: Opera che consiste di errori scoperti dopo la pubblicazione di un’opera predominante, con le loro correzioni. @it
label: darbs: iespiedkļūdu saraksts @lv
definition: Sasaista darbu ar darbu - iespiedkļūdas ar labojumiem, kas atklātas pēc pamatdarba publicēšanas. @lv
toolkit label: darbs: iespiedkļūdu saraksts @lv
toolkit definition: Darbs - iespiedkļūdas ar labojumiem, kas atklātas pēc pamatdarba publicēšanas. @lv
label: 有勘误作品 @zh-hans
definition: 将一种作品与由一种主要作品出版后发现的错误及其更正组成的一种作品关联起来。 @zh-hans
toolkit label: 勘误作品 @zh-hans
toolkit definition: 由一种主要作品出版后发现的错误及其更正组成的一种作品 @zh-hans
has subproperty: P10092
label: düzeltme eseri ile ilişkilidir @tr
definition: Bir eseri, baskın bir eserin yayınlanmasından sonra keşfedilen hataları düzeltmeleriyle içeren bir eserle ilişkilendirir. @tr
toolkit label: düzeltme eseri @tr
toolkit definition: Yayınlanmış bir ana eserin ardından keşfedilen hatalardan ve bunların düzeltmelerinden oluşan bir eser. @tr

is appendix to work
status: Published
definition: Relates a work to a work whose content is augmented with content from a related work.
type: Property
domain: C10001
sub property of: is augmentation of work
lexical alias: appendixToWork.en
toolkit label: appendix to work
toolkit definition: A work whose content is augmented with content from a related work.
toolkit label: annexe d’une œuvre @fr
toolkit definition: Œuvre dont le contenu est augmenté par le contenu d’une œuvre en relation. @fr
toolkit label: apéndice de (obra) @es
toolkit definition: Una obra aumentada por otra obra que consiste en material que no es esencial para la integridad del contenido, tal como una lista de referencias, tablas estadísticas y material explicativo; el material añadido puede venir al final del contenido o ser publicado separadamente. @es
instruction number: 24.5
scope note: Includes lists of references, statistical tables, and explanatory matter that are not essential to the completeness of the content.
label: er bilag til værk @da
definition: Relaterer et værk til et værk, hvis indhold er beriget med indhold fra et relateret værk. @da
toolkit label: bilag til værk @da
toolkit definition: Værk, hvis indhold er beriget med indhold fra et relateret værk. @da
definition: Met une œuvre en relation avec une œuvre dont le contenu est augmenté par le contenu d’une œuvre en relation. @fr
label: là phụ bản của (tác phẩm) @vi
definition: Liên kết tác phẩm với tác phẩm mà nội dung được gia tăng với nội dung của tác phẩm khác. @vi
scope note: Bao gồm cả danh mục tham khảo, bảng thống kê, và vật phẩm giải thích không cần thiết đối với sự hoàn thiện của nội dung. @vi
toolkit label: phụ bản của (tác phẩm) @vi
toolkit definition: Tác phẩm mà nội dung được gia tăng với nội dung của tác phẩm khác. @vi
label: ist Anhang zu (Werk) @de
definition: Setzt ein Werk in Beziehung zu einem Werk, dessen Inhalt durch Inhalt eines in Beziehung stehenden Werks erweitert wird. @de
scope note: Darunter fallen Verzeichnisse der zitierten Literatur, Statistiken und Erläuterungen, die für die Vollständigkeit des Inhalts nicht notwendig sind. @de
toolkit label: Anhang zu (Werk) @de
toolkit definition: Ein Werk, dessen Inhalt durch Inhalt eines in Beziehung stehenden Werks erweitert wird. @de
label: est une annexe d’une œuvre @fr
definition: Liittää teoksen teokseen, jonka sisältöä on laajennettu siihen liittyvän teoksen ekspression sisällöllä. @fi
toolkit label: liite teokseen @fi
toolkit definition: Teos, jonka sisältöä on laajennettu siihen liittyvän teoksen ekspression sisällöllä. @fi
toolkit label: bilag til verk @no
toolkit definition: Et verk hvis innhold er utvidet av innhold fra et relatert verk. @no
label: és apèndix d’una obra @ca
definition: Relaciona una obra amb una obra el contingut de la qual és augmentat amb el contingut d’una obra relacionada. @ca
scope note: Inclou les llistes de referències, les taules estadístiques i el material explicatiu que no són essencials per a la completesa del contingut. @ca
toolkit label: apèndix d’una obra @ca
toolkit definition: Obra el contingut de la qual és augmentat amb el contingut d’una obra relacionada. @ca
scope note: Comprend des listes de références, des tableaux statistiques et des indications explicatives qui ne sont pas essentielles à la complétude du contenu. @fr
has element type: 2
label: είναι παράρτημα στο (έργο) @el
definition: Συνδέει ένα έργο με ένα έργο του οποίου το περιεχόμενο έχει αυξηθεί με περιεχόμενο από ένα άλλο έργο. @el
scope note: Περιλαμβάνει λίστες αναφορών, στατιστικούς πίνακες και επεξηγηματική ύλη, που δεν είναι ουσιώδη για την πληρότητα του περιεχομένου. @el
toolkit label: παράρτημα στο (έργο) @el
toolkit definition: Ένα έργο του οποίου το περιεχόμενο έχει αυξηθεί με περιεχόμενο από ένα άλλο έργο. @el
label: függelék a következő műhöz: @hu
definition: Hozzákapcsol egy művet egy műhöz, amelynek tartalmát egy kapcsolódó mű tartalmával bővítenek. @hu
scope note: Olyan hivatkozási listákat, statisztikai táblázatokat és magyarázó anyagot foglal magába, amelyek lényegesek a tartalom teljességéhez. @hu
toolkit label: függelékkel ellátott mű @hu
toolkit definition: Egy mű, amelynek tartalmát egy kapcsolódó mű tartalmával bővítenek. @hu
scope note: Kattaa viitelistat, tilastolliset taulukot ja selitykset, jotka eivät ole välttämättömiä, jotta sisältö olisi täydellinen. @fi
label: liite teokseen @fi
label: er bilag til verk @no
definition: Relaterer et verk til et verk hvis innhold er utvidet av innhold fra et relatert verk. @no
scope note: Inkluderer referanselister, tabeller over statistikk og forklarende innhold som ikke er avgjørende for innholdets fullstendighet. @no
label: is appendix bij werk @nl
definition: Relateert een werk aan een werk waarvan de content aangevuld is met content uit een gerelateerd werk. @nl
scope note: Omvat referentielijsten, statistische tabellen en toelichtende materie die niet essentieel zijn voor de compleetheid van de content. @nl
toolkit label: appendix bij werk @nl
toolkit definition: Een werk waarvan de content aangevuld is met content uit een gerelateerd werk. @nl
label: هو ملحق لعمل @ar
definition: يربط عمل بعمل محتواه مزيد بمحتوى من عمل ذي صلة. @ar
scope note: يشمل قوائم مراجع، وجداول إحصائية، ومواد تفسيرية لا تعد ضرورية لاكتمال المحتوى. @ar
toolkit label: ملحق لعمل @ar
toolkit definition: عمل محتواه مزيد بمحتوى من عمل ذي صلة. @ar
scope note: Omfatter kildefortegnelser, statistiske tabeller og forklarende stof, som ikke er nødvendige for indholdets fuldstændighed. @da
label: apendiks teosele @et
definition: Seostab teose teosega, mille sisu on laiendatud seotud teose sisuga. @et
scope note: Hõlmab viiteloetelusid, statistilisi tabeleid ja selgitavaid märkusi, mis ei ole sisu terviklikkuse seisukohalt hädavajalikud. @et
toolkit label: apendiks teosele @et
toolkit definition: Teos, mille sisu on laiendatud seotud teose sisuga. @et
label: è appendice a opera @it
definition: Correla un’opera a un’opera il cui contenuto è aumentato con il contenuto di un’opera correlata. @it
scope note: Comprende elenchi di citazioni, tavole statistiche e materiale esplicativo che non sono essenziali alla completezza del contenuto. @it
toolkit label: appendice a opera @it
toolkit definition: Opera il cui contenuto è aumentato con il contenuto di un’opera correlata. @it
label: ir pielikums darbam @lv

is errata to work
status: Published
definition: Relates a work to a work that is augmented by a list of errors in a predominant work, discovered after publication, with their corrections.
type: Property
domain: C10001
sub property of: is augmentation of work
lexical alias: errataToWork.en
toolkit label: errata to work
toolkit definition: A work that is augmented by a list of errors in a predominant work, discovered after publication, with their corrections.
toolkit label: errata d’une œuvre @fr
toolkit definition: Œuvre qui est augmentée d’une liste d’erreurs dans une œuvre prédominante, découvertes après publication, avec leurs corrections. @fr
toolkit label: errata de (obra) @es
toolkit definition: Una obra aumentada por una lista de errores en la obra predominante, descubiertos después de la publicación, con sus correcciones. @es
instruction number: 24.5
label: er errata til værk @da
definition: Relaterer et værk til et værk, der er beriget med en liste over fejl i et fremtrædende værk, som er blevet opdaget efter publicering, sammen med rettelserne. @da
toolkit label: errata til værk @da
toolkit definition: Værk, der er beriget med en liste over fejl i et fremtrædende værk, som er blevet opdaget efter publicering, sammen med rettelserne. @da
definition: Met une œuvre en relation avec une œuvre qui est augmentée d’une liste d’erreurs dans une œuvre prédominante, découvertes après publication, avec leurs corrections. @fr
label: là lỗi in đối với (tác phẩm) @vi
definition: Liên kết tác phẩm với tác phẩm được gia tăng bởi danh mục lỗi trong tác phẩm nổi trội, được phát hiện sau khi xuất bản, với sửa lỗi. @vi
toolkit label: lỗi in đối với (tác phẩm) @vi
toolkit definition: Tác phẩm được gia tăng bởi danh mục lỗi trong tác phẩm nổi trội, được phát hiện sau khi xuất bản, với sửa lỗi. @vi
label: ist Errata zu (Werk) @de
definition: Setzt ein Werk in Beziehung zu einem Werk, das durch eine Liste von Fehlern, die nach Veröffentlichung des Hauptwerks entdeckt wurden, und deren Korrekturen erweitert wird. @de
toolkit label: Errata zu (Werk) @de
toolkit definition: Ein Werk, das durch eine Liste von Fehlern, die nach Veröffentlichung des Hauptwerks entdeckt wurden, und deren Korrekturen erweitert wird. @de
label: est un errata d’une œuvre @fr
definition: Liittää teoksen teokseen, jota on laajennettu teoksen julkaisemisen jälkeen löytyneiden virheiden luettelolla ja niiden korjauksilla. @fi
toolkit label: painovirheluettelo ekspressioon @fi
toolkit definition: Teos, jota on laajennettu teoksen julkaisemisen jälkeen löytyneiden virheiden luettelolla ja niiden korjauksilla. @fi
toolkit label: errata for verk @no
toolkit definition: Et verk som har et tillegg i form av en liste over feil oppdaget etter utgivelsen av et mer fremtredende verk, sammen med rettelsene. @no
label: és errata a una obra @ca
definition: Relaciona una obra amb una obra que és augmentada amb una llista d’errors en una obra predominant, descoberts després de la seva publicació, amb les esmenes corresponents. @ca
toolkit label: errata a una obra @ca
toolkit definition: Obra que és augmentada amb una llista d’errors en una obra predominant, descoberts després de la seva publicació, amb les esmenes corresponents. @ca
has element type: 2
label: είναι παροράματα στο (έργο) @el
definition: Συνδέει ένα έργο με ένα έργο το οποίο έχει αυξηθεί μέσω μιας λίστας λαθών σε ένα κύριο έργο, τα οποία διαπιστώθηκαν μετά τη δημοσίευση, με τις διορθώσεις τους. @el
toolkit label: παροράματα στο (έργο) @el
toolkit definition: Ένα έργο το οποίο έχει αυξηθεί μέσω μιας λίστας λαθών σε ένα κύριο έργο, τα οποία διαπιστώθηκαν μετά τη δημοσίευση, με τις διορθώσεις τους. @el
label: hibajegyzék a következő műhöz: @hu
definition: Hozzákapcsol egy művet egy műhöz, amelyet egy domináns műben bővítettek a megjelenés után felfedezett hibák listájával, valamint azok javításaival. @hu
toolkit label: hibajegyzékkel ellátott mű @hu
toolkit definition: Egy mű, amelyet egy domináns műben bővítettek a megjelenés után felfedezett hibák listájával, valamint azok javításaival. @hu
label: painovirheluettelo ekspressioon @fi
label: er errata for verk @no
definition: Relaterer et verk til et verk som har et tillegg i form av en liste over feil oppdaget etter utgivelsen av et mer fremtredende verk, sammen med rettelsene. @no
label: is errata bij werk @nl
definition: Relateert een werk aan een werk dat is aangevuld door een lijst van fouten in een hoofdwerk, ontdekt na publicatie, met hun correcties. @nl
toolkit label: errata bij werk @nl
toolkit definition: Een werk dat is aangevuld door een lijst van fouten in een hoofdwerk, ontdekt na publicatie, met hun correcties. @nl
label: هو تصويبات لعمل @ar
definition: يربط عمل بعمل مزيد بقائمة أخطاء في عمل سائد، تم اكتشافها بعد النشر، مع تصويباتها. @ar
toolkit label: تصويبات لعمل @ar
toolkit definition: عمل مزيَّد بقائمة أخطاء في عمل سائد، تم اكتشافها بعد النشر، مع تصويباتها. @ar
label: vigade loetelu teosele @et
definition: Seostab teose teosega, mida on pärast avaldamist täiendatud dominantses teoses leitud vigade loetelu ja nende parandustega. @et
toolkit label: vigade loetelu teosele @et
toolkit definition: Teos, mida on pärast avaldamist täiendatud dominantses teoses leitud vigade loetelu ja nende parandustega. @et
label: è errata corrige di opera @it
definition: Correla un'opera a un'opera aumentata da una lista di errori in un’opera predominante, scoperti dopo la pubblicazione, con le loro correzioni. @it
toolkit label: errata corrige a opera @it
toolkit definition: Opera aumentata da una lista di errori in un’opera predominante, scoperti dopo la pubblicazione, con le loro correzioni. @it
label: ir iespiedkļūdu saraksts darbam @lv
definition: Sasaista darbu ar darbu, kam izveidots kļūdu saraksts, kas atklāts pēc publicēšanas. @lv
toolkit label: iespiedkļūdu saraksts darbam @lv
toolkit definition: Darbs, kam izveidots kļūdu saraksts, kas atklāts pēc publicēšanas. @lv
label: 是作品的勘误 @zh-hans
definition: 将一种作品与被一种主要作品出版后发现的错误及其更正列表附增的一种作品关联起来。 @zh-hans
toolkit label: 作品的勘误 @zh-hans
toolkit definition: 被一种主要作品出版后发现的错误及其更正列表附增的一种作品 @zh-hans
has subproperty: P10149
label: eserin düzeltmesidir @tr
definition: Bir eseri, yayınlandıktan sonra keşfedilen ve düzeltmeleriyle birlikte baskın bir eserdeki hataların bir listesiyle çoğaltılmış bir eserle ilişkilendirir. @tr
toolkit label: eser için düzeltme @tr
toolkit definition: Yayımlandıktan sonra tespit edilen hatalarını ve bunların düzeltilmiş hâllerini içeren bir listeyle zenginleştirilmiş bir çalışma. @tr

is guide to work
status: Published
definition: Relates a work to a work that is augmented by a related work that consists of material, such as notes, learning and study aids, exercises, problems, questions and answers, instructor or student materials, etc., to help the user of a predominant work
type: Property
domain: C10001
sub property of: is augmentation of work
lexical alias: guideToWork.en
toolkit label: guide to work
toolkit definition: A work that is augmented by a related work that consists of material to help the user of a predominant work, such as notes, learning and study aids, exercises, problems, questions and answers, instructor or student materials, etc.
toolkit label: guide d’une œuvre @fr
toolkit definition: Œuvre qui est augmentée par une œuvre en relation consistant en documentation destinée à aider l’utilisateur d’une œuvre prédominante, telle que des notes, des outils pédagogiques, des exercices, des problèmes, des questions et réponses, du matériel didactique, etc. @fr
toolkit label: guía de (obra) @es
toolkit definition: Una obra aumentada por otra obra que consiste en material de ayuda al usuario de la obra principal, tal como notas, ayudas para estudio y aprendizaje, ejercicios, problemas, preguntas y respuestas, materiales para el instructor o el estudiante, etc. @es
instruction number: 24.5
label: er vejledning til værk @da
definition: Relaterer et værk til et værk, der er beriget af et relateret værk, som består af materiale, som kan hjælpe brugeren af et fremtrædende værk, såsom noter, lære- og studiehjælpemidler, øvelser, problemstillinger, spørgsmål og svar, lærer- eller elevmaterialer etc. @da
toolkit label: vejledning til værk @da
toolkit definition: Værk, der er beriget af et relateret værk, som består af materiale, som kan hjælpe brugeren af et fremtrædende værk, såsom noter, lære- og studiehjælpemidler, øvelser, problemstillinger, spørgsmål og svar, lærer- eller elevmaterialer etc. @da
definition: Met une œuvre en relation avec une œuvre qui est augmentée par une œuvre en relation consistant en documentation destinée à aider l’utilisateur d’une œuvre prédominante, telle que des notes, des outils pédagogiques, des exercices, des problèmes, des questions et réponses, du matériel didactique, etc. @fr
label: là chỉ đẫn đối với (tác phẩm) @vi
definition: Liên kết tác phẩm với tác phẩm được gia tăng bởi tác phẩm khác có chứa tài liệu, như là ghi chú, trợ giúp học tập và nghiên cứu, bài tập, vấn đề, câu hỏi và trả lời, tài liệu giảng viên hoặc sinh viên, v.v...nhằm trợ giúp người dùng của tác phẩm nổi trội. @vi
toolkit label: chỉ đẫn đối với (tác phẩm) @vi
toolkit definition: Tác phẩm được gia tăng bởi tác phẩm khác có chứa tài liệu, như là ghi chú, trợ giúp học tập và nghiên cứu, bài tập, vấn đề, câu hỏi và trả lời, tài liệu giảng viên hoặc sinh viên, v.v...nhằm trợ giúp người dùng của tác phẩm nổi trội. @vi
label: ist Orientierungshilfe für (Werk) @de
definition: Setzt ein Werk in Beziehung zu einem Werk, das durch ein in Beziehung stehendes Werk erweitert ist, das zum Beispiel Anmerkungen, Lern- und Studienhilfen, Übungen, Problemstellungen, Fragen und Antworten, Lehr- oder Schülermaterialien und so weiter enthält, und Benutzende bei der Verwendung eines Hauptwerks unterstützt. @de
toolkit label: Orientierungshilfe für (Werk) @de
toolkit definition: Ein Werk, das durch ein in Beziehung stehendes Werk erweitert ist, das zum Beispiel Anmerkungen, Lern- und Studienhilfen, Übungen, Problemstellungen, Fragen und Antworten, Lehr- oder Schülermaterialien und so weiter enthält, und Benutzende bei der Verwendung eines Hauptwerks unterstützt. @de
label: est un guide d’une œuvre @fr
definition: Liittää teoksen teokseen, jota laajentaa siihen liittyvä teos, joka koostuu materiaalista, kuten muistiinpanoista, opiskelumateriaaleista, harjoituksista, tehtävistä, kysymyksistä ja vastauksista, opettajan ja opiskelijan aineistoista tms. pääteoksen käyttäjän auttamiseksi. @fi
toolkit label: opas teokseen @fi
toolkit definition: Teos, jota laajentaa siihen liittyvä teos, joka koostuu pääteoksen käyttäjää auttavasta materiaalista, kuten muistiinpanoista, opiskelumateriaaleista, harjoituksista, tehtävistä, kysymyksistä ja vastauksista, opettajan ja oppilaan aineistoista tms. @fi
toolkit label: studieveiledning til verk @no
toolkit definition: Et verk som har et tillegg i form av et relatert verk som består av materiale for å veilede en bruker gjennom bruken av et mer fremtredende verk ved hjelp av noter, pedagogiske hjelpemidler, øvelser, oppgaver, spørsmål og svar, lære- eller studiemateriell, etc. @no
label: és guia d’una obra @ca
definition: Relaciona una obra amb una obra que és augmentada amb una obra relacionada que consisteix en material per ajudar l’usuari d’una obra predominant, com ara notes, ajudes a l’aprenentatge i l’estudi, exercicis, problemes, preguntes i respostes, materials per al professor o l’estudiant, etc. @ca
toolkit label: guia d’una obra @ca
toolkit definition: Obra que és augmentada amb una obra relacionada que consisteix en material per ajudar l’usuari d’una obra predominant, com ara notes, ajudes a l’aprenentatge i l’estudi, exercicis, problemes, preguntes i respostes, materials per al professor o l’estudiant, etc. @ca
has element type: 2
label: είναι οδηγός στο (έργο) @el
definition: Συνδέει ένα έργο με ένα έργο το οποίο έχει αυξηθεί από ένα άλλο έργο αποτελούμενο από υλικό, όπως σημειώσεις, βοηθήματα μάθησης και μελέτης, ασκήσεις, προβλήματα, ερωταποκρίσεις, υλικό για τον εκπαιδευτή ή τον μαθητή κ.λπ., για να βοηθήσει τον χρήστη του κύριου έργου. @el
toolkit label: οδηγός στο (έργο) @el
toolkit definition: Ένα έργο το οποίο έχει αυξηθεί από ένα άλλο έργο αποτελούμενο από υλικό, όπως σημειώσεις, βοηθήματα μάθησης και μελέτης, ασκήσεις, προβλήματα, ερωταποκρίσεις, υλικό για τον εκπαιδευτή ή τον μαθητή κ.λπ. @el
label: kalauz a következő műhöz: @hu
definition: Hozzákapcsol egy művet egy műhöz, amelyet bővítenek egy kapcsolódó művel, amelynek tartalma, mint például jegyzetek, tanulási és tanulmányi segédletek, gyakorlatok, problémák, kérdések és válaszok, oktatói és diákanyagok stb., egy domináns mű használóját segíti. @hu
toolkit label: kalauzzal ellátott mű @hu
toolkit definition: Egy mű, amelyet bővítenek egy kapcsolódó művel, amelynek tartalma, mint például jegyzetek, tanulási és tanulmányi segédletek, gyakorlatok, problémák, kérdések és válaszok, oktatói és diákanyagok stb., egy domináns mű használóját segíti. @hu
label: opas teokseen @fi
label: er studieveiledning til verk @no
definition: Relaterer et verk til et verk som har et tillegg i form av et relatert verk som består av materiale for å veilede en bruker gjennom bruken av et mer fremtredende verk ved hjelp av noter, pedagogiske hjelpemidler, øvelser, oppgaver, spørsmål og svar, lære- eller studiemateriell, etc. @no
label: is gids bij werk @nl
definition: Relateert een werk aan een werk dat aangevuld wordt door een gerelateerd werk dat bestaat uit materiaal om de gebruiker van een hoofdwerk te helpen, zoals noten, leer- en studiehulpmiddelen, oefeningen, vraagstukken, vragen en antwoorden, instructie- of studentenmateriaal etc. @nl
toolkit label: gids bij werk @nl
toolkit definition: Een werk dat aangevuld wordt door een gerelateerd werk dat bestaat uit materiaal om de gebruiker van een hoofdwerk te helpen, zoals noten, leer- en studiehulpmiddelen, oefeningen, vraagstukken, vragen en antwoorden, instructie- of studentenmateriaal etc. @nl
label: هو دليل إرشادي لعمل @ar
definition: يربط عمل بعمل تم تعزيزه من خلال عمل ذي صلة يتكون من مواد، مثل الملاحظات، ووسائل التعلم والدراسة، والتمارين، والمسائل، والأسئلة والأجوبة، ومواد المعلم أو الطلاب، إلخ.، لمساعدة مستخدم عمل سائد. @ar
toolkit label: دليل إرشادي لعمل @ar
toolkit definition: عمل تم تعزيزه من خلال عمل ذي صلة يتكون من مواد، مثل الملاحظات، ووسائل التعلم والدراسة، والتمارين، والمسائل، والأسئلة والأجوبة، ومواد المعلم أو الطلاب، إلخ.، لمساعدة مستخدم عمل سائد. @ar
label: käsiraamat teosele @et
toolkit label: käsiraamat teosele @et
toolkit definition: Teos, mida on täiendatud seotud teosega, milles juhendatakse kasutama dominantset teost märkuste, õpijuhiste, harjutuste, ülesannete, küsimuste ja vastuste, õpetaja või õpilase materjalide jms abil. @et
label: è guida a opera @it
definition: Correla un’opera a un’opera aumentata da un’opera correlata che consiste di materiale come note, sussidi per l’apprendimento e lo studio, esercizi, problemi, domande e risposte, materiali per l’insegnante o per gli studenti, etc. per aiutare l’utente dell’opera principale. @it
toolkit label: guida a opera @it
toolkit definition: Opera aumentata da un’opera correlata che consiste di materiale come note, sussidi per l’apprendimento e lo studio, esercizi, problemi, domande e risposte, materiali per l’insegnante o per gli studenti, etc. per aiutare l’utente dell’opera principale. @it
label: ir palīglīdzeklis resursa darbam @lv
definition: Sasaista darbu ar darbu, kuram izveidots palīglīdzeklis, lai palīdzētu lietot pamatdarbu, piemēram, piezīmes, mācību un studiju līdzekļi, vingrinājumi, uzdevumi, jautājumi un atbildes, pasniedzēja vai studentu materiāli u.tml. @lv
toolkit label: palīglīdzeklis resursa darbam @lv
toolkit definition: Darbs, kuram izveidots palīglīdzeklis, lai palīdzētu lietot pamatdarbu, piemēram, piezīmes, mācību un studiju līdzekļi, vingrinājumi, uzdevumi, jautājumi un atbildes, pasniedzēja vai studentu materiāli u.tml. @lv
label: 是作品的指南 @zh-hans
definition: 将一种作品与被由注释、学习和研究工具、练习、提问、问题与答案、师生参考资料等对主要作品使用者提供帮助的资料组成的一种相关作品附增的一种作品关联起来。 @zh-hans
toolkit label: 作品的指南 @zh-hans
toolkit definition: 被由注释、学习和研究工具、练习、提问、问题与答案、师生参考资料等对主要作品使用者提供帮助的资料组成的一种相关作品附增的一种作品 @zh-hans
has subproperty: P10150
label: eser için rehberdir @tr
definition: Bir çalışmayı, baskın bir çalışmanın kullanıcısına yardımcı olmak için notlar, öğrenme ve çalışma yardımcıları, alıştırmalar, problemler, sorular ve cevaplar, eğitmen veya öğrenci materyalleri vb. gibi materyallerden oluşan ilgili bir eserle çoğaltılmış bir eserle ilişkilendirir. @tr
toolkit label: çalışmaya yardımcı eser @tr
toolkit definition: Birincil eserin kullanıcılarına yardımcı olmak amacıyla notlar, öğrenme ve çalışma materyalleri, alıştırmalar, problemler, soru-cevaplar, eğitmen veya öğrenci materyalleri gibi ek içeriklerden oluşan ilgili bir eserle zenginleştirilmiş bir eser. @tr

is commentary on work
status: Published
definition: Relates a work to a work used as a basis for a set of explanatory or critical notes.
type: Property
domain: C10001
sub property of: is description of work
lexical alias: commentaryOnWork.en
toolkit label: commentary on work
toolkit definition: A work used as a basis for a set of explanatory or critical notes.
toolkit label: commentaire sur une œuvre @fr
toolkit definition: Œuvre qui sert de base à un ensemble de notes explicatives ou critiques. @fr
toolkit label: comentario sobre (obra) @es
toolkit definition: Una obra usada como base para un conjunto de notas explicativas o críticas. @es
instruction number: 23.5
label: er kommentar til værk @da
definition: Relaterer et værk til et værk, som anvendes som grundlag for et sæt af forklarende eller kritiske kommentarer. @da
toolkit label: kommentar til værk @da
toolkit definition: Værk, som anvendes som grundlag for et sæt af forklarende eller kritiske kommentarer. @da
definition: Met une œuvre en relation avec une œuvre qui sert de base à un ensemble de notes explicatives ou critiques. @fr
label: là bình luận về (tác phẩm) @vi
definition: Liên kết tác phẩm với tác phẩm được sử dụng như là cơ sở cho chuỗi ghi chú giải thích hoặc phê bình. @vi
toolkit label: bình luận về (tác phẩm) @vi
toolkit definition: Tác phẩm được sử dụng như là cơ sở cho chuỗi ghi chú giải thích hoặc phê bình. @vi
label: ist Kommentar zu (Werk) @de
definition: Setzt ein Werk in Beziehung zu einem Werk, das als Grundlage für eine Reihe von erläuternden oder kritischen Anmerkungen verwendet wird. @de
toolkit label: Kommentar zu (Werk) @de
toolkit definition: Ein Werk, das als Grundlage für eine Reihe von erläuternden oder kritischen Anmerkungen verwendet wird. @de
label: est un commentaire sur une œuvre @fr
definition: Liittää teoksen selittävien tai kriittisten huomautusten joukon perustana käytettyyn teokseen. @fi
toolkit label: kommentaari teoksesta @fi
toolkit definition: Selittävien tai kriittisten huomautusten joukon perustana käytetty teos. @fi
toolkit label: kommentar til verk @no
toolkit definition: Et verk brukt som utgangspunkt for et sett med forklarende eller kritiske noter. @no
label: és comentari sobre una obra @ca
definition: Relaciona una obra amb una obra usada com a base d’un conjunt de notes explicatives o crítiques. @ca
toolkit label: comentari sobre una obra @ca
toolkit definition: Obra usada com a base d’un conjunt de notes explicatives o crítiques. @ca
has element type: 2
label: είναι σχόλια στο (έργο) @el
definition: Συνδέει ένα έργο με ένα έργο που χρησιμοποιείται ως η βάση για ένα σύνολο επεξηγηματικών ή κριτικών σημειώσεων. @el
toolkit label: σχόλια στο (έργο) @el
toolkit definition: Ένα έργο που χρησιμοποιείται ως η βάση για ένα σύνολο επεξηγηματικών ή κριτικών σημειώσεων. @el
label: kommentárja a következő műnek: @hu
definition: Hozzákapcsol egy művet egy műhöz, amelyet magyarázó vagy kritikai jegyzetek halmazának alapjaként használnak. @hu
toolkit label: kommentált mű @hu
toolkit definition: Egy mű, amelyet magyarázó vagy kritikai jegyzetek halmazának alapjaként használnak. @hu
label: kommentaari teoksesta @fi
label: er kommentar til verk @no
definition: Relaterer et verk til et verk brukt som utgangspunkt for et sett med forklarende eller kritiske noter. @no
label: is commentaar op werk @nl
definition: Relateert een werk aan een werk gebruikt als een basis voor een verzameling van verklarende of kritische noten. @nl
toolkit label: commentaar op werk @nl
toolkit definition: Een werk gebruikt als een basis voor een verzameling van verklarende of kritische noten. @nl
label: هو تعليق على عمل @ar
definition: يربط عمل بعمل يُستخدم كأساس لمجموعة من الملاحظات التفسيرية أو النقدية. @ar
toolkit label: تعليق على عمل @ar
toolkit definition: عمل يُستخدم كأساس لمجموعة من الملاحظات التفسيرية أو النقدية. @ar
label: kommenteeritud teos @et
definition: Seostab teose teosega, mis on aluseks selgitavate või kriitiliste märkuste kogumile. @et
toolkit label: kommenteeritud teos @et
toolkit definition: Teos, mis on aluseks selgitavate või kriitiliste märkuste kogumile. @et
label: è commento su opera @it
definition: Correla un’opera a un’opera utilizzata come base per un insieme di note esplicative o critiche. @it
toolkit label: commento su opera @it
toolkit definition: Opera utilizzata come base per un insieme di note esplicative o critiche. @it
label: ir komentārs darbam @lv
definition: Sasaista darbu ar darbu, kas izmantots par pamatu virknei paskaidrojošu vai kritisku piezīmju. @lv
toolkit label: komentārs darbam @lv
toolkit definition: Darbs, kas izmantots par pamatu virknei paskaidrojošu vai kritisku piezīmju. @lv
label: 是关于作品的评注 @zh-hans
definition: 将一种作品与被用作一个解释性或评论性附注之集合的基础的一种作品关联起来。 @zh-hans
toolkit label: 关于作品的评注 @zh-hans
toolkit definition: 被用作一个解释性或评论性附注之集合的基础的一种作品 @zh-hans
has subproperty: P10187
label: çalışma hakkında yorumdur @tr
definition: Bir eseri, bir dizi açıklayıcı veya eleştirel not için temel olarak kullanılan bir eserle ilişkilendirir. @tr
toolkit label: esere ilişkin yorum @tr
toolkit definition: Bir dizi açıklayıcı veya eleştirel not için temel olarak kullanılan bir çalışma. @tr

is index to work (Deprecated)
definition: Relates a work to a work that is used as a basis for a work that is a systematic, alphabetical guide to its contents. (Deprecated)
type: Property
domain: C10001
sub property of: is augmentation of work
lexical alias: indexToWork.en
toolkit label: index to work (Deprecated)
toolkit definition: A work that is used as a basis for a work that is a systematic, alphabetical guide to its contents. (Deprecated)
toolkit label: index d’une œuvre @fr
toolkit definition: Œuvre qui sert de base à une œuvre qui consiste en un guide méthodique et alphabétique de son contenu. @fr
toolkit label: índice de (obra) @es
toolkit definition: Una obra utilizada como base para un índice, i.e., una guía sistemática, alfabética al contenido de la obra principal, generalmente indicando los números de página u otros códigos de referencia. @es
instruction number: 24.5
label: er indeks til værk @da
definition: Relaterer et værk til et værk, som anvendes som grundlag for et indeks, dvs. en systematisk, alfabetiseret oversigt over indholdet i et fremtrædende værk, normalt kædet sammen med sidenumre eller andre henvisningskoder. @da
toolkit label: indeks til værk @da
toolkit definition: Værk, som anvendes som grundlag for et indeks, dvs. en systematisk, alfabetiseret oversigt over indholdet i et fremtrædende værk, normalt kædet sammen med sidenumre eller andre henvisningskoder. @da
definition: Met une œuvre en relation avec une œuvre qui sert de base à une œuvre qui consiste en un guide méthodique et alphabétique de son contenu. @fr
label: là chỉ mục của (tác phẩm) @vi
definition: Liên kết tác phẩm với tác phẩm được sử dụng như là cơ sở cho chỉ mục, nghĩa là, chỉ dẫn có hệ thống, theo chữ cái nội dung của tác phẩm nổi trội, thường dẫn tới số trang hoặc mã tham chiếu khác. @vi
toolkit label: chỉ mục của (tác phẩm) @vi
toolkit definition: Tác phẩm được sử dụng như là cơ sở cho chỉ mục, nghĩa là, chỉ dẫn có hệ thống, theo chữ cái nội dung của tác phẩm nổi trội, thường dẫn tới số trang hoặc mã tham chiếu khác. @vi
label: ist Index zu (Werk) @de
definition: Setzt ein Werk in Beziehung zu einem Werk, das als Grundlage für ein Werk verwendet wird, bei dem es sich um eine systematische, alphabetische Orientierungshilfe zu dessen Inhalt handelt. @de
toolkit label: Index zu (Werk) @de
toolkit definition: Ein Werk, das als Grundlage für ein Werk verwendet wird, bei dem es sich um eine systematische, alphabetische Orientierungshilfe zu dessen Inhalt handelt. @de
label: est un index d’une œuvre @fr
definition: Liittää teoksen teokseen, jota on käytetty perustana teokselle, joka on systemaattinen, aakkosellinen opas sen sisällöstä. @fi
toolkit label: hakemisto teokseen @fi
toolkit definition: Teos, jota on käytetty perustana teokselle, joka on systemaattinen, aakkosellinen opas sen sisällöstä. @fi
toolkit label: indeks for verk @no
toolkit definition: Et verk som brukes som utgangspunkt for et register, dvs. en systematisk, alfabetisk veiledning til innholdet i et mer fremtredende verk, som regel med henvisninger til sidenumre eller andre referansekoder. @no
label: és índex d’una obra @ca
definition: Relaciona una obra amb una obra que s’usa com a base per a una obra que és una guia sistemàtica o alfabètica als seus continguts. @ca
toolkit label: índex d’una obra @ca
toolkit definition: Obra que s’usa com a base per a una obra que és una guia sistemàtica o alfabètica als seus continguts. @ca
has element type: 2
label: είναι ευρετήριο στο (έργο) @el
definition: Συνδέει ένα έργο με ένα έργο το οποίο χρησιμοποιείται ως η βάση για ένα ευρετήριο, δηλαδή έναν συστηματικό, αλφαβητικό οδηγό των περιεχομένων της κύριας έκφρασης, ο οποίος συνήθως πληκτρολογείται στη σελιδαρίθμηση ή σε άλλους κώδικες αναφοράς. @el
toolkit label: ευρετήριο στο (έργο) @el
toolkit definition: Ένα έργο το οποίο χρησιμοποιείται ως η βάση για ένα ευρετήριο, δηλαδή ένας συστηματικός, αλφαβητικός οδηγός των περιεχομένων της κύριας έκφρασης, ο οποίος συνήθως πληκτρολογείται στη σελιδαρίθμηση ή σε άλλους κώδικες αναφοράς. @el
label: mutatója a következő műnek: @hu
definition: Hozzákapcsol egy művet egy műhöz, amelyet alapként használnak egy olyan műhöz, ami a tartalmára vonatkozó szisztematikus és betűrendes kalauz. @hu
toolkit label: mutatóval ellátott mű @hu
toolkit definition: Egy mű, amelyet alapként használnak egy olyan műhöz, ami a tartalmára vonatkozó szisztematikus és betűrendes kalauz. @hu
label: hakemisto teokseen @fi
label: er indeks for verk @no
definition: Relaterer et verk til et verk som brukes som utgangspunkt for et register, dvs. en systematisk, alfabetisk veiledning til innholdet i et mer fremtredende verk, som regel med henvisninger til sidenumre eller andre referansekoder. @no
label: is index bij werk @nl
definition: Relateert een werk aan een werk dat is gebruikt als een basis voor een werk dat een systematische, alfabetische gids bij diens inhoud is. @nl
toolkit label: index bij werk @nl
toolkit definition: Een werk dat is gebruikt als een basis voor een werk dat een systematische, alfabetische gids bij diens inhoud is. @nl
label: هو كشاف لعمل @ar
definition: يربط عمل بعمل يُستخدم كأساس لعمل عبارة عن دليل منهجي وأبجدي لمحتوياته. @ar
toolkit label: كشاف لعمل @ar
toolkit definition: عمل يُستخدم كأساس لعمل عبارة عن دليل منهجي وأبجدي لمحتوياته. @ar
label: register teosele @et
definition: Seostab teose teosega, mis on aluseks registrile, s.t süstemaatilisele ja tähestikulisele aineloendile dominantse teose sisu kohta. Registris kasutatakse viitamiseks tavaliselt leheküljenumbreid või muid tähiseid. @et
toolkit label: register teosele @et
toolkit definition: Teos, mis on aluseks registrile, s.t süstemaatilisele ja tähestikulisele aineloendile dominantse teose sisu kohta. Registris kasutatakse viitamiseks tavaliselt leheküljenumbreid või muid tähiseid. @et
label: è indice a opera @it
definition: Correla un’opera a un’opera utilizzata come base per un indice, cioè una guida sistematica ai contenuti dell’opera principale, organizzata in ordine alfabetico, che solitamente rinvia a numeri di pagina o ad altri codici di riferimento. @it
toolkit label: indice a opera @it
toolkit definition: Opera utilizzata come base per un indice, cioè una guida sistematica ai contenuti dell’opera principale, organizzata in ordine alfabetico, che solitamente rinvia a numeri di pagina o ad altri codici di riferimento. @it
status: Deprecated
label: ir rādītājs darbam @lv
definition: Sasaista darbu ar darbu, kas izmantots par pamatu rādītājam, t.i., pamatdarba satura sistemātiskam, alfabētiskam rādītājam, parasti norādot uz lappušu numuriem vai citiem atsauču kodiem. @lv
toolkit label: rādītājs darbam @lv
toolkit definition: Darbs, kas izmantots par pamatu rādītājam, t.i., pamatdarba satura sistemātiskam, alfabētiskam rādītājam, parasti norādot uz lappušu numuriem vai citiem atsauču kodiem. @lv
has subproperty: P10188

is supplement to work
status: Published
definition: Relates a work to a work that is updated or otherwise complemented by an augmenting work.
type: Property
domain: C10001
sub property of: is augmentation of work
lexical alias: supplementToWork.en
toolkit label: supplement to work
toolkit definition: A work that is updated or otherwise complemented by an augmenting work.
toolkit label: supplément d’une œuvre @fr
toolkit definition: Œuvre qui est mise à jour ou complétée d’une autre façon par une œuvre augmentatrice. @fr
toolkit label: suplemento de (obra) @es
toolkit definition: Una obra que se actualiza o complementa aumentando la obra principal. @es
instruction number: 24.5
label: er supplement til værk @da
definition: Relaterer et værk til et værk, som er opdateret eller på anden måde komplementeret af et berigende værk. @da
toolkit label: supplement til værk @da
toolkit definition: Værk, som er opdateret eller på anden måde komplementeret af et berigende værk. @da
definition: Met une œuvre en relation avec une œuvre qui est mise à jour ou complétée d’une autre façon par une œuvre augmentatrice. @fr
label: là phụ bản của (tác phẩm) @vi
definition: Liên kết tác phẩm với tác phẩm được cập nhật hoặc nếu không thì được bổ sung bởi tác phẩm gia tăng. @vi
toolkit label: phụ bản của (tác phẩm) @vi
toolkit definition: Tác phẩm được cập nhật hoặc nếu không thì được bổ sung bởi tác phẩm gia tăng. @vi
label: ist Supplement zu (Werk) @de
definition: Setzt ein Werk in Beziehung zu einem Werk, das durch ein erweiterndes Werk aktualisiert oder in anderer Weise vervollständigt wird. @de
toolkit label: Supplement zu (Werk) @de
toolkit definition: Ein Werk, das durch ein erweiterndes Werk aktualisiert oder in anderer Weise vervollständigt wird. @de
label: est un supplément d’une œuvre @fr
definition: Liittää teoksen teokseen, jota päivittää tai muutoin täydentää laajentava teos. @fi
toolkit label: suplementti teokseen @fi
toolkit definition: Teos, jota päivittää tai muutoin täydentää laajentava teos. @fi
toolkit label: supplement til verk @no
toolkit definition: Et verk som oppdateres eller på annen måte utfylles av et utvidende verk. @no
label: és suplement d’una obra @ca
definition: Relaciona una obra amb una obra que s’actualitza o altrament es complementa amb una obra d’augmentació. @ca
toolkit label: suplement d’una obra @ca
toolkit definition: Obra que s’actualitza o altrament es complementa amb una obra d’augmentació. @ca
has element type: 2
label: είναι συμπλήρωμα στο (έργο) @el
definition: Συνδέει ένα έργο με ένα έργο το οποίο ενημερώνεται ή αλλιώς συμπληρώνεται από ένα επαυξημένο έργο. @el
toolkit label: συμπλήρωμα στο (έργο) @el
toolkit definition: Ένα έργο το οποίο ενημερώνεται ή αλλιώς συμπληρώνεται από ένα επαυξημένο έργο. @el
label: szuplementuma a következő műnek: @hu
definition: Hozzákapcsol egy művet egy műhöz, amelyet egy bővítő mű frissít vagy más módon kiegészít. @hu
toolkit label: szuplementált mű @hu
toolkit definition: Egy mű, amelyet egy bővítő mű frissít vagy más módon kiegészít. @hu
label: suplementti teokseen @fi
label: er supplement til verk @no
definition: Relaterer et verk til et verk som oppdateres eller på annen måte utfylles av et utvidende verk. @no
label: is supplement op werk @nl
definition: Relateert een werk aan een werk dat geüpdatet is of op een andere manier gecomplementeerd door een aanvullend werk. @nl
toolkit label: supplement op werk @nl
toolkit definition: Een werk dat geüpdatet is of op een andere manier gecomplementeerd door een aanvullend werk. @nl
label: هو ملحق لعمل @ar
definition: يربط عمل بعمل محدَّث أو مستكمل بعمل مزيد. @ar
toolkit label: ملحق لعمل @ar
toolkit definition: عمل تم تحديثه أو، خلاف ذلك، استكماله بعمل مزيد. @ar
label: suplement teosele @et
definition: Seostab teose teosega, mida on uuendatud või muul viisil täiendatud laiendava teosega. @et
toolkit label: suplement teosele @et
toolkit definition: Teos, mida on uuendatud või muul viisil täiendatud laiendava teosega. @et
label: è supplemento di opera @it
definition: Correla un’opera a un’opera aggiornata o completata da un’opera aggiuntiva. @it
toolkit label: supplemento a opera @it
toolkit definition: Opera aggiornata o completata da un’opera aggiuntiva. @it
label: ir papildinājums darbam @lv
definition: Sasaista darbu ar darbu, kas atjaunots vai citādi papildināts ar aprakstāmo darbu. @lv
toolkit label: papildinājums darbam @lv
toolkit definition: Darbs, kas atjaunots vai citādi papildināts ar aprakstāmo darbu. @lv
label: 是作品的补编 @zh-hans
definition: 将一种作品与被一种附增作品更新或补充的一种作品关联起来。 @zh-hans
toolkit label: 作品的补编 @zh-hans
toolkit definition: 被一种附增作品更新或补充的一种作品 @zh-hans
has subproperty: P10154
label: esere ektir @tr
definition: Bir eseri, güncellenmiş veya başka bir şekilde artırılmış bir eseri ilişkilendirir. @tr
toolkit label: esere ek olarak @tr
toolkit definition: Bir ekleyici eser tarafından güncellenen veya başka bir şekilde tamamlanan bir eser @tr

is addenda to work
status: Published
definition: Relates a work to a work whose content is completed with brief content from a related work.
type: Property
domain: C10001
sub property of: is augmentation of work
lexical alias: addendaToWork.en
toolkit label: addenda to work
toolkit definition: A work whose content is completed with brief content from a related work.
toolkit label: addenda d’une œuvre @fr
toolkit definition: Œuvre dont le contenu est complété par le bref contenu d’une œuvre en relation. @fr
toolkit label: adenda de (obra) @es
toolkit definition: Una obra a la cual se añade material adicional breve, menos extenso que un suplemento, pero esencial para la integridad del contenido de la obra; generalmente se agrega al final de la obra, pero en algunos casos se publica separadamente. @es
instruction number: 24.5
label: er tillæg til værk @da
definition: Relaterer et værk til et værk, hvis indhold er fuldbragt med kortfattet indhold fra et relateret værk. @da
toolkit label: tillæg til værk @da
toolkit definition: Værk, hvis indhold er fuldbragt med kortfattet indhold fra et relateret værk. @da
definition: Met une œuvre en relation avec une œuvre dont le contenu est complété par le bref contenu d’une œuvre en relation. @fr
label: là phần thêm của (tác phẩm) @vi
definition: Liên kết tác phẩm với tác phẩm mà nội dung được hoàn thành với nội dung ngắn gọn từ tác phẩm khác. @vi
toolkit label: phần thêm của (tác phẩm) @vi
toolkit definition: Tác phẩm mà nội dung được hoàn thành với nội dung ngắn gọn từ tác phẩm khác. @vi
label: ist Ergänzung zu (Werk) @de
definition: Setzt ein Werk in Beziehung zu einem Werk, dessen Inhalt durch kurzen Inhalt eines in Beziehung stehenden Werks vervollständigt wird. @de
toolkit label: Ergänzung zu (Werk) @de
toolkit definition: Ein Werk, dessen Inhalt durch kurzen Inhalt eines in Beziehung stehendes Werks vervollständigt wird. @de
label: est un addenda d’une œuvre @fr
definition: Liittää teoksen teokseen, jonka sisältöä täydennetään suppealla sisällöllä siihen liittyvästä teoksesta. @fi
toolkit label: lisäykset teokseen @fi
toolkit definition: Teos, jonka sisältöä täydennetään suppealla sisällöllä siihen liittyvästä teoksesta. @fi
toolkit label: tillegg til verk @no
toolkit definition: Et verk hvis innhold utfylles av kortfattet innhold fra et annet verk. @no
label: és addenda a una obra @ca
definition: Relaciona una obra amb una obra el contingut de la qual es complementa amb un contingut breu d’una obra relacionada. @ca
toolkit label: addenda a una obra @ca
toolkit definition: Obra el contingut de la qual es complementa amb un contingut breu d’una obra relacionada. @ca
has element type: 2
label: είναι προσθήκες στο (έργο) @el
definition: Συνδέει ένα έργο με ένα έργο του οποίου το περιεχόμενο συμπληρώνεται με σύντομο περιεχόμενο από ένα άλλο έργο. @el
toolkit label: προσθήκες στο (έργο) @el
toolkit definition: Ένα έργο του οποίου το περιεχόμενο συμπληρώνεται με σύντομο περιεχόμενο από ένα άλλο έργο. @el
label: pótlás a következő műhöz: @hu
definition: Hozzákapcsol egy művet egy műhöz, amelynek tartalmát egy kapcsolódó mű rövid tartalmával teszik teljessé. @hu
toolkit label: pótlás a következő műhöz: @hu
toolkit definition: Egy mű, amelynek tartalmát egy kapcsolódó mű rövid tartalmával teszik teljessé. @hu
label: lisäykset teokseen @fi
label: er tillegg til verk @no
definition: Relaterer et verk til et verk hvis innhold utfylles av kortfattet innhold fra et annet verk. @no
label: is toevoegingen aan werk @nl
definition: Relateert een werk aan een werk waarvan de content gecompleteerd wordt met korte content uit een gerelateerd werk. @nl
toolkit label: toevoegingen aan werk @nl
toolkit definition: Een werk waarvan de content gecompleteerd wordt met korte content uit een gerelateerd werk. @nl
label: هو إضافة لعمل @ar
definition: يربط عمل بعمل يكتمل محتواه بمحتوى موجز من عمل ذي صلة. @ar
toolkit label: إضافة لعمل @ar
toolkit definition: عمل يكتمل محتواه بمحتوى موجز من عمل ذي صلة. @ar
label: lisa teosele @et
definition: Seostab teose teosega, mille sisu on täiendatud seotud teose lühikese sisuga. @et
toolkit label: lisa teosele @et
toolkit definition: Teos, mille sisu on täiendatud seotud teose lühikese sisuga. @et
label: è addenda a opera @it
definition: Correla un’opera a un’opera il cui contenuto è completato con un breve contenuto da un’opera correlata. @it
toolkit label: addenda a opera @it
toolkit definition: Opera il cui contenuto è completato con un breve contenuto da un’opera correlata. @it
label: ir saturisks pielikums darbam @lv
definition: Sasaista darbu ar darbu, kura saturs ir pilnveidots ar īsu saturu no cita darba. @lv
toolkit label: saturisks pielikums darbam @lv
toolkit definition: Darbs, kura saturs ir pilnveidots ar īsu saturu no cita darba. @lv
label: 是作品的补遗 @zh-hans
definition: 将一种作品与其内容加上一种相关作品之简要内容后就完整的一种作品关联起来。 @zh-hans
toolkit label: 作品的补遗 @zh-hans
toolkit definition: 其内容加上一种相关作品之简要内容后就完整的一种作品 @zh-hans
has subproperty: P10177
label: esere ektir @tr
definition: Bir eseri, içeriği ilgili bir eserden alınan kısa bir içerikle tamamlanan bir eserle ilişkilendirir. @tr
toolkit label: Çalışmaya ek @tr
toolkit definition: İçeriği ilgili bir eserden kısa bir içerikle tamamlanan bir çalışma. @tr

is music for work
status: Published
definition: Relates a work to a work that is complemented by a musical work.
type: Property
domain: C10001
sub property of: is complemented by work
lexical alias: musicForWork.en
toolkit label: music for work
toolkit definition: A work that is complemented by a musical work.
toolkit label: musique pour une œuvre @fr
toolkit definition: Œuvre qui est complétée par une œuvre musicale. @fr
toolkit label: música para (obra) @es
toolkit definition: Una obra tal como una película, obra de teatro, programa de televisión, etc., que usa la obra musical. @es
instruction number: 24.5
label: er musik til værk @da
definition: Relaterer et værk til et værk, som er komplementeret af et musikværk. @da
toolkit label: musik til værk @da
toolkit definition: Værk, som er komplementeret af et musikværk. @da
definition: Met une œuvre en relation avec une œuvre qui est complétée par une œuvre musicale. @fr
label: là âm nhạc cho (tác phẩm) @vi
definition: Liên kết tác phẩm với tác phẩm như là phim điện ảnh, kịch, chương trình truyền hình, v.v...sử dụng tác phẩm âm nhạc. @vi
toolkit label: âm nhạc cho (tác phẩm) @vi
toolkit definition: Tác phẩm như là phim điện ảnh, kịch, chương trình truyền hình, v.v...sử dụng tác phẩm âm nhạc. @vi
label: ist Musik für (Werk) @de
definition: Setzt ein Werk in Beziehung zu einem Werk, das durch ein Musikwerk vervollständigt wird. @de
toolkit label: Musik für (Werk) @de
toolkit definition: Ein Werk, das durch ein Musikwerk vervollständigt wird. @de
label: est une musique pour une œuvre @fr
definition: Liittää teoksen teokseen, jota musiikkiteos täydentää. @fi
toolkit label: musiikki teokseen @fi
toolkit definition: Teos, jota musiikkiteos täydentää. @fi
toolkit label: musikk for verk @no
toolkit definition: Et verk som utfylles av et musikalsk verk. @no
label: és música per a una obra @ca
definition: Relaciona una obra amb una obra que es complementa amb una obra musical. @ca
toolkit label: música per a una obra @ca
toolkit definition: Obra que es complementa amb una obra musical. @ca
has element type: 2
label: είναι μουσική για (έργο) @el
definition: Συνδέει ένα έργο με ένα έργο, όπως μια κινηματογραφική ταινία, ένα θεατρικό έργο, ένα τηλεοπτικό πρόγραμμα κ.λπ. το οποίο χρησιμοποιεί ένα μουσικό έργο. @el
toolkit label: μουσική για (έργο) @el
toolkit definition: Ένα έργο, όπως μια κινηματογραφική ταινία, ένα θεατρικό έργο, ένα τηλεοπτικό πρόγραμμα κ.λπ. το οποίο χρησιμοποιεί ένα μουσικό έργο. @el
label: videózene a következő műhöz: @hu
definition: Hozzákapcsol egy művet egy műhöz, amelyet egy zenemű egészít ki. @hu
toolkit label: zenével ellátott mű @hu
toolkit definition: Egy mű, amelyet egy zenemű egészít ki. @hu
label: musiikki teokseen @fi
label: er musikk for verk @no
definition: Relaterer et verk til et verk som utfylles av et musikalsk verk. @no
label: is muziek voor werk @nl
definition: Relateert een werk aan een werk dat is gecomplementeerd door een muziekwerk. @nl
toolkit label: muziek voor werk @nl
toolkit definition: Een werk dat is gecomplementeerd door een muziekwerk. @nl
label: هو موسيقى لعمل @ar
definition: يربط عمل بعمل يكمله عمل موسيقي. @ar
toolkit label: موسيقى لعمل @ar
toolkit definition: عمل يكمله عمل موسيقي. @ar
label: muusika teosele @et
definition: Seostab teose teosega, mida on täiendatud muusikateosega. @et
toolkit label: muusika teosele @et
toolkit definition: Teos, mida on täiendatud muusikateosega. @et
label: è musica per opera @it
definition: Correla un’opera a un’opera completata da un’opera musicale. @it
toolkit label: musica per opera @it
toolkit definition: Opera che è completata da un’opera musicale. @it
label: ir mūzika darbam @lv
definition: Sasaista darbu ar darbu, kas ir papildināts ar mūzikas darbu. @lv
toolkit label: mūzika darbam @lv
toolkit definition: Darbs, kas ir papildināts ar mūzikas darbu @lv
label: 是用于作品的音乐 @zh-hans
definition: 将一种作品与被一种音乐作品补充的一种作品关联起来。 @zh-hans
toolkit label: 用于作品的音乐 @zh-hans
toolkit definition: 被一种音乐作品补充的一种作品 @zh-hans
has subproperty: is incidental music for work
has subproperty: is music for motion picture work
has subproperty: is music for radio program work
has subproperty: is music for television program work
has subproperty: is music for video work
has subproperty: P10238
label: eser müziğidir @tr

has illustrations work
status: Published
definition: Relates a work to a work that consists of pictorial content designed to explain or decorate an augmented work.
type: Property
domain: C10001
sub property of: is augmented by work
lexical alias: illustrationsWork.en
toolkit label: illustrations work
toolkit definition: A work that consists of pictorial content designed to explain or decorate an augmented work.
toolkit label: illustrations (œuvre) @fr
toolkit definition: Œuvre qui consiste en contenu visuel destiné à expliquer ou à décorer une œuvre augmentée. @fr
toolkit label: ilustraciones (obra) @es
toolkit definition: Una obra que consiste en contenido pictórico diseñado para explicar o decorar la obra aumentada. @es
instruction number: 24.5
label: har illustrationsværk @da
definition: Relaterer et værk til et værk, som består af billedindhold, som er skabt til at forklare eller udsmykke et beriget værk. @da
toolkit label: illustrationsværk @da
toolkit definition: Værk, som består af billedindhold, som er skabt til at forklare eller udsmykke et beriget værk. @da
definition: Met une œuvre en relation avec une œuvre qui consiste en contenu visuel destiné à expliquer ou à décorer une œuvre augmentée. @fr
label: là minh hoạ (tác phẩm) @vi
definition: Liên kết tác phẩm với tác phẩm có chứa nội dung tranh ảnh được thiết kế để giải thích hoặc trang trí cho tác phẩm được gia tăng. @vi
toolkit label: minh hoạ (tác phẩm) @vi
toolkit definition: Tác phẩm có chứa nội dung tranh ảnh được thiết kế để giải thích hoặc trang trí cho tác phẩm được gia tăng. @vi
label: hat Illustrationen (Werk) @de
definition: Setzt ein Werk in Beziehung zu einem Werk, das durch Bildinhalte ergänzt wird, die ein erweitertes Werk erklären oder ausschmücken sollen. @de
toolkit label: Illustrationen (Werk) @de
toolkit definition: Ein Werk, das durch Bildinhalte ergänzt wird, die ein erweitertes Werk erklären oder ausschmücken sollen. @de
label: a pour illustrations (œuvre) @fr
definition: Liittää teoksen teokseen, joka koostuu laajennettavaa teosta selittävästä ja koristavasta kuvamateriaalista. @fi
toolkit label: kuvitus (teos) @fi
toolkit definition: Teos, joka koostuu laajennettavaa teosta selittävästä ja koristavasta kuvamateriaalista. @fi
toolkit label: illustrasjoner (verk) @no
toolkit definition: Et verk som består av bildeinnhold laget for å forklare eller dekorere et utvidet verk. @no
label: té com a obra d’il·lustracions @ca
definition: Relaciona una obra amb una obra que consisteix en un contingut pictòric dissenyat per explicar o decorar una obra augmentada. @ca
toolkit label: obra d’il·lustracions @ca
toolkit definition: Obra que consisteix en un contingut pictòric dissenyat per explicar o decorar una obra augmentada. @ca
has element type: 2
label: είναι εικονογραφήσεις (έργο) @el
definition: Συνδέει ένα έργο με ένα έργο που συνίσταται από εικονογραφημένο περιεχόμενο προορισμένο να εξηγήσει ή να διακοσμήσει μια επαυξημένη έκφραση. @el
toolkit label: εικονογραφήσεις (έργο) @el
toolkit definition: Ένα έργο που συνίσταται από εικονογραφημένο περιεχόμενο προορισμένο να εξηγήσει ή να διακοσμήσει μια επαυξημένη έκφραση. @el
label: illusztrációja a következő mű: @hu
definition: Hozzákapcsol egy művel egy olyan képi tartalomból álló műhöz, amelyet egy bővített mű magyarázatára vagy díszítésére terveztek. @hu
toolkit label: illusztrációmű @hu
toolkit definition: Egy olyan képi tartalomból álló mű, amelyet egy bővített mű magyarázatára vagy díszítésére terveztek. @hu
label: kuvitus (teos) @fi
label: har illustrasjoner (verk) @no
definition: Relaterer et verk til et verk som består av bildeinnhold laget for å forklare eller dekorere et utvidet verk. @no
label: heeft illustraties-werk @nl
definition: Relateert een werk aan een werk dat bestaat uit illustratieve content ontworpen om een aanvullend werk te verklaren of versieren. @nl
toolkit label: illustratiewerk @nl
toolkit definition: Een werk dat bestaat uit illustratieve content ontworpen om een aanvullend werk te verklaren of versieren. @nl
label: له عمل إيضاحيات @ar
definition: يربط عمل بعمل يتكون من محتوى تصويري مصمم لشرح عمل مزيد أو تزيينه. @ar
toolkit label: عمل إيضاحيات @ar
toolkit definition: عمل يتكون من محتوى تصويري مصمم لشرح عمل مزيد أو تزيينه. @ar
label: illustratsioonid teoses @et
definition: Seostab teose teosega, mis sisaldab laiendatud teose selgitamiseks või kaunistamiseks mõeldud piltsisu. @et
toolkit label: illustratsioonid teoses @et
toolkit definition: Teos, mis sisaldab laiendatud teose selgitamiseks või kaunistamiseks mõeldud piltsisu. @et
label: ha come illustrazioni opera @it
definition: Correla un’opera a un’opera che consiste di contenuto pittorico ideato per esplicare o decorare un’opera ampliata. @it
toolkit label: illustrazioni opera @it
toolkit definition: Opera che consiste di contenuto pittorico ideato per esplicare o decorare un’opera ampliata. @it
label: darbs: ilustrācijas @lv
definition: Sasaista darbu ar darbu - ilustrēts saturs, kas radīts, lai izskaidrotu vai izgreznotu papildināto darbu. @lv
toolkit label: darbs: ilustrācijas @lv
toolkit definition: Darbs - ilustrēts saturs, kas radīts, lai izskaidrotu vai izgreznotu papildināto darbu. @lv
label: 有插图作品 @zh-hans
definition: 将一种作品与由被设计用来解释或装饰一种被附增的作品的图画内容组成的一种作品关联起来。 @zh-hans
toolkit label: 插图作品 @zh-hans
toolkit definition: 由被设计用来解释或装饰一种被附增的作品的图画内容组成的一种作品 @zh-hans
has subproperty: P10093
label: resimleme eseri ile ilişkilidir @tr
definition: Bir eseri, çoğaltılmış bir eseri açıklamak veya süslemek için tasarlanmış görsel içeriği içeren bir eserle ilişkilendirir. @tr
toolkit label: resimleme eseri ile ilişkilidir @tr
toolkit definition: Genişletilmiş bir eseri açıklamak veya süslemek için tasarlanmış görsel içerikten oluşan eser. @tr

is illustrations for work
status: Published
definition: Relates a work to a work that is augmented by pictorial content designed to explain or decorate it.
type: Property
domain: C10001
sub property of: is augmentation of work
lexical alias: illustrationsForWork.en
toolkit label: illustrations for work
toolkit definition: A work that is augmented by pictorial content designed to explain or decorate it.
toolkit label: illustrations pour une œuvre @fr
toolkit definition: Œuvre qui est augmentée par du contenu visuel destiné à l’expliquer ou à la décorer. @fr
toolkit label: ilustraciones para (obra) @es
toolkit definition: Una obra aumentada con contenido pictórico diseñado para explicarla o decorarla. @es
instruction number: 24.5
label: er illustrationer til værk @da
definition: Relaterer et værk til et værk, som er beriget med billedindhold, som er skabt til at forklare eller udsmykke det. @da
toolkit label: illustrationer til værk @da
toolkit definition: Værk, som er beriget med billedindhold, som er skabt til at forklare eller udsmykke det. @da
definition: Met une œuvre en relation avec une œuvre qui est augmentée par du contenu visuel destiné à l’expliquer ou à la décorer. @fr
label: là minh hoạ cho (tác phẩm) @vi
definition: Liên kết tác phẩm với tác phẩm được gia tăng bởi nội dung tranh ảnh được thiết kế để giải thích hoặc trang trí. @vi
toolkit label: minh hoạ cho (tác phẩm) @vi
toolkit definition: Tác phẩm được gia tăng bởi nội dung tranh ảnh được thiết kế để giải thích hoặc trang trí. @vi
label: ist Illustrationen für (Werk) @de
definition: Setzt ein Werk in Beziehung zu einem Werk, das durch Bildinhalte ergänzt wird, die das Werk erklären oder ausschmücken sollen. @de
toolkit label: Illustrationen für (Werk) @de
toolkit definition: Ein Werk, das durch Bildinhalte ergänzt wird, die das Werk erklären oder ausschmücken sollen. @de
label: consiste en illustrations pour une œuvre @fr
definition: Liittää teoksen teokseen, jota on laajennettu sitä selittämään tai koristamaan suunnitellulla kuvasisällöllä. @fi
toolkit label: kuvitus teokseen @fi
toolkit definition: Teos, jota on laajennettu sitä selittämään tai koristamaan suunnitellulla kuvasisällöllä. @fi
toolkit label: illustrasjoner for verk @no
toolkit definition: Et verk som har et tillegg i form av bildeinnhold laget for å forklare eller dekorere det. @no
label: és il·lustracions per a una obra @ca
definition: Relaciona una obra amb una obra que és augmentada amb contingut pictòric dissenyat per explicar-la o decorar-la. @ca
toolkit label: il·lustracions per a una obra @ca
toolkit definition: Obra que és augmentada amb contingut pictòric dissenyat per explicar-la o decorar-la. @ca
has element type: 2
label: είναι εικονογραφήσεις για (έργο) @el
definition: Συνδέει ένα έργο με ένα έργο που έχει αυξηθεί από εικονογραφημένο περιεχόμενο για να το εξηγήσει ή να το διακοσμήσει. @el
toolkit label: εικονογραφήσεις για (έργο) @el
toolkit definition: Ένα έργο που έχει αυξηθεί από εικονογραφημένο περιεχόμενο για να το εξηγήσει ή να το διακοσμήσει. @el
label: illusztráció a következő műhöz: @hu
definition: Hozzákapcsol egy művet egy műhöz, amelyet képi tartalommal bővítenek, amelyet annak magyarázatára vagy díszítésére terveztek. @hu
toolkit label: illusztrált mű @hu
toolkit definition: Egy mű, amelyet képi tartalommal bővítenek, amelyet annak magyarázatára vagy díszítésére terveztek. @hu
label: kuvitus teokseen @fi
label: er illustrasjoner for verk @no
definition: Relaterer et verk til et verk som har et tillegg i form av bildeinnhold laget for å forklare eller dekorere det. @no
label: is illustraties voor werk @nl
definition: Relateert een werk aan een werk dat aangevuld is met illustratieve content ontworpen om het te verklaren of te versieren. @nl
toolkit label: illustraties voor werk @nl
toolkit definition: Een werk dat aangevuld is met illustratieve content ontworpen om het te verklaren of te versieren. @nl
label: هو إيضاحيات لعمل @ar
definition: يربط عمل بعمل مزيد بمحتوى تصويري مصمم لشرحه أو تزيينه. @ar
toolkit label: إيضاحيات لعمل @ar
toolkit definition: عمل مزيد بمحتوى تصويري مصمم لشرحه أو تزيينه. @ar
label: illustratsioonid teosele @et
definition: Seostab teose teosega, mida on laiendatud selle selgitamiseks või kaunistamiseks mõeldud piltsisuga. @et
toolkit label: illustratsioonid teosele @et
toolkit definition: Teos, mida on laiendatud selle selgitamiseks või kaunistamiseks mõeldud piltsisuga. @et
label: è opera in forma di illustrazioni per opera @it
definition: Correla un’opera a un’opera aumentata da contenuto pittorico ideato per esplicarla o decorarla. @it
toolkit label: opera in forma di illustrazioni @it
toolkit definition: Opera aumentata da contenuto pittorico ideato per esplicarla o decorarla. @it
label: ir ilustrācijas darbam @lv
definition: Sasaista darbu ar darbu, kuru papildina ilustrēts saturs, kas paredzēts, lai to izskaidrotu vai izgreznotu. @lv
toolkit label: ilustrācijas darbam @lv
toolkit definition: Darbs, kuru papildina ilustrēts saturs, kas paredzēts, lai to izskaidrotu vai izgreznotu. @lv
label: 是作品的插图 @zh-hans
definition: 将一种作品与由被设计用来解释或装饰它的图画内容附增的一种作品关联起来。 @zh-hans
toolkit label: 作品的插图 @zh-hans
toolkit definition: 由被设计用来解释或装饰它的图画内容附增的一种作品 @zh-hans
has subproperty: P10152
label: eser için resimlemedir @tr
definition: Bir eseri, onu açıklamak veya süslemek için tasarlanmış resimsel içerikle çoğaltılmış bir eserle ilişkilendirir. @tr
toolkit label: eser için resimlemedir @tr
toolkit definition: Açıklanması veya süslenmesi amacıyla tasarlanmış görsel içerikle zenginleştirilmiş bir eser. @tr

is indexing for work (Deprecated)
definition: Relates a work to a work whose contents have been indexed by a related work. (Deprecated)
type: Property
domain: C10001
sub property of: has source work
lexical alias: indexingForWork.en
toolkit label: indexing for work (Deprecated)
toolkit definition: A work whose contents have been indexed by a related work. (Deprecated)
toolkit label: indexation pour une œuvre @fr
toolkit definition: Œuvre dont le contenu a été indexé par une œuvre en relation. @fr
toolkit label: indización de (obra) @es
toolkit definition: Una obra cuyo contenido ha sido indizado por un servicio de indización y resumenes. @es
instruction number: 24.5
label: er indeksering af værk @da
definition: Relaterer et værk til et værk, hvis indhold er blevet indekseret af et relateret værk. @da
toolkit label: indeksering af værk @da
toolkit definition: Værk, hvis indhold er blevet indekseret af et relateret værk. @da
definition: Met une œuvre en relation avec une œuvre dont le contenu a été indexé par une œuvre en relation. @fr
label: là định chỉ mục của (tác phẩm) @vi
definition: Liên kết tác phẩm với tác phẩm mà nội dung của nó được định chỉ mục bởi dịch vụ tóm tắt và định chỉ mục. @vi
toolkit label: định chỉ mục của (tác phẩm) @vi
toolkit definition: Tác phẩm mà nội dung của nó được định chỉ mục bởi dịch vụ tóm tắt và định chỉ mục. @vi
label: ist Indexierung für (Werk) @de
definition: Setzt ein Werk in Beziehung zu einem Werk, dessen Inhalte durch ein in Beziehung stehendes Werk indexiert wurden. @de
toolkit label: Indexierung für (Werk) @de
toolkit definition: Ein Werk, dessen Inhalte durch ein in Beziehung stehendes Werk indexiert wurden. @de
label: est une indexation pour une œuvre @fr
definition: Liittää teoksen teokseen, jonka sisällön siihen liittyvä teos on indeksoinut. @fi
toolkit label: indeksointi teoksesta @fi
toolkit definition: Teos, jonka sisällön siihen liittyvä teos on indeksoinut. @fi
toolkit label: indeksering for verk @no
toolkit definition: Et verk hvis innhold er indeksert i et relatert verk. @no
label: és indexació per a una obra @ca
definition: Relaciona una obra amb una obra els continguts de la qual han estat indexats per una obra relacionada. @ca
toolkit label: indexació per a una obra @ca
toolkit definition: Obra els continguts de la qual han estat indexats per una obra relacionada. @ca
has element type: 2
label: είναι ευρετηρίαση για (έργο) @el
definition: Συνδέει ένα έργο με ένα έργο του οποίου τα περιεχόμενα έχουν ευρετηριαστεί από μια υπηρεσία επιτομής και ευρετηρίασης. @el
toolkit label: ευρετηρίαση για (έργο) @el
toolkit definition: Ένα έργο του οποίου τα περιεχόμενα έχουν ευρετηριαστεί από μια υπηρεσία επιτομής και ευρετηρίασης. @el
label: indexe a következő műnek: @hu
definition: Hozzákapcsol egy művet egy műhöz, amelynek tartalmait egy kapcsolódó mű indexeli. @hu
toolkit label: indexelt mű @hu
toolkit definition: Egy mű, amelynek tartalmait egy kapcsolódó mű indexeli. @hu
label: indeksointi teoksesta @fi
label: er indeksering for verk @no
definition: Relaterer et verk til et verk hvis innhold er indeksert i et relatert verk. @no
label: is indexering voor werk @nl
definition: Relateert een werk aan een werk waarvan de content geïndexeerd is door een gerelateerd werk. @nl
toolkit label: indexering voor werk @nl
toolkit definition: Een werk waarvan de content geïndexeerd is door een gerelateerd werk. @nl
label: هو تكشيف لعمل @ar
definition: يربط عمل بعمل تم تكشيف محتوياته بواسطة عمل ذي صلة @ar
toolkit label: تكشيف لعمل @ar
toolkit definition: عمل تم تكشيف محتوياته بواسطة عمل ذي صلة @ar
label: indekseerimine teosele @et
definition: Seostab teose teosega, mille sisu on indekseeritud seotud teoses. @et
toolkit label: indekseerimine teosele @et
toolkit definition: Teos, mille sisu on indekseeritud seotud teoses. @et
label: è indicizzazione per opera @it
definition: Correla un’opera a un’opera i cui contenuti sono stati indicizzati da un’opera correlata. @it
toolkit label: indicizzazione per opera @it
toolkit definition: Opera i cui contenuti sono stati indicizzati da un’opera correlata. @it
status: Deprecated
label: ir indeksētais darbs @lv
definition: Sasaista darbu ar darbu, kura saturs indeksēts ar saistīto darbu. @lv
toolkit label: indeksētais darbs @lv
toolkit definition: Darbs, kura saturs indeksēts ar saistīto darbu. @lv
has subproperty: P10194

has related work of work
status: Published
definition: Relates a work to a work that is associated with a work.
type: Property
domain: C10001
lexical alias: relatedWorkOfWork.en
sub property of: has related RDA entity of work
label: har værk relateret til værk @da
definition: Relaterer et værk til et værk, som er knyttet til et værk. @da
toolkit label: værk relateret til værk @da
toolkit definition: Værk, som er knyttet til et værk. @da
definition: Met une œuvre en relation avec une œuvre qui est associée à une œuvre. @fr
label: có tác phẩm có liên quan (tác phẩm) @vi
definition: Liên kết tác phẩm với tác phẩm liên quan tới tác phẩm đang được mô tả. @vi
toolkit label: tác phẩm có liên quan (tác phẩm) @vi
toolkit definition: Tác phẩm liên quan tới tác phẩm đang được mô tả. @vi
label: hat mit Werk in Beziehung stehendes Werk @de
definition: Setzt ein Werk in Beziehung zu einem Werk, das mit einem Werk in Verbindung steht. @de
toolkit label: mit Werk in Beziehung stehendes Werk @de
toolkit definition: Ein Werk, das mit einem Werk in Verbindung steht. @de
label: a pour œuvre en relation avec une œuvre @fr
definition: Liittää teoksen teokseen, joka liittyy teokseen. @fi
toolkit label: teokseen liittyvä teos @fi
toolkit definition: Teos, joka liittyy teokseen. @fi
label: té com a obra relacionada amb una obra @ca
definition: Relaciona una obra amb una obra que s’associa amb una obra. @ca
toolkit label: related work of work
toolkit definition: A work that is associated with a work.
has element type: 1
label: έχει σχετικό έργο (έργο) @el
definition: Συνδέει ένα έργο με ένα έργο που συνδέεται με ένα περιγραφόμενο έργο. @el
sub property of: P00002
label: mű kapcsolódó műve a következő: @hu
definition: Hozzákapcsol egy művet egy műhöz, amelyet egy műhöz társítanak. @hu
alternative label: referential work relationship
alternative label: whole-part work relationship
alternative label: derivative work relationship
alternative label: sequential work relationship
label: teokseen liittyvä teos @fi
label: har relatert verk av verk @no
definition: Relaterer et verk til et verk som forbindes med et verk. @no
toolkit label: relatert verk av verk @no
toolkit definition: Et verk som forbindes med et verk. @no
label: heeft gerelateerd werk van werk @nl
definition: Relateert een werk aan een werk dat is geassocieerd met een werk. @nl
toolkit label: gerelateerd werk van werk @nl
toolkit definition: Een werk dat is geassocieerd met een werk. @nl
label: له عمل مرتبط بعمل @ar
definition: يربط عمل بعمل مرتبط بعمل. @ar
toolkit label: عمل مرتبط بعمل @ar
toolkit definition: عمل مرتبط بعمل. @ar
toolkit label: obra relacionada amb una obra @ca
toolkit definition: Obra que s’associa amb una obra. @ca
label: teosega seotud teos @et
definition: Seostab teose teosega seotud teosega. @et
toolkit label: teosega seotud teos @et
toolkit definition: Teosega seotud teos. @et
toolkit label: műhöz kapcsolódó mű @hu
toolkit definition: Egy mű, amelyet egy műhöz társítanak. @hu
label: ha come opera correlata di opera @it
definition: Correla un’opera a un’opera che è associata a un’opera. @it
toolkit label: opera correlata di opera @it
toolkit definition: Opera che è associata a un’opera. @it
toolkit label: œuvre en relation avec une œuvre @fr
toolkit definition: Œuvre qui est associée à une œuvre. @fr
label: ar darbu saistītais darbs @lv
definition: Sasaista darbu ar darbu, kas saistīts ar darbu. @lv
toolkit label: ar darbu saistītais darbs @lv
toolkit definition: Darbs, kas saistīts ar darbu. @lv
alternative label: علاقة عمل متتالٍ @ar
alternative label: Nachfolge-Beziehung auf Werkebene @de
label: 有作品的关联作品 @zh-hans
definition: 将一种作品与和一种作品有关的一种作品关联起来。 @zh-hans
toolkit label: 作品的关联作品 @zh-hans
toolkit definition: 和一种作品有关的一种作品 @zh-hans
alternative label: 参考作品关系 @zh-hans
alternative label: 整体-部分关系 @zh-hans
alternative label: 衍生作品关系 @zh-hans
has subproperty: has accompanying work relationship with (Deprecated)
has subproperty: har afledt værkrelation med
has subproperty: has whole-part work relationship with (Deprecated)

is catalogue of work (Deprecated)
definition: Relates a work to a work used as a basis for a complete enumeration of items arranged systematically. (Deprecated)
type: Property
domain: C10001
sub property of: is augmentation of work
lexical alias: catalogueOfWork.en
toolkit label: catalogue of work (Deprecated)
toolkit definition: A work used as a basis for a complete enumeration of items arranged systematically. (Deprecated)
toolkit label: catalogue d’une œuvre @fr
toolkit definition: Œuvre qui sert de base à une énumération complète d’items classés systématiquement. @fr
toolkit label: catálogo de (obra) @es
toolkit definition: Una obra utilizada como base de un catálogo, i.e., una enumeración total de ítems ordenados sistemáticamente. @es
instruction number: 24.5
label: er katalog over værk @da
definition: Relaterer et værk til et værk, som anvendes som grundlag for en komplet fortegnelse over eksemplarer, som er arrangeret systematisk. @da
toolkit label: katalog over værk @da
toolkit definition: Værk, som anvendes som grundlag for en komplet fortegnelse over eksemplarer, som er arrangeret systematisk. @da
definition: Met une œuvre en relation avec une œuvre qui sert de base à une énumération complète d’items classés systématiquement. @fr
label: là mục lục của (tác phẩm) @vi
definition: Liên kết tác phẩm với tác phẩm được sử dụng như là cơ sở cho mục lục, nghĩa là, bảng kê hoàn chỉnh các bản được sắp xếp có hệ thống. @vi
toolkit label: mục lục của (tác phẩm) @vi
toolkit definition: Tác phẩm được sử dụng như là cơ sở cho mục lục, nghĩa là, bảng kê hoàn chỉnh các bản được sắp xếp có hệ thống. @vi
label: ist Katalog von (Werk) @de
definition: Setzt ein Werk in Beziehung zu einem Werk, das als Grundlage für eine vollständige Aufzählung von systematisch angeordneten Elementen verwendet wird. @de
toolkit label: Katalog von (Werk) @de
toolkit definition: Ein Werk, das als Grundlage für eine vollständige Aufzählung von systematisch angeordneten Elementen verwendet wird. @de
label: est un catalogue d’une œuvre @fr
definition: Liittää teoksen systemaattisesti järjestetyn kohteiden täydellisen listauksen perustana käytettyyn teokseen. @fi
toolkit label: luettelo teoksesta @fi
toolkit definition: Systemaattisesti järjestetyn kohteiden täydellisen listauksen perustana käytetty teos. @fi
toolkit label: katalog over verk @no
toolkit definition: Et verk som brukt som utgangspunkt for en fullstendig og systematisk ordnet liste over eksemplarer. @no
label: és catàleg d’una obra @ca
definition: Relaciona una obra amb una obra usada com a base d’una enumeració completa d’ítems arranjats sistemàticament. @ca
toolkit label: catàleg d’una obra @ca
toolkit definition: Obra usada com a base d’una enumeració completa d’ítems arranjats sistemàticament. @ca
has element type: 2
label: είναι κατάλογος του (έργο) @el
definition: Συνδέει ένα έργο με ένα έργο το οποίο χρησιμοποιείται ως η βάση για έναν κατάλογο, μια πλήρη δηλαδή απαρίθμηση των αντιτύπων συστηματικά οργανωμένων. @el
toolkit label: κατάλογος του (έργο) @el
toolkit definition: Ένα έργο το οποίο χρησιμοποιείται ως η βάση για έναν κατάλογο, μια πλήρη δηλαδή απαρίθμηση των αντιτύπων συστηματικά οργανωμένων. @el
label: katalógusa a következő műnek: @hu
definition: Hozzákapcsol egy művet egy műhöz, amelyet alapként használnak szisztematikusan elrendezett példányok teljes felsorolásához. @hu
toolkit label: katalogizált mű @hu
toolkit definition: Egy mű, amelyet alapként használnak szisztematikusan elrendezett példányok teljes felsorolásához. @hu
label: luettelo teoksesta @fi
label: er katalog over verk @no
definition: Relaterer et verk til et verk som brukt som utgangspunkt for en fullstendig og systematisk ordnet liste over eksemplarer. @no
label: is catalogus van werk @nl
definition: Relateert een werk aan een werk gebruikt als een basis voor een complete opsomming van systematisch geordende items. @nl
toolkit label: catalogus van werk @nl
toolkit definition: Een werk gebruikt als een basis voor een complete opsomming van systematisch geordende items. @nl
label: هو فهرس لعمل @ar
definition: يربط عمل بعمل يُستخدم كأساس لحصر كامل للمفردات المرتبة منهجيا. @ar
toolkit label: فهرس لعمل @ar
toolkit definition: عمل يُستخدم كأساس لحصر كامل للمفردات المرتبة منهجيا. @ar
label: kataloog teosele @et
definition: Seostab teose teosega, mis on aluseks süstematiseeritud sissekannete terviklikule loetelule. @et
toolkit label: kataloog teosele @et
toolkit definition: Teos, mis on aluseks süstematiseeritud sissekannete terviklikule loetelule. @et
label: è catalogo di opera @it
definition: Correla un'opera a un'opera usata come base per una completa enumerazione di item collocati sistematicamente. @it
toolkit label: catalogo di opera @it
toolkit definition: Opera usata come base per una completa enumerazione di item collocati sistematicamente. @it
status: Deprecated
label: ir katalogs darbam @lv
definition: Sasaista darbu ar darbu, kas izmantots par pamatu katalogam, t.i., sistemātiski sakārtotu vienību pilnīgam uzskaitījumam. @lv
toolkit label: katalogs darbam @lv
toolkit definition: Darbs, kas izmantots par pamatu katalogam, t.i., sistemātiski sakārtotu vienību pilnīgam uzskaitījumam. @lv
has subproperty: P10180

is adapted as work
status: Published
definition: Relates a work to a work that modifies another work for a purpose, use, or medium other than that for which it was originally intended.
type: Property
domain: C10001
sub property of: has derivative work
lexical alias: adaptedAsWork.en
scope note: This element applies to changes in form or to works completely rewritten in the same form.
toolkit label: adapted as work
toolkit definition: A work that modifies another work for a purpose, use, or medium other than that for which it was originally intended.
toolkit label: adapté comme une œuvre @fr
toolkit definition: Œuvre qui modifie une autre œuvre pour une fin, une utilisation ou un mode d’expression autre que celui auquel elle était destinée à l’origine. @fr
toolkit label: adaptada como (obra) @es
toolkit definition: Una obra que modifica la obra fuente para un propósito, uso o medio diferente del previsto originalmente. @es
instruction number: 24.5
label: er bearbejdet til værk @da
definition: Relaterer et værk til et værk, som modificerer et oprindeligt værk til et andet formål, en anden brug eller et andet medium end det, det oprindeligt var beregnet til. @da
scope note: Dette element gælder for ændringer i form eller for værker, som er omskrevet fuldstændigt i samme form. @da
toolkit label: bearbejdet til værk @da
toolkit definition: Værk, som modificerer et oprindeligt værk til et andet formål, en anden brug eller et andet medium end det, det oprindeligt var beregnet til. @da
definition: Met une œuvre en relation avec une œuvre qui modifie une autre œuvre pour une fin, une utilisation ou un mode d’expression autre que celui auquel elle était destinée à l’origine. @fr
label: được phỏng theo như là (tác phẩm) @vi
definition: Liên kết tác phẩm với tác phẩm sửa đổi tác phẩm nguồn cho mục đích, sử dụng, hoặc phương tiện khác với ý định nguyên gốc. @vi
scope note: Nối quan hệ này áp dụng đối với thay đổi về hình thái hoặc đối cới tác phẩm được viết lại toàn bộ dưới cùng hình thái. @vi
toolkit label: được phỏng theo như là (tác phẩm) @vi
toolkit definition: Tác phẩm sửa đổi tác phẩm nguồn cho mục đích, sử dụng, hoặc phương tiện khác với ý định nguyên gốc. @vi
label: ist bearbeitet als (Werk) @de
definition: Setzt ein Werk in Beziehung zu einem Werk, das ein anderes Werk für einen anderen Zweck, eine andere Nutzung oder ein anderes Medium bearbeitet als den/die/das, wofür es ursprünglich konzipiert war. @de
scope note: Dies Element bezieht sich auf Änderungen der Form oder auf Werke, die in derselben Form vollständig neu geschrieben sind. @de
toolkit label: Bearbeitet als (Werk) @de
toolkit definition: Ein Werk, das ein anderes Werk für einen anderen Zweck, eine andere Nutzung oder ein anderes Medium bearbeitet als den/die/das, wofür es ursprünglich konzipiert war. @de
label: est adapté comme une œuvre @fr
definition: Liittää teoksen teokseen, joka muokkaa toista teosta jotain muuta kuin alkuperäistä tarkoitusta, käyttöä tai esitysmuotoa varten. @fi
toolkit label: mukaelma (teos) @fi
toolkit definition: Teos, joka muokkaa toista teosta jotain muuta kuin alkuperäistä tarkoitusta, käyttöä tai esitysmuotoa varten. @fi
toolkit label: bearbeidet som verk @no
toolkit definition: Et verk som bearbeider et kildeverk til et annet formål, bruksområde eller medium enn det opprinnelig var ment for. @no
label: és adaptat com a obra @ca
definition: Relaciona una obra amb una obra que modifica una altra obra per a un objectiu, un ús o un suport diferent d’aquell per al qual es va concebre originalment. @ca
scope note: Aquest element s’aplica a canvis en la forma o a obres que han estat reescrites completament en la mateixa forma. @ca
toolkit label: adaptat com a obra @ca
toolkit definition: Obra que modifica una altra obra per a un objectiu, un ús o un suport diferent d’aquell per al qual es va concebre originalment. @ca
scope note: Cet élément s’applique aux changements dans la forme ou aux œuvres complètement réécrites dans la même forme. @fr
has element type: 2
label: είναι προσαρμοσμένο ως (έργο) @el
definition: Συνδέει ένα έργο με ένα έργο το οποίο τροποποιεί ένα έργο-πηγή για έναν σκοπό, χρήση ή μέσο άλλο από εκείνο για το οποίο αρχικά προοριζόταν. @el
scope note: Αυτή η σχέση βρίσκει εφαρμογή στις αλλαγές στη μορφή ή στα έργα που έχουν ξαναγραφτεί ολοκληρωτικά στην ίδια μορφή. @el
toolkit label: προσαρμοσμένο ως (έργο) @el
toolkit definition: Ένα έργο το οποίο τροποποιεί ένα έργο-πηγή για έναν σκοπό, χρήση ή μέσο άλλο από εκείνο για το οποίο αρχικά προοριζόταν. @el
label: műfeldolgozása a következő: @hu
definition: Hozzákapcsol egy művet egy műhöz, amely egy másik művet olyan célra, használatra vagy médiumra módosít, amely más, mint amit eredetileg terveztek. @hu
scope note: műre átdolgozva @hu
toolkit label: Egy mű, amely egy másik művet olyan célra, használatra vagy médiumra módosít, amely más, mint amit eredetileg terveztek. @hu
toolkit definition: Ez az elem érvényes a formai változásokra, vagy az ugyanabban a formában teljesen újraírt művekre. @hu
scope note: Tämä elementti soveltuu muutoksiin muodossa tai samassa muodossa kokonaan uudelleenmuokattuihin teoksiin. @fi
label: mukaelma (teos) @fi
label: er bearbeidet som verk @no
definition: Relaterer et verk til et verk som bearbeider et kildeverk til et annet formål, bruksområde eller medium enn det opprinnelig var ment for. @no
scope note: Dette elementet gjelder endring av form eller verk som er fullstendig omskrevet i samme form. @no
label: is bewerkt als werk @nl
definition: Relateert een werk aan een werk dat een ander werk aanpast voor een doel, gebruik of medium anders dan dat waarvoor het oorspronkelijk bedoeld was. @nl
scope note: Dit element is over het algemeen van toepassing op veranderingen in vorm of op werken die compleet herschreven zijn in dezelfde vorm. @nl
toolkit label: bewerkt als werk @nl
toolkit definition: Een werk dat een ander werk aanpast voor een doel, gebruik of medium anders dan dat waarvoor het oorspronkelijk bedoeld was. @nl
label: هو معالج كعمل @ar
definition: يربط عمل بعمل يقوم بتعديل عمل آخر لغرض، أو استخدام، أو وسيط غير ما كان معنيًّا في الأصل. @ar
scope note: هذا العنصر ينطبق على التغييرات في الشكل أو في الأعمال المعاد كتابتها بالكامل بنفس الشكل. @ar
toolkit label: معالج كعمل @ar
toolkit definition: عمل يعدل عمل آخر لغرض، أو استخدام، أو وسيط غير ذلك ما كان معنيَّا في الأصل. @ar
label: adapteeritud teosena @et
definition: Seostab teose teosega, mis muudab allikteost algupärasest erineva otstarbe, kasutusviisi või meediumi jaoks. @et
scope note: Elementi rakendatakse muutuste puhul vormis või teoste puhul, mis on täielikult ümber kirjutatud samas vormis. @et
toolkit label: adapteeritud teosena @et
toolkit definition: Teos, mis muudab allikteost algupärasest erineva otstarbe, kasutusviisi või meediumi jaoks. @et
label: è adattata come opera @it
definition: Correla un’opera a un’opera modificata per uno scopo, utilizzo o mezzo diversi da quelli per cui era stata pensata in origine. @it
scope note: Questo elemento si applica ai cambiamenti di forma o a opere completamente riscritte nella stessa forma. @it
toolkit label: adattata come opera @it
toolkit definition: Opera modificata per uno scopo, utilizzo o diversi da quelli per cui era stata pensata in origine. @it
label: ir adaptēts kā darbs @lv

is paraphrased as work
status: Published
definition: Relates a work to a work that restates the content of another work in a different form.
type: Property
domain: C10001
sub property of: has transformation by style
lexical alias: paraphrasedAsWork.en
toolkit label: paraphrased as work
toolkit definition: A work that restates the content of another work in a different form.
toolkit label: paraphrasé comme une œuvre @fr
toolkit definition: Œuvre qui reprend le contenu d’une autre œuvre sous une formulation différente. @fr
toolkit label: parafraseada como (obra) @es
toolkit definition: Una obra que replantea el contenido de la obra fuente en una forma diferente. @es
instruction number: 24.5
label: er parafraseret som værk @da
definition: Relaterer et værk til et værk, som gentager et oprindeligt værks indhold i en anden form. @da
toolkit label: parafraseret som værk @da
toolkit definition: Værk, som gentager et oprindeligt værks indhold i en anden form. @da
definition: Met une œuvre en relation avec une œuvre qui reprend le contenu d’une autre œuvre sous une formulation différente. @fr
label: được diễn giải như là (tác phẩm) @vi
definition: Liên kết tác phẩm với tác phẩm trình bày lại nội dung của tác phẩm nguồn dưới hình thái khác. @vi
toolkit label: được diễn giải như là (tác phẩm) @vi
toolkit definition: Tác phẩm trình bày lại nội dung của tác phẩm nguồn dưới hình thái khác. @vi
label: ist paraphrasiert als (Werk) @de
definition: Setzt ein Werk in Beziehung zu einem Werk, das den Inhalt eines anderen Werks in einer anderen Form neu darstellt. @de
toolkit label: Paraphrasiert als (Werk) @de
toolkit definition: Ein Werk, das den Inhalt eines anderen Werks in einer anderen Form neu darstellt. @de
label: est paraphrasé comme une œuvre @fr
definition: Liittää teoksen teokseen, joka toisintaa toisen teoksen sisällön eri muodossa. @fi
toolkit label: parafraasi (teos) @fi
toolkit definition: Teos, joka toisintaa toisen teoksen sisällön eri muodossa. @fi
toolkit label: omskrevet som verk @no
toolkit definition: Et verk som gjentar et kildeverks innhold i en annen form. @no
label: és parafrasejat com a obra @ca
definition: Relaciona una obra amb una obra que replanteja el contingut d’una altra obra en una forma diferent. @ca
toolkit label: parafrasejat com a obra @ca
toolkit definition: Obra que replanteja el contingut d’una altra obra en una forma diferent. @ca
has element type: 2
label: είναι παραφρασμένο ως (έργο) @el
definition: Συνδέει ένα έργο με ένα έργο το οποίο αναδιατυπώνει το περιεχόμενο ενός έργου-πηγής σε μια διαφορετική μορφή. @el
toolkit label: παραφρασμένο ως (έργο) @el
toolkit definition: Ένα έργο το οποίο αναδιατυπώνει το περιεχόμενο ενός έργου-πηγής σε μια διαφορετική μορφή. @el
label: parafrazeálja a következő mű: @hu
definition: Hozzákapcsol egy művet egy műhöz, amely eltérő formában fogalmazza újra egy másik mű tartalmát. @hu
toolkit label: parafrazeáló mű @hu
toolkit definition: Egy mű, amely eltérő formában fogalmazza újra egy másik mű tartalmát. @hu
label: parafraasi (teos) @fi
label: er omskrevet som verk @no
definition: Relaterer et verk til et verk som gjentar et kildeverks innhold i en annen form. @no
label: is parafrase als werk @nl
definition: Relateert een werk aan een werk dat de content van een ander werk in een andere vorm formuleert. @nl
toolkit label: parafrase als werk @nl
toolkit definition: Een werk dat de content van een ander werk in een andere vorm formuleert. @nl
label: هو معاد صياغته كعمل @ar
definition: يربط عمل بعمل يعيد صياغة محتوى عمل آخر في شكل مختلف. @ar
toolkit label: معاد صياغته كعمل @ar
toolkit definition: عمل يعيد صياغة محتوى عمل آخر في شكل مختلف. @ar
label: parafraseeritud teosena @et
definition: Seostab teose teosega, mis väljendab allikteose sisu teises vormis. @et
toolkit label: parafraseeritud teosena @et
toolkit definition: Teos, mis väljendab allikteose sisu teises vormis. @et
label: è parafrasata come opera @it
definition: Correla un’opera a un’opera che riformula il contenuto di un’opera di partenza in una forma differente. @it
toolkit label: parafrasata come opera @it
toolkit definition: Opera che riformula il contenuto di un’opera di partenza in una forma differente. @it
label: darba parafrāze @lv
definition: Sasaista darbu ar darbu, kas izsaka pamatdarba saturu citā formā. @lv
toolkit label: darbs: parafrāze @lv
toolkit definition: Darbs, kas izsaka pamatdarba saturu citā formā @lv
label: 被演绎为作品 @zh-hans
definition: 将一种作品与用不同形式重述另一种作品之内容的一种作品关联起来。 @zh-hans
toolkit label: 被演绎为作品 @zh-hans
toolkit definition: 用不同形式重述另一种作品之内容的一种作品 @zh-hans
has subproperty: P10166
label: eser olarak yeniden yorumlanmıştır @tr
definition: Bir eseri, başka bir eserin içeriğini farklı bir biçimde yeniden ifade eden bir eserle ilişkilendirir. @tr
toolkit label: Eser olarak yorumlanmıştır @tr
toolkit definition: Başka bir çalışmanın içeriğini farklı bir biçimde yeniden ifade eden bir çalışma. @tr

is expanded as work
status: Published
definition: Relates a work to a work that enlarges upon the content of another work.
type: Property
domain: C10001
sub property of: has derivative work
lexical alias: expandedAsWork.en
toolkit label: expanded as work
toolkit definition: A work that enlarges upon the content of another work.
toolkit label: augmenté comme une œuvre @fr
toolkit definition: Œuvre qui accroît le contenu d’une autre œuvre. @fr
toolkit label: ampliada como (obra) @es
toolkit definition: Una obra que extiende el contenido de la obra fuente. @es
instruction number: 24.5
label: er udvidet som værk @da
definition: Relaterer et værk til et værk, som uddyber et oprindeligt værks indhold. @da
toolkit label: udvidet som værk @da
toolkit definition: Værk, som uddyber et oprindeligt værks indhold. @da
definition: Met une œuvre en relation avec une œuvre qui accroît le contenu d’une autre œuvre. @fr
label: được mở rộng như là (tác phẩm) @vi
definition: Liên kết tác phẩm với tác phẩm mở rộng nội dung của tác phẩm nguồn. @vi
toolkit label: được mở rộng như là (tác phẩm) @vi
toolkit definition: Tác phẩm mở rộng nội dung của tác phẩm nguồn. @vi
label: ist erweitert als (Werk) @de
definition: Setzt ein Werk in Beziehung zu einem Werk, das den Inhalt eines anderen Werks erweitert. @de
toolkit label: Erweitert als (Werk) @de
toolkit definition: Ein Werk, das den Inhalt eines anderen Werks erweitert. @de
label: est augmenté comme une œuvre @fr
definition: Liittää teoksen teokseen, joka laajentaa toisen teoksen sisältöä. @fi
toolkit label: laajennelma (teos) @fi
toolkit definition: Teos, joka laajentaa toisen teoksen sisältöä. @fi
toolkit label: utvidet som verk @no
toolkit definition: Et verk som utvider innholdet fra et kildeverk. @no
label: és ampliat com a obra @ca
definition: Relaciona una obra amb una obra que amplia el contingut d’una altra obra. @ca
toolkit label: ampliat com a obra @ca
toolkit definition: Obra que amplia el contingut d’una altra obra. @ca
has element type: 2
label: είναι επεκτεινόμενο ως (έργο) @el
definition: Συνδέει ένα έργο με ένα έργο το οποίο επεκτείνει το περιεχόμενο ενός έργου-πηγής. @el
toolkit label: επεκτεινόμενο ως (έργο) @el
toolkit definition: Ένα έργο το οποίο επεκτείνει το περιεχόμενο ενός έργου-πηγής. @el
label: tágítva a következő műben: @hu
definition: Hozzákapcsol egy művet egy műhöz, amely egy másik mű tartalmát tágítja. @hu
toolkit label: bővítő mű @hu
toolkit definition: Egy mű, amely egy másik mű tartalmát tágítja. @hu
label: laajennelma (teos) @fi
label: er utvidet som verk @no
definition: Relaterer et verk til et verk som utvider innholdet fra et kildeverk. @no
label: is uitgebreid als werk @nl
definition: Relateert een werk aan een werk dat de content van een ander werk uitbreidt. @nl
toolkit label: uitgebreid als werk @nl
toolkit definition: Een werk dat de content van een ander werk uitbreidt. @nl
label: هو موسع كعمل @ar
definition: يربط عمل بعمل يتوسع في محتوى عمل آخر. @ar
toolkit label: موسع كعمل @ar
toolkit definition: عمل يتوسع في محتوى عمل آخر. @ar
label: laiendatud teosena @et
definition: Seostab teose teosega, milles on avardatud allikteose sisu. @et
toolkit label: laiendatud teosena @et
toolkit definition: Teos, milles on avardatud allikteose sisu. @et
label: è ampliata come opera @it
definition: Correla un’opera a un’opera che amplia il contenuto di un’opera di partenza. @it
toolkit label: ampliata come opera @it
toolkit definition: Opera che amplia il contenuto di un’opera di partenza. @it
label: ir paplašinājums (darbs) @lv
definition: Sasaista darbu ar darbu, kas ir saturiski paplašināts pamatdarbs. @lv
toolkit label: paplašinājums (darbs) @lv
toolkit definition: Saturiski paplašināts pamatdarbs. @lv
label: 被扩充为作品 @zh-hans
definition: 将一种作品与在另一种作品的内容上扩充的一种作品关联起来。 @zh-hans
toolkit label: 被扩充为作品 @zh-hans
toolkit definition: 在另一种作品的内容上扩充的一种作品 @zh-hans
has subproperty: P10119
label: eser olarak genişletilmiştir @tr
definition: Bir eseri, başka bir eserin içeriğini genişleten bir eserle ilişkilendirir. @tr
toolkit label: eser olarak genişletilmiş @tr
toolkit definition: Başka bir eserin içeriğini genişleten bir eser. @tr

is dramatized as work
status: Published
definition: Relates a work to a work that is a dramatic work that is adapted from another work.
type: Property
domain: C10001
sub property of: is adapted as work
lexical alias: dramatizedAsWork.en
toolkit label: dramatized as work
toolkit definition: A work that is a dramatic work that is adapted from another work.
toolkit label: adapté au théâtre comme une œuvre @fr
toolkit definition: Œuvre dramatique qui est adaptée d’une autre œuvre. @fr
toolkit label: dramatizada como (obra) @es
toolkit definition: Una obra dramática adaptada de la obra fuente. @es
instruction number: 24.5
label: er dramatiseret som værk @da
definition: Relaterer et værk til et dramatisk værk, som er bearbejdet ud fra et andet værk. @da
toolkit label: dramatiseret som værk @da
toolkit definition: Dramatisk værk, som er bearbejdet ud fra et andet værk. @da
definition: Met une œuvre en relation avec une œuvre dramatique qui est adaptée d’une autre œuvre. @fr
label: được kịch hoá như là (tác phẩm) @vi
definition: Liên kết tác phẩm với tác phẩm kịch được phỏng theo tác phẩm nguồn. @vi
toolkit label: được kịch hoá như là (tác phẩm) @vi
toolkit definition: Tác phẩm kịch được phỏng theo tác phẩm nguồn. @vi
label: ist Bühnenbearbeitung als (Werk) @de
definition: Setzt ein Werk in Beziehung zu einem Theaterstück (Werk), das auf einem anderen Werk basiert. @de
toolkit label: Bühnenbearbeitung als (Werk) @de
toolkit definition: Ein Theaterstück (Werk), das auf einem anderen Werk basiert. @de
label: est adapté au théâtre comme une œuvre @fr
definition: Liittää teoksen teokseen, joka on draamateos, joka on sovitettu toisesta teoksesta. @fi
toolkit label: dramatisointi (teos) @fi
toolkit definition: Teos, joka on draamateos, joka on sovitettu toisesta teoksesta. @fi
toolkit label: dramatisert som verk @no
toolkit definition: Et dramatisk verk som er bearbeidet fra et annet verk. @no
label: és dramatitzat com a obra @ca
definition: Relaciona una obra amb una obra que és una obra dramàtica que s’adapta d’una altra obra. @ca
toolkit label: dramatitzat com a obra @ca
toolkit definition: Obra que és una obra dramàtica que s’adapta d’una altra obra. @ca
has element type: 2
label: είναι δραματοποιημένο ως (έργο) @el
definition: Συνδέει ένα έργο με ένα θεατρικό έργο προσαρμοσμένο από ένα έργο-πηγή. @el
toolkit label: δραματοποιημένο ως (έργο) @el
toolkit definition: Ένα θεατρικό έργο προσαρμοσμένο από ένα έργο-πηγή. @el
label: dramatizált változata a következő mű: @hu
definition: Egy művet hozzákapcsol egy drámai műhöz, amelyet egy másik műből dolgoztak át. @hu
toolkit label: dramatizált mű @hu
toolkit definition: Egy drámai mű, amelyet egy másik műből dolgoztak át. @hu
label: dramatisointi (teos) @fi
label: er dramatisert som verk @no
definition: Relaterer et verk til et dramatisk verk som er bearbeidet fra et annet verk. @no
label: is gedramatiseerd als werk @nl
definition: Relateert een werk aan een werk dat is een theaterwerk dat is een bewerking van een ander werk. @nl
toolkit label: gedramatiseerd als werk @nl
toolkit definition: Een werk dat is een theaterwerk dat is een bewerking van een ander werk. @nl
label: هو معدل دراميًا كعمل @ar
definition: يربط عمل بعمل درامي مقتبس من عمل آخر. @ar
toolkit label: معدل دراميًا كعمل @ar
toolkit definition: عمل عبارة عن عمل درامي مقتبس من عمل آخر. @ar
label: dramatiseeritud teosena @et
definition: Seostab teose draamateosega, mis on adapteeritud teisest teosest. @et
toolkit label: dramatiseeritud teosena @et
toolkit definition: Draamateos, mis on adapteeritud teisest teosest. @et
label: è drammatizzata come opera @it
definition: Correla un’opera a un’opera teatrale adattata da un’altra opera. @it
toolkit label: drammatizzata come opera @it
toolkit definition: Opera teatrale adattata da un’altra opera. @it
label: ir dramatizējums (darbs) @lv
definition: Sasaista darbu ar darbu, kas ir dramatizējums (darbs), kas veidots no pamatdarba. @lv
toolkit label: dramatizējums (darbs) @lv
toolkit definition: Dramatizējums (darbs), kas veidots no pamatdarba. @lv
label: 被戏剧化为作品 @zh-hans
definition: 将一种作品与作为一种戏剧作品并改编自另一种作品的一种作品关联起来。 @zh-hans
toolkit label: 被戏剧化为作品 @zh-hans
toolkit definition: 作为一种戏剧作品并改编自另一种作品的一种作品 @zh-hans
has subproperty: P10016
label: eser olarak dramatize edilmiştir @tr
definition: Bir eseri, başka bir eserden uyarlanan dramatik eser olan bir eserle ilişkilendirir. @tr
toolkit label: eser olarak dramatize edilmiş @tr
toolkit definition: Başka bir eserden uyarlanmış bir dramatik eser. @tr

has abstract
status: Published
definition: Relates a work to a work that is an objective summary of a work.
type: Property
domain: C10001
toolkit label: abstract
toolkit definition: A work that is an objective summary of a work.
toolkit label: résumé analytique @fr
toolkit definition: Œuvre qui consiste en un résumé objectif d’une œuvre. @fr
toolkit label: resumida como (obra) @es
toolkit definition: Una obra que abrevia la obra fuente en una manera breve y objetiva. @es
instruction number: 24.5
label: er sammenfattet som værk @da
definition: Relaterer et værk til et værk, som forkorter et andet værk på en kortfattet, objektiv måde. @da
toolkit label: sammenfattet som værk @da
toolkit definition: Værk, som forkorter et andet værk på en kortfattet, objektiv måde. @da
definition: Met une œuvre en relation avec une œuvre qui consiste en un résumé objectif d’une œuvre. @fr
label: được tóm tắt như là (tác phẩm) @vi
definition: Liên kết tác phẩm với tác phẩm tóm tắt tác phẩm nguồn bằng phương thức ngắn gọn, khách quan. @vi
toolkit label: được tóm tắt như là (tác phẩm) @vi
toolkit definition: Tác phẩm tóm tắt tác phẩm nguồn bằng phương thức ngắn gọn, khách quan. @vi
label: ist Abstract als (Werk) @de
definition: Setzt ein Werk in Beziehung zu einem Werk, das ein anderes Werk auf eine kurze, sachliche Art verkürzt. @de
toolkit label: Abstract als (Werk) @de
toolkit definition: Ein Werk, das ein anderes Werk auf eine kurze, sachliche Art verkürzt. @de
label: a pour résumé analytique @fr
definition: Liittää teoksen teokseen, joka on teoksen objektiivinen yhteenveto. @fi
toolkit label: abstrakti @fi
toolkit definition: Teos, joka on teoksen objektiivinen yhteenveto. @fi
toolkit label: abstrahert som verk @no
toolkit definition: Et verk som gir et kortfattet, objektivt sammendrag av et annet verk. @no
label: té resum @ca
definition: Relaciona una obra amb una obra que és un sumari objectiu d’un recurs. @ca
toolkit label: resum @ca
toolkit definition: Obra que és un sumari objectiu d’un recurs. @ca
has element type: 2
label: είναι επιτομή ως (έργο) @el
definition: Συνδέει ένα έργο με ένα έργο, το οποίο συμπτύσσει ένα έργο-πηγή με έναν σύντομο, αντικειμενικό τρόπο. @el
toolkit label: επιτομή ως (έργο) @el
toolkit definition: Ένα έργο το οποίο συμπτύσσει ένα έργο-πηγή με έναν σύντομο, αντικειμενικό τρόπο. @el
label: absztraktja a következő mű: @hu
definition: Hozzákapcsol egy művet egy műhöz, amely egy másik művet rövid, objektív módon lerövidít. @hu
toolkit label: absztraktmű @hu
toolkit definition: Egy mű, amely egy másik művet rövid, objektív módon lerövidít. @hu
label: abstrakti @fi
label: er abstrahert som verk @no
definition: Relaterer et verk til et verk som gir et kortfattet, objektivt sammendrag av et annet verk. @no
label: is geabstraheerd als werk @nl
definition: Relateert een werk aan een werk dat een ander werk inkort op een korte, objectieve wijze. @nl
toolkit label: geabstraheerd als werk @nl
toolkit definition: Een werk dat een ander werk inkort op een korte, objectieve wijze. @nl
label: هو مستخلص كعمل @ar
definition: يربط عمل بعمل يختصر عملاً آخر بطريقة موجزة وموضوعية. @ar
toolkit label: مستخلص كعمل @ar
toolkit definition: عمل يختصر عملاً آخر بطريقة موجزة وموضوعية. @ar
label: annoteeritud teosena @et
definition: Seostab teose teosega, milles on lühidalt ja objektiivselt kokku võetud teise teose sisu. @et
toolkit label: annoteeritud teosena @et
toolkit definition: Teos, milles on lühidalt ja objektiivselt kokku võetud teise teose sisu. @et
label: è riassunta come opera @it
definition: Correla a un’opera che riassume un’altra opera in maniera sintetica e obiettiva. @it
toolkit label: riassunta come opera @it
toolkit definition: Opera che riassume un’altra opera in maniera sintetica e obiettiva. @it
alternative label: abstracted as work
sub property of: has summary
lexical alias: abstract.en
label: ir darba anotācija @lv
definition: Sasaista darbu ar darbu, kas ir no darba izveidota anotācija. @lv
toolkit label: darba anotācija @lv
toolkit definition: No darba izveidota anotācija. @lv
alternative label: abstrakti (teos) @fi
alternative label: 被摘要为作品 @zh-hans
label: 有摘要 @zh-hans
definition: 将一种作品与作为一种作品之客观提要的一种作品关联起来。 @zh-hans
toolkit label: 摘要 @zh-hans
toolkit definition: 作为一种作品之客观提要的一种作品 @zh-hans
alternative label: resumit com a obra @ca
alternative label: résumé analytiquement comme une œuvre @fr
has subproperty: P10107
alternative label: eser olarak özetlenen @tr

is digested as work
status: Published
definition: Relates a work to a work that systematically and comprehensively condenses a related work.
type: Property
domain: C10001
sub property of: has derivative work
lexical alias: digestedAsWork.en
toolkit label: digested as work
toolkit definition: A work that systematically and comprehensively condenses a related work.
toolkit label: condensé comme une œuvre @fr
toolkit definition: Œuvre qui abrège une œuvre en relation de manière systématique et complète. @fr
toolkit label: compendiada como (obra) @es
toolkit definition: Una obra que condensa sistemática e integralmente la obra fuente. @es
instruction number: 24.5
label: er sammenfattet som værk @da
definition: Relaterer et værk til et værk, som systematisk og gennemgribende komprimerer et relateret værk. @da
toolkit label: sammenfattet som værk @da
toolkit definition: Værk, som systematisk og gennemgribende komprimerer et relateret værk. @da
definition: Met une œuvre en relation avec une œuvre qui abrège une œuvre en relation de manière systématique et complète. @fr
label: được sắp đặt như là (tác phẩm) @vi
definition: Liên kết tác phẩm với tác phẩm cô gọn một cách có hệ thống và toàn diện tác phẩm nguồn. @vi
toolkit label: được sắp đặt như là (tác phẩm) @vi
toolkit definition: Tác phẩm cô gọn một cách có hệ thống và toàn diện tác phẩm nguồn. @vi
label: ist Digest (Werk) @de
definition: Setzt ein Werk in Beziehung zu einem Werk, das ein in Beziehung stehendes Werk systematisch und umfassend verdichtet. @de
toolkit label: Digest (Werk) @de
toolkit definition: Ein Werk, das ein in Beziehung stehendes Werk systematisch und umfassend verdichtet. @de
label: est condensé comme une œuvre @fr
definition: Liittää teoksen teokseen, joka systemaattisesti, kokonaisuudessaan ja mukaillen tiivistää siihen liittyvän teoksen. @fi
toolkit label: mukautettu lyhennelmä (teos) @fi
toolkit definition: Teos, joka systemaattisesti, kokonaisuudessaan ja mukaillen tiivistää siihen liittyvän teoksen. @fi
toolkit label: forkortet som verk @no
toolkit definition: Et verk som systematisk forkorter et relatert verk. @no
label: és compendiat com a obra @ca
definition: Relaciona una obra amb una obra que condensa sistemàticament i exhaustiva una obra relacionada. @ca
toolkit label: compendiat com a obra @ca
toolkit definition: Obra que condensa sistemàticament i exhaustiva una obra relacionada. @ca
has element type: 2
label: είναι αφομοιωμένο ως (έργο) @el
definition: Συνδέει ένα έργο με ένα έργο το οποίο συστηματικά και περιεκτικά συμπυκνώνει ένα έργο-πηγή. @el
toolkit label: αφομοιωμένο ως (έργο) @el
toolkit definition: Ένα έργο το οποίο συστηματικά και περιεκτικά συμπυκνώνει ένα έργο-πηγή. @el
label: kivonatolja a következő mű: @hu
definition: Hozzákapcsol egy művet egy műhöz, amely egy kapcsolódó művet módszeresen és átfogóan tömörít. @hu
toolkit label: kivonatmű @hu
toolkit definition: Egy mű, amely egy kapcsolódó művet módszeresen és átfogóan tömörít. @hu
label: mukautettu lyhennelmä (teos) @fi
label: er forkortet som verk @no
definition: Relaterer et verk til et verk som systematisk forkorter et relatert verk. @no
label: is digest als werk @nl
definition: Relateert een werk aan een werk dat een gerelateerd werk systematisch en alomvattend concentreert. @nl
toolkit label: digest als werk @nl
toolkit definition: Een werk dat een gerelateerd werk systematisch en alomvattend concentreert. @nl
label: هو موجز كعمل @ar
definition: يربط عمل بعمل يكثف عملًا ذا صلة تكثيفا منهجيا وشاملا. @ar
toolkit label: موجز كعمل @ar
toolkit definition: عمل يكثف عملًا ذا صلة تكثيفا منهجيا وشاملا. @ar
label: refereeritud teosena @et
definition: Seostab teose teosega, milles seotud teos on süstemaatiliselt ja igakülgselt kokku võetud. @et
toolkit label: refereeritud teosena @et
toolkit definition: Teos, milles seotud teos on süstemaatiliselt ja igakülgselt kokku võetud. @et
label: è compendiata come opera @it
definition: Correla un’opera a un’opera che riassume in maniera sistematica e dettagliata un’opera correlata. @it
toolkit label: compendiata come opera @it
toolkit definition: Opera che riassume in maniera sistematica e dettagliata un’opera correlata. @it
label: ir īssavilkums (darbs) @lv
definition: Sasaista darbu ar darbu, kas sistemātiski un aptveroši īsi apskata saistīto darbu. @lv
toolkit label: īssavilkums (darbs) @lv
toolkit definition: Darbs, kas sistemātiski un aptveroši īsi apskata saistīto darbu. @lv
label: 被编制文摘为作品 @zh-hans
definition: 将一种作品与系统而全面压缩一种相关作品的一种作品关联起来。 @zh-hans
toolkit label: 被编制文摘为作品 @zh-hans
toolkit definition: 系统而全面压缩一种相关作品的一种作品 @zh-hans
has subproperty: P10171
label: eser olarak özetlenmiştir @tr
definition: Bir eseri, ilgili bir eseri sistematik ve kapsamlı bir şekilde özetleyen bir eserle ilişkilendirir. @tr
toolkit label: eser olarak özetlenmiş @tr
toolkit definition: İlgili bir eseri sistematik ve kapsamlı bir şekilde özetleyen bir çalışma. @tr

is abridged as work
status: Published
definition: Relates a work to a work that shortens a related work without changing the general meaning or manner of presentation.
type: Property
domain: C10001
sub property of: has derivative work
lexical alias: abridgedAsWork.en
toolkit label: abridged as work
toolkit definition: A work that shortens a related work without changing the general meaning or manner of presentation.
toolkit label: abrégé comme une œuvre @fr
toolkit definition: Œuvre qui raccourcit une œuvre en relation sans en changer le sens général ou le mode de présentation. @fr
toolkit label: abreviada como (obra) @es
toolkit definition: Una obra que acorta el contenido de la obra fuente sin cambiar el significado general o la manera de presentación. @es
instruction number: 24.5
label: er forkortet som værk @da
definition: Relaterer et værk til et værk, som forkorter et relateret værk uden at ændre den overordnede betydning eller præsentationsmåde. @da
toolkit label: forkortet som værk @da
toolkit definition: Værk, som forkorter et relateret værk uden at ændre den overordnede betydning eller præsentationsmåde. @da
definition: Met une œuvre en relation avec une œuvre qui raccourcit une œuvre en relation sans en changer le sens général ou le mode de présentation. @fr
label: được rút gọn như là (tác phẩm) @vi
definition: Liên kết tác phẩm với tác phẩm làm ngắn tác phẩm nguồn mà không thay đổi ý nghĩa hoặc phương cách trình bày. @vi
toolkit label: được rút gọn như là (tác phẩm) @vi
toolkit definition: Tác phẩm làm ngắn tác phẩm nguồn mà không thay đổi ý nghĩa hoặc phương cách trình bày. @vi
label: ist gekürzt als (Werk) @de
definition: Setzt ein Werk in Beziehung zu einem Werk, das ein in Beziehung stehendes Werk ohne Änderung der allgemeinen Bedeutung oder Darstellungsweise kürzt. @de
toolkit label: Gekürzt als (Werk) @de
toolkit definition: Ein Werk, das ein in Beziehung stehendes Werk ohne Änderung der allgemeinen Bedeutung oder Darstellungsweise kürzt. @de
label: est abrégé comme une œuvre @fr
definition: Liittää teoksen teokseen, joka lyhentää siihen liittyvää teosta muuttamatta sen merkityssisältöä tai esitystyyliä. @fi
toolkit label: lyhennelmä (teos) @fi
toolkit definition: Teos, joka lyhentää siihen liittyvää teosta muuttamatta sen merkityssisältöä tai esitystyyliä. @fi
toolkit label: forkortet som verk @no
toolkit definition: Et verk som forkorter et relatert verk uten å endre den generelle meningen eller presentasjonsformen. @no
label: és abreujat com a obra @ca
definition: Relaciona una obra amb una obra que escurça una obra relacionada sense canviar-ne el significat general o la forma de presentació. @ca
toolkit label: abreujat com a obra @ca
toolkit definition: Obra que escurça una obra relacionada sense canviar-ne el significat general o la forma de presentació. @ca
has element type: 2
label: είναι συντμημένο ως (έργο) @el
definition: Συνδέει ένα έργο με ένα έργο το οποίο περιορίζει [την έκταση] ενός έργου-πηγής χωρίς να μεταβάλλει το γενικό νόημα ή τον τρόπο της παρουσίασης. @el
toolkit label: συντμημένο ως (έργο) @el
toolkit definition: Ένα έργο το οποίο περιορίζει [την έκταση] ενός έργου-πηγής χωρίς να μεταβάλλει το γενικό νόημα ή τον τρόπο της παρουσίασης. @el
label: rövidítése a következő mű: @hu
definition: Hozzákapcsol egy művet egy műhöz, amely egy kapcsolódó művet tömörít, azaz lerövidít anélkül, hogy általános jelentését vagy előadásmódját megváltoztatná. @hu
toolkit label: rövidítő mű @hu
toolkit definition: Egy mű, amely egy kapcsolódó művet tömörít, azaz lerövidít anélkül, hogy általános jelentését vagy előadásmódját megváltoztatná. @hu
label: lyhennelmä (teos) @fi
label: er forkortet som verk @no
definition: Relaterer et verk til et verk som forkorter et relatert verk uten å endre den generelle meningen eller presentasjonsformen. @no
label: is ingekort als werk @nl
definition: Relateert een werk aan een werk dat een gerelateerd werk verkort zonder de algehele betekenis te veranderen of de manier van presentatie. @nl
toolkit label: ingekort als werk @nl
toolkit definition: Een werk dat een gerelateerd werk verkort zonder de algehele betekenis te veranderen of de manier van presentatie. @nl
label: هو مختصر كعمل @ar
definition: يربط عمل بعمل يختصر عملاً ذا صلة دون تغيير المعنى العام أو طريقة العرض. @ar
toolkit label: مختصر كعمل @ar
toolkit definition: عمل يختصر عملاً ذا صلة دون تغيير المعنى العام أو طريقة العرض. @ar
label: lühendatud teosena @et
definition: Seostab teose teosega, milles on lühendatud seotud teost, muutmata selle üldist tähendust ja esitusviisi. @et
toolkit label: lühendatud teosena @et
toolkit definition: Teos, milles on lühendatud seotud teost, muutmata selle üldist tähendust ja esitusviisi. @et
label: è ridotta come opera @it
definition: Correla un’opera a un’opera che abbrevia un’opera correlata senza cambiarne il significato generale o la modalità di presentazione. @it
toolkit label: ridotta come opera @it
toolkit definition: Opera che abbrevia un’opera correlata senza cambiarne il significato generale o la modalità di presentazione. @it
label: ir saīsināts darbs @lv
definition: Sasaista darbu ar darbu, kas ir darba saīsinājums, nemainot tā nozīmi vai pasniegšanas veidu. @lv
toolkit label: saīsināts darbs @lv
toolkit definition: Darba saīsinājums, nemainot tā nozīmi vai pasniegšanas veidu. @lv
label: 被缩编为作品 @zh-hans
definition: 将一种作品与缩短一种相关作品而不改变其总体意义或呈现方式的一种作品关联起来。 @zh-hans
toolkit label: 被缩编为作品 @zh-hans
toolkit definition: 缩短一种相关作品而不改变其总体意义或呈现方式的一种作品 @zh-hans
has subproperty: P10167
label: eser olarak özetlenmiştir @tr
definition: Bir eseri, genel anlamını veya sunum şeklini değiştirmeden ilgili bir eseri kısaltan bir eserle ilişkilendirir. @tr
toolkit label: eser olarak özetlenmiş @tr
toolkit definition: Genel anlamını veya sunum şeklini değiştirmeden ilgili bir çalışmayı kısaltan bir çalışma. @tr

is set to music as work
status: Published
definition: Relates a work to a work that is a non-dramatic musical work, other than an oratorio, that uses the text of another work.
type: Property
domain: C10001
sub property of: has derivative work
lexical alias: setToMusicAsWork.en
toolkit label: set to music as work
toolkit definition: A work that is a non-dramatic musical work, other than an oratorio, that uses the text of another work.
toolkit label: mis en musique comme une œuvre @fr
toolkit definition: Œuvre musicale non dramatique, autre qu’un oratorio, qui utilise le texte d’une autre œuvre. @fr
toolkit label: hecha para música como (obra) @es
toolkit definition: Una obra musical no dramática, diferente del oratorio, que usa el texto de la obra fuente. @es
instruction number: 24.5
label: er sat til musik som værk @da
definition: Relaterer et værk til et ikke-dramatisk musikværk, bortset fra et oratorium, som anvender et oprindeligt værks tekst. @da
toolkit label: sat til musik som værk @da
toolkit definition: Ikke-dramatisk musikværk, bortset fra et oratorium, som anvender et oprindeligt værks tekst. @da
definition: Met une œuvre en relation avec une œuvre musicale non dramatique, autre qu’un oratorio, qui utilise le texte d’une autre œuvre. @fr
label: được đặt nhạc như là (tác phẩm) @vi
definition: Liên kết tác phẩm với tác phẩm âm nhạc phi kịch, khác với ontario, sử dụng văn bản của tác phẩm nguồn. @vi
toolkit label: được đặt nhạc như là (tác phẩm) @vi
toolkit definition: Tác phẩm âm nhạc phi kịch, khác với ontario, sử dụng văn bản của tác phẩm nguồn. @vi
label: ist vertont als (Werk) @de
definition: Setzt ein Werk in Beziehung zu einem nicht dramatischen Musikwerk, bei dem es sich nicht um ein Oratorium handelt, das den Text eines anderen Werks verwendet. @de
toolkit label: Vertont als (Werk) @de
toolkit definition: Eine nicht dramatisches Musikwerk, bei dem es sich nicht um ein Oratorium handelt, das den Text eines anderen Werks verwendet. @de
label: est mis en musique comme une œuvre @fr
definition: Liittää teoksen teokseen, joka on ei-näytelmällinen musiikkiteos (muu kuin oratorio), jonka teksti on peräisin toisesta teoksesta. @fi
toolkit label: tekstiin perustuva musiikki (teos) @fi
toolkit definition: Teos, joka on ei-näytelmällinen musiikkiteos (muu kuin oratorio), jonka teksti on peräisin toisesta teoksesta. @fi
toolkit label: satt til musikk som verk @no
toolkit definition: Et ikke-dramatisk musikalsk verk, bortsett fra et oratorium, som bruker teksten fra et kildeverk. @no
label: és musicat com a obra @ca
definition: Relaciona una obra amb una obra que és una obra musical no teatral, diferent d’un oratori, que usa el text d’una altra obra. @ca
toolkit label: musicat com a obra @ca
toolkit definition: Obra que és una obra musical no teatral, diferent d’un oratori, que usa el text d’una altra obra. @ca
has element type: 2
label: είναι μελοποιημένο ως (έργο) @el
definition: Συνδέει ένα έργο με ένα μη δραματικό μουσικό έργο, άλλο από ορατόριο, το οποίο χρησιμοποιεί το κείμενο ενός έργου-πηγής. @el
toolkit label: μελοποιημένο ως (έργο) @el
toolkit definition: Ένα μη δραματικό μουσικό έργο, άλλο από ορατόριο, το οποίο χρησιμοποιεί το κείμενο ενός έργου-πηγής. @el
label: megzenésítése a következő mű: @hu
definition: Hozzákapcsol egy művet egy nem-drámai zeneműhöz, amely nem oratórium, és amely egy másik mű szövegét használja. @hu
toolkit label: szöveggel ellátott zenemű @hu
toolkit definition: Egy nem-drámai zenemű, amely nem oratórium, amely egy másik mű szövegét használja. @hu
label: tekstiin perustuva musiikki (teos) @fi
label: er satt til musikk som verk @no
definition: Relaterer et verk til et ikke-dramatisk musikalsk verk, bortsett fra et oratorium, som bruker teksten fra et kildeverk. @no
label: is op muziek gezet als werk @nl
definition: Relateert een werk aan een werk dat is een niet-dramatisch muziekwerk, anders dan een oratorium, dat de tekst van een ander werk gebruikt. @nl
toolkit label: op muziek gezet als werk @nl
toolkit definition: Een werk dat is een niet-dramatisch muziekwerk, anders dan een oratorium, dat de tekst van een ander werk gebruikt. @nl
label: هو معد لتصاحبه موسيقى كعمل @ar
definition: يربط عمل بعمل عبارة عن عمل موسيقي غير درامي، بخلاف الموسيقى الدينية، التي تستخدم نص عمل آخر. @ar
toolkit label: معد لتصاحبه موسيقى كعمل @ar
toolkit definition: عمل موسيقي غير درامي، بخلاف الموسيقى الدينية، التي تستخدم نص عمل آخر. @ar
label: viisistatud teosena @et
definition: Seostab teose mittedramaatilise muusikateosega (v.a oratoorium), milles kasutatakse allikteose teksti. @et
toolkit label: viisistatud teosena @et
toolkit definition: Mittedramaatiline muusikateos (v.a oratoorium), milles kasutatakse allikteose teksti. @et
label: è posta in musica come opera @it
definition: Correla un’opera a un’opera musicale non drammatica, diversa dall’oratorio, che utilizza il testo di un'opera di partenza. @it
toolkit label: posta in musica come opera @it
toolkit definition: Opera musicale non drammatica, diversa dall’oratorio, che utilizza il testo di un'opera di partenza. @it
label: darba tekstam komponētā mūzika @lv
definition: Sasaista darbu ar darbu, kas ir ne-dramatisks mūzikas darbs, kas nav oratorija, kurā izmantots pamatdarba teksts. @lv
toolkit label: darbs: tekstam komponētā mūzika @lv
toolkit definition: Ne-dramatisks mūzikas darbs, kas nav oratorija, kurā izmantots pamatdarba teksts. @lv
label: 是配乐为作品 @zh-hans
definition: 将一种作品与作为不同于清唱剧、使用另一种作品的文本的一种非戏剧音乐作品的一种作品关联起来。 @zh-hans
toolkit label: 配乐为作品 @zh-hans
toolkit definition: 作为不同于清唱剧、使用另一种作品的文本的一种非戏剧音乐作品的一种作品 @zh-hans
has subproperty: P10033
label: eser olarak müziğe göre düzenlenmiştir @tr
definition: Bir eseri, başka bir eserin metnini kullanan oratoryo dışındaki dramatik olmayan bir müzik eseriyle ilişkilendirir. @tr
toolkit label: eser olarak müziğe ayarlanmış @tr
toolkit definition: Oratoryo dışında, başka bir eserin metnini kullanan dramatik olmayan bir müzik eseridir. @tr

is modified by variation as work
status: Published
definition: Relates a work to a work that is a musical work in which melodic, thematic, or harmonic material taken from another work forms a discrete theme, which is repeated one or more times with subsequent modifications.
type: Property
domain: C10001
sub property of: has derivative work
lexical alias: modifiedByVariationAsWork.en
toolkit label: modified by variation as work
toolkit definition: A work that is a musical work in which melodic, thematic, or harmonic material taken from another work forms a discrete theme, which is repeated one or more times with subsequent modifications.
toolkit label: modifié par variation comme une œuvre @fr
toolkit definition: Œuvre musicale dans laquelle de la matière mélodique, thématique ou harmonique tirée d’une autre œuvre forme un thème distinct qui est répété une ou plusieurs fois avec des modifications subséquentes. @fr
toolkit label: modificada por variación como (obra) @es
toolkit definition: Una obra musical en la cual el material melódico, temático o armónico de la obra fuente se toma para formar un tema separado, el cual se repite una o más veces con modificaciones subsecuentes @es
instruction number: 24.5
label: er variation tilpasset som værk @da
definition: Relaterer et værk til et musikværk, hvori melodisk, tematisk eller harmonisk materiale taget fra et andet værk danner et separat tema, der gentages en eller flere gange med efterfølgende tilpasninger. @da
toolkit label: variation tilpasset som værk @da
toolkit definition: Musikværk, hvori melodisk, tematisk eller harmonisk materiale taget fra et andet værk danner et separat tema, der gentages en eller flere gange med efterfølgende tilpasninger. @da
definition: Met une œuvre en relation avec une œuvre musicale dans laquelle de la matière mélodique, thématique ou harmonique tirée d’une autre œuvre forme un thème distinct qui est répété une ou plusieurs fois avec des modifications subséquentes. @fr
label: được thay đổi bởi biến tấu như là (tác phẩm) @vi
definition: Liên kết tác phẩm với tác phẩm âm nhạc mà trong đó tài liệu du dương, theo đề tài, hoặc hoà âm được lấy ra để tạo thành đề tài riêng biệt, được nhắc lại một hoặc nhiều lần với các sửa đổi liên tiếp. @vi
toolkit label: được thay đổi bởi biến tấu như là (tác phẩm) @vi
toolkit definition: Tác phẩm âm nhạc mà trong đó tài liệu du dương, theo đề tài, hoặc hoà âm được lấy ra để tạo thành đề tài riêng biệt, được nhắc lại một hoặc nhiều lần với các sửa đổi liên tiếp. @vi
label: ist durch Variation modifiziert als (Werk) @de
definition: Setzt ein Werk in Beziehung zu einem Musikwerk, in dem melodisches, thematisches oder harmonisches Material aus einem anderen Werk ein einzelnes Thema bildet, das ein- oder mehrmals mit nachfolgenden Modifikationen wiederholt wird. @de
toolkit label: Durch Variation modifiziert als (Werk) @de
toolkit definition: Ein Musikwerk, in dem melodisches, thematisches oder harmonisches Material aus einem anderen Werk ein einzelnes Thema bildet, das ein- oder mehrmals mit nachfolgenden Modifikationen wiederholt wird. @de
label: est modifié par variation comme une œuvre @fr
definition: Liittää teoksen musiikkiteokseen, jonka melodinen, temaattinen tai harmoninen aines on otettu toisesta teoksesta erillisen, toistettavan ja muunneltavan teeman muodostamiseksi. @fi
toolkit label: muuntelun tuloksena muodostunut teos @fi
toolkit definition: Musiikkiteos, jonka melodinen, temaattinen tai harmoninen aines on otettu toisesta teoksesta erillisen, toistettavan ja muunneltavan teeman muodostamiseksi. @fi
toolkit label: modifisert gjennom variasjoner som verk @no
toolkit definition: Et musikalsk verk der melodisk, tematisk eller harmonisk materiale hentet fra et annet verk danner et avgrenset tema, som gjentas én eller flere ganger med påfølgende modifikasjoner. @no
label: és modificat per una variació com a obra @ca
definition: Relaciona una obra amb una obra que és una obra musical en la qual el material melòdic, temàtic o harmònic obtingut d’una altra obra forma un tema discret, que es repeteix una o més vegades amb modificacions subsegüents. @ca
toolkit label: modificat per una variació com a obra @ca
toolkit definition: Obra que és una obra musical en la qual el material melòdic, temàtic o harmònic obtingut d’una altra obra forma un tema discret, que es repeteix una o més vegades amb modificacions subsegüents. @ca
has element type: 2
label: τροποποιήθηκε από την παραλλαγή ως (έργο) @el
definition: Συνδέει ένα έργο με ένα μουσικό έργο στο οποίο το μελωδικό, θεματικό ή αρμονικό υλικό που έχει αντληθεί από ένα έργο-πηγή διαμορφώνει ένα διακριτό θέμα, το οποίο επαναλαμβάνεται μία ή περισσότερες φορές με διαδοχικές τροποποιήσεις. @el
toolkit label: τροποποιήθηκε από την παραλλαγή ως (έργο) @el
toolkit definition: Ένα μουσικό έργο στο οποίο το μελωδικό, θεματικό ή αρμονικό υλικό που έχει αντληθεί από ένα έργο-πηγή διαμορφώνει ένα διακριτό θέμα, το οποίο επαναλαμβάνεται μία ή περισσότερες φορές με διαδοχικές τροποποιήσεις. @el
label: változatként módosította a következő mű: @hu
definition: Hozzákapcsol egy művet egy zeneműhöz, amelyben egy másik műformából átvett dallami, tematikus vagy harmonikus anyag egy különálló témát képez, amely egyszer vagy többször ismétlődik egymás utáni módosulásokkal. @hu
toolkit label: változatként módosító mű @hu
toolkit definition: Egy zenemű, amelyben egy másik műformából átvett dallami, tematikus vagy harmonikus anyag egy különálló témát képez, amely egyszer vagy többször ismétlődik egymás utáni módosulásokkal. @hu
label: muuntelun tuloksena muodostunut teos @fi
label: er modifisert gjennom variasjoner som verk @no
definition: Relaterer et verk til et musikalsk verk der melodisk, tematisk eller harmonisk materiale hentet fra et annet verk danner et avgrenset tema, som gjentas én eller flere ganger med påfølgende modifikasjoner. @no
label: is aangepast door variatie als werk @nl
definition: Relateert een werk aan een muziekwerk waarin melodisch, thematisch of harmonisch materiaal is genomen uit een ander werk om een apart thema te vormen, dat één of meer keer herhaald wordt met volgende aanpassingen. @nl
toolkit label: aangepast door variatie als werk @nl
toolkit definition: Een muziekwerk waarin melodisch, thematisch of harmonisch materiaal is genomen uit een ander werk om een apart thema te vormen, dat één of meer keer herhaald wordt met volgende aanpassingen. @nl
label: هو معدل بتنويع كعمل @ar
definition: يربط عمل بعمل موسيقي حيث تؤخذ المواد اللحنية، أو الموضوعية، أو التناغمية من عمل آخر لتشكل مقطوعة متميزة، تتكرر مرة واحدة أو أكثر مع تعديلات لاحقة. @ar
toolkit label: معدل بتنويع كعمل @ar
toolkit definition: عمل موسيقي حيث تؤخذ المواد اللحنية، أو الموضوعية، أو التناغمية من عمل آخر لتشكل مقطوعة متميزة، تتكرر مرة واحدة أو أكثر مع تعديلات لاحقة. @ar
label: teema variatsioonidega (teos) @et
definition: Seostab teose muusikateosega, milles teise teose meloodilisest, temaatilisest või harmoonilisest materjalist on loodud eraldi teema, mida korratakse muudetuna üks või mitu korda. @et
toolkit label: teema variatsioonidega (teos) @et
toolkit definition: Muusikateos, milles teise teose meloodilisest, temaatilisest või harmoonilisest materjalist on loodud eraldi teema, mida korratakse muudetuna üks või mitu korda. @et
label: è modificata da variazione come opera @it
definition: Correla un’opera a un’opera musicale in cui il materiale melodico, tematico o armonico tratto da un’altra opera compone un tema distinto, che si ripete una o più volte con modifiche successive. @it
toolkit label: modificata da variazione come opera @it
toolkit definition: Opera musicale in cui il materiale melodico, tematico o armonico tratto da un’altra opera compone un tema distinto, che si ripete una o più volte con modifiche successive. @it
label: darba variācija @lv
definition: Sasaista darbu ar mūzikas darbu, kurā melodisks, tematisks vai harmonisks materiāls ir ņemts no pamatdarba, izveidojot atsevišķu tēmu, ko atkārto vienu vai vairākas reizes ar secīgām izmaiņām. @lv
toolkit label: darbs: variācija @lv
toolkit definition: Mūzikas darbs, kurā melodisks, tematisks vai harmonisks materiāls ir ņemts no pamatdarba, izveidojot atsevišķu tēmu, ko atkārto vienu vai vairākas reizes ar secīgām izmaiņām. @lv
label: 被修改为变奏曲作为作品 @zh-hans
definition: 将一种作品与其旋律、主题或和声材料被取自另一种作品以形成一个不同的主题、而这个主题又经过后续变化而反复一次或多次的作为一种音乐作品的一种作品关联起来。 @zh-hans
toolkit label: 被修改为变奏曲作为作品 @zh-hans
toolkit definition: 其旋律、主题或和声材料被取自另一种作品以形成一个不同的主题、而这个主题又经过后续变化而反复一次或多次的作为一种音乐作品的一种作品 @zh-hans
has subproperty: P10028
label: eser olarak varyasyonla değiştirilmiştir @tr
definition: Bir eseri, başka bir eserden alınan melodik, tematik veya armonik materyalin, sonraki değişikliklerle bir veya daha fazla kez tekrarlanan ayrı bir tema oluşturduğu bir müzik eseri ile ilişkilendirir. @tr
toolkit label: eser olarak varyasyonla değiştirilirdi @tr
toolkit definition: Başka bir eserden alınan melodik, tematik veya armonik materyalin, sonraki değişikliklerle bir veya daha fazla kez tekrarlanan ayrı bir tema oluşturduğu bir müzik eseri. @tr

has summary
status: Published
definition: Relates a work to a work that is a brief description of a work.
type: Property
domain: C10001
toolkit label: summary
toolkit definition: A work that is a brief description of a work.
toolkit label: résumé @fr
toolkit definition: Œuvre qui consiste en une brève description d’une œuvre. @fr
toolkit label: sumarizada como (obra) @es
toolkit definition: Una obra que contiene una recapitulación breve del contenido de la obra fuente. @es
instruction number: 24.5
label: er opsummeret som værk @da
definition: Relaterer et værk til et værk, som består af en kortfattet gengivelse af et oprindeligt værks indhold. @da
toolkit label: opsummeret som værk @da
toolkit definition: Værk, som består af en kortfattet gengivelse af et oprindeligt værks indhold. @da
definition: Met une œuvre en relation avec une œuvre qui consiste en une brève description d’une œuvre. @fr
label: được tóm lược như là (tác phẩm) @vi
definition: Liên kết tác phẩm với tác phẩm có chứa bản tóm tắt ngắn gọn của nội dung của tác phẩm nguồn. @vi
toolkit label: được tóm lược như là (tác phẩm) @vi
toolkit definition: Tác phẩm có chứa bản tóm tắt ngắn gọn của nội dung của tác phẩm nguồn. @vi
label: ist zusammengefasst als (Werk) @de
definition: Setzt ein Werk in Beziehung zu einem Werk, das aus einer kurzen Wiederholung des Inhalts eines anderen Werks besteht. @de
toolkit label: Zusammengefasst als (Werk) @de
toolkit definition: Ein Werk, das aus einer kurzen Wiederholung des Inhalts eines anderen Werks besteht. @de
label: a pour résumé @fr
definition: Liittää teoksen teokseen, joka on teoksen lyhyt kuvaus. @fi
toolkit label: yhteenveto @fi
toolkit definition: Teos, joka on teoksen lyhyt kuvaus. @fi
toolkit label: sammendrag som verk @no
toolkit definition: Et verk som består av et kort sammendrag av innholdet fra et kildeverk. @no
label: té sumari @ca
definition: Relaciona una obra amb una obra que és una descripció breu d’una obra. @ca
toolkit label: sumari @ca
toolkit definition: Obra que és una descripció breu d’una obra. @ca
has element type: 2
label: είναι περίληψη ως (έργο) @el
definition: Συνδέει ένα έργο με ένα έργο, το οποίο συνιστά μια σύντομη ανακεφαλαίωση του περιεχομένου ενός έργου-πηγής. @el
toolkit label: περίληψη ως (έργο) @el
toolkit definition: Ένα έργο το οποίο συνιστά μια σύντομη ανακεφαλαίωση του περιεχομένου ενός έργου-πηγής. @el
label: összefoglalja a következő mű: @hu
definition: Hozzákapcsol egy művet egy műhöz, amely egy másik mű tartalmának rövid összegzéséből áll. @hu
toolkit label: összefoglaló mű @hu
toolkit definition: Egy mű, amely egy másik mű tartalmának rövid összegzéséből áll. @hu
label: yhteenveto @fi
label: er sammendrag som verk @no
definition: Relaterer et verk til et verk som består av et kort sammendrag av innholdet fra et kildeverk. @no
label: is samengevat als werk @nl
definition: Relateert een werk aan een werk dat bestaat uit een korte herformulering van de content van een ander werk. @nl
toolkit label: samengevat als werk @nl
toolkit definition: Een werk dat bestaat uit een korte herformulering van de content van een ander werk. @nl
label: هو ملخص كعمل @ar
definition: يربط عمل بعمل يتكون من تلخيص موجز لمحتوى عمل آخر. @ar
toolkit label: ملخص كعمل @ar
toolkit definition: عمل يتكون من تلخيص موجز لمحتوى عمل آخر. @ar
label: kokkuvõte teosena @et
definition: Seostab teose teosega, milles on lühidalt kokku võetud allikteose sisu. @et
toolkit label: kokkuvõte teosena @et
toolkit definition: Teos, milles on lühidalt kokku võetud allikteose sisu. @et
label: è riassunta come opera @it
definition: Correla un’opera a un’opera che consiste di una breve ricapitolazione del contenuto di un’opera di partenza. @it
toolkit label: riassunta come opera @it
toolkit definition: Opera che consiste di una breve ricapitolazione del contenuto di un’opera di partenza. @it
alternative label: summarized as work
sub property of: is work described by
lexical alias: summary.en
label: darba kopsavilkums @lv
definition: Sasaista darbu ar darbu - pamatdarba īss satura izklāsts. @lv
toolkit label: darbs: kopsavilkums @lv
toolkit definition: Darbs - pamatdarba īss satura izklāsts. @lv
alternative label: yhteenveto (teos) @fi
alternative label: 被提要为作品 @zh-hans
label: 有提要 @zh-hans
definition: 将一种作品与作为一种作品简要描述的一种作品关联起来。 @zh-hans
toolkit label: 提要 @zh-hans
toolkit definition: 作为一种作品简要描述的一种作品 @zh-hans
alternative label: sumaritzat com a obra @ca
alternative label: résumé comme une œuvre @fr
has subproperty: has abstract
has subproperty: P10109

is parodied as work
status: Published
definition: Relates a work to a work that imitates the style or content of another work for comic effect.
type: Property
domain: C10001
sub property of: is imitated as work
lexical alias: parodiedAsWork.en
toolkit label: parodied as work
toolkit definition: A work that imitates the style or content of another work for comic effect.
toolkit label: parodié comme une œuvre @fr
toolkit definition: Œuvre qui imite le style ou le contenu d’une autre œuvre dans le but de produire un effet comique. @fr
toolkit label: parodiada como (obra) @es
toolkit definition: Una obra que imita el estilo o el contenido de la obra fuente para crear un efecto cómico. @es
instruction number: 24.5
label: er parodieret som værk @da
definition: Relaterer et værk til et værk, som efterligner et oprindeligt værks stil eller indhold for at opnå en komisk effekt. @da
toolkit label: parodieret som værk @da
toolkit definition: Værk, som efterligner et oprindeligt værks stil eller indhold for at opnå en komisk effekt. @da
definition: Met une œuvre en relation avec une œuvre qui imite le style ou le contenu d’une autre œuvre dans le but de produire un effet comique. @fr
label: là được nhại như là (tác phẩm) @vi
definition: Liên kết tác phẩm với tác phẩm nhại lại phong cách và nội dung của tác phẩm nguồn cho hiệu quả hài hước. @vi
toolkit label: được nhại như là (tác phẩm) @vi
toolkit definition: Tác phẩm nhại lại phong cách và nội dung của tác phẩm nguồn cho hiệu quả hài hước. @vi
label: ist parodiert als (Werk) @de
definition: Setzt ein Werk in Beziehung zu einem Werk, das den Stil oder Inhalt eines anderen Werks imitiert, um einen lustigen Effekt zu erzielen. @de
toolkit label: Parodiert als (Werk) @de
toolkit definition: Ein Werk, das den Stil oder Inhalt eines anderen Werks imitiert, um einen lustigen Effekt zu erzielen. @de
label: est parodié comme une œuvre @fr
definition: Liittää teoksen teokseen, joka jäljittelee toisen teoksen tyyliä tai sisältöä humoristisesti. @fi
toolkit label: parodia (teos) @fi
toolkit definition: Teos, joka jäljittelee toisen teoksen tyyliä tai sisältöä humoristisesti. @fi
toolkit label: parodiert som verk @no
toolkit definition: Et verk som etterligner et kildeverks stil eller innhold for en humoristisk effekt. @no
label: és parodiat com a obra @ca
definition: Relaciona una obra amb una obra que imita l’estil o el contingut d’una altra obra per donar un efecte còmic. @ca
toolkit label: parodiat com a obra @ca
toolkit definition: Obra que imita l’estil o el contingut d’una altra obra per donar un efecte còmic. @ca
has element type: 2
label: είναι διακωμωδημένο ως (έργο) @el
definition: Συνδέει ένα έργο με ένα έργο το οποίο μιμείται το ύφος ή το περιεχόμενο ενός έργου-πηγής για κωμικό εφέ. @el
toolkit label: διακωμωδημένο ως (έργο) @el
toolkit definition: Ένα έργο το οποίο μιμείται το ύφος ή το περιεχόμενο ενός έργου-πηγής για κωμικό εφέ. @el
label: parodizálja a következő mű: @hu
definition: Hozzákapcsol egy művet egy műhöz, amely egy másik mű stílusát vagy tartalmát utánozza a komikus hatás kedvéért. @hu
toolkit label: parodizáló mű @hu
toolkit definition: Egy mű, amely egy másik mű stílusát vagy tartalmát utánozza a komikus hatás kedvéért. @hu
label: parodia (teos) @fi
label: er parodiert som verk @no
definition: Relaterer et verk til et verk som etterligner et kildeverks stil eller innhold for en humoristisk effekt. @no
label: is parodie als werk @nl
definition: Relateert een werk aan een werk dat de stijl of content van een ander werk imiteert voor komisch effect. @nl
toolkit label: parodie als werk @nl
toolkit definition: Een werk dat de stijl of content van een ander werk imiteert voor komisch effect. @nl
label: هو محاكى على سبيل السخرية كعمل @ar
definition: يربط عمل بعمل يقلد أسلوب عمل آخر أو محتواه ليُحدث تأثيرًا هزليًا. @ar
toolkit label: محاكى على سبيل السخرية كعمل @ar
toolkit definition: عمل يقلد أسلوب عمل آخر أو محتواه ليُحدث تأثيرًا هزليًا. @ar
label: parodeeritud teosena @et
definition: Seostab teose teosega, mis jäljendab allikteose stiili või sisu koomilise efekti saavutamiseks. @et
toolkit label: parodeeritud teosena @et
toolkit definition: Teos, mis jäljendab allikteose stiili või sisu koomilise efekti saavutamiseks. @et
label: è parodiata come opera @it
definition: Correla un'opera a un'opera che imita lo stile o il contenuto di un’opera di partenza per ottenere un effetto comico. @it
toolkit label: parodiata come opera @it
toolkit definition: Opera che imita lo stile o il contenuto di un’opera di partenza per ottenere un effetto comico. @it
label: darba parodija @lv
definition: Sasaista darbu ar darbu, kas atdarina pamatdarba stilu vai saturu komiska efekta iegūšanai. @lv
toolkit label: darbs: parodija @lv
toolkit definition: Darbs, kas atdarina pamatdarba stilu vai saturu komiska efekta iegūšanai. @lv
label: 被戏仿为作品 @zh-hans
definition: 将一种作品与带喜剧效果模仿另一种作品的风格和内容的一种作品关联起来。 @zh-hans
toolkit label: 被戏仿为作品 @zh-hans
toolkit definition: 带喜剧效果模仿另一种作品的风格和内容的一种作品 @zh-hans
has subproperty: P10144
label: eser olarak parodileştirilmiştir @tr
definition: Bir eseri, komik etki yaratmak için başka bir eserin biçimini veya içeriğini taklit eden bir eserle ilişkilendirir. @tr
toolkit label: eser olarak taklit edilmiştir @tr
toolkit definition: Komik etki yaratmak için başka bir eserin biçimini veya içeriğini taklit eden eser. @tr

is freely translated as work
status: Published
definition: Relates a work to a work that is both an adaptation and a translation into another language of another work.
type: Property
domain: C10001
sub property of: has transformation by style
lexical alias: freelyTranslatedAsWork.en
toolkit label: freely translated as work
toolkit definition: A work that is both an adaptation and a translation into another language of another work.
toolkit label: librement traduit comme une œuvre @fr
toolkit definition: Œuvre qui consiste à la fois en une adaptation et en une traduction dans une autre langue d’une autre œuvre. @fr
toolkit label: traducida libremente como (obra) @es
toolkit definition: Una obra creada mediante la interpretación libre de la obra fuente en otra lengua, preservando el espíritu del original, pero no sus detalles lingüísticos @es
instruction number: 24.5
label: er frit oversat som værk @da
definition: Relaterer et værk til et værk, som både er en bearbejdelse af et oprindeligt værk og en oversættelse til et andet sprog. @da
toolkit label: frit oversat som værk @da
toolkit definition: Værk, som både er en bearbejdelse af et oprindeligt værk og en oversættelse til et andet sprog. @da
definition: Met une œuvre en relation avec une œuvre qui consiste à la fois en une adaptation et en une traduction dans une autre langue d’une autre œuvre. @fr
label: được dịch tự do (tác phẩm) @vi
definition: Liên kết tác phẩm với tác phẩm vừa phỏng theo vừa dịch sang ngôn ngữ khác của tác phẩm nguồn. @vi
toolkit label: dịch tự do như là (tác phẩm) @vi
toolkit definition: Tác phẩm vừa phỏng theo vừa dịch sang ngôn ngữ khác của tác phẩm nguồn. @vi
label: ist frei übersetzt als (Werk) @de
definition: Setzt ein Werk in Beziehung zu einem Werk, das sowohl eine Bearbeitung als auch eine Übersetzung eines anderen Werks in eine andere Sprache ist. @de
toolkit label: Frei übersetzt als (Werk) @de
toolkit definition: Ein Werk, das sowohl eine Bearbeitung als auch eine Übersetzung eines anderen Werks in eine andere Sprache ist. @de
label: est librement traduit comme une œuvre @fr
definition: Liittää teoksen teokseen, joka on sekä toisen teoksen muokkaus että käännös toiselle kielelle. @fi
toolkit label: vapaamuotoinen käännös (teos) @fi
toolkit definition: Teos, joka on sekä toisen teoksen muokkaus että käännös toiselle kielelle. @fi
toolkit label: fritt oversatt som verk @no
toolkit definition: Et verk som er både en bearbeidelse av et kildeverk og en oversettelse til et annet språk. @no
label: és traduït lliurement com a obra @ca
definition: Relaciona una obra amb una obra que és alhora una adaptació i una traducció a una altra llengua d’una altra obra. @ca
toolkit label: traduït lliurement com a obra @ca
toolkit definition: Obra que és alhora una adaptació i una traducció a una altra llengua d’una altra obra. @ca
has element type: 2
label: είναι ελεύθερη μετάφραση ως (έργο) @el
definition: Συνδέει ένα έργο με ένα έργο το οποίο είναι ταυτόχρονα προσαρμογή και μετάφραση ενός έργου-πηγής σε μια άλλη γλώσσα. @el
toolkit label: ελεύθερη μετάφραση ως (έργο) @el
toolkit definition: Ένα έργο το οποίο είναι ταυτόχρονα προσαρμογή και μετάφραση ενός έργου-πηγής σε μια άλλη γλώσσα. @el
label: szabadon fordítva a következő műben: @hu
definition: Hozzákapcsol egy művet egy műhöz, amely egy másik mű adaptációja és egy másik nyelvre való fordítása egyszerre. @hu
toolkit label: szabad fordítása a következő mű: @hu
toolkit definition: Egy mű, amely egy másik mű adaptációja és egy másik nyelvre való fordítása egyszerre. @hu
label: vapaamuotoinen käännös (teos) @fi
label: er fritt oversatt som verk @no
definition: Relaterer et verk til et verk som er både en bearbeidelse av et kildeverk og en oversettelse til et annet språk. @no
label: is vrij vertaald als werk @nl
definition: Relateert een werk aan een werk dat zowel een bewerking is als een vertaling in een andere taal van een ander werk. @nl
toolkit label: vrij vertaald als werk @nl
toolkit definition: Een werk dat zowel een bewerking is als een vertaling in een andere taal van een ander werk. @nl
label: هو مترجم بتصرف كعمل @ar
definition: يربط عمل بعمل يعد اقتباسًا وترجمة إلى لغة أخرى لعمل آخر. @ar
toolkit label: مترجم بتصرف كعمل @ar
toolkit definition: عمل يعد اقتباسًا وترجمة إلى لغة أخرى لعمل آخر. @ar
label: vabalt tõlgitud teosena @et
definition: Seostab teose teosega, mis on nii allikteose adapteering kui ka tõlge teise keelde. @et
toolkit label: vabalt tõlgitud teosena @et
toolkit definition: Teos, mis on nii allikteose adapteering kui ka tõlge teise keelde. @et
label: è liberamente tradotta come opera @it
definition: Correla un’opera a un’opera che è sia un adattamento sia una traduzione in un'altra lingua di un’opera di partenza. @it
toolkit label: liberamente tradotta come opera @it
toolkit definition: Opera che è sia un adattamento sia una traduzione in un'altra lingua di un’opera di partenza. @it
label: ir brīvs tulkojums (darbs) @lv
definition: Sasaista darbu ar darbu, kas ir gan darba avota adaptācija, gan tulkojums citā valodā. @lv
toolkit label: brīvs tulkojums (darbs) @lv
toolkit definition: Darbs, kas ir gan darba avota adaptācija, gan tulkojums citā valodā. @lv
label: 被自由翻译为作品 @zh-hans
definition: 将一种作品与作为另一种作品的用另一种语言改编和翻译同时进行而成的一种作品关联起来。 @zh-hans
toolkit label: 被自由翻译为作品 @zh-hans
toolkit definition: 作为另一种作品的用另一种语言改编和翻译同时进行而成的一种作品 @zh-hans
has subproperty: P10099
label: eser olarak serbestçe çevrilmiştir @tr
definition: Bir eseri, başka bir eserin hem uyarlaması hem de başka bir dile çevirisi olan bir eserle ilişkilendirir. @tr
toolkit label: eser olarak serbestçe çevrilmiş @tr
toolkit definition: Başka bir eserin hem uyarlaması hem de başka bir dile çevirisi olan bir eser. @tr

is remade as work
status: Published
definition: Relates a work to a work that is a motion picture, radio program, television program, or video that is based on an earlier work.
type: Property
domain: C10001
sub property of: has transformation by style
lexical alias: remadeAsWork.en
toolkit label: remade as work
toolkit definition: A work that is a new motion picture, radio program, television program, or video that is based on an earlier work.
toolkit label: repris comme une œuvre @fr
toolkit definition: Œuvre qui consiste en un nouveau film, une nouvelle émission de radio, une nouvelle émission de télévision ou une nouvelle vidéo basée sur une œuvre antérieure. @fr
toolkit label: reproducida como (obra) @es
toolkit definition: Una película cinematográfica, un programa de radio, televisión o video nuevo basados en una obra anterior. @es
instruction number: 24.5
label: er genindspillet som værk @da
definition: Relaterer et værk til en spillefilm, radio- eller tv-program eller video, som er baseret på et tidligere værk. @da
toolkit label: genindspillet som værk @da
toolkit definition: Spillefilm, radio- eller tv-program eller video, som er baseret på et tidligere værk. @da
definition: Met une œuvre en relation avec une œuvre qui consiste en un nouveau film, une nouvelle émission de radio, une nouvelle émission de télévision ou une nouvelle vidéo basée sur une œuvre antérieure. @fr
label: được làm lại như là (tác phẩm) @vi
definition: Liên kết tác phẩm với phim điện ảnh, chương trình truyền thanh, chương trình truyền hình, hoặc video dựa trên tác phẩm trước đây. @vi
toolkit label: được làm lại như là (tác phẩm) @vi
toolkit definition: Phim điện ảnh, chương trình truyền thanh, chương trình truyền hình, hoặc video dựa trên tác phẩm trước đây. @vi
label: ist Remake als (Werk) @de
definition: Setzt ein Werk in Beziehung zu einem Werk, bei dem es sich um einen Film, eine Radiosendung, eine Fernsehsendung oder ein Video handelt, der/die/das auf einem früheren Werk basiert. @de
toolkit label: Remake als (Werk) @de
toolkit definition: Ein Werk, bei dem es sich um einen Film, eine Radiosendung, eine Fernsehsendung oder ein Video handelt, der/die/das auf einem früheren Werk basiert. @de
label: est repris comme une œuvre @fr
definition: Liittää teoksen teokseen, joka on elokuva, radio-ohjelma, televisio-ohjelma tai video, joka perustuu aiempaan teokseen. @fi
toolkit label: uusintaproduktio (teos) @fi
toolkit definition: Teos, joka on uusi elokuva, radio-ohjelma, televisio-ohjelma tai video, joka perustuu aiempaan teokseen. @fi
toolkit label: nyinnspilt som verk @no
toolkit definition: En spillefilm, et radioprogram, et fjernsynsprogram eller en video som er basert på et tidligere verk. @no
label: és nova versió com a obra @ca
definition: Relaciona una obra amb una obra que és una pel·lícula cinematogràfica, un programa radiofònic, un programa de televisió o un vídeo que es basa en una obra anterior. @ca
toolkit label: nova versió com a obra @ca
toolkit definition: Obra que és una pel·lícula cinematogràfica, un programa radiofònic, un programa de televisió o un vídeo que es basa en una obra anterior. @ca
has element type: 2
label: είναι ανακατασκευασμένο ως (έργο) @el
definition: Συνδέει ένα έργο με μια κινηματογραφική ταινία, ένα ραδιοφωνικό πρόγραμμα, ένα τηλεοπτικό πρόγράμμα ή ένα βίντεο, βασισμένα σε προηγούμενο έργο. @el
toolkit label: ανακατασκευασμένο ως (έργο) @el
toolkit definition: Μια νέα κινηματογραφική ταινία, ένα ραδιοφωνικό πρόγραμμα, ένα τηλεοπτικό πρόγράμμα ή ένα βίντεο, βασισμένα σε ένα προηγούμενο έργο. @el
label: átdolgozása a következő műnek: @hu
definition: Hozzákapcsol egy művet egy korábbi művön alapuló mozgóképhez, rádióműsorhoz, televízióműsorhoz, vagy videóhoz. @hu
toolkit label: újraalkotó mű @hu
toolkit definition: Egy korábbi művön alapuló mozgókép, rádióműsor, televízióműsor, vagy videó kifejezési forma. @hu
label: uusintaproduktio (teos) @fi
label: er nyinnspilt som verk @no
definition: Relaterer et verk til en spillefilm, et radioprogram, et fjernsynsprogram eller en video som er basert på et tidligere verk. @no
label: is opnieuw gemaakt als werk @nl
definition: Relateert een werk aan een werk dat is een speelfilm, radioprogramma, televisieprogramma of video dat gebaseerd is op een eerder werk. @nl
toolkit label: opnieuw gemaakt als werk @nl
toolkit definition: Een werk dat is een nieuwe speelfilm, radioprogramma, televisieprogramma of video dat gebaseerd is op een eerder werk. @nl
label: هو معاد صنعه كعمل @ar
definition: يربط عمل بعمل عبارة عن فيلم سينمائي، أو برنامج إذاعي، أو برنامج تليفزيوني، أو فيديو يعتمد على عمل سابق. @ar
toolkit label: معاد صنعه كعمل @ar
toolkit definition: فيلم سينمائي جديد، أو برنامج إذاعي، أو برنامج تلفزيوني، أو فيديو يعتمد على عمل سابق. @ar
label: uusproduktsioon (teos) @et
definition: Seostab teose filmi, raadiosaate, telesaate või videofilmiga, mis põhineb varasemal teosel. @et
toolkit label: uusproduktsioon (teos) @et
toolkit definition: Uus film, raadiosaade, telesaade või videofilm, mis põhineb varasemal teosel. @et
label: è rifatta come opera @it
definition: Correla un'opera a un film, programma radiofonico, programma televisivo o video, basato su un'opera precedente. @it
toolkit label: rifatta come opera @it
toolkit definition: Nuovo film, programma radiofonico, programma televisivo o video, basato su un'opera precedente. @it
label: darba jauna versija @lv
definition: Sasaista darbu ar darbu, kas ir jauna kinofilma, radio, televīzijas raidījums vai video, kas veidoti pēc agrāka darba. Rīmeiks. @lv
toolkit label: darbs: jauna versija @lv
toolkit definition: Jauna kinofilma, radio, televīzijas raidījums vai video, kas veidoti pēc agrāka darba. Rīmeiks. @lv
label: 被重新制作为作品 @zh-hans
definition: 将一种作品与基于一种先前作品的一种新电影、广播节目、电视节目或视频的一种作品关联起来。 @zh-hans
toolkit label: 被重新制作为作品 @zh-hans
toolkit definition: 基于一种先前作品的一种新电影、广播节目、电视节目或视频的一种作品 @zh-hans
has subproperty: P10032
label: eser olarak yeniden yapılmıştır @tr
definition: Bir eseri, eski bir esere dayanan sinema filmi, radyo programı, televizyon programı veya video olan bir eserle ilişkilendirir. @tr
toolkit label: eser olarak yeniden yapılmış @tr
toolkit definition: Eski bir esere dayanan yeni bir sinema filmi, radyo programı, televizyon programı veya video olan bir eser. @tr

is imitated as work
status: Published
definition: Relates a work to a work that copies the style or content of another work.
type: Property
domain: C10001
sub property of: has transformation by style
lexical alias: imitatedAsWork.en
toolkit label: imitated as work
toolkit definition: A work that copies the style or content of another work.
toolkit label: imité comme une œuvre @fr
toolkit definition: Œuvre qui copie le style ou le contenu d’une autre œuvre. @fr
toolkit label: imitada como (obra) @es
toolkit definition: Una obra que copia el estilo o contenido de la obra fuente. @es
instruction number: 24.5
label: er efterlignet som værk @da
definition: Relaterer et værk til et værk, som kopierer et oprindeligt værks stil eller indhold. @da
toolkit label: efterlignet som værk @da
toolkit definition: Værk, som kopierer et oprindeligt værks stil eller indhold. @da
definition: Met une œuvre en relation avec une œuvre qui copie le style ou le contenu d’une autre œuvre. @fr
label: được mô phỏng như là (tác phẩm) @vi
definition: Liên kết tác phẩm với tác phẩm sao lại phong cách hoặc nội dung của tác phẩm nguồn. @vi
toolkit label: được mô phỏng như là (tác phẩm) @vi
toolkit definition: Tác phẩm sao lại phong cách hoặc nội dung của tác phẩm nguồn. @vi
label: ist imitiert als (Werk) @de
definition: Setzt ein Werk in Beziehung zu einem Werk, das den Stil oder Inhalt eines anderen Werks kopiert. @de
toolkit label: Imitiert als (Werk) @de
toolkit definition: Ein Werk, das den Stil oder Inhalt eines anderen Werks kopiert. @de
label: est imité comme une œuvre @fr
definition: Liittää teoksen teokseen, joka jäljittelee toisen teoksen tyyliä tai sisältöä. @fi
toolkit label: jäljitelmä (teos) @fi
toolkit definition: Teos, joka jäljittelee toisen teoksen tyyliä tai sisältöä. @fi
toolkit label: imitert som verk @no
toolkit definition: Et verk som kopierer stilen eller innholdet fra et kildeverk. @no
label: és imitat com a obra @ca
definition: Relaciona una obra amb una obra que copia l’estil o el contingut d’una altra obra. @ca
toolkit label: imitat com a obra @ca
toolkit definition: Obra que copia l’estil o el contingut d’una altra obra. @ca
has element type: 2
label: είναι αντίγραφο ως (έργο) @el
definition: Συνδέει ένα έργο με ένα έργο το οποίο αντιγράφει το ύφος ή το περιεχόμενο ενός έργου-πηγής. @el
toolkit label: αντίγραφο ως (έργο) @el
toolkit definition: Ένα έργο το οποίο αντιγράφει το ύφος ή το περιεχόμενο ενός έργου-πηγής. @el
label: utánzó műve a következő: @hu
definition: Hozzákapcsol egy művet egy műhöz, amely egy másik mű stílusát vagy tartalmát másolja. @hu
toolkit label: utánzó műve a következő: @hu
toolkit definition: Egy mű, amely egy másik mű stílusát vagy tartalmát másolja. @hu
label: jäljitelmä (teos) @fi
label: er imitert som verk @no
definition: Relaterer et verk til et verk som kopierer stilen eller innholdet fra et kildeverk. @no
label: is geïmiteerd als werk @nl
definition: Relateert een werk aan een werk dat de stijl of content van een ander werk kopieert. @nl
toolkit label: geïmiteerd als werk @nl
toolkit definition: Een werk dat de stijl of content van een ander werk kopieert. @nl
label: هو محاكى كعمل @ar
definition: يربط عمل بعمل ينسخ نمط عمل آخر أو محتواه. @ar
toolkit label: محاكى كعمل @ar
toolkit definition: عمل ينسخ أسلوب عمل آخر أو محتواه. @ar
label: jäljendatud teosena @et
definition: Seostab teose teosega, milles jäljendatakse allikteose stiili või sisu. @et
toolkit label: jäljendatud teosena @et
toolkit definition: Teos, milles jäljendatakse allikteose stiili või sisu. @et
label: è imitata come opera @it
definition: Correla un’opera a un’opera che copia lo stile o il contenuto di un’opera di partenza. @it
toolkit label: imitata come opera @it
toolkit definition: Opera che copia lo stile o il contenuto di un’opera di partenza. @it
label: darba imitācija @lv
definition: Sasaista darbu ar darbu, kas atdarina pamatdarba stilu vai saturu. @lv
toolkit label: darbs: imitācija @lv
toolkit definition: Darbs, kas atdarina pamatdarba stilu vai saturu. @lv
label: 被模仿成为作品 @zh-hans
definition: 将一种作品与复制另一种作品的风格和内容的一种作品关联起来。 @zh-hans
toolkit label: 被模仿成为作品 @zh-hans
toolkit definition: 复制另一种作品的风格和内容的一种作品 @zh-hans
has subproperty: is parodied as work
has subproperty: P10117
label: eser olarak taklit edilmiştir @tr
definition: Bir eseri, başka bir eserin biçimini veya içeriğini kopyalayan bir eserle ilişkilendirir. @tr
toolkit label: eser olarak taklit edilmiştir @tr
toolkit definition: Başka bir eserin biçimini veya içeriğini kopyalayan eser. @tr

is graphic novelization of work
status: Published
type: Property
lexical alias: graphicNovelizationOfWork.en
definition: Relates a work to a work that is adapted as a graphic novel.
domain: C10001
toolkit label: graphic novelization of work
toolkit definition: A work that is adapted as a graphic novel.
toolkit label: adaptation en roman graphique d’une œuvre @fr
toolkit definition: Œuvre qui est adaptée en roman graphique. @fr
sub property of: is adaptation of work
toolkit label: novelización gráfica de (obra) @es
toolkit definition: Una obra que ha sido adaptada como una novela gráfica. @es
instruction number: 24.5
label: er omskrivning af værk til graphic novel @da
definition: Relaterer et værk til et værk, som er bearbejdet til en graphic novel. @da
toolkit label: omskrivning af værk til graphic novel @da
toolkit definition: Værk, som er bearbejdet til en graphic novel. @da
definition: Met une œuvre en relation avec une œuvre qui est adaptée en roman graphique. @fr
label: là tiểu thuyết hoá đồ hoạ của (tác phẩm) @vi
definition: Liên kết tác phẩm với tác phẩm đã được phỏng theo như là tiểu thuyết đồ hình. @vi
toolkit label: tiểu thuyết hoá đồ hoạ của (tác phẩm) @vi
toolkit definition: Tác phẩm đã được phỏng theo như là tiểu thuyết đồ hình. @vi
label: ist Bearbeitung als Graphic Novel von (Werk) @de
definition: Setzt ein Werk in Beziehung zu einem Werk, das als Graphic Novel bearbeitet ist. @de
toolkit label: Bearbeitung als Graphic Novel von (Werk) @de
toolkit definition: Ein Werk, das als Graphic Novel bearbeitet ist. @de
label: est une adaptation en roman graphique d’une œuvre @fr
definition: Liittää teoksen teokseen, joka on sovitettu sarjakuvaromaaniksi. @fi
toolkit label: sarjakuvaversio teoksesta @fi
toolkit definition: Teos, joka on sovitettu sarjakuvaromaaniksi. @fi
toolkit label: tegneserieroman basert på verk @no
toolkit definition: Et verk som er bearbeidet til en tegneserieroman. @no
label: és novel·lització gràfica d’una obra @ca
definition: Relaciona una obra amb una obra que s’adapta com una novel·la gràfica. @ca
toolkit label: novel·lització gràfica d’una obra @ca
toolkit definition: Obra que s’adapta com una novel·la gràfica. @ca
has element type: 2
label: είναι μυθιστοριογράφηση σε μορφή κόμικ του (έργο) @el
definition: Συνδέει ένα έργο με ένα έργο το οποίο έχει προσαρμοστεί ως μυθιστόρημα σε μορφή κόμικ. @el
toolkit label: μυθιστοριογράφηση σε μορφή κόμικ του (έργο) @el
toolkit definition: Ένα έργο το οποίο έχει προσαρμοστεί ως μυθιστόρημα σε μορφή κόμικ. @el
label: képregény-feldolgozása a következőnek: @hu
definition: Hozzákapcsol egy művet egy műhöz, amelyet képregényként adaptáltak. @hu
toolkit label: képregényesített mű @hu
toolkit definition: Egy mű, amelyet képregényként átdolgoztak. @hu
label: sarjakuvaversio teoksesta @fi
label: er tegneserieroman basert på verk @no
definition: Relaterer et verk til et verk som er bearbeidet til en tegneserieroman. @no
label: is stripboekbewerking van werk @nl
definition: Relateert een werk aan een werk dat is bewerkt als een stripboek. @nl
toolkit label: stripboekbewerking van werk @nl
toolkit definition: Een werk dat is bewerkt als een stripboek. @nl
label: هو تحويل روائي مصور لعمل @ar
definition: يربط عمل بعمل معالج كرواية مصورة. @ar
toolkit label: تحويل روائي مصور لعمل @ar
toolkit definition: عمل تمت معالجته كرواية مصورة. @ar
label: graafilise romaani versioon teosest @et
definition: Seostab teose teosega, mis on adapteeritud graafilise romaanina. @et
toolkit label: graafilise romaani versioon teosest @et
toolkit definition: Teos, mis on adapteeritud graafilise romaanina. @et
label: è adattatamento in forma di graphic novel di opera @it
definition: Correla un'opera a un'opera adattata come graphic novel. @it
toolkit label: adattatamento in forma di graphic novel di opera @it
toolkit definition: Opera adattata come graphic novel. @it
label: kā grafisks romāns adaptētais darbs @lv
definition: Sasaista darbu ar darbu, kas ir adaptēts kā grafisks romāns. @lv
toolkit label: kā grafisks romāns adaptētais darbs @lv
toolkit definition: Darbs, kas ir adaptēts kā grafisks romāns. @lv
label: 是作品的图解小说化 @zh-hans
definition: 将一种作品与被改编为图解小说的一种作品关联起来。 @zh-hans
toolkit label: 作品的图解小说化 @zh-hans
toolkit definition: 被改编为图解小说的一种作品 @zh-hans
has subproperty: P10252
label: eserin çizgi romanlaştırılmasıdır @tr
definition: Bir eseri, çizgi roman olarak uyarlanan bir eserle ilişkilendirir. @tr
toolkit label: eserin çizgi romanlaştırılması @tr
toolkit definition: Bir çizgi roman olarak uyarlanan bir çalışma. @tr

is augmentation of work
status: Published
definition: Relates a work to a work whose content is added to by a related work.
type: Property
domain: C10001
sub property of: has related work of work
lexical alias: augmentationOfWork.en
toolkit label: augmentation of work
toolkit definition: A work whose content is added to by a related work.
toolkit label: augmentation d’une œuvre @fr
toolkit definition: Œuvre dont le contenu est augmenté par le contenu d’une œuvre en relation. @fr
toolkit label: ampliación de (obra) @es
toolkit definition: Una obra cuyo contenido se agrega a otra obra. @es
instruction number: 24.5
label: er berigelse af værk @da
definition: Relaterer et værk til et værk, hvis indhold udbygges af et relateret værk. @da
toolkit label: berigelse af værk @da
toolkit definition: Værk, hvis indhold udbygges af et relateret værk. @da
definition: Met une œuvre en relation avec une œuvre dont le contenu est augmenté par le contenu d’une œuvre en relation. @fr
label: là gia tăng của (tác phẩm) @vi
definition: Liên kết tác phẩm với tác phẩm mà nội dung của nó được thêm vào bởi tác phẩm khác. @vi
toolkit label: gia tăng của (tác phẩm) @vi
toolkit definition: Tác phẩm mà nội dung của nó được thêm vào bởi tác phẩm khác. @vi
label: ist Erweiterung von (Werk) @de
definition: Setzt ein Werk in Beziehung zu einem Werk, dessen Inhalt durch ein in Beziehung stehendes Werk ergänzt wird. @de
toolkit label: Erweiterung von (Werk) @de
toolkit definition: Ein Werk, dessen Inhalt durch ein in Beziehung stehendes Werk ergänzt wird. @de
label: est une augmentation d’une œuvre @fr
definition: Liittää teoksen teokseen, jonka sisältöä siihen liittyvä teos täydentää. @fi
toolkit label: laajennus teokseen @fi
toolkit definition: Teos, jonka sisältöä siihen liittyvä teos täydentää. @fi
toolkit label: utvidelse av verk @no
toolkit definition: Et verk hvis innhold har blitt utvidet av et relatert verk. @no
label: és augmentació d’una obra @ca
definition: Relaciona una obra amb una obra el contingut de la qual és augmentat per una obra relacionada. @ca
toolkit label: augmentació d’una obra @ca
toolkit definition: Obra el contingut de la qual és augmentat per una obra relacionada. @ca
has element type: 2
label: είναι αύξηση του (έργο) @el
definition: Συνδέει ενα έργο με ένα έργο του οποίου το περιεχόμενο αυξάνεται από ένα άλλο έργο. @el
toolkit label: αύξηση του (έργο) @el
toolkit definition: Ένα έργο του οποίου το περιεχόμενο αυξάνεται από ένα άλλο έργο. @el
label: bővítése a következő műnek: @hu
definition: Hozzákapcsol egy művet egy műhöz, amelynek tartalmát egy kapcsolódó mű adja hozzá. @hu
toolkit label: bővített mű @hu
toolkit definition: Egy mű, amelynek tartalmát egy kapcsolódó mű adja hozzá. @hu
label: laajennus teokseen @fi
label: er utvidelse av verk @no
definition: Relaterer et verk til et verk hvis innhold har blitt utvidet av et relatert verk. @no
label: is aanvulling van werk @nl
definition: Relateert een werk aan een werk waar content aan toegevoegd wordt door een gerelateerd werk. @nl
toolkit label: aanvulling van werk @nl
toolkit definition: Een werk waar content aan toegevoegd wordt door een gerelateerd werk. @nl
label: هو إضافة لعمل @ar
definition: يربط عمل بعمل تمت إضافة محتواه بواسطة عمل ذي صلة. @ar
toolkit label: إضافة لعمل @ar
toolkit definition: عمل تمت إضافة محتواه بواسطة عمل ذي صلة. @ar
label: laiendus teosele @et
definition: Seostab teose teosega, mille sisusse on tehtud seotud teosega lisandusi. @et
toolkit label: laiendus teosele @et
toolkit definition: Teos, mille sisusse on tehtud seotud teosega lisandusi. @et
label: è ampliamento di opera @it
definition: Correla un’opera a un’opera il cui contenuto è ampliato da un’opera correlata. @it
toolkit label: ampliamento di opera @it
toolkit definition: Opera il cui contenuto è ampliato da un’opera correlata. @it
label: ir papildina darbu @lv
definition: Sasaista darbu ar darbu, kura saturu papildina saistītais darbs. @lv
toolkit label: papildina darbu @lv
toolkit definition: Darbs, kura saturu papildina saistītais darbs @lv
label: 是作品的附增 @zh-hans
definition: 将一种作品与其内容被一种相关作品增加的一种作品关联起来。 @zh-hans
toolkit label: 作品的附增 @zh-hans
toolkit definition: 其内容被一种相关作品增加的一种作品 @zh-hans
has subproperty: is cadenza composed for work
has subproperty: is finding aid for work (Deprecated)
has subproperty: is appendix to work
has subproperty: is errata to work
has subproperty: is guide to work
has subproperty: is index to work (Deprecated)
has subproperty: is supplement to work

is evaluation of work
status: Published
definition: Relates a work to a work that is examined or judged by a work.
type: Property
domain: C10001
lexical alias: evaluationOfWork.en
toolkit label: evaluation of work
toolkit definition: A work that is examined or judged by a work.
toolkit label: évaluation d’une œuvre @fr
toolkit definition: Œuvre qui est examinée ou jugée par une œuvre. @fr
toolkit label: evaluación de (obra) @es
toolkit definition: Una obra que es examinada o juzgada. @es
instruction number: 23.5
label: er evaluering af værk @da
definition: Relaterer et værk til et værk, som er undersøgt eller vurderet. @da
toolkit label: evaluering af værk @da
toolkit definition: Værk, som er undersøgt eller vurderet. @da
definition: Met une œuvre en relation avec une œuvre qui est examinée ou jugée par une œuvre. @fr
label: là đánh giá (tác phẩm) @vi
definition: Liên kết tác phẩm với tác phẩm được kiểm tra hoặc đánh giá. @vi
toolkit label: đánh giá của (tác phẩm) @vi
toolkit definition: Tác phẩm được kiểm tra hoặc đánh giá. @vi
label: ist Evaluierung von (Werk) @de
definition: Setzt ein Werk in Beziehung zu einem Werk, das geprüft oder beurteilt wird. @de
toolkit label: Evaluierung von (Werk) @de
toolkit definition: Ein Werk, das geprüft oder beurteilt wird. @de
label: est une évaluation d’une œuvre @fr
definition: Liittää teoksen teokseen, jota on tutkittu tai arvioitu. @fi
toolkit label: arviointi teoksesta @fi
toolkit definition: Teos, jota on tutkittu tai arvioitu. @fi
toolkit label: evaluering av verk @no
toolkit definition: Et verk som utforskes eller vurderes. @no
label: és avaluació d’una obra @ca
definition: Relaciona una obra amb una obra que és examinada o jutjada per una obra. @ca
toolkit label: avaluació d’una obra @ca
toolkit definition: Obra que és examinada o jutjada per una obra. @ca
has element type: 2
label: είναι αξιολόγηση του (έργο) @el
definition: Συνδέει ένα έργο με ένα έργο το οποίο υποβάλλεται σε εξέταση ή κριτική. @el
toolkit label: αξιολόγηση του (έργο) @el
toolkit definition: Ένα έργο το οποίο υποβάλλεται εξετάζεται ή κρίνεται. @el
label: értékelése a következő műnek: @hu
definition: Hozzákapcsol egy művet egy műhöz, amelyet elemeznek és megítélnek. @hu
toolkit label: értékelt mű @hu
toolkit definition: Egy mű, amelyet elemeznek és megítélnek. @hu
label: arviointi teoksesta @fi
label: er evaluering av verk @no
definition: Relaterer et verk til et verk som utforskes eller vurderes. @no
label: is beschouwing van werk @nl
definition: Relateert een werk aan een werk dat onderzocht of beoordeeld wordt. @nl
toolkit label: beschouwing van werk @nl
toolkit definition: Een werk dat onderzocht of beoordeeld wordt. @nl
label: هو تقييم لعمل @ar
definition: يربط عمل بعمل فُحِص أو حُكِم عليه. @ar
toolkit label: تقييم لعمل @ar
toolkit definition: عمل فُحِص أو حُكِم عليه. @ar
label: hinnang teosele @et
definition: Seostab teose teosega, mida on kontrollitud või hinnatud. @et
toolkit label: hinnang teosele @et
toolkit definition: Teos, mida on kontrollitud või hinnatud. @et
label: è valutazione di opera @it
definition: Correla un’opera a un’opera che è esaminata o giudicata. @it
toolkit label: valutazione di opera @it
toolkit definition: Opera che è esaminata o giudicata. @it
sub property of: has subject work
label: ir novērtējums darbam @lv
definition: Sasaista darbu ar darbu, kas tiek pārbaudīts vai vērtēts. @lv
toolkit label: novērtējums darbam @lv
toolkit definition: Darbs, kas tiek pārbaudīts vai vērtēts. @lv
label: 是作品的评价 @zh-hans
definition: 将一种作品与被一种作品检查或评判的一种作品关联起来。 @zh-hans
toolkit label: 作品的评价 @zh-hans
toolkit definition: 被一种作品检查或评判的一种作品 @zh-hans
has subproperty: is critique of work
has subproperty: is review of work
has subproperty: P10153
label: eserin değerlendirmesidir @tr
definition: Bir eseri, bir eser tarafından incelenen veya değerlendirilen bir eserle ilişkilendirir. @tr
toolkit label: eserin değerlendirilmesi @tr
toolkit definition: Bir çalışma tarafından incelenen veya değerlendirilen bir çalışma. @tr

has expression of work
status: Published
definition: Relates a work to an expression that is a realization of a work in the form of alpha-numeric, musical or choreographic notation, sound, image, object, movement, etc., or any combination of such forms.
type: Property
domain: C10001
lexical alias: expressionOfWork.en
instruction number: 17.5
toolkit label: expression of work
toolkit definition: An expression that is a realization of a work in the form of alpha-numeric, musical or choreographic notation, sound, image, object, movement, etc., or any combination of such forms.
toolkit label: expression d’une œuvre @fr
toolkit definition: Expression qui consiste en une réalisation d’une œuvre sous forme de notation alphanumérique, musicale ou chorégraphique, de son, d’image, d’objet, de mouvement, etc. ou de toute combinaison de ces formes. @fr
toolkit label: expresión de la obra @es
toolkit definition: Una realización de la obra en la forma de notaciones alfanumérica, musical o coreográfica, sonido, imagen, movimiento, etc. o en cualquier combinación de tales formas. @es
label: har uttryck för verk @sv
toolkit label: uttryck för verk @sv
label: har udtryk af værk @da
definition: Relaterer et værk til en virkeliggørelse af et værk i form af alfanumerisk, musik- eller koreografinotation, en lyd, et billede, en genstand, en bevægelse etc., eller en kombination af sådanne former. @da
toolkit label: udtryk af værk @da
toolkit definition: Virkeliggørelse af et værk i form af alfanumerisk, musik- eller koreografinotation, en lyd, et billede, en genstand, en bevægelse etc., eller en kombination af sådanne former. @da
definition: Met une œuvre en relation avec une expression qui consiste en une réalisation d’une œuvre sous forme de notation alphanumérique, musicale ou chorégraphique, de son, d’image, d’objet, de mouvement, etc. ou de toute combinaison de ces formes. @fr
label: có biểu hiện của tác phẩm @vi
definition: Liên kết tác phẩm với sự thể hiện của tác phẩm dưới hình thái chữ-số, ký hiệu âm nhạc hoặc nghệ thuật bố trí, âm thanh, hình ảnh, vật thể, động thái, v.v..., hoặc tổ hợp các hình thái đó. @vi
toolkit label: biểu hiện của tác phẩm @vi
toolkit definition: Sự thể hiện của tác phẩm dưới hình thái chữ-số, ký hiệu âm nhạc hoặc nghệ thuật bố trí, âm thanh, hình ảnh, vật thể, động thái, v.v..., hoặc tổ hợp các hình thái đó. @vi
label: hat Expression eines Werks @de
definition: Setzt ein Werk in Beziehung zu einer Expression, bei der es sich um die Realisierung eines Werks in Form einer alphanumerischen, musikalischen oder choreografischen Notation, in Form von Ton, Bild, Gegenstand, Bewegung und so weiter oder einer Kombination solcher Formen handelt. @de
toolkit label: Expression eines Werks @de
toolkit definition: Eine Expression, bei der es sich um die Realisierung eines Werks in Form einer alphanumerischen, musikalischen oder choreografischen Notation, in Form von Ton, Bild, Gegenstand, Bewegung und so weiter oder einer Kombination solcher Formen handelt. @de
label: a pour expression d’une œuvre @fr
definition: Liittää teoksen ekspressioon, joka on teoksen toteutus, joka voi olla muodoltaan aakkosnumeerinen, musiikkinuotinnos, tanssinotaatio, ääntä, kuva, esine, liikettä tms. tai mikä tahansa tällaisten muotojen yhdistelmä. @fi
toolkit label: teoksen ekspressio @fi
toolkit definition: Ekspressio, joka on teoksen toteutus, joka voi olla muodoltaan aakkosnumeerinen, musiikkinuotinnos, tanssinotaatio, ääntä, kuva, esine, liikettä tms. tai mikä tahansa tällaisten muotojen yhdistelmä. @fi
toolkit label: uttrykk av verk @no
toolkit definition: En realisering av et verk i form av alfanumerisk, musikalsk eller koreografisk notasjon, lyd, bilde, gjenstand, bevegelse etc., eller enhver kombinasjon av slike former. @no
label: té com a expressió d’una obra @ca
definition: Relaciona una obra amb una expressió que és una realització d’una obra en la forma de notació alfanumèrica, musical o coreogràfica, de so, d’imatge, d’objecte, de moviment, etc., o de qualsevol combinació d’aquestes formes. @ca
toolkit label: expressió d’una obra @ca
toolkit definition: Expressió que és una realització d’una obra en la forma de notació alfanumèrica, musical o coreogràfica, de so, d’imatge, d’objecte, de moviment, etc., o de qualsevol combinació d’aquestes formes. @ca
sub property of: has related expression of work
has element type: 3
label: έχει έκφραση του έργου @el
definition: Συνδέει ένα έργο με μια υλοποίηση ενός έργου στη μορφή αλφαριθμητικής, μουσικής ή χορογραφικής σημειογραφίας, ήχου, εικόνας, κίνησης κ.λπ. ή οποιοσδήποτε συνδυασμός τέτοιων μορφών. @el
toolkit label: έκφραση του έργου @el
toolkit definition: Μια υλοποίηση ενός έργου στη μορφή αλφαριθμητικής, μουσικής ή χορογραφικής σημειογραφίας, ήχου, εικόνας, κίνησης κ.λπ. ή οποιοσδήποτε συνδυασμός τέτοιων μορφών. @el
label: mű kifejezési formája a következő: @hu
definition: Egy művet hozzákapcsol egy mű megvalósításához alfanumerikus, zenei vagy koreográfiai jelölési rendszer, hang, kép, tárgy, mozgás stb. formájában, vagy ilyen formák valamely kombinációjában. @hu
toolkit label: műhöz tartozó kifejezési forma @hu
toolkit definition: Egy mű megvalósítása alfanumerikus, zenei vagy koreográfiai jelölésrendszer, hang, kép, objektum, mozgás stb. formájában, vagy ilyen formák valamely kombinációjában. @hu
label: teoksen ekspressio @fi
label: har uttrykk av verk @no
definition: Relaterer et verk til en realisering av et verk i form av alfanumerisk, musikalsk eller koreografisk notasjon, lyd, bilde, gjenstand, bevegelse etc., eller enhver kombinasjon av slike former. @no
label: heeft expressie van werk @nl
definition: Relateert een werk aan een expressie die is een realisatie van een werk in de vorm van alfanumerieke, muziek- of choreografische notatie, geluid, beeld, object, beweging etc., of elke combinatie van zulke vormen. @nl
toolkit label: expressie van werk @nl
toolkit definition: Een expressie die is een realisatie van een werk in de vorm van alfanumerieke, muziek- of choreografische notatie, geluid, beeld, object, beweging etc., of elke combinatie van zulke vormen. @nl
label: له تعبيرة لعمل @ar
definition: يربط بين عمل وتعبيرة عبارة عن تحقيق لعمل في شكل تدوين هجائي-رقمي، أو موسيقي أو راقص، أو صوت، أو صورة، أو كائن، أو حركة، إلخ.، أو أي مزيج من مثل هذه الأشكال. @ar
toolkit label: تعبيرة لعمل @ar
toolkit definition: تعبيرة عبارة عن تحقيق لعمل في شكل تدوين هجائي-رقمي، أو موسيقي أو راقص، أو صوت، أو صورة، أو كائن، أو حركة، إلخ.، أو أي مزيج من مثل هذه الأشكال. @ar
label: teose väljendus @et
definition: Seostab teose teose realisatsiooniga teksti, muusika või koreograafilise notatsiooni, heli, pildi, eseme, liikumise vms vormis või nende kombinatsioonina. @et
toolkit label: teose väljendus @et
toolkit definition: Teose realisatsioon teksti, muusika- või koreograafilise notatsiooni, heli, pildi, eseme, liikumise vms vormis või nende kombinatsioonina. @et
label: ha come espressione di opera @it
definition: Correla un'opera a una realizzazione di un'opera in forma di notazione alfanumerica, musicale o coreografica, suono, immagine, oggetto, movimento, etc. o in una qualsiasi combinazione di queste forme. @it
toolkit label: espressione di opera @it
toolkit definition: Realizzazione di un'opera in forma di notazione alfanumerica, musicale o coreografica, suono, immagine, oggetto, movimento, etc. o in una qualsiasi combinazione di queste forme. @it
label: darba izteiksme @lv
definition: Sasaista darbu ar izteiksmi, kas ir darba realizācija burtu-ciparu veidā, mūzikas vai horeogrāfijas, skaņu, attēlu, priekšmetu, kustību u.tml., pierakstu formā vai jebkurā šo formu kombinācijā. (FRBR). @lv
toolkit label: darba izteiksme @lv
toolkit definition: Darba realizācija burtu-ciparu veidā, mūzikas vai horeogrāfijas, skaņu, attēlu, priekšmetu, kustību u.tml., pierakstu formā vai jebkurā šo formu kombinācijā. (FRBR) @lv
label: 有作品的内容表达 @zh-hans
definition: 将一种作品与作为一种作品的实现、以字母数字形式、乐谱或舞谱形式、声音、图像、物体、运动等形式、或者此类形式的任何组合的一种内容表达关联起来。 @zh-hans
toolkit label: 作品的内容表达 @zh-hans
toolkit definition: 作为一种作品的实现、以字母数字形式、乐谱或舞谱形式、声音、图像、物体、运动等形式、或者此类形式的任何组合的一种内容表达 @zh-hans
has subproperty: has representative expression
has subproperty: P10078
label: eserin anlatımı ile ilişkilidir @tr
definition: Bir eseri, alfanümerik, müzikal veya koreografik notasyon, ses, görüntü, nesne, hareket vb. veya bu tür biçimlerin herhangi bir kombinasyonu biçiminde gerçekleştirilmiş bir eserin anlatımıyla ilişkilendirir. @tr
toolkit label: eserin anlatımı @tr

is incidental music for work
status: Published
definition: Relates a work to a work that is a play or other work for the stage that is realized as spoken word and that is complemented by a musical work.
type: Property
domain: C10001
lexical alias: incidentalMusicForWork.en
toolkit label: incidental music for work
toolkit definition: A work that is a play or other work for the stage that is realized as spoken word and that is complemented by a musical work.
toolkit label: musique de scène pour une œuvre @fr
toolkit definition: Œuvre qui consiste en une pièce de théâtre ou une autre œuvre pour la scène qui est réalisée sous forme de parole énoncée et est complétée par une œuvre musicale. @fr
sub property of: is music for work
toolkit label: música incidental para (obra) @es
toolkit definition: Una obra tal como una obra de teatro u otra obra hablada para escenario que utiliza la obra musica como música incidental. @es
instruction number: 24.5
label: er ledsagemusik til værk @da
definition: Relaterer et værk til et værk, som er et skuespil eller andet sceneværk, som realiseres som tale, som er komplementeret af et musikværk. @da
toolkit label: ledsagemusik til værk @da
toolkit definition: Værk, som er et skuespil eller andet sceneværk, som realiseres som tale, som er komplementeret af et musikværk. @da
definition: Met une œuvre en relation avec une œuvre qui consiste en une pièce de théâtre ou une autre œuvre pour la scène qui est réalisée sous forme de parole énoncée et est complétée par une œuvre musicale. @fr
label: là âm nhạc nền của (tác phẩm) @vi
definition: Liên kết tác phẩm với tác phẩm như là kịch hoặc tác phẩm lời nói khác cho sân khấu sử dụng tác phẩm âm nhạc như là âm nhạc nền. @vi
toolkit label: âm nhạc nền của(tác phẩm) @vi
toolkit definition: Tác phẩm như là kịch hoặc tác phẩm lời nói khác cho sân khấu sử dụng tác phẩm âm nhạc như là âm nhạc nền. @vi
label: ist Bühnenmusik für (Werk) @de
definition: Setzt ein Werk in Beziehung zu einem Werk, bei dem es sich um ein Drama oder ein anderes, gesprochenes Bühnenwerk handelt, das durch ein Musikwerk vervollständigt wird. @de
toolkit label: Bühnenmusik für (Werk) @de
toolkit definition: Ein Werk, bei dem es sich um ein Drama oder ein anderes, gesprochenes Bühnenwerk handelt, das durch ein Musikwerk vervollständigt wird. @de
label: est une musique de scène pour une œuvre @fr
definition: Liittää teoksen teokseen, joka on näytelmä tai muu näyttämöteos, joka toteutuu puheena ja jota on täydennetty musiikkiteoksella. @fi
toolkit label: näytelmämusiikki teokseen @fi
toolkit definition: Teos, joka on näytelmä tai muu näyttämöteos, joka toteutuu puheena ja jota on täydennetty musiikkiteoksella. @fi
toolkit label: bakgrunnsmusikk for verk @no
toolkit definition: Et verk som er et skuespill eller annet sceneverk som realiseres som tale supplert av et musikalsk verk. @no
label: és música incidental per a una obra @ca
definition: Relaciona una obra amb una obra que és una obra de teatre o qualsevol altra obra escènica que es realitza com a obra de paraula parlada i que es complementa amb una obra musical. @ca
toolkit label: música incidental per a una obra @ca
toolkit definition: Obra que és una obra de teatre o qualsevol altra obra escènica que es realitza com a obra de paraula parlada i que es complementa amb una obra musical. @ca
has element type: 2
label: είναι μουσική του τυχαίου για (έργο) @el
definition: Συνδέει ένα έργο με ένα έργο, όπως ένα θεατρικό έργο ή άλλο έργο με προφορικό λόγο για τη σκηνή, το οποίο χρησιμοποιεί ένα μουσικό έργο ως μουσική του τυχαίου. @el
toolkit label: μουσική του τυχαίου για (έργο) @el
toolkit definition: Ένα έργο, όπως ένα θεατρικό έργο ή άλλο έργο με προφορικό λόγο για τη σκηνή, το οποίο χρησιμοποιεί ένα μουσικό έργο ως μουσική του τυχαίου. @el
label: kísérőzenéje a következő műnek: @hu
definition: Hozzákapcsol egy művet egy színdarabhoz vagy más beszélt színpadi műhöz, amelyet egy zenemű egészít ki. @hu
toolkit label: zenével kísért mű @hu
toolkit definition: Egy színdarab vagy más beszélt színpadi mű, amelyet egy zenemű egészít ki. @hu
label: näytelmämusiikki teokseen @fi
label: er bakgrunnsmusikk for verk @no
definition: Relaterer et verk til et verk som er et skuespill eller annet sceneverk som realiseres som tale supplert av et musikalsk verk. @no
label: is toneelmuziek voor werk @nl
definition: Relateert een werk aan een werk dat is een toneelstuk of ander podiumwerk dat gerealiseerd is als gesproken woord, en dat gecomplementeerd wordt door een muziekwerk. @nl
toolkit label: toneelmuziek voor werk @nl
toolkit definition: Een werk dat is een toneelstuk of ander podiumwerk dat gerealiseerd is als gesproken woord, en dat gecomplementeerd wordt door een muziekwerk. @nl
label: هو موسيقى تصويرية لعمل @ar
definition: يربط عمل بعمل مسرحي أو عمل آخر للمسرح يتحقق على أنه كلام منطوق ويكمله عمل موسيقي. @ar
toolkit label: موسيقى تصويرية لعمل @ar
toolkit definition: عمل مسرحي أو عمل آخر للمسرح الذي يتحقق على أنه كلمة منطوقة ويكملها عمل موسيقي. @ar
label: näidendimuusika teosele @et
definition: Seostab teose näidendi või muu lavateosega, mis on realiseeritud kõnena ja täiendatud muusikateosega. @et
toolkit label: näidendimuusika teosele @et
toolkit definition: Näidend või muu lavateos, mis on realiseeritud kõnena ja täiendatud muusikateosega. @et
label: è musica di scena per opera @it
definition: Correla un’opera a un’opera che è un dramma o altra opera destinata al teatro realizzata con il parlato che è completata da un’opera musicale. @it
toolkit label: musica di scena per opera @it
toolkit definition: Opera che è un dramma o altra opera destinata al teatro realizzata con il parlato che è completata da un’opera musicale. @it
label: ir uzveduma fona mūzika darbam @lv
definition: Sasaista darbu ar darbu, kas ir teātra izrāde vai cits skatuves darbs, kurā mūzikas darbs izmantots kā fona mūzika. @lv
toolkit label: uzveduma fona mūzika darbam @lv
toolkit definition: Darbs, kas ir teātra izrāde vai cits skatuves darbs, kurā mūzikas darbs izmantots kā fona mūzika. @lv
label: 是作品的配乐 @zh-hans
definition: 将一种作品与被一种音乐作品补充的作为一种戏剧或被口语实现的其他舞台作品的一种作品关联起来。 @zh-hans
toolkit label: 作品的配乐 @zh-hans
toolkit definition: 被一种音乐作品补充的作为一种戏剧或被口语实现的其他舞台作品的一种作品 @zh-hans
has subproperty: P10106
label: eser için fon müziğidir @tr
definition: Bir eseri, sözlü olarak gerçekleştirilen ve bir müzik eseriyle tamamlanan bir oyun veya sahne için başka bir eserle ilişkilendirir. @tr
toolkit label: eserin fon müziğidir @tr
toolkit definition: Bir oyun ya da diğer sahne eseri olup, sözlü olarak gerçekleştirilen ve bir müzik eseriyle tamamlanan bir eser. @tr

has incidental music work
status: Published
definition: Relates a work to a work that is a musical work that complements a work that is a play or other work for the stage that is realized as spoken word.
type: Property
domain: C10001
lexical alias: incidentalMusicWork.en
toolkit label: incidental music work
toolkit definition: A work that is a musical work that complements a work that is a play or other work for the stage that is realized as spoken word.
toolkit label: musique de scène (œuvre) @fr
toolkit definition: Œuvre musicale qui complète une œuvre qui est une pièce de théâtre ou une autre œuvre pour la scène réalisée sous forme de parole énoncée. @fr
sub property of: has music work
toolkit label: música incidental (obra) @es
toolkit definition: Una obra musical que proporciona música incidental para una obra de teatro u otra obra hablada para el escenario. @es
instruction number: 24.5
label: har ledsagemusikværk @da
definition: Relaterer et værk til et musikværk, som komplementerer et værk, som er et skuespil eller andet sceneværk, som realiseres som tale. @da
toolkit label: ledsagemusikværk @da
toolkit definition: Musikværk, som komplementerer et værk, som er et skuespil eller andet sceneværk, som realiseres som tale. @da
definition: Met une œuvre en relation avec une œuvre musicale qui complète une œuvre qui est une pièce de théâtre ou une autre œuvre pour la scène réalisée sous forme de parole énoncée. @fr
label: là âm nhạc nền (tác phẩm) @vi
definition: Liên kết tác phẩm với tác phẩm âm nhạc cung cấp âm nhạc nền cho kịch hoặc tác phẩm lời nói khác đối với sân khấu. @vi
toolkit label: tác phẩm âm nhạc nền @vi
toolkit definition: Tác phẩm âm nhạc cung cấp âm nhạc nền cho kịch hoặc tác phẩm lời nói khác đối với sân khấu. @vi
label: hat Bühnenmusik (Werk) @de
definition: Setzt ein Werk in Beziehung zu einem Musikwerk, das ein Drama oder ein anderes, gesprochenes Bühnenwerk ergänzt. @de
toolkit label: Bühnenmusik (Werk) @de
toolkit definition: Ein Musikwerk, das ein Drama oder ein anderes, gesprochenes Bühnenwerk ergänzt. @de
label: a pour musique de scène (œuvre) @fr
definition: Liittää teoksen musiikkiteokseen, joka täydentää teosta, joka on näytelmä tai muu näyttämöteos, joka toteutuu puheena. @fi
toolkit label: näytelmämusiikki (teos) @fi
toolkit definition: Liittää teoksen musiikkiteokseen, joka täydentää teosta, joka on näytelmä tai muu näyttämöteos, joka toteutuu puheena. @fi
toolkit label: bakgrunnsmusikk (verk) @no
toolkit definition: Et musikalsk verk som supplerer et verk som er et skuespill eller annet sceneverk for muntlig framføring. @no
label: té com a obra de música incidental @ca
definition: Relaciona una obra amb una obra que és una obra musical que complementa una obra que és una obra de teatre o una altra obra escènica que es realitza com a paraula parlada. @ca
toolkit label: obra de música incidental @ca
toolkit definition: Obra que és una obra musical que complementa una obra que és una obra de teatre o una altra obra escènica que es realitza com a paraula parlada. @ca
has element type: 2
label: είναι μουσική του τυχαίου (έργο) @el
definition: Συνδέει ένα έργο με ένα μουσικό έργο που παρέχει μουσική του τυχαίου για ένα θεατρικό έργο ή άλλο έργο με προφορικό λόγο για τη σκηνή. @el
toolkit label: μουσική του τυχαίου (έργο) @el
toolkit definition: Ένα μουσικό έργο που παρέχει μουσική του τυχαίου για ένα θεατρικό έργο ή άλλο έργο με προφορικό λόγο για τη σκηνή. @el
label: kísérőzenéje a következő műnek: @hu
definition: Hozzákapcsol egy művet egy zeneműhöz, amely kísérőzenét szolgáltat egy színdarabhoz vagy a színpad másik beszélt művéhez. @hu
toolkit label: kísérőzenemű @hu
toolkit definition: Egy zenemű, amely kísérőzenét szolgáltat egy színdarabhoz vagy a színpad másik beszélt művéhez. @hu
label: näytelmämusiikki (teos) @fi
label: har bakgrunnsmusikk (verk) @no
definition: Relaterer et verk til et musikalsk verk som supplerer et verk som er et skuespill eller annet sceneverk for muntlig framføring. @no
label: heeft toneelmuziekwerk @nl
definition: Relateert een werk aan een muziekwerk dat een werk complementeert dat een toneelstuk is of een ander werk voor podium dat gerealiseerd is als gesproken woord. @nl
toolkit label: toneelmuziekwerk @nl
toolkit definition: Een muziekwerk dat een werk complementeert dat een toneelstuk is of een ander werk voor podium dat gerealiseerd is als gesproken woord. @nl
label: له عمل موسيقي تصويري @ar
definition: يربط عمل بعمل موسيقي يكمل عملا متمثلا في مسرحية أو عملا آخر للمسرح يدرك ككلمة منطوقة. @ar
toolkit label: عمل موسيقي تصويري @ar
toolkit definition: عمل موسيقي يكمل عملاً متمثلا في مسرحية أو عملًا آخر للمسرح يدرك ككلمة منطوقة. @ar
label: näidendimuusika (teos) @et
definition: Seostab teose muusikateosega, mis täiendab näidendit või muud kõnel põhinevat lavateost. @et
toolkit label: näidendimuusika (teos) @et
toolkit definition: Muusikateos, mis täiendab näidendit või muud kõnel põhinevat lavateost. @et
label: ha come musica di scena opera @it
definition: Correla un’opera a un’opera musicale che accompagna un’opera che è un dramma o altra opera destinata al teatro realizzata con il parlato. @it
toolkit label: musica di scena opera @it
toolkit definition: Opera musicale che accompagna un’opera che è un dramma o altra opera destinata al teatro realizzata con il parlato. @it
label: darbs: uzveduma fona mūzika @lv
definition: Sasaista darbu ar mūzikas darbu, kas papildina darbu, kas ir luga vai cits skatuves darbs, kas realizēts kā mutvārdi. @lv
toolkit label: darbs: uzveduma fona mūzika @lv
toolkit definition: Mūzikas darbs, kas papildina darbu, kas ir luga vai cits skatuves darbs, kas realizēts kā mutvārdi. @lv
label: 有配乐作品 @zh-hans
definition: 将一种作品与作为一种音乐作品并补充作为戏剧或被口语实现的其他舞台作品的一种作品关联起来。 @zh-hans
toolkit label: 配乐作品 @zh-hans
toolkit definition: 作为一种音乐作品并补充作为戏剧或被口语实现的其他舞台作品的一种作品 @zh-hans
has subproperty: P10031
label: fon müziği eseri ile ilişkilidir @tr
definition: Bir eseri, bir oyun veya sahne için sözlü olarak gerçekleştirilen başka bir eser olan bir eseri tamamlayan bir müzik eseri olan eserle ilişkilendirir. @tr
toolkit label: fon müziği eseri ile ilişkilidir @tr
toolkit definition: Bir oyun veya sahne için sözlü olarak gerçekleştirilen başka bir eseri tamamlayan bir müzik eseri olan eser. @tr

has preferred title of work
status: Published
definition: Relates a work to a nomen that is a title of work that is selected for preference in a specific application or context.
type: Property
domain: C10001
sub property of: has title of work
lexical alias: preferredTitleOfWork.en
instruction number: 6.2.2
toolkit label: preferred title of work
toolkit definition: A nomen that is a title of work that is selected for preference in a specific application or context.
scope note: Le titre privilégié constitue aussi l’élément de base d’un point d’accès autorisé représentant cette œuvre. @fr
toolkit label: titre privilégié d’une œuvre @fr
toolkit definition: Nomen qui est un titre d’œuvre faisant l’objet d’un choix privilégié dans une application ou un contexte spécifiques. @fr
toolkit label: título preferido de la obra @es
toolkit definition: El título o forma del título elegido para identificar la obra. @es
label: har föredragen titel för verket @sv
toolkit label: föredragen titel för verket @sv
label: har foretrukken titel på værk @da
definition: Relaterer et værk til en titel på værk, som er valgt som præference i en specifik anvendelse eller kontekst. @da
scope note: Den foretrukne titel er også grundlag for en autoriseret søgeindgang der repræsenterer værket. @da
toolkit label: foretrukken titel på værk @da
toolkit definition: Titel på værk, som er valgt som præference i en specifik anvendelse eller kontekst. @da
definition: Met une œuvre en relation avec un nomen qui est un titre d’œuvre faisant l’objet d’un choix privilégié dans une application ou un contexte spécifiques. @fr
label: có nhan đề ưu tiên của tác phẩm @vi
definition: Liên kết tác phẩm với nhan đề hoặc hình thái của nhan đề được chọn để nhận dạng tác phẩm. @vi
scope note: Nhan đề ưu tiên cũng là cơ sở cho điểm truy cập được phép trình bày tác phẩm đó. @vi
toolkit label: nhan đề ưu tiên của tác phẩm @vi
toolkit definition: Nhan đề hoặc hình thái của nhan đề được chọn để nhận dạng tác phẩm. @vi
label: hat bevorzugten Titel eines Werks @de
definition: Setzt ein Werk in Beziehung zu einem Titel eines Werks, der in einer bestimmten Anwendung oder in einem bestimmten Kontext als Vorzugsform bestimmt wird. @de
scope note: Der bevorzugte Titel ist auch die Grundlage für den normierten Sucheinstieg, der dieses Werk repräsentiert. @de
toolkit label: Bevorzugter Titel eines Werks @de
toolkit definition: Ein Titel eines Werks, der in einer bestimmten Anwendung oder in einem bestimmten Kontext als Vorzugsform bestimmt wird. @de
label: a pour titre privilégié d’une œuvre @fr
definition: Liittää teoksen nomeniin, joka on teoksen nimeke, joka on valittu ensisijaiseksi tietyssä sovelluksessa tai kontekstissa. @fi
toolkit label: teoksen ensisijainen nimeke @fi
toolkit definition: Nomen, joka on teoksen nimeke, joka on valittu ensisijaiseksi tietyssä sovelluksessa tai kontekstissa. @fi
toolkit label: foretrukket tittel på verk @no
toolkit definition: En tittel på verk som er valgt som preferanse i en spesifikk applikasjon eller sammenheng. @no
label: té com a títol preferit d’obra @ca
definition: Relaciona una obra amb un nomen que és un títol d’obra que se selecciona com a preferent en una aplicació o un context específic. @ca
scope note: El títol preferit és també la base d’un punt d’accés autoritzat que representa l’obra. @ca
toolkit label: títol preferit d’obra @ca
toolkit definition: Nomen que és un títol d’obra que se selecciona com a preferent en una aplicació o un context específic. @ca
has element type: 3
label: έχει προτιμώμενο τίτλο για έργο @el
definition: Συνδέει ένα έργο με έναν τίτλο ή μορφή του τίτλου που επιλέγεται για την ταύτιση ενός έργου. @el
scope note: Ο προτιμώμενος τίτλος είναι επίσης η βάση για το καθιερωμένο σημείο πρόσβασης που αναπαριστά αυτό το έργο. @el
toolkit label: προτιμώμενος τίτλος για έργο @el
toolkit definition: Ένας τίτλος ή μορφή του τίτλου που επιλέγεται για την ταύτιση ενός έργου. @el
label: műhöz tartozó előnyben részesített címe a következő: @hu
definition: Hozzákapcsol egy művet egy nomenhez, amely egy olyan műcím, amelyet egy adott alkalmazásban vagy kontextusban előnyben részesítenek. @hu
scope note: A kitűntetett vagy preferált cím alapja a művet képviselő meghatalmazott hozzáférési pontnak is. @hu
toolkit label: mű kitüntetett címe: @hu
toolkit definition: Egy nomen, amely egy olyan műcím, amelyet egy adott alkalmazásban vagy kontextusban előnyben részesítenek. @hu
sub property of: P00021
alternative label: preferred title for work
label: teoksen ensisijainen nimeke @fi
label: har foretrukket tittel på verk @no
definition: Relaterer et verk til en tittel på verk som er valgt som preferanse i en spesifikk applikasjon eller sammenheng. @no
label: heeft geprefereerde titel van werk @nl
definition: Relateert een werk aan een nomen dat is een titel van werk die bij voorkeur geselecteerd is in een specifieke applicatie of context. @nl
toolkit label: geprefereerde titel van werk @nl
toolkit definition: Een nomen dat is een titel van werk die bij voorkeur geselecteerd is in een specifieke applicatie of context. @nl
label: له عنوان مفضل لعمل @ar
definition: يربط بين عمل وتسمية عبارة عن عنوان عمل تم اختياره بتفضيل استخدامه في تطبيق أو سياق محدد. @ar
toolkit label: عنوان مفضل لعمل @ar
toolkit definition: تسمية عبارة عن عنوان عمل تم اختياره بتفضيل استخدامه في تطبيق أو سياق محدد. @ar
label: teose eelispealkiri @et
definition: Seostab teose teose pealkirjaga, mis kindlas rakenduses või kontekstis on valitud eelistatuks. @et
toolkit label: teose eelispealkiri @et
toolkit definition: Teose pealkiri, mis kindlas rakenduses või kontekstis on valitud eelistatuks. @et
label: ha come titolo preferito dell'opera @it
definition: Correla un’opera a un titolo dell’opera scelto come preferito in un ambito di utilizzo o contesto specifici. @it
toolkit label: titolo preferito dell'opera @it
toolkit definition: Ttolo dell’opera che è scelto come preferito in un ambito di utilizzo o contesto specifici. @it
label: darba prioritārais nosaukums @lv
definition: Sasaista darbu ar nomenu, kas ir darba nosaukums, kas ir izvēlēts noteiktam lietojumam vai noteiktā kontekstā. @lv
toolkit label: darba prioritārais nosaukums @lv
toolkit definition: Darba nosaukums, kas ir izvēlēts noteiktam lietojumam vai noteiktā kontekstā. @lv

is abstract of
status: Published
definition: Relates a work to a work that is summarized in an objective manner.
type: Property
domain: C10001
toolkit label: abstract of
toolkit definition: A work that is summarized in an objective manner.
toolkit label: résumé analytique de @fr
toolkit definition: Œuvre qui est résumée de manière objective. @fr
toolkit label: resumen de (obra) @es
toolkit definition: Una obra que ha sido resumida, i.e., abreviada en una forma breve y objetiva. @es
instruction number: 24.5
label: er sammenfatning af værk @da
definition: Relaterer et værk til et værk, som er sammenfattet på en kortfattet, objektiv måde. @da
toolkit label: sammenfatning af værk @da
toolkit definition: Værk, som er sammenfattet på en kortfattet, objektiv måde. @da
definition: Met une œuvre en relation avec une œuvre qui est résumée de manière objective. @fr
label: là tóm tắt của (tác phẩm) @vi
definition: Liên kết tác phẩm với tác phẩm đã được tóm tắt, nghĩa là, tóm tắt theo cách thức ngắn gọn và khách quan. @vi
toolkit label: tóm tắt của (tác phẩm) @vi
toolkit definition: Tác phẩm đã được tóm tắt, nghĩa là, tóm tắt theo cách thức ngắn gọn và khách quan. @vi
label: ist Abstract von (Werk) @de
definition: Setzt ein Werk in Beziehung zu einem Werk, das auf eine kurze, sachliche Art gekürzt ist. @de
toolkit label: Abstract von (Werk) @de
toolkit definition: Ein Werk, das auf eine kurze, sachliche Art gekürzt ist. @de
label: est un résumé analytique de @fr
definition: Liittää teoksen teokseen, joka on lyhennetty objektiivisella tavalla. @fi
toolkit label: abstrakti teoksesta @fi
toolkit definition: Teos, joka on lyhennetty objektiivisella tavalla. @fi
toolkit label: abstrakt av verk @no
toolkit definition: Et verk som er forkortet i et kortfattet, objektivt sammendrag. @no
label: és resum de @ca
definition: Relaciona una obra amb una obra que se sumaritza de manera objectiva. @ca
toolkit label: resum de @ca
toolkit definition: Obra que se sumaritza de manera objectiva. @ca
has element type: 2
label: είναι επιτομή του (έργο) @el
definition: Συνδέει ένα έργο με ένα έργο που συνοψίζεται, δηλαδή συμπτύσσεται με σύντομο, αντικειμενικό τρόπο. @el
toolkit label: επιτομή του (έργο) @el
toolkit definition: Ένα έργο που συνοψίζεται, δηλαδή συμπτύσσεται με σύντομο, αντικειμενικό τρόπο. @el
label: absztraktja a következő műnek: @hu
definition: Hozzákapcsol egy művet egy műhöz, amelyet rövid, objektív módon lerövidítettek. @hu
toolkit label: absztraktként kivonatolt mű @hu
toolkit definition: Egy mű, amelyet rövid, objektív módon lerövidítettek. @hu
label: abstrakti teoksesta @fi
label: er abstrakt av verk @no
definition: Relaterer et verk til et verk som er forkortet i et kortfattet, objektivt sammendrag. @no
label: is abstract van werk @nl
definition: Relateert een werk aan een werk dat verkort is op een korte, objectieve manier. @nl
toolkit label: abstract van werk @nl
toolkit definition: Een werk dat verkort is op een korte, objectieve manier. @nl
label: هو ملخص لعمل @ar
definition: يربط عمل بعمل يتم اختصاره بطريقة موجزة وموضوعية. @ar
toolkit label: ملخص لعمل @ar
toolkit definition: عمل يتم اختصاره بطريقة موجزة وموضوعية. @ar
label: annotatsioon teosele @et
definition: Seostab teose teosega, mille sisu on lühidalt ja objektiivselt kokku võetud. @et
toolkit label: annotatsioon teosele @et
toolkit definition: Teos, mille sisu on lühidalt ja objektiivselt kokku võetud. @et
alternative label: összefoglaló @hu
label: è abstract di opera @it
definition: Correla un’opera a un’opera ridotta in maniera sintetica e obiettiva. @it
toolkit label: abstract di opera @it
toolkit definition: Opera ridotta in maniera sintetica e obiettiva. @it
sub property of: is summary of
lexical alias: abstractOf.en
label: ir anotētais darbs @lv
definition: Sasaista darbu ar darbu, kuru atreferē saīsinātā, objektīvā veidā. @lv
toolkit label: anotētais darbs @lv
toolkit definition: Darbs, kuru atreferē saīsinātā, objektīvā veidā. @lv
label: 是……的摘要 @zh-hans
definition: 将一种作品与被客观提要的一种作品关联起来。 @zh-hans
toolkit label: ……的摘要 @zh-hans
toolkit definition: 被客观提要的一种作品 @zh-hans
alternative label: résumé analytique d’une œuvre @fr
has subproperty: P10126
label: özetidir @tr
definition: Bir eseri, tarafsız biçimde özetlenen bir eserle ilişkilendirir. @tr
toolkit label: özet @tr
toolkit definition: Tarafsız biçimde özetlenen çalışma. @tr

is digest of work
status: Published
definition: Relates a work to a work that is a systematic and comprehensive condensing of a related work.
type: Property
domain: C10001
sub property of: has source work
lexical alias: digestOfWork.en
toolkit label: digest of work
toolkit definition: A work that is a systematic and comprehensive condensing of a related work.
toolkit label: condensé d’une œuvre @fr
toolkit definition: Œuvre qui consiste en un abrégement systématique et complet d’une œuvre en relation. @fr
toolkit label: compendio de (obra) @es
toolkit definition: Una obra que ha sido resumida, i.e., condensada sistemática e integralmente. @es
instruction number: 24.5
label: er sammendrag af værk @da
definition: Relaterer et værk til et værk, som er en systematisk og gennemgribende komprimering af et relateret værk. @da
toolkit label: sammendrag af værk @da
toolkit definition: Værk, som er en systematisk og gennemgribende komprimering af et relateret værk. @da
definition: Met une œuvre en relation avec une œuvre qui consiste en un abrégement systématique et complet d’une œuvre en relation. @fr
label: là vựng tập của (tác phẩm) @vi
definition: Liên kết tác phẩm với tác phẩm đã được làm vựng tập, nghĩa là, làm gọn một cách có hệ thống và toàn diện. @vi
toolkit label: vựng tập của (tác phẩm) @vi
toolkit definition: Tác phẩm đã được làm vựng tập, nghĩa là, làm gọn một cách có hệ thống và toàn diện. @vi
label: ist Digest von (Werk) @de
definition: Setzt ein Werk in Beziehung zu einem Werk, das eine systematische und umfassende Verdichtung eines in Beziehung stehenden Werks darstellt. @de
toolkit label: Digest von (Werk) @de
toolkit definition: Ein Werk, das eine systematische und umfassende Verdichtung eines in Beziehung stehenden Werks darstellt. @de
label: est un condensé d’une œuvre @fr
definition: Liittää teoksen teokseen, joka on siihen liittyvän teoksen systemaattinen ja kokonaisvaltainen tiivistelmä. @fi
toolkit label: mukautettu lyhennelmä teoksesta @fi
toolkit definition: Teos, joka on siihen liittyvän teoksen systemaattinen ja kokonaisvaltainen tiivistelmä. @fi
toolkit label: resymé av verk @no
toolkit definition: Et verk som er systematisk og sterkt forkortet. @no
label: és compendi d’una obra @ca
definition: Relaciona una obra amb una obra que és una condensació sistemàtica i exhaustiva d’una obra relacionada. @ca
toolkit label: compendi d’una obra @ca
toolkit definition: Obra que és una condensació sistemàtica i exhaustiva d’una obra relacionada. @ca
label: είναι επιτομή του (έργο) @el
definition: Συνδέει ένα έργο με ένα έργο το οποίο έχει συντμηθεί, δηλαδή υφίσταται συστηματική και περιεκτική συμπύκνωση. @el
toolkit label: επιτομή του (έργο) @el
toolkit definition: Ένα έργο το οποίο έχει συντμηθεί, δηλαδή υφίσταται συστηματική και περιεκτική συμπύκνωση. @el
label: kivonata a következő műnek: @hu
definition: Hozzákapcsol egy művet egy műhöz, amely egy kapcsolódó mű módszeres és átfogó tömörítése. @hu
toolkit label: kivonatolt mű @hu
toolkit definition: Egy mű, amely egy kapcsolódó mű módszeres és átfogó tömörítése. @hu
label: mukautettu lyhennelmä teoksesta @fi
label: er resymé av verk @no
definition: Relaterer et verk til et verk som er systematisk og sterkt forkortet. @no
label: is digest van werk @nl
definition: Relateert een werk aan een werk dat een systematische en alomvattende concentratie is van een gerelateerd werk. @nl
toolkit label: digest van werk @nl
toolkit definition: Een werk dat een systematische en alomvattende concentratie is van een gerelateerd werk. @nl
label: هو موجز لعمل @ar
definition: يربط عمل بعمل عبارة عن تكثيف منهجي وشامل لعمل ذي صلة. @ar
toolkit label: موجز لعمل @ar
toolkit definition: عمل عبارة عن تكثيف منهجي وشامل لعمل ذي صلة. @ar
label: referaat teosest @et
definition: Seostab teose teosega, mille süstemaatiline ja igakülgne kokkuvõte teos on. @et
toolkit label: referaat teosest @et
toolkit definition: Teos, mille süstemaatiline ja igakülgne kokkuvõte teos on. @et
label: è compendio di opera @it
definition: Correla un’opera a un’opera che è un riassunto sistematico ed esaustivo di un’opera correlata. @it
toolkit label: compendio di opera @it
toolkit definition: Opera che è un riassunto sistematico ed esaustivo di un’opera correlata. @it
has element type: 3
label: ir īssavilkums darbam @lv
definition: Sasaista darbu ar darbu, kas ir saistīta darba sistemātisks un aptverošs īss apskats. @lv
toolkit label: īssavilkums darbam @lv
toolkit definition: Darbs, kas ir saistīta darba sistemātisks un aptverošs īss apskats. @lv
label: 是作品的文摘 @zh-hans
definition: 将一种作品与作为一种相关作品的系统而全面压缩的一种作品关联起来。 @zh-hans
toolkit label: 作品的文摘 @zh-hans
toolkit definition: 作为一种相关作品的系统而全面压缩的一种作品 @zh-hans
has subproperty: P10139
label: eserin özetidir @tr
definition: Bir eseri, ilgili bir eserin sistematik ve kapsamlı bir şekilde derlendiği bir eserle ilişkilendirir. @tr
toolkit label: eserin özeti @tr
toolkit definition: İlgili bir çalışmanın sistematik ve kapsamlı bir şekilde özetlendiği bir eser. @tr

is abstracts for work
status: Published
definition: Relates a work to a work that is abstracted by another work.
type: Property
domain: C10001
sub property of: has source work
lexical alias: abstractsForWork.en
toolkit label: abstracts for work
toolkit definition: A work that is abstracted by another work.
toolkit label: résumés analytiques pour une œuvre @fr
toolkit definition: Œuvre qui est résumée analytiquement par une autre œuvre. @fr
toolkit label: resúmenes de (obra) @es
toolkit definition: Una obra cuyo contenido ha sido resumido por un servicio de indización y resumenes. @es
instruction number: 24.5
label: er sammenfatninger af værk @da
definition: Relaterer et værk til et værk, som er sammenfattet af et andet værk. @da
toolkit label: sammenfatninger af værk @da
toolkit definition: Værk, som er sammenfattet af et andet værk. @da
definition: Met une œuvre en relation avec une œuvre qui est résumée analytiquement par une autre œuvre. @fr
label: là tóm tắt của (tác phẩm) @vi
definition: Liên kết tác phẩm với tác phẩm mà nội dung của nó được tóm tắt bởi dịch vụ tóm tắt và định chỉ mục. @vi
toolkit label: tóm tắt của (tác phẩm) @vi
toolkit definition: Tác phẩm mà nội dung của nó được tóm tắt bởi dịch vụ tóm tắt và định chỉ mục. @vi
label: ist Abstracts für (Werk) @de
definition: Setzt ein Werk in Beziehung zu einem Werk, das durch ein anderes Werk zusammengefasst wird. @de
toolkit label: Abstracts für (Werk) @de
toolkit definition: Ein Werk, das durch ein anderes Werk zusammengefasst wird. @de
label: consiste en résumés analytiques pour une œuvre @fr
definition: Liittää teoksen teokseen, jonka toinen teos on abstrahoinut. @fi
toolkit label: abstraktit teoksesta @fi
toolkit definition: Teos, jonka toinen teos on abstrahoinut. @fi
toolkit label: abstrakt for verk @no
toolkit definition: Et verk som er i sammendrag i et annet verk. @no
label: és resums per a una obra @ca
definition: Relaciona una obra amb una obra que es resumeix per una altra obra. @ca
toolkit label: resums per a una obra @ca
toolkit definition: Obra que es resumeix per una altra obra. @ca
has element type: 2
label: είναι επιτομές για (έργο) @el
definition: Συνδέει ένα έργο με ένα έργο του οποίου τα περιεχόμενα συνοψίζονται από μια υπηρεσία επιτομής και ευρετηρίασης. @el
toolkit label: επιτομές για (έργο) @el
toolkit definition: Ένα έργο του οποίου τα περιεχόμενα συνοψίζονται από μια υπηρεσία επιτομής και ευρετηρίασης. @el
label: absztraktjai a következő műnek: @hu
definition: Hozzákapcsol egy művet egy műhöz, amelyet egy másik mű absztrahált. @hu
toolkit label: absztraktokként kivonatolt mű @hu
toolkit definition: Egy mű, amelyet egy másik mű absztrahált. @hu
label: abstraktit teoksesta @fi
label: er abstrakt for verk @no
definition: Relaterer et verk til et verk som er i sammendrag i et annet verk. @no
label: is abstracts voor werk @nl
definition: Relateert een werk aan een werk dat geabstraheerd is door een ander werk. @nl
toolkit label: abstracts voor werk @nl
toolkit definition: Een werk dat geabstraheerd is door een ander werk. @nl
label: هو ملخصات لعمل @ar
definition: يربط عمل بعمل يتم استخلاصه بعمل آخر. @ar
toolkit label: ملخصات لعمل @ar
toolkit definition: عمل يتم استخلاصه بعمل آخر. @ar
label: annotatsioonid teosele @et
definition: Seostab teose teosega, mis on annoteeritud teises teoses. @et
toolkit label: annotatsioonid teosele @et
toolkit definition: Teos, mis on annoteeritud teises teoses. @et
label: è abstract per opera @it
definition: Correla un’opera a un’opera che ha come abstract un’altra opera. @it
toolkit label: abstract per opera @it
toolkit definition: Opera che ha come abstract un’altra opera. @it
label: ir rezumētais darbs @lv
definition: Sasaista darbu ar darbu, kuru rezumē cits darbs. @lv
toolkit label: rezumētais darbs @lv
toolkit definition: Darbs, kuru rezumē cits darbs @lv
label: 是作品的摘要 @zh-hans
definition: 将一种作品与被另一种作品编制摘要的一种作品关联起来。 @zh-hans
toolkit label: 作品的摘要 @zh-hans
toolkit definition: 被另一种作品编制摘要的一种作品 @zh-hans
has subproperty: P10193
label: eseri özetler @tr
definition: Bir eseri, başka bir eser tarafından soyutlanmış bir eserle ilişkilendirir. @tr
toolkit label: eser için özetler @tr
toolkit definition: Başka bir eser tarafından özetlenen bir eser. @tr

is concordance to work (Deprecated)
definition: Relates a work to a work used as a basis for an index of all or selected words that occur in a realization of a textual work. (Deprecated)
type: Property
domain: C10001
sub property of: is augmentation of work
lexical alias: concordanceToWork.en
toolkit label: concordance to work (Deprecated)
toolkit definition: A work used as a basis for an index of all or selected words that occur in a realization of a textual work. (Deprecated)
toolkit label: concordance d’une œuvre @fr
toolkit definition: Œuvre qui sert de base à un index de la totalité ou d’une partie des mots qui apparaissent dans une réalisation d’une œuvre textuelle. @fr
toolkit label: concordancia de (obra) @es
toolkit definition: Una obra utilizada como base de una concordancia, i.e., un índice de todas las palabras en la obra principal. @es
instruction number: 24.5
label: er konkordans til værk @da
definition: Relaterer et værk til et værk, som anvendes som grundlag for et indeks over alle ordene i værket. @da
toolkit label: konkordans til værk @da
toolkit definition: Værk, som anvendes som grundlag for et indeks over alle ordene i værket. @da
definition: Met une œuvre en relation avec une œuvre qui sert de base à un index de la totalité ou d’une partie des mots qui apparaissent dans une réalisation d’une œuvre textuelle. @fr
label: là sách dẫn của (tác phẩm) @vi
definition: Liên kết tác phẩm với tác phẩm được sử dụng như là cơ sở cho sách dẫn, nghĩa là, chỉ mục tất cả các từ trong tác phẩm nổi trội. @vi
toolkit label: sách dẫn của (tác phẩm) @vi
toolkit definition: Tác phẩm được sử dụng như là cơ sở cho sách dẫn, nghĩa là, chỉ mục tất cả các từ trong tác phẩm nổi trội. @vi
label: ist Konkordanz zu (Werk) @de
definition: Setzt ein Werk in Beziehung zu einem Werk, das als Grundlage für einen Index aller oder ausgewählter Wörter verwendet wird, die in einer Realisierung eines textlichen Werks vorkommen. @de
toolkit label: Konkordanz zu (Werk) @de
toolkit definition: Ein Werk, das als Grundlage für einen Index aller oder ausgewählter Wörter verwendet wird, die in einer Realisierung eines textlichen Werks vorkommen. @de
label: est une concordance d’une œuvre @fr
definition: Liittää teoksen tekstiteoksen toteutuksessa esiintyvien kaikkien tai valikoitujen sanojen hakemiston perustana käytettyyn teokseen. @fi
toolkit label: konkordanssihakemisto teokseen @fi
toolkit definition: Tekstiteoksen toteutuksessa esiintyvien kaikkien tai valikoitujen sanojen hakemiston perustana käytetty teos. @fi
toolkit label: konkordans for verk @no
toolkit definition: Et verk som brukes som utgangspunkt for et register over alle ordene i verket. @no
label: és concordança d’una obra @ca
definition: Relaciona una obra amb una obra usada com a base d’un índex de totes les paraules o de les seleccionades que apareixen en una realització d’una obra textual. @ca
toolkit label: concordança d’una obra @ca
toolkit definition: Obra usada com a base d’un índex de totes les paraules o de les seleccionades que apareixen en una realització d’una obra textual. @ca
has element type: 2
label: είναι συμφραστικός πίνακας λέξεων στο (έργο) @el
definition: Συνδέει ένα έργο με ένα έργο το οποίο χρησιμοποιείται ως η βάση για έναν συμφραστικό πίνακα λέξεων δηλαδή ένα ευρετήριο όλων των λέξεων σε ένα κύριο έργο. @el
toolkit label: συμφραστικός πίνακας λέξεων στο (έργο) @el
toolkit definition: Ένα έργο το οποίο χρησιμοποιείται ως η βάση για έναν συμφραστικό πίνακα λέξεων δηλαδή ένα ευρετήριο όλων των λέξεων σε ένα κύριο έργο. @el
label: konkordanciája a következő műnek: @hu
definition: Hozzákapcsol egy művet egy műhöz, amelyet alapként használnak egy szöveges mű összes szavának vagy válogatott szavak mutatójához. @hu
toolkit label: konkordanciával ellátott mű @hu
toolkit definition: Egy mű, amelyet alapként használnak egy szöveges mű összes szavának vagy válogatott szavak mutatójához. @hu
label: konkordanssihakemisto teokseen @fi
label: er konkordans for verk @no
definition: Relaterer et verk til et verk som brukes som utgangspunkt for et register over alle ordene i verket. @no
label: is concordantie op werk @nl
definition: Relateert een werk aan een werk gebruikt als een basis voor een index van alle of geselecteerde woorden die voorkomen in een realisatie in een tekstwerk. @nl
toolkit label: concordantie op werk @nl
toolkit definition: Een werk gebruikt als een basis voor een index van alle of geselecteerde woorden die voorkomen in een realisatie in een tekstwerk. @nl
label: هو كشاف نصوص لعمل @ar
definition: يربط عمل بعمل يُستخدم كأساس لكشاف لكل الكلمات أو الكلمات المختارة المتحققة في عمل نصي. @ar
toolkit label: كشاف نصوص لعمل @ar
toolkit definition: عمل يُستخدم كأساس لكشاف لكل الكلمات أو الكلمات المختارة المتحققة في عمل نصي. @ar
label: konkordants teosele @et
definition: Seostab teose teosega, mis on aluseks teose kõigi sõnade registrile. @et
toolkit label: konkordants teosele @et
toolkit definition: Teos, mis on aluseks teose kõigi sõnade registrile. @et
label: è concordanza per opera @it
definition: Correla un'opera a un'opera usata come base per un indice di tutte le parole nell’opera. @it
toolkit label: concordanza per opera @it
toolkit definition: Opera usata come base per un indice di tutte le parole nell’opera. @it
status: Deprecated
label: ir konkordance darbam @lv
definition: Sasaista darbu ar darbu, kas izmantots par pamatu konkordancei, t.i., visu lietoto vārdu rādītājam kādā darbā. @lv
toolkit label: konkordance darbam @lv
toolkit definition: Darbs, kas izmantots par pamatu konkordancei, t.i., visu lietoto vārdu rādītājam kādā darbā. @lv
has subproperty: P10181

is choreographic adaptation of work
status: Published
definition: Relates a work to a work that is adapted as a choreographic work.
type: Property
domain: C10001
sub property of: is adaptation of work
lexical alias: choreographicAdaptationOfWork.en
toolkit label: choreographic adaptation of work
toolkit definition: A work that is adapted as a choreographic work.
toolkit label: adaptation chorégraphique d’une œuvre @fr
toolkit definition: Œuvre qui est adaptée en œuvre chorégraphique. @fr
toolkit label: adaptación coreográfica de (obra) @es
toolkit definition: Una obra que ha sido adaptada como una obra que consiste en movimiento (p. ej., danza). @es
instruction number: 24.5
label: er koreografisk bearbejdning af værk @da
definition: Relaterer et værk til et værk, som er bearbejdet til et koreografisk værk. @da
toolkit label: koreografisk bearbejdning af værk @da
toolkit definition: Værk, som er bearbejdet til et koreografisk værk. @da
definition: Met une œuvre en relation avec une œuvre qui est adaptée en œuvre chorégraphique. @fr
label: là phỏng theo nghệ thuật bố trí của (tác phẩm) @vi
definition: Liên kết tác phẩm với tác phẩm đã được cập nhật như là tác phẩm có chứa động thái. @vi
toolkit label: phỏng theo nghệ thuật bố trí của (tác phẩm) @vi
toolkit definition: Tác phẩm đã được cập nhật như là tác phẩm có chứa động thái. @vi
label: ist choreografische Bearbeitung von (Werk) @de
definition: Setzt ein Werk in Beziehung zu einem Werk, das als choreografisches Werk bearbeitet ist. @de
toolkit label: Choreografische Bearbeitung von (Werk) @de
toolkit definition: Ein Werk, das als choreografisches Werk bearbeitet ist. @de
label: est une adaptation chorégraphique d’une œuvre @fr
definition: Liittää teoksen teokseen, joka on sovitettu koreografiseksi teokseksi. @fi
toolkit label: koreografinen sovitus teoksesta @fi
toolkit definition: Teos, joka on sovitettu koreografiseksi teokseksi. @fi
toolkit label: koreografisk bearbeidelse av verk @no
toolkit definition: Et verk som er bearbeidet til et koreografisk verk. @no
label: és adaptació coreogràfica d’una obra @ca
definition: Relaciona una obra amb una obra que s’adapta com una obra coreogràfica. @ca
toolkit label: adaptació coreogràfica d’una obra @ca
toolkit definition: Obra que s’adapta com una obra coreogràfica. @ca
has element type: 2
label: είναι χορογραφική προσαρμογή του (έργο) @el
definition: Συνδέει ένα έργο με ένα έργο το οποίο έχει προσαρμοστεί ως ένα έργο που αποτελείται από κίνηση. @el
toolkit label: χορογραφική προσαρμογή του (έργο) @el
toolkit definition: Ένα έργο το οποίο έχει προσαρμοστεί ως ένα έργο που αποτελείται από κίνηση. @el
label: koreografikus adaptációja a következő műnek: @hu
definition: Hozzákapcsol egy művet egy műhöz, amelyet koreografikus műként adaptáltak. @hu
toolkit label: koreografikusan átdolgozott mű @hu
toolkit definition: Egy mű, amelyet koreografikus műként adaptáltak. @hu
label: koreografinen sovitus teoksesta @fi
label: er koreografisk bearbeidelse av verk @no
definition: Relaterer et verk til et verk som er bearbeidet til et koreografisk verk. @no
label: is choreografische bewerking van werk @nl
definition: Relateert een werk aan een werk dat is bewerkt als een choreografisch werk. @nl
toolkit label: choreografische bewerking van werk @nl
toolkit definition: Een werk dat is bewerkt als een choreografisch werk. @nl
label: هو معالجة راقصة لعمل @ar
definition: يربط عمل بعمل تمت معالجته كعمل راقص. @ar
toolkit label: معالجة راقصة لعمل @ar
toolkit definition: عمل تمت معالجته كعمل راقص. @ar
label: koreograafiline adapteering teosest @et
definition: Seostab teose teosega, mis on adapteeritud koreograafilise teosena. @et
toolkit label: koreograafiline adapteering teosest @et
toolkit definition: Teos, mis on adapteeritud koreograafilise teosena. @et
alternative label: Choreographische Bearbeitung von (Werk) @de
label: è un adattamento coreografico di opera @it
definition: Correla un'opera a un'opera che è adattata come un’opera coreografica. @it
toolkit label: adattamento coreografico di opera @it
toolkit definition: Opera che è adattata come un’opera coreografica. @it
label: kā horeogrāfija adaptētais darbs @lv
definition: Sasaista darbu ar darbu, kas ir adaptēts kā horeogrāfisks darbs. @lv
toolkit label: kā horeogrāfija adaptētais darbs @lv
toolkit definition: Darbs, kas ir adaptēts kā horeogrāfisks darbs. @lv
label: 是作品的编舞改编 @zh-hans
definition: 将一种作品与被改编为一种编舞作品的一种作品关联起来。 @zh-hans
toolkit label: 作品的编舞改编 @zh-hans
toolkit definition: 被改编为一种编舞作品的一种作品 @zh-hans
has subproperty: P10183
label: eserin koreografik uyarlamasıdır @tr
definition: Bir eseri, koreografik bir eser olarak uyarlanan bir eserle ilişkilendirir. @tr
toolkit label: eserin koreografik uyarlaması @tr
toolkit definition: Koreografik bir eser olarak uyarlanan bir eser @tr

is description of work
status: Published
definition: Relates a work to a work that is described by a work.
type: Property
domain: C10001
sub property of: has subject work
lexical alias: descriptionOfWork.en
toolkit label: description of work
toolkit definition: A work that is described by a work.
toolkit label: description d’une œuvre @fr
toolkit definition: Œuvre qui est décrite par une œuvre. @fr
toolkit label: descripción de (obra) @es
toolkit definition: Una obra descrita por una obra que describe. @es
instruction number: 23.5
label: er beskrivelse af værk @da
definition: Relaterer et værk til et værk, som er beskrevet af et værk. @da
toolkit label: beskrivelse af værk @da
toolkit definition: Værk, som er beskrevet af et værk. @da
definition: Met une œuvre en relation avec une œuvre qui est décrite par une œuvre. @fr
label: là mô tả của tác phẩm @vi
definition: Liên kết tác phẩm với tác phẩm được mô tả bởi tác phẩm mô tả. @vi
toolkit label: mô tả của (tác phẩm) @vi
toolkit definition: Tác phẩm được mô tả bởi tác phẩm mô tả. @vi
label: ist Beschreibung von (Werk) @de
definition: Setzt ein Werk in Beziehung zu einem Werk, das von einem Werk beschrieben wird. @de
toolkit label: Beschreibung von (Werk) @de
toolkit definition: Ein Werk, das von einem Werk beschrieben wird. @de
label: est une description d’une œuvre @fr
definition: Liittää teoksen teokseen, jota teos kuvaa. @fi
toolkit label: kuvaus teoksesta @fi
toolkit definition: Teos, jota teos kuvaa. @fi
toolkit label: beskrivelse av verk @no
toolkit definition: Et verk som beskrives av et verk. @no
label: és descripció d’una obra @ca
definition: Relaciona una obra amb una obra que és descrita per una obra. @ca
toolkit label: descripció d’una obra @ca
toolkit definition: Obra que és descrita per una obra. @ca
has element type: 2
label: είναι περιγραφή του (έργο) @el
definition: Συνδέει ένα έργο με ένα έργο που περιγράφεται από ένα περιγραφικό έργο. @el
toolkit label: περιγραφή του (έργο) @el
toolkit definition: Ένα έργο που περιγράφεται από ένα περιγραφικό έργο. @el
label: leírása a következő műnek: @hu
definition: Hozzákapcsol egy művet egy műhöz, amelyet egy mű leír. @hu
toolkit label: leírt mű @hu
toolkit definition: Egy mű, amelyet egy mű leír. @hu
sub property of: is description of RDA entity
label: kuvaus teoksesta @fi
label: er beskrivelse av verk @no
definition: Relaterer et verk til et verk som beskrives av et verk. @no
label: is beschrijving van werk @nl
definition: Relateert een werk aan een werk dat beschreven wordt door een werk. @nl
toolkit label: beschrijving van werk @nl
toolkit definition: Een werk dat beschreven wordt door een werk. @nl
label: هو وصف لعمل @ar
definition: يربط عمل بعمل موصوف في عمل. @ar
toolkit label: وصف لعمل @ar
toolkit definition: عمل موصوف في عمل. @ar
label: kirjeldatud teos @et
definition: Seostab teose teosega, mida teoses on kirjeldatud. @et
toolkit label: kirjeldatud teos @et
toolkit definition: Teos, mida teoses on kirjeldatud. @et
label: è descrizione di opera @it
definition: Correla un'opera a un'opera che è descritta da un'opera. @it
toolkit label: descrizione di opera @it
toolkit definition: Opera che è descritta da un'opera. @it
label: ir apraksts darbam @lv
definition: Sasaista darbu ar darbu, kas aprakstīts darbā. @lv
toolkit label: apraksts darbam @lv
toolkit definition: Darbs, kas aprakstīts darbā @lv
label: 是作品的描述 @zh-hans
definition: 将一种作品与被一种作品描述的一种作品关联起来。 @zh-hans
toolkit label: 作品的描述 @zh-hans
toolkit definition: 被一种作品描述的一种作品 @zh-hans
has subproperty: is analysis of work
has subproperty: is commentary on work
has subproperty: is summary of
has subproperty: is metadata description of work
has subproperty: P10100
label: eserin tanımıdır @tr

is libretto for work
status: Published
definition: Relates a work to a work that is a musical or choreographic work such as an opera, a ballet, or other work for the musical stage, or an oratorio, that is complemented by a textual work.
type: Property
domain: C10001
sub property of: is text for work
lexical alias: librettoForWork.en
toolkit label: libretto for work
toolkit definition: A work that is a musical or choreographic work such as an opera, a ballet, or other work for the musical stage, or an oratorio, that is complemented by a work that is a textual work.
toolkit label: livret pour une œuvre @fr
toolkit definition: Œuvre musicale ou chorégraphique telle qu’un opéra, un ballet ou une autre œuvre pour la scène musicale, ou telle qu’un oratorio, qui est complétée par une œuvre textuelle. @fr
toolkit label: libreto para (obra) @es
toolkit definition: Una obra musical tal como una ópera u otra obra para representación musical o un oratorio, que utiliza el texto de la obra relacionada como libreto. @es
instruction number: 24.5
label: er libretto til værk @da
definition: Relaterer et værk til et værk, som er et musikalsk- eller koreografisk værk, såsom en opera, ballet eller andet værk til en musikalsk scene, eller et oratorium, som er komplementeret af et tekstværk. @da
toolkit label: libretto til værk @da
toolkit definition: Værk, som er et musikalsk- eller koreografisk værk, såsom en opera, ballet eller andet værk til en musikalsk scene, eller et oratorium, som er komplementeret med et tekstværk. @da
definition: Met une œuvre en relation avec une œuvre musicale ou chorégraphique telle qu’un opéra, un ballet ou une autre œuvre pour la scène musicale, ou telle qu’un oratorio, qui est complétée par une œuvre textuelle. @fr
label: là lời nhạc kịch cho (tác phẩm) @vi
definition: Liên kết tác phẩm với tác phẩm âm nhạc như là opera hoặc tác phẩm khác cho âm nhạc sân khấu, hoặc ontario sử dụng văn bản của tác phẩm có liên quan. @vi
toolkit label: lời nhạc kịch cho (tác phẩm) @vi
toolkit definition: Tác phẩm âm nhạc như là opera hoặc tác phẩm khác cho âm nhạc sân khấu, hoặc ontario sử dụng văn bản của tác phẩm có liên quan. @vi
label: ist Libretto für (Werk) @de
definition: Setzt ein Werk in Beziehung zu einem Musikwerk oder einem choreographischen Werk, wie zum Beispiel einer Oper, einem Ballett oder einem anderen Musikwerk für die Bühne, oder einem Oratorium, das durch ein textliches Werk vervollständigt wird. @de
toolkit label: Libretto für (Werk) @de
toolkit definition: Ein Musikwerk oder choreografisches Werk, wie zum Beispiel eine Oper, ein Ballett oder ein anderes Musikwerk für die Bühne oder ein Oratorium, die/das durch ein textliches Werk vervollständigt wird. @de
label: est un livret pour une œuvre @fr
definition: Liittää teoksen teokseen, joka on musiikki- tai koreografinen teos, kuten ooppera, baletti tai muu musiikillinen näyttämöteos tai oratorio, jota täydentää tekstiteos. @fi
toolkit label: libretto teokseen @fi
toolkit definition: Teos, joka on musiikki- tai koreografinen teos, kuten ooppera, baletti tai muu musiikillinen näyttämöteos tai oratorio, jota täydentää teos, joka on tekstiteos. @fi
toolkit label: libretto for verk @no
toolkit definition: Et musikalsk eller koreografisk verk som en opera, en ballett eller et annet verk for en musikalsk scene, eller et oriatorium som suppleres av et verk som er et tekstlig verk. @no
label: és llibret d’una obra @ca
definition: Relaciona una obra amb una obra que és una obra musical o coreogràfica com ara una òpera, un ballet o qualsevol altra obra per a l’escena musical o un oratori, que es complementa amb una obra que és una obra textual. @ca
toolkit label: llibret d’una obra @ca
toolkit definition: Obra que és una obra musical o coreogràfica com ara una òpera, un ballet o qualsevol altra obra per a l’escena musical o un oratori, que es complementa amb una obra que és una obra textual. @ca
has element type: 2
label: είναι λιμπρέτο για (έργο) @el
definition: Συνδέει ένα έργο με ένα μουσικό έργο, όπως μια όπερα ή άλλο έργο για τη μουσική σκηνή ή ένα ορατόριο, το οποίο χρησιμοποιεί το κείμενο ενός σχετικού έργου. @el
toolkit label: λιμπρέτο για (έργο) @el
toolkit definition: Ένα μουσικό έργο, όπως μια όπερα ή άλλο έργο για τη μουσική σκηνή ή ένα ορατόριο, το οποίο χρησιμοποιεί το κείμενο ενός σχετικού έργου. @el
label: librettó a következő műhöz: @hu
definition: Hozzákapcsol egy művet egy olyan zene- vagy koreografikus műhöz, mint egy opera, ballett, vagy egyéb zenés színpadi mű, vagy egy oratórium, amelyet egy szöveges mű egészít ki. @hu
toolkit label: librettó a következő műhöz: @hu
toolkit definition: Egy olyan zene- vagy koreografikus mű, mint egy opera, ballett, vagy egyéb zenés színpadi mű, vagy egy oratórium, amelyet egy szöveges mű egészít ki. @hu
label: libretto teokseen @fi
label: er libretto for verk @no
definition: Relaterer et verk til et musikalsk eller koreografisk verk som en opera, en ballett eller et annet verk for en musikalsk scene, eller et oriatorium som suppleres av et verk som er et tekstlig verk. @no
label: is libretto voor werk @nl
definition: Relateert een werk aan een werk dat een muziek- of choreografisch werk is zoals een opera, een ballet of ander muzikaal podiumwerk of een oratorium dat is gecomplementeerd met een werk dat een tekstwerk is. @nl
toolkit label: libretto voor werk @nl
toolkit definition: Een werk dat een muziek- of choreografisch werk is zoals een opera, een ballet of ander muzikaal podiumwerk of een oratorium dat is gecomplementeerd met een werk dat een tekstwerk is. @nl
label: هو نص أوبرالي لعمل @ar
definition: يربط عمل بعمل عبارة عن عمل موسيقي أو راقص؛ مثل الأوبرا، أو الباليه، أو عمل آخر للمسرح الموسيقي، أو موسيقى دينية يكملها عمل نصي. @ar
toolkit label: نص أوبرالي لعمل @ar
toolkit definition: عمل موسيقي أو عمل راقص؛ مثل الأوبرا، أو الباليه، أو عمل آخر للمسرح الموسيقي، أو موسيقى دينية يكملها عمل عبارة عن عمل نصي. @ar
label: libreto teosele @et
definition: Seostab teose muusikalise või koreograafilise lavateosega (nt ooper, ballett) või oratooriumiga, mille juurde kuulub tekstteos. @et
toolkit label: libreto teosele @et
toolkit definition: Muusikaline või koreograafiline lavateos (nt ooper, ballett) või oratoorium, mille juurde kuulub tekstteos. @et
label: è libretto per opera @it
definition: Correla un’opera a un’opera musicale o coreografica come un’opera, balletto o altra opera per il teatro musicale, o un oratorio, che è completata da un’opera testuale. @it
toolkit label: libretto per opera @it
toolkit definition: Opera musicale o coreografica come un’opera, balletto o altra opera per il teatro musicale, o un oratorio, che è completata da un’opera testuale. @it
label: ir librets darbam @lv
definition: Sasaista darbu ar darbu, kas ir muzikāls uzvedums, piemēram, opera vai oratorija, kurā izmantots saistītā darba teksts kā librets. @lv
toolkit label: librets darbam @lv
toolkit definition: Muzikāls uzvedums, piemēram, opera vai oratorija, kurā izmantots saistītā darba teksts kā librets. @lv
label: 是作品的台本 @zh-hans
definition: 将一种作品与被作为一种文字作品的一种作品补充的作为诸如歌剧、芭蕾或其他舞台音乐作品或清唱剧之类的一种音乐或编舞作品的一种作品关联起来。 @zh-hans
toolkit label: 作品的台本 @zh-hans
toolkit definition: 被作为一种文字作品的一种作品补充的作为诸如歌剧、芭蕾或其他舞台音乐作品或清唱剧之类的一种音乐或编舞作品的一种作品 @zh-hans
has subproperty: P10030
label: eserin librettosudur @tr
definition: Bir eseri, opera, bale veya müzik sahnesi için başka bir eser veya oratoryo türünde müzikal veya koreografik bir eser olan ve metinsel bir eserle tamamlanan bir eserle ilişkilendirir. @tr
toolkit label: eser için opera metni @tr
toolkit definition: Opera, bale veya müzik sahnesi için başka bir eser veya oratoryo türünde müzikal veya koreografik bir eser olan ve metinsel bir eserle tamamlanan bir eser. @tr

is adapted as libretto work
status: Published
definition: Relates a work to a work that consists of the text of a musical or choreographic work such as an opera, a ballet, or other work for the musical stage, or an oratorio, based on another work.
type: Property
domain: C10001
sub property of: is adapted as work
lexical alias: adaptedAsLibrettoWork.en
toolkit label: adapted as libretto work
toolkit definition: A work that consists of the text of a musical or choreographic work such as an opera, a ballet, or other work for the musical stage, or an oratorio, based on another work.
toolkit label: adapté en livret (œuvre) @fr
toolkit definition: Œuvre qui consiste en le texte d’une œuvre musicale ou chorégraphique telle qu’un opéra, un ballet ou une autre œuvre pour la scène musicale, ou telle qu’un oratorio, basé sur une autre œuvre. @fr
toolkit label: adaptada como libreto (obra) @es
toolkit definition: Una obra que consiste en un texto de una ópera para representación musical o un oratorio, basada en la obra fuente. @es
instruction number: 24.5
label: er bearbejdet til librettoværk @da
definition: Relaterer et værk til et musikalsk- eller koreografisk værk, såsom en opera, en ballet eller andet værk til en musikalsk scene, eller et oratorium. @da
toolkit label: bearbejdet til librettoværk @da
toolkit definition: Værk, som består af teksten til et musikalsk- eller koreografisk værk, såsom en opera, en ballet eller andet værk til en musikalsk scene, eller et oratorium. @da
definition: Met une œuvre en relation avec une œuvre qui consiste en le texte d’une œuvre musicale ou chorégraphique telle qu’un opéra, un ballet ou une autre œuvre pour la scène musicale, ou telle qu’un oratorio, basé sur une autre œuvre. @fr
label: được phỏng theo như là lời nhạc kịch (tác phẩm) @vi
definition: Liên kết tác phẩm với tác phẩm có chứa văn bản của opera hoặc tác phẩm khác cho sân khấu âm nhạc, hoặc oratorio, dựa trên tác phẩm nguồn. @vi
toolkit label: được phỏng theo như là lời nhạc kịch (tác phẩm) @vi
toolkit definition: Tác phẩm có chứa văn bản của opera hoặc tác phẩm khác cho sân khấu âm nhạc, hoặc oratorio, dựa trên tác phẩm nguồn. @vi
label: ist bearbeitet als Libretto (Werk) @de
definition: Setzt ein Werk in Beziehung zu einem Werk, das aus dem Text eines Musikwerks oder eines choreografischen Werks, wie zum Beispiel einer Oper, eines Balletts oder eines anderen Musikwerks für die Bühne, oder eines Oratorium besteht und auf einem anderen Werk basiert. @de
toolkit label: Bearbeitet als Libretto (Werk) @de
toolkit definition: Ein Werk, das aus dem Text eines Musikwerks oder eines choreografischen Werks, wie zum Beispiel einer Oper, eines Balletts oder eines anderen Musikwerks für die Bühne, oder eines Oratorium besteht und auf einem anderen Werk basiert. @de
label: est adapté en livret (œuvre) @fr
definition: Liittää teoksen teokseen, joka koostuu toiseen teokseen perustuvasta musiikki- tai koreografisen teoksen, kuten oopperan, baletin tai muun musiikillisen näyttämöteoksen tai oratorion tekstistä. @fi
toolkit label: sovitettu libretoksi (ekspressio) @fi
toolkit definition: Teos, joka koostuu toiseen teokseen perustuvasta musiikki- tai koreografisen teoksen, kuten oopperan, baletin tai muun musiikillisen näyttämöteoksen tai oratorion tekstistä. @fi
toolkit label: bearbeidet som libretto (verk) @no
toolkit definition: Et verk som består av teksten til en musikal eller et koreografisk verk som en opera, en ballett eller et annet verk for en musikalsk scene eller et oratorium basert på et kildeverk. @no
label: és adaptat com a obra de llibret @ca
definition: Relaciona una obra amb una obra que consisteix en el text d’una obra musical o coreogràfica com ara una òpera, un ballet o una altra obra escènica musical o d’un oratori basat en una altra obra. @ca
toolkit label: adaptat com a obra de llibret @ca
toolkit definition: Obra que consisteix en el text d’una obra musical o coreogràfica com ara una òpera, un ballet o una altra obra escènica musical o d’un oratori basat en una altra obra. @ca
has element type: 2
label: είναι προσαρμοσμένο ως λιμπρέτο (έργο) @el
definition: Συνδέει ένα έργο με ένα έργο, το οποίο συνίσταται από το κείμενο μιας όπερας ή άλλου έργου για τη μουσική σκηνή ή ένα ορατόριο, βασισμένο σε ένα έργο-πηγή. @el
toolkit label: προσαρμοσμένο ως λιμπρέτο (έργο) @el
toolkit definition: Ένα έργο, το οποίο συνίσταται από το κείμενο μιας όπερας ή άλλου έργου για τη μουσική σκηνή ή ένα ορατόριο, βασισμένο σε ένα έργο-πηγή. @el
label: librettómű-feldolgozása a következő: @hu
definition: Hozzákapcsol egy művet egy műhöz, amely olyan zene- vagy koreografikus mű szövegéből áll, mint egy opera, balett, oratórium, vagy más zenés színpadi mű. @hu
toolkit label: librettómű-átdolgozás @hu
toolkit definition: Egy mű, amely olyan zene- vagy koreografikus mű szövegéből áll, mint egy opera, balett, oratórium, vagy más zenés színpadi mű. @hu
label: sovitettu libretoksi (ekspressio) @fi
label: er bearbeidet som libretto (verk) @no
definition: Relaterer et verk til et verk som består av teksten til en musikal eller et koreografisk verk som en opera, en ballett eller et annet verk for en musikalsk scene eller et oratorium basert på et kildeverk. @no
label: is bewerkt als librettowerk @nl
definition: Relateert een werk aan een werk dat bestaat uit de tekst van een muziek- of choreografisch werk zoals een opera, een ballet of ander werk voor het muzikale podium of een oratorium gebaseerd op een ander werk. @nl
toolkit label: bewerkt als librettowerk @nl
toolkit definition: Een werk dat bestaat uit de tekst van een muziek- of choreografisch werk zoals een opera, een ballet of ander werk voor het muzikale podium of een oratorium gebaseerd op een ander werk. @nl
label: هو معالج كعمل نص أوبرالي @ar
definition: يربط عمل بعمل يتكون من نص عمل موسيقي أو راقص مثل أوبرا، أو باليه، أو عمل آخر للمسرح الموسيقي، أو موسيقى دينية، مبني على عمل آخر. @ar
toolkit label: معالج كعمل نص أوبرالي @ar
toolkit definition: عمل يتكون من نص عمل موسيقي أو راقص مثل أوبرا، أو باليه، أو عمل آخر للمسرح الموسيقي، أو موسيقى دينية، مبني على عمل آخر. @ar
label: adapteeritud libretona (teos) @et
definition: Seostab teose teosega, mis sisaldab muusikalise või koreograafilise lavateose (nt ooper, ballett) või oratooriumi teksti, mis põhineb allikteosel. @et
toolkit label: adapteeritud libretona (teos) @et
toolkit definition: Teos, mis sisaldab muusikalise või koreograafilise lavateose (nt ooper, ballett) või oratooriumi teksti, mis põhineb allikteosel. @et
label: è adattato come opera in forma di libretto @it
definition: Correla un’opera a un’opera musicale o coreografica come un’opera, balletto o altra opera per il teatro musicale, o un oratorio. @it
toolkit label: adattato come opera in forma di libretto @it
toolkit definition: Opera musicale o coreografica come un’opera, balletto o altra opera per il teatro musicale, o un oratorio. @it
label: ir adaptēts kā librets (darbs) @lv
definition: Sasaista darbu ar darbu - operas, oratorijas vai cita muzikāli dramatiskā darba teksts, kas veidots pēc pamatdarba. @lv
toolkit label: adaptēts kā darbs: librets @lv
toolkit definition: Darbs - operas, oratorijas vai cita muzikāli dramatiskā darba teksts, kas veidots pēc pamatdarba. @lv
label: 被改编为台本作品 @zh-hans
definition: 将一种作品与基于另一种作品、由诸如歌剧、芭蕾或其他舞台音乐作品或清唱剧的一种音乐或编舞作品的文字组成的一种作品关联起来。 @zh-hans
toolkit label: 被改编为台本作品 @zh-hans
toolkit definition: 基于另一种作品、由诸如歌剧、芭蕾或其他舞台音乐作品或清唱剧的一种音乐或编舞作品的文字组成的一种作品 @zh-hans
has subproperty: P10113
label: libretto eseri olarak uyarlanmıştır @tr
definition: Bir eseri, başka bir eserden uyarlanan opera, bale veya müzik sahnesi için başka bir eser veya oratoryo gibi müzikal veya koreografik bir eserin metninden oluşan bir eserle ilişkilendirir. @tr
toolkit label: Opera metni eseri olarak uyarlanan @tr
toolkit definition: Başka bir esere dayanan opera, bale veya müzik sahnesi için başka bir eser veya oratoryo gibi müzikal veya koreografik bir eserin metninden oluşan eser. @tr

has manifestation of work
status: Published
definition: Relates a work to a manifestation that is a physical embodiment of a work.
type: Property
domain: C10001
lexical alias: manifestationOfWork.en
instruction number: 17.7
toolkit label: manifestation of work
toolkit definition: A manifestation that is a physical embodiment of a work.
toolkit label: manifestation d’une œuvre @fr
toolkit definition: Manifestation qui consiste en une matérialisation d’une œuvre. @fr
toolkit label: manifestación de la obra @es
toolkit definition: La materialización física de una expresión de una obra. @es
label: har manifestation av verk @sv
toolkit label: manifestation av verk @sv
label: har manifestation af værk @da
definition: Relaterer et værk til en fysisk konkretisering af et værk. @da
toolkit label: manifestation af værk @da
toolkit definition: Fysisk konkretisering af et værk. @da
definition: Met une œuvre en relation avec une manifestation qui consiste en une matérialisation d’une œuvre. @fr
label: có biểu thị của tác phẩm @vi
definition: Liên kết tác phẩm với hiện thân vật lý của tác phẩm. @vi
toolkit label: biểu thị của tác phẩm @vi
toolkit definition: Hiện thân vật lý của tác phẩm. @vi
label: hat Manifestation eines Werks @de
definition: Setzt ein Werk in Beziehung zu einer Manifestation, bei der es sich um eine physische Verkörperung eines Werks handelt. @de
toolkit label: Manifestation eines Werks @de
toolkit definition: Eine Manifestation, bei der es sich um eine physische Verkörperung eines Werks handelt. @de
label: a pour manifestation d’une œuvre @fr
definition: Liittää teoksen manifestaatioon, joka on teoksen fyysinen ilmentymä. @fi
toolkit label: teoksen manifestaatio @fi
toolkit definition: Manifestaatio, joka on teoksen fyysinen ilmentymä. @fi
toolkit label: manifestasjon av verk @no
toolkit definition: En konkret utforming av et verk. @no
label: té com a manifestació d’una obra @ca
definition: Relaciona una obra amb una manifestació que és una materialització física d’una obra. @ca
toolkit label: manifestació d’una obra @ca
toolkit definition: Manifestació que és una materialització física d’una obra. @ca
sub property of: has related manifestation of work
has element type: 3
label: έχει εκδήλωση του έργου @el
definition: Συνδέει ένα έργο με τη φυσική υλοποίηση ενός έργου. @el
toolkit label: εκδήλωση του έργου @el
toolkit definition: Μια φυσική υλοποίηση ενός έργου. @el
label: mű megjelenési formája a következő: @hu
definition: Hozzákapcsol egy művet egy megjelenési formához, amely egy mű fizikai megtestesülése. @hu
toolkit label: műhöz tartozó megjelenési forma @hu
toolkit definition: Egy megjelenési forma, amely egy mű fizikai megtestesülése. @hu
label: teoksen manifestaatio @fi
label: har manifestasjon av verk @no
definition: Relaterer et verk til en konkret utforming av et verk. @no
label: heeft manifestatie van werk @nl
definition: Relateert een werk aan een manifestatie die is een fysieke verwezenlijking van een werk. @nl
toolkit label: manifestatie van werk @nl
toolkit definition: Een manifestatie die is een fysieke verwezenlijking van een werk. @nl
label: له تجسيدة لعمل @ar
definition: يربط بين عمل وتجسيدة عبارة عن تجسيد مادي لعمل. @ar
toolkit label: تجسيدة لعمل @ar
toolkit definition: تجسيدة عبارة عن تجسيد مادي لعمل. @ar
label: teose kehastus @et
definition: Seostab teose teose materiaalse teostusega. @et
toolkit label: teose kehastus @et
toolkit definition: Teose materiaalne teostus. @et
label: ha come manifestazione di opera @it
definition: Correla un'opera a una materializzazione fisica di un'opera. @it
toolkit label: manifestazione di opera @it
toolkit definition: Materializzazione fisica di un'opera. @it
label: darba manifestācija @lv
definition: Sasaista darbu ar manifestāciju, kas ir darba izteiksmes fiziskais iemiesojums. @lv
toolkit label: darba manifestācija @lv
toolkit definition: Darba izteiksmes fiziskais iemiesojums. @lv
label: 有作品的载体表现 @zh-hans
definition: 将一种作品与作为一种作品的物理具体化的一种载体表现关联起来。 @zh-hans
toolkit label: 作品的载体表现 @zh-hans
toolkit definition: 作为一种作品的物理具体化的一种载体表现 @zh-hans
has subproperty: P10072
label: eserin gösterimi ile ilişkilidir @tr
definition: Bir eseri, eserin fiziksel bir temsili olan bir gösterimle ilişkilendirir. @tr
toolkit label: eserin gösterimi @tr
toolkit definition: Bir eserin fiziksel bir somutlaşması olan bir gösterim. @tr

is motion picture adaptation of work
status: Published
definition: Relates a work to a work that is adapted as a motion picture.
type: Property
domain: C10001
sub property of: is adaptation of work
lexical alias: motionPictureAdaptationOfWork.en
toolkit label: motion picture adaptation of work
toolkit definition: A work that is adapted as a motion picture.
toolkit label: adaptation au cinéma d’une œuvre @fr
toolkit definition: Œuvre qui est adaptée en film. @fr
toolkit label: adaptación cinematográfica de (obra) @es
toolkit definition: Una obra que ha sido adaptada como película cinematográfica. @es
instruction number: 24.5
label: er bearbejdelse af værk til spillefilm @da
definition: Relaterer et værk til et værk, som er bearbejdet til en spillefilm. @da
toolkit label: bearbejdelse af værk til spillefilm @da
toolkit definition: Værk, som er bearbejdet til en spillefilm. @da
definition: Met une œuvre en relation avec une œuvre qui est adaptée en film. @fr
label: là phim điện ảnh được phỏng thao của (tác phẩm) @vi
definition: Liên kết tác phẩm với tác phẩm đã được phỏng theo như là phim điện ảnh @vi
toolkit label: phim điện ảnh được phỏng thao của (tác phẩm) @vi
toolkit definition: Tác phẩm đã được phỏng theo như là phim điện ảnh @vi
label: ist Filmbearbeitung von (Werk) @de
definition: Setzt ein Werk in Beziehung zu einem Werk, das als Film bearbeitet ist. @de
toolkit label: Filmbearbeitung von (Werk) @de
toolkit definition: Ein Werk, das als Film bearbeitet ist. @de
label: est une adaptation au cinéma d’une œuvre @fr
definition: Liittää teoksen teokseen, joka on sovitettu elokuvaksi. @fi
toolkit label: elokuvaversio teoksesta @fi
toolkit definition: Teos, joka on sovitettu elokuvaksi. @fi
toolkit label: bearbeidelse av verk til spillefilm @no
toolkit definition: Et verk som er bearbeidet til spillefilm. @no
label: és adaptació cinematogràfica d’una obra @ca
definition: Relaciona una obra amb una obra que s’adapta com una pel·lícula cinematogràfica. @ca
toolkit label: adaptació cinematogràfica d’una obra @ca
toolkit definition: Obra que s’adapta com una pel·lícula cinematogràfica. @ca
has element type: 2
label: είναι προσαρμογή κινηματογραφικής ταινίας του (έργο) @el
definition: Συνδέει ένα έργο με ένα έργο το οποίο έχει προσαρμοστεί ως κινηματογραφική ταινία. @el
toolkit label: προσαρμογή κινηματογραφικής ταινίας του (έργο) @el
toolkit definition: Ένα έργο το οποίο έχει προσαρμοστεί ως κινηματογραφική ταινία. @el
label: mozgóképes adaptációja a következő műnek: @hu
definition: Hozzákapcsol egy művet egy műhöz, amelyet mozgóképként adaptáltak. @hu
toolkit label: mozifilmmé átdolgozott mű @hu
toolkit definition: Egy mű, amelyet mozgóképként adaptáltak. @hu
label: elokuvaversio teoksesta @fi
label: er bearbeidelse av verk til spillefilm @no
definition: Relaterer et verk til et verk som er bearbeidet til spillefilm. @no
label: is speelfilmbewerking van werk @nl
definition: Relateert een werk aan een werk dat is bewerkt als een speelfilm. @nl
toolkit label: speelfilmbewerking van werk @nl
toolkit definition: Een werk dat is bewerkt als een speelfilm. @nl
label: هو معالجة سينمائية لعمل @ar
definition: يربط عمل بعمل تمت معالجته كفيلم سينمائي @ar
toolkit label: معالجة سينمائية لعمل @ar
toolkit definition: عمل تمت معالجته كفيلم سينمائي. @ar
label: filmiversioon teosest @et
definition: Seostab teose teosega, mis on adapteeritud filmina. @et
toolkit label: filmiversioon teosest @et
toolkit definition: Teos, mis on adapteeritud filmina. @et
label: è adattamento cinematografico di opera @it
definition: Correla un’opera a un’opera adattata come film. @it
toolkit label: adattamento cinematografico di opera @it
toolkit definition: Opera adattata come film. @it
label: kā kinofilma adaptētais darbs @lv
definition: Sasaista darbu ar darbu, kas ir adaptēts kā kinofilma. @lv
toolkit label: kā kinofilma adaptētais darbs @lv
toolkit definition: Darbs, kas ir adaptēts kā kinofilma. @lv
label: 是作品的电影改编 @zh-hans
definition: 将一种作品与被改编为电影的一种作品关联起来。 @zh-hans
toolkit label: 作品的电影改编 @zh-hans
toolkit definition: 被改编为电影的一种作品 @zh-hans
has subproperty: P10129
label: eserin sinema filmi uyarlamasıdır @tr
definition: Bir eseri, sinema filmi olarak uyarlanan bir eserle ilişkilendirir. @tr
toolkit label: eserin sinema filmi uyarlaması @tr
toolkit definition: Sinema filmi olarak uyarlanan bir eser. @tr

is oratorio adaptation of work
status: Published
type: Property
lexical alias: oratorioAdaptationOfWork.en
definition: Relates a work to a work that is adapted as an oratorio.
domain: C10001
toolkit label: oratorio adaptation of work
toolkit definition: A work that is adapted as an oratorio.
sub property of: is adaptation of work
toolkit label: adaptación para oratorio (obra) @es
toolkit definition: Una obra que ha sido adaptada como un oratorio. @es
instruction number: 24.5
label: er bearbejdelse af værk til oratorium @da
definition: Relaterer et værk til et værk, som er bearbejdet til et oratorium. @da
toolkit label: bearbejdelse af værk til oratorium @da
toolkit definition: Værk, som er bearbejdet til et oratorium. @da
label: là phỏng theo oratorio của (tác phẩm) @vi
definition: Liên kết tác phẩm với tác phẩm được phỏng thao như là oratorio. @vi
toolkit label: phỏng theo oratorio của (tác phẩm) @vi
toolkit definition: Tác phẩm được phỏng thao như là oratorio. @vi
label: ist Oratorienbearbeitung von (Werk) @de
definition: Setzt ein Werk in Beziehung zu einem Werk, das als Oratorium bearbeitet ist. @de
toolkit label: Oratorienbearbeitung von (Werk) @de
toolkit definition: Ein Werk, das als Oratorium bearbeitet ist. @de
definition: Liittää teoksen teokseen, joka on sovitettu oratorioksi. @fi
toolkit label: oratoriosovitus teoksesta @fi
toolkit definition: Teos, joka on sovitettu oratorioksi. @fi
toolkit label: bearbeidelse av verk til oratorium @no
toolkit definition: Et verk som er bearbeidet til et oratorium. @no
label: és adaptació com a oratori d’una obra @ca
definition: Relaciona una obra amb una obra que s’adapta com un oratori. @ca
toolkit label: adaptació com a oratori d’una obra @ca
toolkit definition: Obra que s’adapta com un oratori. @ca
label: est une adaptation en oratorio d’une œuvre @fr
definition: Met une œuvre en relation avec une œuvre qui est adaptée en oratorio. @fr
toolkit label: adaptation en oratorio d’une œuvre @fr
toolkit definition: Œuvre qui est adaptée en oratorio. @fr
has element type: 2
label: είναι προσαρμογή ορατορίου του (έργο) @el
definition: Συνδέει ένα έργο με ένα έργο το οποίο έχει προσαρμοστεί ως ορατόριο. @el
toolkit label: προσαρμογή ορατορίου του (έργο) @el
toolkit definition: Ένα έργο το οποίο έχει προσαρμοστεί ως ορατόριο. @el
label: oratórium-átdolgozása a következő műnek: @hu
definition: Hozzákapcsol egy művet egy műhöz, amelyet oratóriumként adaptáltak. @hu
toolkit label: oratóriummá átdolgozott mű @hu
toolkit definition: Egy mű, amelyet oratóriumként adaptáltak. @hu
label: oratoriosovitus teoksesta @fi
label: er bearbeidelse av verk til oratorium @no
definition: Relaterer et verk til et verk som er bearbeidet til et oratorium. @no
label: is oratoriumbewerking van werk @nl
definition: Relateert een werk aan een werk dat is bewerkt als een oratorium. @nl
toolkit label: oratoriumbewerking van werk @nl
toolkit definition: Een werk dat is bewerkt als een oratorium. @nl
label: هو معالجة موسيقية دينية لعمل @ar
definition: يربط عمل بعمل تمت معالجته كموسيقى دينية. @ar
toolkit label: معالجة موسيقية دينية لعمل @ar
toolkit definition: عمل تمت معالجته كموسيقى دينية. @ar
label: oratooriumiversioon teosest @et
definition: Seostab teose teosega, mis on adapteeritud oratooriumina. @et
toolkit label: oratooriumiversioon teosest @et
toolkit definition: Teos, mis on adapteeritud oratooriumina. @et
label: è un adattamento come oratorio di opera @it
definition: Correla un'opera a un'opera che è adattata come oratorio. @it
toolkit label: adattamento come oratorio di opera @it
toolkit definition: Opera che è adattata come oratorio. @it
label: kā oratorija adaptētais darbs @lv
definition: Sasaista darbu ar darbu, kas ir adaptēts kā oratorija. @lv
toolkit label: kā oratorija adaptētais darbs @lv
toolkit definition: Darbs, kas ir adaptēts kā oratorija. @lv
label: 是作品的清唱剧改编 @zh-hans
definition: 将一种作品与被改编为清唱剧的一种作品关联起来。 @zh-hans
toolkit label: 作品的清唱剧改编 @zh-hans
toolkit definition: 被改编为清唱剧的一种作品 @zh-hans
has subproperty: P10288
label: eserin oratoryo uyarlamasıdır @tr
definition: Bir eseri, oratoryo olarak uyarlanan bir eserle ilişkilendirir. @tr
toolkit label: eserin oratoryo uyarlaması @tr
toolkit definition: Oratoryo olarak uyarlanan bir eser. @tr

is summary of
status: Published
definition: Relates a work to a work that is briefly described by a work.
type: Property
domain: C10001
toolkit label: summary of
toolkit definition: A work that is briefly described by a work.
toolkit label: résumé de @fr
toolkit definition: Œuvre qui est brièvement décrite par une œuvre. @fr
toolkit label: sumario de (obra) @es
toolkit definition: Una obra utilizada como base para una recapitulación breve de su contenido. @es
instruction number: 24.5
label: er resumé af værk @da
definition: Relaterer et værk til et værk, som anvendes som grundlag for en kortfattet sammenfatning af dets indhold. @da
toolkit label: resumé af værk @da
toolkit definition: Værk, som anvendes som grundlag for en kortfattet sammenfatning af dets indhold. @da
definition: Met une œuvre en relation avec une œuvre qui est brièvement décrite par une œuvre. @fr
label: là tóm lược của (tác phẩm) @vi
definition: Liên kết tác phẩm với tác phẩm được sử dụng như là cơ sở cho tóm lại ngắn gọn nôi dung của nó. @vi
toolkit label: tóm lược của (tác phẩm) @vi
toolkit definition: Tác phẩm được sử dụng như là cơ sở cho tóm lại ngắn gọn nôi dung của nó. @vi
label: ist Zusammenfassung von (Werk) @de
definition: Setzt ein Werk in Beziehung zu einem Werk, das als Grundlage für eine kurze Zusammenfassung seines Inhalts verwendet wird. @de
toolkit label: Zusammenfassung von (Werk) @de
toolkit definition: Ein Werk, das als Grundlage für eine kurze Zusammenfassung seines Inhalts verwendet wird. @de
label: est un résumé de @fr
definition: Liittää teoksen teokseen, jota teos kuvaa lyhyesti. @fi
toolkit label: yhteenveto teoksesta @fi
toolkit definition: Teos, jota teos kuvaa lyhyesti. @fi
toolkit label: sammendrag av verk @no
toolkit definition: Et verk brukt som utgangspunkt for et kort sammendrag av innholdet. @no
label: és sumari de @ca
definition: Relaciona una obra amb una obra que és breument descrita per una obra. @ca
toolkit label: sumari de @ca
toolkit definition: Obra que és breument descrita per una obra. @ca
has element type: 2
label: είναι περίληψη του (έργο) @el
definition: Συνδέει ένα έργο με ένα έργο το οποίο χρησιμοποιείται ως η βάση για μια σύντομη ανακεφαλαίωση του περιεχομένου του. @el
toolkit label: περίληψη του (έργο) @el
toolkit definition: Ένα έργο το οποίο χρησιμοποιείται ως η βάση για μια σύντομη ανακεφαλαίωση του περιεχομένου του. @el
label: összefoglalója a következő műnek: @hu
definition: Hozzákapcsol egy művet egy műhöz, amelyet tartalma rövid összegzésének az alapjaként használnak. @hu
toolkit label: összefoglalt mű @hu
toolkit definition: Egy mű, amelyet tartalma rövid összegzésének az alapjaként használnak. @hu
label: yhteenveto teoksesta @fi
label: er sammendrag av verk @no
definition: Relaterer et verk til et verk brukt som utgangspunkt for et kort sammendrag av innholdet. @no
label: is samenvatting van werk @nl
definition: Relateert een werk aan een werk gebruikt als een basis voor een korte herformulering van diens content. @nl
toolkit label: samenvatting van werk @nl
toolkit definition: Een werk gebruikt als een basis voor een korte herformulering van diens content. @nl
label: هو ملخص لعمل @ar
definition: يربط عمل بعمل يُستخدم كأساس لتلخيص موجز لمحتواه. @ar
toolkit label: ملخص لعمل @ar
toolkit definition: عمل يُستخدم كأساس لتلخيص موجز لمحتواه. @ar
label: kokkuvõte teosest @et
definition: Seostab teose teosega, mis on lühikese sisukokkuvõtte aluseks. @et
toolkit label: kokkuvõte teosest @et
toolkit definition: Teos, mis on lühikese sisukokkuvõtte aluseks. @et
label: è riassunto di opera @it
definition: Correla un'opera a un'opera usata come base per una breve ricapitolazione del suo contenuto. @it
toolkit label: riassunto di opera @it
toolkit definition: Opera usata come base per una breve ricapitolazione del suo contenuto. @it
alternative label: summary of work
sub property of: is description of work
lexical alias: summaryOf.en
label: ir kopsavilkums darbam @lv
definition: Sasaista darbu ar darbu, kas izmantots par pamatu īsam satura kopsavilkumam. @lv
toolkit label: kopsavilkums darbam @lv
toolkit definition: Darbs, kas izmantots par pamatu īsam satura kopsavilkumam. @lv
alternative label: - @fi
alternative label: 作品的提要 @zh-hans
label: 是……的提要 @zh-hans
definition: 将一种作品与被一种作品简要描述的一种作品关联起来。 @zh-hans
toolkit label: ……的提要 @zh-hans
toolkit definition: 被一种作品简要描述的一种作品 @zh-hans
alternative label: sumari d’obra @ca
alternative label: résumé d’une œuvre @fr
has subproperty: is abstract of
has subproperty: P10179

is merger of work
status: Published
definition: Relates a work to a work that came together with one or more other works to form a new work.
type: Property
domain: C10001
sub property of: is preceded by work
lexical alias: mergerOfWork.en
toolkit label: merger of work
toolkit definition: A work that came together with one or more other works to form a new work.
toolkit label: fusion d’une œuvre @fr
toolkit definition: Œuvre qui s’est combinée à une ou plusieurs autres œuvres pour former une nouvelle œuvre. @fr
toolkit label: fusión de (obra) @es
toolkit definition: Una obra que viene con una o más obras para formar la nueva obra. @es
instruction number: 24.5
label: er sammenlægning af værk @da
definition: Relaterer et værk til et værk, som er lagt sammen med et eller flere andre værker, så det danner et nyt værk. @da
toolkit label: sammenlægning af værk @da
toolkit definition: Værk, som er lagt sammen med et eller flere andre værker, så det danner et nyt værk. @da
definition: Met une œuvre en relation avec une œuvre qui s’est combinée à une ou plusieurs autres œuvres pour former une nouvelle œuvre. @fr
label: là hợp thành của (tác phẩm) @vi
definition: Liên kết tác phẩm với tác phẩm ghép một hoặc nhiều hơn tác phẩm khác để tạo thành tác phẩm mới. @vi
toolkit label: hợp thành của (tác phẩm) @vi
toolkit definition: Tác phẩm ghép một hoặc nhiều hơn tác phẩm khác để tạo thành tác phẩm mới. @vi
label: ist Vereinigung von (Werk) @de
definition: Setzt ein Werk in Beziehung zu einem Werk, das mit einem anderen Werk oder mehreren anderen Werken zusammengeführt wird, um ein neues Werk zu bilden. @de
toolkit label: Vereinigung von (Werk) @de
toolkit definition: Ein Werk, das mit einem anderen Werk oder mehreren anderen Werken zusammengeführt wird, um ein neues Werk zu bilden. @de
label: est une fusion d’une œuvre @fr
definition: Liittää teoksen teokseen, joka on yhdistynyt yhden tai useamman teoksen kanssa ja muodostanut uuden teoksen. @fi
toolkit label: teokseen yhdistyjä @fi
toolkit definition: Teos, joka on yhdistynyt yhden tai useamman teoksen kanssa ja muodostanut uuden teoksen. @fi
toolkit label: sammenslåing av verk @no
toolkit definition: Et verk som er slått sammen med ett eller flere andre verk for å danne et nytt verk. @no
label: és fusió d’una obra @ca
definition: Relaciona una obra amb una obra que s’ha aplegat amb una o més obres per formar una nova obra. @ca
toolkit label: fusió d’una obra @ca
toolkit definition: Obra que s’ha aplegat amb una o més obres per formar una nova obra. @ca
has element type: 2
label: είναι συγχώνευση του (έργο) @el
definition: Συνδέει ένα έργο με ένα έργο το οποίο συνενώθηκε με ένα ή περισσότερα άλλα έργα για να σχηματιστεί ένα νέο έργο. @el
toolkit label: συγχώνευση του (έργο) @el
toolkit definition: Συνδέει ένα έργο με ένα έργο το οποίο συνενώθηκε με ένα ή περισσότερα άλλα έργα για να σχηματιστεί ένα νέο έργο. @el
label: egyesítője a következő műnek: @hu
definition: Hozzákapcsol egy művet egy műhöz, amely egy vagy több egyéb művel egyesült egy új mű létrehozása érdekében. @hu
toolkit label: összeolvadó mű @hu
toolkit definition: Egy mű, amely egy vagy több egyéb művel egyesült egy új mű létrehozása érdekében. @hu
label: teokseen yhdistyjä @fi
label: er sammenslåing av verk @no
definition: Relaterer et verk til et verk som er slått sammen med ett eller flere andre verk for å danne et nytt verk. @no
label: is samenvoeging van werk @nl
definition: Relateert een werk aan een werk dat samengekomen is met een of meer andere werken om een nieuw werk te vormen. @nl
toolkit label: fusie van werk @nl
toolkit definition: Een werk dat samengekomen is met een of meer andere werken om een nieuw werk te vormen. @nl
label: هو مدمِج لعمل @ar
definition: يربط عمل بعمل تم دمجه مع عمل آخر أو أكثر لتكوين عمل جديد. @ar
toolkit label: مدمِج لعمل @ar
toolkit definition: عمل تم دمجه مع عمل آخر أو أكثر لتكوين عمل جديد. @ar
label: teoseks ühenduja @et
definition: Seostab teose teosega, mis on uue teose moodustamiseks kokku pandud ühe või mitme teise teosega. @et
toolkit label: teoseks ühenduja @et
toolkit definition: Teos, mis on uue teose moodustamiseks kokku pandud ühe või mitme teise teosega. @et
label: è fusione di opera @it
definition: Correla un’opera a un’opera che fonde una o più opere per formare una nuova opera. @it
toolkit label: fusione di opera @it
toolkit definition: Opera che fonde una o più opere per formare una nuova opera. @it
label: ir sapludinātais darbs @lv
definition: Sasaista darbu ar darbu, kas kopā ar vienu vai vairākiem citiem darbiem veido jaunu darbu. @lv
toolkit label: sapludinātais darbs @lv
toolkit definition: Darbs, kas kopā ar vienu vai vairākiem citiem darbiem veido jaunu darbu. @lv
label: 是合并作品之一 @zh-hans
definition: 将一种作品与和一种或者多种其他作品一起形成一种新的作品的一种作品关联起来。 @zh-hans
toolkit label: 合并作品之一 @zh-hans
toolkit definition: 和一种或者多种其他作品一起形成一种新的作品的一种作品 @zh-hans
has subproperty: P10213
label: eserin birleşmesidir @tr
definition: Bir eseri, bir ya da daha fazla farklı eserle bir araya getirerek yeni bir eseri oluşturmuş bir eserle ilişkilendirir. @tr
toolkit label: çalışmanın birleştirilmesi @tr
toolkit definition: Bir veya daha fazla başka eserle birleşerek yeni bir eser oluşturan eser. @tr

is parody of work
status: Published
definition: Relates a work to a work whose style or content is imitated for comic effect.
type: Property
domain: C10001
sub property of: is imitation of work
lexical alias: parodyOfWork.en
toolkit label: parody of work
toolkit definition: A work whose style or content is imitated for comic effect.
toolkit label: parodie d’une œuvre @fr
toolkit definition: Œuvre dont le style ou le contenu est imité dans le but de produire un effet comique. @fr
toolkit label: parodia de (obra) @es
toolkit definition: Una obra cuyo estilo o contenido es imitado para obtener un efecto cómico. @es
instruction number: 24.5
label: er parodi på værk @da
definition: Relaterer et værk til et værk, hvis stil eller indhold efterlignes for at opnå en komisk effekt. @da
toolkit label: parodi på værk @da
toolkit definition: Værk, hvis stil eller indhold efterlignes for at opnå en komisk effekt. @da
definition: Met une œuvre en relation avec une œuvre dont le style ou le contenu est imité dans le but de produire un effet comique. @fr
label: là văn nhại của (tác phẩm) @vi
definition: Liên kết tác phẩm với tác phẩm mà phong cách và nội dung được nhại lại cho hiệu quả hài hước. @vi
toolkit label: văn nhại của (tác phẩm) @vi
toolkit definition: Tác phẩm mà phong cách và nội dung được nhại lại cho hiệu quả hài hước. @vi
label: ist Parodie von (Werk) @de
definition: Setzt ein Werk in Beziehung zu einem Werk, dessen Stil oder Inhalt für eine lustige Wirkung nachgeahmt wird. @de
toolkit label: Parodie von (Werk) @de
toolkit definition: Ein Werk, dessen Stil oder Inhalt für eine lustige Wirkung nachgeahmt wird. @de
label: est une parodie d’une œuvre @fr
definition: Liittää teoksen teokseen, jonka tyyliä tai sisältöä jäljitellään humoristisesti. @fi
toolkit label: parodia teoksesta @fi
toolkit definition: Teos, jonka tyyliä tai sisältöä jäljitellään humoristisesti. @fi
toolkit label: parodi på verk @no
toolkit definition: Et verk hvis stil eller innhold kopieres for en humoristisk effekt. @no
label: és paròdia d’una obra @ca
definition: Relaciona una obra amb una obra l’estil o el contingut de la qual s’imita per donar un efecte còmic. @ca
toolkit label: paròdia d’una obra @ca
toolkit definition: Obra l’estil o el contingut de la qual s’imita per donar un efecte còmic. @ca
has element type: 2
label: είναι διακωμώδηση του (έργο) @el
definition: Συνδέει ένα έργο με ένα έργο του οποίου το ύφος ή το περιεχόμενο υποβάλλεται σε μίμηση ως κωμικό εφέ. @el
toolkit label: διακωμώδηση του (έργο) @el
toolkit definition: Ένα έργο του οποίου το ύφος ή το περιεχόμενο υποβάλλεται σε μίμηση ως κωμικό εφέ. @el
label: paródiája a következő műnek: @hu
definition: Hozzákapcsol egy művet egy műhöz, amelynek stílusát vagy tartalmát utánozzák a komikus hatás kedvéért. @hu
toolkit label: parodizált mű @hu
toolkit definition: Egy mű, amelynek stílusát vagy tartalmát utánozzák a komikus hatás kedvéért. @hu
label: parodia teoksesta @fi
label: er parodi på verk @no
definition: Relaterer et verk til et verk hvis stil eller innhold kopieres for en humoristisk effekt. @no
label: is parodie van werk @nl
definition: Relateert een werk aan een werk waarvan stijl of content is geïmiteerd voor komisch effect. @nl
toolkit label: parodie van werk @nl
toolkit definition: Een werk waarvan stijl of content is geïmiteerd voor komisch effect. @nl
label: هو محاكاة ساخرة لعمل @ar
definition: يربط عمل بعمل تم تقليد أسلوبه أو محتواه ليُحدث تأثيرًا هزليًا. @ar
toolkit label: محاكاة ساخرة لعمل @ar
toolkit definition: عمل تم تقليد أسلوبه أو محتواه ليُحدث تأثيرًا هزليًا. @ar
label: parodeeritud teos @et
definition: Seostab teose teosega, mille stiili või sisu on jäljendatud koomilise efekti saavutamiseks. @et
toolkit label: parodeeritud teos @et
toolkit definition: Teos, mille stiili või sisu on jäljendatud koomilise efekti saavutamiseks. @et
label: è parodia di opera @it
definition: Correla un’opera a un’opera il cui stile o contenuto è imitato per produrre un effetto comico. @it
toolkit label: parodia di opera @it
toolkit definition: Opera il cui stile o contenuto è imitato per produrre un effetto comico. @it
label: ir parodija darbam @lv
definition: Sasaista darbu ar darbu, kura stils vai saturs tiek atdarināts komiska efekta iegūšanai. @lv
toolkit label: parodija darbam @lv
toolkit definition: Darbs, kura stils vai saturs tiek atdarināts komiska efekta iegūšanai. @lv
label: 是作品的戏仿 @zh-hans
definition: 将一种作品与其风格和内容被模仿而达到戏剧效果的一种作品关联起来。 @zh-hans
toolkit label: 作品的戏仿 @zh-hans
toolkit definition: 其风格和内容被模仿而达到戏剧效果的一种作品 @zh-hans
has subproperty: P10197
label: eserin parodisidir @tr
definition: Bir eseri, komik etki yaratmak için biçimi veya içeriği taklit edilen bir eserle ilişkilendirir. @tr
toolkit label: Eserin parodisi @tr
toolkit definition: Komik etki yaratmak için bir biçimi veya içeriği taklit edilmiş bir çalışma. @tr

is radio adaptation of work
status: Published
definition: Relates a work to a work that is adapted as a radio program.
type: Property
domain: C10001
sub property of: is adaptation of work
lexical alias: radioAdaptationOfWork.en
toolkit label: radio adaptation of work
toolkit definition: A work that is adapted as a radio program.
toolkit label: adaptation pour la radio d’une œuvre @fr
toolkit definition: Œuvre qui est adaptée en émission de radio. @fr
toolkit label: adaptación para radio de (obra) @es
toolkit definition: Una obra que ha sido adaptada como programa de radio. @es
instruction number: 24.5
label: er bearbejdelse af værk til radio @da
definition: Relaterer et værk til et værk, som er bearbejdet til et radioprogram. @da
toolkit label: bearbejdelse af værk til radio @da
toolkit definition: Værk, som er bearbejdet til et radioprogram. @da
definition: Met une œuvre en relation avec une œuvre qui est adaptée en émission de radio. @fr
label: là phỏng theo truyền thanh của (tác phẩm) @vi
definition: Liên kết tác phẩm với tác phẩm đã được phỏng theo như là chương trình truyền thanh. @vi
toolkit label: phỏng theo truyền thanh của (tác phẩm) @vi
toolkit definition: Tác phẩm đã được phỏng theo như là chương trình truyền thanh. @vi
label: ist Hörfunkbearbeitung von (Werk) @de
definition: Setzt ein Werk in Beziehung zu einem Werk, das als Hörfunksendung bearbeitet ist. @de
toolkit label: Hörfunkbearbeitung von (Werk) @de
toolkit definition: Ein Werk, das als Hörfunksendung bearbeitet ist. @de
label: est une adaptation pour la radio d’une œuvre @fr
definition: Liittää teoksen teokseen, joka on sovitettu radio-ohjelmaksi. @fi
toolkit label: radiosovitus teoksesta @fi
toolkit definition: Teos, joka on sovitettu radio-ohjelmaksi. @fi
toolkit label: bearbeidelse av verk for radio @no
toolkit definition: Et verk som er bearbeidet til et radioprogram. @no
label: és adaptació radiofònica d’una obra @ca
definition: Relaciona una obra amb una obra que s’adapta com un programa radiofònic. @ca
toolkit label: adaptació radiofònica d’una obra @ca
toolkit definition: Obra que s’adapta com un programa radiofònic. @ca
has element type: 2
label: είναι ραδιοφωνική προσαρμογή του (έργο) @el
definition: Συνδέει ένα έργο με ένα έργο το οποίο έχει προσαρμοστεί ως ραδιοφωνικό πρόγραμμα. @el
toolkit label: ραδιοφωνική προσαρμογή του (έργο) @el
toolkit definition: Ένα έργο το οποίο έχει προσαρμοστεί ως ραδιοφωνικό πρόγραμμα. @el
label: rádiós adaptációja a következő műnek: @hu
definition: Hozzákapcsol egy művet egy műhöz, amelyet rádióműsorként adaptáltak. @hu
toolkit label: rádióműsorként átdolgozott mű @hu
toolkit definition: Egy mű, amelyet rádióműsorként átdolgoztak. @hu
label: radiosovitus teoksesta @fi
label: er bearbeidelse av verk for radio @no
definition: Relaterer et verk til et verk som er bearbeidet til et radioprogram. @no
label: is radiobewerking van werk @nl
definition: Relateert een werk aan een werk dat is bewerkt als een radioprogramma. @nl
toolkit label: radiobewerking van werk @nl
toolkit definition: Een werk dat is bewerkt als een radioprogramma. @nl
label: هو معالجة إذاعية لعمل @ar
definition: يربط عمل بعمل تمت معالجته كبرنامج إذاعي. @ar
toolkit label: معالجة إذاعية لعمل @ar
toolkit definition: عمل تمت معالجته كبرنامج إذاعي. @ar
label: raadioversioon teosest @et
definition: Seostab teose teosega, mis on adapteeritud raadiosaatena. @et
toolkit label: raadioversioon teosest @et
toolkit definition: Teos, mis on adapteeritud raadiosaatena. @et
label: è adattamento radiofonico di opera @it
definition: Correla un’opera a un’opera adattata come programma radiofonico. @it
toolkit label: adattamento radiofonico di opera @it
toolkit definition: Opera adattata come programma radiofonico. @it
label: kā radio raidījums adaptētais darbs @lv
definition: Sasaista darbu ar darbu, kas ir adaptēts kā radio raidījums. @lv
toolkit label: kā radio raidījums adaptētais darbs @lv
toolkit definition: Darbs, kas ir adaptēts kā radio raidījums. @lv
label: 是作品的广播改编 @zh-hans
definition: 将一种作品与被改编为广播节目的一种作品关联起来。 @zh-hans
toolkit label: 作品的广播改编 @zh-hans
toolkit definition: 被改编为广播节目的一种作品 @zh-hans
has subproperty: P10131
label: eserin radyo uyarlamasıdır @tr
definition: Bir eseri, radyo programı olarak uyarlanan bir eserle ilişkilendirir. @tr
toolkit label: eserin radyo uyarlaması @tr
toolkit definition: Bir radyo programı olarak uyarlanan bir çalışma. @tr

is novelization of work
status: Published
definition: Relates a work to a work that is adapted as a novel.
type: Property
domain: C10001
sub property of: is adaptation of work
lexical alias: novelizationOfWork.en
toolkit label: novelization of work
toolkit definition: A work that is adapted as a novel.
toolkit label: novélisation d’une œuvre @fr
toolkit definition: Œuvre qui est adaptée en roman. @fr
toolkit label: novelización de (obra) @es
toolkit definition: Una obra que ha sido adaptada como novela. @es
instruction number: 24.5
label: er omskrivning af værk til roman @da
definition: Relaterer et værk til et værk, som er bearbejdet til en roman. @da
toolkit label: omskrivning af værk til roman @da
toolkit definition: Værk, som er bearbejdet til en roman. @da
definition: Met une œuvre en relation avec une œuvre qui est adaptée en roman. @fr
label: là tiểu thuyết hoá của (tác phẩm) @vi
definition: Liên kết tác phẩm với tác phẩm đã được phỏng theo như là tiểu thuyết. @vi
toolkit label: tiểu thuyết hoá của (tác phẩm) @vi
toolkit definition: Tác phẩm đã được phỏng theo như là tiểu thuyết. @vi
label: ist Romanbearbeitung von (Werk) @de
definition: Setzt ein Werk in Beziehung zu einem Werk, das als Roman bearbeitet ist. @de
toolkit label: Romanbearbeitung von (Werk) @de
toolkit definition: Ein Werk, das als Roman bearbeitet ist. @de
label: est une novélisation d’une œuvre @fr
definition: Liittää teoksen teokseen, joka on sovitettu romaaniksi. @fi
toolkit label: romaanimukaelma teoksesta @fi
toolkit definition: Teos, joka on sovitettu romaaniksi. @fi
toolkit label: bearbeidelse av verk til roman @no
toolkit definition: Et verk som er bearbeidet til en roman. @no
label: és novel·lització d’una obra @ca
definition: Relaciona una obra amb una obra que s’adapta com una novel·la. @ca
toolkit label: novel·lització d’una obra @ca
toolkit definition: Obra que s’adapta com una novel·la. @ca
has element type: 2
label: είναι μυθιστοριογράφηση του (έργο) @el
definition: Συνδέει ένα έργο με ένα έργο το οποίο έχει προσαρμοστεί ως μυθιστόρημα. @el
toolkit label: μυθιστοριογράφηση του (έργο) @el
toolkit definition: Ένα έργο το οποίο έχει προσαρμοστεί ως μυθιστόρημα. @el
label: regényesítése a következő műnek: @hu
definition: Hozzákapcsol egy művet egy műhöz, amelyet regényként adaptáltak. @hu
toolkit label: regénnyé átdolgozott mű @hu
toolkit definition: Egy mű, amelyet regényként átdolgoztak. @hu
label: romaanimukaelma teoksesta @fi
label: er bearbeidelse av verk til roman @no
definition: Relaterer et verk til et verk som er bearbeidet til en roman. @no
label: is romanbewerking van werk @nl
definition: Relateert een werk aan een werk dat is bewerkt als een roman. @nl
toolkit label: romanbewerking van werk @nl
toolkit definition: Een werk dat is bewerkt als een roman. @nl
label: هو تحويل روائي لعمل @ar
definition: يربط عمل بعمل تمت معالجته كرواية. @ar
toolkit label: تحويل روائي لعمل @ar
toolkit definition: عمل تمت معالجته كرواية. @ar
label: romaaniversioon teosest @et
definition: Seostab teose teosega, mis on adapteeritud romaanina. @et
toolkit label: romaaniversioon teosest @et
toolkit definition: Teos, mis on adapteeritud romaanina. @et
label: è adattamento in forma di romanzo di opera @it
definition: Correla un’opera a un’opera adattata come romanzo. @it
toolkit label: adattamento come romanzo di opera @it
toolkit definition: Opera adattata come romanzo. @it
label: kā romāns adaptētais darbs @lv
definition: Sasaista darbu ar darbu, kas ir adaptēts kā romāns. @lv
toolkit label: kā romāns adaptētais darbs @lv
toolkit definition: Darbs, kas ir adaptēts kā romāns. @lv
label: 是作品的小说化 @zh-hans
definition: 将一种作品与被改编为小说的一种作品关联起来。 @zh-hans
toolkit label: 作品的小说化 @zh-hans
toolkit definition: 被改编为小说的一种作品 @zh-hans
has subproperty: P10130
label: eserin romanlaştırılmasıdır @tr
definition: Bir eseri, roman olarak uyarlanan bir eserle ilişkilendirir. @tr
toolkit label: Eserin romanlaştırılması @tr
toolkit definition: Bir roman olarak uyarlanan bir eser. @tr

is split into work
status: Published
definition: Relates a work to a work that is a diachronic work that continues the partial content of another diachronic work that is completed.
type: Property
domain: C10001
sub property of: is succeeded by work
lexical alias: splitIntoWork.en
toolkit label: split into work
toolkit definition: A work that is a diachronic work that continues the partial content of another diachronic work that is completed.
toolkit label: scindé en une œuvre @fr
toolkit definition: Œuvre diachronique qui continue le contenu partiel d’une autre œuvre diachronique qui est terminée. @fr
toolkit label: escindida en (obra) @es
toolkit definition: Una de dos o más obras que resultan de la división de una obra anterior en obras separadas. @es
instruction number: 24.5
label: er opdelt i værk @da
definition: Relaterer et værk til et værk, som er et diakronisk værk, som fortsætter det delvise indhold af et andet diakronisk værk, som er fuldstændigt. @da
toolkit label: opdelt i værk @da
toolkit definition: Værk, som er et diakronisk værk, som fortsætter det delvise indhold af et andet diakronisk værk, som er fuldstændigt. @da
definition: Met une œuvre en relation avec une œuvre diachronique qui continue le contenu partiel d’une autre œuvre diachronique qui est terminée. @fr
label: là tách thành (tác phẩm) @vi
definition: Liên kết tác phẩm với tác phẩm sinh ra từ chia tác phẩm trước đây thành hai hoặc nhiều hơn tác phẩm tách biệt. @vi
toolkit label: tách thành (tác phẩm) @vi
toolkit definition: Tác phẩm sinh ra từ chia tác phẩm trước đây thành hai hoặc nhiều hơn tác phẩm tách biệt. @vi
label: ist gesplittet in (Werk) @de
definition: Setzt ein Werk in Beziehung zu einem diachronen Werk, das teilweise den Inhalt eines anderen abgeschlossenen, diachronen Werks fortführt. @de
toolkit label: Gesplittet in (Werk) @de
toolkit definition: Ein diachrones Werk, das teilweise den Inhalt eines anderen abgeschlossenen, diachronen Werks fortführt. @de
label: est scindé en une œuvre @fr
definition: Liittää teoksen teokseen, joka on diakroninen teos, joka jatkaa toisen, valmiin diakronisen teoksen osittaista sisältöä. @fi
toolkit label: jakautunut teokseen @fi
toolkit definition: Teos, joka on diakroninen teos, joka jatkaa toisen, valmiin diakronisen teoksen osittaista sisältöä. @fi
toolkit label: delt opp i verk @no
toolkit definition: Et verk som er et diakronisk verk som fortsetter deler av innholdet av et annet diakronisk verk som er komplett. @no
label: és escindit en una obra @ca
definition: Relaciona una obra amb una obra que és una obra diacrònica que continua el contingut parcial d’una altra obra diacrònica que és completa. @ca
toolkit label: escindit en una obra @ca
toolkit definition: Obra que és una obra diacrònica que continua el contingut parcial d’una altra obra diacrònica que és completa. @ca
has element type: 2
label: είναι χωρισμένο σε (έργο) @el
definition: Συνδέει ένα έργο με ένα έργο προερχόμενο από τη διαίρεση ενός προηγούμενου έργου σε δύο ή περισσότερα διακριτά έργα. @el
toolkit label: χωρισμένο σε (έργο) @el
label: szétvált a következő műre: @hu
definition: Hozzákapcsol egy művet egy diakronikus műhöz, amely egy másik, befejezett diakronikus mű részleges tartalmát folytatja. @hu
toolkit label: kivált mű @hu
toolkit definition: Egy mű, amely egy másik, befejezett diakronikus mű részleges tartalmát folytatja. @hu
scope note: This element applies in general to a successive work.
scope note: Tämä elementti soveltuu yleensä peräkkäisesti ilmestyvään teokseen. @fi
label: jakautunut teokseen @fi
label: er delt opp i verk @no
definition: Relaterer et verk til et verk som er et diakronisk verk som fortsetter deler av innholdet av et annet diakronisk verk som er komplett. @no
scope note: Dette elementet gjelder som oftest for et påfølgende verk. @no
label: is gesplitst tot werk @nl
definition: Relateert een werk aan een werk dat een diachronisch werk is dat de gedeeltelijke content voortzet van een ander diachronisch werk dat afgesloten is. @nl
scope note: Dit element is over het algemeen van toepassing op een successief werk. @nl
toolkit label: gesplitst tot werk @nl
toolkit definition: Een werk dat een diachronisch werk is dat de gedeeltelijke content voortzet van een ander diachronisch werk dat afgesloten is. @nl
label: هو منشطِر إلى عمل @ar
definition: يربط عمل بعمل عبارة عن عمل ممتد زمنيًا يُكْمل المحتوى الجزئي لعمل آخر ممتد زمنيًا ومكتمل. @ar
scope note: هذا العنصر ينطبق عامة على عمل متتالٍ. @ar
toolkit label: منشطِر إلى عمل @ar
toolkit definition: عمل عبارة عن عمل ممتد زمنيًا يُكْمل المحتوى الجزئي لعمل آخر ممتد زمنيًا ومكتمل. @ar
scope note: En general, aquest element s’aplica a una obra estàtica o una obra integrant. @ca
scope note: Dette element gælder generelt for et fortløbende værk. @da
label: jätkub osaliselt teosena @et
definition: Seostab teose diakroonilise teosega, mis osaliselt jätkab teise, lõpetatud diakroonilise teose sisu. @et
scope note: Elementi rakendatakse peamiselt järgteose puhul. @et
toolkit label: jätkub osaliselt teosena @et
toolkit definition: Diakrooniline teos, mis osaliselt jätkab teise, lõpetatud diakroonilise teose sisu. @et
scope note: Im Allgemeinen trifft dieses Element auf ein sukzessives Werk zu. @de
scope note: Ez az elem általában a folyamatos művekre vonatkozik. @hu
label: è scissa in opera @it
definition: Correla un’opera a un’opera diacronica che continua in parte il contenuto di un’altra opera diacronica completa. @it
scope note: Generalmente questo elemento si applica a un'opera successiva. @it
toolkit label: scissa in opera @it
toolkit definition: Opera diacronica che continua in parte il contenuto di un’altra opera diacronica completa. @it
scope note: Cet élément s’applique généralement à une œuvre successive. @fr
label: darba daļējs turpinājums @lv
definition: Sasaista darbu ar darbu, kas ir pabeigts diahronisks darbs, kas turpina daļu cita diahroniska darba saturu, kas ir pabeigts. @lv
toolkit label: darbs: daļējs turpinājums @lv
toolkit definition: Pabeigts diahronisks darbs, kas turpina daļu cita diahroniska darba saturu, kas ir pabeigts. @lv

is replaced in part by work
status: Published
definition: Relates a work to a work whose content partially supersedes and renders obsolete the content of another work.
type: Property
domain: C10001
sub property of: is succeeded by work
lexical alias: replacedInPartByWork.en
toolkit label: replaced in part by work
toolkit definition: A work whose content partially supersedes and renders obsolete the content of another work.
toolkit label: remplacé en partie par une œuvre @fr
toolkit definition: Œuvre dont le contenu remplace partiellement et rend périmé le contenu d’une autre œuvre. @fr
toolkit label: reemplazada en parte por (obra) @es
toolkit definition: Una obra posterior usada en parte en lugar de una obra anterior, generalmente porque la obra posterior contiene información actualizada o nueva que hace obsoleta parte de la obra anterior. @es
scope note: This element applies in general to a static work or an integrating work.
instruction number: 24.5
label: er delvis erstattet af værk @da
definition: Relaterer et værk til et værk, hvis indhold delvis overflødiggør og forælder indholdet af et andet værk. @da
scope note: Dette element gælder generelt for et statisk værk eller et integrerende værk. @da
toolkit label: delvis erstattet af værk @da
toolkit definition: Værk, hvis indhold delvis overflødiggør og forælder indholdet af et andet værk. @da
definition: Met une œuvre en relation avec une œuvre dont le contenu remplace partiellement et rend périmé le contenu d’une autre œuvre. @fr
label: được thay thế một phần bởi (tác phẩm) @vi
definition: Liên kết tác phẩm với tác phẩm sau này sử dụng một phần để thay thế tác phẩm trước đây, thường là vì tác phẩm sau này có chứa thông tin cập nhật hoặc mới làm cho phần của tác phẩm trước đây bị lỗi thời. @vi
scope note: Mối quan hệ này áp dụng tổng quá đối với đơn vị một phần, chuyên khảo nhiều phần, và tài nguyên tích hợp. @vi
toolkit label: được thay thế một phần của (tác phẩm) @vi
toolkit definition: Tác phẩm sau này sử dụng một phần để thay thế tác phẩm trước đây, thường là vì tác phẩm sau này có chứa thông tin cập nhật hoặc mới làm cho phần của tác phẩm trước đây bị lỗi thời. @vi
label: ist teilweise ersetzt durch (Werk) @de
definition: Setzt ein Werk in Beziehung zu einem Werk, dessen Inhalt den Inhalt eines anderen Werks teilweise ersetzt und obsolet macht. @de
scope note: Im Allgemeinen trifft dieses Element auf ein statisches Werk oder ein integrierendes Werks zu. @de
toolkit label: Teilweise ersetzt durch (Werk) @de
toolkit definition: Ein Werk, dessen Inhalt den Inhalt eines anderen Werks teilweise ersetzt und obsolet macht. @de
label: est remplacé en partie par une œuvre @fr
definition: Liittää teoksen teokseen, jonka sisältö osittain korvaa ja tekee vanhentuneeksi toisen teoksen sisällön. @fi
toolkit label: osittain korvattu teoksella @fi
toolkit definition: Teos, jonka sisältö osittain korvaa ja tekee vanhentuneeksi toisen teoksen sisällön. @fi
toolkit label: delvis erstattet av verk @no
toolkit definition: Et verk hvis innhold delvis erstatter og gjør innholdet i et annet verk foreldet. @no
label: és reemplaçat en part per una obra @ca
definition: Relaciona una obra amb una obra el contingut de la qual substitueix parcialment i converteix en obsolet el contingut d’una altra obra. @ca
scope note: En general, aquest element s’aplica a una obra estàtica o a una obra integrant. @ca
toolkit label: reemplaçat en part per una obra @ca
toolkit definition: Obra el contingut de la qual substitueix parcialment i converteix en obsolet el contingut d’una altra obra. @ca
scope note: Cet élément s’applique généralement à une œuvre statique ou à une œuvre intégratrice. @fr
has element type: 2
label: αντικαθίσταται μερικώς από (έργο) @el
definition: Συνδέει ένα έργο με ένα μεταγενέστερο έργο το οποίο χρησιμοποιείται μερικώς στη θέση ενός προηγούμενου έργου, συνήθως λόγω του ότι το μεταγενέστερο έργο περιέχει ενημερωμένη/ανανεωμένη ή νέα πληροφορία, η οποία καθιστά μέρος του προηγούμενου έργου παρωχημένο. @el
scope note: Αυτή η σχέση βρίσκει γενική εφαρμογή σε μονομερείς μονάδες, πολυμερείς μονογραφίες και ενσωματωμένους πόρους. @el
toolkit label: αντικαθίσταται μερικώς από (έργο) @el
toolkit definition: Ένα μεταγενέστερο έργο το οποίο χρησιμοποιείται μερικώς στη θέση ενός προηγούμενου έργου, συνήθως λόγω του ότι το μεταγενέστερο έργο περιέχει ενημερωμένη/ανανεωμένη ή νέα πληροφορία, η οποία καθιστά μέρος του προηγούμενου έργου παρωχημένο. @el
label: részben helyettesíti a következő mű: @hu
definition: Hozzákapcsol egy művet egy műhoz, amelynek tartalma részben túlhaladja és elavulttá teszi egy másik mű tartalmát. @hu
scope note: Ezt az elemet általában az statikus vagy integráló művekre alkalmazzák. @hu
toolkit label: részben helyettesítő mű @hu
toolkit definition: Egy mű, amelynek tartalma részben túlhaladja és elavulttá teszi egy másik mű tartalmát. @hu
scope note: Tämä elementti soveltuu yleensä staattiseen teokseen tai päivittyvään teokseen. @fi
label: osittain korvattu teoksella @fi
label: er delvis erstattet av verk @no
definition: Relaterer et verk til et verk hvis innhold delvis erstatter og gjør innholdet i et annet verk foreldet. @no
scope note: Dette elementet gjelder som regel for et statisk verk eller et integrerende verk. @no
label: is gedeeltelijk vervangen door werk @nl
definition: Relateert een werk aan een werk waarvan de content gedeeltelijk overschrijft en achterhaald maakt de content van een ander werk. @nl
scope note: Dit element is over het algemeen van toepassing op een statisch werk of een geïntegreerd werk. @nl
toolkit label: gedeeltelijk vervangen door werk @nl
toolkit definition: Een werk waarvan de content gedeeltelijk overschrijft en achterhaald maakt de content van een ander werk. @nl
label: هو مستبدَل جزئيًا بعمل @ar
definition: يربط عمل بعمل يحل محتواه محل عمل آخر جزئيا ويجعل محتواه متقادما. @ar
scope note: ينطبق هذا العنصر عامة على عمل ثابت أو عمل متكامل. @ar
toolkit label: مستبدَل جزئيًا بعمل @ar
toolkit definition: عمل يحل محتواه محل عمل آخر جزئيا ويجعل محتواه متقادما. @ar
label: asendatud osaliselt teosega @et
definition: Seostab teose teosega, mille sisu osaliselt asendab ja tühistab teise teose sisu. @et
scope note: Elementi rakendatakse tavaliselt staatilise teose või lõimteose puhul. @et
toolkit label: asendatud osaliselt teosega @et
toolkit definition: Teos, mille sisu osaliselt asendab ja tühistab teise teose sisu. @et
label: è parzialmente sostituita da opera @it
definition: Correla un’opera a un’opera il cui contenuto sostituisce e rende in parte obsoleto il contenuto di un’altra opera. @it
scope note: Questo elemento si applica in genere a un'opera statica o a un'opera integrativa @it
toolkit label: parzialmente sostituito da opera @it
toolkit definition: Opera il cui contenuto in parte sostituisce e rende obsoleto il contenuto di un’altra opera. @it
label: ir daļēji aizstājošais darbs @lv

is absorption in part of work
status: Published
definition: Relates a work to a work whose partial content is incorporated in the content of another work.
type: Property
domain: C10001
sub property of: is preceded by work
lexical alias: absorptionInPartOfWork.en
toolkit label: absorption in part of work
toolkit definition: A work whose partial content is incorporated in the content of another work.
toolkit label: absorption partielle d’une œuvre @fr
toolkit definition: Œuvre dont le contenu partiel est intégré dans le contenu d’une autre œuvre. @fr
toolkit label: absorbida en parte por (obra) @es
toolkit definition: Una obra que incorpora parte del contenido de otra obra. @es
instruction number: 24.5
label: er delvis indlemmelse af værk @da
definition: Relaterer et værk til et værk, hvis delvise indhold er inkorporeret i et andet værks indhold. @da
toolkit label: delvis indlemmelse af værk @da
toolkit definition: Værk, hvis delvise indhold er inkorporeret i et andet værks indhold. @da
definition: Met une œuvre en relation avec une œuvre dont le contenu partiel est intégré dans le contenu d’une autre œuvre. @fr
label: là hấp thụ một phần của (tác phẩm) @vi
definition: Liên kết tác phẩm với tác phẩm đã được kết hợp một phần vào tác phẩm khác. @vi
toolkit label: hấp thụ một phần của (tác phẩm) @vi
toolkit definition: Tác phẩm đã được kết hợp một phần vào tác phẩm khác. @vi
label: ist teilweise darin aufgegangen (Werk) @de
definition: Setzt ein Werk in Beziehung zu einem Werk, dessen Inhalt teilweise in den Inhalt eines anderen Werks eingeflossen ist. @de
toolkit label: Teilweise darin aufgegangen (Werk) @de
toolkit definition: Ein Werk, dessen Inhalt teilweise in den Inhalt eines anderen Werks eingeflossen ist. @de
label: est une absorption partielle d’une œuvre @fr
definition: Liittää teoksen teokseen, jonka osittainen sisältö on yhdistynyt toisen teoksen sisältöön. @fi
toolkit label: osittain sulautunut teos @fi
toolkit definition: Teos, jonka osittainen sisältö on yhdistynyt toisen teoksen sisältöön. @fi
toolkit label: delvis innlemmelse av verk @no
toolkit definition: Et verk hvis innhold er delvis innlemmet i innholdet i et annet verk. @no
label: és absorció en part d’una obra @ca
definition: Relaciona una obra amb una obra el contingut parcial de la qual s’incorpora en el contingut d’una altra obra. @ca
toolkit label: absorció en part d’una obra @ca
toolkit definition: Obra el contingut parcial de la qual s’incorpora en el contingut d’una altra obra. @ca
has element type: 2
label: είναι μερική απορρόφηση του (έργο) @el
definition: Συνδέει ένα έργο με ένα έργο το οποίο έχει ενσωματωθεί μερικώς σε ένα άλλο έργο. @el
toolkit label: μερική απορρόφηση του (έργο) @el
toolkit definition: Ένα έργο το οποίο έχει ενσωματωθεί μερικώς σε ένα άλλο έργο. @el
label: részben beolvasztja a következő művet: @hu
definition: Hozzákapcsol egy művet egy műhöz, amelynek részleges tartalma beolvad egy másik mű tartalmába. @hu
toolkit label: részben beolvasztott mű @hu
toolkit definition: Egy mű, amelynek részleges tartalma beolvad egy másik mű tartalmába. @hu
label: osittain sulautunut teos @fi
label: er delvis innlemmelse av verk @no
definition: Relaterer et verk til et verk hvis innhold er delvis innlemmet i innholdet i et annet verk. @no
label: is gedeeltelijke opname van werk @nl
definition: Relateert een werk aan een werk waarvan de gedeeltelijke content opgenomen is in de content van een ander werk. @nl
toolkit label: gedeeltelijke opname van werk @nl
toolkit definition: Een werk waarvan de gedeeltelijke content opgenomen is in de content van een ander werk. @nl
label: هو احتواء في جزء من عمل @ar
definition: يربط عمل بعمل يكون محتواه الجزئي مدمجًا في محتوى عمل آخر. @ar
toolkit label: احتواء في جزء من عمل @ar
toolkit definition: عمل يكون محتواه الجزئي مدمجًا في محتوى عمل آخر. @ar
label: osaliselt sulandunud teos @et
definition: Seostab teose teosega, mille sisu on osaliselt haaratud teise teose sisusse. @et
toolkit label: osaliselt sulandunud teos @et
toolkit definition: Teos, mille sisu on osaliselt haaratud teise teose sisusse. @et
label: è assorbimento parziale di opera @it
definition: Correla un’opera a un’opera il cui contenuto è parzialmente incorporato nel contenuto di un’altra opera. @it
toolkit label: assorbimento parziale di opera @it
toolkit definition: Opera il cui contenuto è parzialmente incorporato nel contenuto di un’altra opera. @it
label: ir daļēji iekļautais darbs @lv
definition: Sasaista darbu ar darbu, kura daļējs saturs ir iekļauts citā darbā. @lv
toolkit label: daļēji iekļautais darbs @lv
toolkit definition: Darbs, kura daļējs saturs ir iekļauts citā darbā. @lv
label: 是作品的部分吸收 @zh-hans
definition: 将一种作品与其部分内容被纳入另一种作品之内容的一种作品关联起来。 @zh-hans
toolkit label: 作品的部分吸收 @zh-hans
toolkit definition: 其部分内容被纳入另一种作品之内容的一种作品 @zh-hans
has subproperty: P10225
label: eser tarafından kısmen kapsanmasıdır @tr
definition: Bir eseri, kısmi içeriği başka bir eserin içeriğine dahil edilen bir eserle ilişkilendirir. @tr
toolkit label: eser tarafından kısmen kapsama @tr
toolkit definition: Bir kısmi içeriği başka bir eserin içeriğine dahil edilen bir çalışma. @tr

is replacement in part of work
status: Published
definition: Relates a work to a work whose content is partially superseded and rendered obsolete by the content of another work.
type: Property
domain: C10001
sub property of: is preceded by work
lexical alias: replacementInPartOfWork.en
toolkit label: replacement in part of work
toolkit definition: A work whose content is partially superseded and rendered obsolete by the content of another work.
toolkit label: remplacement partiel d’une œuvre @fr
toolkit definition: Œuvre dont le contenu est remplacé partiellement et rendu périmé par le contenu d’une autre œuvre. @fr
toolkit label: reemplazo en parte de (obra) @es
toolkit definition: Una obra anterior cuyo contenido ha sido reemplazado parcialmente por una obra posterior, generalmente porque la obra posterior contiene información actualizada o nueva que hace obsoleta la obra anterior. @es
scope note: This element applies in general to a static work or an integrating work.
instruction number: 24.5
label: er delvis erstatning af værk @da
definition: Relaterer et værk til et værk, hvis indhold er delvist overflødiggjort og forældet af indholdet af et andet værk. @da
scope note: Dette element gælder generelt for et statisk værk eller et integrerende værk. @da
toolkit label: delvis erstatning af værk @da
toolkit definition: Værk, hvis indhold er delvist overflødiggjort og forældet af indholdet af et andet værk. @da
definition: Met une œuvre en relation avec une œuvre dont le contenu est remplacé partiellement et rendu périmé par le contenu d’une autre œuvre. @fr
label: là thay thế một phần của (tác phẩm) @vi
definition: Liên kết tác phẩm với tác phẩm trước đây mà nội dung của nó đã được thay thế một phần bởi tác phẩm sau này, thường là vì tác phẩm sau này có chứa thông tin cập nhật hoặc mới làm cho phần của tác phẩm trước đây bị lỗi thời. @vi
scope note: Mối quan hệ này áp dụng tổng quát cho đơn vị một phần, chuyên khảo nhiều phần, và tài nguyên tích hợp. @vi
toolkit label: thay thế một phần của (tác phẩm) @vi
toolkit definition: Tác phẩm trước đây mà nội dung của nó đã được thay thế một phần bởi tác phẩm sau này, thường là vì tác phẩm sau này có chứa thông tin cập nhật hoặc mới làm cho phần của tác phẩm trước đây bị lỗi thời. @vi
label: ist teilweise Ersatz von (Werk) @de
definition: Setzt ein Werk in Beziehung zu einem Werk, dessen Inhalt teilweise durch den Inhalt eines anderen Werks ersetzt und überflüssig wird. @de
scope note: Im Allgemeinen trifft dieses Element auf ein statisches Werk oder ein integrierendes Werks zu. @de
toolkit label: Teilweise Ersatz von (Werk) @de
toolkit definition: Ein Werk, dessen Inhalt teilweise durch den Inhalt eines anderen Werks ersetzt und überflüssig wird. @de
label: est un remplacement partiel d’une œuvre @fr
definition: Liittää teoksen teokseen, jonka sisällön toisen teoksen sisältö osittain korvaa ja tekee vanhentuneeksi. @fi
toolkit label: korvaa osittain teoksen @fi
toolkit definition: Teos, jonka sisällön toisen teoksen sisältö osittain korvaa ja tekee vanhentuneeksi. @fi
toolkit label: delvis erstatning for verk @no
toolkit definition: Et verk med innhold som delvis er erstattet og foreldet av innholdet av et annet verk. @no
label: és reemplaçament en part d’una obra @ca
definition: Relaciona una obra amb una obra el contingut de la qual és substituït i convertit en obsolet parcialment pel contingut d’una altra obra. @ca
scope note: En general, aquest element s’aplica a una obra estàtica o una obra integrant. @ca
toolkit label: reemplaçament en part d’una obra @ca
toolkit definition: Obra el contingut de la qual és substituït i convertit en obsolet parcialment pel contingut d’una altra obra. @ca
scope note: Cet élément s’applique généralement à une œuvre statique ou à une œuvre intégratrice. @fr
has element type: 2
label: είναι μερική αντικατάσταση του (έργο) @el
definition: Συνδέει ένα έργο με ένα προηγούμενο έργο του οποίου τα περιεχόμενα έχουν μερικώς αντικατασταθεί από ένα μεταγενέστερο έργο, συνήθως γιατί το μεταγενέστερο έργο περιέχει ενημερωμένη ή νέα πληροφόρηση η οποία καθιστά το προηγούμενο έργο παρωχημένο. @el
scope note: Αυτή η σχέση βρίσκει γενική εφαρμογή σε μονομερείς μονάδες, πολυμερείς μονογραφίες και ενσωματωμένους πόρους. @el
toolkit label: μερική αντικατάσταση του (έργο) @el
toolkit definition: Ένα προηγούμενο έργο του οποίου τα περιεχόμενα έχουν μερικώς αντικατασταθεί από ένα μεταγενέστερο έργο, συνήθως γιατί το μεταγενέστερο έργο περιέχει ενημερωμένη ή νέα πληροφόρηση η οποία καθιστά το προηγούμενο έργο παρωχημένο. @el
label: részben helyettesíti a következő művet: @hu
definition: Hozzákapcsol egy művet egy műhöz, amelynek tartalmát részben túlhaladja és elavulttá teszi egy másik mű tartalma. @hu
scope note: Ezt az elemet általában a statikus, vagy integráló művekre alkalmazzák. @hu
toolkit label: részben helyettesített mű @hu
toolkit definition: Egy mű, amelynek tartalmát részben túlhaladja és elavulttá teszi egy másik mű tartalma. @hu
scope note: Tämä elementti soveltuu yleensä staattiseen teokseen tai päivittyvään teokseen. @fi
label: korvaa osittain teoksen @fi
label: er delvis erstatning for verk @no
definition: Relaterer et verk til et verk med innhold som delvis er erstattet og foreldet av innholdet av et annet verk. @no
scope note: Dette elementet gjelder som oftest for et statisk verk eller et integrerende verk. @no
label: is gedeeltelijke vervanging van werk @nl
definition: Relateert een werk aan een werk waarvan de content gedeeltelijk overschreven en achterhaald is door de content van een ander werk. @nl
scope note: Dit element is over het algemeen van toepassing op een statisch werk of een geïntegreerd werk. @nl
toolkit label: gedeeltelijke vervanging van werk @nl
toolkit definition: Een werk waarvan de content gedeeltelijk overschreven en achterhaald is door de content van een ander werk. @nl
label: هو استبدال في جزء من عمل @ar
definition: يربط عمل بعمل يتم استبدال محتواه جزئيًا ويصبح متقادمًا في وجود محتوى عمل آخر. @ar
scope note: هذا العنصر ينطبق عامة على عمل ثابت أو عمل متكامل. @ar
toolkit label: استبدال في جزء من عمل @ar
toolkit definition: عمل يتم استبدال محتواه جزئيًا ويصبح متقادمًا في وجود محتوى عمل آخر. @ar
label: asendab osaliselt teose @et
definition: Seostab teose teosega, mille sisu on osaliselt asendatud ja tühistatud teise teose sisuga. @et
scope note: Elementi rakendatakse tavaliselt staatilise teose või lõimteose puhul. @et
toolkit label: asendab osaliselt teose @et
toolkit definition: Teos, mille sisu on osaliselt asendatud ja tühistatud teise teose sisuga. @et
label: è sostituzione parziale di opera @it
definition: Correla un’opera a un’opera il cui contenuto è parzialmente sostituito e reso obsoleto dal contenuto di un’altra opera. @it
scope note: Generalmente questo elemento si applica a un'opera statica o a un'opera integrativa. @it
toolkit label: sotituzione parziale di opera @it
toolkit definition: Opera il cui contenuto è parzialmente sostituito e reso obsoleto dal contenuto di un’altra opera. @it
label: ir daļēji aizstātais darbs @lv

is abridgement of work
status: Published
definition: Relates a work to a work that is shortened as a related work without changing the general meaning or manner of presentation.
type: Property
domain: C10001
sub property of: has source work
lexical alias: abridgementOfWork.en
toolkit label: abridgement of work
toolkit definition: A work that is shortened as a related work without changing the general meaning or manner of presentation.
toolkit label: abrégé d’une œuvre @fr
toolkit definition: Œuvre qui est raccourcie comme une œuvre en relation sans changer le sens général ou le mode de présentation. @fr
toolkit label: abreviada de (obra) @es
toolkit definition: Una obra que ha sido abreviada, i.e., acortada sin cambiar el significado general o manera de presentación de la obra fuente. @es
instruction number: 24.5
label: er forkortelse af værk @da
definition: Relaterer et værk til et værk, som er forkortet som et relateret værk, uden at ændre på den overordnede betydning eller præsentationsmåde. @da
toolkit label: forkortelse af værk @da
toolkit definition: Værk, som er forkortet som et relateret værk, uden at ændre på den overordnede betydning eller præsentationsmåde. @da
definition: Met une œuvre en relation avec une œuvre qui est raccourcie comme une œuvre en relation sans changer le sens général ou le mode de présentation. @fr
label: là rút gọn của (tác phẩm) @vi
definition: Liên kết tác phẩm với tác phẩm đã được rút gọn, nghĩa là, làm ngắn nhưng không thay đổi ý nghĩa và cách thức chung của trình bày của tác phẩm nguồn. @vi
toolkit label: rút gọn của (tác phẩm) @vi
toolkit definition: Tác phẩm đã được rút gọn, nghĩa là, làm ngắn nhưng không thay đổi ý nghĩa và cách thức chung của trình bày của tác phẩm nguồn. @vi
label: ist Kurzfassung von (Werk) @de
definition: Setzt ein Werk in Beziehung zu einem in Beziehung stehenden Werk, das gekürzt wurde, ohne die allgemeine Bedeutung oder Art der Darstellung des ursprünglichen Werks zu verändern. @de
toolkit label: Kurzfassung von (Werk) @de
toolkit definition: Ein in Beziehung stehendes Werk, das gekürzt wurde, ohne die allgemeine Bedeutung oder Art der Darstellung des ursprünglichen Werks zu verändern. @de
label: est un abrégé d’une œuvre @fr
definition: Liittää teoksen teokseen, jota on lyhennetty siihen liittyväksi teokseksi muuttamatta yleistä merkitystä tai esitystapaa. @fi
toolkit label: lyhennelmä teoksesta @fi
toolkit definition: Teos, jota on lyhennetty siihen liittyväksi teokseksi muuttamatta yleistä merkitystä tai esitystapaa. @fi
toolkit label: forkortelse av verk @no
toolkit definition: Et verk som er forkortet som et relatert verk uten å endre den generelle meningen eller presentasjonsmåten. @no
label: és abreujament d’una obra @ca
definition: Relaciona una obra amb una obra que s’escurça com una obra relacionada sense canviar el significat general o la forma de presentació. @ca
toolkit label: abreujament d’una obra @ca
toolkit definition: Obra que s’escurça com una obra relacionada sense canviar el significat general o la forma de presentació. @ca
has element type: 2
label: είναι σύντμηση του (έργο) @el
definition: Συνδέει ένα έργο με ένα έργο το οποίο έχει συντμηθεί, το οποίο δηλαδή έχει συμπτυχθεί σε έκταση, χωρίς να έχει αλλάξει το γενικό νόημα ή ο τρόπος παρουσίασης του έργου-πηγής. @el
toolkit label: σύντμηση του (έργο) @el
toolkit definition: Ένα έργο το οποίο έχει συντμηθεί, το οποίο δηλαδή έχει συμπτυχθεί σε έκταση, χωρίς να έχει αλλάξει το γενικό νόημα ή ο τρόπος παρουσίασης του έργου-πηγής. @el
label: rövidítése a következő műnek: @hu
definition: Hozzákapcsol egy művet egy műhöz, amelyet kapcsolódó művé tömörítettek, azaz lerövidítettek anélkül, hogy általános jelentését vagy prezentációját megváltoztatták volna. @hu
toolkit label: rövidített mű @hu
toolkit definition: Egy mű, amelyet kapcsolódó művé tömörítettek, azaz lerövidítettek anélkül, hogy általános jelentését vagy prezentációját megváltoztatták volna. @hu
label: lyhennelmä teoksesta @fi
label: er forkortelse av verk @no
definition: Relaterer et verk til et verk som er forkortet som et relatert verk uten å endre den generelle meningen eller presentasjonsmåten. @no
label: is inkorting van werk @nl
definition: Relateert een werk aan een werk dat ingekort is als een gerelateerd werk zonder de algehele betekenis te veranderen of manier van presentatie. @nl
toolkit label: inkorting van werk @nl
toolkit definition: Een werk dat ingekort is als een gerelateerd werk zonder de algehele betekenis te veranderen of manier van presentatie. @nl
label: هو اختصار لعمل @ar
definition: يربط عمل بعمل تم اختصاره كعمل ذي صلة دون تغيير المعنى العام أو طريقة العرض. @ar
toolkit label: اختصار لعمل @ar
toolkit definition: عمل تم اختصاره كعمل ذي صلة دون تغيير المعنى العام أو طريقة العرض. @ar
label: lühendus teosest @et
definition: Seostab teose teosega, mida on lühendatud, muutmata seotud teose üldist tähendust ja esitusviisi. @et
toolkit label: lühendus teosest @et
toolkit definition: Teos, mida on lühendatud, muutmata seotud teose üldist tähendust ja esitusviisi. @et
label: è riduzione di opera @it
definition: Correla un’opera a un’opera abbreviata come un’opera correlata senza cambiamenti nel significato o nel modo di presentazione. @it
toolkit label: riduzione di opera @it
toolkit definition: Opera abbreviata come un’opera correlata senza cambiamenti nel significato o nel modo di presentazione. @it
label: ir pilnīgāks darbs / saīsināts darbs no @lv
definition: Sasaista darbu ar darbu kurš ticis saīsināts, nemainot tā nozīmi vai pasniegšanas veidu. @lv
toolkit label: pilnīgāks darbs / saīsināts darbs no @lv
toolkit definition: Darbs kurš ticis saīsināts, nemainot tā nozīmi vai pasniegšanas veidu @lv
label: 是作品的缩编 @zh-hans
definition: 将一种作品与被缩短为一种相关作品而不改变其总体意义或呈现方式的一种作品关联起来。 @zh-hans
toolkit label: 作品的缩编 @zh-hans
toolkit definition: 被缩短为一种相关作品而不改变其总体意义或呈现方式的一种作品 @zh-hans
has subproperty: P10125
label: eserin özetlenmiş halidir @tr
definition: Bir eseri, genel anlamını veya sunum şeklini değiştirmeden ilgili bir eseri olarak kısaltılmış bir eserle ilişkilendirir. @tr
toolkit label: eserin özetlemesi @tr
toolkit definition: Genel anlamı veya sunuluş biçimi değiştirilmeden ilişkili bir eser olarak kısaltılan bir eser. @tr

is free translation of work
status: Published
definition: Relates a work to a work that is both adapted and translated into another language.
type: Property
domain: C10001
sub property of: is transformation by style of
lexical alias: freeTranslationOfWork.en
toolkit label: free translation of work
toolkit definition: A work that is both adapted and translated into another language.
toolkit label: traduction libre d’une œuvre @fr
toolkit definition: Œuvre qui est à la fois adaptée et traduite dans une autre langue. @fr
toolkit label: traducción libre de (obra) @es
toolkit definition: Una obra que ha sido traducida libremente, preservando el espíritu original, pero no sus detalles linguísticos. @es
instruction number: 24.5
label: er fri oversættelse af værk @da
definition: Relaterer et værk til et værk, som er bearbejdet og oversat til et andet sprog. @da
toolkit label: fri oversættelse af værk @da
toolkit definition: Værk, som er bearbejdet og oversat til et andet sprog. @da
definition: Met une œuvre en relation avec une œuvre qui est à la fois adaptée et traduite dans une autre langue. @fr
label: là dịch tự do của (tác phẩm) @vi
definition: Liên kết tác phẩm với tác phẩm đã được phỏng theo và dịch sang ngôn ngữ khác. @vi
toolkit label: dịch tự do của (tác phẩm) @vi
toolkit definition: Tác phẩm đã được phỏng theo và dịch sang ngôn ngữ khác. @vi
label: ist freie Übersetzung von (Werk) @de
definition: Setzt ein Werk in Beziehung zu einem Werk, das sowohl bearbeitet als auch in eine andere Sprache übersetzt ist. @de
toolkit label: Freie Übersetzung von (Werk) @de
toolkit definition: Ein Werk, das sowohl bearbeitet als auch in eine andere Sprache übersetzt ist. @de
label: est une traduction libre d’une œuvre @fr
definition: Liittää teoksen teokseen, joka on sekä sovitettu että käännetty toiselle kielelle. @fi
toolkit label: vapaa käännös teoksesta @fi
toolkit definition: Teos, joka on sekä sovitettu että käännetty toiselle kielelle. @fi
toolkit label: fri oversettelse av verk @no
toolkit definition: Et verk som er bearbeidet og oversatt til et annet språk. @no
label: és traducció lliure d’una obra @ca
definition: Relaciona una obra amb una obra que s’adapta i es tradueix a una altra llengua. @ca
toolkit label: traducció lliure d’una obra @ca
toolkit definition: Obra que s’adapta i es tradueix a una altra llengua. @ca
has element type: 2
label: είναι ελεύθερη μετάφραση του (έργο) @el
definition: Συνδέει ένα έργο με ένα έργο το οποίο έχει προσαρμοστεί και μεταφραστεί σε μια άλλη γλώσσα. @el
toolkit label: ελεύθερη μετάφραση του (έργο) @el
toolkit definition: Ένα έργο το οποίο έχει προσαρμοστεί και μεταφραστεί σε μια άλλη γλώσσα. @el
label: szabad fordítása a következő műnek @hu
definition: Hozzákapcsol egy művet egy műhöz, amelyet adaptáltak és másik nyelvre fordítottak. @hu
toolkit label: szabadon fordított mű @hu
toolkit definition: Egy mű, amelyet adaptáltak és másik nyelvre fordítottak. @hu
label: vapaa käännös teoksesta @fi
label: er fri oversettelse av verk @no
definition: Relaterer et verk til et verk som er bearbeidet og oversatt til et annet språk. @no
label: is vrije vertaling van werk @nl
definition: Relateert een werk aan een werk dat zowel bewerkt als vertaald is in een andere taal. @nl
toolkit label: vrije vertaling van werk @nl
toolkit definition: Een werk dat zowel bewerkt als vertaald is in een andere taal. @nl
label: هو ترجمة بتصرف لعمل @ar
definition: يربط عمل بعمل تمت معالجته وترجمته إلى لغة أخرى. @ar
toolkit label: ترجمة بتصرف لعمل @ar
toolkit definition: عمل تمت معالجته وترجمته إلى لغة أخرى. @ar
label: vaba tõlge teosest @et
definition: Seostab teose teosega, mis on adapteeritud ja tõlgitud teise keelde. @et
toolkit label: vaba tõlge teosest @et
toolkit definition: Teos, mis on adapteeritud ja tõlgitud teise keelde. @et
label: è traduzione libera di opera @it
definition: Correla un'opera a un'opera adattata e tradotta in un’altra lingua. @it
toolkit label: traduzione libera di opera @it
toolkit definition: Opera adattata e tradotta in un’altra lingua. @it
label: ir brīvi tulkotais darbs @lv
definition: Sasaista darbu ar darbu, kas ir adaptēts un tulkots citā valodā. @lv
toolkit label: brīvi tulkotais darbs @lv
toolkit definition: Darbs, kas ir adaptēts un tulkots citā valodā. @lv
label: 是作品的自由翻译 @zh-hans
definition: 将一种作品与被改编并被翻译成另一种语言的一种作品关联起来。 @zh-hans
toolkit label: 作品的自由翻译 @zh-hans
toolkit definition: 被改编并被翻译成另一种语言的一种作品 @zh-hans
has subproperty: P10143
label: eserin serbest çevirisidir @tr
definition: Bir eseri, başka bir dile hem uyarlanmış hem de çevrilmiş bir eserle ilişkilendirir. @tr
toolkit label: eserin serbest çevirisi @tr
toolkit definition: Başka bir dile hem uyarlanmış hem de çevrilmiş bir eser. @tr

is review of work
status: Published
definition: Relates a work to a work that is briefly evaluated by a work.
type: Property
domain: C10001
lexical alias: reviewOfWork.en
toolkit label: review of work
toolkit definition: A work that is briefly evaluated by a work.
toolkit label: recension d’une œuvre @fr
toolkit definition: Œuvre qui est brièvement évaluée par une œuvre. @fr
toolkit label: reseña de (obra) @es
toolkit definition: Una obra que es usada como base para una evaluación breve. @es
instruction number: 23.5
label: er anmeldelse af værk @da
definition: Relaterer et værk til et værk, som anvendes som grundlag for en kortfattet evaluering. @da
toolkit label: anmeldelse af værk @da
toolkit definition: Værk, som anvendes som grundlag for en kortfattet evaluering. @da
definition: Met une œuvre en relation avec une œuvre qui est brièvement évaluée par une œuvre. @fr
label: là tổng thuật của (tác phẩm) @vi
definition: Liên kết tác phẩm với tác phẩm được sử dụng như là cơ sở cho đánh giá ngắn gọn. @vi
toolkit label: tổng thuật của (tác phẩm) @vi
toolkit definition: Tác phẩm được sử dụng như là cơ sở cho đánh giá ngắn gọn. @vi
label: ist Rezension von (Werk) @de
definition: Setzt ein Werk in Beziehung zu einem Werk, das als Grundlage für eine kurze Untersuchung verwendet wird. @de
toolkit label: Rezension von (Werk) @de
toolkit definition: Ein Werk, das als Grundlage für eine kurze Untersuchung verwendet wird. @de
label: est une recension d’une œuvre @fr
definition: Liittää teoksen lyhyen arvioinnin perustana käytettyyn teokseen. @fi
toolkit label: arvostelu teoksesta @fi
toolkit definition: Teoksen lyhyen arvioinnin perustana käytetty teos. @fi
toolkit label: anmeldelse av verk @no
toolkit definition: Et verk brukt som utgangspunkt for en kortfattet evaluering. @no
label: és revisió d’una obra @ca
definition: Relaciona una obra amb una obra que és avaluada breument per una obra. @ca
toolkit label: revisió d’una obra @ca
toolkit definition: Obra que és avaluada breument per una obra. @ca
has element type: 2
label: είναι κριτική του (έργο) @el
definition: Συνδέει ένα έργο με ένα έργο που χρησιμοποιείται ως η βάση για μια σύντομη αξιολόγηση. @el
toolkit label: κριτική του (έργο) @el
toolkit definition: Ένα έργο που χρησιμοποιείται ως η βάση για μια σύντομη αξιολόγηση. @el
label: szemlézi a következő művet: @hu
definition: Hozzákapcsol egy művet egy műhöz, amelyet egy rövid kiértékelés alapjaként használnak. @hu
toolkit label: szemlézett mű @hu
toolkit definition: Egy mű, amelyet egy rövid kiértékelés alapjaként használnak. @hu
label: arvostelu teoksesta @fi
label: er anmeldelse av verk @no
definition: Relaterer et verk til et verk brukt som utgangspunkt for en kortfattet evaluering. @no
label: is recensie van werk @nl
definition: Relateert een werk aan een werk gebruikt als een basis voor een korte beschouwing. @nl
toolkit label: recensie van werk @nl
toolkit definition: Een werk gebruikt als een basis voor een korte beschouwing. @nl
label: هو مراجعة لعمل @ar
definition: يربط عمل بعمل يُستخدم كأساس لتقييم موجز. @ar
toolkit label: مراجعة لعمل @ar
toolkit definition: عمل يُستخدم كأساس لتقييم موجز. @ar
label: ülevaade teosest @et
definition: Seostab teose teosega, mis on lühihinnangu aluseks. @et
toolkit label: ülevaade teosest @et
toolkit definition: Teos, mis on lühihinnangu aluseks. @et
label: è recensione di opera @it
definition: Correla un'opera a un'opera usata come base per una breve valutazione. @it
toolkit label: recensione di opera @it
toolkit definition: Opera usata come base per una breve valutazione. @it
sub property of: is evaluation of work
label: ir recenzija darbam @lv
definition: Sasaista darbu ar darbu, kas izmantots par pamatu īsam novērtējumam. @lv
toolkit label: recenzija darbam @lv
toolkit definition: Darbs, kas izmantots par pamatu īsam novērtējumam. @lv
label: 是作品的评论 @zh-hans
definition: 将一种作品与被一种作品简要评价的一种作品关联起来。 @zh-hans
toolkit label: 作品的评论 @zh-hans
toolkit definition: 被一种作品简要评价的一种作品 @zh-hans
has subproperty: P10178
label: eserin incelemesidir @tr
definition: Bir eseri, bir eser tarafından kısaca değerlendirilen bir eserle ilişkilendirir. @tr
toolkit label: eserin incelemesi @tr
toolkit definition: Bir çalışma tarafından kısaca değerlendirilen çalışma. @tr

is subject work of
status: Published
type: Property
lexical alias: subjectWorkOf.en
definition: Relates a work to a work that is about a work.
domain: C10001
toolkit label: subject work of
toolkit definition: A work that is about a work.
sub property of: has related work of work
toolkit label: materia de (obra) @es
toolkit definition: Una obra de una obra sobre la que trata la obra. @es
label: er værk, som er subjekt af @da
definition: Relaterer et værk, som handler om et værk. @da
toolkit label: værk, som er subjekt af @da
toolkit definition: Værk, som handler om et værk. @da
label: là chủ đề của (tác phẩm) @vi
definition: Liên kết tác phẩm với tác phẩm nói về tác phẩm. @vi
toolkit label: chủ đề của (tác phẩm) @vi
toolkit definition: Tác phẩm nói về tác phẩm. @vi
label: ist Werk als Thema von @de
definition: Setzt ein Werk in Beziehung zu einem Werk, das von einem Werk handelt. @de
toolkit label: Werk als Thema von @de
toolkit definition: Ein Werk, das von einem Werk handelt. @de
definition: Liittää teoksen teokseen, joka koskee teosta. @fi
toolkit label: aiheena oleva teos teoksessa @fi
toolkit definition: Teos, joka koskee teosta. @fi
toolkit label: emneverk for @no
toolkit definition: Et verk som handler om et verk. @no
label: és obra de matèria de @ca
definition: Relaciona una obra amb una obra que tracta sobre una obra. @ca
toolkit label: obra de matèria de @ca
toolkit definition: Obra que tracta sobre una obra. @ca
label: est une œuvre sujet de @fr
definition: Met une œuvre en relation avec une œuvre qui traite d’une œuvre. @fr
toolkit label: œuvre sujet de @fr
toolkit definition: Œuvre qui traite d’une œuvre. @fr
has element type: 2
alternative label: subject of (work)
label: είναι θέμα του (έργο) @el
definition: Συνδέει ένα έργο με ένα έργο το οποίο αναφέρεται σε ένα έργο. @el
toolkit label: θέμα του (έργο) @el
toolkit definition: Ένα έργο το οποίο αναφέρεται σε ένα έργο. @el
label: tárgyműve a következőnek: @hu
definition: Hozzákapcsol egy művet egy műhöz, amely egy műről szól. @hu
toolkit label: tárgyműve: @hu
toolkit definition: Egy mű, amely egy műről szól. @hu
sub property of: P00014
label: aiheena oleva teos teoksessa @fi
label: er emneverk for @no
definition: Relaterer et verk til et verk som handler om et verk. @no
alternative label: emne for verk @no
label: is werk als onderwerp van @nl
definition: Relateert een werk aan een werk dat over een werk gaat. @nl
toolkit label: werk als onderwerp van @nl
toolkit definition: Een werk dat over een werk gaat. @nl
alternative label: aiheena teoksessa (teos) @fi
label: هو عمل موضوع لـ @ar
definition: يربط عمل بعمل يدور حول عمل. @ar
alternative label: موضوع (عمل) @ar
toolkit label: عمل موضوع @ar
toolkit definition: عمل يدور حول عمل. @ar
alternative label: matèria de (obra) @ca
alternative label: emne for værk @da
label: käsitletud teoses (teos) @et
definition: Seostab teose teosega, mis on teose kohta. @et
toolkit label: käsitletud teoses (teos) @et
toolkit definition: Teos, mis on teose kohta. @et
alternative label: Thema von (Werk) @de
label: è soggetto di @it
definition: Correla un'opera a un'opera che tratta di un'opera. @it
alternative label: soggetto di (opera) @it
toolkit label: soggetto opera di @it
toolkit definition: Opera che tratta di un'opera. @it
alternative label: sujet de (œuvre) @fr
label: ir temats (darbs) @lv
definition: Sasaista darbu ar darbu, kura temats ir darbs. @lv
toolkit label: ir temats (darbs) @lv
toolkit definition: Darbs, kura temats ir darbs. @lv
alternative label: ……的主题（作品） @zh-hans
label: 是……的主题作品 @zh-hans
toolkit label: ……的主题作品 @zh-hans

is television adaptation of work
status: Published
definition: Relates a work to a work that is adapted as a television program.
type: Property
domain: C10001
sub property of: is adaptation of work
lexical alias: televisionAdaptationOfWork.en
toolkit label: television adaptation of work
toolkit definition: A work that is adapted as a television program.
toolkit label: adaptation pour la télévision d’une œuvre @fr
toolkit definition: Œuvre qui est adaptée en émission de télévision. @fr
toolkit label: adaptación para televisión (obra) @es
toolkit definition: Una obra que ha sido adaptada como programa de televisión. @es
instruction number: 24.5
label: er bearbejdelse af værk til tv @da
definition: Relaterer et værk til et værk, som er bearbejdet til et tv-program. @da
toolkit label: bearbejdelse af værk til tv @da
toolkit definition: Værk, som er bearbejdet til et tv-program. @da
definition: Met une œuvre en relation avec une œuvre qui est adaptée en émission de télévision. @fr
label: là phỏng theo truyền hình của (tác phẩm) @vi
definition: Liên kết tác phẩm với tác phẩm đã được phỏng theo như là chương trình truyền hình. @vi
toolkit label: phỏng theo truyền hình của (tác phẩm) @vi
toolkit definition: Tác phẩm đã được phỏng theo như là chương trình truyền hình. @vi
label: ist Fernsehbearbeitung von (Werk) @de
definition: Setzt ein Werk in Beziehung zu einem Werk, das als Fernsehsendung bearbeitet ist. @de
toolkit label: Fernsehbearbeitung von (Werk) @de
toolkit definition: Ein Werk, das als Fernsehsendung bearbeitet ist. @de
label: est une adaptation pour la télévision d’une œuvre @fr
definition: Liittää teoksen teokseen, joka on sovitettu televisio-ohjelmaksi. @fi
toolkit label: televisiosovitus teoksesta @fi
toolkit definition: Teos, joka on sovitettu televisio-ohjelmaksi. @fi
toolkit label: bearbeidelse av verk for fjernsyn @no
toolkit definition: Et verk som er bearbeidet til et fjernsynsprogram. @no
label: és adaptació per a televisió d’una obra @ca
definition: Relaciona una obra amb una obra que s’adapta com un programa de televisió. @ca
toolkit label: adaptació per a televisió d’una obra @ca
toolkit definition: Obra que s’adapta com un programa de televisió. @ca
has element type: 2
label: είναι τηλεοπτική προσαρμογή του (έργο) @el
definition: Συνδέει ένα έργο με ένα έργο το οποίο έχει προσαρμοστεί ως τηλεοπτικό πρόγραμμα. @el
toolkit label: τηλεοπτική προσαρμογή του (έργο) @el
toolkit definition: Ένα έργο το οποίο έχει προσαρμοστεί ως τηλεοπτικό πρόγραμμα. @el
label: televíziós adaptációja a következő műnek: @hu
definition: Hozzákapcsol egy művet egy műhöz, amelyet televízióműsorként adaptáltak. @hu
toolkit label: televízióműsorként átdolgozott mű @hu
toolkit definition: Egy mű, amelyet televízióműsorként átdolgoztak. @hu
label: televisiosovitus teoksesta @fi
label: er bearbeidelse av verk for fjernsyn @no
definition: Relaterer et verk til et verk som er bearbeidet til et fjernsynsprogram. @no
label: is televisiebewerking van werk @nl
definition: Relateert een werk aan een werk dat is bewerkt als een televisieprogramma. @nl
toolkit label: televisiebewerking van werk @nl
toolkit definition: Een werk dat is bewerkt als een televisieprogramma. @nl
label: هو معالجة تليفزيونية لعمل @ar
definition: يربط عمل بعمل تمت معالجته كبرنامج تليفزيوني. @ar
toolkit label: معالجة تليفزيونية لعمل @ar
toolkit definition: عمل تمت معالجته كبرنامج تليفزيوني. @ar
label: televersioon teosest @et
definition: Seostab teose teosega, mis on adapteeritud telesaatena. @et
toolkit label: televersioon teosest @et
toolkit definition: Teos, mis on adapteeritud telesaatena. @et
label: è adattamento televisivo di opera @it
definition: Correla un’opera a un’opera adattata come programma televisivo. @it
toolkit label: adattamento telvisivo di opera @it
toolkit definition: Opera adattata come programma televisivo. @it
label: kā televīzijas raidījums adaptētais darbs @lv
definition: Sasaista darbu ar darbu, kas ir adaptēts kā televīzijas raidījums. @lv
toolkit label: kā televīzijas raidījums adaptētais darbs @lv
toolkit definition: Darbs, kas ir adaptēts kā televīzijas raidījums. @lv
label: 是作品的电视改编 @zh-hans
definition: 将一种作品与被改编为电视节目的一种作品关联起来。 @zh-hans
toolkit label: 作品的电视改编 @zh-hans
toolkit definition: 被改编为电视节目的一种作品 @zh-hans
has subproperty: P10132
label: eserin televizyon uyarlamasıdır @tr
definition: Bir eseri, televizyon programı olarak uyarlanan bir eserle ilişkilendirir. @tr
toolkit label: eserin televizyon uyarlaması @tr
toolkit definition: Bir televizyon programı olarak uyarlanan bir çalışma. @tr

is separated from work
status: Published
definition: Relates a work to a work that is a diachronic work that is continuing whose partial content is continued by another diachronic work.
type: Property
domain: C10001
sub property of: is preceded by work
lexical alias: separatedFromWork.en
toolkit label: separated from work
toolkit definition: A work that is a diachronic work that is continuing whose partial content is continued by another diachronic work.
toolkit label: détaché d’une œuvre @fr
toolkit definition: Œuvre diachronique qui se poursuit et dont le contenu partiel est continué par une autre œuvre diachronique. @fr
toolkit label: separada de (obra) @es
toolkit definition: Una obra que se desprende de una parte de su contenido para formar una obra nueva. @es
instruction number: 24.5
label: er opdelt fra værk @da
definition: Relaterer et værk til et værk, som er et diakronisk værk, der fortsætter, men hvis delvise indhold fortsættes af et andet diakronisk værk. @da
toolkit label: opdelt fra værk @da
toolkit definition: Værk, som er et diakronisk værk, der fortsætter, men hvis delvise indhold fortsættes af et andet diakronisk værk. @da
definition: Met une œuvre en relation avec une œuvre diachronique qui se poursuit et dont le contenu partiel est continué par une autre œuvre diachronique. @fr
label: được phân tách từ (tác phẩm) @vi
definition: Liên kết tác phẩm với tác phẩm chia tách một phần nội dung để tạo thành tác phẩm mới. @vi
toolkit label: được phân tách từ (tác phẩm) @vi
toolkit definition: Tác phẩm chia tách một phần nội dung để tạo thành tác phẩm mới. @vi
label: ist abgespalten von (Werk) @de
definition: Setzt ein Werk in Beziehung zu einem fortlaufenden diachronen Werk, dessen Inhalt teilweise durch ein anderes diachrones Werk fortgeführt wird. @de
toolkit label: Abgespalten von (Werk) @de
toolkit definition: Ein fortlaufendes, diachrones Werk, dessen Inhalt teilweise durch ein anderes diachrones Werk fortgeführt wird. @de
label: est détaché d’une œuvre @fr
definition: Liittää teoksen teokseen, joka on jatkuva diakroninen teos, jonka osittaista sisältöä jatkaa toinen diakroninen teos. @fi
toolkit label: eronnut teoksesta @fi
toolkit definition: Teos, joka on jatkuva diakroninen teos, jonka osittaista sisältöä jatkaa toinen diakroninen teos. @fi
toolkit label: skilt fra verk @no
toolkit definition: Et verk som er et løpende diakronisk verk hvor deler av innholdet fortsettes av et annet diakronisk verk. @no
label: és separat d’una obra @ca
definition: Relaciona una obra amb una obra que és diacrònica i que és contínua, el contingut parcial de la qual és continuat per una altra obra diacrònica. @ca
toolkit label: separat d’una obra @ca
toolkit definition: Obra que és diacrònica que és contínua, el contingut parcial de la qual és continuat per una altra obra diacrònica. @ca
has element type: 2
label: είναι διαχωρισμένο από (έργο) @el
definition: Συνδέει ένα έργο με ένα έργο το οποίο αποσχίστηκε από το περιεχόμενό του για να σχηματίσει ένα νέο έργο. @el
toolkit label: διαχωρισμένο από (έργο) @el
toolkit definition: Ένα έργο το οποίο αποσχίστηκε από το περιεχόμενό του για να σχηματίσει ένα νέο έργο. @el
label: elkülönült a következő műtől: @hu
definition: Hozzákapcsol egy művet egy folytatódó diakronikus műhöz, amelynek részleges tartalmát egy másik diakronikus mű folytatja. @hu
toolkit label: részben szétvált mű @hu
toolkit definition: Egy folytatódó diakronikus mű, amelynek részleges tartalmát egy másik diakronikus mű folytatja. @hu
scope note: This element applies in general to a successive work.
scope note: Tämä elementti soveltuu yleensä peräkkäisesti ilmestyvään teokseen. @fi
label: eronnut teoksesta @fi
label: er skilt fra verk @no
definition: Relaterer et verk til et verk som er et løpende diakronisk verk hvor deler av innholdet fortsettes av et annet diakronisk verk. @no
scope note: Dette elementet gjelder som oftest for et påfølgende verk. @no
label: is afgesplitst van werk @nl
definition: Relateert een werk aan een werk dat een diachronisch werk is dat voortgezet wordt waarvan gedeeltelijke content voortgezet wordt door een ander diachronisch werk. @nl
scope note: Dit element is over het algemeen van toepassing op een successief werk. @nl
toolkit label: afgesplitst van werk @nl
toolkit definition: Een werk dat een diachronisch werk is dat voortgezet wordt waarvan gedeeltelijke content voortgezet wordt door een ander diachronisch werk. @nl
label: هو منفصل عن عمل @ar
definition: يربط عمل بعمل عبارة عن عمل ممتد زمنيًا، ومستمر، ومحتواه الجزئي مستمر من خلال عمل آخر ممتد زمنيًا. @ar
scope note: هذا العنصر ينطبق عامة على عمل متتالٍ. @ar
toolkit label: منفصل عن عمل @ar
toolkit definition: عمل ممتد زمنيًا، ومستمر، ومحتواه الجزئي مستمر من خلال عمل آخر ممتد زمنيًا. @ar
scope note: En general, aquest element s’aplica a una obra successiva. @ca
scope note: Dette element gælder generelt for et fortløbende værk. @da
label: eraldunud teosest @et
definition: Seostab teose jätkuva diakroonilise teosega, mille sisu osaliselt jätkab teine diakrooniline teos. @et
scope note: Elementi rakendatakse peamiselt järgteose puhul. @et
toolkit label: eraldunud teosest @et
toolkit definition: Jätkuv diakrooniline teos, mille sisu osaliselt jätkab teine diakrooniline teos. @et
scope note: Im Allgemeinen trifft dieses Element auf ein sukzessives Werk zu. @de
scope note: Ez az elem általában a folyamatos művekre vonatkozik. @hu
label: è disinta da opera @it
definition: Correla un’opera a un’opera diacronica che continua il cui contento parziale è continuato da un'altra opera diacronica. @it
scope note: Generalmente questo elemento si applica a un'opera successiva @it
toolkit label: distinta da opera @it
toolkit definition: Opera diacronica che continua il cui contento parziale è continuato da un'altra opera diacronica. @it
scope note: Cet élément s’applique généralement à une œuvre successive. @fr
label: ir atdalīts darbs @lv
definition: Sasaista darbu ar darbu, kas ir diahronisks darbs, kura saturu daļēji turpina cits diahroniskais darbs. @lv
toolkit label: darbs: atdalīts no @lv

has history of work
status: Published
definition: Relates a work to a summary of information about the history of a work.
type: Property
domain: C10001
lexical alias: historyOfWork.en
instruction number: 6.7
toolkit label: history of work
toolkit definition: A summary of information about the history of a work.
toolkit label: historique d’une œuvre @fr
toolkit definition: Résumé d’informations sur l’histoire d’une œuvre. @fr
toolkit label: historia de la obra @es
toolkit definition: Información relativa a la historia de una obra. @es
label: har verkets historia @sv
toolkit label: verkets historia @sv
label: har værkhistorie @da
definition: Relaterer et værk til en opsummering af oplysninger om et værks historie. @da
toolkit label: værkhistorie @da
toolkit definition: Opsummering af oplysninger om et værks historie. @da
definition: Met une œuvre en relation avec un résumé de l’information sur l’histoire d’une œuvre. @fr
label: có lịch sử của tác phẩm @vi
definition: Liên kết tác phẩm với tóm lược thông tin về lịch sử của tác phẩm. @vi
toolkit label: lịch sử của tác phẩm @vi
toolkit definition: Tóm lược thông tin về lịch sử của tác phẩm. @vi
label: hat Geschichte eines Werks @de
definition: Setzt ein Werk in Beziehung zu Informationen über die Geschichte eines Werks. @de
toolkit label: Geschichte eines Werks @de
toolkit definition: Informationen über die Geschichte eines Werks. @de
label: a pour historique d’une œuvre @fr
definition: Liittää teoksen yhteenvetoon teoksen historiaan liittyvistä tiedoista. @fi
toolkit label: teoksen historia @fi
toolkit definition: Yhteenveto teoksen historiaan liittyvistä tiedoista. @fi
toolkit label: verkets historie @no
toolkit definition: Et sammendrag av informasjon om et verks historie. @no
label: té com a història d’una obra @ca
definition: Relaciona una obra amb un resum de la informació sobre la història d’una obra. @ca
toolkit label: història d’una obra @ca
toolkit definition: Resum de la informació sobre la història d’una obra. @ca
has element type: 6
label: έχει ιστορία του έργου @el
definition: Συνδέει ένα έργο με μια περίληψη των πληροφοριών που αναφέρονται στην ιστορία ενός έργου. @el
toolkit label: ιστορία του έργου @el
toolkit definition: Μια περίληψη των πληροφοριών που αναφέρονται στην ιστορία ενός έργου. @el
label: mű története a következő: @hu
definition: Hozzákapcsol egy művet egy mű történetéről szóló információk összefoglalásához. @hu
toolkit label: műtörténet @hu
toolkit definition: Egy mű történetéről szóló információk összefoglalása. @hu
label: teoksen historia @fi
label: verkets historie @no
definition: Relaterer et verk til et sammendrag av informasjon om et verks historie. @no
label: heeft geschiedenis van werk @nl
definition: Relateert een werk aan een samenvatting van informatie betreffende de geschiedenis van een werk. @nl
toolkit label: geschiedenis van werk @nl
toolkit definition: Een samenvatting van informatie betreffende de geschiedenis van een werk. @nl
label: له تاريخ لعمل @ar
definition: يربط بين عمل وملخص المعلومات حول تاريخ عمل. @ar
toolkit label: تاريخ لعمل @ar
toolkit definition: ملخص المعلومات حول تاريخ لعمل. @ar
label: teose ajalugu @et
definition: Seostab teose kokkuvõtliku infoga teose ajaloo kohta. @et
toolkit label: teose ajalugu @et
toolkit definition: Kokkuvõtlik info teose ajaloo kohta. @et
label: ha come storia di opera @it
definition: Correla un'opera a informazioni sintetiche sulla storia di un'opera. @it
toolkit label: storia di opera @it
toolkit definition: Informazioni sintetiche sulla storia di un'opera. @it
label: darba vēsture @lv
definition: Sasaista darbu ar informāciju par darba vēsturi. @lv
toolkit label: darba vēsture @lv
toolkit definition: Informācija par darba vēsturi. @lv
label: 有作品的历史 @zh-hans
definition: 将一种作品与关于一种作品历史的信息提要关联起来。 @zh-hans
toolkit label: 作品的历史 @zh-hans
toolkit definition: 关于一种作品历史的信息提要 @zh-hans
has subproperty: P10210
label: eserin geçmişi ile ilişkilidir @tr
definition: Bir eseri, bir eserin tarihi hakkındaki bilgilerin bir özetiyle ilişkilendirir. @tr
toolkit label: çalışmanın tarihçesi @tr
toolkit definition: Bir eserin tarihi hakkındaki bilgilerin özeti. @tr

is remake of work
status: Published
definition: Relates a work to a work used as a basis for a new motion picture, radio program, television program, or video.
type: Property
domain: C10001
sub property of: is transformation by style of
lexical alias: remakeOfWork.en
toolkit label: remake of work
toolkit definition: A work used as a basis for a new motion picture, radio program, television program, or video.
toolkit label: nouvelle version d’une œuvre @fr
toolkit definition: Œuvre qui sert de base à un nouveau film, une nouvelle émission de radio, une nouvelle émission de télévision ou une nouvelle vidéo. @fr
toolkit label: remake de (obra) @es
toolkit definition: Una obra utilizada como base para nueva película cinematográfica, programa de radio, programa de televisión o video. @es
instruction number: 24.5
label: er genindspilning af værk @da
definition: Relaterer et værk til et værk, som anvendes som grundlag for en ny spillefilm, radioprogram, tv-program eller video. @da
toolkit label: genindspilning af værk @da
toolkit definition: Værk, som anvendes som grundlag for en ny spillefilm, radioprogram, tv-program eller video. @da
definition: Met une œuvre en relation avec une œuvre qui sert de base à un nouveau film, une nouvelle émission de radio, une nouvelle émission de télévision ou une nouvelle vidéo. @fr
label: là làm lại của (tác phẩm) @vi
definition: Liên kết tác phẩm với tác phẩm được sử dụng như là cơ sở cho phim điện ảnh, chương trình truyền thanh, chương trình truyền hình, hoặc video mới. @vi
toolkit label: làm lại của (tác phẩm) @vi
toolkit definition: Tác phẩm được sử dụng như là cơ sở cho phim điện ảnh, chương trình truyền thanh, chương trình truyền hình, hoặc video mới. @vi
label: ist Remake von (Werk) @de
definition: Setzt ein Werk in Beziehung zu einem Werk, das als Grundlage für einen neuen Film, eine neue Hörfunksendung, eine neue Fernsehsendung oder ein neues Video verwendet wird. @de
toolkit label: Remake von (Werk) @de
toolkit definition: Ein Werk, das als Grundlage für einen neuen Film, eine neue Hörfunksendung, eine neue Fernsehsendung oder ein neues Video verwendet wird. @de
label: est une nouvelle version d’une œuvre @fr
definition: Liittää teoksen uuden elokuvan, televisio-ohjelman, radio-ohjelman tai videon perustana käytettyyn teokseen. @fi
toolkit label: uusintaproduktio teoksesta @fi
toolkit definition: Uuden elokuvan, televisio-ohjelman, radio-ohjelman tai videon perustana käytetty teos. @fi
toolkit label: nyinnspilling av verk @no
toolkit definition: Et verk brukt som utgangspunkt for en ny spillefilm, et nytt radioprogram, et nytt fjernsynsprogram eller en ny video @no
label: és nova versió d’una obra @ca
definition: Relaciona una obra amb una obra usada com a base d’una nova pel·lícula cinematogràfica, un nou programa radiofònic, un nou programa de televisió o un nou vídeo. @ca
toolkit label: nova versió d’una obra @ca
toolkit definition: Obra usada com a base d’una nova pel·lícula cinematogràfica, un nou programa radiofònic, un nou programa de televisió o un nou vídeo. @ca
has element type: 2
label: είναι ανακατασκευή του (έργο) @el
definition: Συνδέει ένα έργο με ένα έργο το οποίο χρησιμοποιείται ως η βάση για μια νέα κινηματογραφική ταινία, ένα ραδιοφωνικό πρόγραμμα, ένα τηλεοπτικό πρόγραμμα ή βίντεο. @el
toolkit label: ανακατασκευή του (έργο) @el
toolkit definition: Ένα έργο το οποίο χρησιμοποιείται ως η βάση για μια νέα κινηματογραφική ταινία, ένα ραδιοφωνικό πρόγραμμα, ένα τηλεοπτικό πρόγραμμα ή βίντεο. @el
label: újraalkotása a következő műnek @hu
definition: Hozzákapcsol egy művet egy műhöz, amelyet alapként használnak egy új mozgóképhez, rádióműsorhoz, televízióműsorhoz vagy videóhoz. @hu
toolkit label: újraalkotott mű @hu
toolkit definition: Egy mű, amelyet alapként használnak egy új mozgóképhez, rádióműsorhoz, televízióműsorhoz vagy videóhoz. @hu
label: uusintaproduktio teoksesta @fi
label: er nyinnspilling av verk @no
definition: Relaterer et verk til et verk brukt som utgangspunkt for en ny spillefilm, et nytt radioprogram, et nytt fjernsynsprogram eller en ny video @no
label: is remake van werk @nl
definition: Relateert een werk aan een werk gebruikt als een basis voor een nieuwe speelfilm, radioprogramma, televisieprogramma of video. @nl
toolkit label: remake van werk @nl
toolkit definition: Een werk gebruikt als een basis voor een nieuwe speelfilm, radioprogramma, televisieprogramma of video. @nl
label: هو إعادة إنتاج لعمل @ar
definition: يربط عمل بعمل يُستخدم كأساس لفيلم سينمائي جديد، أو برنامج إذاعي، أو برنامج تليفزيوني، أو فيديو. @ar
toolkit label: إعادة إنتاج لعمل @ar
toolkit definition: عمل يُستخدم كأساس لفيلم سينمائي جديد، أو برنامج إذاعي، أو برنامج تليفزيوني، أو فيديو. @ar
label: uusproduktsioon teosest @et
definition: Seostab teose teosega, mis on aluseks uuele filmile, raadiosaatele, telesaatele või videofilmile. @et
toolkit label: uusproduktsioon teosest @et
toolkit definition: Teos, mis on aluseks uuele filmile, raadiosaatele, telesaatele või videofilmile. @et
label: è rifacimento di opera @it
definition: Correla un’opera a un’opera utilizzata come base per un nuovo film, programma radiofonico o video. @it
toolkit label: rifacimento di opera @it
toolkit definition: Opera utilizzata come base per un nuovo film, programma radiofonico o video. @it
label: ir jauna versija darbam @lv
definition: Sasaista darbu ar darbu, kas izmantots par pamatu jaunai kinofilmai, radio, televīzijas raidījumam vai video (rīmeikam). @lv
toolkit label: jauna versija darbam @lv
toolkit definition: Darbs, kas izmantots par pamatu jaunai kinofilmai, radio, televīzijas raidījumam vai video (rīmeikam). @lv
label: 是作品的重新制作 @zh-hans
definition: 将一种作品与被用作一种新的电影、广播节目、电视节目或视频的基础的一种作品关联起来。 @zh-hans
toolkit label: 作品的重新制作 @zh-hans
toolkit definition: 被用作一种新的电影、广播节目、电视节目或视频的基础的一种作品 @zh-hans
has subproperty: P10185
label: eserin yeniden yapımıdır @tr
definition: Bir eseri, yeni bir sinema filmi, radyo programı, televizyon programı veya video için temel olarak kullanılan bir eserle ilişkilendirir. @tr
toolkit label: eserin yeniden yapımı @tr
toolkit definition: Yeni bir sinema filmi, radyo programı, televizyon programı veya video için temel olarak kullanılan bir çalışma. @tr

is imitation of work
status: Published
definition: Relates a work to a work whose style or content is copied in a derivative work.
type: Property
domain: C10001
sub property of: is transformation by style of
lexical alias: imitationOfWork.en
toolkit label: imitation of work
toolkit definition: A work whose style or content is copied in a derivative work.
toolkit label: imitation d’une œuvre @fr
toolkit definition: Œuvre dont le style ou le contenu est copié dans une œuvre dérivée. @fr
toolkit label: imitación de (obra) @es
toolkit definition: Una obra cuyo estilo o contenido se ha copiado en una obra derivada. @es
instruction number: 24.5
label: er efterligning af værk @da
definition: Relaterer et værk til et værk, hvis stil eller indhold er kopieret i et afledt værk. @da
toolkit label: efterligning af værk @da
toolkit definition: Værk, hvis stil eller indhold er kopieret i et afledt værk. @da
definition: Met une œuvre en relation avec une œuvre dont le style ou le contenu est copié dans une œuvre dérivée. @fr
label: là mô phỏng của (tác phẩm) @vi
definition: Liên kết tác phẩm với tác phẩm mà phong cách và nội dung được sao lại trong tác phẩm dẫn xuất. @vi
toolkit label: mô phỏng của (tác phẩm) @vi
toolkit definition: Tác phẩm mà phong cách và nội dung được sao lại trong tác phẩm dẫn xuất. @vi
label: ist Imitation von (Werk) @de
definition: Setzt ein Werk in Beziehung zu einem Werk, dessen Stil oder Inhalt in einem abgeleiteten Werk kopiert wird. @de
toolkit label: Imitation von (Werk) @de
toolkit definition: Ein Werk, dessen Stil oder Inhalt in einem abgeleiteten Werk kopiert wird. @de
label: est une imitation d’une œuvre @fr
definition: Liittää teoksen teokseen, jonka tyyliä tai sisältöä johdannaisteos jäljittelee. @fi
toolkit label: jäljitelmä teoksesta @fi
toolkit definition: Teos, jonka tyyliä tai sisältöä johdannaisteos jäljittelee. @fi
toolkit label: imitasjon av verk @no
toolkit definition: Et verk hvis stil eller innhold kopieres i et avledet verk. @no
label: és imitació d’una obra @ca
definition: Relaciona una obra amb una obra l’estil o el contingut de la qual es copia en una obra derivada. @ca
toolkit label: imitació d’una obra @ca
toolkit definition: Obra l’estil o el contingut de la qual es copia en una obra derivada. @ca
has element type: 2
label: είναι αντίγραφο του (έργο) @el
definition: Συνδέει ένα έργο με ένα έργο του οποίου το ύφος ή το περιεχόμενο αντιγράφεται σε ένα παράγωγο έργο. @el
toolkit label: αντίγραφο του (έργο) @el
toolkit definition: Ένα έργο του οποίου το ύφος ή το περιεχόμενο αντιγράφεται σε ένα παράγωγο έργο. @el
label: utánzása a következő műnek: @hu
definition: Hozzákapcsol egy művet egy műhöz, amelynek stílusát vagy tartalmát egy származékos műben másolják. @hu
toolkit label: utánzott mű @hu
toolkit definition: Egy mű, amelynek stílusát vagy tartalmát egy származékos műben másolják. @hu
label: jäljitelmä teoksesta @fi
label: er imitasjon av verk @no
definition: Relaterer et verk til et verk hvis stil eller innhold kopieres i et avledet verk. @no
label: is imitatie van werk @nl
definition: Relateert een werk aan een werk waarvan stijl of content is gekopieerd in een afgeleid werk. @nl
toolkit label: imitatie van werk @nl
toolkit definition: Een werk waarvan stijl of content is gekopieerd in een afgeleid werk. @nl
label: هو محاكاة لعمل @ar
definition: يربط عمل بعمل يُنسخ أسلوبه أو محتواه في عمل مشتق. @ar
toolkit label: محاكاة لعمل @ar
toolkit definition: عمل يُنسخ أسلوبه أو محتواه في عمل مشتق. @ar
label: jäljendatud teos @et
definition: Seostab teose teosega, mille stiili või sisu on jäljendatud tuletatud teoses. @et
toolkit label: jäljendatud teos @et
toolkit definition: Teos, mille stiili või sisu on jäljendatud tuletatud teoses. @et
label: è imitazione di opera @it
definition: Correla un’opera a un’opera il cui stile o contenuto è copiato in un’opera derivata. @it
toolkit label: imitazione di opera @it
toolkit definition: Opera il cui stile o contenuto è copiato in un’opera derivata. @it
label: ir imitācija darbam @lv
definition: Sasaista darbu ar darbu, kura stils vai saturs atdarināts atvasinātā darbā. @lv
toolkit label: imitācija darbam @lv
toolkit definition: Darbs, kura stils vai saturs atdarināts atvasinātā darbā. @lv
label: 是作品的模仿 @zh-hans
definition: 将一种作品与其风格和内容被复制于一种衍生作品的一种作品关联起来。 @zh-hans
toolkit label: 作品的模仿 @zh-hans
toolkit definition: 其风格和内容被复制于一种衍生作品的一种作品 @zh-hans
has subproperty: is parody of work
has subproperty: P10196
label: eserin taklididir @tr
definition: Bir eseri, biçimi veya içeriği türev bir esere kopyalanan bir eserle ilişkilendirir. @tr
toolkit label: eserin taklididir @tr
toolkit definition: Biçimi veya içeriği türetilen bir çalışmada kopyalanmış bir çalışma. @tr

is verse adaptation of work
status: Published
definition: Relates a work to a work that is adapted as a literary composition in verse form.
type: Property
domain: C10001
sub property of: is adaptation of work
lexical alias: verseAdaptationOfWork.en
toolkit label: verse adaptation of work
toolkit definition: A work that is adapted as a literary composition in verse form.
toolkit label: adaptation en vers d’une œuvre @fr
toolkit definition: Œuvre qui est adaptée sous forme de composition littéraire en vers. @fr
toolkit label: adaptación en verso de (obra) @es
toolkit definition: Una obra que ha sido adaptada como una composición literaria en forma de verso. @es
instruction number: 24.5
label: er bearbejdelse af værk til vers @da
definition: Relaterer et værk til et værk, som er bearbejdet til en litterær komposition i versform. @da
toolkit label: bearbejdelse af værk til vers @da
toolkit definition: Værk, som er bearbejdet til en litterær komposition i versform. @da
definition: Met une œuvre en relation avec une œuvre qui est adaptée sous forme de composition littéraire en vers. @fr
label: là phỏng theo thể thơ của (tác phẩm) @vi
definition: Liên kết tác phẩm với tác phẩm đã được phỏng theo như là sáng tác văn chương ở thể thơ. @vi
toolkit label: phỏng theo thể thơ của (tác phẩm) @vi
toolkit definition: Tác phẩm đã được phỏng theo như là sáng tác văn chương ở thể thơ. @vi
label: ist Gedichtbearbeitung von (Werk) @de
definition: Setzt ein Werk in Beziehung zu einem Werk, das als literarische Dichtung in Versform bearbeitet ist. @de
toolkit label: Gedichtbearbeitung von (Werk) @de
toolkit definition: Ein Werk, das als literarische Dichtung in Versform bearbeitet ist. @de
label: est une adaptation en vers d’une œuvre @fr
definition: Liittää teoksen teokseen, joka on sovitettu runomuotoiseksi kirjalliseksi tuotokseksi. @fi
toolkit label: runomukaelma teoksesta @fi
toolkit definition: Teos, joka on sovitettu runomuotoiseksi kirjalliseksi tuotokseksi. @fi
toolkit label: bearbeidelse av verk til verseform @no
toolkit definition: Et verk som er bearbeidet til en litterær komposisjon i verseform. @no
label: és adaptació en vers d’una obra @ca
definition: Relaciona una obra amb una obra que s’adapta com una composició literària en vers. @ca
toolkit label: adaptació en vers d’una obra @ca
toolkit definition: Obra que s’adapta com una composició literària en vers. @ca
has element type: 2
label: είναι προσαρμογή έμμετρου λόγου του (έργο) @el
definition: Συνδέει ένα έργο με ένα έργο το οποίο έχει προσαρμοστεί ως μια λογοτεχνική σύνθεση σε έμμετρη μορφή. @el
toolkit label: προσαρμογή έμμετρου λόγου του (έργο) @el
toolkit definition: Ένα έργο το οποίο έχει προσαρμοστεί ως μια λογοτεχνική σύνθεση σε έμμετρη μορφή. @el
label: verses adaptációja a következő műnek: @hu
definition: Hozzákapcsol egy művet egy műhöz, amelyet verses formájú irodalmi alkotásként adaptáltak. @hu
toolkit label: versként átdolgozott mű @hu
toolkit definition: Egy mű, amelyet verses formájú irodalmi alkotásként adaptáltak. @hu
label: runomukaelma teoksesta @fi
label: er bearbeidelse av verk til verseform @no
definition: Relaterer et verk til et verk som er bearbeidet til en litterær komposisjon i verseform. @no
label: is bewerking in versvorm van werk @nl
definition: Relateert een werk aan een werk dat is bewerkt als een literaire compositie in versvorm. @nl
toolkit label: bewerking in versvorm van werk @nl
toolkit definition: Een werk dat is bewerkt als een literaire compositie in versvorm. @nl
label: هو اقتباس شعري لعمل @ar
definition: يربط عمل بعمل تمت معالجته كتكوين أدبي في شكل شعر. @ar
toolkit label: اقتباس شعري لعمل @ar
toolkit definition: عمل تمت معالجته كتكوين أدبي في شكل شعر. @ar
label: värsskohandus teosest @et
definition: Seostab teose teosega, mis on adapteeritud värsivormis kirjandusliku kompositsioonina. @et
toolkit label: värsskohandus teosest @et
toolkit definition: Teos, mis on adapteeritud värsivormis kirjandusliku kompositsioonina. @et
label: è adattamento in versi di opera @it
definition: Correla un’opera a un’opera adattata come componimento letterario in versi. @it
toolkit label: adattamento in versi di opera @it
toolkit definition: Opera adattata come componimento letterario in versi. @it
label: kā dzeja adaptētais darbs @lv
definition: Sasaista darbu ar darbu, kas ir adaptēts kā literārs darbs dzejas formā. @lv
toolkit label: kā dzeja adaptētais darbs @lv
toolkit definition: Darbs, kas ir adaptēts kā literārs darbs dzejas formā. @lv
label: 是作品的韵文改编 @zh-hans
definition: 将一种作品与被改编为韵文形式文学写作的一种作品关联起来。 @zh-hans
toolkit label: 作品的韵文改编 @zh-hans
toolkit definition: 被改编为韵文形式文学写作的一种作品 @zh-hans
has subproperty: P10128
label: eserin nazım uyarlamasıdır @tr
definition: Bir eseri, nazım biçiminde edebi bir eser olarak uyarlanan bir eserle ilişkilendirir. @tr
toolkit label: eserin manzum uyarlaması @tr
toolkit definition: Nazım biçiminde edebi bir eser olarak uyarlanan bir eser. @tr

is video adaptation of work
status: Published
definition: Relates a work to a work that is adapted for video.
type: Property
domain: C10001
sub property of: is adaptation of work
lexical alias: videoAdaptationOfWork.en
toolkit label: video adaptation of work
toolkit definition: A work that is adapted for video.
toolkit label: adaptation en vidéo d’une œuvre @fr
toolkit definition: Œuvre qui est adaptée en vidéo. @fr
toolkit label: adaptación para video de (obra) @es
toolkit definition: Una obra que ha sido adaptada para video. @es
instruction number: 24.5
label: er bearbejdelse af værk til video @da
definition: Relaterer et værk til et værk, som er bearbejdet til video. @da
toolkit label: bearbejdelse af værk til video @da
toolkit definition: Værk, som er bearbejdet til video. @da
definition: Met une œuvre en relation avec une œuvre qui est adaptée en vidéo. @fr
label: là phỏng theo video của (tác phẩm) @vi
definition: Liên kết tác phẩm với tác phẩm đã được phỏng cho video. @vi
toolkit label: phỏng theo video của (tác phẩm) @vi
toolkit definition: Tác phẩm đã được phỏng cho video. @vi
label: ist Videobearbeitung von (Werk) @de
definition: Setzt ein Werk in Beziehung zu einem Werk, das als Video bearbeitet ist. @de
toolkit label: Videobearbeitung von (Werk) @de
toolkit definition: Ein Werk, das als Video bearbeitet ist. @de
label: est une adaptation en vidéo d’une œuvre @fr
definition: Liittää teoksen teokseen, joka on sovitettu videoksi. @fi
toolkit label: videosovitus teoksesta @fi
toolkit definition: Teos, joka on sovitettu videoksi. @fi
toolkit label: bearbeidelse av verk for video @no
toolkit definition: Et verk som er bearbeidet for video. @no
label: és adaptació en vídeo d’una obra @ca
definition: Relaciona una obra amb una obra que s’adapta per a vídeo. @ca
toolkit label: adaptació en vídeo d’una obra @ca
toolkit definition: Obra que s’adapta per a vídeo. @ca
has element type: 2
label: είναι σενάριο για βίντεο βασισμένο σε (έργο) @el
definition: Συνδέει ένα έργο με ένα έργο το οποίο έχει προσαρμοστεί για βίντεο. @el
toolkit label: σενάριο για βίντεο βασισμένο σε (έργο) @el
toolkit definition: Ένα έργο το οποίο έχει προσαρμοστεί για βίντεο. @el
label: videóadaptációja a következő műnek: @hu
definition: Hozzákapcsol egy művet egy műhöz, amelyet videóként adaptáltak. @hu
toolkit label: videóként átdolgozott mű @hu
toolkit definition: Egy mű, amelyet videóként adaptáltak. @hu
label: videosovitus teoksesta @fi
label: er bearbeidelse av verk for video @no
definition: Relaterer et verk til et verk som er bearbeidet for video. @no
label: is videobewerking van werk @nl
definition: Relateert een werk aan een werk dat is bewerkt voor video. @nl
toolkit label: videobewerking van werk @nl
toolkit definition: Een werk dat is bewerkt voor video. @nl
label: هو معالجة فيديوية لعمل @ar
definition: يربط عمل بعمل تمت معالجته لفيديو. @ar
toolkit label: معالجة فيديوية لعمل @ar
toolkit definition: عمل تمت معالجته لفيديو. @ar
label: videoversioon teosest @et
definition: Seostab teose teosega, mis on adapteeritud videofilmina. @et
toolkit label: videoversioon teosest @et
toolkit definition: Teos, mis on adapteeritud videofilmina. @et
label: è adattamento video di opera @it
definition: Correla un’opera a un’opera adattata per un video. @it
toolkit label: adattamento video di opera @it
toolkit definition: Opera adattata per un video. @it
label: kā video adaptētais darbs @lv
definition: Sasaista darbu ar darbu, kas ir adaptēts kā video. @lv
toolkit label: kā video adaptētais darbs @lv
toolkit definition: Darbs, kas ir adaptēts kā video. @lv
label: 是作品的视频改编 @zh-hans
definition: 将一种作品与被改编用于视频的一种作品关联起来。 @zh-hans
toolkit label: 作品的视频改编 @zh-hans
toolkit definition: 被改编用于视频的一种作品 @zh-hans
has subproperty: P10138
label: eserinin video uyarlamasıdır @tr
definition: Bir eseri, video için uyarlanan bir eserle ilişkilendirir. @tr
toolkit label: eserinin video uyarlaması @tr
toolkit definition: Videoya olarak uyarlanan bir çalışma. @tr

is video game adaptation of work
status: Published
type: Property
lexical alias: videoGameAdaptationOfWork.en
definition: Relates a work to a work that is adapted as a video game.
domain: C10001
toolkit label: video game adaptation of work
toolkit definition: A work that is adapted as a video game.
toolkit label: adaptation en jeu vidéo d’une œuvre @fr
toolkit definition: Œuvre qui est adaptée en jeu vidéo. @fr
sub property of: is adaptation of work
toolkit label: adaptación a video juego de (obra) @es
toolkit definition: Una obra que ha sido adaptada como un video juego. @es
instruction number: 24.5
label: er bearbejdelse af værk til computerspil @da
definition: Relaterer et værk til et værk, som er bearbejdet til et computerspil. @da
toolkit label: bearbejdelse af værk til computerspil @da
toolkit definition: Værk, som er bearbejdet til et computerspil. @da
definition: Met une œuvre en relation avec une œuvre qui est adaptée en jeu vidéo. @fr
label: là phỏng theo trò chơi video của (tác phẩm) @vi
definition: Liên kết tác phẩm với tác phẩm đã được phỏng theo như là trò chơi video. @vi
toolkit label: phỏng theo trò chơi video của (tác phẩm) @vi
toolkit definition: Tác phẩm đã được phỏng theo như là trò chơi video. @vi
label: ist Videospielbearbeitung von (Werk) @de
definition: Setzt ein Werk in Beziehung zu einem Werk, das als Videospiel bearbeitet ist. @de
toolkit label: Videospielbearbeitung von (Werk) @de
toolkit definition: Ein Werk, das als Videospiel bearbeitet ist. @de
label: est une adaptation en jeu vidéo d’une œuvre @fr
definition: Liittää teoksen teokseen, joka on sovitettu videopeliksi. @fi
toolkit label: videopelisovitus teoksesta @fi
toolkit definition: Teos, joka on sovitettu videopeliksi. @fi
toolkit label: bearbeidelse av verk til videospill @no
toolkit definition: Et verk som er bearbeidet til et videospill. @no
label: és adaptació en videojoc d’una obra @ca
definition: Relaciona una obra amb una obra que s’adapta com un videojoc. @ca
toolkit label: adaptació en videojoc d’una obra @ca
toolkit definition: Obra que s’adapta com un videojoc. @ca
has element type: 2
label: είναι video game προσαρμογή του (έργο) @el
definition: Συνδέει ένα έργο με ένα έργο που έχει προσαρμοστεί ως video game. @el
toolkit label: video game προσαρμογή του (έργο) @el
toolkit definition: Ένα έργο που έχει προσαρμοστεί ως video game. @el
label: videójáték-átdolgozása a következő műnek: @hu
definition: Hozzákapcsol egy művet egy műhöz, amelyet videójátékként adaptáltak. @hu
toolkit label: videójátékként átdolgozott mű @hu
toolkit definition: Egy mű, amelyet videójátékként átdolgoztak. @hu
label: videopelisovitus teoksesta @fi
label: er bearbeidelse av verk til videospill @no
definition: Relaterer et verk til et verk som er bearbeidet til et videospill. @no
label: is computerspelbewerking van werk @nl
definition: Relateert een werk aan een werk dat is bewerkt als een computerspel. @nl
toolkit label: computerspelbewerking van werk @nl
toolkit definition: Een werk dat is bewerkt als een computerspel. @nl
label: هو تكييف لعمل كلعبة فيديو @ar
definition: يربط عمل بعمل معالج كلعبة فيديو. @ar
toolkit label: تكييف عمل كلعبة فيديو @ar
toolkit definition: عمل معالج كلعبة فيديو. @ar
label: videomänguversioon teosest @et
definition: Seostab teose teosega, mis on adapteeritud videomänguna. @et
toolkit label: videomänguversioon teosest @et
toolkit definition: Teos, mis on adapteeritud videomänguna. @et
label: è adattamento come videogioco di opera @it
definition: Correla un'opera a un'opera che è adattata come videogioco. @it
toolkit label: adattamento come videogioco di opera @it
toolkit definition: Opera che è adattata come videogioco. @it
label: kā videospēle adaptētais darbs @lv
definition: Sasaista darbu ar darbu, kas ir adaptēts kā videospēle. @lv
toolkit label: kā videospēle adaptētais darbs @lv
toolkit definition: Darbs, kas ir adaptēts kā videospēle. @lv
label: 是作品的视频游戏改编 @zh-hans
definition: 将一种作品与被改编为一种视频游戏的一种作品关联起来。 @zh-hans
toolkit label: 作品的视频游戏改编 @zh-hans
toolkit definition: 被改编为一种视频游戏的一种作品 @zh-hans
has subproperty: P10250
label: Eserin video oyunu uyarlanmasıdır @tr
definition: Bir eseri, video oyunu olarak uyarlanan bir eserle ilişkilendirir. @tr
toolkit label: video oyunu uyarlama eseri @tr
toolkit definition: Bir video oyunu olarak uyarlanan bir çalışma. @tr

has source work
status: Published
definition: Relates a work to a work that is modified to create a new work.
type: Property
domain: C10001
sub property of: is transformation by genre of
toolkit label: source work
toolkit definition: A work that is modified to create a new work.
toolkit label: œuvre source @fr
toolkit definition: Œuvre qui est modifiée pour créer une nouvelle œuvre. @fr
toolkit label: basada en (obra) @es
toolkit definition: Una obra utilizada como fuente para una obra derivada. @es
instruction number: 24.5
label: er baseret på værk @da
definition: Relaterer et værk til et værk, som anvendes som kilde til et afledt værk. @da
toolkit label: baseret på værk @da
toolkit definition: Værk, som anvendes som kilde til et afledt værk. @da
definition: Met une œuvre en relation avec une œuvre qui est modifiée pour créer une nouvelle œuvre. @fr
label: được dựa trên (tác phẩm) @vi
definition: Liên kết tác phẩm với tác phẩm được sử dụng như là nguồn cho tác phẩm dẫn xuất. @vi
toolkit label: được dựa trên (tác phẩm) @vi
toolkit definition: Tác phẩm được sử dụng như là nguồn cho tác phẩm dẫn xuất. @vi
label: ist basierend auf (Werk) @de
definition: Setzt ein Werk in Beziehung zu einem Werk, das als Ursprung eines abgeleiteten Werks verwendet wird. @de
toolkit label: Basiert auf (Werk) @de
toolkit definition: Ein Werk, das als Ursprung eines abgeleiteten Werks verwendet wird. @de
label: a pour œuvre source @fr
definition: Liittää teoksen teokseen, jota on muokattu uuden teoksen luomiseksi. @fi
toolkit label: lähdeteos @fi
toolkit definition: Teos, jota on muokattu uuden teoksen luomiseksi. @fi
toolkit label: basert på verk @no
toolkit definition: Et verk brukt som utgangspunkt for et avledet verk. @no
label: té obra font @ca
definition: Relaciona una obra amb una obra que es modifica per crear una nova obra. @ca
toolkit label: obra font @ca
toolkit definition: Obra que es modifica per crear una nova obra. @ca
has element type: 2
label: βασίζεται στο (έργο) @el
definition: Συνδέει ένα έργο με ένα έργο που χρησιμοποιείται ως η βάση για ένα παράγωγο έργο. @el
toolkit label: βασίζεται στο (έργο) @el
toolkit definition: Ένα έργο που χρησιμοποιείται ως η βάση για ένα παράγωγο έργο. @el
label: alapja a következő mű: @hu
definition: Hozzákapcsol egy művet egy műhöz, amelyet egy származékos mű alapjaként használnak. @hu
toolkit label: alapmű @hu
toolkit definition: Egy mű, amelyet egy származékos mű alapjaként használnak. @hu
label: lähdeteos @fi
label: er basert på verk @no
definition: Relaterer et verk til et verk brukt som utgangspunkt for et avledet verk. @no
label: is gebaseerd op werk @nl
definition: Relateert een werk aan een werk gebruikt als een bron voor een afgeleid werk. @nl
toolkit label: gebaseerd op werk @nl
toolkit definition: Een werk gebruikt als een bron voor een afgeleid werk. @nl
label: هو معتمد على عمل @ar
definition: يربط عمل بعمل يستخدم كمصدر لعمل مشتق. @ar
toolkit label: معتمد على عمل @ar
toolkit definition: عمل يستخدم كمصدر لعمل مشتق. @ar
label: põhineb teosel @et
definition: Seostab teose teosega, mis on tuletatud teose allikaks. @et
toolkit label: põhineb teosel @et
toolkit definition: Teos, mis on tuletatud teose allikaks. @et
label: è basata su opera @it
definition: Correla un’opera a un’opera usata come base per un’opera derivata. @it
toolkit label: basata su opera @it
toolkit definition: Opera usata come base per un’opera derivata. @it
alternative label: is based on work
lexical alias: sourceWork.en
label: ir veidots pēc darba @lv
definition: Sasaista darbu ar darbu, kas izmantots par pamatu atvasinātam darbam. @lv
toolkit label: veidots pēc darba @lv
toolkit definition: Darbs, kas izmantots par pamatu atvasinātam darbam. @lv
alternative label: perustuu teokseen @fi
alternative label: 被基于作品 @zh-hans
label: 有源作品 @zh-hans
definition: 将一种作品与被修改以创建一种新作品的一种作品关联起来。 @zh-hans
toolkit label: 源作品 @zh-hans
toolkit definition: 被修改以创建一种新作品的一种作品 @zh-hans
alternative label: basé sur une œuvre @fr
alternative label: és basat en una obra @ca
has subproperty: is adaptation of work
has subproperty: is expanded version of work

is motion picture screenplay based on work
status: Published
definition: Relates a work to a work that is adapted as a screenplay for a motion picture.
type: Property
domain: C10001
sub property of: is screenplay based on work
lexical alias: motionPictureScreenplayBasedOnWork.en
toolkit label: motion picture screenplay based on work
toolkit definition: A work that is adapted as a screenplay for a motion picture.
toolkit label: scénario de film basé sur une œuvre @fr
toolkit definition: Œuvre qui est adaptée en scénario de film. @fr
toolkit label: guión cinematográfico basado en (obra) @es
toolkit definition: Una obra que ha sido adaptada como guión para una película cinematográfica. @es
instruction number: 24.5
label: er filmmanuskript baseret på værk @da
definition: Relaterer et værk til et værk, som er bearbejdet til et manuskript til en spillefilm. @da
toolkit label: filmmanuskript baseret på værk @da
toolkit definition: Værk, som er bearbejdet til et manuskript til en spillefilm. @da
definition: Met une œuvre en relation avec une œuvre qui est adaptée en scénario de film. @fr
label: là kịch bản điện ảnh được trên (tác phẩm) @vi
definition: Liên kết tác phẩm với tác phẩm đã được phỏng theo như là kịch bản của phim điện ảnh. @vi
toolkit label: kịch bản điện ảnh được trên tác phẩm @vi
toolkit definition: Tác phẩm đã được phỏng theo như là kịch bản của phim điện ảnh. @vi
label: ist Filmdrehbuch basierend auf (Werk) @de
definition: Setzt ein Werk in Beziehung zu einem Werk, das als Drehbuch für einen Film bearbeitet ist. @de
toolkit label: Filmdrehbuch basiert auf (Werk) @de
toolkit definition: Ein Werk, das als Drehbuch für einen Film bearbeitet ist. @de
label: est un scénario de film basé sur une œuvre @fr
definition: Liittää teoksen teokseen, joka on sovitettu elokuvan käsikirjoitukseksi. @fi
toolkit label: elokuvakäsikirjoituksen perustana oleva teos @fi
toolkit definition: Teos, joka on sovitettu elokuvan käsikirjoitukseksi. @fi
toolkit label: manus for spillefilm basert på verk @no
toolkit definition: Et verk som er bearbeidet til et manuskript for en spillefilm. @no
label: és guió cinematogràfic basat en una obra @ca
definition: Relaciona una obra amb una obra que s’adapta com un guió d’una pel·lícula cinematogràfica. @ca
toolkit label: guió cinematogràfic basat en una obra @ca
toolkit definition: Obra que s’adapta com un guió d’una pel·lícula cinematogràfica. @ca
has element type: 2
label: είναι σενάριο κινηματογραφικής ταινίας βασισμένο σε (έργο) @el
definition: Συνδέει ένα έργο με ένα έργο το οποίο έχει προσαρμοστεί ως σενάριο για κινηματογραφική ταινία. @el
toolkit label: σενάριο κινηματογραφικής ταινίας βασισμένο σε (έργο) @el
toolkit definition: Ένα έργο το οποίο έχει προσαρμοστεί ως σενάριο για κινηματογραφική ταινία. @el
label: mozgókép-forgatókönyv a következő mű alapján: @hu
definition: Hozzákapcsol egy művet egy műhöz, amelyet egy mozgókép forgatókönyveként adaptáltak. @hu
toolkit label: mozgókép-forgatókönyv a következő mű alapján: @hu
toolkit definition: Egy mű, amelyet egy mozgókép forgatókönyveként átdolgoztak. @hu
label: elokuvakäsikirjoituksen perustana oleva teos @fi
label: er manus for spillefilm basert på verk @no
definition: Relaterer et verk til et verk som er bearbeidet til et manuskript for en spillefilm. @no
label: is speelfilmscenario gebaseerd op werk @nl
definition: Relateert een werk aan een werk dat is bewerkt als een scenario voor een speelfilm. @nl
toolkit label: speelfilmscenario gebaseerd op werk @nl
toolkit definition: Een werk dat is bewerkt als een scenario voor een speelfilm. @nl
label: هو سيناريو فيلم سينمائي مبني على عمل @ar
definition: يربط عمل بعمل تمت معالجته كسيناريو لفيلم سينمائي. @ar
toolkit label: سيناريو فيلم سينمائي مبني على عمل @ar
toolkit definition: عمل تمت معالجته كسيناريو لفيلم سينمائي. @ar
label: filmistsenaariumi aluseks olev teos @et
definition: Seostab teose teosega, mis on adapteeritud filmistsenaariumina. @et
toolkit label: filmistsenaariumi aluseks olev teos @et
toolkit definition: Teos, mis on adapteeritud filmistsenaariumina. @et
label: è sceneggiatura cinematografica basata su opera @it
definition: Correla un’opera a un’opera adattata come sceneggiatura per un film. @it
toolkit label: sceneggiatura cinematografica basata su opera @it
toolkit definition: Opera adattata come sceneggiatura per un film. @it
label: kā kinoscenārijs adaptētais darbs @lv
definition: Sasaista darbu ar darbu, kas ir adaptēts kā kinofilmas scenārijs. @lv
toolkit label: kā kinoscenārijs adaptētais darbs @lv
toolkit definition: Darbs, kas ir adaptēts kā kinofilmas scenārijs. @lv
label: 是基于作品的电影剧本 @zh-hans
definition: 将一种作品与被改编为电影剧本的一种作品关联起来。 @zh-hans
toolkit label: 基于作品的电影剧本 @zh-hans
toolkit definition: 被改编为电影剧本的一种作品 @zh-hans
has subproperty: P10134
label: esere dayalı sinema filmi senaryosudur @tr
definition: Bir eseri, sinema filmi için senaryo olarak uyarlanan bir eserle ilişkilendirir. @tr
toolkit label: eserinden uyarlanan sinema filmi senaryosu @tr
toolkit definition: Bir sinema filmi için senaryo olarak uyarlanan bir çalışma. @tr

is screenplay based on work
status: Published
definition: Relates a work to a work that is adapted as a screenplay for a motion picture, television program, or video.
type: Property
domain: C10001
sub property of: is adaptation of work
lexical alias: screenplayBasedOnWork.en
toolkit label: screenplay based on work
toolkit definition: A work that is adapted as a screenplay for a motion picture, television program, or video.
toolkit label: scénario basé sur une œuvre @fr
toolkit definition: Œuvre qui est adaptée en scénario de film, d’émission de télévision ou de vidéo. @fr
toolkit label: guión basado en (obra) @es
toolkit definition: Una obra que ha sido adaptada como guión para una película cinematográfica, programa de televisión o vídeo. @es
instruction number: 24.5
label: er manuskript baseret på værk @da
definition: Relaterer et værk til et værk, som er bearbejdet til et manuskript til en spillefilm, tv-program eller en video. @da
toolkit label: manuskript baseret på værk @da
toolkit definition: Værk, som er bearbejdet til et manuskript til en spillefilm, tv-program eller en video. @da
definition: Met une œuvre en relation avec une œuvre qui est adaptée en scénario de film, d’émission de télévision ou de vidéo. @fr
label: là kịch bản được trên (tác phẩm) @vi
definition: Liên kết tác phẩm với tác phẩm đã được phỏng theo như là kịch bản của phim điện ảnh, chương trình truyền hình, hoặc video. @vi
toolkit label: kịch bản được trên (tác phẩm) @vi
toolkit definition: Tác phẩm đã được phỏng theo như là kịch bản của phim điện ảnh, chương trình truyền hình, hoặc video. @vi
label: ist Drehbuch basierend auf (Werk) @de
definition: Setzt ein Werk in Beziehung zu einem Werk, das als Drehbuch für einen Film, eine Fernsehsendung oder ein Video bearbeitet ist. @de
toolkit label: Drehbuch basiert auf (Werk) @de
toolkit definition: Ein Werk, das als Drehbuch für einen Film, eine Fernsehsendung oder ein Video bearbeitet ist. @de
label: est un scénario basé sur une œuvre @fr
definition: Liittää teoksen teokseen, joka on sovitettu elokuvan, televisio-ohjelman tai videon käsikirjoitukseksi. @fi
toolkit label: käsikirjoituksen perustana oleva teos @fi
toolkit definition: Teos, joka on sovitettu elokuvan, televisio-ohjelman tai videon käsikirjoitukseksi. @fi
toolkit label: manus basert på verk @no
toolkit definition: Et verk som er bearbeidet til et manuskript for en spillefilm, et fjernsynsprogram eller en video. @no
label: és guió basat en una obra @ca
definition: Relaciona una obra amb una obra que s’adapta com un guió d’una pel·lícula cinematogràfica, un programa de televisió o un vídeo. @ca
toolkit label: guió basat en una obra @ca
toolkit definition: Obra que s’adapta com un guió d’una pel·lícula cinematogràfica, un programa de televisió o un vídeo. @ca
has element type: 2
label: είναι σενάριο βασισμένο σε (έργο) @el
definition: Συνδέει ένα έργο με ένα έργο το οποίο έχει προσαρμοστεί ως σενάριο για μια κινηματογραφική ταινία, ένα τηλεοπτικό πρόγραμμα ή βίντεο. @el
toolkit label: σενάριο βασισμένο σε (έργο) @el
toolkit definition: Ένα έργο το οποίο έχει προσαρμοστεί ως σενάριο για μια κινηματογραφική ταινία, ένα τηλεοπτικό πρόγραμμα ή βίντεο. @el
label: forgatókönyv a következő műből: @hu
definition: Hozzákapcsol egy művet egy műhöz, amelyet egy mozgókép, tévéműsor vagy videó forgatókönyveként adaptáltak. @hu
toolkit label: forgatókönyvként átdolgozott mű @hu
toolkit definition: Egy mű, amelyet egy mozgókép, tévéműsor vagy videó forgatókönyveként átdolgoztak. @hu
label: käsikirjoituksen perustana oleva teos @fi
label: er manus basert på verk @no
definition: Relaterer et verk til et verk som er bearbeidet til et manuskript for en spillefilm, et fjernsynsprogram eller en video. @no
label: is scenario gebaseerd op werk @nl
definition: Relateert een werk aan een werk dat is bewerkt als een scenario voor een speelfilm, televisieprogramma of video. @nl
toolkit label: scenario gebaseerd op werk @nl
toolkit definition: Een werk dat is bewerkt als een scenario voor een speelfilm, televisieprogramma of video. @nl
label: هو سيناريو مبني على عمل @ar
definition: يربط عمل بعمل تمت معالجته كسيناريو لفيلم سينمائي، أو برنامج تليفزيوني، أو فيديو. @ar
toolkit label: سيناريو مبني على عمل @ar
toolkit definition: عمل تمت معالجته كسيناريو لفيلم سينمائي، أو برنامج تليفزيوني، أو فيديو. @ar
label: stsenaariumi aluseks olev teos @et
definition: Seostab teose teosega, mis on adapteeritud filmi, telesaate või videofilmi stsenaariumina. @et
toolkit label: stsenaariumi aluseks olev teos @et
toolkit definition: Teos, mis on adapteeritud filmi, telesaate või videofilmi stsenaariumina. @et
label: è sceneggiatura basata su opera @it
definition: Correla un’opera a un’opera adattata come sceneggiatura per un film, programma televisivo o video. @it
toolkit label: sceneggiatura basata su opera @it
toolkit definition: Opera adattata come sceneggiatura per un film, programma televisivo o video. @it
label: kā scenārijs adaptētais darbs @lv
definition: Sasaista darbu ar darbu, kas ir adaptēts kā kinofilmas, televīzijas raidījuma vai video scenārijs. @lv
toolkit label: kā scenārijs adaptētais darbs @lv
toolkit definition: Darbs, kas ir adaptēts kā kinofilmas, televīzijas raidījuma vai video scenārijs. @lv
label: 是基于作品的影视剧剧本 @zh-hans
definition: 将一种作品与被改编为电影、电视节目或视频剧本的一种作品关联起来。 @zh-hans
toolkit label: 基于作品的影视剧剧本 @zh-hans
toolkit definition: 被改编为电影、电视节目或视频剧本的一种作品 @zh-hans
has subproperty: is motion picture screenplay based on work
has subproperty: is television screenplay based on work
has subproperty: is video screenplay based on work
has subproperty: P10133
label: senaryo esere dayanmaktadır @tr
definition: Bir eseri, sinema filmi, televizyon programı veya video için senaryo olarak uyarlanan bir eserle ilişkilendirir. @tr
toolkit label: eserden uyarlanan senaryo @tr

is libretto based on work
status: Published
definition: Relates a work to a work that provides text for a musical or choreographic work such as an opera, a ballet, or other work for the musical stage, or an oratorio.
type: Property
domain: C10001
sub property of: is adaptation of work
lexical alias: librettoBasedOnWork.en
toolkit label: libretto based on work
toolkit definition: A work that provides text for a musical or choreographic work such as an opera, a ballet, or other work for the musical stage, or an oratorio.
toolkit label: livret basé sur une œuvre @fr
toolkit definition: Œuvre qui fournit du texte pour une œuvre musicale ou chorégraphique telle qu’un opéra, un ballet ou une autre œuvre pour la scène musicale, ou telle qu’un oratorio. @fr
toolkit label: libreto basado en (obra) @es
toolkit definition: Una obra utilizada como base para el texto de una ópera u otra obra para escenario musical o un oratorio. @es
instruction number: 24.5
label: er libretto baseret på værk @da
definition: Relaterer et værk til et musikalsk- eller koreografisk værk, såsom en opera, en ballet eller andet værk til en musikalsk scene, eller et oratorium. @da
toolkit label: libretto baseret på værk @da
toolkit definition: Værk, som angiver tekst til et musikalsk- eller koreografisk værk, såsom en opera, en ballet eller andet værk til en musikalsk scene, eller et oratorium. @da
definition: Met une œuvre en relation avec une œuvre qui fournit du texte pour une œuvre musicale ou chorégraphique telle qu’un opéra, un ballet ou une autre œuvre pour la scène musicale, ou telle qu’un oratorio. @fr
label: là lời nhạc kịch dựa trên (tác phẩm) @vi
definition: Liên kết tác phẩm với tác phẩm đã được phỏng theo như là văn bản của opera hoặc tác phẩm khác cho sân khấu âm nhạc, hoặc oratorio. @vi
toolkit label: lời nhạc kịch dựa trên (tác phẩm) @vi
toolkit definition: Tác phẩm đã được phỏng theo như là văn bản của opera hoặc tác phẩm khác cho sân khấu âm nhạc, hoặc oratorio. @vi
label: ist Libretto basierend auf (Werk) @de
definition: Setzt ein Werk in Beziehung zu einem Werk, das Text für ein Musikwerk oder choreografisches Werk, wie zum Beispiel einer Oper, einem Ballett oder einem anderen Musikwerk für die Bühne, oder für ein Oratorium enthält. @de
toolkit label: Libretto basiert auf (Werk) @de
toolkit definition: Ein Werk, das Text für ein Musikwerk oder choreografisches Werk, wie zum Beispiel einer Oper, einem Ballett oder einem anderen Musikwerk für die Bühne, oder für ein Oratorium enthält. @de
label: est un livret basé sur une œuvre @fr
definition: Liittää teoksen musiikki- tai koreografiseen teokseen, kuten oopperaan, balettiin tai muuhun musiikilliseen näyttämöteokseen tai oratorioon. @fi
toolkit label: libreton perustana oleva teos @fi
toolkit definition: Teos, johon musiikki- tai korografisen teoksen, kuten oopperan, baletin tai muun musiikillisen näyttämöteoksen tai oratorion teksti perustuu. @fi
toolkit label: libretto basert på verk @no
toolkit definition: Et verk som gir tekst til en musikal eller et koreografisk verk som en opera, en ballett eller et annet verk for en musikalsk scene, eller et oratorium. @no
label: és llibret basat en una obra @ca
definition: Relaciona una obra amb una obra que proporciona el text per a una obra musical o coreogràfica com ara una opera, un ballet o qualsevol altra obra escènica musical o un oratori. @ca
toolkit label: llibret basat en una obra @ca
toolkit definition: Obra que proporciona el text per a una obra musical o coreogràfica com ara una òpera, un ballet o qualsevol altra obra escènica musical o un oratori. @ca
has element type: 2
label: είναι λιμπρέτο βασισμένο στο (έργο) @el
definition: Συνδέει ένα έργο με ένα έργο το οποίο έχει προσαρμοστεί ως το κείμενο μιας όπερας ή άλλο έργο για τη μουσική σκηνή ή ένα ορατόριο. @el
toolkit label: λιμπρέτο βασισμένο στο (έργο) @el
toolkit definition: Ένα έργο το οποίο έχει προσαρμοστεί ως το κείμενο μιας όπερας ή άλλο έργο για τη μουσική σκηνή ή ένα ορατόριο. @el
label: librettó a következő mű alapján: @hu
definition: Hozzákapcsol egy művet egy olyan zene- vagy koreografikus műhöz, mint egy opera, vagy egyéb zenés színpadi forrás, vagy egy oratórium. @hu
toolkit label: librettó-alapmű @hu
toolkit definition: Egy olyan zene- vagy koreografikus mű, mint egy opera, vagy egyéb zenés színpadi forrás, vagy egy oratórium. @hu
label: libreton perustana oleva teos @fi
label: er libretto basert på verk @no
definition: Relaterer et verk til et verk som gir tekst til en musikal eller et koreografisk verk som en opera, en ballett eller et annet verk for en musikalsk scene, eller et oratorium. @no
label: is libretto gebaseerd op werk @nl
definition: geen nieuwe vert nodig, was al aangepast @nl
toolkit label: libretto gebaseerd op werk @nl
toolkit definition: geen nieuwe vert nodig, was al aangepast @nl
label: هو نص أوبرالي معتمد على عمل @ar
definition: يربط عمل بعمل موسيقي، أو راقص مثل الأوبرا، أو الباليه، أو أي عمل آخر للمسرح الموسيقي، أو لموسيقى دينية. @ar
toolkit label: نص أوبرالي معتمد على عمل @ar
toolkit definition: عمل يقدم نصًا لعمل موسيقي، أو راقص مثل الأوبرا، أو الباليه، أو أي عمل آخر للمسرح الموسيقي، أو لموسيقى دينية. @ar
label: libreto aluseks olev teos @et
definition: Seostab teose teosega, mis annab teksti muusikalisele või koreograafilisele lavateosele (nt ooper, ballett) või oratooriumile. @et
toolkit label: libreto aluseks olev teos @et
toolkit definition: Teos, mis annab teksti muusikalisele või koreograafilisele lavateosele (nt ooper, ballett) või oratooriumile. @et
label: è libretto basato su opera @it
definition: Correla un’opera a un’opera musicale o coreografica come un’opera, balletto o altro lavoro per il teatro musicale, o un oratorio. @it
toolkit label: libretto basato su opera @it
toolkit definition: Opera che fornisce il testo per un'opera musicale o coreografica come un’opera, balletto o altro lavoro per il teatro musicale, o un oratorio. @it
label: kā librets adaptētais darbs @lv
definition: Sasaista darbu ar darbu, pēc kura veidots librets operai, oratorijai vai citam muzikāli dramatiskam darbam. @lv
toolkit label: kā librets adaptētais darbs @lv
toolkit definition: Darbs, pēc kura veidots librets operai, oratorijai vai citam muzikāli dramatiskam darbam. @lv
label: 是基于作品的台本 @zh-hans
definition: 将一种作品与为诸如歌剧、芭蕾、或其他舞台音乐作品或清唱剧提供文本的一种作品关联起来。 @zh-hans
toolkit label: 基于作品的台本 @zh-hans
toolkit definition: 为诸如歌剧、芭蕾、或其他舞台音乐作品或清唱剧提供文本的一种作品 @zh-hans
has subproperty: P10189
label: esere dayalı librettodur @tr
definition: Bir eseri, opera, bale veya müzik sahnesi için başka bir eser veya oratoryo gibi müzikal veya koreografik bir eser için metin sağlayan bir eserle ilişkilendirir. @tr
toolkit label: eserden uyarlanan opera metni @tr
toolkit definition: Bir opera, bale veya müzikal sahne için başka bir eser veya oratoryo gibi müzikal veya koreografik bir eser için metin sağlayan eser. @tr

is radio script based on work
status: Published
definition: Relates a work to a work that is adapted as a script for a radio program.
type: Property
domain: C10001
sub property of: is adaptation of work
lexical alias: radioScriptBasedOnWork.en
toolkit label: radio script based on work
toolkit definition: A work that is adapted as a script for a radio program.
toolkit label: script radiophonique basé sur une œuvre @fr
toolkit definition: Œuvre qui est adaptée en script d’émission de radio. @fr
toolkit label: guión radiofónico basado en (obra) @es
toolkit definition: Una obra que ha sido adaptada como guión para un programa de radio. @es
instruction number: 24.5
label: er radiomanuskript baseret på værk @da
definition: Relaterer et værk til et værk, som er bearbejdet til et manuskript til et radioprogram. @da
toolkit label: radiomanuskript baseret på værk @da
toolkit definition: Værk, som er bearbejdet til et manuskript til et radioprogram. @da
definition: Met une œuvre en relation avec une œuvre qui est adaptée en script d’émission de radio. @fr
label: là kịch bản truyền thanh được trên (tác phẩm) @vi
definition: Liên kết tác phẩm với tác phẩm đã được phỏng theo như là kịch bản của chương trình truyền thanh. @vi
toolkit label: kịch bản truyền thanh được trên (tác phẩm) @vi
toolkit definition: Tác phẩm đã được phỏng theo như là kịch bản của chương trình truyền thanh. @vi
label: ist Hörfunkskript basierend auf (Werk) @de
definition: Setzt ein Werk in Beziehung zu einem Werk, das als Skript für eine Hörfunksendung bearbeitet ist. @de
toolkit label: Hörfunkskript basiert auf (Werk) @de
toolkit definition: Ein Werk, das als Skript für eine Hörfunksendung bearbeitet ist. @de
label: est un script radiophonique basé sur une œuvre @fr
definition: Liittää teoksen teokseen, joka on sovitettu radio-ohjelman käsikirjoitukseksi. @fi
toolkit label: radiokäsikirjoituksen perustana oleva teos @fi
toolkit definition: Teos, joka on sovitettu radio-ohjelman käsikirjoitukseksi. @fi
toolkit label: radiomanus basert på verk @no
toolkit definition: Et verk som er bearbeidet til et manuskript for et radioprogram. @no
label: és guió radiofònic basat en una obra @ca
definition: Relaciona una obra amb una obra que s’adapta com un guió d’un programa radiofònic. @ca
toolkit label: guió radiofònic basat en una obra @ca
toolkit definition: Obra que s’adapta com un guió d’un programa radiofònic. @ca
has element type: 2
label: είναι ραδιοφωνικό σενάριο βασισμένο σε (έργο) @el
definition: Συνδέει ένα έργο με ένα έργο το οποίο έχει προσαρμοστεί ως σενάριο για ένα ραδιοφωνικό πρόγραμμα. @el
toolkit label: ραδιοφωνικό σενάριο βασισμένο σε (έργο) @el
toolkit definition: Ένα έργο το οποίο έχει προσαρμοστεί ως σενάριο για ένα ραδιοφωνικό πρόγραμμα. @el
label: rádiós szövegkönyv a következő műből @hu
definition: Hozzákapcsol egy művet egy műhöz, amelyet egy rádióműsor forgatókönyveként adaptáltak. @hu
toolkit label: rádióműsor-szövegkönyvként átdolgozott mű @hu
toolkit definition: Egy mű, amelyet egy rádióműsor forgatókönyveként átdolgoztak. @hu
label: radiokäsikirjoituksen perustana oleva teos @fi
label: er radiomanus basert på verk @no
definition: Relaterer et verk til et verk som er bearbeidet til et manuskript for et radioprogram. @no
label: is radioscript gebaseerd op werk @nl
definition: Relateert een werk aan een werk dat is bewerkt als een script voor een radioprogramma. @nl
toolkit label: radioscript gebaseerd op werk @nl
toolkit definition: Een werk dat is bewerkt als een script voor een radioprogramma. @nl
label: هو نص إذاعي مبني على عمل @ar
definition: يربط عمل بعمل تمت معالجته كنص لبرنامج إذاعي. @ar
toolkit label: نص إذاعي مبني على عمل @ar
toolkit definition: عمل تمت معالجته كنص لبرنامج إذاعي. @ar
label: raadiostsenaariumi aluseks olev teos @et
definition: Seostab teose teosega, mis on adapteeritud raadiosaate stsenaariumina. @et
toolkit label: raadiostsenaariumi aluseks olev teos @et
toolkit definition: Teos, mis on adapteeritud raadiosaate stsenaariumina. @et
label: è sceneggiatura radiofonica basata su opera @it
definition: Correla un’opera a un’opera adattata come sceneggiatura per un programma radiofonico. @it
toolkit label: sceneggiatura radiofonica basata su opera @it
toolkit definition: Opera adattata come sceneggiatura per un programma radiofonico. @it
label: kā radio raidījuma scenārijs adaptētais darbs @lv
definition: Sasaista darbu ar darbu, kas ir adaptēts kā radio raidījuma scenārijs. @lv
toolkit label: kā radio raidījuma scenārijs adaptētais darbs @lv
toolkit definition: Darbs, kas ir adaptēts kā radio raidījuma scenārijs. @lv
label: 是基于作品的广播文稿 @zh-hans
definition: 将一种作品与被改编为广播节目文稿的一种作品关联起来。 @zh-hans
toolkit label: 基于作品的广播文稿 @zh-hans
toolkit definition: 被改编为广播节目文稿的一种作品 @zh-hans
has subproperty: P10137
label: esere dayalı radyo metnidir @tr
definition: Bir eseri, radyo programı için metin olarak uyarlanan bir eserle ilişkilendirir. @tr
toolkit label: esere dayalı radyo senaryosu @tr
toolkit definition: Radyo programı için metin olarak uyarlanan bir eser. @tr

is television screenplay based on work
status: Published
definition: Relates a work to a work that is adapted as a screenplay for a television program.
type: Property
domain: C10001
sub property of: is screenplay based on work
lexical alias: televisionScreenplayBasedOnWork.en
toolkit label: television screenplay based on work
toolkit definition: A work that is adapted as a screenplay for a television program.
toolkit label: scénario de télévision basé sur une œuvre @fr
toolkit definition: Œuvre qui est adaptée en scénario d’émission de télévision. @fr
toolkit label: guión para televisión basado en (obra) @es
toolkit definition: Una obra que ha sido adaptada como guión para un programa de televisión. @es
instruction number: 24.5
label: er tv-manuskript baseret på værk @da
definition: Relaterer et værk til et værk, som er bearbejdet til et manuskript til et tv-program. @da
toolkit label: tv-manuskript baseret på værk @da
toolkit definition: Værk, som er bearbejdet til et manuskript til et tv-program. @da
definition: Met une œuvre en relation avec une œuvre qui est adaptée en scénario d’émission de télévision. @fr
label: là kịch bản truyền hình được trên (tác phẩm) @vi
definition: Liên kết tác phẩm với tác phẩm đã được phỏng theo như là kịch bản của chương trình truyền hình. @vi
toolkit label: kịch bản truyền hình được trên (tác phẩm) @vi
toolkit definition: Tác phẩm đã được phỏng theo như là kịch bản của chương trình truyền hình. @vi
label: ist Fernsehdrehbuch basierend auf (Werk) @de
definition: Setzt ein Werk in Beziehung zu einem Werk, das als Drehbuch für eine Fernsehsendung bearbeitet ist. @de
toolkit label: Fernsehdrehbuch basiert auf (Werk) @de
toolkit definition: Ein Werk, das als Drehbuch für eine Fernsehsendung bearbeitet ist. @de
label: est un scénario de télévision basé sur une œuvre @fr
definition: Liittää teoksen teokseen, joka on sovitettu televisio-ohjelman käsikirjoitukseksi. @fi
toolkit label: televisiokäsikirjoituksen perustana oleva teos @fi
toolkit definition: Teos, joka on sovitettu televisio-ohjelman käsikirjoitukseksi. @fi
toolkit label: fjernsynsmanus basert på verk @no
toolkit definition: Et verk som er bearbeidet til et manuskript for et fjernsynsprogram. @no
label: és guió de televisió basat en una obra @ca
definition: Relaciona una obra amb una obra que s’adapta com un guió d’un programa de televisió. @ca
toolkit label: guió de televisió basat en una obra @ca
toolkit definition: Obra que s’adapta com un guió d’un programa de televisió. @ca
has element type: 2
label: είναι τηλεοπτικό σενάριο βασισμένο σε (έργο) @el
definition: Συνδέει ένα έργο με ένα έργο το οποίο έχει προσαρμοστεί ως σενάριο για ένα τηλεοπτικό πρόγραμμα. @el
toolkit label: τηλεοπτικό σενάριο βασισμένο σε (έργο) @el
toolkit definition: Ένα έργο το οποίο έχει προσαρμοστεί ως σενάριο για ένα τηλεοπτικό πρόγραμμα. @el
label: televíziós forgatókönyv a következő műből: @hu
definition: Hozzákapcsol egy művet egy műhöz, amelyet egy televízióműsor forgatókönyveként adaptáltak. @hu
toolkit label: televízióműsor-forgatókönyvként átdolgozott mű @hu
toolkit definition: Egy mű, amelyet egy televízióműsor forgatókönyveként átdolgoztak. @hu
label: televisiokäsikirjoituksen perustana oleva teos @fi
label: er fjernsynsmanus basert på verk @no
definition: Relaterer et verk til et verk som er bearbeidet til et manuskript for et fjernsynsprogram. @no
label: is televisiescenario gebaseerd op werk @nl
definition: Relateert een werk aan een werk dat is bewerkt als een scenario voor een televisieprogramma. @nl
toolkit label: televisiescenario gebaseerd op werk @nl
toolkit definition: Een werk dat is bewerkt als een scenario voor een televisieprogramma. @nl
label: هو سيناريو تليفزيوني مبني على عمل @ar
definition: يربط عمل بعمل تمت معالجته كسيناريو لبرنامج تليفزيوني. @ar
toolkit label: سيناريو تليفزيوني مبني على عمل @ar
toolkit definition: عمل تمت معالجته كسيناريو لبرنامج تليفزيوني. @ar
label: telestsenaariumi aluseks olev teos @et
definition: Seostab teose teosega, mis on adapteeritud telesaate stsenaariumina. @et
toolkit label: telestsenaariumi aluseks olev teos @et
toolkit definition: Teos, mis on adapteeritud telesaate stsenaariumina. @et
label: è sceneggiatura televisiva basata su opera @it
definition: Correla un’opera a un’opera adattata come sceneggiatura per un programma televisivo. @it
toolkit label: sceneggiatura televisiva basata su opera @it
toolkit definition: Opera adattata come sceneggiatura per un programma televisivo. @it
label: kā televīzijas raidījuma scenārijs adaptētais darbs @lv
definition: Sasaista darbu ar darbu, kas ir adaptēts kā televīzijas raidījuma scenārijs. @lv
toolkit label: kā televīzijas raidījuma scenārijs adaptētais darbs @lv
toolkit definition: Darbs, kas ir adaptēts kā televīzijas raidījuma scenārijs. @lv
label: 是基于作品的电视剧本 @zh-hans
definition: 将一种作品与被改编为电视节目剧本的一种作品关联起来。 @zh-hans
toolkit label: 基于作品的电视剧本 @zh-hans
toolkit definition: 被改编为电视节目剧本的一种作品 @zh-hans
has subproperty: P10135
label: eserinden uyarlanan televizyon senaryosudur @tr
definition: Bir eseri, televizyon progamı için senaryo olarak uyarlanan bir eserle ilişkilendirir. @tr
toolkit label: eserinden uyarlanan televizyon senaryosu @tr
toolkit definition: Televizyon progamı için senaryo olarak uyarlanan bir çalışma. @tr

is variations based on work
status: Published
definition: Relates a work to a work that is a musical work from which melodic, thematic, or harmonic material is taken to form a discrete theme, which is repeated one or more times with subsequent modifications.
type: Property
domain: C10001
sub property of: has source work
lexical alias: variationsBasedOnWork.en
toolkit label: variations based on work
toolkit definition: A work that is a musical work from which melodic, thematic, or harmonic material is taken to form a discrete theme, which is repeated one or more times with subsequent modifications.
toolkit label: variations basées sur une œuvre @fr
toolkit definition: Œuvre musicale d’où est tirée de la matière mélodique, thématique ou harmonique pour former un thème distinct, qui est répété une ou plusieurs fois avec des modifications subséquentes. @fr
toolkit label: variaciones basadas en (obra) @es
toolkit definition: Una obra musical de la cual se toma material melódico, temático o armónico para formar un tema separado, que se repite una o más veces con modificaciones subsecuentes. @es
instruction number: 24.5
label: er variationer baseret på værk @da
definition: Relaterer et værk til et musikværk, hvorfra der er taget melodisk, tematisk eller harmonisk materiale til at danne et separat tema, der gentages en eller flere gange med efterfølgende tilpasninger. @da
toolkit label: variationer baseret på værk @da
toolkit definition: Musikværk, hvorfra der er taget melodisk, tematisk eller harmonisk materiale til at danne et separat tema, der gentages en eller flere gange med efterfølgende tilpasninger. @da
definition: Met une œuvre en relation avec une œuvre musicale d’où est tirée de la matière mélodique, thématique ou harmonique pour former un thème distinct, qui est répété une ou plusieurs fois avec des modifications subséquentes. @fr
label: là biến tấu dựa trên (tác phẩm) @vi
definition: Liên kết tác phẩm với tác phẩm âm nhạc mà từ đó tài liệu du dương, theo đề tài, hoặc hoà âm được lấy ra để tạo thành đề tài riêng biệt, được nhắc lại một hoặc nhiều lần với các sửa đổi liên tiếp. @vi
toolkit label: biến tấu dựa trên (tác phẩm) @vi
toolkit definition: Tác phẩm âm nhạc mà từ đó tài liệu du dương, theo đề tài, hoặc hoà âm được lấy ra để tạo thành đề tài riêng biệt, được nhắc lại một hoặc nhiều lần với các sửa đổi liên tiếp. @vi
label: ist Variationen basierend auf (Werk) @de
definition: Setzt ein Werk in Beziehung zu einem Musikwerk, aus dem melodisches, thematisches oder harmonisches Material entnommen wird, um ein einzelnes Thema zu bilden, das ein- oder mehrmals mit nachfolgenden Modifikationen wiederholt wird. @de
toolkit label: Variationen basieren auf (Werk) @de
toolkit definition: Ein Musikwerk, aus dem melodisches, thematisches oder harmonisches Material entnommen wird, um ein einzelnes Thema zu bilden, das ein- oder mehrmals mit nachfolgenden Modifikationen wiederholt wird. @de
label: consiste en variations basées sur une œuvre @fr
definition: Liittää teoksen musiikkiteokseen, josta melodinen, temaattinen tai harmoninen aines on otettu erillisen, toistettavan ja muunneltavan teeman muodostamiseksi. @fi
toolkit label: muunnelmien perustana oleva teos @fi
toolkit definition: Musiikkiteos, josta melodinen, temaattinen tai harmoninen aines on otettu erillisen, toistettavan ja muunneltavan teeman muodostamiseksi. @fi
toolkit label: variasjoner basert på verk @no
toolkit definition: Et musikalsk verk der melodisk, tematisk eller harmonisk materiale hentet fra kildeverket danner et avgrenset tema, som gjentas én eller flere ganger med påfølgende modifikasjoner. @no
label: és variacions basades en una obra @ca
definition: Relaciona una obra amb una obra que és una obra musical de la qual el material melòdic, temàtic o harmònic s’obté per formar un tema discret que es repeteix una o més vegades amb modificacions subsegüents. @ca
toolkit label: variacions basades en una obra @ca
toolkit definition: Una obra que és una obra musical de la qual el material melòdic, temàtic o harmònic s’obté per formar un tema discret que es repeteix una o més vegades amb modificacions subsegüents. @ca
has element type: 2
label: είναι παραλλαγές βασισμένες πάνω σε (έργο) @el
definition: Συνδέει μια έκφραση με μια έκφραση ενός μουσικού έργου από το οποίο έχει αντληθεί μελωδικό, θεματικό ή αρμονικό υλικό για τη διαμόρφωση ενός διακριτού θέματος, το οποίο επαναλαμβάνεται μία ή περισσότερες φορές με διαδοχικές τροποποιήσεις. @el
toolkit label: παραλλαγές βασισμένες πάνω σε (έργο) @el
toolkit definition: Ένα μουσικό έργο από το οποίο έχει αντληθεί μελωδικό, θεματικό ή αρμονικό υλικό για τη διαμόρφωση ενός διακριτού θέματος, το οποίο επαναλαμβάνεται μία ή περισσότερες φορές με διαδοχικές τροποποιήσεις. @el
label: változatok a következő mű alapján: @hu
definition: Hozzákapcsol egy művet egy zeneműhöz, amelyből dallami, tematikus vagy harmonikus anyagot emelnek ki egy különálló téma megalkotása céljából, amely egyszer vagy többször ismétlődik egymás utáni módosulásokkal. @hu
toolkit label: változatokkal ellátott mű @hu
toolkit definition: Egy zenemű, amelyből dallami, tematikus vagy harmonikus anyagot emelnek ki egy különálló téma megalkotása céljából, amely egyszer vagy többször ismétlődik egymás utáni módosulásokkal. @hu
label: muunnelmien perustana oleva teos @fi
label: er variasjoner basert på verk @no
definition: Relaterer et verk til et musikalsk verk der melodisk, tematisk eller harmonisk materiale hentet fra kildeverket danner et avgrenset tema, som gjentas én eller flere ganger med påfølgende modifikasjoner. @no
label: is variaties gebaseerd op werk @nl
definition: Relateert een werk aan een muziekwerk waarvan melodisch, thematisch of harmonisch materiaal is genomen om een apart thema te vormen, dat één of meer keer herhaald wordt met volgende aanpassingen. @nl
toolkit label: variaties gebaseerd op werk @nl
toolkit definition: Een muziekwerk waarvan melodisch, thematisch of harmonisch materiaal is genomen om een apart thema te vormen, dat één of meer keer herhaald wordt met volgende aanpassingen. @nl
label: هو تنويعات تعتمد على عمل @ar
definition: يربط عمل بعمل موسيقي تؤخذ منه مواد لحنية، أو موضوعية، أو تناغمية لتشكل مقطوعة متميزة، تتكرر مرة واحدة أو أكثر مع تعديلات لاحقة. @ar
toolkit label: تنويعات تعتمد على عمل @ar
toolkit definition: عمل موسيقي تؤخذ منه مواد لحنية، أو موضوعية، أو تناغمية لتشكل مقطوعة متميزة، تتكرر مرة واحدة أو أكثر مع تعديلات لاحقة. @ar
label: variatsioonide aluseks olev teos @et
definition: Seostab teose muusikateosega, mille meloodilisest, temaatilisest või harmoonilisest materjalist on loodud eraldi teema, mida korratakse muudetuna üks või mitu korda. @et
toolkit label: variatsioonide aluseks olev teos @et
toolkit definition: Muusikateos, mille meloodilisest, temaatilisest või harmoonilisest materjalist on loodud eraldi teema, mida korratakse muudetuna üks või mitu korda. @et
label: è una variazione basata su opera @it
definition: Correla un’opera a un’opera musicale da cui si trae il materiale melodico, tematico o armonico per comporre un tema distinto, che si ripete una o più volte con modifiche successive. @it
toolkit label: variazione basata su opera @it
toolkit definition: Opera musicale da cui si trae il materiale melodico, tematico o armonico per comporre un tema distinto, che si ripete una o più volte con modifiche successive. @it
label: ir variācija darbam @lv
definition: Sasaista darbu ar mūzikas darbu, no kura ņemts melodisks, tematisks vai harmonisks materiāls, lai izveidotu atsevišķu tēmu, ko atkārto vienu vai vairākas reizes ar secīgām izmaiņām. @lv
toolkit label: variācija darbam @lv
toolkit definition: Muzikas darbs, no kura ņemts melodisks, tematisks vai harmonisks materiāls, lai izveidotu atsevišķu tēmu, ko atkārto vienu vai vairākas reizes ar secīgām izmaiņām. @lv
label: 是基于作品的变奏曲 @zh-hans
definition: 将一种作品与其旋律、主题或和声材料被用来形成一个独立的主题、而这个主题又经过后续变化而反复一次或多次的作为一种音乐作品的一种作品关联起来。 @zh-hans
toolkit label: 基于作品的变奏曲 @zh-hans
toolkit definition: 其旋律、主题或和声材料被用来形成一个独立的主题、而这个主题又经过后续变化而反复一次或多次的作为一种音乐作品的一种作品 @zh-hans
has subproperty: P10027
label: esere dayalı alternatifler @tr
definition: Bir eseri, melodik, tematik veya armonik materyalin ayrı bir tema oluşturmak üzere alındığı ve sonraki değişikliklerle bir veya daha fazla kez tekrarlanan bir müzik eseriyle ilişkilendirir. @tr
toolkit label: esere dayalı alternatifler @tr
toolkit definition: Melodik, tematik veya armonik materyalin ayrı bir tema oluşturmak üzere alındığı ve sonraki değişikliklerle bir veya daha fazla kez tekrarlanan bir müzik eseri. @tr

is video screenplay based on work
status: Published
definition: Relates a work to a work that is adapted as a screenplay for a video.
type: Property
domain: C10001
sub property of: is screenplay based on work
lexical alias: videoScreenplayBasedOnWork.en
toolkit label: video screenplay based on work
toolkit definition: A work that is adapted as a screenplay for a video.
toolkit label: scénario de vidéo basé sur une œuvre @fr
toolkit definition: Œuvre qui est adaptée en scénario de vidéo. @fr
toolkit label: guión para video basado en (obra) @es
toolkit definition: Una obra ha que ha sido adaptada como guión para un video. @es
instruction number: 24.5
label: er videomanuskript baseret på værk @da
definition: Relaterer et værk til et værk, som er bearbejdet til et manuskript til en video. @da
toolkit label: videomanuskript baseret på værk @da
toolkit definition: Værk, som er bearbejdet til et manuskript til en video. @da
definition: Met une œuvre en relation avec une œuvre qui est adaptée en scénario de vidéo. @fr
label: là kịch bản video được trên (tác phẩm) @vi
definition: Liên kết tác phẩm với tác phẩm đã được phỏng theo như là kịch bản của video. @vi
toolkit label: kịch bản video được trên (tác phẩm) @vi
toolkit definition: Tác phẩm đã được phỏng theo như là kịch bản của video. @vi
label: ist Videodrehbuch basierend auf (Werk) @de
definition: Setzt ein Werk in Beziehung zu einem Werk, das als Drehbuch für ein Video bearbeitet ist. @de
toolkit label: Videodrehbuch basiert auf (Werk) @de
toolkit definition: Ein Werk, das als Drehbuch für ein Video bearbeitet ist. @de
label: est un scénario de vidéo basé sur une œuvre @fr
definition: Liittää teoksen teokseen, joka on sovitettu videon käsikirjoitukseksi. @fi
toolkit label: videokäsikirjoituksen perustana oleva teos @fi
toolkit definition: Teos, joka on sovitettu videon käsikirjoitukseksi. @fi
toolkit label: videomanus basert på verk @no
toolkit definition: Et verk som er bearbeidet til et manuskript for en video. @no
label: és guió de vídeo basat en una obra @ca
definition: Relaciona una obra amb una obra que s’adapta com un guió d’un vídeo. @ca
toolkit label: guió de vídeo basat en una obra @ca
toolkit definition: Obra que s’adapta com un guió d’un vídeo. @ca
has element type: 2
label: είναι σενάριο για βίντεο βασισμένο σε (έργο) @el
definition: Συνδέει ένα έργο με ένα έργο το οποίο έχει προσαρμοστεί ως σενάριο για ένα βίντεο. @el
toolkit label: σενάριο για βίντεο βασισμένο σε (έργο) @el
toolkit definition: Ένα έργο το οποίο έχει προσαρμοστεί ως σενάριο για ένα βίντεο. @el
label: videóforgatókönyv a következő műből @hu
definition: Hozzákapcsol egy művet egy műhöz, amelyet egy videó forgatókönyveként adaptáltak. @hu
toolkit label: videóforgatókönyvként átdolgozott mű @hu
toolkit definition: Egy mű, amelyet forgatókönyvként átdolgoztak egy videóhoz. @hu
label: videokäsikirjoituksen perustana oleva teos @fi
label: er videomanus basert på verk @no
definition: Relaterer et verk til et verk som er bearbeidet til et manuskript for en video. @no
label: is videoscenario gebaseerd op werk @nl
definition: Relateert een werk aan een werk dat is bewerkt als een scenario voor een video. @nl
toolkit label: videoscenario gebaseerd op werk @nl
toolkit definition: Een werk dat is bewerkt als een scenario voor een video. @nl
label: هو سيناريو فيديو مبني على عمل @ar
definition: يربط عمل بعمل تمت معالجته كسيناريو لفيديو. @ar
toolkit label: سيناريو فيديو مبني على عمل @ar
toolkit definition: عمل تمت معالجته كسيناريو لفيديو. @ar
label: videostsenaariumi aluseks olev teos @et
definition: Seostab teose teosega, mis on adapteeritud videofilmi stsenaariumina. @et
toolkit label: videostsenaariumi aluseks olev teos @et
toolkit definition: Teos, mis on adapteeritud videofilmi stsenaariumina. @et
label: è sceneggiatura per video basata su opera @it
definition: Correla un’opera a un’opera adattata come sceneggiatura per un video. @it
toolkit label: sceneggiatura per video basata su opera @it
toolkit definition: Opera adattata come sceneggiatura per un video. @it
label: kā video scenārijs adaptētais darbs @lv
definition: Sasaista darbu ar darbu, kas ir adaptēts kā video scenārijs. @lv
toolkit label: kā video scenārijs adaptētais darbs @lv
toolkit definition: Darbs, kas ir adaptēts kā video scenārijs. @lv
label: 是基于作品的视频剧本 @zh-hans
definition: 将一种作品与被改编为视频剧本的一种作品关联起来。 @zh-hans
toolkit label: 基于作品的视频剧本 @zh-hans
toolkit definition: 被改编为视频剧本的一种作品 @zh-hans
has subproperty: P10136
label: esere dayalı video senaryosudur @tr
definition: Bir eseri, video için senaryo olarak uyarlanan bir eserle ilişkilendirir. @tr
toolkit label: esere dayalı video senaryosu @tr
toolkit definition: Video için senaryo olarak uyarlanan bir çalışma. @tr

is musical setting of work
status: Published
definition: Relates a work to a work that provides text for a non-dramatic musical work, other than an oratorio.
type: Property
domain: C10001
sub property of: has source work
lexical alias: musicalSettingOfWork.en
toolkit label: musical setting of work
toolkit definition: A work that provides text for a non-dramatic musical work, other than an oratorio.
toolkit label: mise en musique d’une œuvre @fr
toolkit definition: Œuvre qui fournit un texte pour une œuvre musicale non dramatique, autre qu’un oratorio. @fr
toolkit label: composición musical de (obra) @es
toolkit definition: Una obra que proporciona el texto de una obra musical no dramática, diferente del oratorio. @es
instruction number: 24.5
label: er musiksætning af værk @da
definition: Relaterer et værk til et værk, som angiver tekst til et ikke-dramatisk musikværk, bortset fra et oratorium. @da
toolkit label: musiksætning af værk @da
toolkit definition: Værk, som angiver tekst til et ikke-dramatisk musikværk, bortset fra et oratorium. @da
definition: Met une œuvre en relation avec une œuvre qui fournit un texte pour une œuvre musicale non dramatique, autre qu’un oratorio. @fr
label: là phổ nhạc của (tác phẩm) @vi
definition: Liên kết tác phẩm với tác phẩm cung cấp văn bản cho tác phẩm âm nhạc phi kịch, khác với oratorio. @vi
toolkit label: phổ nhạc của (tác phẩm) @vi
toolkit definition: Tác phẩm cung cấp văn bản cho tác phẩm âm nhạc phi kịch, khác với oratorio. @vi
label: ist Vertonung von (Werk) @de
definition: Setzt ein Werk in Beziehung zu einem Werk, das Text für ein nicht dramatisches Musikwerk (kein Oratorium) liefert. @de
toolkit label: Vertonung von (Werk) @de
toolkit definition: Ein Werk, das Text für ein nicht dramatisches Musikwerk (kein Oratorium) liefert. @de
label: est une mise en musique d’une œuvre @fr
definition: Liittää teoksen teokseen, joka on ei-näytelmällisen musiikkiteoksen (muun kuin oratorion) teksti. @fi
toolkit label: musiikkiteoksen teksti (teos) @fi
toolkit definition: Teos, joka on ei-näytelmällisen musiikkiteoksen (muun kuin oratorion) teksti. @fi
toolkit label: musikksetting av verk @no
toolkit definition: Et verk som tilfører teksten til et ikke-dramatisk musikalsk verk, bortsett fra et oratorium. @no
label: és musicació d’una obra @ca
definition: Relaciona una obra amb una obra que proporciona el text d’una obra musical no teatral, diferent d’un oratori. @ca
toolkit label: musicació d’una obra @ca
toolkit definition: Obra que proporciona el text d’una obra musical no teatral, diferent d’un oratori. @ca
has element type: 2
label: είναι μελοποίηση του (έργο) @el
definition: Συνδέει ένα έργο με ένα έργο το οποίο παρέχει κείμενο για ένα μη δραματικό μουσικό έργο, άλλο από ορατόριο. @el
toolkit label: μελοποίηση του (έργο) @el
toolkit definition: Ένα έργο το οποίο παρέχει κείμενο για ένα μη δραματικό μουσικό έργο, άλλο από ορατόριο. @el
label: zenei átirata a következő műnek: @hu
definition: Hozzákapcsol egy művet egy műhöz, amely szöveggel lát el egy nem oratórium, nem-drámai zeneművet. @hu
toolkit label: zeneszövegmű @hu
toolkit definition: Egy mű, amely szöveggel lát el egy nem oratórium, nem-drámai zeneművet. @hu
label: musiikkiteoksen teksti (teos) @fi
label: er musikksetting av verk @no
definition: Relaterer et verk til et verk som tilfører teksten til et ikke-dramatisk musikalsk verk, bortsett fra et oratorium. @no
label: is muziek gezet op werk @nl
definition: Relateert een werk aan een werk dat de tekst verzorgt voor een niet-dramatisch muziekwerk, anders dan een oratorium. @nl
toolkit label: op muziek gezet werk @nl
toolkit definition: Een werk dat de tekst verzorgt voor een niet-dramatisch muziekwerk, anders dan een oratorium. @nl
label: هو إعداد موسيقي لعمل @ar
definition: يربط عمل بعمل يقدم نصًا لعمل موسيقي غير درامي، بخلاف الموسيقى الدينية. @ar
toolkit label: إعداد موسيقي لعمل @ar
toolkit definition: عمل يقدم نصًا لعمل موسيقي غير درامي، بخلاف الموسيقى الدينية. @ar
label: viisistatud tekst (teos) @et
definition: Seostab teose teosega, millest on võetud mittedramaatilise muusikateose (v.a oratooriumi) tekst. @et
toolkit label: viisistatud tekst (teos) @et
toolkit definition: Teos, millest on võetud mittedramaatilise muusikateose (v.a oratooriumi) tekst. @et
label: è testo per musica di opera @it
definition: Correla un’opera a un’opera che fornisce testo per un’opera musicale non in forma drammatica, differente dall’oratorio. @it
toolkit label: testo per musica di opera @it
toolkit definition: Opera che fornisce testo per un’opera musicale non in forma drammatica, differente dall’oratorio. @it
label: ir darbs komponēts tekstam @lv
definition: Sasaista darbu ar darbu nodrošina tekstu ne-dramatiskam muzikālam darbam, kas nav oratorija. @lv
toolkit label: darbs komponēts tekstam @lv
toolkit definition: Darbs nodrošina tekstu ne-dramatiskam muzikālam darbam, kas nav oratorija. @lv
label: 是作品的配乐 @zh-hans
definition: 将一种作品与为一种非戏剧音乐作品（清唱剧除外）提供文本的作品关联起来。 @zh-hans
toolkit label: 作品的配乐 @zh-hans
toolkit definition: 为一种非戏剧音乐作品（清唱剧除外）提供文本的作品 @zh-hans
has subproperty: P10161
label: eserin müzikal düzenlemesidir @tr
definition: Bir eseri, oratoryo dışında dramatik olmayan bir müzik eseri için metin sağlayan bir eserle ilişkilendirir. @tr
toolkit label: Müzikal ortamın çalışması @tr
toolkit definition: Oratoryo dışında dramatik olmayan bir müzikal eser için metin sağlayan bir çalışma. @tr

is musical theatre adaptation of work
status: Published
definition: Relates a work to a work that is adapted as a musical theatre work.
type: Property
sub property of: is adaptation of work
domain: C10001
lexical alias: musicalTheatreAdaptationOfWork.en
toolkit label: musical theatre adaptation of work
toolkit definition: A work that is adapted as a musical theatre work.
toolkit label: adaptation au théâtre musical d’une œuvre @fr
toolkit definition: Œuvre qui est adaptée en œuvre de théâtre musical. @fr
toolkit label: adaptación a teatro musical de (obra) @es
toolkit definition: Una obra que ha sido adaptada como una obra de teatro musical. @es
instruction number: 24.5
label: er bearbejdelse af værk til musikteater @da
definition: Relaterer et værk til et værk, som er bearbejdet til et musikteaterværk. @da
toolkit label: bearbejdelse af værk til musikteater @da
toolkit definition: Værk, som er bearbejdet til et musikteaterværk. @da
definition: Met une œuvre en relation avec une œuvre qui est adaptée en œuvre de théâtre musical. @fr
label: là phong theo nhà hát âm nhạc của (tác phẩm) @vi
definition: Liên kết tác phẩm với tác phẩm đã được phỏng theo như là tác phẩm nhà hát âm nhạc. @vi
toolkit label: phong theo nhà hát âm nhạc của (tác phẩm) @vi
toolkit definition: Tác phẩm đã được phỏng theo như là tác phẩm nhà hát âm nhạc. @vi
label: ist Musiktheaterbearbeitung von (Werk) @de
definition: Setzt ein Werk in Beziehung zu einem Werk, das als Musiktheaterwerk bearbeitet ist. @de
toolkit label: Musiktheaterbearbeitung von (Werk) @de
toolkit definition: Ein Werk, das als Musiktheaterwerk bearbeitet ist. @de
label: est une adaptation au théâtre musical d’une œuvre @fr
definition: Liittää teoksen teokseen, joka on sovitettu musikaaliteokseksi. @fi
toolkit label: musikaaliversio teoksesta @fi
toolkit definition: Teos, joka on sovitettu musikaaliteokseksi. @fi
toolkit label: bearbeidelse av verk til musikal @no
toolkit definition: Et verk som er bearbeidet til et musikalverk. @no
label: és adaptació per a teatre musical d’una obra @ca
definition: Relaciona una obra amb una obra que s’adapta com una obra teatral musical. @ca
toolkit label: adaptació per a teatre musical d’una obra @ca
toolkit definition: Obra que s’adapta com una obra teatral musical. @ca
has element type: 2
label: είναι μουσικοθεατρική προσαρμογή του (έργο) @el
definition: Συνδέει ένα έργο με ένα έργο το οποίο έχει προσαρμοστεί ως μουσικο-θεατρικό έργο. @el
toolkit label: μουσικοθεατρική προσαρμογή του (έργο) @el
toolkit definition: Ένα έργο το οποίο έχει προσαρμοστεί ως μουσικο-θεατρικό έργο. @el
label: zeneszínházi feldolgozása a következő műnek: @hu
definition: Hozzákapcsol egy művet egy műhöz, amelyet zeneszínházi műként adaptáltak. @hu
toolkit label: zeneszínházi feldolgozása a következő műnek: @hu
toolkit definition: Egy mű, amelyet zeneszínházi műként adaptáltak. @hu
label: musikaaliversio teoksesta @fi
label: er bearbeidelse av verk til musikal @no
definition: Relaterer et verk til et verk som er bearbeidet til et musikalverk. @no
alternative label: musical theater adaptation of work
label: is muziektheaterbewerking van werk @nl
definition: Relateert een werk aan een werk dat is bewerkt als een muziektheaterwerk. @nl
toolkit label: muziektheaterbewerking van werk @nl
toolkit definition: Een werk dat is bewerkt als een muziektheaterwerk. @nl
label: هو اقتباس مسرحي موسيقي لعمل @ar
definition: يربط عمل بعمل معالج كعمل مسرحي موسيقي. @ar
toolkit label: معالجة مسرحية موسيقية لعمل @ar
toolkit definition: عمل معالج كعمل مسرحي موسيقي. @ar
label: muusikaliversioon teosest @et
definition: Seostab teose teosega, mis on adapteeritud muusikalina. @et
toolkit label: muusikaliversioon teosest @et
toolkit definition: Teos, mis on adapteeritud muusikalina. @et
label: è adattamento per teatro musicale di opera @it
definition: Correla un’opera a un’opera adattata come un’opera per il teatro musicale. @it
toolkit label: adattamento per teatro musicale di opera @it
toolkit definition: Opera adattata come un’opera per il teatro musicale. @it
label: kā muzikāls iestudējums adaptētais darbs @lv
definition: Sasaista darbu ar darbu, kas ir adaptēts kā muzikāls iestudējums. @lv
toolkit label: kā muzikāls iestudējums adaptētais darbs @lv
toolkit definition: Darbs, kas ir adaptēts kā muzikāls iestudējums. @lv
alternative label: معالجة مسرحية موسيقية لعمل @ar
alternative label: adaptació per a teatre musical d’una obra @ca
alternative label: teoksen musikaaliversio @fi
alternative label: 作品的音乐戏剧改编 @zh-hans
label: 是作品的音乐戏剧改编 @zh-hans
definition: 将一种作品与被改编为一种音乐戏剧作品的一种作品关联起来。 @zh-hans
toolkit label: 作品的音乐戏剧改编 @zh-hans
toolkit definition: 被改编为一种音乐戏剧作品的一种作品 @zh-hans
has subproperty: P10233
alternative label: eserin müzikal tiyatro uyarlaması @tr

has equinox
status: Published
definition: Relates a work to a timespan that is a point of intersection of the ecliptic and the celestial equator, occupied by the sun when its declination is 0°.
type: Property
domain: C10001
lexical alias: equinox.en
instruction number: 7.5
toolkit label: equinox
toolkit definition: A timespan that is a point of intersection of the ecliptic and the celestial equator, occupied by the sun when its declination is 0°.
toolkit label: équinoxe @fr
toolkit definition: Laps de temps qui constitue un point d’intersection de l’écliptique et de l’équateur céleste, occupé par le soleil quand sa déclinaison est de 0°. @fr
toolkit label: equinoccio @es
toolkit definition: Uno de los dos puntos de intersección de la eclíptica y el Ecuador celeste, ocupada por el sol cuando su declinación es 0°. @es
label: har ekvinoktium @sv
toolkit label: ekvinoktium @sv
label: har jævndøgn @da
definition: Relaterer et værk til en tidsperiode, som er skæringspunktet mellem ekliptika og himlens ækvator, hvor solen befinder sig, når dens hældning er 0°. @da
toolkit label: jævndøgn @da
toolkit definition: Tidsperiode, som er skæringspunktet mellem ekliptika og himlens ækvator, hvor solen befinder sig, når dens hældning er 0°. @da
definition: Met une œuvre en relation avec un laps de temps qui constitue un point d’intersection de l’écliptique et de l’équateur céleste, occupé par le soleil quand sa déclinaison est de 0°. @fr
label: có điểm phân @vi
definition: Liên kết tác phẩm với điểm giao nhau của đường hoàng đạo và xích đạo bầu trời, xuất hiện bởi mặt trời khi độ lệch của nó là 0° @vi
toolkit label: điểm phân @vi
toolkit definition: Điểm giao nhau của đường hoàng đạo và xích đạo bầu trời, xuất hiện bởi mặt trời khi độ lệch của nó là 0° @vi
label: hat Äquinoktium @de
definition: Setzt ein Werk in Beziehung zu einem von zwei Kreuzungspunkten der Sonnenbahn und des Himmelsäquators, die von der Sonne überquert werden, wenn ihre Deklination 0° beträgt. @de
toolkit label: Äquinoktium @de
toolkit definition: Einer von zwei Kreuzungspunkten der Sonnenbahn und des Himmelsäquators, die von der Sonne überquert werden, wenn ihre Deklination 0° beträgt. @de
label: a pour équinoxe @fr
definition: Liittää teoksen ajanjaksoon, joka on ekliptikan ja taivaanekvaattorin leikkauspiste, jossa aurinko on, kun sen deklinaatio on 0°. @fi
toolkit label: tasauspiste @fi
toolkit definition: Ajanjakso, joka on ekliptikan ja taivaanekvaattorin leikkauspiste, jossa aurinko on, kun sen deklinaatio on 0°. @fi
toolkit label: jevndøgn @no
toolkit definition: Et tidsrom som er et skjæringspunkt mellom solbanen og himmelekvator, der solen befinner seg når deklinasjonen dens er 0°. @no
label: té com a equinocci @ca
definition: Relaciona una obra amb un interval de temps que és un punt d’intersecció de l’eclíptica i de l’equador celeste, ocupat pel sol quan la seva declinació és de 0º. @ca
toolkit label: equinocci @ca
toolkit definition: Interval de temps que és un punt d’intersecció de l’eclíptica i de l’equador celeste, ocupat pel sol quan la seva declinació és de 0º. @ca
sub property of: has related timespan of work
has element type: 2
label: έχει ισημερία @el
definition: Συνδέει ένα έργο με ένα σημείο τομής της εκλειπτικής τροχιάς και του ουράνιου ισημερινού, από τα οποία διέρχεται ο ήλιος όταν η απόκλισή του είναι 0°. @el
toolkit label: ισημερία @el
toolkit definition: Ένα σημείο τομής της εκλειπτικής τροχιάς και του ουράνιου ισημερινού, από τα οποία διέρχεται ο ήλιος όταν η απόκλισή του είναι 0°. @el
label: napéjegyenlősége a következő: @hu
definition: Hozzákapcsol egy művet egy időtartamhoz, amely a nappálya és az égi egyenlítő kereszteződési pontja, amelyet a nap akkor foglal el, amikor a deklinációja 0°. @hu
toolkit label: napéjegyenlősége: @hu
toolkit definition: Egy időtartam, amely a nappálya és az égi egyenlítő kereszteződési pontja, amelyet a nap akkor foglal el, amikor a deklinációja 0°. @hu
label: tasauspiste @fi
label: har jevndøgn @no
definition: Relaterer et verk til et tidsrom som er et skjæringspunkt mellom solbanen og himmelekvator, der solen befinner seg når deklinasjonen dens er 0°. @no
label: heeft equinox @nl
definition: Relateert een werk aan een tijdspanne dat een snijpunt is van de ecliptica en de hemelevenaar, ingenomen door de zon wanneer zijn declinatie 0° is. @nl
toolkit definition: Een tijdspanne dat een snijpunt is van de ecliptica en de hemelevenaar, ingenomen door de zon wanneer zijn declinatie 0° is. @nl
label: له اعتدال @ar
definition: يربط بين عمل وفترة زمنية تمثل نقطة تقاطع بين مسير الشمس وخط الاستواء السماوي، تحتله الشمس عندما يكون انحرافها صفر درجة. @ar
toolkit label: اعتدال @ar
toolkit definition: فترة زمنية تمثل نقطة تقاطع بين مسير الشمس وخط الاستواء السماوي، تحتله الشمس عندما يكون انحرافها صفر درجة. @ar
label: võrdpäevsus @et
definition: Seostab teose ajavahemikuga, millal Päike läbib ekliptika ja taevaekvaatori lõikepunkti, kui Päikese kääne on 0°. @et
alternative label: ekvinoktsium @et
toolkit label: võrdpäevsus @et
toolkit definition: Ajavahemik, millal Päike läbib ekliptika ja taevaekvaatori lõikepunkti, kui Päikese kääne on 0°. @et
label: ha come equinozio @it
definition: Correla un’opera a un intervallo di tempo che è un punto di intersezione tra l’eclittica e l’equatore celeste, occupato dal Sole quando la sua declinazione è 0°. @it
toolkit label: equinozio @it
toolkit definition: Intervallo di tempo che è un punto di intersezione tra l’eclittica e l’equatore celeste, occupato dal Sole quando la sua declinazione è 0°. @it
label: ekvinokcija @lv
definition: Sasaista darbu ar laikposmu, kurā Saules diska centrs savā redzamajā gada kustībā šķērso debess ekvatoru un dienas un nakts garums ir vienāds. (svešv.vārdn.). @lv
toolkit label: ekvinokcija @lv
toolkit definition: Laikposms, kurā Saules diska centrs savā redzamajā gada kustībā šķērso debess ekvatoru un dienas un nakts garums ir vienāds. (svešv.vārdn.) @lv
label: 有二分点 @zh-hans
definition: 将一种作品与作为当太阳的赤纬角度为0时其所占黄道和天赤道的一个交叉点的一个时间段关联起来。 @zh-hans
toolkit label: 二分点 @zh-hans
toolkit definition: 作为当太阳的赤纬角度为0时其所占黄道和天赤道的一个交叉点的一个时间段 @zh-hans
has subproperty: P10214
label: ekinoks ile ilişkilidir @tr
definition: Bir eseri, güneşin sapmasının 0° olduğu anda ekliptik ve gök ekvatorunun kesişme noktası olan bir zaman aralığıyla ilişkilendirir. @tr
toolkit label: ekinoks @tr
toolkit definition: Güneşin sapmasının 0° olduğu anda, ekliptik ile gök ekvatorunun kesişim noktası olan bir zaman aralığı @tr

has note on metadata work
status: Published
lexical alias: noteOnMetadataWork.en
definition: Relates a work to a broad unstructured description of one or more attributes of a metadata work.
alternative label: cataloguer's note
toolkit label: note on metadata work
toolkit definition: A broad unstructured description of one or more attributes of a metadata work.
type: Property
domain: C10001
sub property of: has note on work
has element type: 6
alternative label: explanation of relationship
instruction number: 24.7 24.8 29.6 29.7
label: huomautus metatietoteoksesta @fi
definition: Liittää teoksen metatietoteoksen yhden tai useamman attribuutin laajaan rakenteistamattomaan kuvailuun. @fi
toolkit label: huomautus metatietoteoksesta @fi
toolkit definition: Metatietoteoksen yhden tai useamman attribuutin laaja rakenteistamaton kuvailu. @fi
label: har note om metadataverk @no
definition: Relaterer et verk til en bred ustrukturert beskrivelse av ett eller flere attributter for et metadataverk. @no
toolkit label: note om metadataverk @no
toolkit definition: En bred ustrukturert beskrivelse av ett eller flere attributter for et metadataverk. @no
label: heeft noot bij metadatawerk @nl
definition: Relateert een werk aan een algemene ongestructureerde beschrijving van één of meer attributen van een metadatawerk. @nl
toolkit label: noot bij metadatawerk @nl
toolkit definition: Een algemene ongestructureerde beschrijving van één of meer attributen van een metadatawerk. @nl
label: له تبصرة عن عمل ميتاداتا @ar
definition: يربط بين عمل ووصف عام غير محدد لخاصية أو أكثر من خصائص عمل الميتاداتا. @ar
alternative label: تفسير لعلاقة @ar
toolkit label: تبصرة عن عمل ميتاداتا @ar
toolkit definition: وصف عام غير محدد لخاصية أو أكثر من خصائص عمل الميتاداتا. @ar
label: té com a nota sobre una obra de metadades @ca
definition: Relaciona una obra amb una descripció no estructurada àmplia d’un o més atributs d’una obra de metadades. @ca
toolkit label: nota sobre una obra de metadades @ca
toolkit definition: Descripció no estructurada àmplia d’un o més atributs d’una obra de metadades. @ca
label: har note om metadataværk @da
definition: Relaterer et værk til en bred, ustruktureret beskrivelse af en eller flere af et metadataværks attributter. @da
alternative label: katalogisatorens note @da
toolkit label: note om metadataværk @da
toolkit definition: Bred, ustruktureret beskrivelse af en eller flere af et metadataværks attributter. @da
label: märkus metaandmeteose kohta @et
definition: Seostab teose üldise struktureerimata kirjeldusega, mis iseloomustab üht või mitut metaandmeteose omadust. @et
alternative label: kataloogija märkus @et
alternative label: seose selgitus @et
toolkit label: märkus metaandmeteose kohta @et
toolkit definition: Üldine struktureerimata kirjeldus, mis iseloomustab üht või mitut metaandmeteose omadust. @et
label: hat Anmerkung zum Metadatenwerk @de
definition: Setzt ein Werk in Beziehung zu einer umfassenden, unstrukturierten Beschreibung eines Merkmals oder mehrerer Merkmale eines Metadatenwerks. @de
toolkit label: Anmerkung zum Metadatenwerk @de
toolkit definition: Eine umfassende, unstrukturierte Beschreibung eines Merkmals oder mehrerer Merkmale eines Metadatenwerks. @de
label: metaadatműről szóló megjegyzése a következő: @hu
definition: Hozzákapcsol egy művet egy metaadatmű egy vagy több ismérvének átfogó, strukturálatlan leírásához. @hu
toolkit label: megjegyzés a metaadatműről @hu
toolkit definition: Egy metaadatmű egy vagy több ismérvének átfogó, strukturálatlan leírása. @hu
label: ha come nota su opera di metadati @it
definition: Correla un'opera a una descrizione non strutturata estesa di uno o più attributi di un'opera di metadati. @it
alternative label: nota del catalogatore @it
toolkit label: nota su opera di metadati @it
toolkit definition: Descrizione non strutturata estesa di uno o più attributi di un'opera di metadati. @it
label: a pour note sur une œuvre de métadonnées @fr
definition: Met une œuvre en relation avec une description non structurée générale d’un ou plusieurs attributs d’une œuvre de métadonnées. @fr
alternative label: note du catalogueur @fr
alternative label: explication d’une relation @fr
toolkit label: note sur une œuvre de métadonnées @fr
toolkit definition: Description non structurée générale d’un ou plusieurs attributs d’une œuvre de métadonnées. @fr
label: piezīme par metadatiem @lv
definition: Sasaista darbu ar plašu nestrukturētu metadatu viena vai vairāku atribūtu aprakstu. @lv
toolkit label: piezīme par metadatiem @lv
toolkit definition: Plašs nestrukturēts metadatu viena vai vairāku atribūtu apraksts. @lv
alternative label: Erläuterung einer Beziehung @de
label: 有关于元数据作品的附注 @zh-hans
definition: 将一种作品与一种元数据作品的一个或多个属性的宽泛的、非结构化的描述关联起来。 @zh-hans
toolkit label: 关于元数据作品的附注 @zh-hans
toolkit definition: 一种元数据作品的一个或多个属性的宽泛的、非结构化的描述 @zh-hans
alternative label: 编目员的附注 @zh-hans
alternative label: 关系的解释 @zh-hans
alternative label: katalogizáló megjegyzése: @hu
alternative label: kapcsolat magyarázata: @hu
has subproperty: P10402
alternative label: katalogcunun notu @tr
toolkit label: Üstveri çalışması hakkında not @tr
toolkit definition: Bir üst veri çalışmasının bir veya daha fazla niteliğinin yapılandırılmamış geniş tanımı. @tr

has note on work
status: Published
type: Property
lexical alias: noteOnWork.en
definition: Relates a work to a broad unstructured description of one or more attributes of a work.
domain: C10001
toolkit label: note on work
toolkit definition: A broad unstructured description of one or more attributes of a work.
has element type: 6
sub property of: P00015
label: huomautus teoksesta @fi
definition: Liittää teoksen teoksen yhden tai useamman attribuutin yleisluonteiseen rakenteistamattomaan kuvailuun. @fi
toolkit label: huomautus teoksesta @fi
toolkit definition: Teoksen yhden tai useamman attribuutin yleisluonteinen rakenteistamaton kuvailu. @fi
label: har note på verk @no
definition: Relaterer et verk til en bred ustrukturert beskrivelse av ett eller flere attributter til et verk. @no
toolkit label: note på verk @no
toolkit definition: En bred ustrukturert beskrivelse av ett eller flere attributter til et verk. @no
label: heeft noot bij werk @nl
definition: Relateert een werk aan een algemene ongestructureerde beschrijving van één of meer attributen van een werk. @nl
toolkit label: noot bij werk @nl
toolkit definition: Een algemene ongestructureerde beschrijving van één of meer attributen van een werk. @nl
label: له تبصرة عن عمل @ar
definition: يربط بين عمل ووصف عام غير محدد لخاصية واحدة أو أكثر من خصائص عمل. @ar
toolkit label: تبصرة عن عمل @ar
toolkit definition: وصف عام غير محدد لخاصية واحدة أو أكثر من خصائص عمل. @ar
label: té com a nota sobre una obra @ca
definition: Relaciona una obra amb una descripció no estructurada àmplia d’un o més atributs d’una obra. @ca
toolkit label: nota sobre una obra @ca
toolkit definition: Descripció no estructurada àmplia d’un o més atributs d’una obra. @ca
label: har note om værk @da
definition: Relaterer et værk til en bred, ustruktureret beskrivelse af en eller flere af et værks attributter. @da
toolkit label: note om værk @da
toolkit definition: Bred, ustruktureret beskrivelse af en eller flere af et værks attributter. @da
label: märkus teose kohta @et
definition: Seostab teose üldise struktureerimata kirjeldusega, mis iseloomustab üht või mitut teose omadust. @et
toolkit label: märkus teose kohta @et
toolkit definition: Üldine struktureerimata kirjeldus, mis iseloomustab üht või mitut teose omadust. @et
label: hat Anmerkung zum Werk @de
definition: Setzt ein Werk in Beziehung zu einer umfassenden, unstrukturierten Beschreibung eines Merkmals oder mehrerer Merkmale eines Werks. @de
toolkit label: Anmerkung zum Werk @de
toolkit definition: Eine umfassende, unstrukturierte Beschreibung eines Merkmals oder mehrerer Merkmale eines Werks. @de
label: műre vonatkozó megjegyzése a következő: @hu
definition: Hozzákapcsol egy művet egy mű egy vagy több ismérvének szabad szöveges, strukturálatlan leírásához. @hu
toolkit label: műre vonatkozó megjegyzése: @hu
toolkit definition: Egy mű egy vagy több ismérvének szabad szöveges, strukturálatlan leírása. @hu
label: ha come nota su opera @it
definition: Correla un’opera a una descrizione non strutturata estesa di uno o più attributi di un’opera. @it
toolkit label: nota su opera @it
toolkit definition: Descrizione non strutturata estesa di uno o più attributi di un’opera. @it
label: a pour note sur une œuvre @fr
definition: Met une œuvre en relation avec une description non structurée générale d’un ou plusieurs attributs d’une œuvre. @fr
toolkit label: note sur une œuvre @fr
toolkit definition: Description non structurée générale d’un ou plusieurs attributs d’une œuvre. @fr
label: piezīme par darbu @lv
definition: Sasaista darbu ar plašu nestrukturētu darba viena vai vairāku atribūtu aprakstu. @lv
toolkit label: piezīme par darbu @lv
toolkit definition: Plašs nestrukturēts darba viena vai vairāku atribūtu apraksts. @lv
label: 有关于作品的附注 @zh-hans
definition: 将一种作品与关于一种作品的一个或多个属性的宽泛的非结构化描述关联起来。 @zh-hans
toolkit label: 关于作品的附注 @zh-hans
toolkit definition: 关于一种作品的一个或多个属性的宽泛的非结构化描述 @zh-hans
has subproperty: has note on metadata work
has subproperty: P10330
label: eser hakkında not ile ilişkilidir @tr
definition: Bir eseri, bir eserin bir veya daha fazla niteliğinin yapılandırılmamış geniş bir tanımıyla ilişkilendirir. @tr
toolkit label: çalışma hakkında not @tr
toolkit definition: Bir eserin bir veya daha fazla niteliğinin yapılandırılmamış geniş tanımı. @tr

is opera adaptation of work
status: Published
definition: Relates a work to a work that is adapted as an opera.
type: Property
sub property of: is adaptation of work
domain: C10001
lexical alias: operaAdaptationOfWork.en
toolkit label: opera adaptation of work
toolkit definition: A work that is adapted as opera.
toolkit label: adaptation à l’opéra d’une œuvre @fr
toolkit definition: Œuvre qui est adaptée à l’opéra. @fr
toolkit label: adaptación a la ópera (obra) @es
toolkit definition: Una obra que ha sido adaptada como ópera. @es
instruction number: 24.5
label: er bearbejdelse af værk til opera @da
definition: Relaterer et værk til et værk, som er bearbejdet til en opera. @da
toolkit label: bearbejdelse af værk til opera @da
toolkit definition: Værk, som er bearbejdet til en opera. @da
definition: Met une œuvre en relation avec une œuvre qui est adaptée à l’opéra. @fr
label: là phỏng theo opera của (tác phẩm) @vi
definition: Liên kết tác phẩm với tác phẩm đã được phỏng theo như là opera. @vi
toolkit label: phỏng theo opera của (tác phẩm) @vi
toolkit definition: Tác phẩm đã được phỏng theo như là opera. @vi
label: ist Opernbearbeitung von (Werk) @de
definition: Setzt ein Werk in Beziehung zu einem Werk, das als Oper bearbeitet ist. @de
toolkit label: Opernbearbeitung von (Werk) @de
toolkit definition: Ein Werk, das als Oper bearbeitet ist. @de
label: est une adaptation à l’opéra d’une œuvre @fr
definition: Liittää teoksen teokseen, joka on sovitettu oopperaksi. @fi
toolkit label: oopperasovitus teoksesta @fi
toolkit definition: Teos, joka on sovitettu oopperaksi. @fi
toolkit label: bearbeidelse av verk til opera @no
toolkit definition: Et verk som er bearbeidet til en opera. @no
label: és adaptació operística d’una obra @ca
definition: Relaciona una obra amb una obra que s’adapta com una òpera. @ca
toolkit label: adaptació operística d’una obra @ca
toolkit definition: Obra que s’adapta com una òpera. @ca
has element type: 2
label: είναι προσαρμογή όπερας του (έργο) @el
definition: Συνδέει ένα έργο με ένα έργο το οποίο έχει προσαρμοστεί ως όπερα. @el
toolkit label: προσαρμογή όπερας του (έργο) @el
toolkit definition: Ένα έργο το οποίο έχει προσαρμοστεί ως όπερα. @el
label: operaadaptációja a következő műnek: @hu
definition: Hozzákapcsol egy művet egy műhöz, amelyet operaként adaptáltak. @hu
toolkit label: operává átdolgozott mű @hu
toolkit definition: Egy mű, amelyet operaként adaptáltak. @hu
label: oopperasovitus teoksesta @fi
label: er bearbeidelse av verk til opera @no
definition: Relaterer et verk til et verk som er bearbeidet til en opera. @no
label: is operabewerking van werk @nl
definition: Relateert een werk aan een werk dat is bewerkt als opera. @nl
toolkit label: operabewerking van werk @nl
toolkit definition: Een werk dat is bewerkt als opera. @nl
label: هو معالجة أوبرالية لعمل @ar
definition: يربط عمل بعمل معالج كأوبرا. @ar
toolkit label: معالجة أوبرالية لعمل @ar
toolkit definition: عمل معالج كأوبرا. @ar
label: ooperiversioon teosest @et
definition: Seostab teose teosega, mis on adapteeritud ooperina. @et
toolkit label: ooperiversioon teosest @et
toolkit definition: Teos, mis on adapteeritud ooperina. @et
label: è adattamento come opera musicale di opera @it
definition: Correla un’opera ca on un’opera adattata come un’opera musicale. @it
toolkit label: adattamento come opera musicale di opera @it
toolkit definition: Opera adattata come un’opera musicale. @it
label: kā opera adaptētais darbs @lv
definition: Sasaista darbu ar darbu, kas ir adaptēts kā opera. @lv
toolkit label: kā opera adaptētais darbs @lv
toolkit definition: Darbs, kas ir adaptēts kā opera. @lv
label: 是作品的歌剧改编 @zh-hans
definition: 将一种作品与被改编为歌剧的一种作品关联起来。 @zh-hans
toolkit label: 作品的歌剧改编 @zh-hans
toolkit definition: 被改编为歌剧的一种作品 @zh-hans
has subproperty: P10234
label: eserin opera uyarlamasıdır @tr
definition: Bir eseri, opera eserine uyarlanan bir eserle ilişkilendirir. @tr
toolkit label: eserin operaya uyarlaması @tr
toolkit definition: Bir opera olarak uyarlanan bir eser. @tr

is adapted as opera work
status: Published
definition: Relates a work to a work that is an opera that is based on another work.
type: Property
domain: C10001
sub property of: is adapted as work
lexical alias: adaptedAsOperaWork.en
toolkit label: adapted as opera work
toolkit definition: A work that is an opera that is based on another work.
toolkit label: adapté en opéra (œuvre) @fr
toolkit definition: Œuvre qui consiste en un opéra basé sur une autre œuvre. @fr
toolkit label: adaptada como ópera (obra) @es
toolkit definition: Una ópera basada en la obra fuente. @es
instruction number: 24.5
label: er bearbejdet til operaværk @da
definition: Relaterer et værk til en opera, baseret på et oprindeligt værk. @da
toolkit label: bearbejdet til operaværk @da
toolkit definition: Opera, baseret på et oprindeligt værk. @da
definition: Met une œuvre en relation avec une œuvre qui consiste en un opéra basé sur une autre œuvre. @fr
label: được phỏng theo như là opera (tác phẩm) @vi
definition: Liên kết tác phẩm với opera dựa trên tác phẩm nguồn. @vi
toolkit label: được phỏng theo như là opera (tác phẩm) @vi
toolkit definition: Opera dựa trên tác phẩm nguồn. @vi
label: ist bearbeitet als Oper (Werk) @de
definition: Setzt ein Werk in Beziehung zu einer Oper (Werk), die auf einem anderen Werk basiert. @de
toolkit label: Bearbeitet als Oper (Werk) @de
toolkit definition: Eine Oper (Werk), die auf einem anderen Werk basiert. @de
label: est adapté en opéra (œuvre) @fr
definition: Liittää teoksen teokseen, joka on ooppera, joka perustuu toiseen teokseen. @fi
toolkit label: oopperasovitus (teos) @fi
toolkit definition: Teos, joka on ooppera, joka perustuu toiseen teokseen. @fi
toolkit label: bearbeidet som opera (verk) @no
toolkit definition: En opera basert på et kildeverk. @no
label: és adaptat com a obra d’òpera @ca
definition: Relaciona una obra amb una obra que és una òpera que es basa en una altra obra. @ca
toolkit label: adaptat com a obra d’òpera @ca
toolkit definition: Obra que és una òpera que es basa en una obra font. @ca
has element type: 2
label: είναι προσαρμοσμένο ως όπερα (έργο) @el
definition: Συνδέει ένα έργο με μια όπερα βασισμένη σε ένα έργο-πηγή. @el
toolkit label: προσαρμοσμένο ως όπερα (έργο) @el
toolkit definition: Μια όπερα βασισμένη σε ένα έργο-πηγή. @el
label: operamű-feldolgozása a következő: @hu
definition: Egy művet hozzákapcsol egy forrásművön alapuló operához. @hu
toolkit label: operamű-átdolgozás @hu
toolkit definition: Egy forrásművön alapuló opera. @hu
label: oopperasovitus (teos) @fi
label: er bearbeidet som opera (verk) @no
definition: Relaterer et verk til en opera basert på et kildeverk. @no
label: is bewerkt als operawerk @nl
definition: Relateert een werk aan een werk dat is een opera dat is gebaseerd op een ander werk. @nl
toolkit label: bewerkt als operawerk @nl
toolkit definition: Een werk dat is een opera dat is gebaseerd op een ander werk. @nl
label: هو معالج كعمل أوبرالي @ar
definition: يربط عمل بعمل عبارة عن أوبرا اعتمدت على عمل آخر. @ar
toolkit label: معالج كعمل أوبرالي @ar
toolkit definition: عمل عبارة عن أوبرا اعتمدت على عمل آخر. @ar
label: adapteeritud ooperina (teos) @et
definition: Seostab teose allikteosel põhineva ooperiga. @et
toolkit label: adapteeritud ooperina (teos) @et
toolkit definition: Allikteosel põhinev ooper. @et
label: è adattata in forma di opera @it
definition: Correla un’opera a un’opera musicale basata su un’opera di partenza. @it
toolkit label: è adattata in forma di opera @it
toolkit definition: Opera musicale basata su un’opera di partenza. @it
label: ir adaptēts kā opera (darbs) @lv
definition: Sasaista darbu ar darbu, kas ir opera veidota pēc pamatdarba. @lv
toolkit label: adaptēts kā darbs: opera @lv
toolkit definition: Opera veidota pēc pamatdarba. @lv
label: 被改编为歌剧作品 @zh-hans
definition: 将一种作品与作为基于另一种作品的一种歌剧的一种作品关联起来。 @zh-hans
toolkit label: 被改编为歌剧作品 @zh-hans
toolkit definition: 作为基于另一种作品的一种歌剧的一种作品 @zh-hans
has subproperty: P10236
label: opera eseri olarak uyarlanmıştır @tr
definition: Bir eseri, başka bir eserden uyarlanan opera eseri olan bir eserle ilişkilendirir. @tr
toolkit label: Opera eseri olarak uyarlanan @tr
toolkit definition: Başka bir esere dayanan opera eseri olan eser. @tr

has opus number
status: Published
type: Property
lexical alias: opusNumber.en
definition: Relates a work to a nomen that is a numeric designation of musical work that is assigned from a list of works of a composer indicating the chronological order of composition.
domain: C10001
toolkit label: opus number
toolkit definition: A nomen that is a numeric designation of musical work that is assigned from a list of works of a composer indicating the chronological order of composition.
sub property of: has numeric designation of musical work
has element type: 3
instruction number: 6.16.1.3.2
label: opusnumero @fi
definition: Liittää teoksen nomeniin, joka on musiikkiteoksen numerointi, joka on annettu säveltäjän teosluettelossa osoittaen sävellyksen aikajärjestyksen. @fi
toolkit label: opusnumero @fi
toolkit definition: Nomen, joka on musiikkiteoksen numerointi, joka on annettu säveltäjän teosluettelossa osoittaen sävellyksen aikajärjestyksen. @fi
label: har opusnummer @no
definition: Relaterer et verk til en numerisk betegnelse på musikalsk verk som er tildelt utfra en liste av verk av en komponist som viser den kronologiske rekkefølgen av komposisjonene. @no
toolkit label: opusnummer @no
toolkit definition: En numerisk betegnelse på musikalsk verk som er tildelt utfra en liste av verk av en komponist som viser den kronologiske rekkefølgen av komposisjonene. @no
label: heeft opusnummer @nl
definition: Relateert een werk aan een nomen dat is een numerieke aanduiding van muziekwerk dat is toegekend uit een lijst van werken van een componist waarmee de chronologische volgorde van compositie wordt aangegeven. @nl
toolkit definition: Een nomen dat is een numerieke aanduiding van muziekwerk dat is toegekend uit een lijst van werken van een componist waarmee de chronologische volgorde van compositie wordt aangegeven. @nl
label: له رقم قطعة موسيقية @ar
definition: يربط بين عمل وتسمية عبارة عن تعيين رقمي لعمل موسيقي محدَد من قائمة أعمال ملحن يشير إلى الترتيب الزمني للتلحين. @ar
toolkit label: رقم قطعة موسيقية @ar
toolkit definition: تسمية عبارة عن تعيين رقمي لعمل موسيقي محدَد من قائمة أعمال ملحن يشير إلى الترتيب الزمني للتلحين. @ar
label: té com a número d’opus @ca
definition: Relaciona una obra amb un nomen que és una designació numèrica d’una obra musical que s’assigna a partir d’una llista d’obres d’un compositor que indica l’ordre cronològic de composició. @ca
toolkit label: número d’opus @ca
toolkit definition: Nomen que és una designació numèrica d’una obra musical que s’assigna a partir d’una llista d’obres d’un compositor que indica l’ordre cronològic de composició. @ca
definition: Relaterer et værk til en numerisk betegnelse på musikværk, tildelt udfra en liste over en komponists værker, som angiver den kronologiske rækkefølge for kompositionen. @da
toolkit definition: Numerisk betegnelse på musikværk, tildelt udfra en liste over en komponists værker, som angiver den kronologiske rækkefølge for kompositionen. @da
label: oopuse number @et
definition: Seostab teose muusikateose numbrilise tähistusega, mis on võetud helilooja teoste nimestikust ja näitab heliteose kronoloogilist järjestust. @et
toolkit label: oopuse number @et
toolkit definition: Muusikateose numbriline tähistus, mis on võetud helilooja teoste nimestikust ja näitab heliteose kronoloogilist järjestust. @et
label: hat Opus-Nummer @de
definition: Setzt ein Werk in Beziehung zu einer numerische Bezeichnung eines Musikwerks, die von einer Komponistin/einem Komponisten oder einem Verlag vergeben wird oder gemäß einem Nachschlagewerk oder Werkverzeichnis verwendet wird. Sie gibt meist Aufschluss über die chronologische Reihenfolge der Komposition innerhalb eines Gesamtwerks. @de
toolkit label: Opus-Nummer @de
toolkit definition: Eine numerische Bezeichnung eines Musikwerks, die von einer Komponistin/einem Komponisten oder einem Verlag vergeben wird oder gemäß einem Nachschlagewerk oder Werkverzeichnis verwendet wird. Sie gibt meist Aufschluss über die chronologische Reihenfolge der Komposition innerhalb eines Gesamtwerks. @de
label: opusszáma a következő: @hu
definition: Hozzákapcsol egy művet egy nomenhez, egy zenemű számjelzéséhez, amelyet egy zeneszerző műveinek a komponálás kronológiai sorrendjét jelölő jegyzékéből rendeltek hozzá. @hu
toolkit label: opusszáma: @hu
toolkit definition: Egy nomen, egy zenemű számjelzése, amelyet egy zeneszerző műveinek a komponálás kronológiai sorrendjét jelölő jegyzékéből rendeltek hozzá. @hu
label: ha come numero di opera @it
definition: Correla un’opera a una designazione numerica di opera musicale assegnata da un elenco di opere di un compositore ordinato secondo l’ordine cronologico di composizione. @it
toolkit label: numero di opera @it
toolkit definition: Designazione numerica di opera musicale assegnata da un elenco di opere di un compositore ordinato secondo l’ordine cronologico di composizione. @it
label: a pour numéro d’opus @fr
definition: Met une œuvre en relation avec un nomen qui est une désignation numérique d’une œuvre musicale attribuée à partir d’une liste des œuvres d’un compositeur indiquant l’ordre chronologique de composition. @fr
toolkit label: numéro d’opus @fr
toolkit definition: Nomen qui est une désignation numérique d’une œuvre musicale attribuée à partir d’une liste des œuvres d’un compositeur indiquant l’ordre chronologique de composition. @fr
label: opusa numurs @lv
definition: Sasaista darbu ar nomenu, kas ir mūzikas darbu numerācijas apzīmējums, ko piešķir komponista darbu sacerēšanas hronoloģiskās secības apzīmēšanai. @lv
toolkit label: opusa numurs @lv
toolkit definition: Mūzikas darbu numerācijas apzīmējums, ko piešķir komponista darbu sacerēšanas hronoloģiskās secības apzīmēšanai. @lv
label: 有作品编号 @zh-hans
definition: 将一种作品与作为根据作曲者作品列表分配、表示作曲时间顺序的音乐作品的一个数字标识的一个命名关联起来。 @zh-hans
toolkit label: 作品编号 @zh-hans
toolkit definition: 作为根据作曲者作品列表分配、表示作曲时间顺序的音乐作品的一个数字标识的一个命名 @zh-hans
has subproperty: P10333
label: opus numarası ile ilişkilidir @tr
definition: Bir eseri, bir bestecinin eserlerinin kronolojik sırasını gösteren bir listeden atanan müzik eserinin sayısal belirteci olan bir isimle ilişkilendirir. @tr
toolkit label: Beste numarası @tr
toolkit definition: Bir bestecinin eserlerinin kronolojik sırasını gösteren bir listeden atanan müzik eserinin sayısal bir tanımı olan bir isim. @tr

is adapted as oratorio work
status: Published
type: Property
lexical alias: adaptedAsOratorioWork.en
definition: Relates a work to a work that is an oratorio that is based on another work.
domain: C10001
toolkit label: adapted as oratorio work
toolkit definition: A work that is an oratorio that is based on another work.
sub property of: is adapted as work
toolkit label: adaptada como oratorio (obra) @es
toolkit definition: Un oratorio basado en la obra fuente. @es
instruction number: 24.5
label: er værk, som er bearbejdet til oratorium @da
definition: Relaterer et værk til et oratorium, baseret på et oprindeligt værk. @da
toolkit label: værk, som er bearbejdet til oratorium @da
toolkit definition: Oratorium, baseret på et oprindeligt værk. @da
label: được phỏng theo như là oratorio (tác phẩm) @vi
definition: Liên kết tác phẩm với oratorio dựa trên tác phẩm nguồn. @vi
toolkit label: được phỏng theo như là oratorio (tác phẩm) @vi
toolkit definition: Oratorio dựa trên tác phẩm nguồn. @vi
label: ist bearbeitet als Oratorium (Werk) @de
definition: Setzt ein Werk in Beziehung zu einem Oratorium (Werk), das auf einem anderen Werk basiert. @de
toolkit label: Bearbeitet als Oratorium (Werk) @de
toolkit definition: Ein Oratorium (Werk), das auf einem anderen Werk basiert. @de
definition: Liittää teoksen teokseen, joka on oratorio, joka perustuu toiseen teokseen. @fi
toolkit label: oratoriosovitus (teos) @fi
toolkit definition: Teos, joka on oratorio, joka perustuu toiseen teokseen. @fi
toolkit label: bearbeidet som oratorium (verk) @no
toolkit definition: Et oratorium basert på et kildeverk. @no
label: és adaptat com a obra d’oratori @ca
definition: Relaciona una obra amb una obra que es un oratori que es basa en una altra obra. @ca
toolkit label: adaptat com a obra d’oratori @ca
toolkit definition: Obra que es un oratori que es basa en una altra obra. @ca
label: est adapté en oratorio (œuvre) @fr
definition: Met une œuvre en relation avec une œuvre qui consiste en un oratorio basé sur une autre œuvre. @fr
toolkit label: adapté en oratorio (œuvre) @fr
toolkit definition: Œuvre qui consiste en un oratorio basé sur une autre œuvre. @fr
has element type: 2
label: είναι προσαρμοσμένο ως ορατόριο (έργο) @el
definition: Συνδέει ένα έργο με ένα ορατόριο βασισμένο σε ένα έργο-πηγή. @el
toolkit label: προσαρμοσμένο ως ορατόριο (έργο) @el
toolkit definition: Ένα ορατόριο βασισμένο σε ένα έργο-πηγή. @el
label: oratóriummű-átdolgozása a következő: @hu
definition: Egy művet hozzákapcsol egy forrásművön alapuló oratóriumhoz. @hu
toolkit label: oratóriummű-átdolgozás @hu
toolkit definition: Egy forrásművön alapuló oratórium. @hu
label: oratoriosovitus (teos) @fi
label: er bearbeidet som oratorium (verk) @no
definition: Relaterer et verk til et oratorium basert på et kildeverk. @no
label: is bewerkt als oratoriumwerk @nl
definition: Relateert een werk aan een werk dat is een oratorium dat gebaseerd is op een ander werk. @nl
toolkit label: bewerkt als oratoriumwerk @nl
toolkit definition: Een werk dat is een oratorium dat gebaseerd is op een ander werk. @nl
label: هو معالج كعمل موسيقى دينية @ar
definition: يربط عمل بعمل عبارة عن موسيقى دينية مبنية على عمل آخر. @ar
toolkit label: معالج كعمل موسيقى دينية @ar
toolkit definition: عمل عبارة عن موسيقى دينية مبنية على عمل آخر. @ar
label: adapteeritud oratooriumina (teos) @et
definition: Seostab teose oratooriumiga, mis põhineb allikteosel. @et
toolkit label: adapteeritud oratooriumina (teos) @et
toolkit definition: Oratoorium, mis põhineb allikteosel. @et
label: è adattata come opera in forma di oratorio @it
definition: Correla un'opera a un oratorio basato su un'opera di partenza. @it
toolkit label: adattato come opera in forma di oratorio @it
toolkit definition: Oratorio basato su un'opera di partenza. @it
label: ir adaptēts kā oratorija (darbs) @lv
definition: Sasaista darbu ar darbu, kas ir oratorija veidota pēc pamatdarba. @lv
toolkit label: adaptēts kā darbs: oratorija @lv
toolkit definition: Oratorija veidota pēc pamatdarba. @lv
label: 被改编为清唱剧作品 @zh-hans
definition: 将一种作品与作为基于另一种作品的一种清唱剧的一种作品关联起来。 @zh-hans
toolkit label: 被改编为清唱剧作品 @zh-hans
toolkit definition: 作为基于另一种作品的一种清唱剧的一种作品 @zh-hans
has subproperty: P10289
label: oratoryo eseri olarak uyarlanmıştır @tr
definition: Bir eseri, başka bir esereden uyarlanan bir oratoryoolan bir eserle ilişkilendirir. @tr
toolkit label: Oratoryo eseri olarak uyarlanan @tr
toolkit definition: Başka bir esere dayanan bir oratoryo eser. @tr

has organizer agent
status: Published
type: Property
lexical alias: organizerAgent.en
definition: Relates a work to an agent who organizes a conference, exhibition, or other event that gives rise to a work.
domain: C10001
toolkit label: organizer agent
toolkit definition: An agent who organizes a conference, exhibition, or other event that gives rise to a work.
toolkit label: agent organisateur @fr
toolkit definition: Agent qui organise un congrès, une exposition ou un autre événement qui donne lieu à la création d’une œuvre. @fr
sub property of: has creator agent of work
toolkit label: organizador @es
toolkit definition: Una persona, familia o entidad corporativa que organiza una exhibición, evento, conferencia, etc., que da origen a una obra. @es
instruction number: 18.5
label: har agent, som er arrangør @da
definition: Relaterer et værk til en agent, som organiserer en konference, udstilling eller anden begivenhed, som giver anledning til et værk. @da
toolkit label: agent, som er arrangør @da
toolkit definition: Agent, som organiserer en konference, udstilling eller anden begivenhed, som giver anledning til et værk. @da
definition: Met une œuvre en relation avec un agent qui organise un congrès, une exposition ou un autre événement qui donne lieu à la création d’une œuvre. @fr
label: có nhà tổ chức @vi
definition: Liên kết tác phẩm với tác nhân tổ chức triển lãm, sự kiện, hội nghị, khoá học, chương trình, v.v... bắt nguồn cho tác phẩm. @vi
toolkit label: nhà tổ chức @vi
toolkit definition: Tác nhân tổ chức triển lãm, sự kiện, hội nghị, khoá học, chương trình, v.v... bắt nguồn cho tác phẩm. @vi
label: hat Veranstalterin/Veranstalter (Akteur) @de
definition: Setzt ein Werk in Beziehung zu einem Akteur, der eine Konferenz, eine Ausstellung oder ein anderes Ereignis organisiert beziehungsweise veranstaltet, aus der/dem ein Werk hervorgeht. @de
toolkit label: Veranstalterin/Veranstalter (Akteur) @de
toolkit definition: Ein Akteur, der eine Konferenz, eine Ausstellung oder ein anderes Ereignis organisiert beziehungsweise veranstaltet, aus der/dem ein Werk hervorgeht. @de
label: a pour agent organisateur @fr
definition: Liittää teoksen toimijaan, joka järjestää konferenssin, näyttelyn tai muun tapahtuman, joka antaa alun teokselle. @fi
toolkit label: järjestäjä (toimija) @fi
toolkit definition: Toimija, joka järjestää konferenssin, näyttelyn tai muun tapahtuman, joka antaa alun teokselle. @fi
toolkit label: arrangør (agent) @no
toolkit definition: En agent som organiserer en konferanse, en utstilling eller et annet arrangement som gir opphav til et verk. @no
label: té com a agent organitzador @ca
definition: Relaciona una obra amb un agent que organitza un congrés, una exposició o qualsevol altre esdeveniment que dona lloc a una obra. @ca
toolkit label: agent organitzador @ca
toolkit definition: Agent que organitza un congrés, una exposició o qualsevol altre esdeveniment que dona lloc a una obra. @ca
has element type: 2
label: έχει οργανωτή @el
definition: Συνδέει ένα έργο με έναν φορέα, ο οποίος οργανώνει μια έκθεση, ένα συμβάν, συνέδριο κ.λπ., εκ των οποίων προέκυψε η ανάγκη για ένα έργο. @el
toolkit label: οργανωτής @el
toolkit definition: Ένας φορέας, ο οποίος οργανώνει μια έκθεση, ένα συμβάν, συνέδριο κ.λπ., εκ των οποίων προέκυψε η ανάγκη για ένα έργο. @el
label: szervező ágense a következő: @hu
definition: Hozzákapcsol egy művet egy ágenshez, amely egy mű létrejöttét eredményező konferenciát, kiállítást vagy egyéb eseményt szervez. @hu
toolkit label: szervező ágens: @hu
toolkit definition: Egy ágens, amely egy mű létrejöttét eredményező konferenciát, kiállítást vagy egyéb eseményt szervez. @hu
alternative label: organizer
alternative label: järjestäjä @fi
label: järjestäjä (toimija) @fi
label: har arrangør (agent) @no
definition: Relaterer et verk til en agent som organiserer en konferanse, en utstilling eller et annet arrangement som gir opphav til et verk. @no
alternative label: arrangør @no
label: heeft organisator-actor @nl
definition: Relateert een werk aan een actor die organiseert een conferentie, tentoonstelling of andere gebeurtenis die aanleiding geeft tot een werk. @nl
toolkit label: organisator-actor @nl
toolkit definition: Een actor die organiseert een conferentie, tentoonstelling of andere gebeurtenis dat aanleiding geeft tot een werk. @nl
label: له وكيل منظم @ar
definition: يربط بين عمل ووكيل ينظم مؤتمرًا، أو معرضًا، أو أي حدث آخر ينتج عنه عمل. @ar
alternative label: منظم @ar
toolkit label: وكيل منظم @ar
toolkit definition: وكيل ينظم مؤتمرًا، أو معرضًا، أو أي حدث آخر ينتج عنه عمل. @ar
alternative label: organitzador @ca
label: korraldaja (tegija) @et
definition: Seostab teose tegijaga, kes korraldab teosele aluse pannud konverentsi, näituse vm ürituse. @et
alternative label: korraldaja @et
toolkit label: korraldaja (tegija) @et
toolkit definition: Tegija, kes korraldab teosele aluse pannud konverentsi, näituse vm ürituse. @et
alternative label: szervező: @hu
label: ha come organizzatore agente @it
definition: Correla un’opera a un agente che organizza una conferenza, una mostra o un altro evento che dà origine a un’opera. @it
alternative label: organizzatore @it
toolkit label: organizzatore agente @it
toolkit definition: Agente che organizza una conferenza, una mostra o un altro evento che dà origine a un’opera. @it
alternative label: organisateur @fr
label: organizētājs (aģents) @lv
definition: Sasaista darbu ar aģentu, kas organizējis konferenci, izstādi vai citu pasākumu. @lv
toolkit label: organizētājs (aģents) @lv
toolkit definition: Aģents, kas organizējis konferenci, izstādi vai citu pasākumu. @lv
alternative label: Veranstalter @de
alternative label: 组织者 @zh-hans
toolkit label: 组织者行为者 @zh-hans

has organizer collective agent
status: Published
lexical alias: organizerCollectiveAgent.en
definition: Relates a work to a collective agent who organizes a conference, exhibition, or other event that gives rise to a work.
toolkit label: organizer collective agent
toolkit definition: A collective agent who organizes a conference, exhibition, or other event that gives rise to a work.
type: Property
domain: C10001
has element type: 2
sub property of: has creator collective agent of work
sub property of: has organizer agent
label: järjestäjä (yhteistoimija) @fi
definition: Liittää teoksen yhteistoimijaan, joka järjestää konferenssin, näyttelyn tai muun tapahtuman, joka antaa alun teokselle. @fi
toolkit label: järjestäjä (yhteistoimija) @fi
toolkit definition: Yhteistoimija, joka järjestää konferenssin, näyttelyn tai muun tapahtuman, joka antaa alun teokselle. @fi
label: har arrangør (kollektiv agent) @no
definition: Relaterer et verk til en kollektiv agent som organiserer en konferanse, en utstilling eller et annet arrangement som gir opphav til et verk. @no
toolkit label: arrangør (kollektiv agent) @no
toolkit definition: En kollektiv agent som organiserer en konferanse, en utstilling eller et annet arrangement som gir opphav til et verk. @no
label: heeft organisator-collectieve actor @nl
definition: Relateert een werk aan een collectieve actor die organiseert een conferentie, tentoonstelling of andere gebeurtenis dat aanleiding geeft tot een werk. @nl
toolkit label: organisator-collectieve actor @nl
toolkit definition: Een collectieve actor die organiseert een conferentie, tentoonstelling of andere gebeurtenis die aanleiding geeft tot een werk. @nl
label: له وكيل جماعي منظِم @ar
definition: يربط بين عمل ووكيل جماعي ينظم مؤتمرًا، أو معرضًا، أو أي حدث آخر ينتج عنه عمل. @ar
toolkit label: وكيل جماعي منظِم @ar
toolkit definition: وكيل جماعي ينظم مؤتمرًا، أو معرضًا، أو أي حدث آخر ينتج عنه عمل. @ar
label: té com a agent col·lectiu organitzador @ca
definition: Relaciona una obra amb un agent col·lectiu que organitza un congrés, una exposició o qualsevol altre esdeveniment que dona lloc a una obra. @ca
toolkit label: agent col·lectiu organitzador @ca
toolkit definition: Agent col·lectiu que organitza un congrés, una exposició o qualsevol altre esdeveniment que dona lloc a una obra. @ca
label: har kollektiv agent, som er arrangør @da
definition: Relaterer et værk til en kollektiv agent, som organiserer en konference, udstilling eller anden begivenhed, som giver anledning til et værk. @da
toolkit label: kollektiv agent, som er arrangør @da
toolkit definition: Kollektiv agent, som organiserer en konference, udstilling eller anden begivenhed, som giver anledning til et værk. @da
label: korraldaja (kollektiiv) @et
definition: Seostab teose kollektiiviga, kes korraldab teosele aluse pannud konverentsi, näituse vm ürituse. @et
toolkit label: korraldaja (kollektiiv) @et
toolkit definition: Kollektiiv, kes korraldab teosele aluse pannud konverentsi, näituse vm ürituse. @et
label: hat Veranstalterin/Veranstalter (Gemeinschaftlicher Akteur) @de
definition: Setzt ein Werk in Beziehung zu einem gemeinschaftlichen Akteur, der eine Konferenz, eine Ausstellung oder ein anderes Ereignis organisiert beziehungsweise veranstaltet, aus der/dem ein Werk hervorgeht. @de
toolkit label: Veranstalterin/Veranstalter (Gemeinschaftlicher Akteur) @de
toolkit definition: Ein gemeinschaftlicher Akteur, der eine Konferenz, eine Ausstellung oder ein anderes Ereignis organisiert beziehungsweise veranstaltet, aus der/dem ein Werk hervorgeht. @de
label: szervező kollektív ágense a következő: @hu
definition: Hozzákapcsol egy művet egy kollektív ágenshez, amely egy mű létrejöttét eredményező konferenciát, kiállítást vagy egyéb eseményt szervez. @hu
toolkit label: szervező kollektív ágens: @hu
toolkit definition: Egy kollektív ágens, amely egy mű létrejöttét eredményező konferenciát, kiállítást vagy egyéb eseményt szervez. @hu
label: ha come organizzatore agente collettivo @it
definition: Correla un'opera a un agente collettivo organizzatore di una conferenza, mostra o altro evento che dà origine a un'opera. @it
toolkit label: organizzatore agente collettivo @it
toolkit definition: Agente collettivo organizzatore di una conferenza, mostra o altro evento, che da origine a un'opera. @it
label: a pour agent collectif organisateur @fr
definition: Met une œuvre en relation avec un agent collectif qui organise un congrès, une exposition ou un autre événement qui donne lieu à la création d’une œuvre. @fr
toolkit label: agent collectif organisateur @fr
toolkit definition: Agent collectif qui organise un congrès, une exposition ou un autre événement qui donne lieu à la création d’une œuvre. @fr
label: organizētājs (grupa) @lv
definition: Sasaista darbu ar grupu, kas organizējusi konferenci, izstādi vai citu pasākumu. @lv
toolkit label: organizētājs (grupa) @lv
toolkit definition: Grupa, kas organizējusi konferenci, izstādi vai citu pasākumu. @lv
label: 有组织者集体行为者 @zh-hans
definition: 将一种作品与组织会议、展览或其他事件以产生一种作品的一个集体行为者关联起来。 @zh-hans
toolkit label: 组织者集体行为者 @zh-hans
toolkit definition: 组织会议、展览或其他事件以产生一种作品的一个集体行为者 @zh-hans
has subproperty: has organizer corporate body
has subproperty: has organizer family
has subproperty: P10504
label: organizatör kolektif temsilcisi ile ilişkilidir @tr
definition: Bir eseri, bir esere yol açan bir konferans, sergi veya başka bir etkinlik düzenleyen kolektif bir temsilci ile ilişkilendirir. @tr
toolkit label: organizatör kolektif temsilcisi @tr
toolkit definition: Bir eserin ortaya çıkmasına sebep olan bir konferans, sergi veya başka bir etkinliği organize eden bir kolektif temsilci. @tr

has organizer corporate body
status: Published
lexical alias: organizerCorporateBody.en
definition: Relates a work to a corporate body who organizes a conference, exhibition, or other event that gives rise to a work.
toolkit label: organizer corporate body
toolkit definition: A corporate body who organizes a conference, exhibition, or other event that gives rise to a work.
type: Property
domain: C10001
has element type: 2
sub property of: has creator corporate body of work
sub property of: has organizer collective agent
label: järjestäjä (yhteisö) @fi
definition: Liittää teoksen yhteisöön, joka järjestää konferenssin, näyttelyn tai muun tapahtuman, joka antaa alun teokselle. @fi
toolkit label: järjestäjä (yhteisö) @fi
toolkit definition: Yhteisö, joka järjestää konferenssin, näyttelyn tai muun tapahtuman, joka antaa alun teokselle. @fi
label: har arrangør (korporasjon) @no
definition: Relaterer et verk til en korporasjon som organiserer en konferanse, en utstilling eller et annet arrangement som gir opphav til et verk. @no
toolkit label: arrangør (korporasjon) @no
toolkit definition: En korporasjon som organiserer en konferanse, en utstilling eller et annet arrangement som gir opphav til et verk. @no
label: heeft organisator-corporatie @nl
definition: Relateert een werk aan een corporatie die organiseert een conferentie, tentoonstelling of andere gebeurtenis dat aanleiding geeft tot een werk. @nl
toolkit label: organisator-corporatie @nl
toolkit definition: Een corporatie die organiseert een conferentie, tentoonstelling of andere gebeurtenis dat aanleiding geeft tot een werk. @nl
label: له هيئة منظِمة @ar
definition: يربط بين عمل وهيئة تنظم مؤتمرًا، أو معرضًا، أو أي حدث آخر ينتج عنه عمل. @ar
toolkit label: هيئة منظِمة @ar
toolkit definition: هيئة تنظم مؤتمرًا، أو معرضًا، أو أي حدث آخر ينتج عنه عمل. @ar
label: té com a entitat corporativa organitzadora @ca
definition: Relaciona una obra amb una entitat corporativa que organitza un congrés, una exposició o qualsevol altre esdeveniment que dona lloc a una obra. @ca
toolkit label: entitat corporativa organitzadora @ca
toolkit definition: Entitat corporativa que organitza un congrés, una exposició o qualsevol altre esdeveniment que dona lloc a una obra. @ca
label: har korporation, som er arrangør @da
definition: Relaterer et værk til en korporation, som organiserer en konference, udstilling eller anden begivenhed, som giver anledning til et værk. @da
toolkit label: korporation, som er arrangør @da
toolkit definition: Korporation, som organiserer en konference, udstilling eller anden begivenhed, som giver anledning til et værk. @da
label: korraldaja (asutus) @et
definition: Seostab teose asutusega, kes korraldab teosele aluse pannud konverentsi, näituse vm ürituse. @et
toolkit label: korraldaja (asutus) @et
toolkit definition: Asutus, kes korraldab teosele aluse pannud konverentsi, näituse vm ürituse. @et
label: hat Veranstalterin/Veranstalter (Körperschaft) @de
definition: Setzt ein Werk in Beziehung zu einer Körperschaft, die eine Konferenz, eine Ausstellung oder ein anderes Ereignis organisiert beziehungsweise veranstaltet, aus der/dem ein Werk hervorgeht. @de
toolkit label: Veranstalterin/Veranstalter (Körperschaft) @de
toolkit definition: Eine Körperschaft, die eine Konferenz, eine Ausstellung oder ein anderes Ereignis organisiert beziehungsweise veranstaltet, aus der/dem ein Werk hervorgeht. @de
label: szervező testülete a következő: @hu
definition: Hozzákapcsol egy művet egy testülethez, amely egy mű létrejöttét eredményező konferenciát, kiállítást vagy egyéb eseményt szervez. @hu
toolkit label: szervező testület: @hu
toolkit definition: Egy testület, amely egy mű létrejöttét eredményező konferenciát, kiállítást vagy egyéb eseményt szervez. @hu
label: ha come organizzatore ente @it
definition: Correla un'opera a un ente organizzatore di una conferenza, mostra o altro evento che dà origine a un'opera. @it
toolkit label: organizzatore ente @it
toolkit definition: Ente organizzatore di una conferenza, mostra o altro evento che dà origine a un'opera. @it
label: a pour collectivité organisatrice @fr
definition: Met une œuvre en relation avec une collectivité qui organise un congrès, une exposition ou un autre événement qui donne lieu à la création d’une œuvre. @fr
toolkit label: collectivité organisatrice @fr
toolkit definition: Collectivité qui organise un congrès, une exposition ou un autre événement qui donne lieu à la création d’une œuvre. @fr
label: organizētājs (institūcija) @lv
definition: Sasaista darbu ar institūciju, kas organizējusi konferenci, izstādi vai citu pasākumu. @lv
toolkit label: organizētājs (institūcija) @lv
toolkit definition: Institūcija, kas organizējusi konferenci, izstādi vai citu pasākumu. @lv
label: 有组织者团体 @zh-hans
definition: 将一种作品与组织会议、展览或其他事件以产生一种作品的一个团体关联起来。 @zh-hans
toolkit label: 组织者团体 @zh-hans
toolkit definition: 组织会议、展览或其他事件以产生一种作品的一个团体 @zh-hans
has subproperty: P10551
label: organizatör tüzel kişisi ile ilişkilidir @tr
definition: Bir eseri, düzenlediği bir konferans, sergi veya etkinlik sonucu bir eser ortaya çıkan tüzel kişi ile ilişkilendirir. @tr
toolkit label: Organizatör kolektif temsilcisi @tr
toolkit definition: Bir esere yol açan bir konferans, sergi veya başka bir etkinlik düzenleyen bir tüzel kişi. @tr

has organizer family
status: Published
lexical alias: organizerFamily.en
definition: Relates a work to a family who organizes a conference, exhibition, or other event that gives rise to a work.
toolkit label: organizer family
toolkit definition: A family who organizes a conference, exhibition, or other event that gives rise to a work.
type: Property
domain: C10001
has element type: 2
sub property of: has creator family of work
sub property of: has organizer collective agent
label: järjestäjä (suku) @fi
definition: Liittää teoksen sukuun, joka järjestää konferenssin, näyttelyn tai muun tapahtuman, joka antaa alun teokselle. @fi
toolkit label: järjestäjä (suku) @fi
toolkit definition: Suku, joka järjestää konferenssin, näyttelyn tai muun tapahtuman, joka antaa alun teokselle. @fi
label: har arrangør (familie) @no
definition: Relaterer et verk til en familie som organiserer en konferanse, en utstilling eller et annet arrangement som gir opphav til et verk. @no
toolkit label: arrangør (familie) @no
toolkit definition: En familie som organiserer en konferanse, en utstilling eller et annet arrangement som gir opphav til et verk. @no
label: heeft organisator-familie @nl
definition: Relateert een werk aan een familie die organiseert een conferentie, tentoonstelling of andere gebeurtenis dat aanleiding geeft tot een werk. @nl
toolkit label: organisator-familie @nl
toolkit definition: Een familie die organiseert een conferentie, tentoonstelling of andere gebeurtenis dat aanleiding geeft tot een werk. @nl
label: له عائلة منظِمة @ar
definition: يربط بين عمل وعائلة تنظم مؤتمرًا، أو معرضًا، أو أي حدث آخر ينتج عنه عمل. @ar
toolkit label: عائلة منظِمة @ar
toolkit definition: عائلة تنظم مؤتمرًا، أو معرضًا، أو أي حدث آخر ينتج عنه عمل. @ar
label: té com a família organitzadora @ca
definition: Relaciona una obra amb una família que organitza un congrés, una exposició o qualsevol altre esdeveniment que dona lloc a una obra. @ca
toolkit label: família organitzadora @ca
toolkit definition: Família que organitza un congrés, una exposició o qualsevol altre esdeveniment que dona lloc a una obra. @ca
label: har familie, som er arrangør @da
definition: Relaterer et værk til en familie, som organiserer en konference, udstilling eller anden begivenhed, som giver anledning til et værk. @da
toolkit label: familie, som er arrangør @da
toolkit definition: Familie, som organiserer en konference, udstilling eller anden begivenhed, som giver anledning til et værk. @da
label: korraldaja (perekond) @et
definition: Seostab teose perekonnaga, kes korraldab teosele aluse pannud konverentsi, näituse vm ürituse. @et
toolkit label: korraldaja (perekond) @et
toolkit definition: Perekond, kes korraldab teosele aluse pannud konverentsi, näituse vm ürituse. @et
label: hat Veranstalterin/Veranstalter (Familie) @de
definition: Setzt ein Werk in Beziehung zu einer Familie, die eine Konferenz, eine Ausstellung oder ein anderes Ereignis organisiert beziehungsweise veranstaltet, aus der/dem ein Werk hervorgeht. @de
toolkit label: Veranstalterin/Veranstalter (Familie) @de
toolkit definition: Eine Familie, die eine Konferenz, eine Ausstellung oder ein anderes Ereignis organisiert beziehungsweise veranstaltet, aus der/dem ein Werk hervorgeht. @de
label: szervező családja a következő: @hu
definition: Hozzákapcsol egy művet egy családhoz, amely egy mű létrejöttét eredményező konferenciát, kiállítást vagy egyéb eseményt szervez. @hu
toolkit label: szervező család: @hu
toolkit definition: Egy család, amely egy mű létrejöttét eredményező konferenciát, kiállítást vagy egyéb eseményt szervez. @hu
label: ha come organizzatore famiglia @it
definition: Correla un'opera alla famiglia organizzatrice di una conferenza, mostra o altro evento che dà origine a un'opera. @it
toolkit label: organizzatore famiglia @it
toolkit definition: Famiglia organizzatrice di una conferenza, mostra o altro evento, che dà origine a un'opera. @it
label: a pour famille organisatrice @fr
definition: Met une œuvre en relation avec une famille qui organise un congrès, une exposition ou un autre événement qui donne lieu à la création d’une œuvre. @fr
toolkit label: famille organisatrice @fr
toolkit definition: Famille qui organise un congrès, une exposition ou un autre événement qui donne lieu à la création d’une œuvre. @fr
label: organizētājs (dzimta/ģimene) @lv
definition: Sasaista darbu ar dzimtu/ģimeni, kas organizējusi konferenci, izstādi vai citu pasākumu. @lv
toolkit label: organizētājs (dzimta/ģimene) @lv
toolkit definition: Dzimta/ģimene, kas organizējusi konferenci, izstādi vai citu pasākumu. @lv
label: 有组织者家族 @zh-hans
definition: 将一种作品与组织会议、展览或其他事件以产生一种作品的一个家族关联起来。 @zh-hans
toolkit label: 组织者家族 @zh-hans
toolkit definition: 组织会议、展览或其他事件以产生一种作品的一个家族 @zh-hans
has subproperty: P10598
label: organizatör ailesi ile ilişkilidir @tr
definition: Bir eseri, düzenlediği bir konferans, sergi veya etkinlik sonucu bir eser ortaya çıkan bir aileyle ilişkilendirir. @tr
toolkit label: Organizatör aile @tr
toolkit definition: Bir eserin ortaya çıkmasına neden olan bir konferans, sergi veya başka bir etkinliği düzenleyen bir aile. @tr

has organizer person
status: Published
lexical alias: organizerPerson.en
definition: Relates a work to a person who organizes a conference, exhibition, or other event that gives rise to a work.
toolkit label: organizer person
toolkit definition: A person who organizes a conference, exhibition, or other event that gives rise to a work.
type: Property
domain: C10001
has element type: 2
sub property of: has creator person of work
sub property of: has organizer agent
label: järjestäjä (henkilö) @fi
definition: Liittää teoksen henkilöön, joka järjestää konferenssin, näyttelyn tai muun tapahtuman, joka antaa alun teokselle. @fi
toolkit label: järjestäjä (henkilö) @fi
toolkit definition: Henkilö, joka järjestää konferenssin, näyttelyn tai muun tapahtuman, joka antaa alun teokselle. @fi
label: har arrangør (person) @no
definition: Relaterer et verk til en person som organiserer en konferanse, en utstilling eller et annet arrangement som gir opphav til et verk. @no
toolkit label: arrangør (person) @no
toolkit definition: En person som organiserer en konferanse, en utstilling eller et annet arrangement som gir opphav til et verk. @no
label: heeft organisator-persoon @nl
definition: Relateert een werk aan een persoon die organiseert een conferentie, tentoonstelling of andere gebeurtenis die aanleiding geeft tot een werk. @nl
toolkit label: organisator-persoon @nl
toolkit definition: Een persoon die organiseert een conferentie, tentoonstelling of andere gebeurtenis die aanleiding geeft tot een werk. @nl
label: له شخص منظِم @ar
definition: يربط بين عمل وشخص ينظم مؤتمرًا، أو معرضًا، أو أي حدث آخر ينتج عنه عمل. @ar
toolkit label: شخص منظِم @ar
toolkit definition: شخص ينظم مؤتمرًا، أو معرضًا، أو أي حدث آخر ينتج عنه عمل. @ar
label: té com a persona organitzadora @ca
definition: Relaciona una obra amb una persona que organitza un congrés, una exposició o qualsevol altre esdeveniment que dona lloc a una obra. @ca
toolkit label: persona organitzadora @ca
toolkit definition: Persona que organitza un congrés, una exposició o qualsevol altre esdeveniment que dona lloc a una obra. @ca
label: har person, som er arrangør @da
definition: Relaterer et værk til en person, som organiserer en konference, udstilling eller anden begivenhed, som giver anledning til et værk. @da
toolkit label: person, som er arrangør @da
toolkit definition: Person, som organiserer en konference, udstilling eller anden begivenhed, som giver anledning til et værk. @da
label: korraldaja (isik) @et
definition: Seostab teose isikuga, kes korraldab teosele aluse pannud konverentsi, näituse vm ürituse. @et
toolkit label: korraldaja (isik) @et
toolkit definition: Isik, kes korraldab teosele aluse pannud konverentsi, näituse vm ürituse. @et
label: hat Veranstalterin/Veranstalter (Person) @de
definition: Setzt ein Werk in Beziehung zu einer Person, die eine Konferenz, eine Ausstellung oder ein anderes Ereignis organisiert beziehungsweise veranstaltet, aus der/dem ein Werk hervorgeht. @de
toolkit label: Veranstalterin/Veranstalter (Person) @de
toolkit definition: Eine Person, die eine Konferenz, eine Ausstellung oder ein anderes Ereignis organisiert beziehungsweise veranstaltet, aus der/dem ein Werk hervorgeht. @de
label: szervező személye a következő: @hu
definition: Hozzákapcsol egy művet egy személyhez, aki egy mű létrejöttét eredményező konferenciát, kiállítást vagy egyéb eseményt szervez. @hu
toolkit label: szervező személy: @hu
toolkit definition: Egy személy, aki egy mű létrejöttét eredményező konferenciát, kiállítást vagy egyéb eseményt szervez. @hu
label: ha come organizzatore persona @it
definition: Correla un'opera a una persona che organizza una conferenza, mostra o altro evento, che dà origine a un'opera. @it
toolkit label: organizzatore persona @it
toolkit definition: Persona che organizza una conferenza, mostra o altro evento che dà origine a un'opera. @it
label: a pour personne organisatrice @fr
definition: Met une œuvre en relation avec une personne qui organise un congrès, une exposition ou un autre événement qui donne lieu à la création d’une œuvre. @fr
toolkit label: personne organisatrice @fr
toolkit definition: Personne qui organise un congrès, une exposition ou un autre événement qui donne lieu à la création d’une œuvre. @fr
label: organizētājs (persona) @lv
definition: Sasaista darbu ar personu, kura organizējusi konferenci, izstādi vai citu pasākumu. @lv
toolkit label: organizētājs (persona) @lv
toolkit definition: Persona, kura organizējusi konferenci, izstādi vai citu pasākumu. @lv
label: 有组织者个人 @zh-hans
definition: 将一种作品与组织会议、展览或其他事件以产生一种作品的一个个人关联起来。 @zh-hans
toolkit label: 组织者个人 @zh-hans
toolkit definition: 组织会议、展览或其他事件以产生一种作品的一个个人 @zh-hans
has subproperty: P10457
label: organizatör kişisi ile ilişkilidir @tr
definition: Bir eseri, eser yol açan bir konferans, sergi veya başka bir etkinlik düzenleyen kişiyle ilişkilendirir. @tr
toolkit label: organizatör kişi @tr
toolkit definition: Bir işe yol açan bir konferans, sergi veya başka bir etkinlik düzenleyen kişi. @tr

is merged to form work
status: Published
definition: Relates a work to a work that is formed from the coming together of two or more works.
type: Property
domain: C10001
sub property of: is succeeded by work
lexical alias: mergedToFormWork.en
toolkit label: merged to form work
toolkit definition: A work that is formed from the coming together of two or more works.
toolkit label: fusionné pour former une œuvre @fr
toolkit definition: Œuvre qui est formée par la combinaison de deux ou plusieurs œuvres. @fr
toolkit label: fusionada para formar (obra) @es
toolkit definition: Una obra formada the unión de dos o más obras. @es
instruction number: 24.5
label: er sammenlagt til værk @da
definition: Relaterer et værk til et værk, som er dannet ved at lægge to eller flere værker sammen. @da
toolkit label: sammenlagt til værk @da
toolkit definition: Værk, som er dannet ved at lægge to eller flere værker sammen. @da
definition: Met une œuvre en relation avec une œuvre qui est formée par la combinaison de deux ou plusieurs œuvres. @fr
label: được hợp lại để tạo thành (tác phẩm) @vi
definition: Liên kết tác phẩm với tác phẩm được hình thành từ ghép lại hai hoặc nhiều hơn tác phẩm. @vi
toolkit label: được hợp lại để tạo thành (tác phẩm) @vi
toolkit definition: Tác phẩm được hình thành từ ghép lại hai hoặc nhiều hơn tác phẩm. @vi
label: ist vereinigt, um ... zu bilden (Werk) @de
definition: Setzt ein Werk in Beziehung zu einem Werk, das durch das Zusammenführen von zwei oder mehreren Werken gebildet wird. @de
toolkit label: Vereinigt, um ... zu bilden (Werk) @de
toolkit definition: Ein Werk, das durch das Zusammenführen von zwei oder mehreren Werken gebildet wird. @de
label: est fusionné pour former une œuvre @fr
definition: Liittää teoksen teokseen, joka on muodostunut kahden tai useamman teoksen yhdistymisestä. @fi
toolkit label: yhdistynyt teokseksi @fi
toolkit definition: Teos, joka on muodostunut kahden tai useamman teoksen yhdistymisestä. @fi
toolkit label: slått sammen til verk @no
toolkit definition: Et verk skapt ved å kombinere to eller flere verk. @no
label: és fusionat per formar una obra @ca
definition: Relaciona una obra amb una obra que està formada per la reunió de dues o més obres. @ca
toolkit label: fusionat per formar una obra @ca
toolkit definition: Obra que està formada per la reunió de dues o més obres. @ca
has element type: 2
label: είναι συγχωνευμένο για να σχηματίσει (έργο) @el
definition: Συνδέει ένα έργο με ένα έργο το οποίο σχηματίζεται από τη συνένωση δύο ή περισσότερων έργων. @el
toolkit label: συγχωνευμένο για να σχηματίσει (έργο) @el
toolkit definition: Ένα έργο το οποίο σχηματίζεται από τη συνένωση δύο ή περισσότερων έργων. @el
label: beleolvadt a következő műbe: @hu
definition: Hozzákapcsol egy művet egy műhöz, amely két vagy több mű egyesüléséből jött létre. @hu
toolkit label: összeolvasztott mű @hu
toolkit definition: Egy mű, amely két vagy több mű egyesüléséből jött létre. @hu
label: yhdistynyt teokseksi @fi
label: er slått sammen til verk @no
definition: Relaterer et verk til et verk skapt ved å kombinere to eller flere verk. @no
label: is samengevoegd om werk te vormen @nl
definition: Relateert een werk aan een werk dat is gevormd door het samenkomen van twee of meer werken. @nl
toolkit label: gefuseerd om werk te vormen @nl
toolkit definition: Een werk dat is gevormd door het samenkomen van twee of meer werken. @nl
label: هو مدمج لتشكيل عمل @ar
definition: يربط عمل بعمل مكون من تجميع لعملين أو أكثر معًا. @ar
toolkit label: مدمج لتشكيل عمل @ar
toolkit definition: عمل مكون من تجميع لعملين أو أكثر معًا. @ar
label: ühendatud teoseks @et
definition: Seostab teose teosega, mis on moodustatud kahe või enama teose kokkupaneku teel. @et
toolkit label: ühendatud teoseks @et
toolkit definition: Teos, mis on moodustatud kahe või enama teose kokkupaneku teel. @et
label: è fusa per formare opera @it
definition: Correla un’opera a un’opera formata dalla fusione di due o più opere. @it
toolkit label: fusa per formare opera @it
toolkit definition: Opera formata dalla fusione di due o più opere. @it
label: ir sapludināts darbā @lv
definition: Sasaista darbu ar darbu, kas izveidots no diviem vai vairākiem darbiem. @lv
toolkit label: sapludināts darbā @lv
toolkit definition: Darbs, kas izveidots no diviem vai vairākiem darbiem. @lv
label: 被合并而形成作品 @zh-hans
definition: 将一种作品与两种或多种作品一起形成的一种作品关联起来。 @zh-hans
toolkit label: 被合并而形成作品 @zh-hans
toolkit definition: 两种或多种作品一起形成的一种作品 @zh-hans
has subproperty: P10212
label: eser olarak birleştirilmiştir @tr
definition: Bir eseri, iki veya daha fazla eserin bir araya gelmesiyle oluşan bir eserle ilişkilendirir. @tr
toolkit label: Birden fazla çalışmanın birleştirilmesi @tr
toolkit definition: İki veya daha fazla çalışmanın bir araya gelmesiyle oluşan bir çalışma. @tr

is part of work
status: Published
definition: Relates a work to a work that has another work as a discrete component.
type: Property
domain: C10001
sub property of: has related work of work
lexical alias: partOfWork.en
toolkit label: part of work
toolkit definition: A work that has another work as a discrete component.
toolkit label: partie d’œuvre de @fr
toolkit definition: Œuvre qui a pour composante distincte une autre œuvre. @fr
toolkit label: contenida en (obra) @es
toolkit definition: Una obra mayor de la cual una parte es un componente separado. @es
instruction number: 24.5
label: er del af værk @da
definition: Relaterer et værk til et værk, som har et andet værk som en separat komponent. @da
toolkit label: del af værk @da
toolkit definition: Værk, som har et andet værk som en separat komponent. @da
definition: Met une œuvre en relation avec une œuvre qui a pour composante distincte une autre œuvre. @fr
label: được chứa trong (tác phẩm) @vi
definition: Liên kết tác phẩm với tác phẩm lớn hơn mà tác phẩm là bộ phận cấu thành tách biệt. @vi
toolkit label: được chứa trong (tác phẩm) @vi
toolkit definition: Tác phẩm lớn hơn mà tác phẩm là bộ phận cấu thành tách biệt. @vi
label: ist Teil von (Werk) @de
definition: Setzt ein Werk in Beziehung zu einem Werk, das ein anderes Werk als einzelnen Bestandteil enthält. @de
toolkit label: Teil von (Werk) @de
toolkit definition: Ein Werk, das ein anderes Werk als einzelnen Bestandteil enthält. @de
label: est une partie d’œuvre de @fr
definition: Liittää teoksen teokseen, jolla on toinen teos itsenäisenä osana. @fi
toolkit label: osa teosta @fi
toolkit definition: Teos, jolla on toinen teos itsenäisenä osana. @fi
toolkit label: del av verk @no
toolkit definition: Et verk som inneholder et annet verk som en avgrenset del. @no
label: és part d’una obra @ca
definition: Relaciona una obra amb una obra que té una altra obra com a component discret. @ca
toolkit label: part d’una obra @ca
toolkit definition: Obra que té una altra obra com a component discret. @ca
has element type: 2
label: περιέχεται σε (έργο) @el
definition: Συνδέει ένα έργο με ένα μεγαλύτερο έργο για το οποίο το έργο συνιστά ένα διακριτό συστατικό. @el
toolkit label: περιέχεται σε (έργο) @el
toolkit definition: Ένα μεγαλύτερο έργο στο οποίο ένα έργο συνιστά ένα διακριτό συστατικό. @el
label: része a következő műnek: @hu
definition: Hozzákapcsol egy művet egy műhöz, amely elkülöníthető alkotóelemként rendelkezik egy másik művel. @hu
toolkit label: befoglaló mű @hu
toolkit definition: Egy mű, amely elkülöníthető alkotóelemként rendelkezik egy másik művel. @hu
alternative label: contained in (work)
scope note: A part work is considered to be essential to the whole work.
scope note: Teoksen osaa pidetään olennaisena koko teokselle. @fi
alternative label: sisältyy teokseen @fi
label: osa teosta @fi
label: er del av verk @no
definition: Relaterer et verk til et verk som inneholder et annet verk som en avgrenset del. @no
scope note: Et delverk er ansett å være viktig for hele verket. @no
label: is deel van werk @nl
definition: Relateert een werk aan een werk dat een ander werk als afzonderlijk onderdeel heeft. @nl
scope note: Een deelwerk wordt beschouwd als essentieel voor het hele werk. @nl
toolkit label: deel van werk @nl
toolkit definition: Een werk dat een ander werk als afzonderlijk onderdeel heeft. @nl
label: هو جزء من عمل @ar
definition: يربط عمل بعمل يحتوي على عمل آخر كمكون منفصل. @ar
scope note: يعد العمل الجزئي ضروريًا للعمل بأكمله. @ar
alternative label: متضمن في (عمل) @ar
toolkit label: جزء من عمل @ar
toolkit definition: عمل له عمل آخر كمكون منفصل. @ar
scope note: Una obra de part es considera essencial per a l’obra completa. @ca
alternative label: contingut en (obra) @ca
scope note: Del af et værk er anset for at være vigtigt for hele værket. @da
alternative label: indholdt i værk @da
label: osa teosest @et
definition: Seostab teose teosega, millesse kuulub iseseisva koostisosana teine teos. @et
scope note: Teose osa peetakse kogu teose suhtes oluliseks. @et
alternative label: sisaldub teoses @et
toolkit label: osa teosest @et
toolkit definition: Teos, millesse kuulub iseseisva koostisosana teine teos. @et
scope note: Ein Teilwerk wird als wesentlich für das Gesamtwerk angesehen. @de
alternative label: Enthalten in (Werk) @de
scope note: A részmű alapvető fontosságú az egész mű szempontjából. @hu
alternative label: tartalmazza a következő (mű): @hu
label: è parte di opera @it

has part work
status: Published
definition: Relates a work to a work that is a discrete component of another work.
type: Property
domain: C10001
sub property of: has related work of work
lexical alias: partWork.en
toolkit label: part work
toolkit definition: A work that is a discrete component of another work.
toolkit label: partie d’œuvre @fr
toolkit definition: Œuvre qui constitue une composante distincte d’une autre œuvre. @fr
toolkit label: incluye (obra) @es
toolkit definition: Una obra que es un componente separado de una obra mayor. @es
instruction number: 24.5
label: har delværk @da
definition: Relaterer et værk til et værk, som er en adskilt komponent af et andet værk. @da
toolkit label: delværk @da
toolkit definition: Værk, som er en adskilt komponent af et andet værk. @da
definition: Met une œuvre en relation avec une œuvre qui constitue une composante distincte d’une autre œuvre. @fr
label: là vỏ chứa của (tác phẩm) @vi
definition: Liên kết tác phẩm với tác phẩm là bộ phận cấu thành tách biệt của tác phẩm lớn hơn. @vi
toolkit label: vỏ chứa của (tác phẩm) @vi
toolkit definition: Tác phẩm là bộ phận cấu thành tách biệt của tác phẩm lớn hơn. @vi
label: hat Teilwerk @de
definition: Setzt ein Werk in Beziehung zu einem Werk, das ein einzelner Bestandteil eines anderen Werks ist. @de
toolkit label: Teilwerk @de
toolkit definition: Ein Werk, das ein einzelner Bestandteil eines anderen Werks ist. @de
label: a pour partie d’œuvre @fr
definition: Liittää teoksen teokseen, joka on itsenäinen osa toista teosta. @fi
toolkit label: teoksen osa @fi
toolkit definition: Teos, joka on itsenäinen osa toista teosta. @fi
toolkit label: del av verk @no
toolkit definition: Et verk som er en avgrenset bestanddel av et annet verk. @no
label: té com a obra de part @ca
definition: Relaciona una obra amb una obra que és un component discret d’una altra obra. @ca
toolkit label: obra de part @ca
toolkit definition: Obra que és un component discret d’una altra obra. @ca
has element type: 2
label: είναι περιέκτης του (έργο) @el
definition: Συνδέει ένα έργο με ένα έργο το οποίο συνιστά διακριτό συστατικό ενός μεγαλύτερου έργου. @el
toolkit label: περιέκτης του (έργο) @el
toolkit definition: Ένα έργο το οποίο συνιστά διακριτό συστατικό ενός μεγαλύτερου έργου. @el
label: részműve a következő: @hu
definition: Hozzákapcsol egy művet egy műhöz, amely egy másik mű elkülöníthető alkotóeleme. @hu
toolkit label: részmű @hu
toolkit definition: Egy mű, amely egy másik mű elkülöníthető alkotóeleme. @hu
alternative label: container of (work)
scope note: A part work is considered to be essential to the whole work.
alternative label: component part
scope note: Teoksen osaa pidetään olennaisena koko teokselle. @fi
label: teoksen osa @fi
label: har del av verk @no
definition: Relaterer et verk til et verk som er en avgrenset bestanddel av et annet verk. @no
alternative label: inneholder verk @no
label: heeft deelwerk @nl
definition: Relateert een werk aan een werk dat een afzonderlijk onderdeel van een ander werk is. @nl
scope note: Een deelwerk wordt beschouwd als essentieel voor het hele werk. @nl
toolkit label: deelwerk @nl
toolkit definition: Een werk dat een afzonderlijk onderdeel van een ander werk is. @nl
label: له عمل جزئي @ar
definition: يربط عمل بعمل عبارة عن مكون منفصل من عمل آخر. @ar
scope note: عمل جزئي يعد ضروريًا للعمل بأكمله. @ar
alternative label: جزء مكون @ar
toolkit label: له عمل جزئي @ar
toolkit definition: عمل عبارة عن مكون منفصل من عمل آخر. @ar
scope note: Una obra de part es considera essencial per a l’obra completa. @ca
scope note: Delværk er anset for at være vigtigt for hele værket. @da
alternative label: container af værk @da
label: teose osa @et
definition: Seostab teose teosega, mis on teise teose iseseisev koostisosa. @et
scope note: Teose osa peetakse kogu teose suhtes oluliseks. @et
alternative label: sisaldab teost @et
toolkit label: teose osa @et
toolkit definition: Teos, mis on teise teose iseseisev koostisosa. @et
scope note: Ein Teilwerk wird als wesentlich für das Gesamtwerk angesehen. @de
alternative label: Bestandteil @de
scope note: alkotórésze: @hu
label: ha come parte opera @it
definition: Correla un'opera a un'opera che è una componente distinta di un’altra opera. @it
scope note: Un'opera parte è considerata essere essenziale per l'opera completa. @it

is critique of item (Deprecated)
type: Property
lexical alias: critiqueOfItem.en
definition: Relates a work to an item used as a basis for a critical evaluation. (Deprecated)
domain: C10001
toolkit label: critique of item (Deprecated)
toolkit definition: An item used as a basis for a critical evaluation. (Deprecated)
toolkit label: critique d’un item @fr
toolkit definition: Item qui sert de base à une évaluation critique. @fr
sub property of: is description of item
toolkit label: crítica de (ítem) @es
toolkit definition: Un ítem usado como base para una evaluación crítica. @es
instruction number: 23.5
label: er kritik af eksemplar @da
definition: Relaterer et værk til et eksemplar, som anvendes som grundlag for en kritisk evaluering. @da
toolkit label: kritik af eksemplar @da
toolkit definition: Eksemplar, som anvendes som grundlag for en kritisk evaluering. @da
definition: Met une œuvre en relation avec un item qui sert de base à une évaluation critique. @fr
label: là phê bình của (bản) @vi
definition: Liên kết tác phẩm với bản được dùng như là cơ sở cho đánh giá phê bình. @vi
toolkit label: phê bình của (bản) @vi
toolkit definition: Bản được dùng như là cơ sở cho đánh giá phê bình. @vi
label: ist Kritik von (Exemplar) @de
definition: Setzt ein Werk in Beziehung zu einem Exemplar, das als Grundlage für eine kritische Untersuchung verwendet wird. @de
toolkit label: Kritik von (Exemplar) @de
toolkit definition: Ein Exemplar, das als Grundlage für eine kritische Untersuchung verwendet wird. @de
label: est une critique d’un item @fr
definition: Liittää teoksen kappaleeseen, johon kriittinen arviointi perustuu. @fi
toolkit label: kritiikki kappaleesta @fi
toolkit definition: Kappale, johon kriittinen arviointi perustuu. @fi
toolkit label: kritikk av eksemplar @no
toolkit definition: Et eksemplar brukt som utgangspunkt for en kritisk evaluering. @no
label: és crítica d’un ítem @ca
definition: Relaciona una obra amb un ítem usat com a base d’una avaluació crítica. @ca
toolkit label: crítica d’un ítem @ca
toolkit definition: Ítem usat com a base d’una avaluació crítica. @ca
has element type: 2
label: είναι κριτική στο (αντίτυπο) @el
definition: Συνδέει ένα έργο με ένα αντίτυπο που χρησιμοποιείται ως η βάση για μια κριτική αξιολόγηση. @el
toolkit label: κριτική στο (αντίτυπο) @el
toolkit definition: Ένα αντίτυπο που χρησιμοποιείται ως η βάση για μια κριτική αξιολόγηση. @el
label: bírálata a következő példánynak: @hu
definition: Hozzákapcsol egy művet egy példányhoz, amelyet egy kritikai kiértékelés alapjaként használnak. @hu
toolkit label: bírált példány @hu
toolkit definition: Egy példány, amelyet egy kritikai kiértékelés alapjaként használnak. @hu
label: kritiikki kappaleesta @fi
label: er kritikk av eksemplar @no
definition: Relaterer et verk til et eksemplar brukt som utgangspunkt for en kritisk evaluering. @no
label: is kritiek van item @nl
definition: Relateert een werk aan een item gebruikt als een basis voor een kritische beschouwing. @nl
toolkit label: kritiek van item @nl
toolkit definition: Een item gebruikt als een basis voor een kritische beschouwing. @nl
label: هو نقد لمفردة @ar
definition: يربط بين عمل ومفردة تستخدم كأساس لتقييم نقدي. @ar
toolkit label: نقد لمفردة @ar
toolkit definition: مفردة تستخدم كأساس لتقييم نقدي. @ar
label: arvustatud eksemplar @et
definition: Seostab teose eksemplariga, mis on aluseks kriitilisele hinnangule. @et
toolkit label: arvustatud eksemplar @et
toolkit definition: Eksemplar, mis on aluseks kriitilisele hinnangule. @et
label: è critica di item @it
definition: Correla un'opera a un item usato come base per una valutazione critica. @it
toolkit label: critica di item @it
toolkit definition: Item usato come base per una valutazione critica. @it
status: Deprecated
label: ir kritika vienībai @lv
definition: Sasaista darbu ar vienību, kas izmantota par pamatu kritikai. @lv
toolkit label: kritika vienībai @lv
toolkit definition: Vienība, kas izmantota par pamatu kritikai. @lv
has subproperty: P10269

is analysis of item
status: Published
type: Property
lexical alias: analysisOfItem.en
definition: Relates a work to an item whose structure is described by a work.
domain: C10001
toolkit label: analysis of item
toolkit definition: An item whose structure is described by a work.
toolkit label: analyse d’un item @fr
toolkit definition: Item dont la structure est décrite par une œuvre. @fr
sub property of: is description of item
toolkit label: análisis de (ítem) @es
toolkit definition: Un ítem que ha sido examinado para identificar sus componentes y sus relaciones. @es
instruction number: 23.5
label: er analyse af eksemplar @da
definition: Relaterer et værk til et eksemplar, hvis struktur er beskrevet af et værk. @da
toolkit label: analyse af eksemplar @da
toolkit definition: Eksemplar, hvis struktur er beskrevet af et værk. @da
definition: Met une œuvre en relation avec un item dont la structure est décrite par une œuvre. @fr
label: là phân tích của (bản) @vi
definition: Liên kết tác phẩm với bản đã được kiểm tra để nhận dạng các thành phần và quan hệ của chúng. @vi
toolkit label: phân tích của (bản) @vi
toolkit definition: Bản đã được kiểm tra để nhận dạng các thành phần và quan hệ của chúng. @vi
label: ist Analyse von (Exemplar) @de
definition: Setzt ein Werk in Beziehung zu einem Exemplar, dessen Struktur von einem Werk beschrieben wird. @de
toolkit label: Analyse von (Exemplar) @de
toolkit definition: Ein Exemplar, dessen Struktur von einem Werk beschrieben wird. @de
label: est une analyse d’un item @fr
definition: Liittää teoksen kappaleeseen, jonka rakennetta teos kuvaa. @fi
toolkit label: analyysi kappaleesta @fi
toolkit definition: Kappale, jonka rakennetta teos kuvaa. @fi
toolkit label: analyse av eksemplar @no
toolkit definition: Et eksemplar som har en struktur som beskrives av et verk. @no
label: és anàlisi d’un ítem @ca
definition: Relaciona una obra amb un ítem l’estructura del qual és descrita per una obra. @ca
toolkit label: anàlisi d’un ítem @ca
toolkit definition: Ítem l’estructura del qual és descrita per una obra. @ca
has element type: 2
label: είναι ανάλυση του (αντίτυπο) @el
definition: Συνδέει ένα έργο με ένα αντίτυπο που έχει εξεταστεί για την ταύτιση των συστατικών του και των σχέσεων τους. @el
toolkit label: ανάλυση του (αντίτυπο) @el
toolkit definition: Ένα αντίτυπο που έχει εξεταστεί για την ταύτιση των συστατικών του και των σχέσεων τους. @el
label: elemzése a következő példánynak: @hu
definition: Hozzákapcsol egy művet egy példányhoz, amelynek alkotóelemeit leírja egy mű. @hu
toolkit label: elemzett példány @hu
toolkit definition: Egy példány, amelynek alkotóelemeit leírja egy mű. @hu
label: analyysi kappaleesta @fi
label: er analyse av eksemplar @no
definition: Relaterer et verk til et eksemplar som har en struktur som beskrives av et verk. @no
label: is analyse van item @nl
definition: Relateert een werk aan een item waarvan de structuur beschreven wordt door een werk. @nl
toolkit label: analyse van item @nl
toolkit definition: Een item waarvan de structuur beschreven wordt door een werk. @nl
label: هو تحليل لمفردة @ar
definition: يربط بين عمل ومفردة يوصف هيكلها في عمل. @ar
toolkit label: تحليل لمفردة @ar
toolkit definition: مفردة يوصف هيكلها في عمل. @ar
label: analüüsitud eksemplar @et
definition: Seostab teose eksemplariga, mille struktuuri on teoses kirjeldatud. @et
toolkit label: analüüsitud eksemplar @et
toolkit definition: Eksemplar, mille struktuuri on teoses kirjeldatud. @et
label: è analisi di item @it
definition: Correla un’opera a un item la cui struttura è descritta da un’opera. @it
toolkit label: analisi di item @it
toolkit definition: Item la cui struttura è descritta da un’opera. @it
label: ir analīze vienībai @lv
definition: Sasaista darbu ar vienību, kas ir pārbaudīta, lai identificētu tās sastāvdaļas un to savstarpējās attiecības. @lv
toolkit label: ir analīze vienībai @lv
toolkit definition: Vienība, kas ir pārbaudīta, lai identificētu tās sastāvdaļas un to savstarpējās attiecības. @lv
label: 是单件的分析 @zh-hans
definition: 将一种作品与其结构被一种作品描述的一个单件关联起来。 @zh-hans
toolkit label: 单件的分析 @zh-hans
toolkit definition: 其结构被一种作品描述的一个单件 @zh-hans
has subproperty: P10266
label: kopyanın analizidir @tr
definition: Bir eseri, yapısının bir eser tarafından tanımlandığı bir kopyayla ilişkilendirir. @tr
toolkit label: kopyanın analizi @tr
toolkit definition: Yapısı bir eser tarafından açıklanan bir kopya. @tr

is evaluation of item (Deprecated)
type: Property
lexical alias: evaluationOfItem.en
definition: Relates a work to an item that is examined or judged. (Deprecated)
domain: C10001
toolkit label: evaluation of item (Deprecated)
toolkit definition: An item that is examined or judged. (Deprecated)
toolkit label: évaluation d’un item @fr
toolkit definition: Item qui est examiné ou jugé. @fr
sub property of: is description of item
toolkit label: evaluación de (ítem) @es
toolkit definition: Un ítem que es examinado o juzgado. @es
instruction number: 23.5
label: er evaluering af eksemplar @da
definition: Relaterer et værk til et eksemplar, som er undersøgt eller bedømt. @da
toolkit label: evaluering af eksemplar @da
toolkit definition: Eksemplar, som er undersøgt eller bedømt. @da
definition: Met une œuvre en relation avec un item qui est examiné ou jugé. @fr
label: là đánh giá của (bản) @vi
definition: Liên kết tác phẩm với bản được kiểm tra hoặc đánh giá. @vi
toolkit label: đánh giá của (bản) @vi
toolkit definition: Bản được kiểm tra hoặc đánh giá. @vi
label: ist Evaluierung von (Exemplar) @de
definition: Setzt ein Werk in Beziehung zu einem Exemplar, das untersucht oder beurteilt wird. @de
toolkit label: Evaluierung von (Exemplar) @de
toolkit definition: Ein Exemplar, das untersucht oder beurteilt wird. @de
label: est une évaluation d’un item @fr
definition: Liittää teoksen kappaleeseen, jota on tutkittu tai arvioitu. @fi
toolkit label: arviointi kappaleesta @fi
toolkit definition: Kappale, jota on tutkittu tai arvioitu. @fi
toolkit label: evaluering av eksemplar @no
toolkit definition: Et eksemplar som utforskes eller vurderes. @no
label: és avaluació d’un ítem @ca
definition: Relaciona una obra amb un ítem que s’examina o es jutja. @ca
toolkit label: avaluació d’un ítem @ca
toolkit definition: Ítem que s’examina o es jutja. @ca
has element type: 2
label: είναι αξιολόγηση του (αντίτυπο) @el
definition: Συνδέει ένα έργο με ένα αντίτυπο που εξετάζεται ή κρίνεται. @el
toolkit label: αξιολόγηση του (αντίτυπο) @el
toolkit definition: Ένα αντίτυπο που εξετάζεται ή κρίνεται. @el
label: kiértékelése a következő példánynak: @hu
definition: Hozzákapcsol egy művet egy példányhoz, amelyet elemeznek és megítélnek. @hu
toolkit label: értékelt példány @hu
toolkit definition: Egy példány, amelyet elemeznek és megítélnek. @hu
label: arviointi kappaleesta @fi
label: er evaluering av eksemplar @no
definition: Relaterer et verk til et eksemplar som utforskes eller vurderes. @no
label: is beschouwing van item @nl
definition: Relateert een werk aan een item dat onderzocht of beoordeeld wordt. @nl
toolkit label: beschouwing van item @nl
toolkit definition: Een item dat onderzocht of beoordeeld wordt. @nl
label: هو تقييم لمفردة @ar
definition: يربط بين عمل ومفردة يتم فحصها أو الحكم عليها. @ar
toolkit label: تقييم لمفردة @ar
toolkit definition: مفردة يتم فحصها أو الحكم عليها. @ar
label: hinnang eksemplarile @et
definition: Seostab teose eksemplariga, mida on kontrollitud või hinnatud. @et
toolkit label: hinnang eksemplarile @et
toolkit definition: Eksemplar, mida on kontrollitud või hinnatud. @et
label: è valutazione di item @it
definition: Correla un’opera a un item che è esaminato o valutato. @it
toolkit label: valutazione di item @it
toolkit definition: Item che è esaminato o valutato. @it
status: Deprecated
label: ir novērtējums vienībai @lv
definition: Sasaista darbu ar vienību, kas ir pārbaudīta vai vērtēta. @lv
toolkit label: ir novērtējums vienībai @lv
toolkit definition: Vienība, kas ir pārbaudīta vai vērtēta. @lv
has subproperty: P10267

is description of item
status: Published
type: Property
lexical alias: descriptionOfItem.en
definition: Relates a work to an item that is described by a work.
domain: C10001
toolkit label: description of item
toolkit definition: An item that is described by a work.
toolkit label: description d’un item @fr
toolkit definition: Item qui est décrit par une œuvre. @fr
sub property of: has subject item
toolkit label: descripción de (ítem) @es
toolkit definition: Un ítem descrito por una obra que describe. @es
instruction number: 23.5
label: er beskrivelse af eksemplar @da
definition: Relaterer et værk til et eksemplar, som er beskrevet af et værk. @da
toolkit label: beskrivelse af eksemplar @da
toolkit definition: Eksemplar, som er beskrevet af et værk. @da
definition: Met une œuvre en relation avec un item qui est décrit par une œuvre. @fr
label: là mô tả của (bản) @vi
definition: Liên kết tác phẩm với bản được mô tả bởi tác phẩm mô tả. @vi
toolkit label: mô tả của (bản) @vi
toolkit definition: Bản được mô tả bởi tác phẩm mô tả. @vi
label: ist Beschreibung von (Exemplar) @de
definition: Setzt ein Werk in Beziehung zu einem Exemplar, das von einem Werk beschrieben wird. @de
toolkit label: Beschreibung von (Exemplar) @de
toolkit definition: Ein Exemplar, das von einem Werk beschrieben wird. @de
label: est une description d’un item @fr
definition: Liittää teoksen kappaleeseen, jota teos kuvaa. @fi
toolkit label: kuvaus kappaleesta @fi
toolkit definition: Kappale, jota teos kuvaa. @fi
toolkit label: beskrivelse av eksemplar @no
toolkit definition: Et eksemplar som beskrives av et verk. @no
label: és descripció d’un ítem @ca
definition: Relaciona una obra amb un ítem que és descrit per una obra. @ca
toolkit label: descripció d’un ítem @ca
toolkit definition: Ítem que és descrit per una obra. @ca
has element type: 2
label: είναι περιγραφή του (αντίτυπο) @el
definition: Συνδέει ένα έργο με ένα αντίτυπο που περιγράφεται σε ένα περιγραφικό έργο. @el
toolkit label: περιγραφή του (αντίτυπο) @el
toolkit definition: Ένα αντίτυπο που περιγράφεται σε ένα περιγραφικό έργο. @el
label: leírása a következő példánynak: @hu
definition: Hozzákapcsol egy művet egy példányhoz, amelyet egy mű leír. @hu
toolkit label: leírt példány: @hu
toolkit definition: Egy példány, amelyet egy mű leír. @hu
sub property of: is description of RDA entity
label: kuvaus kappaleesta @fi
label: er beskrivelse av eksemplar @no
definition: Relaterer et verk til et eksemplar som beskrives av et verk. @no
label: is beschrijving van item @nl
definition: Relateert een werk aan een item dat beschreven wordt door een werk. @nl
toolkit label: beschrijving van item @nl
toolkit definition: Een item dat beschreven wordt door een werk. @nl
label: هو وصف لمفردة @ar
definition: يربط بين عمل ومفردة موصوفة في عمل. @ar
toolkit label: وصف لمفردة @ar
toolkit definition: مفردة موصوفة في عمل. @ar
label: kirjeldatud eksemplar @et
definition: Seostab teose eksemplariga, mida teoses on kirjeldatud. @et
toolkit label: kirjeldatud eksemplar @et
toolkit definition: Eksemplar, mida teoses on kirjeldatud. @et
label: è descrizione di item @it
definition: Correla un’opera a un item che è descritto da un’opera. @it
toolkit label: descrizione di item @it
toolkit definition: Item che è descritto da un’opera. @it
label: ir apraksts vienībai @lv
definition: Sasaista darbu ar vienību, kas ir aprakstīta darbā. @lv
toolkit label: ir apraksts vienībai @lv
toolkit definition: Vienība, kas ir aprakstīta darbā. @lv
label: 是单件的描述 @zh-hans
definition: 将一种作品与被一种作品描述的一个单件关联起来。 @zh-hans
toolkit label: 单件的描述 @zh-hans
toolkit definition: 被一种作品描述的一个单件 @zh-hans
has subproperty: is commentary on item
has subproperty: is critique of item (Deprecated)
has subproperty: is analysis of item
has subproperty: is evaluation of item (Deprecated)
has subproperty: is review of item (Deprecated)
has subproperty: is metadata description of item

is review of item (Deprecated)
type: Property
lexical alias: reviewOfItem.en
definition: Relates a work to an item used as a basis for a brief evaluation. (Deprecated)
domain: C10001
toolkit label: review of item (Deprecated)
toolkit definition: An item used as a basis for a brief evaluation. (Deprecated)
toolkit label: recension d’un item @fr
toolkit definition: Item qui sert de base à une brève évaluation. @fr
sub property of: is description of item
toolkit label: reseña de (ítem) @es
toolkit definition: Un ítem usado como base para una evaluación breve. @es
instruction number: 23.5
label: er anmeldelse af eksemplar @da
definition: Relaterer et værk til et eksemplar, som anvendes som grundlag for en kortfattet evaluering. @da
toolkit label: anmeldelse af eksemplar @da
toolkit definition: Eksemplar, som anvendes som grundlag for en kortfattet evaluering. @da
definition: Met une œuvre en relation avec un item qui sert de base à une brève évaluation. @fr
label: tổng quan của bản @vi
definition: Liên kết tác phẩm với bản được dùng như là cơ sở cho đánh giá ngắn gọn. @vi
toolkit label: tổng quan của bản @vi
toolkit definition: Bản được dùng như là cơ sở cho đánh giá ngắn gọn. @vi
label: ist Rezension von (Exemplar) @de
definition: Setzt ein Werk in Beziehung zu einem Exemplar, das als Grundlage für eine kurze Untersuchung verwendet wird. @de
toolkit label: Rezension von (Exemplar) @de
toolkit definition: Ein Exemplar, das als Grundlage für eine kurze Untersuchung verwendet wird. @de
label: est une recension d’un item @fr
definition: Liittää teoksen lyhyen arvioinnin perustana käytettyyn kappaleeseen. @fi
toolkit label: arvostelu kappaleesta @fi
toolkit definition: Lyhyen arvioinnin perustana käytetty kappale. @fi
toolkit label: anmeldelse av eksemplar @no
toolkit definition: Et eksemplar brukt som utgangspunkt for en kortfattet evaluering. @no
label: és revisió d’un ítem @ca
definition: Relaciona una obra amb un ítem usat com a base d’una avaluació breu. @ca
toolkit label: revisió d’un ítem @ca
toolkit definition: Ítem usat com a base d’una avaluació breu. @ca
has element type: 2
label: είναι εξέταση του (αντίτυπο) @el
definition: Συνδέει ένα έργο με ένα αντίτυπο που χρησιμοποιείται ως η βάση για μια σύντομη αξιολόγηση. @el
toolkit label: εξέταση του (αντίτυπο) @el
toolkit definition: Ένα αντίτυπο που χρησιμοποιείται ως η βάση για μια σύντομη αξιολόγηση. @el
label: szemlézi a következő példányt: @hu
definition: Hozzákapcsol egy művet egy példányhoz, amelyet egy rövid kiértékelés alapjaként használnak. @hu
toolkit label: szemlézett példány @hu
toolkit definition: Egy példány, amelyet egy rövid kiértékelés alapjaként használnak. @hu
label: arvostelu kappaleesta @fi
label: er anmeldelse av eksemplar @no
definition: Relaterer et verk til et eksemplar brukt som utgangspunkt for en kortfattet evaluering. @no
label: is recensie van item @nl
definition: Relateert een werk aan een item gebruikt als een basis voor een korte beschouwing. @nl
toolkit label: recensie van item @nl
toolkit definition: Een item gebruikt als een basis voor een korte beschouwing. @nl
label: هو مراجعة لمفردة @ar
definition: يربط بين عمل ومفردة تستخدم كأساس لتقييم موجز. @ar
toolkit label: مراجعة لمفردة @ar
toolkit definition: مفردة تستخدم كأساس لتقييم موجز. @ar
label: ülevaade eksemplarist @et
definition: Seostab teose eksemplariga, mis on lühihinnangu aluseks. @et
toolkit label: ülevaade eksemplarist @et
toolkit definition: Eksemplar, mis on lühihinnangu aluseks. @et
label: è recensione di item @it
definition: Correla un'opera a un item usato come base per una breve valutazione. @it
toolkit label: recensione di item @it
toolkit definition: Item usato come base per una breve valutazione. @it
status: Deprecated
label: ir recenzija vienībai @lv
definition: Sasaista darbu ar vienību, kas izmantota par pamatu īsam novērtējumam. @lv
toolkit label: recenzija vienībai @lv
toolkit definition: Vienība, kas izmantota par pamatu īsam novērtējumam. @lv
has subproperty: P10268

has photographer agent of work
status: Published
definition: Relates a work to an agent who is responsible for creating a photographic work.
type: Property
domain: C10001
sub property of: has creator agent of work
lexical alias: photographerAgentOfWork.en
toolkit label: photographer agent of work
toolkit definition: An agent who is responsible for creating a photographic work.
toolkit label: agent photographe d’une œuvre @fr
toolkit definition: Agent qui est responsable de la création d’une œuvre photographique. @fr
toolkit label: fotógrafo @es
toolkit definition: Una personal, familia o entidad corporativa responsable de la creación de una obra fotográfica. @es
instruction number: 18.5
label: har agent, som er fotograf af værk @da
definition: Relaterer et værk til en agent, som er ansvarlig for at skabe et fotografisk værk. @da
toolkit label: agent, som er fotograf af værk @da
toolkit definition: Agent, som er ansvarlig for at skabe et fotografisk værk. @da
definition: Met une œuvre en relation avec un agent qui est responsable de la création d’une œuvre photographique. @fr
label: có người chụp ảnh @vi
definition: Liên kết tác phẩm với tác nhân có trách nhiệm tạo lập tác phẩm nhiếp ảnh. @vi
toolkit label: người chụp ảnh @vi
toolkit definition: Tác nhân có trách nhiệm tạo lập tác phẩm nhiếp ảnh. @vi
label: hat Fotografin/Fotografen eines Werks (Akteur) @de
definition: Setzt ein Werk in Beziehung zu einem Akteur, der für die Schaffung eines fotografischen Werks verantwortlich ist. @de
toolkit label: Fotografin/Fotograf eines Werks (Akteur) @de
toolkit definition: Ein Akteur, der für die Schaffung eines fotografischen Werks verantwortlich ist. @de
label: a pour agent photographe d’une œuvre @fr
definition: Liittää teoksen toimijaan, joka on vastuussa valokuvateoksen luomisesta. @fi
toolkit label: teoksen valokuvaaja (toimija) @fi
toolkit definition: Toimija, joka on vastuussa valokuvateoksen luomisesta. @fi
toolkit label: fotograf for verk (agent) @no
toolkit definition: En agent som er ansvarlig for å skape et fotografisk verk. @no
label: té com a agent fotògraf d’una obra @ca
definition: Relaciona una obra amb un agent que és responsable de la creació d’una obra fotogràfica. @ca
toolkit label: agent fotògraf d’una obra @ca
toolkit definition: Agent que és responsable de la creació d’una obra fotogràfica. @ca
has element type: 2
label: έχει φωτογράφο @el
definition: Συνδέει ένα έργο με έναν φορέα υπεύθυνο για τη δημιουργία ενός φωτογραφικού έργου. @el
toolkit label: φωτογράφος @el
toolkit definition: Ένας φορέας υπεύθυνος για τη δημιουργία ενός φωτογραφικού έργου. @el
label: mű fényképész ágense a következő: @hu
definition: Hozzákapcsol egy művet egy ágenshez, amely felelős egy fényképészeti mű megalkotásáért. @hu
toolkit label: mű fényképész ágense: @hu
toolkit definition: Egy ágens, amely felelős egy fényképészeti mű megalkotásáért. @hu
alternative label: photographer
alternative label: teoksen valokuvaaja @fi
label: teoksen valokuvaaja (toimija) @fi
label: har fotograf for verk (agent) @no
definition: Relaterer et verk til en agent som er ansvarlig for å skape et fotografisk verk. @no
alternative label: fotograf for verk @no
label: heeft fotograaf-actor van werk @nl
definition: Relateert een werk aan een actor die verantwoordelijk is voor het creëren van een fotografisch werk. @nl
toolkit label: fotograaf-actor van werk @nl
toolkit definition: Een actor die verantwoordelijk is voor het creëren van een fotografisch werk. @nl
label: له وكيل مصور لعمل @ar
definition: يربط بين عمل ووكيل مسؤول عن إبداع عمل مصور. @ar
alternative label: مصور @ar
toolkit label: وكيل مصور لعمل @ar
toolkit definition: وكيل مسؤول عن إبداع عمل مصور. @ar
alternative label: fotògraf @ca
alternative label: fotograf af værk @da
label: teose fotograaf (tegija) @et
definition: Seostab teose tegijaga, kes vastutab fotograafilise teose loomise eest. @et
alternative label: teose fotograaf @et
toolkit label: teose fotograaf (tegija) @et
toolkit definition: Tegija, kes vastutab fotograafilise teose loomise eest. @et
alternative label: fényképész: @hu
label: ha come fotografo agente di opera @it
definition: Correla un'opera a un agente responsabile della creazione di un'opera fotografica. @it
alternative label: fotografo di opera @it
toolkit label: fotografo agente di opera @it
toolkit definition: Agente responsabile della creazione di un'opera fotografica. @it
alternative label: photographe @fr
label: fotogrāfs (aģents) @lv
definition: Sasaista darbu ar aģentu, kas ir atbildīgs par fotogrāfiska darba izveidi. @lv
toolkit label: fotogrāfs (aģents) @lv
toolkit definition: Aģents, kas ir atbildīgs par fotogrāfiska darba izveidi. @lv
alternative label: Fotograf @de
toolkit label: 作品的摄影者行为者 @zh-hans

has photographer collective agent of work
status: Published
lexical alias: photographerCollectiveAgentOfWork.en
definition: Relates a work to a collective agent who is responsible for creating a photographic work.
toolkit label: photographer collective agent of work
toolkit definition: A collective agent who is responsible for creating a photographic work.
type: Property
domain: C10001
has element type: 2
sub property of: has creator collective agent of work
sub property of: has photographer agent of work
label: teoksen valokuvaaja (yhteistoimija) @fi
definition: Liittää teoksen yhteistoimijaan, joka on vastuussa valokuvateoksen luomisesta. @fi
toolkit label: teoksen valokuvaaja (yhteistoimija) @fi
toolkit definition: Yhteistoimija, joka on vastuussa valokuvateoksen luomisesta. @fi
label: har fotograf for verk (kollektiv agent) @no
definition: Relaterer et verk til en kollektiv agent som er ansvarlig for å skape et fotografisk verk. @no
toolkit label: fotograf for verk (kollektiv agent) @no
toolkit definition: En kollektiv agent som er ansvarlig for å skape et fotografisk verk. @no
label: heeft fotograaf-collectieve actor werk @nl
definition: Relateert een werk aan een collectieve actor die verantwoordelijk is voor het creëren van een fotografisch werk. @nl
toolkit label: fotograaf-collectieve actor werk @nl
toolkit definition: Een collectieve actor die verantwoordelijk is voor het creëren van een fotografisch werk. @nl
label: له وكيل جماعي مصور لعمل @ar
definition: يربط بين عمل ووكيل جماعي مسئول عن إنشاء عمل فوتوغرافي. @ar
toolkit label: وكيل جماعي مصور لعمل @ar
toolkit definition: وكيل جماعي مسئول عن إنشاء عمل فوتوغرافي. @ar
label: té com a agent col·lectiu fotògraf d’una obra @ca
definition: Relaciona una obra amb un agent col·lectiu que és responsable de la creació d’una obra fotogràfica. @ca
toolkit label: agent col·lectiu fotògraf d’una obra @ca
toolkit definition: Agent col·lectiu que és responsable de la creació d’una obra fotogràfica. @ca
label: har kollektiv agent, som er fotograf af værk @da
definition: Relaterer et værk til en kollektiv agent, som er ansvarlig for at skabe et fotografisk værk. @da
toolkit label: kollektiv agent, som er fotograf af værk @da
toolkit definition: Kollektiv agent, som er ansvarlig for at skabe et fotografisk værk. @da
label: teose fotograaf (kollektiiv) @et
definition: Seostab teose kollektiiviga, kes vastutab fotograafilise teose loomise eest. @et
toolkit label: teose fotograaf (kollektiiv) @et
toolkit definition: Kollektiiv, kes vastutab fotograafilise teose loomise eest. @et
label: hat Fotografin/Fotografen eines Werks (Gemeinschaftlicher Akteur) @de
definition: Setzt ein Werk in Beziehung zu einem gemeinschaftlichen Akteur, der für die Schaffung eines fotografischen Werks verantwortlich ist. @de
toolkit label: Fotografin/Fotograf eines Werks (Gemeinschaftlicher Akteur) @de
toolkit definition: Ein gemeinschaftlicher Akteur, der für die Schaffung eines fotografischen Werks verantwortlich ist. @de
label: mű fényképész kollektív ágense a következő: @hu
definition: Hozzákapcsol egy művet egy kollektív ágenshez, amely felelős egy fényképészeti mű létrehozásáért. @hu
toolkit label: mű fényképész kollektív ágense: @hu
toolkit definition: Egy kollektív ágens, amely felelős egy fényképészeti mű létrehozásáért. @hu
label: ha come fotografo agente collettivo di opera @it
definition: Correla un'opera all'agente collettivo responsabile della creazione di un'opera fotografica. @it
toolkit label: fotografo agente collettivo di opera @it
toolkit definition: Agente collettivo responsabile della creazione di un'opera fotografica. @it
label: a pour agent collectif photographe d’une œuvre @fr
definition: Met une œuvre en relation avec un agent collectif qui est responsable de la création d’une œuvre photographique. @fr
toolkit label: agent collectif photographe d’une œuvre @fr
toolkit definition: Agent collectif qui est responsable de la création d’une œuvre photographique. @fr
label: fotogrāfs (grupa) @lv
definition: Sasaista darbu ar grupu, kas ir atbildīga par fotogrāfiska darba izveidi. @lv
toolkit label: fotogrāfs (grupa) @lv
toolkit definition: Grupa, kas ir atbildīga par fotogrāfiska darba izveidi. @lv
label: 有作品的摄影者集体行为者 @zh-hans
definition: 将一种作品与负责创建一种摄影作品的一个集体行为者关联起来。 @zh-hans
toolkit label: 作品的摄影者集体行为者 @zh-hans
toolkit definition: 负责创建一种摄影作品的一个集体行为者 @zh-hans
has subproperty: has photographer corporate body of work
has subproperty: has photographer family of work
has subproperty: P10492
label: eserin fotoğrafçı kolektif temsilcisi ile ilişkilidir @tr
definition: Bir eseri, fotoğrafik bir eser oluşturmaktan sorumlu olan kolektif bir temsilci ile ilişkilendirir. @tr
toolkit label: Eserin fotoğrafçı kolektif temsilcisi @tr
toolkit definition: Fotoğrafik bir eserin oluşturulmasından sorumlu olan kolektif temsilci @tr

has photographer corporate body of work
status: Published
lexical alias: photographerCorporateBodyOfWork.en
definition: Relates a work to a corporate body who is responsible for creating a photographic work.
toolkit label: photographer corporate body of work
toolkit definition: A corporate body who is responsible for creating a photographic work.
type: Property
domain: C10001
has element type: 2
sub property of: has creator corporate body of work
sub property of: has photographer collective agent of work
label: teoksen valokuvaaja (yhteisö) @fi
definition: Liittää teoksen yhteisöön, joka on vastuussa valokuvateoksen luomisesta. @fi
toolkit label: teoksen valokuvaaja (yhteisö) @fi
toolkit definition: Yhteisö, joka on vastuussa valokuvateoksen luomisesta. @fi
label: har fotograf for verk (korporasjon) @no
definition: Relaterer et verk til en korporasjon som er ansvarlig for å skape et fotografisk verk. @no
toolkit label: fotograf for verk (korporasjon) @no
toolkit definition: En korporasjon som er ansvarlig for å skape et fotografisk verk. @no
label: heeft fotograaf-corporatie werk @nl
definition: Relateert een werk aan een corporatie die verantwoordelijk is voor het creëren van een fotografisch werk. @nl
toolkit label: fotograaf-corporatie werk @nl
toolkit definition: Een corporatie die verantwoordelijk is voor het creëren van een fotografisch werk. @nl
label: له هيئة مصورة عمل @ar
definition: يربط بين عمل وهيئة مسئولة عن إنشاء عمل فوتوغرافي. @ar
toolkit label: هيئة مصورة عمل @ar
toolkit definition: هيئة مسئولة عن إنشاء عمل فوتوغرافي. @ar
label: té com a entitat corporativa fotògrafa d’una obra @ca
definition: Relaciona una obra amb una entitat corporativa que és responsable de la creació d’una obra fotogràfica. @ca
toolkit label: entitat corporativa fotògrafa d’una obra @ca
toolkit definition: Entitat corporativa que és responsable de la creació d’una obra fotogràfica. @ca
label: har korporation, som er fotograf af værk @da
definition: Relaterer et værk til en korporation, som er ansvarlig for at skabe et fotografisk værk. @da
toolkit label: korporation, som er fotograf af værk @da
toolkit definition: Korporation, som er ansvarlig for at skabe et fotografisk værk. @da
label: teose fotograaf (asutus) @et
definition: Seostab teose asutusega, kes vastutab fotograafilise teose loomise eest. @et
toolkit label: teose fotograaf (asutus) @et
toolkit definition: Asutus, kes vastutab fotograafilise teose loomise eest. @et
label: hat Fotografin/Fotografen eines Werks (Körperschaft) @de
definition: Setzt ein Werk in Beziehung zu einer Körperschaft, die für die Schaffung eines fotografischen Werks verantwortlich ist. @de
toolkit label: Fotografin/Fotograf eines Werks (Körperschaft) @de
toolkit definition: Eine Körperschaft, die für die Schaffung eines fotografischen Werks verantwortlich ist. @de
label: mű fényképész testülete a következő: @hu
definition: Hozzákapcsol egy művet egy testülethez, amely felelős egy fényképészeti mű létrehozásáért. @hu
toolkit label: mű fényképész testülete: @hu
toolkit definition: Egy testület, amely felelős egy fényképészeti mű létrehozásáért. @hu
label: ha come fotografo ente di opera @it
definition: Correla un'opera a un ente responsabile della creazione di un'opera fotografica. @it
toolkit label: fotografo ente di opera @it
toolkit definition: Ente responsabile della creazione di un'opera fotografica. @it
label: a pour collectivité photographe d’une œuvre @fr
definition: Met une œuvre en relation avec une collectivité qui est responsable de la création d’une œuvre photographique. @fr
toolkit label: collectivité photographe d’une œuvre @fr
toolkit definition: Collectivité qui est responsable de la création d’une œuvre photographique. @fr
label: fotogrāfs (institūcija) @lv
definition: Sasaista darbu ar institūciju, kas ir atbildīga par fotogrāfiska darba izveidi. @lv
toolkit label: fotogrāfs (institūcija) @lv
toolkit definition: Institūcija, kas ir atbildīga par fotogrāfiska darba izveidi. @lv
label: 有作品的摄影者团体 @zh-hans
definition: 将一种作品与负责创建一种摄影作品的一个团体关联起来。 @zh-hans
toolkit label: 作品的摄影者团体 @zh-hans
toolkit definition: 负责创建一种摄影作品的一个团体 @zh-hans
has subproperty: P10539
label: eserin fotoğrafçı tüzel kişisi ile ilişkilidir @tr
definition: Bir eseri, bir fotoğraf eseri oluşturmaktan sorumlu olan tüzel kişi ile ilişkilendirir. @tr
toolkit label: Eserin fotoğrafçı tüzel kişisi @tr
toolkit definition: Bir fotoğrafik eserin oluşturulmasından sorumlu olan bir tüzel kişi. @tr

has photographer family of work
status: Published
lexical alias: photographerFamilyOfWork.en
definition: Relates a work to a family who is responsible for creating a photographic work.
toolkit label: photographer family of work
toolkit definition: A family who is responsible for creating a photographic work.
type: Property
domain: C10001
has element type: 2
sub property of: has creator family of work
sub property of: has photographer collective agent of work
label: teoksen valokuvaaja (suku) @fi
definition: Liittää teoksen sukuun, joka on vastuussa valokuvateoksen luomisesta. @fi
toolkit label: teoksen valokuvaaja (suku) @fi
toolkit definition: Suku, joka on vastuussa valokuvateoksen luomisesta. @fi
label: har fotograf for verk (familie) @no
definition: Relaterer et verk til en familie som er ansvarlig for å skape et fotografisk verk. @no
toolkit label: fotograf for verk (familie) @no
toolkit definition: En familie som er ansvarlig for å skape et fotografisk verk. @no
label: heeft fotograaf-familie werk @nl
definition: Relateert een werk aan een familie die verantwoordelijk is voor het creëren van een fotografisch werk. @nl
toolkit label: fotograaf-familie werk @nl
toolkit definition: Een familie die verantwoordelijk is voor het creëren van een fotografisch werk. @nl
label: له عائلة مصورة لعمل @ar
definition: يربط بين عمل وعائلة مسئولة عن إنشاء عمل فوتوغرافي. @ar
toolkit label: عائلة مصورة لعمل @ar
toolkit definition: عائلة مسئولة عن إنشاء عمل فوتوغرافي. @ar
label: té com a família fotògrafa d’una obra @ca
definition: Relaciona una obra amb una família que és responsable de la creació d’una obra fotogràfica. @ca
toolkit label: família fotògrafa d’una obra @ca
toolkit definition: Família que és responsable de la creació d’una obra fotogràfica. @ca
label: har familie, som er fotograf af værk @da
definition: Relaterer et værk til en familie, som er ansvarlig for at skabe et fotografisk værk. @da
toolkit label: familie, som er fotograf af værk @da
toolkit definition: Familie, som er ansvarlig for at skabe et fotografisk værk. @da
label: teose fotograaf (perekond) @et
definition: Seostab teose perekonnaga, kes vastutab fotograafilise teose loomise eest. @et
toolkit label: teose fotograaf (perekond) @et
toolkit definition: Perekond, kes vastutab fotograafilise teose loomise eest. @et
label: hat Fotografin/Fotografen eines Werks (Familie) @de
definition: Setzt ein Werk in Beziehung zu einer Familie, die für die Schaffung eines fotografischen Werks verantwortlich ist. @de
toolkit label: Fotografin/Fotograf eines Werks (Familie) @de
toolkit definition: Eine Familie, die für die Schaffung eines fotografischen Werks verantwortlich ist. @de
label: mű fényképész családja a következő: @hu
definition: Hozzákapcsol egy művet egy családhoz, amely felelős egy fényképészeti mű létrehozásáért. @hu
toolkit label: mű fényképész családja: @hu
toolkit definition: Egy család, amely felelős egy fényképészeti mű létrehozásáért. @hu
label: ha come fotografo famiglia di opera @it
definition: Correla un'opera alla famiglia responsabile della creazione di un'opera fotografica. @it
toolkit label: fotografo famiglia di opera @it
toolkit definition: Famiglia responsabile della creazione di un'opera fotografica. @it
label: a pour famille photographe d’une œuvre @fr
definition: Met une œuvre en relation avec une famille qui est responsable de la création d’une œuvre photographique. @fr
toolkit label: famille photographe d’une œuvre @fr
toolkit definition: Famille qui est responsable de la création d’une œuvre photographique. @fr
label: fotogrāfs (dzimta/ģimene) @lv
definition: Sasaista darbu ar dzimtu/ģimeni, kas ir atbildīga par fotogrāfiska darba izveidi. @lv
toolkit label: fotogrāfs (dzimta/ģimene) @lv
toolkit definition: Dzimta/ģimene, kas ir atbildīga par fotogrāfiska darba izveidi. @lv
label: 有作品的摄影者家族 @zh-hans
definition: 将一种作品与负责创建一种摄影作品的一个家族关联起来。 @zh-hans
toolkit label: 作品的摄影者家族 @zh-hans
toolkit definition: 负责创建一种摄影作品的一个家族 @zh-hans
has subproperty: P10586
label: eserin fotoğrafçı ailesi ile ilişkilidir @tr
definition: Bir eseri, fbir otoğraf eseri oluşturmaktan sorumlu olan bir aileyle ilişkilendirir. @tr
toolkit label: Eserin fotoğrafçı ailesi @tr
toolkit definition: Bir fotoğrafik eseri oluşturmaktan sorumlu bir aile. @tr

has photographer person of work
status: Published
lexical alias: photographerPersonOfWork.en
definition: Relates a work to a person who is responsible for creating a photographic work.
toolkit label: photographer person of work
toolkit definition: A person who is responsible for creating a photographic work.
type: Property
domain: C10001
has element type: 2
sub property of: has creator person of work
sub property of: has photographer agent of work
label: teoksen valokuvaaja (henkilö) @fi
definition: Liittää teoksen henkilöön, joka on vastuussa valokuvateoksen luomisesta. @fi
toolkit label: teoksen valokuvaaja (henkilö) @fi
toolkit definition: Henkilö, joka on vastuussa valokuvateoksen luomisesta. @fi
label: har fotograf for verk (person) @no
definition: Relaterer et verk til en person som er ansvarlig for å skape et fotografisk verk. @no
toolkit label: fotograf for verk (person) @no
toolkit definition: En person som er ansvarlig for å skape et fotografisk verk. @no
label: heeft fotograaf-persoon werk @nl
definition: Relateert een werk aan een persoon die verantwoordelijk is voor het creëren van een fotografisch werk. @nl
toolkit label: fotograaf-persoon werk @nl
toolkit definition: Een persoon die verantwoordelijk is voor het creëren van een fotografisch werk. @nl
label: له شخص مصور لعمل @ar
definition: يربط بين عمل وشخص مسئول عن إنشاء عمل فوتوغرافي. @ar
toolkit label: شخص مصور لعمل @ar
toolkit definition: شخص يكون مسئولاً عن إنشاء عمل فوتوغرافي. @ar
label: té com a persona fotògrafa d’una obra @ca
definition: Relaciona una obra amb una persona que és responsable de la creació d’una obra fotogràfica. @ca
toolkit label: persona fotògrafa d’una obra @ca
toolkit definition: Persona que és responsable de la creació d’una obra fotogràfica. @ca
label: har person, som er fotograf af værk @da
definition: Relaterer et værk til en person, som er ansvarlig for at skabe et fotografisk værk. @da
toolkit label: person, som er fotograf af værk @da
toolkit definition: Person, som er ansvarlig for at skabe et fotografisk værk. @da
label: teose fotograaf (isik) @et
definition: Seostab teose isikuga, kes vastutab fotograafilise teose loomise eest. @et
toolkit label: teose fotograaf (isik) @et
toolkit definition: Isik, kes vastutab fotograafilise teose loomise eest. @et
label: hat Fotografin/Fotografen eines Werks (Person) @de
definition: Setzt ein Werk in Beziehung zu einer Person, die für die Schaffung eines fotografischen Werks verantwortlich ist. @de
toolkit label: Fotografin/Fotograf eines Werks (Person) @de
toolkit definition: Eine Person, die für die Schaffung eines fotografischen Werks verantwortlich ist. @de
label: mű fényképész személye a következő: @hu
definition: Hozzákapcsol egy művet egy személyhez, aki felelős egy fényképészeti mű létrehozásáért. @hu
toolkit label: mű fényképész személye: @hu
toolkit definition: Egy személy, aki felelős egy fényképészeti mű létrehozásáért. @hu
label: ha come fotografo persona di opera @it
definition: Correla un'opera alla persona responsabile della creazione di un'opera fotografica. @it
toolkit label: fotografo persona di opera @it
toolkit definition: Persona responsabile della creazione di un'opera fotografica. @it
label: a pour personne photographe d’une œuvre @fr
definition: Met une œuvre en relation avec une personne qui est responsable de la création d’une œuvre photographique. @fr
toolkit label: personne photographe d’une œuvre @fr
toolkit definition: Personne qui est responsable de la création d’une œuvre photographique. @fr
label: fotogrāfs (persona) @lv
definition: Sasaista darbu ar personu, kura ir atbildīga par fotogrāfiska darba izveidi. @lv
toolkit label: fotogrāfs (persona) @lv
toolkit definition: Persona, kura ir atbildīga par fotogrāfiska darba izveidi. @lv
label: 有作品的摄影者个人 @zh-hans
definition: 将一种作品与负责创建一种摄影作品的一个个人关联起来。 @zh-hans
toolkit label: 作品的摄影者个人 @zh-hans
toolkit definition: 负责创建一种摄影作品的一个个人 @zh-hans
has subproperty: P10445
label: eserin fotoğrafçı kişisi ile ilişkilidir @tr
definition: Bir eseri, bir fotoğraf eseri yaratmaktan sorumlu olan bir kişiyle ilişkilendirir. @tr
toolkit label: eserin fotoğrafçısı @tr
toolkit definition: Bir fotoğrafik eseri oluşturmaktan sorumlu olan kişi. @tr

has place of capture of representative expression
status: Published
type: Property
lexical alias: placeOfCaptureOfRepresentativeExpression.en
definition: Relates a work to a place that is associated with recording, filming, etc., the content of a representative expression.
domain: C10001
toolkit label: place of capture of representative expression
has element type: 3
toolkit definition: A place that is associated with recording, filming, etc., the content of a representative expression.
sub property of: has related place of work
label: edustavan ekspression tallennuspaikka @fi
definition: Liittää teoksen paikkaan, joka liittyy edustavan ekspression sisällön äänitykseen, kuvaukseen tms. @fi
toolkit label: edustavan ekspression tallennuspaikka @fi
toolkit definition: Paikka, joka liittyy edustavan ekspression sisällön äänitykseen, kuvaukseen tms. @fi
label: har innspillingssted for representativt uttrykk @no
definition: Relaterer et verk til et sted som forbindes med innspilling, opptak, etc. av innholdet i et representativt uttrykk. @no
toolkit label: innspillingssted for representativt uttrykk @no
toolkit definition: Et sted som forbindes med innspilling, opptak, etc. av innholdet i et representativt uttrykk. @no
label: heeft plaats van vastleggen van representatieve expressie @nl
definition: Relateert een werk aan een plaats die geassocieerd is met het opnemen, filmen etc. van de content van een representatieve expressie. @nl
toolkit label: plaats van vastleggen van representatieve expressie @nl
toolkit definition: Een plaats die geassocieerd is met het opnemen, filmen etc. van de content van een representatieve expressie. @nl
label: له مكان التقاط لتعبيرة ممثِلة @ar
definition: يربط بين عمل ومكان مرتبط بتسجيل محتوى تعبيرة ممثِلة، أو تصويره، إلخ. @ar
toolkit label: مكان التقاط لتعبيرة ممثِلة @ar
toolkit definition: مكان مرتبط بتسجيل محتوى تعبيرة ممثِلة، أو تصويره، إلخ. @ar
label: té com a lloc de captura d’una expressió representativa @ca
definition: Relaciona una obra amb un lloc que s’associa amb l’enregistrament, la filmació, etc. del contingut d’una expressió representativa. @ca
toolkit label: lloc de captura d’una expressió representativa @ca
toolkit definition: Lloc que s’associa amb l’enregistrament, la filmació, etc. del contingut d’una expressió representativa. @ca
label: har optagelsessted for repræsentativt udtryk @da
definition: Relaterer et værk til et sted, som er knyttet til optagelse, indspilning etc., af et repræsentativt udtryks indhold. @da
toolkit label: optagelsessted for repræsentativt udtryk @da
toolkit definition: Sted, som er knyttet til optagelse, indspilning etc., af et repræsentativt udtryks indhold. @da
label: iseloomuliku väljenduse jäädvustamise koht @et
definition: Seostab teose kohaga, mis on seotud iseloomuliku väljenduse sisu salvestamise, filmimise vms jäädvustamisega. @et
toolkit label: iseloomuliku väljenduse jäädvustamise koht @et
toolkit definition: Koht, mis on seotud iseloomuliku väljenduse sisu salvestamise, filmimise vms jäädvustamisega. @et
label: hat Aufzeichnungsort einer repräsentativen Expression @de
definition: Setzt ein Werk in Beziehung zu einem Geografikum, das mit der Aufnahme, dem Filmen und so weiter des Inhalts einer repräsentativen Expression in Verbindung steht. @de
toolkit label: Aufzeichnungsort einer repräsentativen Expression @de
toolkit definition: Ein Geografikum, das mit der Aufnahme, dem Filmen und so weiter des Inhalts einer repräsentativen Expression in Verbindung steht. @de
label: reprezentatív kifejezési forma rögzítési helye a következő: @hu
definition: Hozzákapcsol egy művet egy helyhez, amely egy reprezentatív kifejezési forma tartalmának rögzítéséhez, filmezéséhez, stb. kapcsolódik. @hu
toolkit label: reprezentatív kifejezési formához tartozó rögzítési hely @hu
toolkit definition: Egy hely, amely egy reprezentatív kifejezési forma tartalmának rögzítéséhez, filmezéséhez, stb. kapcsolódik. @hu
label: ha come luogo di cattura dell'edizione rappresentativa @it
definition: Correla un’opera a un luogo che è associato con la registrazione, ripresa, etc. del contenuto di una espressione rappresentativa. @it
toolkit label: luogo di cattura dell'espessione rappresentativa @it
toolkit definition: Luogo che è associato con la registrazione, ripresa, etc. del contenuto di una espressione rappresentativa. @it
label: a pour lieu de captation d’une expression représentative @fr
definition: Met une œuvre en relation avec un lieu qui est associé à l’enregistrement, au tournage, etc. du contenu d’une expression représentative. @fr
toolkit label: lieu de captation d’une expression représentative @fr
toolkit definition: Lieu qui est associé à l’enregistrement, au tournage, etc. du contenu d’une expression représentative. @fr
label: reprezentatīvās izteiksmes tveršanas vieta @lv
definition: Sasaista darbu ar vietu, kas saistīta ar reprezentatīvas izteiksmes satura ierakstīšanu, filmēšanu u.tml. @lv
toolkit label: reprezentatīvās izteiksmes tveršanas vieta @lv
toolkit definition: Vieta, kas saistīta ar reprezentatīvas izteiksmes satura ierakstīšanu, filmēšanu u.tml. @lv
label: 有代表性内容表达的摄录地点 @zh-hans
definition: 将一种作品与和一种代表性内容表达的内容的录制、拍摄等有关的一个地点关联起来。 @zh-hans
toolkit label: 代表性内容表达的摄录地点 @zh-hans
toolkit definition: 和一种代表性内容表达的内容的录制、拍摄等有关的一个地点 @zh-hans
has subproperty: P10354
label: temsili anlatımın kayıt yeri ile ilişkilidir @tr
definition: Bir eseri, temsili bir anlatımın içeriği olan kayıt, filme alma vb. ile bağlantılı olan bir yerle ilişkilendirir. @tr
toolkit label: temsili anlatımın çekime alındığı yer @tr
toolkit definition: Temsil edici bir anlatımın içeriğinin kaydedildiği, çekildiği vb. ile bağlantılı olan bir yer. @tr

har sagsøger
status: Deprecated
type: Property
domain: C10001
sub property of: has other agent associated with work (Deprecated)
lexical alias: plaintiff.en
toolkit label: demandeur @fr
toolkit definition: Personne ou collectivité qui intente une poursuite civile. @fr
toolkit label: demandante @es
toolkit definition: Una persona o entidad corporativa que presenta una demanda en un proceso civil. @es
instruction number: 18.5
definition: Relaterer et værk til en person eller korporation, der anlægger en civil sag. @da
toolkit label: sagsøger @da
toolkit definition: Person eller korporation, der anlægger en civil sag. @da
definition: Met une œuvre en relation avec une personne ou une collectivité qui intente une poursuite civile. @fr
label: có nguyên đơn @vi
definition: Liên kết tác phẩm với cá nhân hoặc tập thể đưa ra đơn kiện trong vụ kiện dân sự. @vi
toolkit label: nguyên đơn @vi
toolkit definition: Cá nhân hoặc tập thể đưa ra đơn kiện trong vụ kiện dân sự. @vi
label: hat Zivilkläger @de
definition: Setzt ein Werk mit einer Person oder einer Körperschaft, die eine Klage in ein Zivilverfahren einbringt, in Beziehung. @de
toolkit label: Zivilkläger @de
toolkit definition: Eine Person oder eine Körperschaft, die eine Klage in ein Zivilverfahren einbringt. @de
label: a pour demandeur @fr
label: kantaja @fi
definition: Liittää teoksen henkilöön tai yhteisöön, joka esittää kanteen siviiliprosessissa @fi
toolkit label: kantaja @fi
toolkit definition: Henkilö tai yhteisö, joka esittää kanteen siviiliprosessissa @fi
toolkit label: saksøker @no
toolkit definition: En person eller korporasjon som er saksøker i en sivilrettslig sak. @no
label: té com a demandant @ca
definition: Relaciona una obra amb una persona o entitat corporativa que interposa una demanda civil. @ca
toolkit label: demandant @ca
toolkit definition: Persona o entitat corporativa que interposa una demanda civil. @ca
label: έχει ενάγοντα @el
definition: Συνδέει ένα έργο με ένα φυσικό πρόσωπο ή συλλογικό όργανο, που ασκεί αγωγή στο πλαίσιο αστικής διαδικασίας. @el
toolkit label: ενάγων @el
toolkit definition: Ένα φυσικό πρόσωπο ή συλλογικό όργανο, που ασκεί αγωγή στο πλαίσιο αστικής διαδικασίας. @el

has addenda work
status: Published
definition: Relates a work to a work that consists of brief content that is essential for the completeness of a related work.
type: Property
domain: C10001
sub property of: is augmented by work
lexical alias: addendaWork.en
toolkit label: addenda work
toolkit definition: A work that consists of brief content that is essential for the completeness of a related work.
toolkit label: addenda (œuvre) @fr
toolkit definition: Œuvre qui consiste en un bref contenu essentiel à la complétude d’une œuvre en relation. @fr
toolkit label: adenda (obra) @es
toolkit definition: Una obra que consiste en un material adicional breve, menos extenso que un suplemento, pero que es esencial para la integridad del texto de la obra principal; generalmente se agrega al final del contenido, pero que también puede publicarse en forma separada. @es
instruction number: 24.5
label: har tillægsværk @da
definition: Relaterer et værk til et værk, som består af kortfattet indhold, som er væsentligt for fuldstændigheden af et relateret værk. @da
toolkit label: tillægsværk @da
toolkit definition: Værk, som består af kortfattet indhold, som er væsentligt for fuldstændigheden af et relateret værk. @da
definition: Met une œuvre en relation avec une œuvre qui consiste en un bref contenu essentiel à la complétude d’une œuvre en relation. @fr
label: là phụ lục (tác phẩm) @vi
definition: Liên kết tác phẩm với tác phẩm có chứa nội dung ngắn gọn nhưng cần thiết đối với sự hàn chỉnh của tác phẩm khác. @vi
toolkit label: phụ lục (tác phẩm) @vi
toolkit definition: Tác phẩm có chứa nội dung ngắn gọn nhưng cần thiết đối với sự hàn chỉnh của tác phẩm khác. @vi
label: hat Ergänzung (Werk) @de
definition: Setzt ein Werk in Beziehung zu einem Werk, das aus kurzem Inhalt besteht, der für die Vollständigkeit eines in Beziehung stehenden Werks notwendig ist. @de
toolkit label: Ergänzung (Werk) @de
toolkit definition: Ein Werk, das aus kurzem Inhalt besteht, der für die Vollständigkeit eines in Beziehung stehenden Werks notwendig ist. @de
label: a pour addenda (œuvre) @fr
definition: Liittää teoksen teokseen, joka koostuu suppeasta sisällöstä, joka on olennainen siihen liittyvän teoksen kokonaisuudelle. @fi
toolkit label: lisäykset (teos) @fi
toolkit definition: Teos, joka koostuu suppeasta sisällöstä, joka on olennainen siihen liittyvän teoksen kokonaisuudelle. @fi
toolkit label: tilleggsverk @no
toolkit definition: Et verk som består av kortfattet innhold som er avgjørende for at et annet verk skal være fullstendig. @no
label: té com a obra d’addenda @ca
definition: Relaciona una obra amb una obra que consisteix en un contingut breu que és essencial per a la completesa d’una obra relacionada. @ca
toolkit label: obra d’addenda @ca
toolkit definition: Obra que consisteix en un contingut breu que és essencial per a la completesa d’una obra relacionada. @ca
has element type: 2
label: είναι προσθήκες (έργο) @el
definition: Συνδέει ένα έργο με ένα έργο, το οποίο συνίσταται από ένα σύντομο περιεχόμενο που είναι ουσιώδες για την πληρότητα ενός άλλου έργου. @el
toolkit label: προσθήκες (έργο) @el
toolkit definition: Ένα έργο, το οποίο συνίσταται από ένα σύντομο περιεχόμενο που είναι ουσιώδες για την πληρότητα ενός άλλου έργου. @el
label: pótlás-műve a következő: @hu
definition: Hozzákapcsol egy művet egy rövid tartalomból álló műhöz, amely nélkülözhetetlen egy kapcsolódó mű teljességéhez. @hu
toolkit label: pótlásmű @hu
toolkit definition: Egy rövid tartalomból álló mű, amely nélkülözhetetlen egy kapcsolódó mű teljességéhez. @hu
label: lisäykset (teos) @fi
label: har tilleggsverk @no
definition: Relaterer et verk til et verk som består av kortfattet innhold som er avgjørende for at et annet verk skal være fullstendig. @no
label: heeft toevoegingen-werk @nl
definition: Relateert een werk aan een werk dat bestaat uit korte content die essentieel is voor de compleetheid van een gerelateerd werk. @nl
toolkit label: toevoegingen-werk @nl
toolkit definition: Een werk dat bestaat uit korte content die essentieel is voor de compleetheid van een gerelateerd werk. @nl
label: له عمل إضافات @ar
definition: يربط عمل بعمل يتكون من محتوى موجز ويعَد ضروريًا لاستكمال عمل ذي صلة. @ar
toolkit label: عمل إضافات @ar
toolkit definition: عمل يتكون من محتوى موجز ويعَد ضروريًا لاستكمال عمل ذي صلة. @ar
label: lisa (teos) @et
definition: Seostab teose teosega, mille sisu on lühike, kuid hädavajalik seotud teose terviklikkuse seisukohast. @et
toolkit label: lisa (teos) @et
toolkit definition: Teos, mille sisu on lühike, kuid hädavajalik seotud teose terviklikkuse seisukohast. @et
label: ha come addenda opera @it
definition: Correla un’opera a un’opera che consiste di contenuto breve essenziale a completamento di un’opera correlata. @it
toolkit label: addenda opera @it
toolkit definition: Opera che consiste di contenuto breve essenziale a completamento di un’opera correlata. @it
label: darbs: saturisks pielikums @lv
definition: Sasaista darbu ar darbu - īss saturs, kas ir būtisks saistītā darba pilnīgumam. @lv
toolkit label: darbs: saturisks pielikums @lv
toolkit definition: Darbs - īss saturs, kas ir būtisks saistītā darba pilnīgumam. @lv
label: 有补遗作品 @zh-hans
definition: 将一种作品与由简要内容组成并对一种相关作品的完整性必不可少的一种作品关联起来。 @zh-hans
toolkit label: 补遗作品 @zh-hans
toolkit definition: 由简要内容组成并对一种相关作品的完整性必不可少的一种作品 @zh-hans
has subproperty: P10112
label: ek eser ile ilişkilidir @tr
definition: Bir eseri, ilgili eserin bütünlüğü için gerekli olan kısa içerikten oluşan bir eserle ilişkilendirir. @tr
toolkit label: Ek çalışma @tr
toolkit definition: İlgili bir eserin tamamlayıcılığı için gerekli olan kısa içerikten oluşan bir eser. @tr

has prequel work
status: Published
definition: Relates a work to a work that extends the narrative of another work backwards in time.
type: Property
domain: C10001
sub property of: has related work of work
lexical alias: prequelWork.en
toolkit label: prequel work
toolkit definition: A work that extends the narrative of another work backwards in time.
toolkit label: antépisode (œuvre) @fr
toolkit definition: Œuvre qui prolonge le récit d’une autre œuvre sur une période plus ancienne dans le temps. @fr
toolkit label: precuela @es
toolkit definition: Una obra que extiende la narración de una obra anterior hacia atrás en el tiempo. @es
instruction number: 24.5
label: har værk, som er forløber @da
definition: Relaterer et værk til et værk, som forlænger et andet værks fortælling tilbage i tid. @da
toolkit label: værk, som er forløber @da
toolkit definition: Værk, som forlænger et andet værks fortælling tilbage i tid. @da
definition: Met une œuvre en relation avec une œuvre qui prolonge le récit d’une autre œuvre sur une période plus ancienne dans le temps. @fr
label: là tác phẩm mở rộng @vi
definition: Liên kết tác phẩm với tác phẩm mở rộng câu chuyện kể của tác phẩm trước đây theo ngược thời gian. @vi
toolkit label: tác phẩm mở rộng @vi
toolkit definition: Tác phẩm mở rộng câu chuyện kể của tác phẩm trước đây theo ngược thời gian. @vi
label: hat Prequel (Werk) @de
definition: Setzt ein Werk in Beziehung zu einem Werk, das den Erzählstrang eines anderen Werks zeitlich rückwärts erweitert. @de
toolkit label: Prequel (Werk) @de
toolkit definition: Ein Werk, das den Erzählstrang eines anderen Werks zeitlich rückwärts erweitert. @de
label: a pour antépisode (œuvre) @fr
definition: Liittää teoksen teokseen, joka laajentaa toisen teoksen kerrontaa ajassa taaksepäin. @fi
toolkit label: esiosa (teos) @fi
toolkit definition: Teos, joka laajentaa toisen teoksen kerrontaa ajassa taaksepäin. @fi
toolkit label: forløper (verk) @no
toolkit definition: Et verk som fortsetter historien fra et annet verk bakover i tid. @no
label: té com a obra de preqüela @ca
definition: Relaciona una obra amb una obra que amplia la narrativa d’una altra obra cap enrere en el temps. @ca
toolkit label: obra de preqüela @ca
toolkit definition: Obra que amplia la narrativa d’una altra obra cap enrere en el temps. @ca
has element type: 2
label: είναι προοίμιο @el
definition: Συνδέει ένα έργο με ένα έργο το οποίο επεκτείνει την αφήγηση ενός προηγούμενου έργου προς τα πίσω στον χρόνο. @el
toolkit label: προοίμιο @el
toolkit definition: Ένα έργο το οποίο επεκτείνει την αφήγηση ενός προηγούμενου έργου προς τα πίσω στον χρόνο. @el
label: előzményműve a következő: @hu
definition: Hozzákapcsol egy művet egy műhöz, amely időben visszafelé terjeszti ki egy másik mű narratíváját. @hu
toolkit label: előzménymű @hu
toolkit definition: Egy mű, amely időben visszafelé terjeszti ki egy másik mű narratíváját. @hu
alternative label: sequel to
label: esiosa (teos) @fi
label: har forløper (verk) @no
definition: Relaterer et verk til et verk som fortsetter historien fra et annet verk bakover i tid. @no
alternative label: etterfølger til @no
label: heeft prequel-werk @nl
definition: Relateert een werk aan een werk dat de narratie van een ander werk uitbreidt, achterwaarts in de tijd. @nl
toolkit label: prequel-werk @nl
toolkit definition: Een werk dat de narratie van een ander werk uitbreidt, achterwaarts in de tijd. @nl
label: له عمل بادئة @ar
definition: يربط عمل بعمل يمتد من خلاله سرد عمل آخر إلى الوراء عبر الزمن. @ar
alternative label: تتمة @ar
toolkit label: عمل بادئة @ar
toolkit definition: عمل يمتد من خلاله سرد عمل آخر إلى الوراء عبر الزمن. @ar
alternative label: efterfølger til @da
label: järg teosele @et
definition: Seostab teose teosega, mis laiendab teise teose sündmuste esitust ajas tagasi. @et
toolkit label: järg teosele @et
toolkit definition: Teos, mis laiendab teise teose sündmuste esitust ajas tagasi. @et
alternative label: folytatása: @hu
label: ha come opera precedente @it
definition: Correla un’opera a un’opera che amplia la narrazione di un’altra opera tornando indietro nel tempo. @it
alternative label: sequel di @it
toolkit label: opera precedente @it
toolkit definition: Opera che amplia la narrazione di un’altra opera tornando indietro nel tempo. @it
alternative label: prequel
label: darbs: pirmsstāsts @lv
definition: Sasaista darbu ar darbu (prīkvels), kura sižets risinās pirms sākotnējā darba notikumu laika. @lv
toolkit label: darbs: pirmsstāsts @lv
toolkit definition: Darbs (prīkvels), kura sižets risinās pirms sākotnējā darba notikumu laika. @lv
alternative label: Sequel @de
label: 有前篇作品 @zh-hans
definition: 将一种作品与把另一种作品的叙述在时间上往回延伸的一种作品关联起来。 @zh-hans
toolkit label: 前篇作品 @zh-hans

has producer agent
status: Published
definition: Relates a work to an agent responsible for most of the business aspects of a production for screen, sound recording, television, webcast, etc.
type: Property
scope note: A producer is generally responsible for fundraising, managing the production, hiring key personnel, arranging for distributors, etc.
domain: C10001
sub property of: has creator agent of work
lexical alias: producerAgent.en
toolkit label: producer agent
toolkit definition: An agent who is responsible for most of the business aspects of a production for screen, sound recording, television, webcast, etc.
toolkit label: agent producteur @fr
toolkit definition: Agent qui est responsable de la majeure partie des aspects commerciaux de la production d’un film, d’un enregistrement audio, d’une émission de télévision, d’une webémission, etc. @fr
toolkit label: productor @es
toolkit definition: Una persona, familia o entidad corporativa responsable de la mayor parte de los aspectos empresariales de la producción cinematográfica, grabación sonora, televisión, emisión web, etc. @es
instruction number: 18.5
label: har agent, som er producer @da
definition: Relaterer et værk til en agent, som er ansvarlig for størstedelen af de forretningsmæssige aspekter ved en produktion beregnet til lærred, lydoptagelse, tv, webcast etc. @da
scope note: Produceren er almindeligvis ansvarlig for finansiering, produktionsledelse, ansættelse af nøglepersonale, at finde distributører etc. @da
toolkit label: agent, som er producer @da
toolkit definition: Agent, som er ansvarlig for størstedelen af de forretningsmæssige aspekter ved en produktion beregnet til lærred, lydoptagelse, tv, webcast etc. @da
definition: Met une œuvre en relation avec un agent qui est responsable de la majeure partie des aspects commerciaux de la production d’un film, d’un enregistrement audio, d’une émission de télévision, d’une webémission, etc. @fr
label: có nhà sản xuất @vi
definition: Liên kết tác phẩm với tác nhân có trách nhiệm về phần lớn khía cạnh kinh doanh của sản phẩm màn ảnh, ghi âm, truyền hình, web, v.v... @vi
scope note: Nhà sản xuất có trách nhiệm tổng quát về nguồn tài chính, quản lý sản xuất, thuê mướn nhân sự chủ yếu, dắp xếp về nhà phân phppos, v.v... @vi
toolkit label: nhà sản xuất @vi
toolkit definition: Tác nhân có trách nhiệm về phần lớn khía cạnh kinh doanh của sản phẩm màn ảnh, ghi âm, truyền hình, web, v.v... @vi
label: hat Produzentin/Produzenten (Akteur) @de
definition: Setzt ein Werk in Beziehung zu einem Akteur, der für die meisten geschäftlichen Aspekte einer Produktion für die Leinwand, für eine Tonaufnahme, für das Fernsehen, für einen Webcast und so weiter verantwortlich ist. @de
scope note: Eine Produzentin/Ein Produzent ist im Allgemeinen für die Geldbeschaffung, das Produktionsmanagement, das Einstellen von wichtigem Personal, die Organisation des Vertriebs und so weiter verantwortlich. @de
toolkit label: Produzentin/Produzent (Akteur) @de
toolkit definition: Ein Akteur, der für die meisten geschäftlichen Aspekte einer Produktion für die Leinwand, für eine Tonaufnahme, für das Fernsehen, für einen Webcast und so weiter verantwortlich ist. @de
label: a pour agent producteur @fr
definition: Liittää teoksen toimijaan, joka vastaa suurimmasta osasta elokuva-, äänite-, televisio-, suoratoisto- tms. tuotannon liiketoiminnallisista tehtävistä. @fi
toolkit label: tuottaja (toimija) @fi
toolkit definition: Toimija, joka vastaa suurimmasta osasta elokuva-, äänite-, televisio-, suoratoisto- tms. tuotannon liiketoiminnallisista tehtävistä. @fi
toolkit label: produsent (agent) @no
toolkit definition: En agent som er ansvarlig for de fleste forretningsmessige aspektene ved en produksjon for film eller fjernsyn, lydinnspilling, webcast, etc. @no
label: té com a agent productor @ca
definition: Relaciona una obra amb un agent que és responsable de la majoria dels aspectes comercials d’una producció d’una pel·lícula, d’un enregistrament sonor, un programa de televisió, d’una emissió web, etc. @ca
scope note: En general, un productor és responsable d’assegurar el finançament, de gestionar la producció, de contractar el personal clau, d’organitzar la distribució, etc. @ca
toolkit label: agent productor @ca
toolkit definition: Agent que és responsable de la majoria dels aspectes comercials d’una producció d’una pel·lícula, d’un enregistrament sonor, d’un programa de televisió, d’una emissió web, etc. @ca
scope note: Un producteur est généralement responsable d’assurer le financement, de gérer la production, de recruter le personnel clé, d’organiser la distribution, etc. @fr
has element type: 2
label: έχει παραγωγό @el
definition: Συνδέει ένα έργο με έναν φορέα υπεύθυνο για τις περισσότερες επιχειρηματικές πτυχές μιας παραγωγής επί της οθόνης, ηχογράφησης, τηλεοπτικής, διαδικτυακής εκπομπής κ.λπ. @el
scope note: Ένας παραγωγός είναι γενικά υπεύθυνος για τη συγκέντρωση πόρων/χρηματοδότησης, τη διεύθυνση της παραγωγής, την πρόσληψη του βασικού προσωπικού, την οργάνωση της διανομής κ.λπ. @el
toolkit label: παραγωγός @el
toolkit definition: Ένας φορέας υπεύθυνος για τις περισσότερες επιχειρηματικές πτυχές μιας παραγωγής επί της οθόνης, ηχογράφησης, τηλεοπτικής, διαδικτυακής εκπομπής κ.λπ. @el
label: producer ágense a következő: @hu
definition: Hozzákapcsol egy művet egy ágenshez, amely felelős egy képernyőre kerülő műsor, hangfelvétel, televíziós, webes közvetítés stb. legtöbb üzleti vonatkozásáért. @hu
scope note: producer ágens. @hu
toolkit label: Egy ágens, amely felelős egy képernyőre kerülő műsor, hangfelvétel, televíziós, webes közvetítés stb. legtöbb üzleti vonatkozásáért. @hu
toolkit definition: producer: @hu
alternative label: producer
scope note: Tuottaja vastaa tyypillisesti rahoituksen hankkimisesta, tuotannon johdosta, avainhenkilöstön palkkaamisesta, jakajien järjestämisestä jne. @fi
alternative label: tuottaja @fi
label: tuottaja (toimija) @fi
label: har produsent (agent) @no
definition: Relaterer et verk til en agent som er ansvarlig for de fleste forretningsmessige aspektene ved en produksjon for film eller fjernsyn, lydinnspilling, webcast, etc. @no
scope note: En produsent har normalt ansvar for å skaffe finansiering, lede produksjonen, ansette nøkkelmedarbeidere, finne distributører, etc. @no
alternative label: produsent @no
label: heeft producent-actor @nl
definition: Relateert een werk aan een actor die verantwoordelijk is voor het merendeel van de zakelijke aspecten van een productie voor scherm, geluidsopname, televisie, webcast etc. @nl
scope note: Een producent is over het algemeen verantwoordelijk voor het werven van fondsen, het beheren van de productie, het inhuren van het belangrijkste personeel, het verzorgen van distributeurs etc. @nl
toolkit label: producent-actor @nl
toolkit definition: Een actor die verantwoordelijk is voor het merendeel van de zakelijke aspecten van een productie voor scherm, geluidsopname, televisie, webcast etc. @nl
label: له وكيل منتج @ar
definition: يربط بين عمل ووكيل مسئول عن معظم جوانب العمل الخاصة بالإنتاج للسينما، وللتسجيل الصوتي، وللتلفزيون، وللبث عبر الإنترنت، إلخ. @ar
scope note: منتج مسئول عامة عن التمويل، وإدارة الإنتاج، وتوظيف الموظفين الرؤساء، والترتيب مع الموزعين، إلخ. @ar
alternative label: منتج @ar
toolkit label: وكيل منتج @ar
toolkit definition: وكيل مسئول عن معظم جوانب العمل في الإنتاج للسينما، وللتسجيل الصوتي، وللتليفزيون، وللبث عبر الإنترنت، إلخ. @ar
alternative label: productor @ca
label: produtsent (tegija) @et
definition: Seostab teose tegijaga, kes vastutab enamiku äriliste aspektide eest filmide, helisalvestiste, telesaadete, veebiülekannete jms tootmisel. @et
scope note: Tavaliselt vastutab produtsent rahastuse hankimise, tootejuhtimise, põhipersonali palkamise, levitamislepingute jms eest. @et
alternative label: produtsent @et
toolkit label: produtsent (tegija) @et
toolkit definition: Tegija, kes vastutab enamiku äriliste aspektide eest filmide, helisalvestiste, telesaadete, veebiülekannete jms tootmisel. @et

has producer collective agent
status: Published
lexical alias: producerCollectiveAgent.en
definition: Relates a work to a collective agent who is responsible for most of the business aspects of a production for screen, sound recording, television, webcast, etc.
toolkit label: producer collective agent
toolkit definition: A collective agent who is responsible for most of the business aspects of a production for screen, sound recording, television, webcast, etc.
type: Property
domain: C10001
has element type: 2
sub property of: has creator collective agent of work
sub property of: has producer agent
scope note: A producer is generally responsible for fundraising, managing the production, hiring key personnel, arranging for distributors, etc.
label: tuottaja (yhteistoimija) @fi
definition: Liittää teoksen yhteistoimijaan, joka on vastuussa suurimmasta osasta elokuva-, äänite-, televisio-, suoratoisto- tms. tuotannon liiketoiminnallisista tehtävistä. @fi
scope note: Tuottaja vastaa tyypillisesti rahoituksen hankkimisesta, tuotannon johdosta, avainhenkilöstön palkkaamisesta, jakajien järjestämisestä jne. @fi
toolkit label: tuottaja (yhteistoimija) @fi
toolkit definition: Yhteistoimija, joka on vastuussa suurimmasta osasta elokuva-, äänite-, televisio-, suoratoisto- tms. tuotannon liiketoiminnallisista tehtävistä. @fi
label: har produsent (kollektiv agent) @no
definition: Relaterer et verk til en kollektiv agent som er ansvarlig for de fleste forretningsmessige aspektene ved en produksjon for film eller fjernsyn, lydinnspilling, webcast, etc. @no
scope note: En produsent har normalt ansvar for å skaffe finansiering, lede produksjonen, ansette nøkkelmedarbeidere, finne distributører, etc. @no
toolkit label: produsent (kollektiv agent) @no
toolkit definition: En kollektiv agent som er ansvarlig for de fleste forretningsmessige aspektene ved en produksjon for film eller fjernsyn, lydinnspilling, webcast, etc. @no
label: heeft producent-collectieve actor @nl
definition: Relateert een werk aan een collectieve actor die verantwoordelijk is voor het merendeel van de zakelijke aspecten van een productie voor scherm, geluidsopname, televisie, webcast etc. @nl
scope note: Een producent is over het algemeen verantwoordelijk voor het werven van fondsen, het beheren van de productie, het inhuren van het belangrijkste personeel, het verzorgen van distributeurs etc. @nl
toolkit label: producent-collectieve actor @nl
toolkit definition: Een collectieve actor die verantwoordelijk is voor het merendeel van de zakelijke aspecten van een productie voor scherm, geluidsopname, televisie, webcast etc. @nl
label: له وكيل جماعي منتج @ar
definition: يربط العمل بوكيل جماعي مسئول عن معظم جوانب العمل في الإنتاج للسينما، وللتسجيل الصوتي، وللتليفزيون، وللبث عبر الإنترنت، إلخ. @ar
scope note: منتج مسئول عامة عن التمويل، وإدارة الإنتاج، وتوظيف الموظفين الرؤساء، والترتيب مع الموزعين، إلخ. @ar
toolkit label: وكيل جماعي منتج @ar
toolkit definition: وكيل جماعي مسئول عن معظم جوانب العمل في الإنتاج للسينما، وللتسجيل الصوتي، وللتليفزيون، وللبث عبر الإنترنت، إلخ. @ar
label: té com a agent col·lectiu productor @ca
definition: Relaciona una obra amb un agent col·lectiu que és responsable de la majoria dels aspectes comercials d’una producció d’una pel·lícula, d’un enregistrament sonor, d’un programa de televisió, d’una emissió web, etc. @ca
scope note: En general, un productor és responsable d’assegurar el finançament, de gestionar la producció, de contractar el personal clau, d’organitzar la distribució, etc. @ca
toolkit label: agent col·lectiu productor @ca
toolkit definition: Agent col·lectiu que és responsable de la majoria dels aspectes comercials d’una producció d’una pel·lícula, d’un enregistrament sonor, d’un programa de televisió, d’una emissió web, etc. @ca
label: har kollektiv agent, som er producer @da
definition: Relaterer et værk til en kollektiv agent, som er ansvarlig for størstedelen af de forretningsmæssige aspekter ved en produktion beregnet til lærred, lydoptagelse, tv, webcast etc. @da
scope note: Produceren er almindeligvis ansvarlig for finansiering, produktionsledelse, ansættelse af nøglepersonale, at finde distributører etc. @da
toolkit label: kollektiv agent, som er producer @da
toolkit definition: Kollektiv agent, som er ansvarlig for størstedelen af de forretningsmæssige aspekter ved en produktion beregnet til lærred, lydoptagelse, tv, webcast etc. @da
label: produtsent (kollektiiv) @et
definition: Seostab teose kollektiiviga, kes vastutab enamiku äriliste aspektide eest filmide, helisalvestiste, telesaadete, veebiülekannete jms tootmisel. @et
scope note: Tavaliselt vastutab produtsent rahastuse hankimise, tootejuhtimise, põhipersonali palkamise, levitamislepingute jms eest. @et
toolkit label: produtsent (kollektiiv) @et
toolkit definition: Kollektiiv, kes vastutab enamiku äriliste aspektide eest filmide, helisalvestiste, telesaadete, veebiülekannete jms tootmisel. @et
label: hat Produzentin/Produzenten (Gemeinschaftlicher Akteur) @de
definition: Setzt ein Werk in Beziehung zu einem gemeinschaftlichen Akteur, der für die meisten geschäftlichen Aspekte einer Produktion für die Leinwand, für eine Tonaufnahme, für das Fernsehen, für einen Webcast und so weiter verantwortlich ist. @de
scope note: Eine Produzentin/Ein Produzent ist im Allgemeinen für die Geldbeschaffung, das Produktionsmanagement, das Einstellen von wichtigem Personal, die Organisation des Vertriebs und so weiter verantwortlich. @de
toolkit label: Produzentin/Produzent (Gemeinschaftlicher Akteur) @de
toolkit definition: Ein gemeinschaftlicher Akteur, der für die meisten geschäftlichen Aspekte einer Produktion für die Leinwand, für eine Tonaufnahme, für das Fernsehen, für einen Webcast und so weiter verantwortlich ist. @de
label: producer kollektív ágense a következő: @hu
definition: Hozzákapcsol egy művet egy kollektív ágenshez, amely felelős egy képernyőre kerülő műsor, hangfelvétel, televíziós, webes közvetítés, stb. legtöbb üzleti vonatkozásáért. @hu
scope note: Egy producer általában felelős az adománygyűjtésért, a produkció irányításáért, a kulcsfontosságú személyzet felvételéért, a forgalmazók megszervezéséért stb. @hu
toolkit label: producer kollektív ágens: @hu
toolkit definition: Egy kollektív ágens, amely felelős egy képernyőre kerülő műsor, hangfelvétel, televíziós, webes közvetítés, stb. legtöbb üzleti vonatkozásáért. @hu
label: ha come produttore agente collettivo @it
definition: Correla un'opera all'agente collettivo responsabile della maggior parte degli aspetti commerciali di una produzione destinata allo schermo, registrazione audio, televisione, webcast, etc. @it
scope note: Generalmente un produttore è responsabile per la raccolta dei fondi, gestione della produzione, assunzione dei capi reparto, accordi con i distributori, etc. @it
toolkit label: produttore agente collettivo @it
toolkit definition: Agente collettivo responsabile della maggior parte degli aspetti commerciali di una produzione destinata allo schermo, registrazione audio, televisione, webcast, etc. @it
label: a pour agent collectif producteur @fr
definition: Met une œuvre en relation avec un agent collectif qui est responsable de la majeure partie des aspects commerciaux de la production d’un film, d’un enregistrement audio, d’une émission de télévision, d’une webémission, etc. @fr
scope note: Un producteur est généralement responsable d’assurer le financement, de gérer la production, de recruter le personnel clé, d’organiser la distribution, etc. @fr
toolkit label: agent collectif producteur @fr
toolkit definition: Agent collectif qui est responsable de la majeure partie des aspects commerciaux de la production d’un film, d’un enregistrement audio, d’une émission de télévision, d’une webémission, etc. @fr
label: producents (grupa) @lv
definition: Sasaista darbu ar grupu, kas ir atbildīga par filmas, mūzikas ierakstu, televīzijas, tīmekļa pārraižu u.tml. biznesa aspektiem. @lv
toolkit label: producents (grupa) @lv
toolkit definition: Grupa, kas ir atbildīga par filmas, mūzikas ierakstu, televīzijas, tīmekļa pārraižu u.tml. biznesa aspektiem. @lv
scope note: Producents parasti ir atbildīgs par līdzekļu piesaistīšanu, ražošanas vadīšanu, vadošā personāla pieņemšanu darbā, vienošanos ar izplatītājiem u.tml. @lv
label: 有制作者集体行为者 @zh-hans
definition: 将一种作品与负责银幕、录音、电视、网络直播等制作的大部分商业运作的一个集体行为者关联起来。 @zh-hans
toolkit label: 制作者行为者 @zh-hans
toolkit definition: 负责银幕、录音、电视、网络直播等制作的大部分商业运作的一个集体行为者 @zh-hans
scope note: 制作者通常负责募集资金、管理制作、聘用主要人员、安排发行者等 @zh-hans
has subproperty: has audio producer collective agent
has subproperty: has film producer collective agent
has subproperty: has producer corporate body

has producer corporate body
status: Published
lexical alias: producerCorporateBody.en
definition: Relates a work to a corporate body who is responsible for most of the business aspects of a production for screen, sound recording, television, webcast, etc.
toolkit label: producer corporate body
toolkit definition: A corporate body who is responsible for most of the business aspects of a production for screen, sound recording, television, webcast, etc.
type: Property
domain: C10001
has element type: 2
sub property of: has creator corporate body of work
sub property of: has producer collective agent
scope note: A producer is generally responsible for fundraising, managing the production, hiring key personnel, arranging for distributors, etc.
label: tuottaja (yhteisö) @fi
definition: Liittää teoksen yhteisöön, joka on vastuussa suurimmasta osasta elokuva-, äänite-, televisio-, suoratoisto- tms. tuotannon liiketoiminnallisista tehtävistä. @fi
scope note: Tuottaja vastaa tyypillisesti rahoituksen hankkimisesta, tuotannon johdosta, avainhenkilöstön palkkaamisesta, jakajien järjestämisestä jne. @fi
toolkit label: tuottaja (yhteisö) @fi
toolkit definition: Yhteisö, joka on vastuussa suurimmasta osasta elokuva-, äänite-, televisio-, suoratoisto- tms. tuotannon liiketoiminnallisista tehtävistä. @fi
label: har produsent (korporasjon) @no
definition: Relaterer et verk til en korporasjon som er ansvarlig for de fleste forretningsmessige aspektene ved en produksjon for film eller fjernsyn, lydinnspilling, webcast, etc. @no
scope note: En produsent har normalt ansvar for å skaffe finansiering, lede produksjonen, ansette nøkkelmedarbeidere, finne distributører, etc. @no
toolkit label: produsent (korporasjon) @no
toolkit definition: En korporasjon som er ansvarlig for de fleste forretningsmessige aspektene ved en produksjon for film eller fjernsyn, lydinnspilling, webcast, etc. @no
label: heeft producent-corporatie @nl
definition: Relateert een werk aan een corporatie die verantwoordelijk is voor het merendeel van de zakelijke aspecten van een productie voor scherm, geluidsopname, televisie, webcast etc. @nl
scope note: Een producent is over het algemeen verantwoordelijk voor het werven van fondsen, het beheren van de productie, het inhuren van het belangrijkste personeel, het verzorgen van distributeurs etc. @nl
toolkit label: producent-corporatie @nl
toolkit definition: Een corporatie die verantwoordelijk is voor het merendeel van de zakelijke aspecten van een productie voor scherm, geluidsopname, televisie, webcast etc. @nl
label: له هيئة منتجة @ar
definition: يربط بين عمل وهيئة مسئولة عن معظم جوانب العمل في الإنتاج للسينما، وللتسجيل الصوتي، وللتليفزيون، وللبث عبر الإنترنت، إلخ. @ar
scope note: منتج مسئول عامة عن التمويل، وإدارة الإنتاج، وتوظيف الموظفين الرؤساء، والترتيب مع الموزعين، إلخ. @ar
toolkit label: هيئة منتجة @ar
toolkit definition: هيئة مسئولة عن معظم جوانب العمل في الإنتاج للسينما، وللتسجيل الصوتي، وللتليفزيون، وللبث عبر الإنترنت، إلخ. @ar
label: té com a entitat corporativa productora @ca
definition: Relaciona una obra amb una entitat corporativa que és responsable de la majoria dels aspectes comercials d’una producció d’una pel·lícula, d’un enregistrament sonor, d’un programa de televisió, d’una emissió web, etc. @ca
scope note: En general, un productor és responsable d’assegurar el finançament, de gestionar la producció, de contractar el personal clau, d’organitzar la distribució, etc. @ca
toolkit label: entitat corporativa productora @ca
toolkit definition: Entitat corporativa que és responsable de la majoria dels aspectes comercials d’una producció d’una pel·lícula, d’un enregistrament sonor, d’un programa de televisió, d’una emissió web, etc. @ca
label: har korporation, som er producer @da
definition: Relaterer et værk til en korporation, som er ansvarlig for størstedelen af de forretningsmæssige aspekter ved en produktion beregnet til lærred, lydoptagelse, tv, webcast etc. @da
scope note: Produceren er almindeligvis ansvarlig for finansiering, produktionsledelse, ansættelse af nøglepersonale, at finde distributører etc. @da
toolkit label: korporation, som er producer @da
toolkit definition: Korporation, som er ansvarlig for størstedelen af de forretningsmæssige aspekter ved en produktion beregnet til lærred, lydoptagelse, tv, webcast etc. @da
label: produtsent (asutus) @et
definition: Seostab teose asutusega, kes vastutab enamiku äriliste aspektide eest filmide, helisalvestiste, telesaadete, veebiülekannete jms tootmisel. @et
scope note: Tavaliselt vastutab produtsent rahastuse hankimise, tootejuhtimise, põhipersonali palkamise, levitamislepingute jms eest. @et
toolkit label: produtsent (asutus) @et
toolkit definition: Asutus, kes vastutab enamiku äriliste aspektide eest filmide, helisalvestiste, telesaadete, veebiülekannete jms tootmisel. @et
label: hat Produzentin/Produzenten (Körperschaft) @de
definition: Setzt ein Werk in Beziehung zu einer Körperschaft, die für die meisten geschäftlichen Aspekte einer Produktion für die Leinwand, für eine Tonaufnahme, für das Fernsehen, für einen Webcast und so weiter verantwortlich ist. @de
scope note: Eine Produzentin/Ein Produzent ist im Allgemeinen für die Geldbeschaffung, das Produktionsmanagement, das Einstellen von wichtigem Personal, die Organisation des Vertriebs und so weiter verantwortlich. @de
toolkit label: Produzentin/Produzent (Körperschaft) @de
toolkit definition: Eine Körperschaft, die für die meisten geschäftlichen Aspekte einer Produktion für die Leinwand, für eine Tonaufnahme, für das Fernsehen, für einen Webcast und so weiter verantwortlich ist. @de
label: producer testülete a következő: @hu
definition: Hozzákapcsol egy művet egy testülethez, amely felelős egy képernyőre kerülő műsor, hangfelvétel, televíziós, webes közvetítés, stb. legtöbb üzleti vonatkozásáért. @hu
scope note: Egy producer általában felelős az adománygyűjtésért, a produkció irányításáért, a kulcsfontosságú személyzet felvételéért, a forgalmazók megszervezéséért stb. @hu
toolkit label: producer testület: @hu
toolkit definition: Egy testület, amely felelős egy képernyőre kerülő műsor, hangfelvétel, televíziós, webes közvetítés, stb. legtöbb üzleti vonatkozásáért. @hu
label: ha come produttore ente @it
definition: Correla un'opera a un ente responsabile della maggior parte degli aspetti commerciali di una produzione destinata allo schermo, registrazione audio, televisione, webcast, etc. @it
scope note: Generalmente un produttore è responsabile della raccolta dei fondi, gestione della produzione, assunzione dei capi reparto, accordi con i distributori, etc. @it
toolkit label: produttore ente @it
toolkit definition: Ente responsabile della maggior parte degli aspetti commerciali di una produzione destinata allo schermo, registrazione audio, televisione, webcast, etc. @it
label: a pour collectivité productrice @fr
definition: Met une œuvre en relation avec une collectivité qui est responsable de la majeure partie des aspects commerciaux de la production d’un film, d’un enregistrement audio, d’une émission de télévision, d’une webémission, etc. @fr
scope note: Un producteur est généralement responsable d’assurer le financement, de gérer la production, de recruter le personnel clé, d’organiser la distribution, etc. @fr
toolkit label: collectivité productrice @fr
toolkit definition: Collectivité qui est responsable de la majeure partie des aspects commerciaux de la production d’un film, d’un enregistrement audio, d’une émission de télévision, d’une webémission, etc. @fr
label: producents (institūcija) @lv
definition: Sasaista darbu ar institūciju, kas ir atbildīga par filmas, mūzikas ierakstu, televīzijas, tīmekļa pārraižu u.tml. biznesa aspektiem. @lv
toolkit label: producents (institūcija) @lv
toolkit definition: Institūcija, kas ir atbildīga par filmas, mūzikas ierakstu, televīzijas, tīmekļa pārraižu u.tml. biznesa aspektiem. @lv
scope note: Producents parasti ir atbildīgs par līdzekļu piesaistīšanu, ražošanas vadīšanu, vadošā personāla pieņemšanu darbā, vienošanos ar izplatītājiem u.tml. @lv
label: 有制作者团体 @zh-hans
definition: 将一种作品与负责银幕、录音、电视、网络直播等制作的大部分商业运作的一个团体关联起来。 @zh-hans
toolkit label: 制作者团体 @zh-hans
toolkit definition: 负责银幕、录音、电视、网络直播等制作的大部分商业运作的一个团体 @zh-hans
scope note: 制作者通常负责募集资金、管理制作、聘用主要人员、安排发行者等 @zh-hans
has subproperty: has audio producer corporate body
has subproperty: has film producer corporate body
has subproperty: has radio producer corporate body

has producer family
status: Published
lexical alias: producerFamily.en
definition: Relates a work to a family who is responsible for most of the business aspects of a production for screen, sound recording, television, webcast, etc.
toolkit label: producer family
toolkit definition: A family who is responsible for most of the business aspects of a production for screen, sound recording, television, webcast, etc.
type: Property
domain: C10001
has element type: 2
sub property of: has creator family of work
sub property of: has producer collective agent
scope note: A producer is generally responsible for fundraising, managing the production, hiring key personnel, arranging for distributors, etc.
label: tuottaja (suku) @fi
definition: Liittää teoksen sukuun, joka on vastuussa suurimmasta osasta elokuva-, äänite-, televisio-, suoratoisto- tms. tuotannon liiketoiminnallisista tehtävistä. @fi
scope note: Tuottaja vastaa tyypillisesti rahoituksen hankkimisesta, tuotannon johdosta, avainhenkilöstön palkkaamisesta, jakajien järjestämisestä jne. @fi
toolkit label: tuottaja (suku) @fi
toolkit definition: Suku, joka on vastuussa suurimmasta osasta elokuva-, äänite-, televisio-, suoratoisto- tms. tuotannon liiketoiminnallisista tehtävistä. @fi
label: har produsent (familie) @no
definition: Relaterer et verk til en familie som er ansvarlig for de fleste forretningsmessige aspektene ved en produksjon for film eller fjernsyn, lydinnspilling, webcast, etc. @no
scope note: En produsent har normalt ansvar for å skaffe finansiering, lede produksjonen, ansette nøkkelmedarbeidere, finne distributører, etc. @no
toolkit label: produsent (familie) @no
toolkit definition: En familie som er ansvarlig for de fleste forretningsmessige aspektene ved en produksjon for film eller fjernsyn, lydinnspilling, webcast, etc. @no
label: heeft producent-familie @nl
definition: Relateert een werk aan een familie die verantwoordelijk is voor het merendeel van de zakelijke aspecten van een productie voor scherm, geluidsopname, televisie, webcast etc. @nl
scope note: Een producent is over het algemeen verantwoordelijk voor het werven van fondsen, het beheren van de productie, het inhuren van het belangrijkste personeel, het verzorgen van distributeurs etc. @nl
toolkit label: producent-familie @nl
toolkit definition: Een familie die verantwoordelijk is voor het merendeel van de zakelijke aspecten van een productie voor scherm, geluidsopname, televisie, webcast etc. @nl
label: له عائلة منتجة @ar
definition: يربط بين عمل وعائلة مسئولة عن معظم جوانب العمل في الإنتاج للسينما، وللتسجيل الصوتي، وللتليفزيون، وللبث عبر الإنترنت، إلخ. @ar
scope note: منتج مسئول عامة عن التمويل، وإدارة الإنتاج، وتوظيف الموظفين الرؤساء، والترتيب مع الموزعين، إلخ. @ar
toolkit label: عائلة منتجة @ar
toolkit definition: عائلة مسئولة عن معظم جوانب العمل في الإنتاج للسينما، وللتسجيل الصوتي، وللتليفزيون، وللبث عبر الإنترنت، إلخ. @ar
label: té com a família productora @ca
definition: Relaciona una obra amb una família que és responsable de la majoria dels aspectes comercials d’una producció d’una pel·lícula, d’un enregistrament sonor, d’un programa de televisió, d’una emissió web, etc. @ca
scope note: En general, un productor és responsable d’assegurar el finançament, de gestionar la producció, de contractar el personal clau, d’organitzar la distribució, etc. @ca
toolkit label: família productora @ca
toolkit definition: Família que és responsable de la majoria dels aspectes comercials d’una producció d’una pel·lícula, d’un enregistrament sonor, d’un programa de televisió, d’una emissió web, etc. @ca
label: har familie, som er producer @da
definition: Relaterer et værk til en familie, som er ansvarlig for størstedelen af de forretningsmæssige aspekter ved en produktion beregnet til lærred, lydoptagelse, tv, webcast etc. @da
scope note: Produceren er almindeligvis ansvarlig for finansiering, produktionsledelse, ansættelse af nøglepersonale, at finde distributører etc. @da
toolkit label: familie, som er producer @da
toolkit definition: Familie, som er ansvarlig for størstedelen af de forretningsmæssige aspekter ved en produktion beregnet til lærred, lydoptagelse, tv, webcast etc. @da
label: produtsent (perekond) @et
definition: Seostab teose perekonnaga, kes vastutab enamiku äriliste aspektide eest filmide, helisalvestiste, telesaadete, veebiülekannete jms tootmisel. @et
scope note: Tavaliselt vastutab produtsent rahastuse hankimise, tootejuhtimise, põhipersonali palkamise, levitamislepingute jms eest. @et
toolkit label: produtsent (perekond) @et
toolkit definition: Perekond, kes vastutab enamiku äriliste aspektide eest filmide, helisalvestiste, telesaadete, veebiülekannete jms tootmisel. @et
label: hat Produzentin/Produzenten (Familie) @de
definition: Setzt ein Werk in Beziehung zu einer Familie, die für die meisten geschäftlichen Aspekte einer Produktion für die Leinwand, für eine Tonaufnahme, für das Fernsehen, für einen Webcast und so weiter verantwortlich ist. @de
scope note: Eine Produzentin/Ein Produzent ist im Allgemeinen für die Geldbeschaffung, das Produktionsmanagement, das Einstellen von wichtigem Personal, die Organisation des Vertriebs und so weiter verantwortlich. @de
toolkit label: Produzentin/Produzent (Familie) @de
toolkit definition: Eine Familie, die für die meisten geschäftlichen Aspekte einer Produktion für die Leinwand, für eine Tonaufnahme, für das Fernsehen, für einen Webcast und so weiter verantwortlich ist. @de
label: producer családja a következő: @hu
definition: Hozzákapcsol egy művet egy családhoz, amely felelős egy képernyőre kerülő műsor, hangfelvétel, televíziós, webes közvetítés, stb. legtöbb üzleti vonatkozásáért. @hu
scope note: Egy producer általában felelős az adománygyűjtésért, a produkció irányításáért, a kulcsfontosságú személyzet felvételéért, a forgalmazók megszervezéséért stb. @hu
toolkit label: producer család: @hu
toolkit definition: Egy család, amely felelős egy képernyőre kerülő műsor, hangfelvétel, televíziós, webes közvetítés, stb. legtöbb üzleti vonatkozásáért. @hu
label: ha come produttore famiglia @it
definition: Correla un'opera alla famiglia responsabile della maggior parte degli aspetti commerciali di una produzione destinata allo schermo, registrazione audio, televisione, webcast, etc. @it
scope note: Generalmente un produttore è responsabile della raccolta dei fondi, gestione della produzione, assunzione dei capi reparto, accordi con i distributori, etc. @it
toolkit label: produttore famiglia @it
toolkit definition: Famiglia responsabile della maggior parte degli aspetti commerciali di una produzione destinata allo schermo, registrazione audio, televisione, webcast, etc. @it
label: a pour famille productrice @fr
definition: Met une œuvre en relation avec une famille qui est responsable de la majeure partie des aspects commerciaux de la production d’un film, d’un enregistrement audio, d’une émission de télévision, d’une webémission, etc. @fr
scope note: Un producteur est généralement responsable d’assurer le financement, de gérer la production, de recruter le personnel clé, d’organiser la distribution, etc. @fr
toolkit label: famille productrice @fr
toolkit definition: Famille qui est responsable de la majeure partie des aspects commerciaux de la production d’un film, d’un enregistrement audio, d’une émission de télévision, d’une webémission, etc. @fr
label: producents (dzimta/ģimene) @lv
definition: Sasaista darbu ar dzimtu/ģimeni, kas ir atbildīga par filmas, mūzikas ierakstu, televīzijas, tīmekļa pārraižu u.tml. biznesa aspektiem. @lv
toolkit label: producents (dzimta/ģimene) @lv
toolkit definition: Dzimta/ģimene, kas ir atbildīga par filmas, mūzikas ierakstu, televīzijas, tīmekļa pārraižu u.tml. biznesa aspektiem. @lv
scope note: Producents parasti ir atbildīgs par līdzekļu piesaistīšanu, ražošanas vadīšanu, vadošā personāla pieņemšanu darbā, vienošanos ar izplatītājiem u.tml. @lv
label: 有制作者家族 @zh-hans
definition: 将一种作品与负责银幕、录音、电视、网络直播等制作的大部分商业运作的一个家族关联起来。 @zh-hans
toolkit label: 制作者家族 @zh-hans
toolkit definition: 负责银幕、录音、电视、网络直播等制作的大部分商业运作的一个家族 @zh-hans
scope note: 制作者通常负责募集资金、管理制作、聘用主要人员、安排发行者等 @zh-hans
has subproperty: has audio producer family
has subproperty: has film producer family
has subproperty: has radio producer family

has producer person
status: Published
lexical alias: producerPerson.en
definition: Relates a work to a person who is responsible for most of the business aspects of a production for screen, sound recording, television, webcast, etc.
toolkit label: producer person
toolkit definition: A person who is responsible for most of the business aspects of a production for screen, sound recording, television, webcast, etc.
type: Property
domain: C10001
has element type: 2
sub property of: has creator person of work
sub property of: has producer agent
scope note: A producer is generally responsible for fundraising, managing the production, hiring key personnel, arranging for distributors, etc.
label: tuottaja (henkilö) @fi
definition: Liittää teoksen henkilöön, joka on vastuussa suurimmasta osasta elokuva-, äänite-, televisio-, suoratoisto- tms. tuotannon liiketoiminnallisista tehtävistä. @fi
scope note: Tuottaja vastaa tyypillisesti rahoituksen hankkimisesta, tuotannon johdosta, avainhenkilöstön palkkaamisesta, jakajien järjestämisestä jne. @fi
toolkit label: tuottaja (henkilö) @fi
toolkit definition: Henkilö, joka on vastuussa suurimmasta osasta elokuva-, äänite-, televisio-, suoratoisto- tms. tuotannon liiketoiminnallisista tehtävistä. @fi
label: har produsent (person) @no
definition: Relaterer et verk til en person som er ansvarlig for de fleste forretningsmessige aspektene ved en produksjon for film eller fjernsyn, lydinnspilling, webcast, etc. @no
scope note: En produsent har normalt ansvar for å skaffe finansiering, lede produksjonen, ansette nøkkelmedarbeidere, finne distributører, etc. @no
toolkit label: produsent (person) @no
toolkit definition: En person som er ansvarlig for de fleste forretningsmessige aspektene ved en produksjon for film eller fjernsyn, lydinnspilling, webcast, etc. @no
label: heeft producent-persoon @nl
definition: Relateert een werk aan een persoon die verantwoordelijk is voor het merendeel van de zakelijke aspecten van een productie voor scherm, geluidsopname, televisie, webcast etc. @nl
scope note: Een producent is over het algemeen verantwoordelijk voor het werven van fondsen, het beheren van de productie, het inhuren van het belangrijkste personeel, het verzorgen van distributeurs etc. @nl
toolkit label: producent-persoon @nl
toolkit definition: Een persoon die verantwoordelijk is voor het merendeel van de zakelijke aspecten van een productie voor scherm, geluidsopname, televisie, webcast etc. @nl
label: له شخص منتج @ar
definition: يربط بين عمل وشخص مسئول عن معظم جوانب العمل في الإنتاج للسينما، أو للتسجيل الصوتي، أو للتليفزيون، أو للبث عبر الإنترنت، إلخ. @ar
scope note: منتج مسئول عامة عن التمويل، وإدارة الإنتاج، وتوظيف الموظفين الرؤساء، والترتيب مع الموزعين، إلخ. @ar
toolkit label: شخص منتج @ar
toolkit definition: شخص يكون مسئولاً عن معظم جوانب العمل في الإنتاج للسينما، أو للتسجيل الصوتي، أو للتليفزيون، أو للبث عبر الإنترنت، إلخ. @ar
label: té com a persona productora @ca
definition: Relaciona una obra amb una persona que és responsable de la majoria dels aspectes comercials d’una producció d’una pel·lícula, d’un enregistrament sonor, d’un programa de televisió, d’una emissió web, etc. @ca
scope note: En general, un productor és responsable d’assegurar el finançament, de gestionar la producció, de contractar el personal clau, d’organitzar la distribució, etc. @ca
toolkit label: persona productora @ca
toolkit definition: Persona que és responsable de la majoria dels aspectes comercials d’una producció d’una pel·lícula, d’un enregistrament sonor, d’un programa de televisió, d’una emissió web, etc. @ca
label: har person, som er producer @da
definition: Relaterer et værk til en person, som er ansvarlig for størstedelen af de forretningsmæssige aspekter ved en produktion beregnet til lærred, lydoptagelse, tv, webcast etc. @da
scope note: Produceren er almindeligvis ansvarlig for finansiering, produktionsledelse, ansættelse af nøglepersonale, at finde distributører etc. @da
toolkit label: person, som er producer @da
toolkit definition: Person, som er ansvarlig for størstedelen af de forretningsmæssige aspekter ved en produktion beregnet til lærred, lydoptagelse, tv, webcast etc. @da
label: produtsent (isik) @et
definition: Seostab teose isikuga, kes vastutab enamiku äriliste aspektide eest filmide, helisalvestiste, telesaadete, veebiülekannete jms tootmisel. @et
scope note: Tavaliselt vastutab produtsent rahastuse hankimise, tootejuhtimise, põhipersonali palkamise, levitamislepingute jms eest. @et
toolkit label: produtsent (isik) @et
toolkit definition: Isik, kes vastutab enamiku äriliste aspektide eest filmide, helisalvestiste, telesaadete, veebiülekannete jms tootmisel. @et
label: hat Produzentin/Produzenten (Person) @de
definition: Setzt ein Werk in Beziehung zu einer Person, die für die meisten geschäftlichen Aspekte einer Produktion für die Leinwand, für eine Tonaufnahme, für das Fernsehen, für einen Webcast und so weiter verantwortlich ist. @de
scope note: Eine Produzentin/Ein Produzent ist im Allgemeinen für die Geldbeschaffung, das Produktionsmanagement, das Einstellen von wichtigem Personal, die Organisation des Vertriebs und so weiter verantwortlich. @de
toolkit label: Produzentin/Produzent (Person) @de
toolkit definition: Eine Person, die für die meisten geschäftlichen Aspekte einer Produktion für die Leinwand, für eine Tonaufnahme, für das Fernsehen, für einen Webcast und so weiter verantwortlich ist. @de
label: producer személye a következő: @hu
definition: Hozzákapcsol egy művet egy személyhez, aki felelős egy képernyőre kerülő műsor, hangfelvétel, televíziós, webes közvetítés, stb. legtöbb üzleti vonatkozásáért. @hu
scope note: Egy producer általában felelős az adománygyűjtésért, a produkció irányításáért, a kulcsfontosságú személyzet felvételéért, a forgalmazók megszervezéséért stb. @hu
toolkit label: producer személy: @hu
toolkit definition: Egy személy, aki felelős egy képernyőre kerülő műsor, hangfelvétel, televíziós, webes közvetítés, stb. legtöbb üzleti vonatkozásáért. @hu
label: ha come produttore persona @it
definition: Correla un'opera alla persona responsabile della maggior parte degli aspetti commerciali di una produzione destinata allo schermo, registrazione audio, televisione, webcast, etc. @it
scope note: Generalmente un produttore è responsabile della raccolta dei fondi, gestione della produzione, assunzione dei capi reparto, accordi con i distributori, etc. @it
toolkit label: produttore persona @it
toolkit definition: Persona responsabile della maggior parte degli aspetti commerciali di una produzione destinata allo schermo, registrazione audio, televisione, webcast, etc. @it
label: a pour personne productrice @fr
definition: Met une œuvre en relation avec une personne qui est responsable de la majeure partie des aspects commerciaux de la production d’un film, d’un enregistrement audio, d’une émission de télévision, d’une webémission, etc. @fr
scope note: Un producteur est généralement responsable d’assurer le financement, de gérer la production, de recruter le personnel clé, d’organiser la distribution, etc. @fr
toolkit label: personne productrice @fr
toolkit definition: Personne qui est responsable de la majeure partie des aspects commerciaux de la production d’un film, d’un enregistrement audio, d’une émission de télévision, d’une webémission, etc. @fr
label: producents (persona) @lv
definition: Sasaista darbu ar personu, kura ir atbildīga par filmas, mūzikas ierakstu, televīzijas, tīmekļa pārraižu u.tml. biznesa aspektiem. @lv
toolkit label: producents (persona) @lv
toolkit definition: Persona, kura ir atbildīga par filmas, mūzikas ierakstu, televīzijas, tīmekļa pārraižu u.tml. biznesa aspektiem. @lv
scope note: Producents parasti ir atbildīgs par līdzekļu piesaistīšanu, ražošanas vadīšanu, vadošā personāla pieņemšanu darbā, vienošanos ar izplatītājiem u.tml. @lv
label: 有制作者个人 @zh-hans
definition: 将一种作品与负责银幕、录音、电视、网络直播等制作的大部分商业运作的一个个人关联起来。 @zh-hans
toolkit label: 制作者个人 @zh-hans
toolkit definition: 负责银幕、录音、电视、网络直播等制作的大部分商业运作的一个个人 @zh-hans
scope note: 制作者通常负责募集资金、管理制作、聘用主要人员、安排发行者等 @zh-hans
has subproperty: has audio producer person
has subproperty: has film producer person
has subproperty: has radio producer person

has production company
status: Published
definition: Relates a work to a corporate body who is responsible for managing the financial, technical, and organizational aspects of a production for stage, screen, sound recording, television, webcast, etc.
type: Property
domain: C10001
sub property of: has creator corporate body of work
lexical alias: productionCompany.en
toolkit label: production company
toolkit definition: A corporate body who is responsible for managing the financial, technical, and organizational aspects of a production for stage, screen, sound recording, television, webcast, etc.
toolkit label: société de production @fr
toolkit definition: Collectivité qui est responsable de gérer les aspects financiers, techniques et organisationnels de la production d’un spectacle, d’un film, d’un enregistrement audio, d’une émission de télévision, d’une webémission, etc. @fr
toolkit label: compañía productora @es
toolkit definition: Una entidad corporativa responsable de la gestión financiera, técnica y organizativa de una producción para escena cinematográfica, pantalla, grabación sonora, televisión, emisión web, etc. @es
instruction number: 18.5
label: har produktionsselskab @da
definition: Relaterer et værk til en korporation, som er ansvarlig for økonomisk, teknisk og organisatorisk ledelse af en produktion beregnet til scene, lærred, lydoptagelse, tv, webcast etc. @da
toolkit label: produktionsselskab @da
toolkit definition: Korporation, som er ansvarlig for økonomisk, teknisk og organisatorisk ledelse af en produktion beregnet til scene, lærred, lydoptagelse, tv, webcast etc. @da
definition: Met une œuvre en relation avec une collectivité qui est responsable de gérer les aspects financiers, techniques et organisationnels de la production d’un spectacle, d’un film, d’un enregistrement audio, d’une émission de télévision, d’une webémission, etc. @fr
label: có công ty sản xuất @vi
definition: Liên kết tác phẩm với tập thể có trách nhiệm về quản lý tài chính, kỹ thuật và tổ chức sản phẩm cho sân khấu, màn ảnh, ghi âm, truyền hình, trên web, v.v... @vi
toolkit label: công ty sản xuất @vi
toolkit definition: Tập thể có trách nhiệm về quản lý tài chính, kỹ thuật và tổ chức sản phẩm cho sân khấu, màn ảnh, ghi âm, truyền hình, trên web, v.v... @vi
label: hat Produktionsfirma @de
definition: Setzt ein Werk in Beziehung zu einer Körperschaft, die für das finanzielle, technische und organisatorische Management einer Produktion für die Bühne, den Bildschirm, die Tonaufnahme, das Fernsehen, für einen Webcast und so weiter verantwortlich ist. @de
toolkit label: Produktionsfirma @de
toolkit definition: Eine Körperschaft, die für das finanzielle, technische und organisatorische Management einer Produktion für die Bühne, den Bildschirm, die Tonaufnahme, das Fernsehen, für einen Webcast und so weiter verantwortlich ist. @de
label: a pour société de production @fr
definition: Liittää teoksen yhteisöön, joka vastaa näyttämö-, elokuva-, äänite-, televisio-, suoratoistolähetys- tms. tuotannon taloudellisesta, teknisestä ja organisatorisesta johtamisesta. @fi
toolkit label: tuotantoyhtiö @fi
toolkit definition: Yhteisö, joka vastaa näyttämö-, elokuva-, äänite-, televisio-, suoratoistolähetys- tms. tuotannon taloudellisesta, teknisestä ja organisatorisesta johtamisesta. @fi
toolkit label: produksjonsselskap @no
toolkit definition: En korporasjon med ansvar for håndtering av de økonomiske, tekniske og organisatoriske aspektene av en produksjon for scene, film eller fjernsyn, lydinnspilling, webcast, etc. @no
label: té com a empresa de producció @ca
definition: Relaciona una obra amb una entitat corporativa que és responsable de la gestió dels aspectes financers, tècnics i d’organització de la producció d’un espectacle, d’una pel·lícula, d’un enregistrament sonor, d’un programa de televisió, d’una emissió web, etc. @ca
toolkit label: empresa de producció @ca
toolkit definition: Entitat corporativa que és responsable de la gestió dels aspectes financers, tècnics i d’organització de la producció d’un espectacle, d’una pel·lícula, d’un enregistrament sonor, d’un programa de televisió, d’una emissió web, etc. @ca
has element type: 2
label: έχει εταιρία παραγωγής @el
definition: Συνδέει ένα έργο με ένα συλλογικό όργανο, το οποίο είναι υπεύθυνο για την οικονομική, τεχνική και οργανωτική διαχείριση μιας παραγωγής που προορίζεται για τη σκηνή, την οθόνη, μια ηχογράφηση, την τηλεόραση, μια διαδικτυακή μετάδοση κ.λπ. @el
toolkit label: εταιρία παραγωγής @el
toolkit definition: Ένα συλλογικό όργανο, το οποίο είναι υπεύθυνο για την οικονομική, τεχνική και οργανωτική διαχείριση μιας παραγωγής που προορίζεται για τη σκηνή, την οθόνη, μια ηχογράφηση, την τηλεόραση, μια διαδικτυακή μετάδοση κ.λπ. @el
label: produkciós cége a következő: @hu
definition: Hozzákapcsol egy művet egy testülethez, amely felelős egy színpadi produkció, film, hangfelvétel, televíziós vagy webes közvetítés, stb. pénzügyi, technikai és szervezeti vonatkozásának irányításáért. @hu
toolkit label: produkciós cég: @hu
toolkit definition: Egy testület, amely felelős egy színpadi produkció, film, hangfelvétel, televíziós vagy webes közvetítés, stb. pénzügyi, technikai és szervezeti vonatkozásának irányításáért. @hu
label: tuotantoyhtiö @fi
label: har produksjonsselskap @no
definition: Relaterer et verk til en korporasjon med ansvar for håndtering av de økonomiske, tekniske og organisatoriske aspektene av en produksjon for scene, film eller fjernsyn, lydinnspilling, webcast, etc. @no
label: heeft productiebedrijf @nl
definition: Relateert een werk aan een corporatie die verantwoordelijk is voor het beheer van de financiële, technische en organisatorische aspecten van een productie voor podium, scherm, geluidsopname, televisie, webcast etc. @nl
toolkit label: productiebedrijf @nl
toolkit definition: Een corporatie die verantwoordelijk is voor het beheer van de financiële, technische en organisatorische aspecten van een productie voor podium, scherm, geluidsopname, televisie, webcast etc. @nl
label: له شركة إنتاج @ar
definition: يربط بين عمل وهيئة مسئولة عن إدارة الجوانب المالية، والتقنية، والتنظيمية في الإنتاج للمسرح، وللسينما، وللتسجيل الصوتي، وللتليفزيون، وللبث عبر الإنترنت، إلخ. @ar
toolkit label: شركة إنتاج @ar
toolkit definition: هيئة مسئولة عن إدارة الجوانب المالية، والتقنية، والتنظيمية في الإنتاج للمسرح، وللسينما، وللتسجيل الصوتي، وللتليفزيون، وللبث عبر الإنترنت، إلخ. @ar
label: produktsioonifirma @et
definition: Seostab teose asutusega, kes vastutab lavastuste, filmide, helisalvestiste, telesaadete, veebiülekannete jms tootmise finantsilise, tehnilise ja korraldusliku juhtimise eest. @et
toolkit label: produktsioonifirma @et
toolkit definition: Asutus, kes vastutab lavastuste, filmide, helisalvestiste, telesaadete, veebiülekannete jms tootmise finantsilise, tehnilise ja korraldusliku juhtimise eest. @et
label: ha come compagnia di produzione @it
definition: Correla un’opera a un ente responsabile della gestione finanziaria, tecnica e organizzativa di una produzione per il teatro, cinema, registrazione audio, televisione, webcast, etc. @it
toolkit label: compagnia di produzione @it
toolkit definition: Ente responsabile della gestione finanziaria, tecnica e organizzativa di una produzione per il teatro, cinema, registrazione audio, televisione, webcast, etc. @it
label: producentu kompānija @lv
definition: Sasaista darbu ar institūciju, kas ir atbildīga par teātra, filmas, mūzikas ierakstu, televīzijas, tīmekļa pārraides u.tml. finansiālu, tehnisku un organizatorisku vadību. @lv
toolkit label: producentu kompānija @lv
toolkit definition: Institūcija, kas ir atbildīga par teātra, filmas, mūzikas ierakstu, televīzijas, tīmekļa pārraides u.tml. finansiālu, tehnisku un organizatorisku vadību. @lv
label: 有制作公司 @zh-hans
definition: 将一种作品与负责管理舞台、播放、录音、电视、网络直播等制作的资金、技术和组织方面的一个团体关联起来。 @zh-hans
toolkit label: 制作公司 @zh-hans
toolkit definition: 负责管理舞台、播放、录音、电视、网络直播等制作的资金、技术和组织方面的一个团体 @zh-hans
has subproperty: P10008
label: yapım şirketi ile ilişkilidir @tr
definition: Bir eseri, sahne, ekran, ses kaydı, televizyon, web yayını vb. için bir prodüksiyonun finansal, teknik ve organizasyonel yönlerini yönetmekten sorumlu olan tüzel kişi ile ilişkilendirir. @tr
toolkit label: Üretim şirketi @tr
toolkit definition: Sahne, ekran, ses kaydı, televizyon, web yayını vb. için bir prodüksiyonun mali, teknik ve organizasyonel yönlerini yönetmekten sorumlu olan tüzel kişi @tr

has programmer agent
status: Published
definition: Relates a work to an agent who is responsible for creating a computer program.
type: Property
domain: C10001
sub property of: has creator agent of work
lexical alias: programmerAgent.en
toolkit label: programmer agent
toolkit definition: An agent who is responsible for creating a computer program.
toolkit label: agent programmeur @fr
toolkit definition: Agent qui est responsable de la création d’un programme informatique. @fr
toolkit label: programador @es
toolkit definition: Una persona, familia o entidad corporativa responsable de la creación de un programa de computadora. @es
instruction number: 18.5
label: har agent, som er programmør @da
definition: Relaterer et værk til en agent, som er ansvarlig for at skabe et computerprogram. @da
toolkit label: agent, som er programmør @da
toolkit definition: Agent, som er ansvarlig for at skabe et computerprogram. @da
definition: Met une œuvre en relation avec un agent qui est responsable de la création d’un programme informatique. @fr
label: có người lập trình @vi
definition: Liên kết tác phẩm với tác nhân có trách nhiệm sáng tạo chương trình máy tính. @vi
toolkit label: người lập trình @vi
toolkit definition: Tác nhân có trách nhiệm sáng tạo chương trình máy tính. @vi
label: hat Programmiererin/Programmierer (Akteur) @de
definition: Setzt ein Werk in Beziehung zu einem Akteur, der für die Schaffung eines Computerprogramms verantwortlich ist. @de
toolkit label: Programmiererin/Programmierer (Akteur) @de
toolkit definition: Ein Akteur, der für die Schaffung eines Computerprogramms verantwortlich ist. @de
label: a pour agent programmeur @fr
definition: Liittää teoksen toimijaan, joka on vastuussa tietokoneohjelman luomisesta. @fi
toolkit label: ohjelmoija (toimija) @fi
toolkit definition: Toimija, joka on vastuussa tietokoneohjelman luomisesta. @fi
toolkit label: programmerer (agent) @no
toolkit definition: En agent som er ansvarlig for å skape et dataprogram. @no
label: té com a agent programador @ca
definition: Relaciona una obra amb un agent que és responsable de la creació d’un programa informàtic. @ca
toolkit label: agent programador @ca
toolkit definition: Agent que és responsable de la creació d’un programa informàtic. @ca
has element type: 2
label: έχει προγραμματιστή @el
definition: Συνδέει ένα έργο με έναν φορέα υπεύθυνο για τη δημιουργία ενός προγράμματος υπολογιστή. @el
toolkit label: προγραμματιστής @el
toolkit definition: Συνδέει ένα έργο με έναν φορέα υπεύθυνο για τη δημιουργία ενός προγράμματος υπολογιστή. @el
label: programozó ágense a következő: @hu
definition: Hozzákapcsol egy művet egy ágenshez, amely felelős egy számítógépes program megalkotásáért. @hu
toolkit label: programozó ágens: @hu
toolkit definition: Egy ágens, amely felelős egy számítógépes program megalkotásáért. @hu
alternative label: programmer
alternative label: ohjelmoija @fi
label: ohjelmoija (toimija) @fi
label: har programmerer (agent) @no
definition: Relaterer et verk til en agent som er ansvarlig for å skape et dataprogram. @no
alternative label: programmerer @no
label: heeft programmeur-actor @nl
definition: Relateert een werk aan een actor die verantwoordelijk is voor het creëren van een computerprogramma. @nl
toolkit label: programmeur-actor @nl
toolkit definition: Een actor die verantwoordelijk is voor het creëren van een computerprogramma. @nl
label: له وكيل مبرمج @ar
definition: يربط بين عمل ووكيل مسئول عن إنشاء برنامج كمبيوتر. @ar
alternative label: مُبرمج @ar
toolkit label: وكيل مبرمج @ar
toolkit definition: وكيل مسؤول عن إنشاء برنامج كمبيوتر. @ar
alternative label: programador @ca
alternative label: programmør @da
label: programmeerija (tegija) @et
definition: Seostab teose tegijaga, kes vastutab arvutiprogrammi loomise eest. @et
alternative label: programmeerija @et
toolkit label: programmeerija (tegija) @et
toolkit definition: Tegija, kes vastutab arvutiprogrammi loomise eest. @et
alternative label: programozó: @hu
label: ha come programmatore agente @it
definition: Correla un'opera a un agente responsabile della creazione di un programma per computer. @it
alternative label: programmatore @it
toolkit label: programmatore agente @it
toolkit definition: Agente responsabile della creazione di un programma per computer. @it
alternative label: programmeur @fr
label: programmētājs (aģents) @lv
definition: Sasaista darbu ar aģentu, kas ir atbildīgs par datorprogrammas izveidi. @lv
toolkit label: programmētājs (aģents) @lv
toolkit definition: Aģents, kas ir atbildīgs par datorprogrammas izveidi. @lv
alternative label: Programmierer @de
toolkit label: 编程者行为者 @zh-hans

has programmer collective agent
status: Published
lexical alias: programmerCollectiveAgent.en
definition: Relates a work to a collective agent who is responsible for creating a computer program.
toolkit label: programmer collective agent
toolkit definition: A collective agent who is responsible for creating a computer program.
type: Property
domain: C10001
has element type: 2
sub property of: has creator collective agent of work
sub property of: has programmer agent
label: ohjelmoija (yhteistoimija) @fi
definition: Liittää teoksen yhteistoimijaan, joka on vastuussa tietokoneohjelman luomisesta. @fi
toolkit label: ohjelmoija (yhteistoimija) @fi
toolkit definition: Yhteistoimija, joka on vastuussa tietokoneohjelman luomisesta. @fi
label: har programmerer (kollektiv agent) @no
definition: Relaterer et verk til en kollektiv agent som er ansvarlig for å skape et dataprogram. @no
toolkit label: programmerer (kollektiv agent) @no
toolkit definition: En kollektiv agent som er ansvarlig for å skape et dataprogram. @no
label: heeft programmeur-collectieve actor @nl
definition: Relateert een werk aan een collectieve actor die verantwoordelijk is voor het creëren van een computerprogramma. @nl
toolkit label: programmeur-collectieve actor @nl
toolkit definition: Een collectieve actor die verantwoordelijk is voor het creëren van een computerprogramma. @nl
label: له وكيل جماعي مبرمج @ar
definition: يربط بين عمل ووكيل جماعي مسئول عن إنشاء برنامج كمبيوتر. @ar
toolkit label: وكيل جماعي مبرمج @ar
toolkit definition: وكيل جماعي مسئول عن إنشاء برنامج كمبيوتر. @ar
label: té com a agent col·lectiu programador @ca
definition: Relaciona una obra amb un agent col·lectiu que és responsable de la creació d’un programa informàtic. @ca
toolkit label: agent col·lectiu programador @ca
toolkit definition: Agent col·lectiu que és responsable de la creació d’un programa informàtic. @ca
label: har kollektiv agent, som er programmør @da
definition: Relaterer et værk til en kollektiv agent, som er ansvarlig for at skabe et computerprogram. @da
toolkit label: kollektiv agent, som er programmør @da
toolkit definition: Kollektiv agent, som er ansvarlig for at skabe et computerprogram. @da
label: programmeerija (kollektiiv) @et
definition: Seostab teose kollektiiviga, kes vastutab arvutiprogrammi loomise eest. @et
toolkit label: programmeerija (kollektiiv) @et
toolkit definition: Kollektiiv, kes vastutab arvutiprogrammi loomise eest. @et
label: hat Programmiererin/Programmierer (Gemeinschaftlicher Akteur) @de
definition: Setzt ein Werk in Beziehung zu einem gemeinschaftlichen Akteur, der für die Schaffung eines Computerprogramms verantwortlich ist. @de
toolkit label: Programmiererin/Programmierer (Gemeinschaftlicher Akteur) @de
toolkit definition: Ein gemeinschaftlicher Akteur, der für die Schaffung eines Computerprogramms verantwortlich ist. @de
label: programozó kollektív ágense a következő: @hu
definition: Hozzákapcsol egy művet egy kollektív ágenshez, amely felelős egy számítógépes program megalkotásáért. @hu
toolkit label: programozó kollektív ágens: @hu
toolkit definition: Egy kollektív ágens, mely felelős egy számítógépes program megalkotásáért. @hu
label: ha come programmatore agente collettivo @it
definition: Correla un'opera all'agente collettivo responsabile della creazione di un programma per computer. @it
toolkit label: programmatore agente collettivo @it
toolkit definition: Agente collettivo responsabile della creazione di un programma per computer. @it
label: a pour agent collectif programmeur @fr
definition: Met une œuvre en relation avec un agent collectif qui est responsable de la création d’un programme informatique. @fr
toolkit label: agent collectif programmeur @fr
toolkit definition: Agent collectif qui est responsable de la création d’un programme informatique. @fr
label: programmētājs (grupa) @lv
definition: Sasaista darbu ar grupu, kas ir atbildīga par datorprogrammas izveidi. @lv
toolkit label: programmētājs (grupa) @lv
toolkit definition: Grupa, kas ir atbildīga par datorprogrammas izveidi. @lv
label: 有编程者集体行为者 @zh-hans
definition: 将一种作品与负责创建一种计算机程序的一个集体行为者关联起来。 @zh-hans
toolkit label: 编程者集体行为者 @zh-hans
toolkit definition: 负责创建一种计算机程序的一个集体行为者 @zh-hans
has subproperty: has programmer corporate body
has subproperty: has programmer family
has subproperty: P10487
label: kolektif program temsilcisi ile ilişkilidir @tr
definition: Bir eseri, bir bilgisayar programı oluşturmaktan sorumlu olan kolektif bir temsilci ile ilişkilendirir. @tr
toolkit label: programcı kolektif temsilci @tr
toolkit definition: Bir bilgisayar programı oluşturmakla sorumlu olan bir kolektif temsilci @tr

has programmer corporate body
status: Published
lexical alias: programmerCorporateBody.en
definition: Relates a work to a corporate body who is responsible for creating a computer program.
toolkit label: programmer corporate body
toolkit definition: A corporate body who is responsible for creating a computer program.
type: Property
domain: C10001
has element type: 2
sub property of: has creator corporate body of work
sub property of: has programmer collective agent
label: ohjelmoija (yhteisö) @fi
definition: Liittää teoksen yhteisöön, joka on vastuussa tietokoneohjelman luomisesta. @fi
toolkit label: ohjelmoija (yhteisö) @fi
toolkit definition: Yhteisö, joka on vastuussa tietokoneohjelman luomisesta. @fi
label: har programmerer (korporasjon) @no
definition: Relaterer et verk til en korporasjon som er ansvarlig for å skape et dataprogram. @no
toolkit label: programmerer (korporasjon) @no
toolkit definition: En korporasjon som er ansvarlig for å skape et dataprogram. @no
label: heeft programmeur-corporatie @nl
definition: Relateert een werk aan een corporatie die verantwoordelijk is voor het creëren van een computerprogramma. @nl
toolkit label: programmeur-corporatie @nl
toolkit definition: Een corporatie die verantwoordelijk is voor het creëren van een computerprogramma. @nl
label: له هيئة مبرمجة @ar
definition: يربط بين عمل وهيئة مسئولة عن إنشاء برنامج كمبيوتر. @ar
toolkit label: هيئة مبرمجة @ar
toolkit definition: هيئة مسئولة عن إنشاء برنامج كمبيوتر. @ar
label: té com a entitat corporativa programadora @ca
definition: Relaciona una obra amb una entitat corporativa que és responsable de la creació d’un programa informàtic. @ca
toolkit label: entitat corporativa programadora @ca
toolkit definition: Entitat corporativa que és responsable de la creació d’un programa informàtic. @ca
label: har korporation, som er programmør @da
definition: Relaterer et værk til en korporation, som er ansvarlig for at skabe et computerprogram. @da
toolkit label: korporation, som er programmør @da
toolkit definition: Korporation, som er ansvarlig for at skabe et computerprogram. @da
label: programmeerija (asutus) @et
definition: Seostab teose asutusega, kes vastutab arvutiprogrammi loomise eest. @et
toolkit label: programmeerija (asutus) @et
toolkit definition: Asutus, kes vastutab arvutiprogrammi loomise eest. @et
label: hat Programmiererin/Programmierer (Körperschaft) @de
definition: Setzt ein Werk in Beziehung zu einer Körperschaft, die für die Schaffung eines Computerprogramms verantwortlich ist. @de
toolkit label: Programmiererin/Programmierer (Körperschaft) @de
toolkit definition: Eine Körperschaft, die für die Schaffung eines Computerprogramms verantwortlich ist. @de
label: programozó testülete a következő: @hu
definition: Hozzákapcsol egy művet egy testülethez, amely felelős egy számítógépes program megalkotásáért. @hu
toolkit label: programozó testület: @hu
toolkit definition: Egy testület, amely felelős egy számítógépes program megalkotásáért. @hu
label: ha come programmatore ente @it
definition: Correla un'opera a un ente responsabile della creazione di un programma per computer. @it
toolkit label: programmatore ente @it
toolkit definition: Ente responsabile della creazione di un programma per computer. @it
label: a pour collectivité programmeuse @fr
definition: Met une œuvre en relation avec une collectivité qui est responsable de la création d’un programme informatique. @fr
toolkit label: collectivité programmeuse @fr
toolkit definition: Collectivité qui est responsable de la création d’un programme informatique. @fr
label: programmētājs (institūcija) @lv
definition: Sasaista darbu ar institūciju, kas ir atbildīga par datorprogrammas izveidi. @lv
toolkit label: programmētājs (institūcija) @lv
toolkit definition: Institūcija, kas ir atbildīga par datorprogrammas izveidi. @lv
label: 有编程者团体 @zh-hans
definition: 将一种作品与负责创建一种计算机程序的一个团体关联起来。 @zh-hans
toolkit label: 编程者团体 @zh-hans
toolkit definition: 负责创建一种计算机程序的一个团体 @zh-hans
has subproperty: P10534
label: programcı tüzel kişisi ile ilişkilidir @tr
definition: Bir eseri, bir bilgisayar programı oluşturmaktan sorumlu olan tüzel kişi ile ilişkilendirir. @tr
toolkit label: programcı tüzel kişi @tr
toolkit definition: Bir bilgisayar programı oluşturmaktan sorumlu bir tüzel kişi. @tr

has programmer family
status: Published
lexical alias: programmerFamily.en
definition: Relates a work to a family who is responsible for creating a computer program.
toolkit label: programmer family
toolkit definition: A family who is responsible for creating a computer program.
type: Property
domain: C10001
has element type: 2
sub property of: has creator family of work
sub property of: has programmer collective agent
label: ohjelmoija (suku) @fi
definition: Liittää teoksen sukuun, joka on vastuussa tietokoneohjelman luomisesta. @fi
toolkit label: ohjelmoija (suku) @fi
toolkit definition: Suku, joka on vastuussa tietokoneohjelman luomisesta. @fi
label: har programmerer (familie) @no
definition: Relaterer et verk til en familie som er ansvarlig for å skape et dataprogram. @no
toolkit label: programmerer (familie) @no
toolkit definition: En familie som er ansvarlig for å skape et dataprogram. @no
label: heeft programmeur-familie @nl
definition: Relateert een werk aan een familie die verantwoordelijk is voor het creëren van een computerprogramma. @nl
toolkit label: programmeur-familie @nl
toolkit definition: Een familie die verantwoordelijk is voor het creëren van een computerprogramma. @nl
label: له عائلة مبرمجة @ar
definition: يربط بين عمل وعائلة مسئولة عن إنشاء برنامج كمبيوتر. @ar
toolkit label: عائلة مبرمجة @ar
toolkit definition: عائلة مسئولة عن إنشاء برنامج كمبيوتر. @ar
label: té com a família programadora @ca
definition: Relaciona una obra amb una família que és responsable de la creació d’un programa informàtic. @ca
toolkit label: família programadora @ca
toolkit definition: Família que és responsable de la creació d’un programa informàtic. @ca
label: har familie, som er programmør @da
definition: Relaterer et værk til en familie, som er ansvarlig for at skabe et computerprogram. @da
toolkit label: familie, som er programmør @da
toolkit definition: Familie, som er ansvarlig for at skabe et computerprogram. @da
label: programmeerija (perekond) @et
definition: Seostab teose perekonnaga, kes vastutab arvutiprogrammi loomise eest. @et
toolkit label: programmeerija (perekond) @et
toolkit definition: Perekond, kes vastutab arvutiprogrammi loomise eest. @et
label: hat Programmiererin/Programmierer (Familie) @de
definition: Setzt ein Werk in Beziehung zu einer Familie, die für die Schaffung eines Computerprogramms verantwortlich ist. @de
toolkit label: Programmiererin/Programmierer (Familie) @de
toolkit definition: Eine Familie, die für die Schaffung eines Computerprogramms verantwortlich ist. @de
label: programozó családja a következő: @hu
definition: Hozzákapcsol egy művet egy családhoz, amely felelős egy számítógépes program megalkotásáért. @hu
toolkit label: programozó család: @hu
toolkit definition: Egy család, amely felelős egy számítógépes program megalkotásáért. @hu
label: ha come programmatore famiglia @it
definition: Correla un'opera alla famiglia responsabile della creazione di un programma per computer. @it
toolkit label: programmatore famiglia @it
toolkit definition: Famiglia responsabile della creazione di un programma per computer. @it
label: a pour famille programmeuse @fr
definition: Met une œuvre en relation avec une famille qui est responsable de la création d’un programme informatique. @fr
toolkit label: famille programmeuse @fr
toolkit definition: Famille qui est responsable de la création d’un programme informatique. @fr
label: programmētājs (dzimta/ģimene) @lv
definition: Sasaista darbu ar dzimtu/ģimeni, kas ir atbildīga par datorprogrammas izveidi. @lv
toolkit label: programmētājs (dzimta/ģimene) @lv
toolkit definition: Dzimta/ģimene, kas ir atbildīga par datorprogrammas izveidi. @lv
label: 有编程者家族 @zh-hans
definition: 将一种作品与负责创建一种计算机程序的一个家族关联起来。 @zh-hans
toolkit label: 编程者家族 @zh-hans
toolkit definition: 负责创建一种计算机程序的一个家族 @zh-hans
has subproperty: P10581
label: programcı ailesi ile ilişkilidir @tr
definition: Bir eseri, bir bilgisayar programı oluşturmaktan sorumlu olan bir aileyle ilişkilendirir. @tr
toolkit label: programcı aile @tr
toolkit definition: Bir bilgisayar programı oluşturmaktan sorumlu bir aile. @tr

has programmer person
status: Published
lexical alias: programmerPerson.en
definition: Relates a work to a person who is responsible for creating a computer program.
toolkit label: programmer person
toolkit definition: A person who is responsible for creating a computer program.
type: Property
domain: C10001
has element type: 2
sub property of: has creator person of work
sub property of: has programmer agent
label: ohjelmoija (henkilö) @fi
definition: Liittää teoksen henkilöön, joka on vastuussa tietokoneohjelman luomisesta. @fi
toolkit label: ohjelmoija (henkilö) @fi
toolkit definition: Henkilö, joka on vastuussa tietokoneohjelman luomisesta. @fi
label: har programmerer (person) @no
definition: Relaterer et verk til en person som er ansvarlig for å skape et dataprogram. @no
toolkit label: programmerer (person) @no
toolkit definition: En person som er ansvarlig for å skape et dataprogram. @no
label: heeft programmeur-persoon @nl
definition: Relateert een werk aan een persoon die verantwoordelijk is voor het creëren van een computerprogramma. @nl
toolkit label: programmeur-persoon @nl
toolkit definition: Een persoon die verantwoordelijk is voor het creëren van een computerprogramma. @nl
label: له شخص مبرمج @ar
definition: يربط بين عمل وشخص مسئول عن إنشاء برنامج كمبيوتر. @ar
toolkit label: شخص مبرمج @ar
toolkit definition: شخص يكون مسئولاً عن إنشاء برنامج كمبيوتر. @ar
label: té com a persona programadora @ca
definition: Relaciona una obra amb una persona que és responsable de la creació d’un programa informàtic. @ca
toolkit label: persona programadora @ca
toolkit definition: Persona que és responsable de la creació d’un programa informàtic. @ca
label: har person, som er programmør @da
definition: Relaterer et værk til en person, som er ansvarlig for at skabe et computerprogram. @da
toolkit label: person, som er programmør @da
toolkit definition: Person, som er ansvarlig for at skabe et computerprogram. @da
label: programmeerija (isik) @et
definition: Seostab teose isikuga, kes vastutab arvutiprogrammi loomise eest. @et
toolkit label: programmeerija (isik) @et
toolkit definition: Isik, kes vastutab arvutiprogrammi loomise eest. @et
label: hat Programmiererin/Programmierer (Person) @de
definition: Setzt ein Werk in Beziehung zu einer Person, die für die Schaffung eines Computerprogramms verantwortlich ist. @de
toolkit label: Programmiererin/Programmierer (Person) @de
toolkit definition: Eine Person, die für die Schaffung eines Computerprogramms verantwortlich ist. @de
label: programozó személye a következő: @hu
definition: Hozzákapcsol egy művet egy személyhez, aki felelős egy számítógépes program megalkotásáért. @hu
toolkit label: programozó személy: @hu
toolkit definition: Egy személy, aki felelős egy számítógépes program megalkotásáért. @hu
label: ha come programmatore persona @it
definition: Correla un'opera alla persona responsabile della creazione di un programma per computer. @it
toolkit label: programmatore persona @it
toolkit definition: Persona responsabile della creazione di un programma per computer. @it
label: a pour personne programmeuse @fr
definition: Met une œuvre en relation avec une personne qui est responsable de la création d’un programme informatique. @fr
toolkit label: personne programmeuse @fr
toolkit definition: Personne qui est responsable de la création d’un programme informatique. @fr
label: programmētājs (persona) @lv
definition: Sasaista darbu ar personu, kura ir atbildīga par datorprogrammas izveidi. @lv
toolkit label: programmētājs (persona) @lv
toolkit definition: Persona, kura ir atbildīga par datorprogrammas izveidi. @lv
label: 有编程者个人 @zh-hans
definition: 将一种作品与负责创建一种计算机程序的一个个人关联起来。 @zh-hans
toolkit label: 编程者个人 @zh-hans
toolkit definition: 负责创建一种计算机程序的一个个人 @zh-hans
has subproperty: P10440
label: programcı kişisi ile ilişkilidir @tr
definition: Bir eseri, bilgisayar programı oluşturmaktan sorumlu olan bir kişiyle ilişkilendirir. @tr
toolkit label: programcı kişi @tr
toolkit definition: Bir bilgisayar programı oluşturmaktan sorumlu olan kişi. @tr

has projection of cartographic content of representative expression
status: Published
type: Property
lexical alias: projectionOfCartographicContentOfRepresentativeExpression.en
definition: Relates a work to a method or system used to represent the surface of the earth or of a celestial sphere on a plane in a representative expression of a work.
domain: C10001
toolkit label: projection of cartographic content of representative expression
has element type: 5
toolkit definition: A method or system used to represent the surface of the earth or of a celestial sphere on a plane in a representative expression of a work.
label: edustavan ekspression kartografisen sisällön projektio @fi
definition: Liittää teoksen menetelmään tai järjestelmään, jota käytetään esittämään maapallon tai taivaanpallon pintaa kaksiulotteisesti teoksen edustavassa ekspressiossa. @fi
toolkit label: edustavan ekspression kartografisen sisällön projektio @fi
toolkit definition: Menetelmä tai järjestelmä, jota käytetään esittämään maapallon tai taivaanpallon pintaa kaksiulotteisesti teoksen edustavassa ekspressiossa. @fi
label: har kartprojeksjon for representativt uttrykk @no
definition: Relaterer et verk til en metode eller et system som brukes for å gjengi overflaten til jorden eller et annet kuleformet himmellegeme på en flat overflate i et representativt uttrykk av et verk. @no
toolkit label: kartprojeksjon for representativt uttrykk @no
toolkit definition: En metode eller et system som brukes for å gjengi overflaten til jorden eller et annet kuleformet himmellegeme på en flat overflate i et representativt uttrykk av et verk. @no
label: heeft projectie van cartografische content van representatieve expressie @nl
definition: Relateert een werk aan een methode of systeem gebruikt om het oppervlak van de aarde of een hemelbol voor te stellen op een vlak in een representatieve expressie van een werk. @nl
toolkit label: projectie van cartografische content van representatieve expressie @nl
toolkit definition: Een methode of systeem gebruikt om het oppervlak van de aarde of een hemelbol voor te stellen op een vlak in een representatieve expressie van een werk. @nl
label: له إسقاط لمحتوى خرائطي لتعبيرة ممثِلة @ar
definition: يربط بين عمل وطريقة أو نظام مستخدم لتمثيل سطح الأرض أو الكرة السماوية على مسطح في تعبيرة ممثِلة لعمل. @ar
toolkit label: إسقاط محتوى خرائطي لتعبيرة ممثِلة @ar
toolkit definition: طريقة أو نظام مستخدم لتمثيل سطح الأرض أو الكرة السماوية على مسطح في تعبيرة ممثِلة لعمل. @ar
label: té com a projecció de contingut cartogràfic d’una expressió representativa @ca
definition: Relaciona una obra amb un mètode o sistema usat per representar la superfície de la terra o d’una esfera celeste sobre un pla en una expressió representativa d’una obra. @ca
toolkit label: projecció de contingut cartogràfic d’una expressió representativa @ca
toolkit definition: Mètode o sistema usat per representar la superfície de la terra o d’una esfera celeste sobre un pla en una expressió representativa d’una obra. @ca
label: har projicering af kartografisk indhold af repræsentativt udtryk @da
definition: Relaterer et værk til en metode eller system, som anvendes til at repræsentere jordens overflade eller overfladen på et himmellegeme på et kort i et værks repræsentative udtryk. @da
toolkit label: projicering af kartografisk indhold af repræsentativt udtryk @da
toolkit definition: Metode eller system, som anvendes til at repræsentere jordens overflade eller overfladen på et himmellegeme på et kort i et værks repræsentative udtryk. @da
label: iseloomuliku väljenduse kartograafilise sisu projektsioon @et
definition: Seostab teose meetodi või süsteemiga, mida teose iseloomulikus väljenduses on kasutatud Maa pinna või taevasfääri tasapinnaliseks kujutamiseks. @et
toolkit label: iseloomuliku väljenduse kartograafilise sisu projektsioon @et
toolkit definition: Meetod või süsteem, mida teose iseloomulikus väljenduses on kasutatud Maa pinna või taevasfääri tasapinnaliseks kujutamiseks. @et
label: hat Projektion von kartografischem Inhalt einer repräsentativen Expression @de
definition: Setzt eine Expression in Beziehung zu einer Methode oder ein System, die/das angewendet wird, um in einer repräsentativen Expression eines Werks die Oberfläche der Erde oder einer Himmelskugel auf einer Ebene zu repräsentieren. @de
toolkit label: Projektion von kartografischem Inhalt einer repräsentativen Expression @de
toolkit definition: Eine Methode oder ein System, die/das angewendet wird, um in einer repräsentativen Expression eines Werks die Oberfläche der Erde oder einer Himmelskugel auf einer Ebene zu repräsentieren. @de
label: reprezentatív kifejezési forma vetített kartográfiai tartalma a következő: @hu
definition: Hozzákapcsol egy művet egy olyan módszerhez vagy rendszerhez, amelyet egy mű kifejezési formájában a Föld vagy egy égitest felszínének síkbeli ábrázolására használnak. @hu
toolkit label: reprezentatív kifejezési formához tartozó vetített kartografikus tartalom @hu
toolkit definition: Egy olyan módszer vagy rendszer, amelyet egy mű kifejezési formájában a Föld vagy egy égitest felszínének síkbeli ábrázolására használnak. @hu
label: ha come proiezione di contenuto cartografico dell'espressione rappresentativa @it
definition: Correla un’opera a un metodo o sistema utilizzato per rappresentare la superficie della Terra o di una sfera celeste su un piano in un’espressione rappresentativa di un’opera. @it
toolkit label: proiezione di contenuto cartografico dell'espressione rappresentativa @it
toolkit definition: Metodo o sistema utilizzato per rappresentare la superficie della Terra o di una sfera celeste su un piano in un’espressione rappresentativa di un’opera. @it
label: a pour projection d’un contenu cartographique d’une expression représentative @fr
definition: Met une œuvre en relation avec une méthode ou un système utilisé pour représenter la surface de la Terre ou d’une sphère céleste sur un plan dans une expression représentative d’une œuvre. @fr
toolkit label: projection d’un contenu cartographique d’une expression représentative @fr
toolkit definition: Méthode ou système utilisé pour représenter la surface de la Terre ou d’une sphère céleste sur un plan dans une expression représentative d’une œuvre. @fr
label: reprezentatīvās izteiksmes projekcija (kartogrāfijā) @lv
definition: Sasaista darbu ar metodi vai sistēmu, ko izmanto zemes vai debess sfēras virsmas attēlošanai plaknē, reprezentatīvā darba izteiksmē. @lv
toolkit label: reprezentatīvās izteiksmes projekcija (kartogrāfijā) @lv
toolkit definition: Metode vai sistēma, ko izmanto zemes vai debess sfēras virsmas attēlošanai plaknē, reprezentatīvā darba izteiksmē. @lv
label: 有代表性内容表达的地图内容的投影 @zh-hans
definition: 将一种作品与用于在一种作品的一种代表性内容表达中一个平面上表示地球或天球表面的方法或系统关联起来。 @zh-hans
toolkit label: 代表性内容表达的地图内容的投影 @zh-hans
toolkit definition: 用于在一种作品的一种代表性内容表达中一个平面上表示地球或天球表面的方法或系统 @zh-hans
has subproperty: P10355
label: temsili anlatımın kartografik içeriğinin projeksiyonu ile ilişkilidir @tr
definition: Bir eseri, bir eserin temsili ifadesinde, yeryüzünün veya bir göksel kürenin yüzeyini bir düzlem üzerinde temsil etmek için kullanılan bir yöntem veya sistemle ilişkilendirir. @tr
toolkit label: temsili anlatımın kartografik içeriğinin projeksiyonu @tr
toolkit definition: Bir eserin temsili anlatımında yeryüzünün veya göksel bir kürenin yüzeyini bir düzlem üzerinde temsil etmek için kullanılan bir yöntem veya sistem. @tr

has project supervisor
status: Published
lexical alias: projectSupervisor.en
definition: Relates a work to a person who is an academic supervisor who is responsible for advising or supervising a project undertaken by a student that results in a work.
toolkit label: project supervisor
toolkit definition: A person who is an academic supervisor who is responsible for advising or supervising a project undertaken by a student that results in a work.
type: Property
domain: C10001
has element type: 2
sub property of: has academic supervisor
label: projektin ohjaaja @fi
definition: Liittää teoksen henkilöön, joka on akateeminen ohjaaja, joka on vastuussa opiskelijan suorittaman, teokseen johtavan projektin neuvonnasta tai ohjaamisesta. @fi
toolkit label: projektin ohjaaja @fi
toolkit definition: Henkilö, joka on akateeminen ohjaaja, joka on vastuussa opiskelijan suorittaman, teokseen johtavan projektin neuvonnasta tai ohjaamisesta. @fi
label: har prosjektveileder @no
definition: Relaterer et verk til en akademisk veileder som er ansvarlig for å veilede eller føre tilsyn med et prosjekt utført av en student og som resulterer i et verk. @no
toolkit label: prosjektveileder @no
toolkit definition: En akademisk veileder som er ansvarlig for å veilede eller føre tilsyn med et prosjekt utført av en student og som resulterer i et verk. @no
label: heeft projectbegeleider @nl
definition: Relateert een werk aan een persoon die is een academische begeleider die verantwoordelijk is voor advisering of begeleiding van een project door een student dat resulteert in een werk. @nl
toolkit label: projectbegeleider @nl
toolkit definition: Een persoon die is een academische begeleider die verantwoordelijk is voor advisering of begeleiding van een project door een student dat resulteert in een werk. @nl
label: له مشرف مشروعات @ar
definition: يربط بين عمل وشخص يكون مشرفا أكاديميا مسئولاً عن تقديم المشورة أو الإشراف على مشروع يقوم به طالب وينتج عنه عمل. @ar
toolkit label: مشرف مشروعات @ar
toolkit definition: شخص يكون مشرفا أكاديميا مسئولاً عن تقديم المشورة أو الإشراف على مشروع يقوم به طالب وينتج عنه عمل. @ar
label: té com a supervisor de projecte @ca
definition: Relaciona una obra amb una persona que és un supervisor acadèmic que és responsable d’assessorar o supervisar un projecte emprès per un estudiant que dona com a resultat una obra. @ca
toolkit label: supervisor de projecte @ca
toolkit definition: Persona que és un supervisor acadèmic que és responsable d’assessorar o supervisar un projecte emprès per un estudiant que dona com a resultat una obra. @ca
label: har vejleder @da
definition: Relaterer et værk til en akademisk vejleder, som er ansvarlig for vejledning og tilsynsføring af et projekt, som udføres af en studerende, og som resulterer i et værk. @da
toolkit label: vejleder @da
toolkit definition: Akademisk vejleder, som er ansvarlig for vejledning og tilsynsføring af et projekt, som udføres af en studerende, og som resulterer i et værk. @da
label: projekti juhendaja @et
definition: Seostab teose akadeemilise juhendajaga, kes vastutab (üli)õpilase täidetava ja teoses väljenduva projekti nõustamise või ülevaatamise eest. @et
toolkit label: projekti juhendaja @et
toolkit definition: Akadeemiline juhendaja, kes vastutab (üli)õpilase täidetava ja teoses väljenduva projekti nõustamise või ülevaatamise eest. @et
label: hat Projektbetreuerin/Projektbetreuer @de
definition: Setzt ein Werk in Beziehung zu einer akademischen Betreuerin/einem akademischen Betreuer (Person), die/der ein Projekt einer Studentin/eines Studenten beaufsichtigt oder betreut, das zu einem Werk führt. @de
toolkit label: Projektbetreuerin/Projektbetreuer @de
toolkit definition: Eine akademische Betreuerin/Ein akademischer Betreuer (Person), die/der ein Projekt einer Studentin/eines Studenten beaufsichtigt oder betreut, das zu einem Werk führt. @de
label: projekt témavezetője a következő: @hu
definition: Hozzákapcsol egy művet egy tudományos témavezető személyhez, aki egy olyan hallgató által vállalt projekt tanácsadója és témavezetője, amely egy művet eredményez. @hu
toolkit label: projekt-témavezető: @hu
toolkit definition: Egy tudományos témavezető személy, aki egy olyan hallgató által vállalt projekt tanácsadója és témavezetője, amely egy művet eredményez. @hu
label: ha come supervisore di progetto @it
definition: Correla un'opera al supervisore accademico responsabile della consulenza o supervisione su un progetto intrapreso da uno studente che produce un'opera. @it
toolkit label: supervisore di progetto @it
toolkit definition: Supervisore accademico responsabile della consulenza o supervisione su un progetto intrapreso da uno studente, che produce un'opera. @it
label: a pour superviseur de projet @fr
definition: Met une œuvre en relation avec une personne qui est un superviseur académique responsable de guider ou de superviser un projet entrepris par un étudiant et entraînant la création d’une œuvre. @fr
toolkit label: superviseur de projet @fr
toolkit definition: Personne qui est un superviseur académique responsable de guider ou de superviser un projet entrepris par un étudiant et entraînant la création d’une œuvre. @fr
label: studiju darba vadītājs @lv
definition: Sasaista darbu ar personu, kura ir akadēmiskais vadītājs, kurš atbildīgs par studenta darba konsultēšanu vai uzraudzīšanu. @lv
toolkit label: studiju darba vadītājs @lv
toolkit definition: Akadēmiskais vadītājs, kurš atbildīgs par studenta darba konsultēšanu vai uzraudzīšanu. @lv
label: 有项目主管 @zh-hans
definition: 将一种作品与负责为导致一种作品的学生所做的项目作咨询和监督的作为学术主管的一个个人关联起来。 @zh-hans
toolkit label: 项目主管 @zh-hans
toolkit definition: 负责为导致一种作品的学生所做的项目作咨询和监督的作为学术主管的一个个人 @zh-hans
has subproperty: P10408
label: proje danışmanı ile ilişkilidir @tr
definition: Bir eseri, bir öğrenci tarafından üstlenilen ve bir eser olarak sonuçlanan bir projeye danışmanlık yapmaktan veya denetlemekten sorumlu olan bir akademik danışman olan kişiyle ilişkilendirir. @tr
toolkit label: Proje yöneticisi @tr
toolkit definition: Bir öğrenci tarafından üstlenilen ve bir çalışma ile sonuçlanan bir projeye danışmanlık yapmaktan veya denetlemekten sorumlu olan akademik danışman olan kişi. @tr

has radio director agent
status: Published
definition: Relates a work to an agent who is a director who is responsible for the general management and supervision of a radio program.
type: Property
domain: C10001
sub property of: has director agent
lexical alias: radioDirectorAgent.en
toolkit label: radio director agent
toolkit definition: An agent who is a director who is responsible for the general management and supervision of a radio program.
toolkit label: agent réalisateur de radio @fr
toolkit definition: Agent réalisateur qui est responsable de la gestion et de la supervision générales d’une émission de radio. @fr
toolkit label: director de radio @es
toolkit definition: Un director responsable de la dirección y supervisión general de un programa de radio. @es
instruction number: 18.5
label: har agent, som er radioregissør @da
definition: Relaterer et værk til en agent, som er instruktør, som er ansvarlig for den generelle ledelse af- og tilsyn med et radioprogram. @da
toolkit label: agent, som er radioregissør @da
toolkit definition: Agent, som er instruktør, som er ansvarlig for den generelle ledelse af- og tilsyn med et radioprogram. @da
definition: Met une œuvre en relation avec un agent réalisateur qui est responsable de la gestion et de la supervision générales d’une émission de radio. @fr
label: có đạo diễn truyền thanh @vi
definition: Liên kết tác phẩm với đạo diễn có trách nhiệm về quản lý và giám sát chung của chương trình truyền thanh. @vi
toolkit label: đạo diễn truyền thanh @vi
toolkit definition: Đạo diễn có trách nhiệm về quản lý và giám sát chung của chương trình truyền thanh. @vi
label: hat Hörfunkregisseurin/Hörfunkregisseur (Akteur) @de
definition: Setzt ein Werk in Beziehung zu einer Regisseurin/einem Regisseur (Akteur), die/der für das allgemeine Management und die Leitung einer Radiosendung verantwortlich ist. @de
toolkit label: Hörfunkregisseurin/Hörfunkregisseur (Akteur) @de
toolkit definition: Eine Regisseurin/ein Regisseur (Akteur), die/der für das allgemeine Management und die Leitung einer Radiosendung verantwortlich ist. @de
label: a pour agent réalisateur de radio @fr
definition: Liittää teoksen toimijaan, joka on ohjaaja, joka on vastuussa radio-ohjelman yleisestä johtamisesta ja valvonnasta. @fi
toolkit label: radio-ohjaaja (toimija) @fi
toolkit definition: Toimija, joka on ohjaaja, joka on vastuussa radio-ohjelman yleisestä johtamisesta ja valvonnasta. @fi
toolkit label: radioregissør (agent) @no
toolkit definition: En agent som er regissør med ansvar for generell ledelse av et radioprogram. @no
label: té com a agent realitzador radiofònic @ca
definition: Relaciona una obra amb un agent que és un realitzador que és responsable de la gestió general i la supervisió d’un programa radiofònic. @ca
toolkit label: agent realitzador radiofònic @ca
toolkit definition: Agent que és un realitzador que és responsable de la gestió general i la supervisió d’un programa radiofònic. @ca
has element type: 2
label: έχει διευθυντή ραδιοφωνικού προγράμματος @el
definition: Συνδέει ένα έργο με έναν διευθυντή υπεύθυνο για τη γενική διεύθυνση και εποπτεία ενός ραδιοφωνικού προγράμματος. @el
toolkit label: διευθυντής ραδιοφωνικού προγράμματος @el
toolkit definition: Ένας διευθυντής υπεύθυνος για τη γενική διεύθυνση και εποπτεία ενός ραδιοφωνικού προγράμματος. @el
label: rádiós rendező ágense a következő: @hu
definition: Hozzákapcsol egy művet egy rendező ágenshez, amely felelős egy rádióműsor általános menedzseléséért és felügyeletéért. @hu
toolkit label: rádiós rendező ágens: @hu
toolkit definition: Egy rendező ágens, amely felelős egy rádióműsor általános menedzseléséért és felügyeletéért. @hu
alternative label: radio director
alternative label: radio-ohjaaja @fi
label: radio-ohjaaja (toimija) @fi
label: har radioregissør (agent) @no
definition: Relaterer et verk til en agent som er regissør med ansvar for generell ledelse av et radioprogram. @no
alternative label: radioregissør @no
label: heeft radioregisseur-actor @nl
definition: Relateert een werk aan een actor die een regisseur is die verantwoordelijk is voor het algemeen beheer en toezicht van een radioprogramma. @nl
toolkit label: radioregisseur-actor @nl
toolkit definition: Een actor die een regisseur is die verantwoordelijk is voor het algemeen beheer en toezicht van een radioprogramma. @nl
label: له وكيل مخرج إذاعي @ar
definition: يربط بين عمل ووكيل يكون مخرجا مسئولاً عن الإدارة العامة والإشراف على برنامج إذاعي. @ar
alternative label: مخرج إذاعي @ar
toolkit label: وكيل مخرج إذاعي @ar
toolkit definition: وكيل يكون مخرجا مسئولاً عن الإدارة العامة والإشراف على برنامج إذاعي. @ar
alternative label: realitzador radiofònic @ca
alternative label: radioinstruktør @da
label: raadiorežissöör (tegija) @et
definition: Seostab teose tegijaga, kes on raadiosaate üldise juhtimise ja juhendamise eest vastutav režissöör. @et
alternative label: raadiorežissöör @et
toolkit label: raadiorežissöör (tegija) @et
toolkit definition: Tegija, kes on raadiosaate üldise juhtimise ja juhendamise eest vastutav režissöör. @et
alternative label: rádiós rendező: @hu
label: ha come regista radiofonico agente @it
definition: Correla un’opera all'agente regista responsabile dell'organizzazione e della supervisione generali di un programma radiofonico. @it
alternative label: regista radiofonico @it
toolkit label: regista radiofonico agente @it
toolkit definition: Agente responsabile dell'organizzazione e della supervisione generali di un programma radiofonico. @it
alternative label: réalisateur de radio @fr
label: radio raidījuma direktors (aģents) @lv
definition: Sasaista darbu ar aģentu - direktors, kurš atbildīgs par radio raidījuma vispārēju vadību un uzraudzību. @lv
toolkit label: radio raidījuma direktors (aģents) @lv
toolkit definition: Aģents - direktors, kurš atbildīgs par radio raidījuma vispārēju vadību un uzraudzību. @lv
alternative label: Hörfunkregisseur @de
toolkit label: 广播导演行为者 @zh-hans

has radio director collective agent
status: Published
lexical alias: radioDirectorCollectiveAgent.en
definition: Relates a work to a collective agent who is a director who is responsible for the general management and supervision of a radio program.
toolkit label: radio director collective agent
toolkit definition: A collective agent who is a director who is responsible for the general management and supervision of a radio program.
type: Property
domain: C10001
has element type: 2
sub property of: has director collective agent
sub property of: has radio director agent
label: radio-ohjaaja (yhteistoimija) @fi
definition: Liittää teoksen yhteistoimijaan, joka on ohjaaja, joka on vastuussa radio-ohjelman yleisestä johtamisesta ja valvonnasta. @fi
toolkit label: radio-ohjaaja (yhteistoimija) @fi
toolkit definition: Yhteistoimija, joka on ohjaaja, joka on vastuussa radio-ohjelman yleisestä johtamisesta ja valvonnasta. @fi
label: har radioregissør (kollektiv agent) @no
definition: Relaterer et verk til en kollektiv agent som er regissør med ansvar for generell ledelse av et radioprogram. @no
toolkit label: radioregissør (kollektiv agent) @no
toolkit definition: En kollektiv agent som er regissør med ansvar for generell ledelse av et radioprogram. @no
label: heeft radioregisseur-collectieve actor @nl
definition: Relateert een werk aan een collectieve actor die een regisseur is die verantwoordelijk is voor het algemeen beheer en toezicht van een radioprogramma. @nl
toolkit label: radioregisseur-collectieve actor @nl
toolkit definition: Een collectieve actor die een regisseur is die verantwoordelijk is voor het algemeen beheer en toezicht van een radioprogramma. @nl
label: له وكيل جماعي مخرج إذاعي @ar
definition: يربط بين عمل ووكيل جماعي يكون مديرًا مسئولاً عن الإدارة العامة والإشراف على برنامج إذاعي. @ar
toolkit label: وكيل جماعي مخرج إذاعي @ar
toolkit definition: وكيل جماعي يكون مديرًا مسئولاً عن الإدارة العامة والإشراف على برنامج إذاعي. @ar
label: té com a agent col·lectiu realitzador radiofònic @ca
definition: Relaciona una obra amb un agent col·lectiu que és un realitzador que és responsable de la gestió i supervisió d’un programa radiofònic. @ca
toolkit label: agent col·lectiu realitzador radiofònic @ca
toolkit definition: Agent col·lectiu que és un realitzador que és responsable de la gestió i supervisió d’un programa radiofònic. @ca
label: har kollektiv agent, som er radioregissør @da
definition: Relaterer et værk til en kollektiv agent, som er instruktør, som er ansvarlig for den generelle ledelse af- og tilsyn med et radioprogram. @da
toolkit label: kollektiv agent, som er radioregissør @da
toolkit definition: Kollektiv agent, som er instruktør, som er ansvarlig for den generelle ledelse af- og tilsyn med et radioprogram. @da
label: raadiorežissöör (kollektiiv) @et
definition: Seostab teose kollektiiviga, kes on raadiosaate üldise juhtimise ja juhendamise eest vastutav režissöör. @et
toolkit label: raadiorežissöör (kollektiiv) @et
toolkit definition: Kollektiiv, kes on raadiosaate üldise juhtimise ja juhendamise eest vastutav režissöör. @et
label: hat Hörfunkregisseurin/Hörfunkregisseur (Gemeinschaftlicher Akteur) @de
definition: Setzt ein Werk in Beziehung zu einer Regiesseurin/einem Regisseur (Gemeinschaftlicher Akteur), die/der für das allgemeine Management und die Leitung einer Hörfunksendung verantwortlich ist. @de
toolkit label: Hörfunkregisseurin/Hörfunkregisseur (Gemeinschaftlicher Akteur) @de
toolkit definition: Eine Produzentin/Ein Produzent (Gemeinschaftlicher Akteur), die/der für das allgemeine Management und die Leitung einer Hörfunksendung verantwortlich ist. @de
label: rádiós rendező kollektív ágense a következő: @hu
definition: Hozzákapcsol egy művet egy rendező kollektív ágenshez, amely felelős egy rádióműsor általános menedzseléséért és felügyeletéért. @hu
toolkit label: rádiós rendező kollektív ágens: @hu
toolkit definition: Egy rendező kollektív ágens, amely felelős egy rádióműsor általános menedzseléséért és felügyeletéért. @hu
label: ha come regista radiofonico agente collettivo @it
definition: Correla un'opera all'agente collettivo regista responsabile della gestione generale e della supervisione di un programma radiofonico. @it
toolkit label: regista radiofonico agente collettivo @it
toolkit definition: Agente collettivo regista responsabile della gestione generale e della supervisione di un programma radiofonico. @it
label: a pour agent collectif réalisateur de radio @fr
definition: Met une œuvre en relation avec un agent collectif réalisateur qui est responsable de la gestion et de la supervision générales d’une émission de radio. @fr
toolkit label: agent collectif réalisateur de radio @fr
toolkit definition: Agent collectif réalisateur qui est responsable de la gestion et de la supervision générales d’une émission de radio. @fr
label: radio raidījuma direktors (grupa) @lv
definition: Sasaista darbu ar grupu - direktors, kura atbildīga par radio raidījuma vispārēju vadību un uzraudzību. @lv
toolkit label: radio raidījuma direktors (grupa) @lv
toolkit definition: Grupa - direktors, kura atbildīga par radio raidījuma vispārēju vadību un uzraudzību. @lv
label: 有广播导演集体行为者 @zh-hans
definition: 将一种作品与作为一个导演并负责广播节目的总体管理和监督的一个集体行为者关联起来。 @zh-hans
toolkit label: 广播导演集体行为者 @zh-hans
toolkit definition: 作为一个导演并负责广播节目的总体管理和监督的一个集体行为者 @zh-hans
has subproperty: has radio director corporate body
has subproperty: has radio director family
has subproperty: P10466
label: radyo yönetmeni kolektif temsilcisi ile ilişkilidir @tr
definition: Bir eseri, bir radyo programının genel yönetimi ve denetiminden sorumlu yönetmen olan kolektif bir temsilci ile ilişkilendirir. @tr
toolkit label: radyo yönetmeni kolektif temsilci @tr
toolkit definition: Bir radyo programının genel yönetimi ve denetiminden sorumlu yönetmen olan kolektif bir temsilci. @tr

has radio director corporate body
status: Published
lexical alias: radioDirectorCorporateBody.en
definition: Relates a work to a corporate body who is a director who is responsible for the general management and supervision of a radio program.
toolkit label: radio director corporate body
toolkit definition: A corporate body who is a director who is responsible for the general management and supervision of a radio program.
type: Property
domain: C10001
has element type: 2
sub property of: has director corporate body
sub property of: has radio director collective agent
label: radio-ohjaaja (yhteisö) @fi
definition: Liittää teoksen yhteisöön, joka on ohjaaja, joka on vastuussa radio-ohjelman yleisestä johtamisesta ja valvonnasta. @fi
toolkit label: radio-ohjaaja (yhteisö) @fi
toolkit definition: Yhteisö, joka on ohjaaja, joka on vastuussa radio-ohjelman yleisestä johtamisesta ja valvonnasta. @fi
label: har radioregissør (korporasjon) @no
definition: Relaterer et verk til en korporasjon som er regissør med ansvar for generell ledelse av et radioprogram. @no
toolkit label: radioregissør (korporasjon) @no
toolkit definition: En korporasjon som er regissør med ansvar for generell ledelse av et radioprogram. @no
label: heeft radioregisseur-corporatie @nl
definition: Relateert een werk aan een corporatie die een regisseur is die verantwoordelijk is voor het algemeen beheer en toezicht van een radioprogramma. @nl
toolkit label: radioregisseur-corporatie @nl
toolkit definition: Een corporatie die een regisseur is die verantwoordelijk is voor het algemeen beheer en toezicht van een radioprogramma. @nl
label: له هيئة مخرجة إذاعية @ar
definition: يربط بين عمل وهيئة تكون مديرة مسئولة عن الإدارة العامة والإشراف على برنامج إذاعي. @ar
toolkit label: هيئة مخرجة إذاعية @ar
toolkit definition: هيئة تكون مديرة مسئولة عن الإدارة العامة والإشراف على برنامج إذاعي. @ar
label: té com a entitat corporativa realitzadora radiofònica @ca
definition: Relaciona una obra amb una entitat corporativa que és un realitzador que és responsable de la gestió i supervisió d’un programa radiofònic. @ca
toolkit label: entitat corporativa realitzadora radiofònica @ca
toolkit definition: Entitat corporativa que és un realitzador que és responsable de la gestió i supervisió d’un programa radiofònic. @ca
label: har korporation, som er radioregissør @da
definition: Relaterer et værk til en korporation, som er instruktør, som er ansvarlig for den generelle ledelse af- og tilsyn med et radioprogram. @da
toolkit label: korporation, som er radioregissør @da
toolkit definition: Korporation, som er instruktør, som er ansvarlig for den generelle ledelse af- og tilsyn med et radioprogram. @da
label: raadiorežissöör (asutus) @et
definition: Seostab teose asutusega, kes on raadiosaate üldise juhtimise ja juhendamise eest vastutav režissöör. @et
toolkit label: raadiorežissöör (asutus) @et
toolkit definition: Asutus, kes on raadiosaate üldise juhtimise ja juhendamise eest vastutav režissöör. @et
label: hat Hörfunkregisseurin/Hörfunkregisseur (Körperschaft) @de
definition: Setzt ein Werk in Beziehung zu einer Regisseurin/einem Regisseur (Körperschaft), die/der für das allgemeine Management und die Leitung einer Hörfunksendung verantwortlich ist. @de
toolkit label: Hörfunkregisseurin/Hörfunkregisseur (Körperschaft) @de
toolkit definition: Eine Regisseurin/Ein Regisseur (Körperschaft), die/der für das allgemeine Management und die Leitung einer Hörfunksendung verantwortlich ist. @de
label: rádiós rendező testülete a következő: @hu
definition: Hozzákapcsol egy művet egy rendező testülethez, amely felelős egy rádióműsor általános menedzseléséért és felügyeletéért. @hu
toolkit label: rádiós rendező testület: @hu
toolkit definition: Egy rendező testület, amely felelős egy rádióműsor általános menedzseléséért és felügyeletéért. @hu
label: ha come regista radiofonico ente @it
definition: Correla un'opera a un ente regista responsabile della gestione generale e della supervisione di un programma radiofonico. @it
toolkit label: regista radiofonico ente @it
toolkit definition: Ente regista responsabile della gestione generale e della supervisione di un programma radiofonico. @it
label: a pour collectivité réalisatrice de radio @fr
definition: Met une œuvre en relation avec une collectivité réalisatrice qui est responsable de la gestion et de la supervision générales d’une émission de radio. @fr
toolkit label: collectivité réalisatrice de radio @fr
toolkit definition: Collectivité réalisatrice qui est responsable de la gestion et de la supervision générales d’une émission de radio. @fr
label: radio raidījuma direktors (institūcija) @lv
definition: Sasaista darbu ar institūciju - direktors, kura atbildīga par radio raidījuma vispārēju vadību un uzraudzību. @lv
toolkit label: radio raidījuma direktors (institūcija) @lv
toolkit definition: Institūcija - direktors, kura atbildīga par radio raidījuma vispārēju vadību un uzraudzību. @lv
label: 有广播导演团体 @zh-hans
definition: 将一种作品与作为一个导演并负责广播节目的总体管理和监督的一个团体关联起来。 @zh-hans
toolkit label: 广播导演团体 @zh-hans
toolkit definition: 作为一个导演并负责广播节目的总体管理和监督的一个团体 @zh-hans
has subproperty: P10513
label: radyo yönetmeni tüzel kişisi ile ilişkilidir @tr
definition: Bir eseri, bir radyo programının genel yönetim ve denetiminden sorumlu yönetici olan tüzel kişi ile ilişkilendirir. @tr
toolkit label: radyo yönetmeni tüzel kişi @tr
toolkit definition: Bir radyo programının genel yönetim ve denetiminden sorumlu yönetici olan tüzel kişilik. @tr

has radio director family
status: Published
lexical alias: radioDirectorFamily.en
definition: Relates a work to a family who is a director who is responsible for the general management and supervision of a radio program.
toolkit label: radio director family
toolkit definition: A family who is a director who is responsible for the general management and supervision of a radio program.
type: Property
domain: C10001
has element type: 2
sub property of: has director family
sub property of: has radio director collective agent
label: radio-ohjaaja (suku) @fi
definition: Liittää teoksen sukuun, joka on ohjaaja, joka on vastuussa radio-ohjelman yleisestä johtamisesta ja valvonnasta. @fi
toolkit label: radio-ohjaaja (suku) @fi
toolkit definition: Suku, joka on ohjaaja, joka on vastuussa radio-ohjelman yleisestä johtamisesta ja valvonnasta. @fi
label: har radioregissør (familie) @no
definition: Relaterer et verk til en familie som er regissør med ansvar for generell ledelse av et radioprogram. @no
toolkit label: radioregissør (familie) @no
toolkit definition: En familie som er regissør med ansvar for generell ledelse av et radioprogram. @no
label: heeft radioregisseur-familie @nl
definition: Relateert een werk aan een familie die een regisseur is die verantwoordelijk is voor het algemeen beheer en toezicht van een radioprogramma. @nl
toolkit label: radioregisseur-familie @nl
toolkit definition: Een familie die een regisseur is die verantwoordelijk is voor het algemeen beheer en toezicht van een radioprogramma. @nl
label: له عائلة مخرجة إذاعية @ar
definition: يربط بين عمل وعائلة تكون مديرة مسئولة عن الإدارة العامة والإشراف على برنامج إذاعي. @ar
toolkit label: عائلة مخرجة إذاعية @ar
toolkit definition: عائلة تكون مديرة مسئولة عن الإدارة العامة والإشراف على برنامج إذاعي. @ar
label: té com a família realitzadora radiofònica @ca
definition: Relaciona una obra amb una família que és un realitzador que és responsable de la gestió general i la supervisió d’un programa radiofònic. @ca
toolkit label: família realitzadora radiofònica @ca
toolkit definition: Família que és un realitzador que és responsable de la gestió general i la supervisió d’un programa radiofònic. @ca
label: har familie, som er radioregissør @da
definition: Relaterer et værk til en familie, som er instruktør, som er ansvarlig for den generelle ledelse af- og tilsyn med et radioprogram. @da
toolkit label: familie, som er radioregissør @da
toolkit definition: Familie, som er instruktør, som er ansvarlig for den generelle ledelse af- og tilsyn med et radioprogram. @da
label: raadiorežissöör (perekond) @et
definition: Seostab teose perekonnaga, kes on raadiosaate üldise juhtimise ja juhendamise eest vastutav režissöör. @et
toolkit label: raadiorežissöör (perekond) @et
toolkit definition: Perekond, kes on raadiosaate üldise juhtimise ja juhendamise eest vastutav režissöör. @et
label: hat Hörfunkregisseurin/Hörfunkregisseur (Familie) @de
definition: Setzt ein Werk in Beziehung zu einer Regisseurin/einem Regisseur (Familie), die/der für das allgemeine Management und die Leitung einer Hörfunksendung verantwortlich ist. @de
toolkit label: Hörfunkregisseurin/Hörfunkregisseur (Familie) @de
toolkit definition: Eine Regisseurin/Ein Regisseur (Familie), die/der für das allgemeine Management und die Leitung einer Hörfunksendung verantwortlich ist. @de
label: rádiós rendező családja a következő: @hu
definition: Hozzákapcsol egy művet egy rendező családhoz, amely felelős egy rádióműsor általános menedzseléséért és felügyeletéért. @hu
toolkit label: rádiós rendező család: @hu
toolkit definition: Egy rendező család, amely felelős egy rádióműsor általános menedzseléséért és felügyeletéért. @hu
label: ha come regista radiofonico famiglia @it
definition: Correla un'opera alla famiglia regista responsabile della gestione generale e della supervisione di un programma radiofonico. @it
toolkit label: regista radiofonico famiglia @it
toolkit definition: Famiglia regista responsabile della gestione generale e della supervisione di un programma radiofonico. @it
label: a pour famille réalisatrice de radio @fr
definition: Met une œuvre en relation avec une famille réalisatrice qui est responsable de la gestion et de la supervision générales d’une émission de radio. @fr
toolkit label: famille réalisatrice de radio @fr
toolkit definition: Famille réalisatrice qui est responsable de la gestion et de la supervision générales d’une émission de radio. @fr
label: radio raidījuma direktors (dzimta/ģimene) @lv
definition: Sasaista darbu ar dzimtu/ģimeni - direktors, kura atbildīga par radio raidījuma vispārēju vadību un uzraudzību. @lv
toolkit label: radio raidījuma direktors (dzimta/ģimene) @lv
toolkit definition: Dzimta/ģimene - direktors, kura atbildīga par radio raidījuma vispārēju vadību un uzraudzību. @lv
label: 有广播导演家族 @zh-hans
definition: 将一种作品与作为一个导演并负责广播节目的总体管理和监督的一个家族关联起来。 @zh-hans
toolkit label: 广播导演家族 @zh-hans
toolkit definition: 作为一个导演并负责广播节目的总体管理和监督的一个家族 @zh-hans
has subproperty: P10560
label: radyo yönetmeni ailesi ile ilişkilidir @tr
definition: Bir eseri, bir radyo programının genel yönetim ve denetiminden sorumlu bir yönetmen bir aileyle ilişkilendirir. @tr
toolkit label: radyo yönetmeni aile @tr
toolkit definition: Bir radyo programının genel yönetim ve denetiminden sorumlu yönetici aile. @tr

has radio director person
status: Published
lexical alias: radioDirectorPerson.en
definition: Relates a work to a person who is a director who is responsible for the general management and supervision of a radio program.
toolkit label: radio director person
toolkit definition: A person who is a director who is responsible for the general management and supervision of a radio program.
type: Property
domain: C10001
has element type: 2
sub property of: has director person
sub property of: has radio director agent
label: radio-ohjaaja (henkilö) @fi
definition: Liittää teoksen henkilöön, joka on ohjaaja, joka on vastuussa radio-ohjelman yleisestä johtamisesta ja valvonnasta. @fi
toolkit label: radio-ohjaaja (henkilö) @fi
toolkit definition: Henkilö, joka on ohjaaja, joka on vastuussa radio-ohjelman yleisestä johtamisesta ja valvonnasta. @fi
label: har radioregissør (person) @no
definition: Relaterer et verk til en person som er regissør med ansvar for generell ledelse av et radioprogram. @no
toolkit label: radioregissør (person) @no
toolkit definition: En person som er regissør med ansvar for generell ledelse av et radioprogram. @no
label: heeft radioregisseur-persoon @nl
definition: Relateert een werk aan een persoon die een regisseur is die verantwoordelijk is voor het algemeen beheer en toezicht van een radioprogramma. @nl
toolkit label: radioregisseur-persoon @nl
toolkit definition: Een persoon die een regisseur is die verantwoordelijk is voor het algemeen beheer en toezicht van een radioprogramma. @nl
label: له شخص مخرج إذاعي @ar
definition: يربط بين عمل وشخص يكون مديرًا مسئولاً عن الإدارة العامة والإشراف على برنامج إذاعي. @ar
toolkit label: شخص مخرج إذاعي @ar
toolkit definition: شخص يكون مديرًا مسئولاً عن الإدارة العامة والإشراف على برنامج إذاعي. @ar
label: té com a persona realitzadora radiofònica @ca
definition: Relaciona una obra amb una persona que és un realitzador que és responsable de la gestió general i la supervisió d’un programa radiofònic. @ca
toolkit label: persona realitzadora radiofònica @ca
toolkit definition: Persona que és un realitzador que és responsable de la gestió general i la supervisió d’un programa radiofònic. @ca
label: har person, som er radioregissør @da
definition: Relaterer et værk til en person, som er instruktør, som er ansvarlig for den generelle ledelse af- og tilsyn med et radioprogram. @da
toolkit label: person, som er radioregissør @da
toolkit definition: Person, som er instruktør, som er ansvarlig for den generelle ledelse af- og tilsyn med et radioprogram. @da
label: raadiorežissöör (isik) @et
definition: Seostab teose isikuga, kes on raadiosaate üldise juhtimise ja juhendamise eest vastutav režissöör. @et
toolkit label: raadiorežissöör (isik) @et
toolkit definition: Isik, kes on raadiosaate üldise juhtimise ja juhendamise eest vastutav režissöör. @et
label: hat Hörfunkregisseurin/Hörfunkregisseur (Person) @de
definition: Setzt ein Werk in Beziehung zu einer Regisseurin/einem Regisseur (Person), die/der für das allgemeine Management und die Leitung einer Hörfunksendung verantwortlich ist. @de
toolkit label: Hörfunkregisseurin/Hörfunkregisseur (Person) @de
toolkit definition: Eine Regisseurin/Ein Regisseur (Person), die/der für das allgemeine Management und die Leitung einer Hörfunksendung verantwortlich ist. @de
label: rádiós rendező személye a következő: @hu
definition: Hozzákapcsol egy művet egy rendező személyhez, aki felelős egy rádióműsor általános menedzseléséért és felügyeletéért. @hu
toolkit label: rádiós rendező személy: @hu
toolkit definition: Egy rendező személy, aki felelős egy rádióműsor általános menedzseléséért és felügyeletéért. @hu
label: ha come regista radiofonico persona @it
definition: Correla un'opera alla persona regista responsabile della gestione generale e della supervisione di un programma radiofonico. @it
toolkit label: regista radiofonico persona @it
toolkit definition: Persona regista responsabile della gestione generale e della supervisione di un programma radiofonico. @it
label: a pour personne réalisatrice de radio @fr
definition: Met une œuvre en relation avec une personne réalisatrice qui est responsable de la gestion et de la supervision générales d’une émission de radio. @fr
toolkit label: personne réalisatrice de radio @fr
toolkit definition: Personne réalisatrice qui est responsable de la gestion et de la supervision générales d’une émission de radio. @fr
label: radio raidījuma direktors (persona) @lv
definition: Sasaista darbu ar personu - direktors, kura atbildīga par radio raidījuma vispārēju vadību un uzraudzību. @lv
toolkit label: radio raidījuma direktors (persona) @lv
toolkit definition: Persona - direktors, kura atbildīga par radio raidījuma vispārēju vadību un uzraudzību. @lv
label: 有广播导演个人 @zh-hans
definition: 将一种作品与作为一个导演并负责广播节目的总体管理和监督的一个个人关联起来。 @zh-hans
toolkit label: 广播导演个人 @zh-hans
toolkit definition: 作为一个导演并负责广播节目的总体管理和监督的一个个人 @zh-hans
has subproperty: P10419
label: radyo yönetmeni kişisi ile ilişkilidir @tr
definition: Bi eseri, bir radyo programının genel yönetim ve denetiminden sorumlu yönetmen olan kişiyle ilişkilendirir. @tr
toolkit label: radyo yönetmeni olan kişi @tr
toolkit definition: Bir radyo programının genel yönetim ve denetiminden sorumlu olan yönetmen kişi. @tr

is adapted as radio program work
status: Published
definition: Relates a work to a work that is a radio program based on another work.
type: Property
domain: C10001
sub property of: is adapted as work
lexical alias: adaptedAsRadioProgramWork.en
toolkit label: adapted as radio program work
toolkit definition: A work that is a radio program based on another work.
toolkit label: adapté en émission de radio (œuvre) @fr
toolkit definition: Œuvre qui consiste en une émission de radio basée sur une autre œuvre. @fr
toolkit label: adaptada como programa de radio (obra) @es
toolkit definition: Un programa de radio basado en la obra fuente. @es
instruction number: 24.5
label: er bearbejdet til radioprogramværk @da
definition: Relaterer et værk til et radioprogram, baseret på et oprindeligt værk. @da
toolkit label: bearbejdet til radioprogramværk @da
toolkit definition: Radioprogram, baseret på et oprindeligt værk. @da
definition: Met une œuvre en relation avec une œuvre qui consiste en une émission de radio basée sur une autre œuvre. @fr
label: được phỏng theo như là chương trình truyền thanh (tác phẩm) @vi
definition: Liên kết tác phẩm với chương trình truyền thanh dựa trên tác phẩm nguồn. @vi
toolkit label: được phỏng theo như là chương trình truyền thanh (tác phẩm) @vi
toolkit definition: Chương trình truyền thanh dựa trên tác phẩm nguồn. @vi
label: ist bearbeitet als Hörfunksendung (Werk) @de
definition: Setzt ein Werk in Beziehung zu einer Hörfunksendung (Werk), die auf einem anderen Werk basiert. @de
toolkit label: Bearbeitet als Hörfunksendung (Werk) @de
toolkit definition: Eine Hörfunksendung (Werk), die auf einem anderen Werk basiert. @de
label: est adapté en émission de radio (œuvre) @fr
definition: Liittää teoksen teokseen, joka on toiseen teokseen perustuva radio-ohjelma. @fi
toolkit label: radiosovitus (teos) @fi
toolkit definition: Teos, joka on toiseen teokseen perustuva radio-ohjelma. @fi
toolkit label: bearbeidet som radioprogram (verk) @no
toolkit definition: Et radioprogram basert på et kildeverk. @no
label: és adaptat com a obra de programa radiofònic @ca
definition: Relaciona una obra amb una obra que és un programa radiofònic basat en una altra obra. @ca
toolkit label: adaptat com a obra de programa radiofònic @ca
toolkit definition: Obra que és un programa radiofònic basat en una altra obra. @ca
has element type: 2
label: είναι προσαρμοσμένο ως ραδιοφωνικό πρόγραμμα (έργο) @el
definition: Συνδέει ένα έργο με ένα ραδιοφωνικό πρόγραμμα βασισμένο σε ένα έργο-πηγή. @el
toolkit label: προσαρμοσμένο ως ραδιοφωνικό πρόγραμμα (έργο) @el
toolkit definition: Ένα ραδιοφωνικό πρόγραμμα βασισμένο σε ένα έργο-πηγή. @el
label: rádióműsormű-átdolgozása a következő: @hu
definition: Hozzákapcsol egy művet egy műhöz, egy rádióműsorhoz, amely egy másik művön alapul. @hu
toolkit label: rádióműsormű-átdolgozása: @hu
toolkit definition: Egy mű, egy rádióműsor, amely egy másik műre alapul. @hu
label: radiosovitus (teos) @fi
label: er bearbeidet som radioprogram (verk) @no
definition: Relaterer et verk til et radioprogram basert på et kildeverk. @no
label: is bewerkt als radioprogrammawerk @nl
definition: Relateert een werk aan een werk dat is een radioprogramma gebaseerd op een ander werk. @nl
toolkit label: bewerkt als radioprogrammawerk @nl
toolkit definition: Een werk dat is een radioprogramma gebaseerd op een ander werk. @nl
label: هو معالج كعمل برنامج إذاعي @ar
definition: يربط عمل بعمل عبارة عن برنامج إذاعي مبني على عمل آخر. @ar
toolkit label: معالج كعمل برنامج إذاعي @ar
toolkit definition: عمل عبارة عن برنامج إذاعي مبني على عمل آخر. @ar
label: adapteeritud raadiosaatena (teos) @et
definition: Seostab teose allikteosel põhineva raadiosaatega. @et
toolkit label: adapteeritud raadiosaatena (teos) @et
toolkit definition: Allikteosel põhinev raadiosaade. @et
label: è adattata come opera in forma di programma radiofonico @it
definition: Correla un'opera a un programma radiofonico basato su un'opera di partenza. @it
toolkit label: adattata come opera in forma di programma radiofonico @it
toolkit definition: Programma radiofonico basato su un'opera di partenza. @it
label: ir adaptēts kā radio raidījums (darbs) @lv
definition: Sasaista darbu ar darbu, kas ir radioraidījums veidots pēc pamatdarba. @lv
toolkit label: adaptēts kā darbs: radio raidījums @lv
toolkit definition: Radioraidījums veidots pēc pamatdarba. @lv
label: 被改编为广播节目作品 @zh-hans
definition: 将一种作品与作为基于另一种作品的一种广播节目的一种作品关联起来。 @zh-hans
toolkit label: 被改编为广播节目作品 @zh-hans
toolkit definition: 作为基于另一种作品的一种广播节目的一种作品 @zh-hans
has subproperty: P10076
label: radyo programı eseri olarak uyarlanmıştır @tr
definition: Bir eseri, bir başka eserden uyarlanan radyo programı olan bir eserle ilişkilendirir. @tr
toolkit label: Radyo programı çalışması olarak uyarlanan @tr
toolkit definition: Başka bir eserden uyarlanan radyo programı olan bir çalışma @tr

has radio program music work
status: Published
definition: Relates a work to a work that is a musical work that complements a work that is a radio program.
type: Property
domain: C10001
sub property of: has music work
lexical alias: radioProgramMusicWork.en
toolkit label: radio program music work
toolkit definition: A work that is a musical work that complements a work that is a radio program.
toolkit label: musique d’émission de radio (œuvre) @fr
toolkit definition: Œuvre musicale qui complète une œuvre consistant en une émission de radio. @fr
toolkit label: música de programa radial (obra) @es
toolkit definition: Una obra musical utilizada en un programa de radio. @es
instruction number: 24.5
label: har radioprogrammusikværk @da
definition: Relaterer et værk til et musikværk, som komplementerer et værk, som er et radioprogram. @da
toolkit label: radioprogrammusikværk @da
toolkit definition: Musikværk, som komplementerer et værk, som er et radioprogram. @da
definition: Met une œuvre en relation avec une œuvre musicale qui complète une œuvre consistant en une émission de radio. @fr
label: là âm nhạc chương trình truyền thanh (tác phẩm) @vi
definition: Liên kết tác phẩm với tác phẩm âm nhạc được sử dụng trong chương trình truyền thanh. @vi
toolkit label: âm nhạc chương trình truyền thanh (tác phẩm) @vi
toolkit definition: Tác phẩm âm nhạc được sử dụng trong chương trình truyền thanh. @vi
label: hat Hörfunksendungsmusik (Werk) @de
definition: Setzt ein Werk in Beziehung zu einem Musikwerk, das eine Hörfunksendung (Werk) ergänzt. @de
toolkit label: Hörfunksendungsmusik (Werk) @de
toolkit definition: Ein Musikwerk, das eine Hörfunksendung (Werk) ergänzt. @de
label: a pour musique d’émission de radio (œuvre) @fr
definition: Liittää teoksen musiikkiteokseen, joka täydentää teosta, joka on radio-ohjelma. @fi
toolkit label: radio-ohjelman musiikki (teos) @fi
toolkit definition: Musiikkiteos, joka täydentää teosta, joka on radio-ohjelma. @fi
toolkit label: radiomusikk (verk) @no
toolkit definition: Et musikalsk verk som utfyller et radioprogram. @no
label: té com a obra de música de programa radiofònic @ca
definition: Relaciona una obra amb una obra que és una obra musical que complementa una obra que és un programa radiofònic. @ca
toolkit label: obra de música de programa radiofònic @ca
toolkit definition: Obra que és una obra musical que complementa una obra que és un programa radiofònic. @ca
has element type: 2
label: είναι μουσική ραδιοφωνικού προγράμματος (έργο) @el
definition: Συνδέει ένα έργο με ένα μουσικό έργο το οποίο χρησιμοποιείται σε ένα ραδιοφωνικό πρόγραμμα. @el
toolkit label: μουσική ραδιοφωνικού προγράμματος (έργο) @el
toolkit definition: Ένα μουσικό έργο το οποίο χρησιμοποιείται σε ένα ραδιοφωνικό πρόγραμμα. @el
label: rádióműsorzene-műve a következő: @hu
definition: Hozzákapcsol egy művet egy zeneműhöz, amely kiegészít egy rádióműsor-művet. @hu
toolkit label: rádióműsor-zenemű @hu
toolkit definition: Egy zenemű, amely kiegészít egy rádióműsor-művet. @hu
label: radio-ohjelman musiikki (teos) @fi
label: har radiomusikk (verk) @no
definition: Relaterer et verk til et musikalsk verk som utfyller et radioprogram. @no
label: heeft radioprogrammamuziek-werk @nl
definition: Relateert een werk aan een muziekwerk dat een werk complementeert dat een radioprogramma is. @nl
toolkit label: radioprogrammamuziek-werk @nl
toolkit definition: Een muziekwerk dat een werk complementeert dat een radioprogramma is. @nl
label: له عمل موسيقي لبرنامج إذاعي @ar
definition: يربط عمل بعمل موسيقي يكمل عملًا عبارة عن برنامج إذاعي. @ar
toolkit label: عمل موسيقى لبرنامج إذاعي @ar
toolkit definition: عمل موسيقي يكمل عملًا عبارة عن برنامج إذاعي. @ar
label: raadiosaate muusika (teos) @et
definition: Seostab teose muusikateosega, mis täiendab raadiosaatena esinevat teost. @et
toolkit label: raadiosaate muusika (teos) @et
toolkit definition: Muusikateos, mis täiendab raadiosaatena esinevat teost. @et
label: ha come musica per programma radiofonico opera @it
definition: Correla un’opera a un’opera musicale che completa un’opera che è un programma radiofonico. @it
toolkit label: musica per programma radiofonico opera @it
toolkit definition: Opera musicale che completa un’opera che è un programma radiofonico. @it
label: darbs: radio raidījuma mūzika @lv
definition: Sasaista darbu ar mūzikas darbu, kas papildina darbu, kas ir radio raidījums. @lv
toolkit label: darbs: radio raidījuma mūzika @lv
toolkit definition: Muzikas darbs, kas papildina darbu, kas ir radio raidījums. @lv
label: 有广播节目音乐作品 @zh-hans
definition: 将一种作品与作为一种音乐作品并补充作为一种广播节目的一种作品的一种作品关联起来。 @zh-hans
toolkit label: 广播节目音乐作品 @zh-hans
toolkit definition: 作为一种音乐作品并补充作为一种广播节目的一种作品的一种作品 @zh-hans
has subproperty: P10243
label: radyo programı müziği eseri ile ilişkilidir @tr
definition: Bir eseri, radyo programı olan bir eseri tamamlayan bir müzik eseri olan eserle ilişkilendirir. @tr
toolkit label: radyo programı müziği @tr
toolkit definition: Bir radyo programını tamamlayan bir müzik eseri olan bir eser. @tr

has radio producer agent
status: Published
definition: Relates a work to an agent who is a producer who is responsible for most of the business aspects of a radio program.
type: Property
domain: C10001
sub property of: has producer agent
lexical alias: radioProducerAgent.en
toolkit label: radio producer agent
toolkit definition: An agent who is a producer who is responsible for most of the business aspects of a radio program.
toolkit label: agent producteur de radio @fr
toolkit definition: Agent producteur qui est responsable de la majeure partie des aspects commerciaux d’une émission de radio. @fr
toolkit label: productor de radio @es
toolkit definition: Un productor responsable de la mayor parte de los aspectos empresariales relacionados con un programa de radio. @es
instruction number: 18.5
label: har agent, som er radioproducer @da
definition: Relaterer et værk til en agent, som er en producer, som er ansvarlig for størstedelen af de forretningsmæssige aspekter ved et radioprogram. @da
toolkit label: agent, som er radioproducer @da
toolkit definition: Agent, som er en producer, som er ansvarlig for størstedelen af de forretningsmæssige aspekter ved et radioprogram. @da
definition: Met une œuvre en relation avec un agent producteur qui est responsable de la majeure partie des aspects commerciaux d’une émission de radio. @fr
label: có nhà sản xuất truyền thanh @vi
definition: Liên kết tác phẩm với nhà sản xuất có trách nhiệm về phần lớn khía cạnh kinh doanh của chương trình thanh @vi
toolkit label: nhà sản xuất truyền thanh @vi
toolkit definition: Nhà sản xuất có trách nhiệm về phần lớn khía cạnh kinh doanh của chương trình thanh @vi
label: hat Hörfunkproduzentin/Hörfunkproduzenten (Akteur) @de
definition: Setzt ein Werk in Beziehung zu einer Produzentin/einem Produzenten (Akteur), die/der für die meisten geschäftlichen Aspekte einer Hörfunksendung verantwortlich ist. @de
toolkit label: Hörfunkproduzentin/Hörfunkproduzent (Akteur) @de
toolkit definition: Eine Produzentin/Ein Produzent (Akteur), die/der für die meisten geschäftlichen Aspekte einer Hörfunksendung verantwortlich ist. @de
label: a pour agent producteur de radio @fr
definition: Liittää teoksen toimijaan, joka on tuottaja, joka on vastuussa suurimmasta osasta radio-ohjelman liiketoiminnasta. @fi
toolkit label: radiotuottaja (toimija) @fi
toolkit definition: Toimija, joka on tuottaja, joka on vastuussa suurimmasta osasta radio-ohjelman liiketoiminnasta. @fi
toolkit label: radioprodusent (agent) @no
toolkit definition: En agent som er en produsent med ansvar for de fleste forretningsmessige aspektene ved et radioprogram. @no
label: té com a agent productor radiofònic @ca
definition: Relaciona una obra amb un agent que és un productor que és responsable de la majoria dels aspectes comercials d’un programa radiofònic. @ca
toolkit label: agent productor radiofònic @ca
toolkit definition: Agent que és un productor que és responsable de la majoria dels aspectes comercials d’un programa radiofònic. @ca
has element type: 2
label: έχει ραδιοφωνικό παραγωγό @el
definition: Συνδέει ένα έργο με έναν παραγωγό υπεύθυνο για τις περισσότερες επιχειρηματικές πτυχές ενός ραδιοφωνικού προγράμματος. @el
toolkit label: ραδιοφωνικός παραγωγός @el
toolkit definition: Ένας παραγωγός υπεύθυνος για τις περισσότερες επιχειρηματικές πτυχές ενός ραδιοφωνικού προγράμματος. @el
label: rádiós producer ágense a következő: @hu
definition: Hozzákapcsol egy művet egy producer ágenshez, amely felelős egy rádióműsor üzleti vonatkozásainak a zöméért. @hu
toolkit label: rádióproducer ágens: @hu
toolkit definition: Egy producer ágens, aki felelős egy rádióműsor üzleti vonatkozásainak a zöméért. @hu
alternative label: radio producer
alternative label: radiotuottaja @fi
label: radiotuottaja (toimija) @fi
label: har radioprodusent (agent) @no
definition: Relaterer et verk til en agent som er en produsent med ansvar for de fleste forretningsmessige aspektene ved et radioprogram. @no
alternative label: radioprodusent @no
label: heeft radioproducent-actor @nl
definition: Relateert een werk aan een actor die een producer is die verantwoordelijk is voor het merendeel van de zakelijke aspecten van een radioprogramma. @nl
toolkit label: radioproducent-actor @nl
toolkit definition: Een actor die een producer is die verantwoordelijk is voor het merendeel van de zakelijke aspecten van een radioprogramma. @nl
label: له وكيل منتج إذاعي @ar
definition: يربط بين عمل ووكيل عبارة عن منتج مسئول عن معظم جوانب العمل في برنامج إذاعي. @ar
alternative label: منتج إذاعي @ar
toolkit label: وكيل منتح إذاعي @ar
toolkit definition: وكيل عبارة عن منتج مسئول عن معظم جوانب العمل في برنامج إذاعي. @ar
alternative label: productor radiofònic @ca
alternative label: radioproducer @da
label: raadioprodutsent (tegija) @et
definition: Seostab teose tegijaga, kes produtsendina vastutab enamiku äriliste aspektide eest raadiosaate tootmisel. @et
alternative label: raadioprodutsent @et
toolkit label: raadioprodutsent (tegija) @et
toolkit definition: Tegija, kes produtsendina vastutab enamiku äriliste aspektide eest raadiosaate tootmisel. @et
alternative label: rádióproducer: @hu
label: ha come produttore radiofonico agente @it
definition: Correla un'opera all'agente produttore responsabile della maggior parte degli aspetti commerciali di un programma radiofonico. @it
alternative label: produttore radiofonico @it
toolkit label: produttore radiofonico agente @it
toolkit definition: Agente produttore responsabile della maggior parte degli aspetti commerciali di un programma radiofonico. @it
alternative label: producteur de radio @fr
label: radio raidījuma producents (aģents) @lv
definition: Sasaista darbu ar aģentu - producents, kurš ir atbildīgs par radio raidījuma darbības/biznesa aspektiem. @lv
toolkit label: radio raidījuma producents (aģents) @lv
toolkit definition: Aģents - producents, kurš ir atbildīgs par radio raidījuma darbības/biznesa aspektiem. @lv
alternative label: Hörfunkproduzent @de
toolkit label: 广播制作者行为者 @zh-hans

has radio producer collective agent
status: Published
lexical alias: radioProducerCollectiveAgent.en
definition: Relates a work to a collective agent who is a producer who is responsible for most of the business aspects of a radio program.
toolkit label: radio producer collective agent
toolkit definition: A collective agent who is a producer who is responsible for most of the business aspects of a radio program.
type: Property
domain: C10001
has element type: 2
sub property of: has producer collective agent
sub property of: has radio producer agent
label: radiotuottaja (yhteistoimija) @fi
definition: Liittää teoksen yhteistoimijaan, joka on tuottaja, joka on vastuussa suurimmasta osasta radio-ohjelman liiketoiminnasta. @fi
toolkit label: radiotuottaja (yhteistoimija) @fi
toolkit definition: Yhteistoimija, joka on tuottaja, joka on vastuussa suurimmasta osasta radio-ohjelman liiketoiminnasta. @fi
label: har radioprodusent (kollektiv agent) @no
definition: Relaterer et verk til en kollektiv agent som er en produsent med ansvar for de fleste forretningsmessige aspektene ved et radioprogram. @no
toolkit label: radioprodusent (kollektiv agent) @no
toolkit definition: En kollektiv agent som er en produsent med ansvar for de fleste forretningsmessige aspektene ved et radioprogram. @no
label: heeft radioproducent-collectieve actor @nl
definition: Relateert een werk aan een collectieve actor die een producer is die verantwoordelijk is voor het merendeel van de zakelijke aspecten van een radioprogramma. @nl
toolkit label: radioproducent-collectieve actor @nl
toolkit definition: Een collectieve actor die een producer is die verantwoordelijk is voor het merendeel van de zakelijke aspecten van een radioprogramma. @nl
label: له وكيل جماعي منتج إذاعي @ar
definition: يربط بين عمل ووكيل جماعي يكون منتجًا مسئولاً عن معظم جوانب العمل في برنامج إذاعي. @ar
toolkit label: وكيل جماعي منتج إذاعي @ar
toolkit definition: وكيل جماعي يكون منتجًا مسئولاً عن معظم جوانب العمل في برنامج إذاعي. @ar
label: té com a agent col·lectiu productor radiofònic @ca
definition: Relaciona una obra amb un agent col·lectiu que és un productor que és responsable de la majoria dels aspectes comercials d’un programa radiofònic. @ca
toolkit label: agent col·lectiu productor radiofònic @ca
toolkit definition: Agent col·lectiu que és un productor que és responsable de la majoria dels aspectes comercials d’un programa radiofònic. @ca
label: har kollektiv agent, som er radioproducer @da
definition: Relaterer et værk til en kollektiv agent, som er en producer, som er ansvarlig for størstedelen af de forretningsmæssige aspekter ved et radioprogram. @da
toolkit label: kollektiv agent, som er radioproducer @da
toolkit definition: Kollektiv agent, som er en producer, som er ansvarlig for størstedelen af de forretningsmæssige aspekter ved et radioprogram. @da
label: raadioprodutsent (kollektiiv) @et
definition: Seostab teose kollektiiviga, kes produtsendina vastutab enamiku äriliste aspektide eest raadiosaate tootmisel. @et
toolkit label: raadioprodutsent (kollektiiv) @et
toolkit definition: Kollektiiv, kes produtsendina vastutab enamiku äriliste aspektide eest raadiosaate tootmisel. @et
label: hat Hörfunkproduzentin/Hörfunkproduzenten (Gemeinschaftlicher Akteur) @de
definition: Setzt ein Werk in Beziehung zu einer Produzentin/einem Produzenten (Gemeinschaftlicher Akteur), die/der für die meisten geschäftlichen Aspekte einer Hörfunksendung verantwortlich ist. @de
toolkit label: Hörfunkproduzentin/Hörfunkproduzent (Gemeinschaftlicher Akteur) @de
toolkit definition: Eine Produzentin/Ein Produzent (Gemeinschaftlicher Akteur), die/der für die meisten geschäftlichen Aspekte einer Hörfunksendung verantwortlich ist. @de
label: rádióproducer kollektív ágense a következő: @hu
definition: Hozzákapcsol egy művet egy producer kollektív ágenshez, amely felelős egy rádióműsor üzleti vonatkozásainak a zöméért. @hu
toolkit label: rádióproducer kollektív ágens: @hu
toolkit definition: Egy producer kollektív ágens, amely felelős egy rádióműsor üzleti vonatkozásainak a zöméért. @hu
label: ha come produttore radiofonico agente collettivo @it
definition: Correla un'opera all'agente collettivo produttore responsabile della gestione della maggior parte degli aspetti commerciali di un programma radiofonico. @it
toolkit label: produttore radiofonico agente collettivo @it
toolkit definition: Agente collettivo produttore responsabile della gestione della maggior parte degli aspetti commerciali di un programma radiofonico. @it
label: a pour agent collectif producteur de radio @fr
definition: Met une œuvre en relation avec un agent collectif producteur qui est responsable de la majeure partie des aspects commerciaux d’une émission de radio. @fr
toolkit label: agent collectif producteur de radio @fr
toolkit definition: Agent collectif producteur qui est responsable de la majeure partie des aspects commerciaux d’une émission de radio. @fr
label: radio raidījuma producents (grupa) @lv
definition: Sasaista darbu ar grupu - producents, kurš ir atbildīgs par radio raidījuma darbības/biznesa aspektiem. @lv
toolkit label: radio raidījuma producents (grupa) @lv
toolkit definition: Grupa - producents, kurš ir atbildīgs par radio raidījuma darbības/biznesa aspektiem. @lv
label: 有广播制作者集体行为者 @zh-hans
definition: 将一种作品与作为制作者并负责广播节目的大部分商业运作的一个集体行为者关联起来。 @zh-hans
toolkit label: 广播制作者集体行为者 @zh-hans
toolkit definition: 作为制作者并负责广播节目的大部分商业运作的一个集体行为者 @zh-hans
has subproperty: has radio producer corporate body
has subproperty: has radio producer family
has subproperty: P10470
label: radyo yapımcısı kolektif temsilcisi ile ilişkilidir @tr
definition: Bir eseri, bir radyo programının ticari yönlerinin çoğundan sorumlu yapımcı olan kolektif bir temsilci ile ilişkilendirir. @tr
toolkit label: radyo yapımcısı kolektif temsilci @tr
toolkit definition: Bir radyo programının ticari yönlerinin çoğundan sorumlu olan bir yapımcı olan kolektif bir temsilci. @tr

has radio producer corporate body
status: Published
lexical alias: radioProducerCorporateBody.en
definition: Relates a work to a corporate body who is a producer who is responsible for most of the business aspects of a radio program.
toolkit label: radio producer corporate body
toolkit definition: A corporate body who is a producer who is responsible for most of the business aspects of a radio program.
type: Property
domain: C10001
has element type: 2
sub property of: has producer corporate body
sub property of: has radio producer collective agent
label: radiotuottaja (yhteisö) @fi
definition: Liittää teoksen yhteisöön, joka on tuottaja, joka on vastuussa suurimmasta osasta radio-ohjelman liiketoiminnasta. @fi
toolkit label: radiotuottaja (yhteisö) @fi
toolkit definition: Yhteisö, joka on tuottaja, joka on vastuussa suurimmasta osasta radio-ohjelman liiketoiminnasta. @fi
label: har radioprodusent (korporasjon) @no
definition: Relaterer et verk til en korporasjon som er en produsent med ansvar for de fleste forretningsmessige aspektene ved et radioprogram. @no
toolkit label: radioprodusent (korporasjon) @no
toolkit definition: En korporasjon som er en produsent med ansvar for de fleste forretningsmessige aspektene ved et radioprogram. @no
label: heeft radioproducent-corporatie @nl
definition: Relateert een werk aan een corporatie die een producer is die verantwoordelijk is voor het merendeel van de zakelijke aspecten van een radioprogramma. @nl
toolkit label: radioproducent-corporatie @nl
toolkit definition: Een corporatie die een producer is die verantwoordelijk is voor het merendeel van de zakelijke aspecten van een radioprogramma. @nl
label: له هيئة منتجة إذاعية @ar
definition: يربط بين عمل وهيئة تكون منتجة مسئولة عن معظم جوانب العمل في برنامج إذاعي. @ar
toolkit label: هيئة منتجة إذاعية @ar
toolkit definition: هيئة تكون منتجة مسئولة عن معظم جوانب العمل في برنامج إذاعي. @ar
label: té com a entitat corporativa productora radiofònica @ca
definition: Relaciona una obra amb una entitat corporativa que és un productor que és responsable de la majoria dels aspectes comercials d’un programa radiofònic. @ca
toolkit label: entitat corporativa productora radiofònica @ca
toolkit definition: Entitat corporativa que és un productor que és responsable de la majoria dels aspectes comercials d’un programa radiofònic. @ca
label: har korporation, som er radioproducer @da
definition: Relaterer et værk til en korporation, som er en producer, som er ansvarlig for størstedelen af de forretningsmæssige aspekter ved et radioprogram. @da
toolkit label: korporation, som er radioproducer @da
toolkit definition: Korporation, som er en producer, som er ansvarlig for størstedelen af de forretningsmæssige aspekter ved et radioprogram. @da
label: raadioprodutsent (asutus) @et
definition: Seostab teose asutusega, kes produtsendina vastutab enamiku äriliste aspektide eest raadiosaate tootmisel. @et
toolkit label: raadioprodutsent (asutus) @et
toolkit definition: Asutus, kes produtsendina vastutab enamiku äriliste aspektide eest raadiosaate tootmisel. @et
label: hat Hörfunkproduzentin/Hörfunkproduzenten (Körperschaft) @de
definition: Setzt ein Werk in Beziehung zu einer Produzentin/einem Produzenten (Körperschaft), die/der für die meisten geschäftlichen Aspekte einer Hörfunksendung verantwortlich ist. @de
toolkit label: Hörfunkproduzentin/Hörfunkproduzent (Körperschaft) @de
toolkit definition: Eine Produzentin/Ein Produzent (Körperschaft), die/der für die meisten geschäftlichen Aspekte einer Hörfunksendung verantwortlich ist. @de
label: rádióproducer testülete a következő: @hu
definition: Hozzákapcsol egy művet egy producer testülethez, amely felelős egy rádióműsor üzleti vonatkozásainak a zöméért. @hu
toolkit label: rádióproducer testület: @hu
toolkit definition: Egy producer testület, amely felelős egy rádióműsor üzleti vonatkozásainak a zöméért. @hu
label: ha come produttore radiofonico ente @it
definition: Correla un'opera a un ente produttore responsabile della gestione della maggior parte degli aspetti commerciali di un programma radiofonico. @it
toolkit label: produttore radiofonico ente @it
toolkit definition: Ente produttore responsabile della gestione della maggior parte degli aspetti commerciali di un programma radiofonico. @it
label: a pour collectivité productrice de radio @fr
definition: Met une œuvre en relation avec une collectivité productrice qui est responsable de la majeure partie des aspects commerciaux d’une émission de radio. @fr
toolkit label: collectivité productrice de radio @fr
toolkit definition: Collectivité productrice qui est responsable de la majeure partie des aspects commerciaux d’une émission de radio. @fr
label: radio raidījuma producents (institūcija) @lv
definition: Sasaista darbu ar institūciju - producents, kurš ir atbildīgs par radio raidījuma darbības/biznesa aspektiem. @lv
toolkit label: radio raidījuma producents (institūcija) @lv
toolkit definition: Institūcija - producents, kurš ir atbildīgs par radio raidījuma darbības/biznesa aspektiem. @lv
label: 有广播制作者团体 @zh-hans
definition: 将一种作品与作为制作者并负责广播节目的大部分商业运作的一个团体关联起来。 @zh-hans
toolkit label: 广播制作者团体 @zh-hans
toolkit definition: 作为制作者并负责广播节目的大部分商业运作的一个团体 @zh-hans
has subproperty: P10517
label: radyo yapımcısı tüzel kişisi ile ilişkilidir @tr
definition: Bir eseri, bir radyo programının ticari yönlerinin çoğundan sorumlu olan bir yapımcı olan tüzel kişi ile ilişkilendirir. @tr
toolkit label: radyo yapımcısı tüzel kişi @tr
toolkit definition: Bir radyo programının ticari yönlerinin çoğundan sorumlu olan yapımcı olan bir tüzel kişi. @tr

has radio producer family
status: Published
lexical alias: radioProducerFamily.en
definition: Relates a work to a family who is a producer who is responsible for most of the business aspects of a radio program.
toolkit label: radio producer family
toolkit definition: A family who is a producer who is responsible for most of the business aspects of a radio program.
type: Property
domain: C10001
has element type: 2
sub property of: has producer family
sub property of: has radio producer collective agent
label: radiotuottaja (suku) @fi
definition: Liittää teoksen sukuun, joka on tuottaja, joka on vastuussa suurimmasta osasta radio-ohjelman liiketoiminnasta. @fi
toolkit label: radiotuottaja (suku) @fi
toolkit definition: Suku, joka on tuottaja, joka on vastuussa suurimmasta osasta radio-ohjelman liiketoiminnasta. @fi
label: har radioprodusent (familie) @no
definition: Relaterer et verk til en familie som er en produsent med ansvar for de fleste forretningsmessige aspektene ved et radioprogram. @no
toolkit label: radioprodusent (familie) @no
toolkit definition: En familie som er en produsent med ansvar for de fleste forretningsmessige aspektene ved et radioprogram. @no
label: heeft radioproducent-familie @nl
definition: Relateert een werk aan een familie die een producer is die verantwoordelijk is voor het merendeel van de zakelijke aspecten van een radioprogramma. @nl
toolkit label: radioproducent-familie @nl
toolkit definition: Een familie die een producer is die verantwoordelijk is voor het merendeel van de zakelijke aspecten van een radioprogramma. @nl
label: له عائلة منتجة إذاعية @ar
definition: يربط بين عمل وعائلة تكون منتجة مسئولة عن معظم جوانب العمل في برنامج إذاعي. @ar
toolkit label: عائلة منتجة إذاعية @ar
toolkit definition: عائلة تكون منتجة مسئولة عن معظم جوانب العمل في برنامج إذاعي. @ar
label: té com a família productora radiofònica @ca
definition: Relaciona una obra amb una família que és un productor que és responsable de la majoria dels aspectes comercials d’un programa radiofònic. @ca
toolkit label: família productora radiofònica @ca
toolkit definition: Família que és un productor que és responsable de la majoria dels aspectes comercials d’un programa radiofònic. @ca
label: har familie, som er radioproducer @da
definition: Relaterer et værk til en familie, som er en producer, som er ansvarlig for størstedelen af de forretningsmæssige aspekter ved et radioprogram. @da
toolkit label: familie, som er radioproducer @da
toolkit definition: Familie, som er en producer, som er ansvarlig for størstedelen af de forretningsmæssige aspekter ved et radioprogram. @da
label: raadioprodutsent (perekond) @et
definition: Seostab teose perekonnaga, kes produtsendina vastutab enamiku äriliste aspektide eest raadiosaate tootmisel. @et
toolkit label: raadioprodutsent (perekond) @et
toolkit definition: Perekond, kes produtsendina vastutab enamiku äriliste aspektide eest raadiosaate tootmisel. @et
label: hat Hörfunkproduzentin/Hörfunkproduzenten (Familie) @de
definition: Setzt ein Werk in Beziehung zu einer Produzentin/einem Produzenten (Familie), die/der für die meisten geschäftlichen Aspekte einer Hörfunksendung verantwortlich ist. @de
toolkit label: Hörfunkproduzentin/Hörfunkproduzent (Familie) @de
toolkit definition: Eine/Produzentin/Ein Produzent (Familie), die/der für die meisten geschäftlichen Aspekte einer Hörfunksendung verantwortlich ist. @de
label: rádióproducer családja a következő: @hu
definition: Hozzákapcsol egy művet egy producer családhoz, amely felelős egy rádióműsor üzleti vonatkozásainak a zöméért. @hu
toolkit label: rádióproducer család: @hu
toolkit definition: Egy producer család, amely felelős egy rádióműsor üzleti vonatkozásainak a zöméért. @hu
label: ha come produttore radiofonico famiglia @it
definition: Correla un'opera alla famiglia produttore responsabile della gestione della maggior parte degli aspetti commerciali di un programma radiofonico. @it
toolkit label: produttore radiofonico famiglia @it
toolkit definition: Famiglia produttore responsabile della gestione della maggior parte degli aspetti commerciali di un programma radiofonico. @it
label: a pour famille productrice de radio @fr
definition: Met une œuvre en relation avec une famille productrice qui est responsable de la majeure partie des aspects commerciaux d’une émission de radio. @fr
toolkit label: famille productrice de radio @fr
toolkit definition: Famille productrice qui est responsable de la majeure partie des aspects commerciaux d’une émission de radio. @fr
label: radio raidījuma producents (dzimta/ģimene) @lv
definition: Sasaista darbu ar dzimtu/ģimeni - producents, kurš ir atbildīgs par radio raidījuma darbības/biznesa aspektiem. @lv
toolkit label: radio raidījuma producents (dzimta/ģimene) @lv
toolkit definition: Dzimta/ģimene - producents, kurš ir atbildīgs par radio raidījuma darbības/biznesa aspektiem. @lv
label: 有广播制作者家族 @zh-hans
definition: 将一种作品与作为制作者并负责广播节目的大部分商业运作的一个家族关联起来。 @zh-hans
toolkit label: 广播制作者家族 @zh-hans
toolkit definition: 作为制作者并负责广播节目的大部分商业运作的一个家族 @zh-hans
has subproperty: P10564
label: radyo yapımcısı ailesi ile ilişkilidir @tr
definition: Bir eseri, bir radyo programının ticari yönlerinin çoğundan sorumlu olan yapımcı bir aileyle ilişkilendirir. @tr
toolkit label: radyo yapımcı aile @tr
toolkit definition: Bir radyo programının ticari yönlerinin çoğundan sorumlu olan bir yapımcı olan bir aile. @tr

has radio producer person
status: Published
lexical alias: radioProducerPerson.en
definition: Relates a work to a person who is a producer who is responsible for most of the business aspects of a radio program.
toolkit label: radio producer person
toolkit definition: A person who is a producer who is responsible for most of the business aspects of a radio program.
type: Property
domain: C10001
has element type: 2
sub property of: has producer person
sub property of: has radio producer agent
label: radiotuottaja (henkilö) @fi
definition: Liittää teoksen henkilöön, joka on tuottaja, joka on vastuussa suurimmasta osasta radio-ohjelman liiketoiminnasta. @fi
toolkit label: radiotuottaja (henkilö) @fi
toolkit definition: Henkilö, joka on tuottaja, joka on vastuussa suurimmasta osasta radio-ohjelman liiketoiminnasta. @fi
label: har radioprodusent (person) @no
definition: Relaterer et verk til en person som er en produsent med ansvar for de fleste forretningsmessige aspektene ved et radioprogram. @no
toolkit label: radioprodusent (person) @no
toolkit definition: En person som er en produsent med ansvar for de fleste forretningsmessige aspektene ved et radioprogram. @no
label: heeft radioproducent-persoon @nl
definition: Relateert een werk aan een persoon die een producer is die verantwoordelijk is voor het merendeel van de zakelijke aspecten van een radioprogramma. @nl
toolkit label: radioproducent-persoon @nl
toolkit definition: Een persoon die een producer is die verantwoordelijk is voor het merendeel van de zakelijke aspecten van een radioprogramma. @nl
label: له شخص منتج إذاعي @ar
definition: يربط بين عمل وشخص يكون منتجًا مسئولاً عن معظم جوانب العمل في برنامج إذاعي. @ar
toolkit label: شخص منتج إذاعي @ar
toolkit definition: شخص يكون منتجًا مسئولاً عن معظم جوانب العمل في برنامج إذاعي. @ar
label: té com a persona productora radiofònica @ca
definition: Relaciona una obra amb una persona que és un productor que és responsable de la majoria dels aspectes comercials d’un programa radiofònic. @ca
toolkit label: persona productora radiofònica @ca
toolkit definition: Persona que és un productor que és responsable de la majoria dels aspectes comercials d’un programa radiofònic. @ca
label: har person, som er radioproducer @da
definition: Relaterer et værk til en person, som er en producer, som er ansvarlig for størstedelen af de forretningsmæssige aspekter ved et radioprogram. @da
toolkit label: person, som er radioproducer @da
toolkit definition: Person, som er en producer, som er ansvarlig for størstedelen af de forretningsmæssige aspekter ved et radioprogram. @da
label: raadioprodutsent (isik) @et
definition: Seostab teose isikuga, kes produtsendina vastutab enamiku äriliste aspektide eest raadiosaate tootmisel. @et
toolkit label: raadioprodutsent (isik) @et
toolkit definition: Isik, kes produtsendina vastutab enamiku äriliste aspektide eest raadiosaate tootmisel. @et
label: hat Hörfunkproduzentin/Hörfunkproduzenten (Person) @de
definition: Setzt ein Werk in Beziehung zu einer Produzentin/einem Produzenten (Person), die/der für die meisten geschäftlichen Aspekte einer Hörfunksendung verantwortlich ist. @de
toolkit label: Hörfunkproduzentin/Hörfunkproduzent (Person) @de
toolkit definition: Eine Produzentin/Ein Produzent (Person), die/der für die meisten geschäftlichen Aspekte einer Hörfunksendung verantwortlich ist. @de
label: rádióproducer személye a következő: @hu
definition: Hozzákapcsol egy művet egy producer személyhez, aki felelős egy rádióműsor üzleti vonatkozásainak a zöméért. @hu
toolkit label: rádióproducer személy: @hu
toolkit definition: Egy producer személy, aki felelős egy rádióműsor üzleti vonatkozásainak a zöméért. @hu
label: ha come produttore radiofonico persona @it
definition: Correla un'opera alla persona produttore responsabile della gestione della maggior parte degli aspetti commerciali di un programma radiofonico. @it
toolkit label: produttore radiofonico persona @it
toolkit definition: Persona produttore responsabile della gestione della maggior parte degli aspetti commerciali di un programma radiofonico. @it
label: a pour personne productrice de radio @fr
definition: Met une œuvre en relation avec une personne productrice qui est responsable de la majeure partie des aspects commerciaux d’une émission de radio. @fr
toolkit label: personne productrice de radio @fr
toolkit definition: Personne productrice qui est responsable de la majeure partie des aspects commerciaux d’une émission de radio. @fr
label: radio raidījuma producents (persona) @lv
definition: Sasaista darbu ar personu - producents, kurš ir atbildīgs par radio raidījuma darbības/biznesa aspektiem. @lv
toolkit label: radio raidījuma producents (persona) @lv
toolkit definition: Persona - producents, kurš ir atbildīgs par radio raidījuma darbības/biznesa aspektiem. @lv
label: 有广播制作者个人 @zh-hans
definition: 将一种作品与作为制作者并负责广播节目的大部分商业运作的一个个人关联起来。 @zh-hans
toolkit label: 广播制作者个人 @zh-hans
toolkit definition: 作为制作者并负责广播节目的大部分商业运作的一个个人 @zh-hans
has subproperty: P10423
label: radyo yapımcısı kişisi ile ilişkilidir @tr
definition: Bir eseri, bir radyo programının ticari yönlerinin çoğunu yönetmekten sorumlu yapımcı olan kişiyle ilişkilendirir. @tr
toolkit label: Radyo yapımcısı olan kişi @tr
toolkit definition: Bir radyo programının ticari yönlerinin çoğunu yönetmekten sorumlu olan yapımcı kişi. @tr

is adapted as radio script work
status: Published
definition: Relates a work to a work that consists of a script for a radio program, based on another work.
type: Property
domain: C10001
sub property of: is adapted as work
lexical alias: adaptedAsRadioScriptWork.en
toolkit label: adapted as radio script work
toolkit definition: A work that consists of a script for a radio program, based on another work.
toolkit label: adapté en script radiophonique (œuvre) @fr
toolkit definition: Œuvre qui consiste en un script d’émission de radio basé sur une autre œuvre. @fr
toolkit label: adaptada como guión radiofónico (obra) @es
toolkit definition: Una obra que consiste en el guión para un programa de radio, basado en la obra fuente. @es
instruction number: 24.5
label: er bearbejdet til radiomanuskriptværk @da
definition: Relaterer et værk til et værk, som består af et manuskript til et radioprogram, baseret på et oprindeligt værk. @da
toolkit label: bearbejdet til radiomanuskriptværk @da
toolkit definition: Værk, som består af et manuskript til et radioprogram, baseret på et oprindeligt værk. @da
definition: Met une œuvre en relation avec une œuvre qui consiste en un script d’émission de radio basé sur une autre œuvre. @fr
label: được phỏng theo như là kịch bản truyền thanh (tác phẩm) @vi
definition: Liên kết tác phẩm với tác phẩm có chứa kịch bản của chương trình truyền thanh, dựa trên tác phẩm nguồn. @vi
toolkit label: được phỏng theo như là kịch bản truyền thanh (tác phẩm) @vi
toolkit definition: Tác phẩm có chứa kịch bản của chương trình truyền thanh, dựa trên tác phẩm nguồn. @vi
label: ist bearbeitet als Hörfunkskript (Werk) @de
definition: Setzt ein Werk in Beziehung zu einem Werk, das aus einem Skript für eine Hörfunksendung besteht, das auf einem anderen Werk basiert. @de
toolkit label: Bearbeitet als Hörfunkskript (Werk) @de
toolkit definition: Ein Werk, das aus einem Skript für eine Hörfunksendung besteht, das auf einem anderen Werk basiert. @de
label: est adapté en script radiophonique (œuvre) @fr
definition: Liittää teoksen teokseen, joka koostuu toiseen teokseen perustuvasta radio-ohjelman käsikirjoituksesta. @fi
toolkit label: sovitettu radiokäsikirjoitukseksi (teos) @fi
toolkit definition: Teos, joka koostuu toiseen teokseen perustuvasta radio-ohjelman käsikirjoituksesta. @fi
toolkit label: bearbeidet som manus for radio (verk) @no
toolkit definition: Et verk som består av et manuskript for et radioprogram, basert på et kildeverk. @no
label: és adaptat com a obra de guió radiofònic @ca
definition: Relaciona una obra amb una obra que consisteix en un guió d’un programa radiofònic basat en una altra obra. @ca
toolkit label: adaptat com a obra de guió radiofònic @ca
toolkit definition: Obra que consisteix en un guió d’un programa radiofònic basat en una altra obra. @ca
has element type: 2
label: είναι προσαρμοσμένο ως ραδιοφωνικό σενάριο (έργο) @el
definition: Συνδέει ένα έργο με ένα έργο που συνίσταται από ένα σενάριο για ένα ραδιοφωνικό πρόγραμμα βασισμένο σε ένα έργο-πηγή. @el
toolkit label: προσαρμοσμένο ως ραδιοφωνικό σενάριο (έργο) @el
toolkit definition: Ένα έργο που συνίσταται από ένα σενάριο για ένα ραδιοφωνικό πρόγραμμα βασισμένο σε ένα έργο-πηγή. @el
label: rádiósszövegkönyv-feldolgozása a következő: @hu
definition: Hozzákapcsol egy művet egy műhöz, amely egy másik művön alapuló rádióműsor forgatókönyvéből áll. @hu
toolkit label: rádiósszövegkönyv-feldolgozása a következő: @hu
toolkit definition: Egy mű, amely egy másik művön alapuló rádióműsor forgatókönyvéből áll. @hu
label: sovitettu radiokäsikirjoitukseksi (teos) @fi
label: er bearbeidet som manus for radio (verk) @no
definition: Relaterer et verk til et verk som består av et manuskript for et radioprogram, basert på et kildeverk. @no
label: is bewerkt als radioscriptwerk @nl
definition: Relateert een werk aan een werk dat bestaat uit een script voor een radioprogramma, gebaseerd op een ander werk. @nl
toolkit label: bewerkt als radioscriptwerk @nl
toolkit definition: Een werk dat bestaat uit een script voor een radioprogramma, gebaseerd op een ander werk. @nl
label: هو معالج كعمل نص إذاعي @ar
definition: يربط عمل بعمل يتكون من نص لبرنامج إذاعي، مبني على عمل آخر . @ar
toolkit label: معالج كعمل نص إذاعي @ar
toolkit definition: عمل يتكون من نص لبرنامج إذاعي، مبني على عمل آخر . @ar
label: adapteeritud raadiostsenaariumina (teos) @et
definition: Seostab teose teosega, mis on allikteosel põhinev stsenaarium raadiosaate jaoks. @et
toolkit label: adapteeritud raadiostsenaariumina (teos) @et
toolkit definition: Teos, mis on allikteosel põhinev stsenaarium raadiosaate jaoks. @et
label: è adattata come opera in forma di sceneggiatura radiofonica @it
definition: Correla un’opera a un’opera che consiste di una sceneggiatura per un programma radiofonico, basata su un’opera di partenza. @it
toolkit label: adattata come opera in forma di sceneggiatura radiofonica @it
toolkit definition: Opera che consiste di una sceneggiatura per un programma radiofonico, basata su un’opera di partenza. @it
label: ir adaptēts kā radio raidījuma scenārijs (darbs) @lv
definition: Sasaista darbu ar darbu - radio raidījuma scenārijs, kas veidots pēc pamatdarba. @lv
toolkit label: adaptēts kā darbs: radio raidījuma scenārijs @lv
toolkit definition: Darbs - radio raidījuma scenārijs, kas veidots pēc pamatdarba. @lv
label: 被改编为广播文稿作品 @zh-hans
definition: 将一种作品与由基于另一种作品的一种广播节目的文稿组成的一种作品关联起来。 @zh-hans
toolkit label: 被改编为广播文稿作品 @zh-hans
toolkit definition: 由基于另一种作品的一种广播节目的文稿组成的一种作品 @zh-hans
has subproperty: P10098
label: radyo metni eseri olarak uyarlanmıştır @tr
definition: Bir eseri, başka bir eserden uyarlanan bir radyo metninden oluşan bir eserle ilişkilendirir. @tr
toolkit label: Radyo metni çalışması olarak uyarlanan @tr
toolkit definition: Başka bir esere dayalı olarak bir radyo programı için yazılmış bir senaryodan oluşan eser. @tr

has radio script work
status: Published
definition: Relates a work to a work that is textual work that complements a work that is a radio program.
type: Property
domain: C10001
sub property of: has text work
lexical alias: radioScriptWork.en
toolkit label: radio script work
toolkit definition: A work that is a textual work that complements a work that is a radio program.
toolkit label: script radiophonique (œuvre) @fr
toolkit definition: Œuvre textuelle qui complète une œuvre consistant en une émission de radio. @fr
toolkit label: guión radiofónico (obra) @es
toolkit definition: Una obra que proporciona el texto para un programa de radio. @es
instruction number: 24.5
label: har radiomanuskriptværk @da
definition: Relaterer et værk til et værk, som er et tekstværk, som komplementerer et værk, som er et radioprogram. @da
toolkit label: radiomanuskriptværk @da
toolkit definition: Værk, som er et tekstværk, som komplementerer et værk, som er et radioprogram. @da
definition: Met une œuvre en relation avec une œuvre textuelle qui complète une œuvre consistant en une émission de radio. @fr
label: là kịch bản truyền thanh (tác phẩm) @vi
definition: Liên kết tác phẩm với tác phẩm cung cấp văn bản cho chương trình truyền thanh. @vi
toolkit label: kịch bản truyền thanh (tác phẩm) @vi
toolkit definition: Tác phẩm cung cấp văn bản cho chương trình truyền thanh. @vi
label: hat Hörfunkskript (Werk) @de
definition: Setzt ein Werk in Beziehung zu einem textlichen Werk, das eine Hörfunksendung (Werk) ergänzt. @de
toolkit label: Hörfunkskript (Werk) @de
toolkit definition: Ein textliches Werk, das eine Hörfunksendung (Werk) ergänzt. @de
label: a pour script radiophonique (œuvre) @fr
definition: Liittää teoksen teokseen, joka on tekstiteos, joka täydentää teosta, joka on radio-ohjelma. @fi
toolkit label: radio-ohjelman käsikirjoitus (teos) @fi
toolkit definition: Teos, joka on joka on tekstiteos, joka täydentää teosta, joka on radio-ohjelma. @fi
toolkit label: radiomanus (verk) @no
toolkit definition: Et verk som er et tekstlig verk som utfyller et verk som er et radioprogram. @no
label: té com a obra de guió radiofònic @ca
definition: Relaciona una obra amb una obra que és una obra textual que complementa una obra que és un programa radiofònic. @ca
toolkit label: obra de guió radiofònic @ca
toolkit definition: Obra que és una obra textual que complementa una obra que és un programa radiofònic. @ca
has element type: 2
label: είναι ραδιοφωνικό σενάριο (έργο) @el
definition: Συνδέει ένα έργο με ένα έργο το οποίο παρέχει κείμενο για ένα ραδιοφωνικό πρόγραμμα. @el
toolkit label: ραδιοφωνικό σενάριο (έργο) @el
toolkit definition: Ένα έργο το οποίο παρέχει κείμενο για ένα ραδιοφωνικό πρόγραμμα. @el
label: rádiószövegkönyv-műve a következő: @hu
definition: Hozzákapcsol egy művet egy szöveges műhöz, amely kiegészít egy rádióműsor művet. @hu
toolkit label: rádiós szövegkönyvmű @hu
toolkit definition: Egy szöveges mű, amely kiegészít egy rádióműsor művet. @hu
label: radio-ohjelman käsikirjoitus (teos) @fi
label: har radiomanus (verk) @no
definition: Relaterer et verk til et verk som er et tekstlig verk som utfyller et verk som er et radioprogram. @no
label: heeft radioscriptwerk @nl
definition: geen nieuwe vert nodig, bevatte tikfout in Engelse versie, geen inhoudelijke wijziging. @nl
toolkit label: radioscriptwerk @nl
toolkit definition: geen nieuwe vert nodig, bevatte tikfout in Engelse versie, geen inhoudelijke wijziging. @nl
label: له عمل نص إذاعي @ar
definition: يربط عمل بعمل عبارة عن عمل نصي يكمل عملًا عبارة عن برنامج إذاعي. @ar
toolkit label: عمل نص إذاعي @ar
toolkit definition: عمل عبارة عن عمل نصي يكمل عملًا عبارة عن برنامج إذاعي. @ar
label: raadiostsenaarium (teos) @et
definition: Seostab teose tekstteosega, mis täiendab raadioteost. @et
toolkit label: raadiostsenaarium (teos) @et
toolkit definition: Tekstteos, mis täiendab raadioteost. @et
label: ha come sceneggiatura radiofonica opera @it
definition: Correla un’opera a un’opera testuale che completa un’opera che è un programma radiofonico. @it
toolkit label: sceneggiatura radiofonica opera @it
toolkit definition: Opera testuale che completa un’opera che è un programma radiofonico. @it
label: darbs: radio raidījuma scenārijs @lv
definition: Sasaista darbu ar darbu, kas ir realizēts kā teksts, kas papildina darbu, kas ir radio raidījums. @lv
toolkit label: darbs: radio raidījuma scenārijs @lv
toolkit definition: Darbs, kas ir realizēts kā teksts, kas papildina darbu, kas ir radio raidījums. @lv
label: 有广播文稿作品 @zh-hans
definition: 将一种作品与补充作为一种广播节目的一种作品的作为一种文字作品的一种作品关联起来。 @zh-hans
toolkit label: 广播文稿作品 @zh-hans
toolkit definition: 补充作为一种广播节目的一种作品的作为一种文字作品的一种作品 @zh-hans
has subproperty: P10162
label: radyo metni eseri ile ilişkilidir @tr
definition: Bir eseri, radyo programı olan bir eseri tamamlayan metinsel bir eserle ilişkilendirir. @tr
toolkit label: radyo metni eseri @tr
toolkit definition: Bir radyo programı olan bir eseri tamamlayan metinsel bir çalışma. @tr

has rapporteur agent
status: Published
type: Property
lexical alias: rapporteurAgent.en
definition: Relates a work to an agent who is an author who is appointed by an organization to report on the proceedings of its meetings.
domain: C10001
toolkit label: rapporteur agent
toolkit definition: An agent who is an author who is appointed by an organization to report on the proceedings of its meetings.
toolkit label: agent rapporteur @fr
toolkit definition: Agent auteur qui est nommé par une organisation pour rédiger les comptes rendus de ses réunions. @fr
sub property of: has author agent
toolkit label: relator @es
toolkit definition: Un autor asignado por una organización para reportar sobre las actas de sus reuniones. @es
scope note: Responsibility limited to taking minutes is excluded.
see also: P20058
instruction number: 18.5
label: har agent, som er rapportør @da
definition: Relaterer et værk til en agent, som er en forfatter, som er udpeget af en organisation til at rapportere om udviklingen af dens møder. @da
scope note: Omfatter ikke ansvar begrænset til at tage referat. @da
toolkit label: agent, som er rapportør @da
toolkit definition: Agent, som er en forfatter, som er udpeget af en organisation til at rapportere om udviklingen af dens møder. @da
definition: Met une œuvre en relation avec un agent auteur qui est nommé par une organisation pour rédiger les comptes rendus de ses réunions. @fr
label: có người chuẩn bị báo cáo @vi
definition: Liên kết tác phẩm với tác giả được chỉ định bởi tổ chức để báo cáo về kỷ yếu của cuộc họp. @vi
scope note: Trách nhiệm giới hạn vào ghi biển bản không được bao gồm @vi
toolkit label: người chuẩn bị báo cáo @vi
toolkit definition: Tác giả được chỉ định bởi tổ chức để báo cáo về kỷ yếu của cuộc họp. @vi
label: hat Berichterstatterin/Berichterstatter (Akteur) @de
definition: Setzt ein Werk in Beziehung zu einer Verfasserin/einem Verfasser (Akteur), die/der von einer Organisation eingestellt ist, um über den Ablauf ihrer Sitzungen zu berichten. @de
scope note: Darunter fällt nicht die Verantwortlichkeit, die sich auf das Protokollschreiben beschränkt. @de
toolkit label: Berichterstatterin/Berichterstatter (Akteur) @de
toolkit definition: Eine Verfasserin/Ein Verfasser (Akteur), die/der von einer Organisation eingestellt ist, um über den Ablauf ihrer Sitzungen zu berichten. @de
label: a pour agent rapporteur @fr
definition: Liittää teoksen toimijaan, joka on kirjoittaja, joka on saanut organisaatiolta tehtäväkseen raportoida kokousmenettelyistä. @fi
toolkit label: kokousten raportoija (toimija) @fi
toolkit definition: Toimija, joka on kirjoittaja, joka on saanut organisaatiolta tehtäväkseen raportoida kokousmenettelyistä. @fi
toolkit label: rapportør (agent) @no
toolkit definition: En agent som er en forfatter som er utnevnt av en organisasjon til å rapportere fra organisasjonens møter. @no
label: té com a agent relator @ca
definition: Relaciona una obra amb un agent que és un autor que és nomenat per una organització per redactar les actes de les seves reunions. @ca
scope note: S’exclou la responsabilitat que es limita a prendre notes. @ca
toolkit label: agent relator @ca
toolkit definition: Agent que és un autor que és nomenat per una organització per redactar les actes de les seves reunions. @ca
scope note: Une responsabilité limitée à rédiger un procès-verbal est exclue. @fr
has element type: 2
label: έχει εισηγητή @el
definition: Συνδέει ένα έργο με έναν συγγραφέα, στον οποίο έχει ανατεθεί από έναν οργανισμό να αναφέρει σχετικά με τα πρακτικά των συναντήσεων του. @el
scope note: Δεν περιλαμβάνεται η υπευθυνότητα που περιορίζεται στην τήρηση πρακτικών. @el
toolkit label: εισηγητής @el
toolkit definition: Ένας συγγραφέας, στον οποίο έχει ανατεθεί από έναν οργανισμό να αναφέρει σχετικά με τα πρακτικά των συναντήσεών του. @el
label: raportőr ágense a következő: @hu
definition: Hozzákapcsol egy forrást egy szerző ágenshez, amelyet egy szervezet megbíz azzal, hogy készítsen jelentést üléseinek a jegyzőkönyveiről. @hu
scope note: Nem tartozik bele a jegyzőkönyvvezetésre korlátozódó szerzőség. @hu
toolkit label: raportőr ágens: @hu
toolkit definition: Egy szerző ágens, amelyet egy szervezet megbíz azzal, hogy készítsen jelentést üléseinek a jegyzőkönyveiről. @hu
alternative label: rapporteur
scope note: Ei kata pöytäkirjan laatimiseen rajoittuvaa vastuuta. @fi
alternative label: kokousten raportoija @fi
label: kokousten raportoija (toimija) @fi
label: har rapportør (agent) @no
definition: Relaterer et verk til en agent som er en forfatter som er utnevnt av en organisasjon til å rapportere fra organisasjonens møter. @no
scope note: Ansvar som er begrenset til å ta møtereferater, er ikke inkludert. @no
alternative label: rapportør @no
label: heeft rapporteur-actor @nl
definition: Relateert een werk aan een actor die een auteur is die is aangesteld door een organisatie om te rapporteren over de handelingen van haar bijeenkomsten. @nl
scope note: Verantwoordelijkheid beperkt tot het notuleren is uitgesloten. @nl
toolkit label: rapporteur-actor @nl
toolkit definition: Een actor die een auteur is die is aangesteld door een organisatie om te rapporteren over de handelingen van haar bijeenkomsten. @nl
label: له وكيل مقرر @ar
definition: يربط بين عمل ووكيل يكون مؤلفا عينته منظمة لإعداد تقارير عن وقائع اجتماعاتها. @ar
scope note: تُستبعد المسئولية المقتصرة على تدوين مضابط الجلسات. @ar
alternative label: مقرر @ar
toolkit label: وكيل مقرر @ar
toolkit definition: وكيل يكون مؤلفا عينته منظمة لإعداد تقارير عن وقائع اجتماعاتها. @ar
alternative label: relator @ca
label: aruande koostaja (tegija) @et
definition: Seostab teose tegijaga, kes on tekstteose autor, kelle organisatsioon on määranud oma koosolekute toimingutest aruannet kirjutama. @et
scope note: Ei hõlma vastutust, mis on piiratud ainult protokollimisega. @et
alternative label: aruande koostaja @et
toolkit label: aruande koostaja (tegija) @et

has rapporteur collective agent
status: Published
lexical alias: rapporteurCollectiveAgent.en
definition: Relates a work to a collective agent who is an author who is appointed by an organization to report on the proceedings of its meetings.
toolkit label: rapporteur collective agent
toolkit definition: A collective agent who is an author who is appointed by an organization to report on the proceedings of its meetings.
type: Property
domain: C10001
has element type: 2
sub property of: has author collective agent
sub property of: has rapporteur agent
scope note: Responsibility limited to taking minutes is excluded.
label: kokousten raportoija (yhteistoimija) @fi
definition: Liittää teoksen yhteistoimijaan, joka on kirjoittaja, joka on saanut organisaatiolta tehtäväkseen raportoida kokousmenettelyistä. @fi
scope note: Ei kata pöytäkirjan laatimiseen rajoittuvaa vastuuta. @fi
toolkit label: kokousten raportoija (yhteistoimija) @fi
toolkit definition: Yhteistoimija, joka on kirjoittaja, joka on saanut organisaatiolta tehtäväkseen raportoida kokousmenettelyistä. @fi
label: har rapportør (kollektiv agent) @no
definition: Relaterer et verk til en kollektiv agent som er en forfatter som er utnevnt av en organisasjon til å rapportere fra organisasjonens møter. @no
scope note: Ansvar som er begrenset til å ta møtereferater, er ikke inkludert. @no
toolkit label: rapportør (kollektiv agent) @no
toolkit definition: En kollektiv agent som er en forfatter som er utnevnt av en organisasjon til å rapportere fra organisasjonens møter. @no
label: heeft rapporteur-collectieve actor @nl
definition: Relateert een werk aan een collectieve actor die een auteur is die is aangesteld door een organisatie om te rapporteren over de handelingen van haar bijeenkomsten. @nl
scope note: Verantwoordelijkheid beperkt tot het notuleren is uitgesloten. @nl
toolkit label: rapporteur-collectieve actor @nl
toolkit definition: Een collectieve actor die een auteur is die is aangesteld door een organisatie om te rapporteren over de handelingen van haar bijeenkomsten. @nl
label: له وكيل جماعي مقرر @ar
definition: يربط بين عمل ووكيل جماعي يكون مؤلفا عينته منظمة لإعداد تقارير عن وقائع اجتماعاتها. @ar
scope note: تُستبعد المسئولية المقتصرة على تدوين مضابط الجلسات. @ar
toolkit label: وكيل جماعي مقرر @ar
toolkit definition: وكيل جماعي يكون مؤلفا عينته منظمة لإعداد تقارير عن وقائع اجتماعاتها. @ar
label: té com a agent col·lectiu relator @ca
definition: Relaciona una obra amb un agent col·lectiu que és un autor que és nomenat per una organització per redactar les actes de les seves reunions. @ca
scope note: S’exclou la responsabilitat que es limita a prendre notes. @ca
toolkit label: agent col·lectiu relator @ca
toolkit definition: Agent col·lectiu que és un autor que és nomenat per una organització per redactar les actes de les seves reunions. @ca
label: har kollektiv agent, som er rapportør @da
definition: Relaterer et værk til en kollektiv agent, som er en forfatter, som er udpeget af en organisation til at rapportere om udviklingen af dens møder. @da
scope note: Omfatter ikke ansvar begrænset til at tage referat. @da
toolkit label: kollektiv agent, som er rapportør @da
toolkit definition: Kollektiv agent, som er en forfatter, som er udpeget af en organisation til at rapportere om udviklingen af dens møder. @da
label: aruande koostaja (kollektiiv) @et
definition: Seostab teose kollektiiviga, kes on tekstteose autor, kelle organisatsioon on määranud oma koosolekute toimingutest aruannet kirjutama. @et
scope note: Ei hõlma vastutust, mis on piiratud ainult protokollimisega. @et
toolkit label: aruande koostaja (kollektiiv) @et
toolkit definition: Kollektiiv, kes on tekstteose autor, kelle organisatsioon on määranud oma koosolekute toimingutest aruannet kirjutama. @et
label: hat Berichterstatterin/Berichterstatter (Gemeinschaftlicher Akteur) @de
definition: Setzt ein Werk in Beziehung zu einer Verfasserin/einem Verfasser (Gemeinschaftlicher Akteur), die/der von einer Organisation eingestellt ist, um über den Ablauf ihrer Sitzungen zu berichten. @de
scope note: Darunter fällt nicht die Verantwortlichkeit, die sich auf das Protokollschreiben beschränkt. @de
toolkit label: Berichterstatterin/Berichterstatter (Gemeinschaftlicher Akteur) @de
toolkit definition: Eine Verfasserin/Ein Verfasser (Gemeinschaftlicher Akteur), die/der von einer Organisation eingestellt ist, um über den Ablauf ihrer Sitzungen zu berichten. @de
label: raportőr kollektív ágense a következő: @hu
definition: Hozzákapcsol egy művet egy szerző kollektív ágenshez, amelyet egy szervezet megbíz azzal, hogy készítsen jelentést az üléseinek a lefolyásáról. @hu
scope note: Nem tartozik bele a jegyzőkönyvvezetésre korlátozódó szerzőség. @hu
toolkit label: raportőr kollektív ágens: @hu
toolkit definition: Egy szerző kollektív ágens, amelyet egy szervezet megbíz azzal, hogy készítsen jelentést az üléseinek a lefolyásáról. @hu
label: ha come relatore agente collettivo @it
definition: Correla un'opera all'agente collettivo autore incaricato da un'organizzazione di compilare rapporti sugli atti dei suoi incontri. @it
scope note: E' esclusa la responsabilità limitata alla redazione dei verbali. @it
toolkit label: relatore agente collettivo @it
toolkit definition: Agente collettivo autore incaricato da un'organizzazione di compilare rapporti sugli atti dei suoi incontri. @it
label: a pour agent collectif rapporteur @fr
definition: Met une œuvre en relation avec un agent collectif auteur qui est nommé par une organisation pour rédiger les comptes rendus de ses réunions. @fr
scope note: Une responsabilité limitée à rédiger un procès-verbal est exclue. @fr
toolkit label: agent collectif rapporteur @fr
toolkit definition: Agent collectif auteur qui est nommé par une organisation pour rédiger les comptes rendus de ses réunions. @fr
label: ziņotājs (grupa) @lv
definition: Sasaista darbu ar grupu - autors, kuru organizācija ir deleģējusi, lai ziņotu par tās sanāksmju rezultātiem. @lv
toolkit label: ziņotājs (grupa) @lv
toolkit definition: Grupa - autors, kuru organizācija ir deleģējusi, lai ziņotu par tās sanāksmju rezultātiem. @lv
scope note: Neietver atbildību protokolēt. @lv
label: 有会务报告人集体行为者 @zh-hans
definition: 将一种作品与作为一个著者并被一个组织指定为在其会议文集中报告的一个集体行为者关联起来。 @zh-hans
toolkit label: 会务报告人集体行为者 @zh-hans
toolkit definition: 作为一个著者并被一个组织指定为在其会议文集中报告的一个集体行为者 @zh-hans
scope note: 不包括仅限于写会议记录的责任。 @zh-hans
has subproperty: has rapporteur corporate body
has subproperty: has rapporteur family
has subproperty: P10479

has rapporteur corporate body
status: Published
lexical alias: rapporteurCorporateBody.en
definition: Relates a work to a corporate body who is an author who is appointed by an organization to report on the proceedings of its meetings.
toolkit label: rapporteur corporate body
toolkit definition: A corporate body who is an author who is appointed by an organization to report on the proceedings of its meetings.
type: Property
domain: C10001
has element type: 2
sub property of: has author corporate body
sub property of: has rapporteur collective agent
scope note: Responsibility limited to taking minutes is excluded.
label: kokousten raportoija (yhteisö) @fi
definition: Liittää teoksen yhteisöön, joka on kirjoittaja, joka on saanut organisaatiolta tehtäväkseen raportoida kokousmenettelyistä. @fi
scope note: Ei kata pöytäkirjan laatimiseen rajoittuvaa vastuuta. @fi
toolkit label: kokousten raportoija (yhteisö) @fi
toolkit definition: Yhteisö, joka on kirjoittaja, joka on saanut organisaatiolta tehtäväkseen raportoida kokousmenettelyistä. @fi
label: har rapportør (korporasjon) @no
definition: Relaterer et verk til en korporasjon som er en forfatter som er utnevnt av en organisasjon til å rapportere fra organisasjonens møter. @no
scope note: Ansvar som er begrenset til å ta møtereferater, er ikke inkludert. @no
toolkit label: rapportør (korporasjon) @no
toolkit definition: En korporasjon som er en forfatter som er utnevnt av en organisasjon til å rapportere fra organisasjonens møter. @no
label: heeft rapporteur-corporatie @nl
definition: Relateert een werk aan een corporatie die een auteur is die is aangesteld door een organisatie om te rapporteren over de handelingen van haar bijeenkomsten. @nl
scope note: Verantwoordelijkheid beperkt tot het notuleren is uitgesloten. @nl
toolkit label: rapporteur-corporatie @nl
toolkit definition: Een corporatie die een auteur is die is aangesteld door een organisatie om te rapporteren over de handelingen van haar bijeenkomsten. @nl
label: له هيئة مقررة @ar
definition: يربط بين عمل وهيئة تكون مؤلفا عينته منظمة لإعداد تقارير عن وقائع اجتماعاتها. @ar
scope note: تُستبعد المسئولية المقتصرة على تدوين مضابط الجلسات. @ar
toolkit label: هيئة مقررة @ar
toolkit definition: هيئة تكون مؤلفا عينته منظمة لإعداد تقارير عن وقائع اجتماعاتها. @ar
label: té com a entitat corporativa relatora @ca
definition: Relaciona una obra amb una entitat corporativa que és un autor que és nomenat per una organització per redactar les actes de les seves reunions. @ca
scope note: S’exclou la responsabilitat que es limita a prendre notes. @ca
toolkit label: entitat corporativa relatora @ca
toolkit definition: Entitat corporativa que és un autor que és nomenat per una organització per redactar les actes de les seves reunions. @ca
label: har korporation, som er rapportør @da
definition: Relaterer et værk til en korporation, som er en forfatter, som er udpeget af en organisation til at rapportere om udviklingen af dens møder. @da
scope note: Omfatter ikke ansvar begrænset til at tage referat. @da
toolkit label: korporation, som er rapportør @da
toolkit definition: Korporation, som er en forfatter, som er udpeget af en organisation til at rapportere om udviklingen af dens møder. @da
label: aruande koostaja (asutus) @et
definition: Seostab teose asutusega, kes on tekstteose autor, kelle organisatsioon on määranud oma koosolekute toimingutest aruannet kirjutama. @et
scope note: Ei hõlma vastutust, mis on piiratud ainult protokollimisega. @et
toolkit label: aruande koostaja (asutus) @et
toolkit definition: Asutus, kes on tekstteose autor, kelle organisatsioon on määranud oma koosolekute toimingutest aruannet kirjutama. @et
label: hat Berichterstatterin/Berichterstatter (Körperschaft) @de
definition: Setzt ein Werk in Beziehung zu einer Verfasserin/einem Verfasser (Körperschaft), die/der von einer Organisation eingestellt ist, um über den Ablauf ihrer Sitzungen zu berichten. @de
scope note: Darunter fällt nicht die Verantwortlichkeit, die sich auf das Protokollschreiben beschränkt. @de
toolkit label: Berichterstatterin/Berichterstatter (Körperschaft) @de
toolkit definition: Eine Verfasserin/Ein Verfasser (Körperschaft), die/der von einer Organisation eingestellt ist, um über den Ablauf ihrer Sitzungen zu berichten. @de
label: raportőr testülete a következő: @hu
definition: Hozzákapcsol egy művet egy szerző testülethez, amelyet egy szervezet megbíz azzal, hogy készítsen jelentést az üléseinek a lefolyásáról. @hu
scope note: Nem tartozik bele a jegyzőkönyvvezetésre korlátozódó szerzőség. @hu
toolkit label: raportőr testület: @hu
toolkit definition: Egy szerző testület, amelyet egy szervezet megbíz azzal, hogy készítsen jelentést az üléseinek a lefolyásáról. @hu
label: ha come relatore ente @it
definition: Correla un'opera a un ente autore incaricato da un'organizzazione di compilare rapporti sugli atti dei suoi incontri. @it
scope note: E' esclusa la responsabilità limitata alla redazione dei verbali. @it
toolkit label: relatore ente @it
toolkit definition: Ente autore incaricato da un'organizzazione di compilare rapporti sugli atti dei suoi incontri. @it
label: a pour collectivité rapporteuse @fr
definition: Met une œuvre en relation avec une collectivité autrice qui est nommée par une organisation pour rédiger les comptes rendus de ses réunions. @fr
scope note: Une responsabilité limitée à rédiger un procès-verbal est exclue. @fr
toolkit label: collectivité rapporteuse @fr
toolkit definition: Collectivité autrice qui est nommée par une organisation pour rédiger les comptes rendus de ses réunions. @fr
label: ziņotājs (institūcija) @lv
definition: Sasaista darbu ar institūciju - autors, kuru organizācija ir deleģējusi, lai ziņotu par tās sanāksmju rezultātiem. @lv
toolkit label: ziņotājs (institūcija) @lv
toolkit definition: Institūcija - autors, kuru organizācija ir deleģējusi, lai ziņotu par tās sanāksmju rezultātiem. @lv
scope note: Neietver atbildību protokolēt. @lv
label: 有会务报告人团体 @zh-hans
definition: 将一种作品与作为一个著者并被一个组织指定为在其会议文集中报告的一个团体关联起来。 @zh-hans
toolkit label: 会务报告人团体 @zh-hans
toolkit definition: 作为一个著者并被一个组织指定为在其会议文集中报告的一个团体 @zh-hans
scope note: 不包括仅限于写会议记录的责任。 @zh-hans
has subproperty: P10526
label: raportör tüzel kişisi ile ilişkilidir @tr
definition: Bir eseri, bir kuruluş tarafından toplantılarının işleyişi hakkında rapor vermek üzere atanan bir yazar olan tüzel kişi ile ilişkilendirir. @tr

has rapporteur family
status: Published
lexical alias: rapporteurFamily.en
definition: Relates a work to a family who is an author who is appointed by an organization to report on the proceedings of its meetings.
toolkit label: rapporteur family
toolkit definition: A family who is an author who is appointed by an organization to report on the proceedings of its meetings.
type: Property
domain: C10001
has element type: 2
sub property of: has author family
sub property of: has rapporteur collective agent
scope note: Responsibility limited to taking minutes is excluded.
label: kokousten raportoija (suku) @fi
definition: Liittää teoksen sukuun, joka on kirjoittaja, joka on saanut organisaatiolta tehtäväkseen raportoida kokousmenettelyistä. @fi
scope note: Ei kata pöytäkirjan laatimiseen rajoittuvaa vastuuta. @fi
toolkit label: kokousten raportoija (suku) @fi
toolkit definition: Suku, joka on kirjoittaja, joka on saanut organisaatiolta tehtäväkseen raportoida kokousmenettelyistä. @fi
label: har rapportør (familie) @no
definition: Relaterer et verk til en familie som er en forfatter som er utnevnt av en organisasjon til å rapportere fra organisasjonens møter. @no
scope note: Ansvar som er begrenset til å ta møtereferater, er ikke inkludert. @no
toolkit label: rapportør (familie) @no
toolkit definition: En familie som er en forfatter som er utnevnt av en organisasjon til å rapportere fra organisasjonens møter. @no
label: heeft rapporteur-familie @nl
definition: Relateert een werk aan een familie die een auteur is die is aangesteld door een organisatie om te rapporteren over de handelingen van haar bijeenkomsten. @nl
scope note: Verantwoordelijkheid beperkt tot het notuleren is uitgesloten. @nl
toolkit label: rapporteur-familie @nl
toolkit definition: Een familie die een auteur is die is aangesteld door een organisatie om te rapporteren over de handelingen van haar bijeenkomsten. @nl
label: له عائلة مقررة @ar
definition: يربط بين عمل وعائلة تكون مؤلفة عينتها منظمة لإعداد تقارير عن وقائع اجتماعاتها. @ar
scope note: تُستبعد المسئولية المقتصرة على تدوين مضابط الجلسات. @ar
toolkit label: عائلة مقررة @ar
toolkit definition: عائلة تكون مؤلفة عينتها منظمة لإعداد تقارير عن وقائع اجتماعاتها. @ar
label: té com a família relatora @ca
definition: Relaciona una obra amb una família que és un autor que és nomenat per una organització per redactar les actes de les seves reunions. @ca
scope note: S’exclou la responsabilitat que es limita a prendre notes. @ca
toolkit label: família relatora @ca
toolkit definition: Família que és un autor que és nomenat per una organització per redactar les actes de les seves reunions. @ca
label: har familie, som er rapportør @da
definition: Relaterer et værk til en familie, som er en forfatter, som er udpeget af en organisation til at rapportere om udviklingen af dens møder. @da
scope note: Omfatter ikke ansvar begrænset til at tage referat. @da
toolkit label: familie, som er rapportør @da
toolkit definition: Familie, som er en forfatter, som er udpeget af en organisation til at rapportere om udviklingen af dens møder. @da
label: aruande koostaja (perekond) @et
definition: Seostab teose perekonnaga, kes on tekstteose autor, kelle organisatsioon on määranud oma koosolekute toimingutest aruannet kirjutama. @et
scope note: Ei hõlma vastutust, mis on piiratud ainult protokollimisega. @et
toolkit label: aruande koostaja (perekond) @et
toolkit definition: Perekond, kes on tekstteose autor, kelle organisatsioon on määranud oma koosolekute toimingutest aruannet kirjutama. @et
label: hat Berichterstatterin/Berichterstatter (Familie) @de
definition: Setzt ein Werk in Beziehung zu einer Verfasserin/einem Verfasser (Familie), die/der von einer Organisation eingestellt ist, um über den Ablauf ihrer Sitzungen zu berichten. @de
scope note: Darunter fällt nicht die Verantwortlichkeit, die sich auf das Protokollschreiben beschränkt. @de
toolkit label: Berichterstatterin/Berichterstatter (Familie) @de
toolkit definition: Eine Verfasserin/Ein Verfasser (Familie), die/der von einer Organisation eingestellt ist, um über den Ablauf ihrer Sitzungen zu berichten. @de
label: raportőr családja a következő: @hu
definition: Hozzákapcsol egy művet egy szerző családhoz, amelyet egy szervezet megbíz azzal, hogy készítsen jelentést az üléseinek a lefolyásáról. @hu
scope note: Nem tartozik bele a jegyzőkönyvvezetésre korlátozódó szerzőség. @hu
toolkit label: raportőr család: @hu
toolkit definition: Egy szerző család, amelyet egy szervezet megbíz azzal, hogy készítsen jelentést az üléseinek a lefolyásáról. @hu
label: ha come relatore famiglia @it
definition: Correla un'opera alla famiglia autore incaricato da un'organizzazione di compilare rapporti sugli atti dei suoi incontri. @it
scope note: E' esclusa la responsabilità limitata a redigere verbali. @it
toolkit label: relatore famiglia @it
toolkit definition: Famiglia autrore incaricato da un'organizzazione di compilare rapporti sugli atti dei suoi incontri. @it
label: a pour famille rapporteuse @fr
definition: Met une œuvre en relation avec une famille autrice qui est nommée par une organisation pour rédiger les comptes rendus de ses réunions. @fr
scope note: Une responsabilité limitée à rédiger un procès-verbal est exclue. @fr
toolkit label: famille rapporteuse @fr
toolkit definition: Famille autrice qui est nommée par une organisation pour rédiger les comptes rendus de ses réunions. @fr
label: ziņotājs (dzimta/ģimene) @lv
definition: Sasaista darbu ar dzimtu/ģimeni - autors, kuru organizācija ir deleģējusi, lai ziņotu par tās sanāksmju rezultātiem. @lv
toolkit label: ziņotājs (dzimta/ģimene) @lv
toolkit definition: Dzimta/ģimene - autors, kuru organizācija ir deleģējusi, lai ziņotu par tās sanāksmju rezultātiem. @lv
scope note: Neietver atbildību protokolēt. @lv
label: 有会务报告人家族 @zh-hans
definition: 将一种作品与作为一个著者并被一个组织指定为在其会议文集中报告的一个家族关联起来。 @zh-hans
toolkit label: 会务报告人家族 @zh-hans
toolkit definition: 作为一个著者并被一个组织指定为在其会议文集中报告的一个家族 @zh-hans
scope note: 不包括仅限于写会议记录的责任。 @zh-hans
has subproperty: P10573
label: raportör ailesi ile ilişkilidir @tr
definition: Bir eseri, bir kuruluş tarafından toplantılarının işleyişi hakkında rapor vermek üzere atanan bir yazar olan aileyle ilişkilendirir. @tr

has rapporteur person
status: Published
lexical alias: rapporteurPerson.en
definition: Relates a work to a person who is an author who is appointed by an organization to report on the proceedings of its meetings.
toolkit label: rapporteur person
toolkit definition: A person who is an author who is appointed by an organization to report on the proceedings of its meetings.
type: Property
domain: C10001
has element type: 2
sub property of: has author person
sub property of: has rapporteur agent
scope note: Responsibility limited to taking minutes is excluded.
label: kokousten raportoija (henkilö) @fi
definition: Liittää teoksen henkilöön, joka on kirjoittaja, joka on saanut organisaatiolta tehtäväkseen raportoida kokousmenettelyistä. @fi
scope note: Ei kata pöytäkirjan laatimiseen rajoittuvaa vastuuta. @fi
toolkit label: kokousten raportoija (henkilö) @fi
toolkit definition: Henkilö, joka on kirjoittaja, joka on saanut organisaatiolta tehtäväkseen raportoida kokousmenettelyistä. @fi
label: har rapportør (person) @no
definition: Relaterer et verk til en person som er en forfatter som er utnevnt av en organisasjon til å rapportere fra organisasjonens møter. @no
scope note: Ansvar som er begrenset til å ta møtereferater, er ikke inkludert. @no
toolkit label: rapportør (person) @no
toolkit definition: En person som er en forfatter som er utnevnt av en organisasjon til å rapportere fra organisasjonens møter. @no
label: heeft rapporteur-persoon @nl
definition: Relateert een werk aan een persoon die een auteur is die is aangesteld door een organisatie om te rapporteren over de handelingen van haar bijeenkomsten. @nl
scope note: Verantwoordelijkheid beperkt tot het notuleren is uitgesloten. @nl
toolkit label: rapporteur-persoon @nl
toolkit definition: Een persoon die een auteur is die is aangesteld door een organisatie om te rapporteren over de handelingen van haar bijeenkomsten. @nl
label: له شخص مقرر @ar
definition: يربط بين عمل وشخص يكون مؤلفا عينته منظمة لإعداد تقارير عن وقائع اجتماعاتها. @ar
scope note: تُستبعد المسئولية المقتصرة على تدوين مضابط الجلسات. @ar
toolkit label: شخص مقرر @ar
toolkit definition: شخص يكون مؤلفا عينته منظمة لإعداد تقارير عن وقائع اجتماعاتها. @ar
label: té com a persona relatora @ca
definition: Relaciona una obra amb una persona que és un autor que és nomenat per una organització per redactar les actes de les seves reunions. @ca
scope note: S’exclou la responsabilitat que es limita a prendre notes. @ca
toolkit label: persona relatora @ca
toolkit definition: Persona que és un autor que és nomenat per una organització per redactar les actes de les seves reunions. @ca
label: har person, som er rapportør @da
definition: Relaterer et værk til en person, som er en forfatter, som er udpeget af en organisation til at rapportere om udviklingen af dens møder. @da
scope note: Omfatter ikke ansvar begrænset til at tage referat. @da
toolkit label: person, som er rapportør @da
toolkit definition: Person, som er en forfatter, som er udpeget af en organisation til at rapportere om udviklingen af dens møder. @da
label: aruande koostaja (isik) @et
definition: Seostab teose isikuga, kes on tekstteose autor, kelle organisatsioon on määranud oma koosolekute toimingutest aruannet kirjutama. @et
scope note: Ei hõlma vastutust, mis on piiratud ainult protokollimisega. @et
toolkit label: aruande koostaja (isik) @et
toolkit definition: Isik, kes on tekstteose autor, kelle organisatsioon on määranud oma koosolekute toimingutest aruannet kirjutama. @et
label: hat Berichterstatterin/Berichterstatter (Person) @de
definition: Setzt ein Werk in Beziehung zu einer Verfasserin/einem Verfasser (Person), die/der von einer Organisation eingestellt ist, um über den Ablauf ihrer Sitzungen zu berichten. @de
scope note: Darunter fällt nicht die Verantwortlichkeit, die sich auf das Protokollschreiben beschränkt. @de
toolkit label: Berichterstatterin/Berichterstatter (Person) @de
toolkit definition: Eine Verfasserin/Ein Verfasser (Person), die/der von einer Organisation eingestellt ist, um über den Ablauf ihrer Sitzungen zu berichten. @de
label: raportőr személye a következő: @hu
definition: Hozzákapcsol egy művet egy szerző személyhez, akit egy szervezet megbíz azzal, hogy készítsen jelentést az üléseinek a lefolyásáról. @hu
scope note: Nem tartozik bele a jegyzőkönyvvezetésre korlátozódó szerzőség. @hu
toolkit label: raportőr személy: @hu
toolkit definition: Egy szerző személy, akit egy szervezet megbíz azzal, hogy készítsen jelentést az üléseinek a lefolyásáról. @hu
label: ha come relatore persona @it
definition: Correla un'opera alla persona autore incaricata da un'organizzazione di compilare rapporti sugli atti dei suoi incontri. @it
scope note: E' esclusa la responsabilità limitata alla redazione dei verbali. @it
toolkit label: relatore persona @it
toolkit definition: Persona autore incaricata da un'organizzazione di compilare rapporti sugli atti dei suoi incontri. @it
label: a pour personne rapporteuse @fr
definition: Met une œuvre en relation avec une personne autrice qui est nommée par une organisation pour rédiger les comptes rendus de ses réunions. @fr
scope note: Une responsabilité limitée à rédiger un procès-verbal est exclue. @fr
toolkit label: personne rapporteuse @fr
toolkit definition: Personne autrice qui est nommée par une organisation pour rédiger les comptes rendus de ses réunions. @fr
label: ziņotājs (persona) @lv
definition: Sasaista darbu ar personu - autors, kuru organizācija ir deleģējusi, lai ziņotu par tās sanāksmju rezultātiem. @lv
toolkit label: ziņotājs (persona) @lv
toolkit definition: Persona - autors, kuru organizācija ir deleģējusi, lai ziņotu par tās sanāksmju rezultātiem. @lv
scope note: Neietver atbildību protokolēt. @lv
label: 有会务报告人个人 @zh-hans
definition: 将一种作品与作为一个著者并被一个组织指定为在其会议文集中报告的一个个人关联起来。 @zh-hans
toolkit label: 会务报告人个人 @zh-hans
toolkit definition: 作为一个著者并被一个组织指定为在其会议文集中报告的一个个人 @zh-hans
scope note: 不包括仅限于写会议记录的责任。 @zh-hans
has subproperty: P10432
label: raportör kişisi ile ilişkilidir @tr
definition: Bir eseri, bir kuruluş tarafından toplantılarının işleyişi hakkında rapor vermek üzere atanan yazar olan kişiyle ilişkilendirir. @tr

has recording source
status: Published
lexical alias: recordingSource.en
definition: Relates a work to a source of information for a metadata work that is an unstructured description transcribed from a manifestation that is being described.
toolkit label: recording source
toolkit definition: A source of information for a metadata work that is an unstructured description transcribed from a manifestation that is being described.
type: Property
domain: C10001
has element type: 4
label: merkintälähde @fi
definition: Liittää teoksen metatietoteoksen tiedonlähteeseen, joka on rakenteistamaton kuvailu jäljennettynä manifestaatiosta, joka on kuvailtavana. @fi
toolkit label: merkintälähde @fi
toolkit definition: Metatietoteoksen tiedonlähde, joka on rakenteistamaton kuvailu jäljennettynä manifestaatiosta, joka on kuvailtavana. @fi
label: har registreringskilde @no
definition: Relaterer et verk til en informasjonskilde for et metadataverk som er en ustrukturert beskrivelse gjengitt fra en manifestasjon som blir beskrevet. @no
toolkit label: registreringskilde @no
toolkit definition: En informasjonskilde for et metadataverk som er en ustrukturert beskrivelse gjengitt fra en manifestasjon som blir beskrevet. @no
label: heeft bron van overname @nl
definition: Relateert een werk aan een bron van informatie voor een metadatawerk dat een ongestructureerde beschrijving is, overgenomen uit een manifestatie die beschreven wordt. @nl
toolkit label: bron van overname @nl
toolkit definition: Een bron van informatie voor een metadatawerk dat een ongestructureerde beschrijving is, overgenomen uit een manifestatie die beschreven wordt. @nl
label: له مصدر تسجيل @ar
definition: يربط بين عمل ومصدر معلومات لعمل ميتاداتا يعد وصفًا غير محدد يُنسخ من تجسيدة يتم وصفها. @ar
toolkit label: مصدر تسجيل @ar
toolkit definition: مصدر معلومات لعمل ميتاداتا يعد وصفًا غير محدد يُنسخ من تجسيدة يتم وصفها. @ar
label: té com a font d’enregistrament @ca
definition: Relaciona una obra amb una font d’informació d’una obra de metadades que és una descripció no estructurada transcrita d’una manifestació que es descriu. @ca
toolkit label: font d’enregistrament @ca
toolkit definition: Font d’informació d’una obra de metadades que és una descripció no estructurada transcrita d’una manifestació que es descriu. @ca
definition: Relaterer et værk til en informationskilde for et metadataværk, som er en ustruktureret beskrivelse, gengivet fra en manifestation, der bliver beskrevet. @da
toolkit definition: Informationskilde for et metadataværk, som er en ustruktureret beskrivelse, gengivet fra en manifestation, der bliver beskrevet. @da
label: andmeallikas @et
definition: Seostab teose metaandmeteose jaoks kasutatud andmeallikaga, mida näitab kirjeldatavast kehastusest transkribeeritud struktureerimata kirjeldus. @et
toolkit label: andmeallikas @et
toolkit definition: Metaandmeteose jaoks kasutatud andmeallikas, mida näitab kirjeldatavast kehastusest transkribeeritud struktureerimata kirjeldus. @et
label: hat Aufnahmequelle @de
definition: Setzt ein Werk in Beziehung zu einer Informationsquelle für ein Metadatenwerk, bei der es sich um eine unstrukturierte Beschreibung handelt, die aus einer beschriebenen Manifestation transkribiert ist. @de
toolkit label: Aufnahmequelle @de
toolkit definition: Eine Informationsquelle für ein Metadatenwerk, bei der es sich um eine unstrukturierte Beschreibung handelt, die aus einer beschriebenen Manifestation transkribiert ist. @de
label: rögzítési forrása a következő: @hu
definition: Hozzákapcsol egy művet egy metaadatmű adatforrásához, amely egy megjelenési forma leírásából átírt, struktúrálatlan leírás. @hu
toolkit label: rögzítési forrása: @hu
toolkit definition: Egy metaadatmű adatforrása, amely egy megjelenési forma leírásából átírt, struktúrálatlan leírás. @hu
label: ha come fonte di registrazione @it
definition: Correla un'opera a una fonte d'informazione per un'opera di metadati che è una descrizione non strutturata trascritta dalla manifestazione che si sta descrivendo. @it
toolkit label: fonte di registrazione @it
toolkit definition: Fonte d'informazione per un'opera di metadati che è una descrizione non strutturata trascritta dalla manifestazione che si sta descrivendo. @it
label: a pour source d’enregistrement @fr
definition: Met une œuvre en relation avec une source d’information pour une œuvre de métadonnées qui consiste en une description non structurée transcrite d’une manifestation décrite. @fr
toolkit label: source d’enregistrement @fr
toolkit definition: Source d’information pour une œuvre de métadonnées qui consiste en une description non structurée transcrite d’une manifestation décrite. @fr
label: metadatu ieraksta avots @lv
definition: Sasaista darbu ar metadatu darba informācijas avotu, kas ir no apskatāmās manifestācijas iegūts nestrukturēts apraksts. @lv
toolkit label: metadatu ieraksta avots @lv
toolkit definition: Metadatu darba informācijas avots, kas ir no apskatāmās manifestācijas iegūts nestrukturēts apraksts. @lv
label: 有记录信息源 @zh-hans
definition: 将一种作品与一种元数据作品（即转录自被描述载体表现的非结构化描述）的一个信息源关联起来。 @zh-hans
toolkit label: 记录信息源 @zh-hans
toolkit definition: 一种元数据作品（即转录自被描述载体表现的非结构化描述）的一个信息源 @zh-hans
has subproperty: P10404
label: kayıt kaynağı ile ilişkilidir @tr
definition: Bir eseri, tanımlanmakta olan bir gösterimden yazıya aktarılan yapılandırılmamış bir açıklama olan bir üstveri eseri için bilgi kaynağı ile ilişkilendirir. @tr
toolkit label: Kayıt kaynağı @tr
toolkit definition: Tanımlanan bir gösterimden kayda alınan yapılandırılmamış bir açıklama olan bir meta veri çalışması için bir bilgi kaynağı. @tr

har henvisende værkrelation med
status: Deprecated
type: Property
lexical alias: referentialWorkRelationship.en
domain: C10001
sub property of: has related work of work
toolkit label: relación obra referencial @es
toolkit definition: Una obra que hace referencia a la obra. @es
instruction number: 24.5
definition: Relaterer et værk til et værk der henviser til et andet værk. @da
toolkit label: henvisende værkrelation med @da
toolkit definition: Værk der henviser til et andet værk. @da
label: có mối quan hệ tác phẩm tham chiếu với @vi
definition: Liên kết tác phẩm với tác phẩm tham chiếu tác phẩm khác. @vi
toolkit label: mối quan hệ tác phẩm tham chiếu với @vi
toolkit definition: Tác phẩm tham chiếu tác phẩm khác. @vi
label: hat Referenzbeziehung auf Werkebene @de
definition: Setzt ein Werk mit einem Werk, das auf ein anderes Werk verweist, in Beziehung. @de
toolkit label: Referenzbeziehung auf Werkebene @de
toolkit definition: Ein Werk, das auf ein anderes Werk verweist. @de
label: teoksen viittaussuhde @fi
definition: Liittää teoksen teokseen, johon toinen teos viittaa. @fi
toolkit label: teoksen viittaussuhde @fi
toolkit definition: Teos, johon toinen teos viittaa. @fi
toolkit label: relasjonstypen henvisende verk @no
toolkit definition: Et verk som henviser til et annet verk. @no
label: té com a relació d’obra referencial @ca
definition: Relaciona una obra amb una obra que referencia una altra obra. @ca
toolkit label: relació d’obra referencial @ca
toolkit definition: Obra que referencia una altra obra. @ca
label: a pour relation d’œuvre référentielle @fr
definition: Met une œuvre en relation avec une œuvre qui fait référence à une autre œuvre. @fr
toolkit label: relation d’œuvre référentielle @fr
toolkit definition: Œuvre qui fait référence à une autre œuvre. @fr
label: έχει σχέσεις αναφοράς έργου με @el
definition: Συνδέει ένα έργο με ένα έργο που παραπέμπει σε ένα άλλο έργο. @el
toolkit label: σχέσεις αναφοράς έργου με @el
toolkit definition: Ένα έργο που παραπέμπει σε ένα άλλο έργο. @el
has subproperty: P10296

is adapted as novel work
status: Published
definition: Relates a work to a work that is a novel adapted from another work.
type: Property
domain: C10001
sub property of: is adapted as work
lexical alias: adaptedAsNovelWork.en
toolkit label: adapted as novel work
toolkit definition: A work that is a novel adapted from another work.
toolkit label: adapté en roman (œuvre) @fr
toolkit definition: Œuvre qui consiste en un roman adapté d’une autre œuvre. @fr
toolkit label: adaptada como novela (obra) @es
toolkit definition: Una novela adaptada de la obra fuente. @es
instruction number: 24.5
label: er bearbejdet til romanværk @da
definition: Relaterer et værk til en roman, som er bearbejdet ud fra et oprindeligt værk. @da
toolkit label: bearbejdet til romanværk @da
toolkit definition: Roman, som er bearbejdet ud fra et oprindeligt værk. @da
definition: Met une œuvre en relation avec une œuvre qui consiste en un roman adapté d’une autre œuvre. @fr
label: được phỏng theo như là tác tiểu thuyết (tác phẩm) @vi
definition: Liên kết tác phẩm với tiểu thuyết được phỏng theo từ tác phẩm nguồn. @vi
toolkit label: được phỏng theo như là tiểu thuyết (tác phẩm) @vi
toolkit definition: Tiểu thuyết được phỏng theo từ tác phẩm nguồn. @vi
label: ist bearbeitet als Roman (Werk) @de
definition: Setzt ein Werk in Beziehung zu einem Roman (Werk), der auf einem anderen Werk basiert. @de
toolkit label: Bearbeitet als Roman (Werk) @de
toolkit definition: Ein Roman (Werk), der auf einem anderen Werk basiert. @de
label: est adapté en roman (œuvre) @fr
definition: Liittää teoksen teokseen, joka on toisesta teoksesta sovitettu romaani. @fi
toolkit label: romaanimukaelma (teos) @fi
toolkit definition: Teos, joka on toisesta teoksesta sovitettu romaani. @fi
toolkit label: bearbeidet som roman (verk) @no
toolkit definition: En roman bearbeidet fra et kildeverk. @no
label: és adaptat com a obra de novel·la @ca
definition: Relaciona una obra amb una obra que és una novel·la adaptada d’una altra obra. @ca
toolkit label: adaptat com a obra de novel·la @ca
toolkit definition: Obra que és una novel·la adaptada d’una altra obra. @ca
has element type: 2
label: είναι προσαρμοσμένο ως μυθιστόρημα (έργο) @el
definition: Συνδέει ένα έργο με ένα μυθιστόρημα προσαρμοσμένο από ένα έργο-πηγή. @el
toolkit label: προσαρμοσμένο ως μυθιστόρημα (έργο) @el
toolkit definition: Ένα μυθιστόρημα προσαρμοσμένο από ένα έργο-πηγή. @el
label: regényként való átdolgozása a következő mű: @hu
definition: Hozzákapcsol egy művet egy másik műhöz, egy regényhez, amelyet egy másik műből adaptáltak. @hu
toolkit label: regénymű-átdolgozás @hu
toolkit definition: Egy mű, egy regény, amelyet egy másik műből adaptáltak. @hu
label: romaanimukaelma (teos) @fi
label: er bearbeidet som roman (verk) @no
definition: Relaterer et verk til en roman bearbeidet fra et kildeverk. @no
label: is bewerkt als romanwerk @nl
definition: Relateert een werk aan een werk dat is een roman bewerkt van een ander werk. @nl
toolkit label: bewerkt als romanwerk @nl
toolkit definition: Een werk dat is een roman bewerkt van een ander werk. @nl
label: هو معالج كعمل روائي @ar
definition: يربط عمل بعمل عبارة عن رواية مقتبسة من عمل آخر. @ar
toolkit label: معالج كعمل روائي @ar
toolkit definition: رواية مقتبسة من عمل آخر. @ar
label: adapteeritud romaanina (teos) @et
definition: Seostab teose allikteosest adapteeritud romaaniga. @et
toolkit label: adapteeritud romaanina (teos) @et
toolkit definition: Allikteosest adapteeritud romaan. @et
label: è adattata come opera in forma di romanzo @it
definition: Correla un’opera a un romanzo adattato da un'opera di partenza. @it
toolkit label: adattata come in forma di romanzo @it
toolkit definition: Romanzo adattato da un'opera di partenza. @it
label: ir adaptēts kā romāns (darbs) @lv
definition: Sasaista darbu ar darbu, kas ir romāns adaptēts pēc pamatdarba. @lv
toolkit label: adaptēts kā darbs: romāns @lv
toolkit definition: Romāns adaptēts pēc pamatdarba. @lv
label: 被改编为小说作品 @zh-hans
definition: 将一种作品与作为改编自另一种作品的一种小说的一种作品关联起来。 @zh-hans
toolkit label: 被改编为小说作品 @zh-hans
toolkit definition: 作为改编自另一种作品的一种小说的一种作品 @zh-hans
has subproperty: P10034
label: roman eseri olarak uyarlanmıştır @tr
definition: Bir eseri, başka bir eserden uyarlanmış bir roman olan bir eserle ilişkilendirir. @tr
toolkit label: Roman eseri olarak uyarlanan @tr
toolkit definition: Başka bir eserden uyarlanmış bir roman olan bir eser. @tr

has regional version
status: Published
lexical alias: regionalVersion.en
definition: Relates a work to a work that is created by changing the regional audience of a work.
toolkit label: regional version
toolkit definition: A work that is created by changing the regional audience of a work.
type: Property
domain: C10001
sub property of: has transformation by audience
has element type: 2
label: alueversio @fi
definition: Liittää teoksen teokseen, joka on luotu muuttamalla teoksen alueyleisöä. @fi
toolkit label: alueversio @fi
toolkit definition: Teos, joka on luotu muuttamalla teoksen alueyleisöä. @fi
label: har regional versjon @no
definition: Relaterer et verk til et verk som er skapt ved endring av den regionale målgruppen for et verk. @no
toolkit label: regional versjon @no
toolkit definition: Et verk som er skapt ved endring av den regionale målgruppen for et verk. @no
label: heeft regionale versie @nl
definition: Relateert een werk aan een werk dat is gecreëerd door het wijzigen van de regionale doelgroep van een werk. @nl
toolkit label: regionale versie @nl
toolkit definition: Een werk dat is gecreëerd door het wijzigen van de regionale doelgroep van een werk. @nl
label: له إصدارة إقليمية @ar
definition: يربط عمل بعمل تم إنشاؤه عن طريق تغيير الجمهور الإقليمي لعمل. @ar
toolkit label: إصدارة إقليمية @ar
toolkit definition: عمل يتم إنشاؤه عن طريق تغيير الجمهور الإقليمي لعمل. @ar
label: té com a versió regional @ca
definition: Relaciona una obra amb una obra que es crea canviant els destinataris regionals d’una obra. @ca
toolkit label: versió regional @ca
toolkit definition: Obra que es crea canviant els destinataris regionals d’una obra. @ca
label: har regional version @da
definition: Relaterer et værk til et værk, som er skabt ved at ændre et værks regionale målgruppe. @da
toolkit definition: Værk, som er skabt ved at ændre et værks regionale målgruppe. @da
label: regionaalversioon @et
definition: Seostab teose teosega, mis on loodud, muutes teose regionaalset sihtrühma. @et
toolkit label: regionaalversioon @et
toolkit definition: Teos, mis on loodud, muutes teose regionaalset sihtrühma. @et
label: hat Regionalversion @de
definition: Setzt ein Werk in Beziehung zu einem Werk, das durch Änderung der regionalen Zielgruppe eines Werks geschaffen wird. @de
toolkit label: Regionalversion @de
toolkit definition: Ein Werk, das durch Änderung der regionalen Zielgruppe eines Werks erstellt wird. @de
label: regionális változata a következő: @hu
definition: Hozzákapcsol egy művet egy műhöz, amely egy mű regionális közönségének megváltozása következtében jött létre. @hu
toolkit label: regionális változata: @hu
toolkit definition: Egy mű, amely egy mű regionális közönségének megváltozása következtében jött létre. @hu
label: ha come versione regionale @it
definition: Correla un'opera a un'opera creata modificando la regione dei destinatari di un'opera. @it
toolkit label: versione regionale @it
toolkit definition: Opera creata cambiando la regione dei destinatari di un'opera. @it
label: a pour version régionale @fr
definition: Met une œuvre en relation avec une œuvre qui est créée en modifiant le public régional d’une œuvre. @fr
toolkit label: version régionale @fr
toolkit definition: Œuvre qui est créée en modifiant le public régional d’une œuvre. @fr
label: reģionālā versija @lv
definition: Sasaista darbu ar darbu, kas radīts, mainot darba reģionālo auditoriju. @lv
toolkit label: reģionālā versija @lv
toolkit definition: Darbs, kas radīts, mainot darba reģionālo auditoriju. @lv
label: 有地区版本 @zh-hans
definition: 将一种作品与通过改变一种作品的地区受众而创建的一种作品关联起来。 @zh-hans
toolkit label: 地区版本 @zh-hans
toolkit definition: 通过改变一种作品的地区受众而创建的一种作品 @zh-hans
has subproperty: P10386
label: bölgesel sürüm ile ilişkilidir @tr
definition: Bir eseri, bir eserin bölgesel kitlesi değiştirilerek oluşturulan bir eserle ilişkilendirir. @tr
toolkit label: bölgesel sürüm @tr
toolkit definition: Bir eserin bölgesel izleyici kitlesinin değiştirilmesiyle oluşturulan bir eser. @tr

is regional version of
status: Published
lexical alias: regionalVersionOf.en
definition: Relates a work to a work that has a regional audience that is changed to create a work.
toolkit label: regional version of
toolkit definition: A work that has a regional audience that is changed to create a work.
type: Property
domain: C10001
sub property of: is transformation by audience of
has element type: 2
label: alueversio teoksesta @fi
definition: Liittää teoksen teokseen, jolla on alueyleisö, jota on muutettu teoksen luomiseksi. @fi
toolkit label: alueversio teoksesta @fi
toolkit definition: Teos, jolla on alueyleisö, jota on muutettu teoksen luomiseksi. @fi
label: er regional versjon av @no
definition: Relaterer et verk til et verk som har en regional målgruppe som er endret for å skape et verk. @no
toolkit label: regional versjon av @no
toolkit definition: Et verk som har en regional målgruppe som er endret for å skape et verk. @no
label: is regionale versie van @nl
definition: Relateert een werk aan een werk dat een regionale doelgroep heeft die gewijzigd wordt om een werk te creëren. @nl
toolkit label: regionale versie van @nl
toolkit definition: Een werk dat een regionale doelgroep heeft die gewijzigd wordt om een werk te creëren. @nl
label: هو إصدارة إقليمية لـ @ar
definition: يربط عمل بعمل له جمهور إقليمي يتم تغييره لإنشاء عمل. @ar
toolkit label: إصدارة إقليمية لـ @ar
toolkit definition: عمل له جمهور إقليمي يتم تغييره لإنشاء عمل. @ar
label: és versió regional de @ca
definition: Relaciona una obra amb una obra que té uns destinataris regionals que es canvien per crear una obra. @ca
toolkit label: versió regional de @ca
toolkit definition: Obra que té uns destinataris regionals que es canvien per crear una obra. @ca
label: er regional version af @da
definition: Relaterer et værk til et værk, som har en regional målgruppe, som ændres for at skabe et værk. @da
toolkit label: regional version af @da
toolkit definition: Værk, som har en regional målgruppe, som ændres for at skabe et værk. @da
label: regionaalversioon teosest @et
definition: Seostab teose teosega, mille regionaalset sihtrühma on teose loomiseks muudetud. @et
toolkit label: regionaalversioon teosest @et
toolkit definition: Teos, mille regionaalset sihtrühma on teose loomiseks muudetud. @et
label: ist Regionalversion von @de
definition: Setzt ein Werk in Beziehung zu einem Werk, dessen regionale Zielgruppe geändert wird, um ein Werk zu schaffen. @de
toolkit label: Regionalversion von @de
toolkit definition: Ein Werk, dessen regionales Zielgruppe geändert wird, um ein Werk zu schaffen. @de
label: regionális változata a következőnek: @hu
definition: Hozzákapcsol egy művet egy műhöz, amelynek regionális közönsége megváltozott egy mű létrejövetele érdekében. @hu
toolkit label: regionális változata: @hu
toolkit definition: Egy mű, amelynek regionális közönsége megváltozott egy mű létrejövetele érdekében. @hu
label: è versione regionale di @it
definition: Correla un'opera a un'opera i cui destinatari regionali sono cambiati per creare un'opera. @it
toolkit label: versione regionale di @it
toolkit definition: Opera i cui destinatari regionali sono cambiati per creare un'opera. @it
label: est une version régionale de @fr
definition: Met une œuvre en relation avec une œuvre dont le public cible régional est modifié pour créer une œuvre. @fr
toolkit label: version régionale de @fr
toolkit definition: Œuvre dont le public cible régional est modifié pour créer une œuvre. @fr
label: ir reģionālā versija no @lv
definition: Sasaista darbu ar darbu, kam reģionālā auditorija mainīta, lai radītu šo darbu. @lv
toolkit label: reģionālā versija no @lv
toolkit definition: Darbs, kam reģionālā auditorija mainīta, lai radītu šo darbu. @lv
label: 是……的地区版本 @zh-hans
definition: 将一种作品与有地区受众并被改变以创建一种作品的一种作品关联起来。 @zh-hans
toolkit label: ……的地区版本 @zh-hans
toolkit definition: 有地区受众并被改变以创建一种作品的一种作品 @zh-hans
has subproperty: P10389
label: bölgesel sürümüdür @tr
definition: Bir eseri, bir eser oluşturmak için değiştirilen bölgesel kitleye sahip bir eser ile ilişkilendirir. @tr
toolkit label: bölgesel versiyona sahip (eser) @tr
toolkit definition: Bir eserin, bölgesel hedef kitlesi değiştirilerek oluşturulduğu bir eser. @tr

has related entity of work
status: Published
lexical alias: relatedEntityOfWork.en
definition: Relates a work to an entity that is associated with a work.
toolkit label: related entity of work
toolkit definition: An entity that is associated with a work.
type: Property
domain: C10001
has element type: 1
sub property of: P00028
label: teokseen liittyvä entiteetti @fi
definition: Liittää teoksen entiteettiin, joka liittyy teokseen. @fi
toolkit label: teokseen liittyvä entiteetti @fi
toolkit definition: Entiteetti, joka liittyy teokseen. @fi
label: har relatert entitet for verk @no
definition: Relaterer et verk til en entitet som forbindes med et verk. @no
toolkit label: relatert entitet for verk @no
toolkit definition: En entitet som forbindes med et verk. @no
label: heeft gerelateerde entiteit van werk @nl
definition: Relateert een werk aan een entitieit die is geassocieerd met een werk. @nl
toolkit label: gerelateerde entiteit van werk @nl
toolkit definition: Een entitieit die is geassocieerd met een werk. @nl
label: له كيان مرتبط بعمل @ar
definition: يربط بين عمل وكيان مرتبط بعمل. @ar
toolkit label: كيان مرتبط بعمل @ar
toolkit definition: كيان مرتبط بعمل. @ar
label: té com a entitat relacionada amb una obra @ca
definition: Relaciona una obra amb una entitat que s’associa amb una obra. @ca
toolkit label: entitat relacionada amb una obra @ca
toolkit definition: Entitat que s’associa amb una obra. @ca
label: har entitet relateret til værk @da
definition: Relaterer et værk til en entitet, som er knyttet til et værk. @da
toolkit label: entitet relateret til værk @da
toolkit definition: Entitet, som er knyttet til et værk. @da
label: teosega seotud olem @et
definition: Seostab teose teosega seotud olemiga. @et
toolkit label: teosega seotud olem @et
toolkit definition: Teosega seotud olem. @et
label: hat mit Werk in Beziehung stehende Entität @de
definition: Setzt ein Werk in Beziehung zu einer Entität, die mit einem Werk in Verbindung steht. @de
toolkit label: mit Werk in Beziehung stehende Entität @de
toolkit definition: Eine Entität, die mit einem Werk in Verbindung steht. @de
label: mű kapcsolódó entitása a következő: @hu
definition: Hozzákapcsol egy művet egy entitáshoz, amelyet egy műhöz társítanak. @hu
toolkit label: mű kapcsolódó entitása: @hu
toolkit definition: Egy entitás, amelyet egy műhöz társítanak. @hu
label: ha come entità correlata di opera @it
definition: Correla un'opera a un'entità associata a un'opera. @it
toolkit label: entità correlata di opera @it
toolkit definition: Entità associata a un'opera. @it
label: a pour entité en relation avec une œuvre @fr
definition: Met une œuvre en relation avec une entité qui est associée à une œuvre. @fr
toolkit label: entité en relation avec une œuvre @fr
toolkit definition: Entité qui est associée à une œuvre. @fr
label: ar darbu saistītā entīte @lv
definition: Sasaista darbu ar entīti, kas saistīta ar darbu. @lv
toolkit label: ar darbu saistītā entīte @lv
toolkit definition: Entīte, kas saistīta ar darbu @lv
label: 有作品的关联实体 @zh-hans
definition: 将一种作品与和一种作品有关的一个实体关联起来。 @zh-hans
toolkit label: 作品的关联实体 @zh-hans
toolkit definition: 和一种作品有关的一个实体 @zh-hans
has subproperty: has related RDA entity of work
has subproperty: has subject
has subproperty: P10405
label: eserin ilgili varlığı ile ilişkilidir @tr
definition: Bir eseri, bir eserle bağlantılı olan bir varlıkla ilişkilendirir. @tr
toolkit label: Eserin ilşkili olduğu varlık @tr
toolkit definition: Bir eserle bağlantılı olan bir varlık. @tr

has related RDA entity of work
status: Published
sub property of: has related entity of work
type: Property
lexical alias: relatedRDAEntityOfWork.en
definition: Relates a work to an RDA entity that is associated with a work.
domain: C10001
label: har RDA-entitet relateret til værk @da
definition: Relaterer et værk til en RDA-entitet, som er knyttet til et værk. @da
label: có thực thể có liên quan (tác phẩm) @vi
definition: Liên kết tác phẩm với thực thể liên quan tới tác phẩm đang được mô tả. @vi
toolkit definition: Thực thể liên quan tới tác phẩm đang được mô tả. @vi
definition: Liittää teoksen RDA-entiteettiin, joka liittyy teokseen. @fi
toolkit label: teokseen liittyvä RDA-entiteetti @fi
toolkit definition: RDA-entiteetti, joka liittyy teokseen. @fi
label: té com a entitat RDA relacionada amb una obra @ca
definition: Relaciona una obra amb una entitat RDA que s’associa amb una obra. @ca
label: a pour entité RDA en relation avec une œuvre @fr
definition: Met une œuvre en relation avec une entité RDA qui est associée à une œuvre. @fr
toolkit label: related RDA entity of work
toolkit definition: An RDA entity that is associated with a work.
has element type: 1
label: έχει σχετική οντότητα (έργο) @el
definition: Συνδέει ένα έργο με μια οντότητα που συνδέεται με ένα περιγραφόμενο έργο. @el
label: műhöz kapcsolódó RDA-entitás a következő: @hu
definition: Hozzákapcsol egy noment egy műhöz kapcsolódó RDA-entitáshoz. @hu
sub property of: P00001
label: teokseen liittyvä RDA-entiteetti @fi
label: har RDA-entitet relatert til verk @no
definition: Relaterer et verk til en RDA-entitet som forbindes med et verk. @no
toolkit label: RDA-entitet relatert til verk @no
toolkit definition: En RDA-entitet som forbindes med et verk. @no
label: heeft gerelateerde RDA-entiteit van werk @nl
definition: Relateert een werk aan een RDA-entiteit die is geassocieerd met een werk. @nl
toolkit label: gerelateerde RDA-entiteit van werk @nl
toolkit definition: Een RDA-entiteit die is geassocieerd met een werk. @nl
label: له كيان "وام" مرتبط بعمل @ar
definition: يربط بين عمل وكيان "وام" مرتبط بعمل. @ar
toolkit label: كيان "وام" مرتبط بعمل @ar
toolkit definition: كيان "وام" المرتبط بعمل. @ar
toolkit label: entitat RDA relacionada amb una obra @ca
toolkit definition: Entitat RDA que s’associa amb una obra. @ca
toolkit label: RDA-entitet relateret til værk @da
toolkit definition: RDA-entitet, som er knyttet til et værk. @da
label: teosega seotud RDA olem @et
definition: Seostab teose teosega seotud RDA olemiga. @et
toolkit label: teosega seotud RDA olem @et
toolkit definition: Teosega seotud RDA olem. @et
label: hat mit Werk in Beziehung stehende RDA-Entität @de
definition: Setzt ein Werk in Beziehung zu einer RDA-Entität, die mit einem Werk in Verbindung steht. @de
toolkit label: mit Werk in Beziehung stehende RDA-Entität @de
toolkit definition: Eine RDA-Entität, die mit einem Werk in Verbindung steht. @de
toolkit label: műhöz kapcsolódó RDA-entitás: @hu
toolkit definition: Egy műhöz kapcsolódó RDA-entitás: @hu
label: ha come entità RDA correlata a opera @it
definition: Correla un'opera a un'entità RDA che è associata a un'opera. @it
toolkit label: entità RDA correlata a opera @it
toolkit definition: Entità RDA che è associata a un'opera. @it
toolkit label: entité RDA en relation avec une œuvre @fr
toolkit definition: Entité RDA qui est associée à une œuvre. @fr
label: ar darbu saistītā RDA entīte @lv
definition: Sasaista darbu ar RDA entīti, kas saistīta ar darbu. @lv
toolkit label: ar darbu saistītā RDA entīte @lv
toolkit definition: RDA entīte, kas saistīta ar darbu. @lv
label: 有作品的关联RDA实体 @zh-hans
definition: 将一种作品与和一种作品有关的一个RDA实体关联起来。 @zh-hans
toolkit label: 作品的关联RDA实体 @zh-hans
toolkit definition: 和一种作品有关的一个RDA实体 @zh-hans
has subproperty: has related agent of work
has subproperty: has related place of work
has subproperty: has related timespan of work
has subproperty: has related expression of work
has subproperty: has related manifestation of work
has subproperty: has related nomen of work
has subproperty: has related item of work
has subproperty: has related work of work
has subproperty: has subject RDA entity
has subproperty: P10307
label: eserin ilgili RDA varlığı ile ilişkilidir @tr
definition: Bir eseri, bir eserle bağlantılı olan bir RDA varlığıyla ilişkilendirir. @tr

has remix artist agent
status: Published
sub property of: has creator agent of work
type: Property
lexical alias: remixArtistAgent.en
definition: Relates a work to an agent who is responsible for creating an audio work by manipulating, recombining, mixing, and reproducing previously recorded sounds.
scope note: Remixing activities that do not substantially change the nature and content of the original work, and mixing recorded tracks together to appear as one continuous track, are excluded.
domain: C10001
toolkit label: remix artist agent
toolkit definition: An agent who is responsible for creating an audio work by manipulating, recombining, mixing, and reproducing previously recorded sounds.
see also: P20296
instruction number: 18.5
label: har agent, som er remixer @da
definition: Relaterer et værk til en agent, som er ansvarlig for at skabe et lydværk ved manipulering, rekombinering, mixing og gengivelse af tidligere indspillede lyde. @da
scope note: Remixing-aktiviteter, som ikke væsentligt forandrer originalværkets karakter og indhold, samt mixe indspillede lydspor sammen for at fremstå som ét uafbrudt spor, er ikke omfattet. @da
toolkit label: agent, som er remixer @da
toolkit definition: Agent, som er ansvarlig for at skabe et lydværk ved manipulering, rekombinering, mixing og gengivelse af tidligere indspillede lyde. @da
label: có nghệ sỹ hoà âm @vi
definition: Liên kết tác phẩm với tác nhân có trách nhiệm sáng tạo tác phẩm audio bằng cách thực hiện, kết hợp, hoà âm, và sản xuất lại âm thanh được ghi trước đây. @vi
scope note: Hoạt động tái hào âm không làm thay đổi cơ bản bản chất và nội dung và nội dung của tác phẩm nguyên gốc và hoà trộn các rãnh ghi với nhau để thành rãnh liên tục không được bao gồm. @vi
toolkit label: nghệ sỹ hoà âm @vi
toolkit definition: Tác nhân có trách nhiệm sáng tạo tác phẩm audio bằng cách thực hiện, kết hợp, hoà âm, và sản xuất lại âm thanh được ghi trước đây. @vi
label: hat Remix Artist (Akteur) @de
definition: Setzt ein Werk in Beziehung zu einem Akteur, der für das Schaffen eines Tonwerks verantwortlich ist, indem er eine bestehende Tonaufnahme bearbeitet, rekombiniert, mischt und reproduziert. @de
scope note: Darunter fallen keine Nachbearbeitungen, die weder Art noch Inhalt des Originalwerks wesentlich verändern, sowie das Zusammenmischen von aufgenommenen Einzelspuren (Kanälen) zu einem scheinbar ununterbrochen durchgehenden Klangerlebnis. @de
toolkit label: Remix Artist (Akteur) @de
toolkit definition: Ein Akteur, der für das Schaffen eines Tonwerks verantwortlich ist, indem er eine bestehende Tonaufnahme bearbeitet, rekombiniert, mischt und reproduziert. @de
definition: Liittää teoksen toimijaan, joka on vastuussa ääniteoksen luomisesta manipuloimalla, yhdistelemällä, sekoittamalla ja uudelleen tuottamalla aiemmin äänitettyjä ääniä. @fi
toolkit label: uudelleenmiksaaja (toimija) @fi
toolkit definition: Toimija, joka on vastuussa ääniteoksen luomisesta manipuloimalla, yhdistelemällä, sekoittamalla ja uudelleen tuottamalla aiemmin äänitettyjä ääniä. @fi
toolkit label: remikser (agent) @no
toolkit definition: En agent som er ansvarlig for å skape et lydverk ved å manipulere, mikse, sette sammen og reprodusere lyd som er spilt inn tidligere. @no
label: té com a agent artista de remescla @ca
definition: Relaciona una obra amb un agent que és responsable de la creació d’una obra àudio mitjançant la manipulació, la recombinació, la mescla i la reproducció de sons enregistrats prèviament. @ca
scope note: S’exclouen les activitats de remescla que no canvien substancialment la natura i el contingut de l’obra original, i la mescla de pistes enregistrades conjuntament perquè semblin una pista contínua. @ca
toolkit label: agent artista de remescla @ca
toolkit definition: Agent que és responsable de la creació d’una obra àudio mitjançant la manipulació, la recombinació, la mescla i la reproducció de sons enregistrats prèviament. @ca
label: a pour agent remixeur @fr
definition: Met une œuvre en relation avec un agent qui est responsable de la création d’une œuvre audio par la manipulation, la recombinaison, le mixage et la reproduction de sons préalablement enregistrés. @fr
scope note: Sont exclus les activités de remixage qui ne changent pas considérablement la nature et le contenu de l’œuvre originale et le fait de mixer ensemble des pistes enregistrées pour donner l’impression d’une seule piste continue. @fr
toolkit label: agent remixeur @fr
toolkit definition: Agent qui est responsable de la création d’une œuvre audio par la manipulation, la recombinaison, le mixage et la reproduction de sons préalablement enregistrés. @fr
has element type: 2
label: έχει καλλιτέχνη remix @el
definition: Συνδέει ένα έργο με έναν φορέα υπεύθυνο για τη δημιουργία ενός ακουστικού έργου μέσω του χειρισμού, της επανασύνθεσης, της μίξης και της αναπαραγωγής προηγούμενα ηχογραφημένων ήχων. @el
scope note: Δεν περιλαμβάνονται οι διαδικασίες μίξης, οι οποίες δεν μεταβάλλουν ουσιαστικά τη φύση και το περιεχόμενου του πρωτότυπου έργου και η μίξη ηχογραφημένων κομματιών [με τέτοιον τρόπο], ώστε [αυτά] να εμφανίζονται ως ένα ενιαίο κομμάτι. @el
toolkit label: καλλιτέχνης remix @el
toolkit definition: Ένας φορέας υπεύθυνος για τη δημιουργία ενός ακουστικού έργου μέσω του χειρισμού, της επανασύνθεσης, της μίξης και της αναπαραγωγής προηγούμενα ηχογραφημένων ήχων. @el
label: remixművész ágense a következő: @hu
definition: Hozzákapcsol egy művet egy ágenshez, amely felelős egy audiomű létrehozásáért korábban rögzített hangok manipulálásával, újrakombinálásával, keverésével és reprodukálásával. @hu
scope note: Nem tartoznak ide sem azok a remixelési tevékenységek, amelyek nem változtatják meg lényegesen az eredeti mű jellegét és tartalmát, sem a rögzített sávok látszólag egy folyamatos sávként való összemixelése. @hu
toolkit label: remixművész ágens: @hu
toolkit definition: Egy ágens, amely felelős egy audiomű létrehozásáért korábban rögzített hangok megmunkálásával, újrakombinálásával és reprodukálásával. @hu
alternative label: remix artist
scope note: Ei kata uudelleenmiksaamista, joka ei oleellisesti muuta alkuperäisen teoksen luonnetta ja sisältöä eikä aiemmin äänitettyjen musiikkikappaleiden yhdistämistä yhdeksi musiikkikappaleeksi. @fi
alternative label: uudelleenmiksaaja @fi
label: uudelleenmiksaaja (toimija) @fi
label: har remikser (agent) @no
definition: Relaterer et verk til en agent som er ansvarlig for å skape et lydverk ved å manipulere, mikse, sette sammen og reprodusere lyd som er spilt inn tidligere. @no
scope note: Remiksaktiviteter som ikke i betydelig grad endrer originalverkets særpreg og innhold, og miksing av innspilte spor slik at resultatet høres ut som ett sammenhengende spor, er ikke inkludert. @no
alternative label: remikser @no
label: heeft remixartiest-actor @nl
definition: Relateert een werk aan een actor die verantwoordelijk is voor het creëren van een geluidswerk door het manipuleren, opnieuw combineren, mixen en reproduceren van eerder opgenomen geluiden. @nl
scope note: Remixhandelingen die de aard en content van het originele werk niet substantieel wijzigen, en het bij elkaar mixen van opgenomen sporen zodat het één voortdurend spoor lijkt, zijn uitgesloten. @nl
toolkit label: remixartiest-actor @nl
toolkit definition: Een actor die verantwoordelijk is voor het creëren van een geluidswerk door het manipuleren, opnieuw combineren, mixen en reproduceren van eerder opgenomen geluiden. @nl
label: له وكيل فنان مزج موسيقي @ar
definition: يربط بين عمل ووكيل مسئول عن إنشاء عمل صوتي عن طريق معالجة الأصوات المسجلة مسبقًا، وإعادة دمجها، وخلطها، وإعادة إنتاجها. @ar
scope note: تُستبعد أنشطة المزج التي لا تغير تغييرا كبيرا طبيعة العمل الأصلي ومحتواه، ودمج المسارات المسجلة معًا لتظهر كمسار واحد مستمر. @ar
alternative label: فنان مزج موسيقي @ar
toolkit label: وكيل فنان مزج موسيقي @ar
toolkit definition: وكيل مسئول عن إنشاء عمل صوتي عن طريق معالجة الأصوات المسجلة مسبقًا، وإعادة دمجها، وخلطها، وإعادة إنتاجها. @ar
alternative label: artista de remescla @ca
alternative label: remixer @da
label: remiksija (tegija) @et
definition: Seostab teose tegijaga, kes vastutab audioteose loomise eest, manipuleerides, ümber kombineerides, segades ja taastekitades varem salvestatud helisid. @et
scope note: Ei hõlma remiksimist, mis ei muuda oluliselt originaalteose olemust ja sisu, ega salvestatud heliradade kokkupanekut üheks helirajaks. @et
alternative label: remiksija @et
toolkit label: remiksija (tegija) @et
toolkit definition: Tegija, kes vastutab audioteose loomise eest, manipuleerides, ümber kombineerides, segades ja taastekitades varem salvestatud helisid. @et

has remix artist collective agent
status: Published
lexical alias: remixArtistCollectiveAgent.en
definition: Relates a work to a collective agent who is responsible for creating an audio work by manipulating, recombining, mixing, and reproducing previously recorded sounds.
toolkit label: remix artist collective agent
toolkit definition: A collective agent who is responsible for creating an audio work by manipulating, recombining, mixing, and reproducing previously recorded sounds.
type: Property
domain: C10001
has element type: 2
sub property of: has creator collective agent of work
sub property of: has remix artist agent
scope note: Remixing activities that do not substantially change the nature and content of the original work, and mixing recorded tracks together to appear as one continuous track, are excluded.
label: uudelleenmiksaaja (yhteistoimija) @fi
definition: Liittää teoksen yhteistoimijaan, joka on vastuussa ääniteoksen luomisesta manipuloimalla, yhdistelemällä, sekoittamalla ja uudelleen tuottamalla aiemmin äänitettyjä ääniä. @fi
scope note: Ei kata uudelleenmiksaamista, joka ei oleellisesti muuta alkuperäisen teoksen luonnetta ja sisältöä eikä aiemmin äänitettyjen musiikkikappaleiden yhdistämistä yhdeksi musiikkikappaleeksi. @fi
toolkit label: uudelleenmiksaaja (yhteistoimija) @fi
toolkit definition: Yhteistoimija, joka on vastuussa ääniteoksen luomisesta manipuloimalla, yhdistelemällä, sekoittamalla ja uudelleen tuottamalla aiemmin äänitettyjä ääniä. @fi
label: har remikser (kollektiv agent) @no
definition: Relaterer et verk til en kollektiv agent som er ansvarlig for å skape et lydverk ved å manipulere, mikse, sette sammen og reprodusere lyd som er spilt inn tidligere. @no
scope note: Remiksaktiviteter som ikke i betydelig grad endrer originalverkets særpreg og innhold, og miksing av innspilte spor slik at resultatet høres ut som ett sammenhengende spor, er ikke inkludert. @no
toolkit label: remikser (kollektiv agent) @no
toolkit definition: En kollektiv agent som er ansvarlig for å skape et lydverk ved å manipulere, mikse, sette sammen og reprodusere lyd som er spilt inn tidligere. @no
label: heeft remixartiest-collectieve actor @nl
definition: Relateert een werk aan een collectieve actor die verantwoordelijk is voor het creëren van een geluidswerk door het manipuleren, opnieuw combineren, mixen en reproduceren van eerder opgenomen geluiden. @nl
scope note: Remixhandelingen die de aard en content van het originele werk niet substantieel wijzigen, en het bij elkaar mixen van opgenomen sporen zodat het één voortdurend spoor lijkt, zijn uitgesloten. @nl
toolkit label: remixartiest-collectieve actor @nl
toolkit definition: Een collectieve actor die verantwoordelijk is voor het creëren van een geluidswerk door het manipuleren, opnieuw combineren, mixen en reproduceren van eerder opgenomen geluiden. @nl
label: له وكيل جماعي فنان مزج موسيقي @ar
definition: يربط بين عمل ووكيل جماعي مسئول عن إنشاء عمل صوتي من خلال المعالجة بالأصوات المسجلة مسبقًا، وإعادة دمجها، وخلطها، وإعادة إنتاجها. @ar
scope note: تُستبعد أنشطة المزج التي لا تغير تغييرا كبيرا طبيعة العمل الأصلي ومحتواه، ودمج المسارات المسجلة معًا لتظهر كمسار واحد مستمر. @ar
toolkit label: وكيل جماعي فنان مزج موسيقي @ar
toolkit definition: وكيل جماعي مسئول عن إنشاء عمل صوتي من خلال المعالجة بالأصوات المسجلة مسبقًا، وإعادة دمجها، وخلطها، وإعادة إنتاجها. @ar
label: té com a agent col·lectiu artista de remescla @ca
definition: Relaciona una obra amb un agent col·lectiu que és responsable de la creació d’una obra d’àudio mitjançant la manipulació, la recombinació, la mescla i la reproducció de sons enregistrats prèviament. @ca
scope note: S’exclouen les activitats de remescla que no canvien substancialment la natura i el contingut de l’obra original, i la mescla de pistes enregistrades conjuntament perquè semblin una pista contínua. @ca
toolkit label: agent col·lectiu artista de remescla @ca
toolkit definition: Agent col·lectiu que és responsable de la creació d’una obra d’àudio mitjançant la manipulació, la recombinació, la mescla i la reproducció de sons enregistrats prèviament. @ca
label: har kollektiv agent, som er remixer @da
definition: Relaterer et værk til en kollektiv agent, som er ansvarlig for at skabe et lydværk ved manipulering, rekombinering, mixing og gengivelse af tidligere indspillede lyde. @da
scope note: Remixing-aktiviteter, som ikke væsentligt forandrer originalværkets karakter og indhold, samt mixe indspillede lydspor sammen for at fremstå som ét uafbrudt spor, er ikke omfattet. @da
toolkit label: kollektiv agent, som er remixer @da
toolkit definition: Kollektiv agent, som er ansvarlig for at skabe et lydværk ved manipulering, rekombinering, mixing og gengivelse af tidligere indspillede lyde. @da
label: remiksija (kollektiiv) @et
definition: Seostab teose kollektiiviga, kes vastutab audioteose loomise eest, manipuleerides, ümber kombineerides, segades ja taastekitades varem salvestatud helisid. @et
scope note: Ei hõlma remiksimist, mis ei muuda oluliselt originaalteose olemust ja sisu, ega salvestatud heliradade kokkupanekut üheks helirajaks. @et
toolkit label: remiksija (kollektiiv) @et
toolkit definition: Kollektiiv, kes vastutab audioteose loomise eest, manipuleerides, ümber kombineerides, segades ja taastekitades varem salvestatud helisid. @et
label: hat Remix Artist (Gemeinschaftlicher Akteur) @de
definition: Setzt ein Werk in Beziehung zu einem gemeinschaftlichen Akteur, der für die Schaffung eines Tonwerks verantwortlich ist, indem er eine bestehende Tonaufnahme bearbeitet, rekombiniert, mischt und reproduziert. @de
scope note: Darunter fallen keine Nachbearbeitungen, die weder Art noch Inhalt des Originalwerks wesentlich verändern, sowie das Zusammenmischen von aufgenommenen Einzelspuren (Kanälen) zu einem scheinbar ununterbrochen durchgehenden Klangerlebnis. @de
toolkit label: Remix Artist (Gemeinschaftlicher Akteur) @de
toolkit definition: Ein gemeinschaftlicher Akteur, der für die Schaffung eines Tonwerks verantwortlich ist, indem er eine bestehende Tonaufnahme bearbeitet, rekombiniert, mischt und reproduziert. @de
label: remixművész kollektív ágense a következő: @hu
definition: Hozzákapcsol egy művet egy kollektív ágenshez, amely felelős egy audiomű létrehozásáért korábban rögzített hangok manipulálásával, újrakombinálásával, keverésével és reprodukálásával. @hu
scope note: Nem tartoznak ide sem azok a remixelési tevékenységek, amelyek nem változtatják meg lényegesen az eredeti mű jellegét és tartalmát, sem a rögzített sávok látszólag egy folyamatos sávként való összemixelése. @hu
toolkit label: remixművész kollektív ágens: @hu
toolkit definition: Egy kollektív ágens, amely felelős egy audiomű létrehozásáért korábban rögzített hangok manipulálásával, újrakombinálásával, keverésével és reprodukálásával. @hu
label: ha come artista di remix agente collettivo @it
definition: Correla un'opera all'agente collettivo responsabile della creazione di un'opera audio tramite la manipolazione, ricombinazione, missaggio e riproduzione di suoni registrati in precedenza. @it
scope note: Sono escluse le attività che non modificano sostanzialmente la natura e il contenuto dell'opera originale, nonché il missaggio di brani registrati che appaiono come un unico brano. @it
toolkit label: artista di remix agente collettivo @it
toolkit definition: Agente collettivo responsabile della creazione di un'opera audio tramite la manipolazione, ricombinazione, missaggio e riproduzione di suoni registrati in precedenza. @it
label: a pour agent collectif remixeur @fr
definition: Met une œuvre en relation avec un agent collectif qui est responsable de la création d’une œuvre audio par la manipulation, la recombinaison, le mixage et la reproduction de sons préalablement enregistrés. @fr
scope note: Sont exclus les activités de remixage qui ne changent pas considérablement la nature et le contenu de l’œuvre originale et le fait de mixer ensemble des pistes enregistrées pour donner l’impression d’une seule piste continue. @fr
toolkit label: agent collectif remixeur @fr
toolkit definition: Agent collectif qui est responsable de la création d’une œuvre audio par la manipulation, la recombinaison, le mixage et la reproduction de sons préalablement enregistrés. @fr
label: remiksētājs (grupa) @lv
definition: Sasaista darbu ar grupu, kas ir atbildīga par audio darba radīšanu, manipulējot, pārkombinējot, miksējot un atkārtoti atskaņojot iepriekš ierakstītas skaņas. @lv
toolkit label: remiksētājs (grupa) @lv
toolkit definition: Grupa, kas ir atbildīga par audio darba radīšanu, manipulējot, pārkombinējot, miksējot un atkārtoti atskaņojot iepriekš ierakstītas skaņas. @lv
scope note: Neietver remiksēšanas darbības, kas būtiski nemaina oriģinālā darba būtību un saturu, kā arī ierakstu celiņu apvienošanu vienā ieraksta celiņā. @lv
label: 有合成艺术家集体行为者 @zh-hans
definition: 将一种作品与通过操纵、重新组合、混合和复制事先录制的声音而负责创建一种音频作品的一个集体行为者关联起来。 @zh-hans
toolkit label: 合成艺术家集体行为者 @zh-hans
toolkit definition: 通过操纵、重新组合、混合和复制事先录制的声音而负责创建一种音频作品的一个集体行为者 @zh-hans
scope note: 不包括不实质性改变原作品的性质和内容的合成活动、以及将录制的音轨混合成一个连续的音轨的活动。 @zh-hans
has subproperty: has remix artist corporate body
has subproperty: has remix artist family
has subproperty: P10496

has remix artist corporate body
status: Published
lexical alias: remixArtistCorporateBody.en
definition: Relates a work to a corporate body who is responsible for creating an audio work by manipulating, recombining, mixing, and reproducing previously recorded sounds.
toolkit label: remix artist corporate body
toolkit definition: A corporate body who is responsible for creating an audio work by manipulating, recombining, mixing, and reproducing previously recorded sounds.
type: Property
domain: C10001
has element type: 2
sub property of: has creator corporate body of work
sub property of: has remix artist collective agent
scope note: Remixing activities that do not substantially change the nature and content of the original work, and mixing recorded tracks together to appear as one continuous track, are excluded.
label: uudelleenmiksaaja (yhteisö) @fi
definition: Liittää teoksen yhteisöön, joka on vastuussa ääniteoksen luomisesta manipuloimalla, yhdistelemällä, sekoittamalla ja uudelleen tuottamalla aiemmin äänitettyjä ääniä. @fi
scope note: Ei kata uudelleenmiksaamista, joka ei oleellisesti muuta alkuperäisen teoksen luonnetta ja sisältöä eikä aiemmin äänitettyjen musiikkikappaleiden yhdistämistä yhdeksi musiikkikappaleeksi. @fi
toolkit label: uudelleenmiksaaja (yhteisö) @fi
toolkit definition: Yhteisö, joka on vastuussa ääniteoksen luomisesta manipuloimalla, yhdistelemällä, sekoittamalla ja uudelleen tuottamalla aiemmin äänitettyjä ääniä. @fi
label: har remikser (korporasjon) @no
definition: Relaterer et verk til en korporasjon som er ansvarlig for å skape et lydverk ved å manipulere, mikse, sette sammen og reprodusere lyd som er spilt inn tidligere. @no
scope note: Remiksaktiviteter som ikke i betydelig grad endrer originalverkets særpreg og innhold, og miksing av innspilte spor slik at resultatet høres ut som ett sammenhengende spor, er ikke inkludert. @no
toolkit label: remikser (korporasjon) @no
toolkit definition: En korporasjon som er ansvarlig for å skape et lydverk ved å manipulere, mikse, sette sammen og reprodusere lyd som er spilt inn tidligere. @no
label: heeft remixartiest-corporatie @nl
definition: Relateert een werk aan een corporatie die verantwoordelijk is voor het creëren van een geluidswerk door het manipuleren, opnieuw combineren, mixen en reproduceren van eerder opgenomen geluiden. @nl
scope note: Remixhandelingen die de aard en content van het originele werk niet substantieel wijzigen, en het bij elkaar mixen van opgenomen sporen zodat het één voortdurend spoor lijkt, zijn uitgesloten. @nl
toolkit label: remixartiest-corporatie @nl
toolkit definition: Een corporatie die verantwoordelijk is voor het creëren van een geluidswerk door het manipuleren, opnieuw combineren, mixen en reproduceren van eerder opgenomen geluiden. @nl
label: له هيئة فنانة مزج موسيقي @ar
definition: يربط بين عمل وهيئة مشتركة مسئولة عن إنشاء عمل صوتي عن طريق المعالجة بالأصوات المسجلة مسبقًا، وإعادة دمجها، وخلطها، وإعادة إنتاجها. @ar
scope note: تُستبعد أنشطة المزج التي لا تغير تغييرا كبيرا طبيعة العمل الأصلي ومحتواه، ودمج المسارات المسجلة معًا لتظهر كمسار واحد مستمر. @ar
toolkit label: هيئة فنانة مزج موسيقي @ar
toolkit definition: هيئة مسئولة عن إنشاء عمل صوتي عن طريق المعالجة بالأصوات المسجلة مسبقًا، وإعادة دمجها، وخلطها، وإعادة إنتاجها. @ar
label: té com a entitat corporativa artista de remescla @ca
definition: Relaciona una obra amb una entitat corporativa que és responsable de la creació d’una obra d’àudio mitjançant la manipulació, la recombinació, la mescla i la reproducció de sons enregistrats prèviament. @ca
scope note: S’exclouen les activitats de remescla que no canvien substancialment la natura i el contingut de l’obra original, i la mescla de pistes enregistrades conjuntament perquè semblin una pista contínua. @ca
toolkit label: entitat corporativa artista de remescla @ca
toolkit definition: Entitat corporativa que és responsable de la creació d’una obra d’àudio mitjançant la manipulació, la recombinació, la mescla i la reproducció de sons enregistrats prèviament. @ca
label: har korporation, som er remixer @da
definition: Relaterer et værk til en korporation, som er ansvarlig for at skabe et lydværk ved manipulering, rekombinering, mixing og gengivelse af tidligere indspillede lyde. @da
scope note: Remixing-aktiviteter, som ikke væsentligt forandrer originalværkets karakter og indhold, samt mixe indspillede lydspor sammen for at fremstå som ét uafbrudt spor, er ikke omfattet. @da
toolkit label: korporation, som er remixer @da
toolkit definition: Korporation, som er ansvarlig for at skabe et lydværk ved manipulering, rekombinering, mixing og gengivelse af tidligere indspillede lyde. @da
label: remiksija (asutus) @et
definition: Seostab teose asutusega, kes vastutab audioteose loomise eest, manipuleerides, ümber kombineerides, segades ja taastekitades varem salvestatud helisid. @et
scope note: Ei hõlma remiksimist, mis ei muuda oluliselt originaalteose olemust ja sisu, ega salvestatud heliradade kokkupanekut üheks helirajaks. @et
toolkit label: remiksija (asutus) @et
toolkit definition: Asutus, kes vastutab audioteose loomise eest, manipuleerides, ümber kombineerides, segades ja taastekitades varem salvestatud helisid. @et
label: hat Remix Artist (Körperschaft) @de
definition: Setzt ein Werk in Beziehung zu einer Körperschaft, die für die Schaffung eines Tonwerks verantwortlich ist, indem sie eine bestehende Tonaufnahme bearbeitet, rekombiniert, mischt und reproduziert. @de
scope note: Darunter fallen keine Nachbearbeitungen, die weder Art noch Inhalt des Originalwerks wesentlich verändern, sowie das Zusammenmischen von aufgenommenen Einzelspuren (Kanälen) zu einem scheinbar ununterbrochen durchgehenden Klangerlebnis. @de
toolkit label: Remix Artist (Körperschaft) @de
toolkit definition: Eine Körperschaft, die für die Schaffung eines Tonwerks verantwortlich ist, indem sie eine bestehende Tonaufnahme bearbeitet, rekombiniert, mischt und reproduziert. @de
label: remixművész testülete a következő: @hu
definition: Hozzákapcsol egy művet egy testülethez, amely felelős egy audiomű létrehozásáért korábban rögzített hangok manipulálásával, újrakombinálásával, keverésével és reprodukálásával. @hu
scope note: Nem tartoznak ide sem azok a remixelési tevékenységek, amelyek nem változtatják meg lényegesen az eredeti mű jellegét és tartalmát, sem a rögzített sávok látszólag egy folyamatos sávként való összemixelése. @hu
toolkit label: remixművész testület: @hu
toolkit definition: Egy testület, amely felelős egy audiomű létrehozásáért korábban rögzített hangok manipulálásával, újrakombinálásával, keverésével és reprodukálásával. @hu
label: ha come artista di remix ente @it
definition: Correla un'opera a un ente responsabile della creazione di un'opera audio tramite la manipolazione, ricombinazione, missaggio e riproduzione di suoni registrati in precedenza. @it
scope note: Sono escluse le attività che non modificano sostanzialmente la natura e il contenuto dell'opera originale, nonché il missaggio di brani registrati che appaiono come un unico brano. @it
toolkit label: artista di remix ente @it
toolkit definition: Ente responsabile della creazione di un'opera audio tramite la manipolazione, ricombinazione, missaggio e riproduzione di suoni registrati in precedenza. @it
label: a pour collectivité remixeuse @fr
definition: Met une œuvre en relation avec une collectivité qui est responsable de la création d’une œuvre audio par la manipulation, la recombinaison, le mixage et la reproduction de sons préalablement enregistrés. @fr
scope note: Sont exclus les activités de remixage qui ne changent pas considérablement la nature et le contenu de l’œuvre originale et le fait de mixer ensemble des pistes enregistrées pour donner l’impression d’une seule piste continue. @fr
toolkit label: collectivité remixeuse @fr
toolkit definition: Collectivité qui est responsable de la création d’une œuvre audio par la manipulation, la recombinaison, le mixage et la reproduction de sons préalablement enregistrés. @fr
label: remiksētājs (institūcija) @lv
definition: Sasaista darbu ar institūciju, kas ir atbildīga par audio darba radīšanu, manipulējot, pārkombinējot, miksējot un atkārtoti atskaņojot iepriekš ierakstītas skaņas. @lv
toolkit label: remiksētājs (institūcija) @lv
toolkit definition: Institūcija, kas ir atbildīga par audio darba radīšanu, manipulējot, pārkombinējot, miksējot un atkārtoti atskaņojot iepriekš ierakstītas skaņas. @lv
scope note: Neietver remiksēšanas darbības, kas būtiski nemaina oriģinālā darba būtību un saturu, kā arī ierakstu celiņu apvienošanu vienā ieraksta celiņā. @lv
label: 有合成艺术家团体 @zh-hans
definition: 将一种作品与通过操纵、重新组合、混合和复制事先录制的声音而负责创建一种音频作品的一个团体关联起来。 @zh-hans
toolkit label: 合成艺术家团体 @zh-hans
toolkit definition: 通过操纵、重新组合、混合和复制事先录制的声音而负责创建一种音频作品的一个团体 @zh-hans
scope note: 不包括不实质性改变原作品的性质和内容的合成活动、以及将录制的音轨混合成一个连续的音轨的活动。 @zh-hans
has subproperty: P10543
label: remix sanatçısı tüzel kişisi ile ilişkilidir @tr
definition: Bir eseri, önceden kaydedilmiş sesleri değiştirerek, yeniden birleştirerek, karıştırarak ve yeniden üreterek bir ses eseri oluşturmaktan sorumlu olan tüzel kişi ile ilişkilendirir. @tr

has remix artist family
status: Published
lexical alias: remixArtistFamily.en
definition: Relates a work to a family who is responsible for creating an audio work by manipulating, recombining, mixing, and reproducing previously recorded sounds.
toolkit label: remix artist family
toolkit definition: A family who is responsible for creating an audio work by manipulating, recombining, mixing, and reproducing previously recorded sounds.
type: Property
domain: C10001
has element type: 2
sub property of: has creator family of work
sub property of: has remix artist collective agent
scope note: Remixing activities that do not substantially change the nature and content of the original work, and mixing recorded tracks together to appear as one continuous track, are excluded.
label: uudelleenmiksaaja (suku) @fi
definition: Liittää teoksen sukuun, joka on vastuussa ääniteoksen luomisesta manipuloimalla, yhdistelemällä, sekoittamalla ja uudelleen tuottamalla aiemmin äänitettyjä ääniä. @fi
scope note: Ei kata uudelleenmiksaamista, joka ei oleellisesti muuta alkuperäisen teoksen luonnetta ja sisältöä eikä aiemmin äänitettyjen musiikkikappaleiden yhdistämistä yhdeksi musiikkikappaleeksi. @fi
toolkit label: uudelleenmiksaaja (suku) @fi
toolkit definition: Suku, joka on vastuussa ääniteoksen luomisesta manipuloimalla, yhdistelemällä, sekoittamalla ja uudelleen tuottamalla aiemmin äänitettyjä ääniä. @fi
label: har remikser (familie) @no
definition: Relaterer et verk til en famile som er ansvarlig for å skape et lydverk ved å manipulere, mikse, sette sammen og reprodusere lyd som er spilt inn tidligere. @no
scope note: Remiksaktiviteter som ikke i betydelig grad endrer originalverkets særpreg og innhold, og miksing av innspilte spor slik at resultatet høres ut som ett sammenhengende spor, er ikke inkludert. @no
toolkit label: remikser (familie) @no
toolkit definition: En famile som er ansvarlig for å skape et lydverk ved å manipulere, mikse, sette sammen og reprodusere lyd som er spilt inn tidligere. @no
label: heeft remixartiest-familie @nl
definition: Relateert een werk aan een familie die verantwoordelijk is voor het creëren van een geluidswerk door het manipuleren, opnieuw combineren, mixen en reproduceren van eerder opgenomen geluiden. @nl
scope note: Remixhandelingen die de aard en content van het originele werk niet substantieel wijzigen, en het bij elkaar mixen van opgenomen sporen zodat het één voortdurend spoor lijkt, zijn uitgesloten. @nl
toolkit label: remixartiest-familie @nl
toolkit definition: Een familie die verantwoordelijk is voor het creëren van een geluidswerk door het manipuleren, opnieuw combineren, mixen en reproduceren van eerder opgenomen geluiden. @nl
label: له عائلة فنانة مزج موسيقي @ar
definition: يربط بين عمل وعائلة مسئولة عن إنشاء عمل صوتي عن طريق المعالجة بالأصوات المسجلة مسبقًا، وإعادة دمجها، وخلطها، وإعادة إنتاجها. @ar
scope note: تُستبعد أنشطة المزج التي لا تغير تغييرا كبيرا طبيعة العمل الأصلي ومحتواه، ودمج المسارات المسجلة معًا لتظهر كمسار واحد مستمر. @ar
toolkit label: عائلة فنانة مزج موسيقي @ar
toolkit definition: عائلة مسئولة عن إنشاء عمل صوتي عن طريق المعالجة بالأصوات المسجلة مسبقًا، وإعادة دمجها، وخلطها، وإعادة إنتاجها. @ar
label: té com a família artista de remescla @ca
definition: Relaciona una obra amb una família que és responsable de la creació d’una obra d’àudio mitjançant la manipulació, la recombinació, la mescla i la reproducció de sons enregistrats prèviament. @ca
scope note: S’exclouen les activitats de remescla que no canvien substancialment la natura i el contingut de l’obra original, i la mescla de pistes enregistrades conjuntament perquè semblin una pista contínua. @ca
toolkit label: família artista de remescla @ca
toolkit definition: Família que és responsable de la creació d’una obra d’àudio mitjançant la manipulació, la recombinació, la mescla i la reproducció de sons enregistrats prèviament. @ca
label: har familie, som er remixer @da
definition: Relaterer et værk til en familie, som er ansvarlig for at skabe et lydværk ved manipulering, rekombinering, mixing og gengivelse af tidligere indspillede lyde. @da
scope note: Remixing-aktiviteter, som ikke væsentligt forandrer originalværkets karakter og indhold, samt mixe indspillede lydspor sammen for at fremstå som ét uafbrudt spor, er ikke omfattet. @da
toolkit label: familie, som er remixer @da
toolkit definition: Familie, som er ansvarlig for at skabe et lydværk ved manipulering, rekombinering, mixing og gengivelse af tidligere indspillede lyde. @da
label: remiksija (perekond) @et
definition: Seostab teose perekonnaga, kes vastutab audioteose loomise eest, manipuleerides, ümber kombineerides, segades ja taastekitades varem salvestatud helisid. @et
scope note: Ei hõlma remiksimist, mis ei muuda oluliselt originaalteose olemust ja sisu, ega salvestatud heliradade kokkupanekut üheks helirajaks. @et
toolkit label: remiksija (perekond) @et
toolkit definition: Perekond, kes vastutab audioteose loomise eest, manipuleerides, ümber kombineerides, segades ja taastekitades varem salvestatud helisid. @et
label: hat Remix Artist (Familie) @de
definition: Setzt ein Werk in Beziehung zu einer Familie, die für die Schaffung eines Tonwerks verantwortlich ist, indem sie eine bestehende Tonaufnahme bearbeitet, rekombiniert, mischt und reproduziert. @de
scope note: Darunter fallen keine Nachbearbeitungen, die weder Art noch Inhalt des Originalwerks wesentlich verändern, sowie das Zusammenmischen von aufgenommenen Einzelspuren (Kanälen) zu einem scheinbar ununterbrochen durchgehenden Klangerlebnis. @de
toolkit label: Remix Artist (Familie) @de
toolkit definition: Eine Familie, die für die Schaffung eines Tonwerks verantwortlich ist, indem sie eine bestehende Tonaufnahme bearbeitet, rekombiniert, mischt und reproduziert. @de
label: remixművész családja a következő: @hu
definition: Hozzákapcsol egy művet egy családhoz, amely felelős egy audiomű létrehozásáért korábban rögzített hangok manipulálásával, újrakombinálásával, keverésével és reprodukálásával. @hu
scope note: Nem tartoznak ide sem azok a remixelési tevékenységek, amelyek nem változtatják meg lényegesen az eredeti mű jellegét és tartalmát, sem a rögzített sávok látszólag egy folyamatos sávként való összemixelése. @hu
toolkit label: remixművész család: @hu
toolkit definition: Egy család, amely felelős egy audiomű létrehozásáért korábban rögzített hangok manipulálásával, újrakombinálásával, keverésével és reprodukálásával. @hu
label: ha come artista di remix famiglia @it
definition: Correla un'opera alla famiglia responsabile della creazione di un'opera audio tramite la manipolazione, ricombinazione, missaggio e riproduzione di suoni registrati in precedenza. @it
scope note: Sono escluse le attività che non modificano sostanzialmente la natura e il contenuto dell'opera originale, nonché il missaggio di brani registrati che appaiano come un unico brano. @it
toolkit label: artista di remix famiglia @it
toolkit definition: Famiglia responsabile della creazione di un'opera audio tramite la manipolazione, ricombinazione, missaggio e riproduzione di suoni registrati in precedenza. @it
label: a pour famille remixeuse @fr
definition: Met une œuvre en relation avec une famille qui est responsable de la création d’une œuvre audio par la manipulation, la recombinaison, le mixage et la reproduction de sons préalablement enregistrés. @fr
scope note: Sont exclus les activités de remixage qui ne changent pas considérablement la nature et le contenu de l’œuvre originale et le fait de mixer ensemble des pistes enregistrées pour donner l’impression d’une seule piste continue. @fr
toolkit label: famille remixeuse @fr
toolkit definition: Famille qui est responsable de la création d’une œuvre audio par la manipulation, la recombinaison, le mixage et la reproduction de sons préalablement enregistrés. @fr
label: remiksētājs (dzimta/ģimene) @lv
definition: Sasaista darbu ar dzimtu/ģimeni, kas ir atbildīga par audio darba radīšanu, manipulējot, pārkombinējot, miksējot un atkārtoti atskaņojot iepriekš ierakstītas skaņas. @lv
toolkit label: remiksētājs (dzimta/ģimene) @lv
toolkit definition: Dzimta/ģimene, kas ir atbildīga par audio darba radīšanu, manipulējot, pārkombinējot, miksējot un atkārtoti atskaņojot iepriekš ierakstītas skaņas. @lv
scope note: Neietver remiksēšanas darbības, kas būtiski nemaina oriģinālā darba būtību un saturu, kā arī ierakstu celiņu apvienošanu vienā ieraksta celiņā. @lv
label: 有合成艺术家家族 @zh-hans
definition: 将一种作品与通过操纵、重新组合、混合和复制事先录制的声音而负责创建一种音频作品的一个家族关联起来。 @zh-hans
toolkit label: 合成艺术家家族 @zh-hans
toolkit definition: 通过操纵、重新组合、混合和复制事先录制的声音而负责创建一种音频作品的一个家族 @zh-hans
scope note: 不包括不实质性改变原作品的性质和内容的合成活动、以及将录制的音轨混合成一个连续的音轨的活动。 @zh-hans
has subproperty: P10590
label: remix sanatçısı ailesi ile ilişkilidir @tr
definition: Bir eseri, önceden kaydedilmiş sesleri değiştirerek, yeniden birleştirerek, karıştırarak ve yeniden üreterek bir ses eseri oluşturmaktan sorumlu olan bir aileyle ilişkilendirir. @tr

has remix artist person
status: Published
lexical alias: remixArtistPerson.en
definition: Relates a work to a person who is responsible for creating an audio work by manipulating, recombining, mixing, and reproducing previously recorded sounds.
toolkit label: remix artist person
toolkit definition: A person who is responsible for creating an audio work by manipulating, recombining, mixing, and reproducing previously recorded sounds.
type: Property
domain: C10001
has element type: 2
sub property of: has creator person of work
sub property of: has remix artist agent
scope note: Remixing activities that do not substantially change the nature and content of the original work, and mixing recorded tracks together to appear as one continuous track, are excluded.
label: uudelleenmiksaaja (henkilö) @fi
definition: Liittää teoksen henkilöön, joka on vastuussa ääniteoksen luomisesta manipuloimalla, yhdistelemällä, sekoittamalla ja uudelleen tuottamalla aiemmin äänitettyjä ääniä. @fi
scope note: Ei kata uudelleenmiksaamista, joka ei oleellisesti muuta alkuperäisen teoksen luonnetta ja sisältöä eikä aiemmin äänitettyjen musiikkikappaleiden yhdistämistä yhdeksi musiikkikappaleeksi. @fi
toolkit label: uudelleenmiksaaja (henkilö) @fi
toolkit definition: Henkilö, joka on vastuussa ääniteoksen luomisesta manipuloimalla, yhdistelemällä, sekoittamalla ja uudelleen tuottamalla aiemmin äänitettyjä ääniä. @fi
label: har remikser (person) @no
definition: Relaterer et verk til en person som er ansvarlig for å skape et lydverk ved å manipulere, mikse, sette sammen og reprodusere lyd som er spilt inn tidligere. @no
scope note: Remiksaktiviteter som ikke i betydelig grad endrer originalverkets særpreg og innhold, og miksing av innspilte spor slik at resultatet høres ut som ett sammenhengende spor, er ikke inkludert. @no
toolkit label: remikser (person) @no
toolkit definition: En person som er ansvarlig for å skape et lydverk ved å manipulere, mikse, sette sammen og reprodusere lyd som er spilt inn tidligere. @no
label: heeft remixartiest-persoon @nl
definition: Relateert een werk aan een persoon die verantwoordelijk is voor het creëren van een geluidswerk door het manipuleren, opnieuw combineren, mixen en reproduceren van eerder opgenomen geluiden. @nl
scope note: Remixhandelingen die de aard en content van het originele werk niet substantieel wijzigen, en het bij elkaar mixen van opgenomen sporen zodat het één voortdurend spoor lijkt, zijn uitgesloten. @nl
toolkit label: remixartiest-persoon @nl
toolkit definition: Een persoon die verantwoordelijk is voor het creëren van een geluidswerk door het manipuleren, opnieuw combineren, mixen en reproduceren van eerder opgenomen geluiden. @nl
label: له شخص فنان مزج موسيقي @ar
definition: يربط بين عمل وشخص مسئول عن إنشاء عمل صوتي عن طريق المعالجة بالأصوات المسجلة مسبقًا، وإعادة دمجها، وخلطها، وإعادة إنتاجها. @ar
scope note: تُستبعد أنشطة المزج التي لا تغير تغييرا كبيرا طبيعة العمل الأصلي ومحتواه، ودمج المسارات المسجلة معًا لتظهر كمسار واحد مستمر. @ar
toolkit label: شخص فنان مزج موسيقي @ar
toolkit definition: شخص مسئول عن إنشاء عمل صوتي عن طريق المعالجة بالأصوات المسجلة مسبقًا، وإعادة دمجها، وخلطها، وإعادة إنتاجها. @ar
label: té com a persona artista de remescla @ca
definition: Relaciona una obra amb una persona que és responsable de la creació d’una obra d’àudio mitjançant la manipulació, la recombinació, la mescla i la reproducció de sons enregistrats prèviament. @ca
scope note: S’exclouen les activitats de remescla que no canvien substancialment la natura i el contingut de l’obra original, i la mescla de pistes enregistrades conjuntament perquè semblin una pista contínua. @ca
toolkit label: persona artista de remescla @ca
toolkit definition: Persona que és responsable de la creació d’una obra d’àudio mitjançant la manipulació, la recombinació, la mescla i la reproducció de sons enregistrats prèviament. @ca
label: har person, som er remixer @da
definition: Relaterer et værk til en person, som er ansvarlig for at skabe et lydværk ved manipulering, rekombinering, mixing og gengivelse af tidligere indspillede lyde. @da
scope note: Remixing-aktiviteter, som ikke væsentligt forandrer originalværkets karakter og indhold, samt mixe indspillede lydspor sammen for at fremstå som ét uafbrudt spor, er ikke omfattet. @da
toolkit label: person, som er remixer @da
toolkit definition: Person, som er ansvarlig for at skabe et lydværk ved manipulering, rekombinering, mixing og gengivelse af tidligere indspillede lyde. @da
label: remiksija (isik) @et
definition: Seostab teose isikuga, kes vastutab audioteose loomise eest, manipuleerides, ümber kombineerides, segades ja taastekitades varem salvestatud helisid. @et
scope note: Ei hõlma remiksimist, mis ei muuda oluliselt originaalteose olemust ja sisu, ega salvestatud heliradade kokkupanekut üheks helirajaks. @et
toolkit label: remiksija (isik) @et
toolkit definition: Isik, kes vastutab audioteose loomise eest, manipuleerides, ümber kombineerides, segades ja taastekitades varem salvestatud helisid. @et
label: hat Remix Artist (Person) @de
definition: Setzt ein Werk in Beziehung zu einer Person, die für die Schaffung eines Tonwerks verantwortlich ist, indem sie eine bestehende Tonaufnahme bearbeitet, rekombiniert, mischt und reproduziert. @de
scope note: Darunter fallen keine Nachbearbeitungen, die weder Art noch Inhalt des Originalwerks wesentlich verändern, sowie das Zusammenmischen von aufgenommenen Einzelspuren (Kanälen) zu einem scheinbar ununterbrochen durchgehenden Klangerlebnis. @de
toolkit label: Remix Artist (Person) @de
toolkit definition: Eine Familie, die für die Schaffung eines Tonwerks verantwortlich ist, indem sie eine bestehende Tonaufnahme bearbeitet, rekombiniert, mischt und reproduziert. @de
label: remixművész személye a következő: @hu
definition: Hozzákapcsol egy művet egy személyhez, aki felelős egy audiomű létrehozásáért korábban rögzített hangok manipulálásával, újrakombinálásával, keverésével és reprodukálásával. @hu
scope note: Nem tartoznak ide sem azok a remixelési tevékenységek, amelyek nem változtatják meg lényegesen az eredeti mű jellegét és tartalmát, sem a rögzített sávok látszólag egy folyamatos sávként való összemixelése. @hu
toolkit label: remixművész személy: @hu
toolkit definition: Egy személy, aki felelős egy audiomű létrehozásáért korábban rögzített hangok manipulálásával, újrakombinálásával, keverésével és reprodukálásával. @hu
label: ha come artista di remix persona @it
definition: Correla un'opera alla persona responsabile della creazione di un'opera audio tramite la manipolazione, ricombinazione, missaggio e riproduzione di suoni registrati in precedenza. @it
scope note: Sono escluse le attività che non modificano sostanzialmente la natura e il contenuto dell'opera originale, nonché il missaggio di brani registrati che appaiono come un unico brano. @it
toolkit label: artista di remix persona @it
toolkit definition: Persona responsabile della creazione di un'opera audio tramite la manipolazione, ricombinazione, missaggio e riproduzione di suoni registrati in precedenza. @it
label: a pour personne remixeuse @fr
definition: Met une œuvre en relation avec une personne qui est responsable de la création d’une œuvre audio par la manipulation, la recombinaison, le mixage et la reproduction de sons préalablement enregistrés. @fr
scope note: Sont exclus les activités de remixage qui ne changent pas considérablement la nature et le contenu de l’œuvre originale et le fait de mixer ensemble des pistes enregistrées pour donner l’impression d’une seule piste continue. @fr
toolkit label: personne remixeuse @fr
toolkit definition: Personne qui est responsable de la création d’une œuvre audio par la manipulation, la recombinaison, le mixage et la reproduction de sons préalablement enregistrés. @fr
label: remiksētājs (persona) @lv
definition: Sasaista darbu ar personu, kura ir atbildīga par audio darba radīšanu, manipulējot, pārkombinējot, miksējot un atkārtoti atskaņojot iepriekš ierakstītas skaņas. @lv
toolkit label: remiksētājs (persona) @lv
toolkit definition: Persona, kura ir atbildīga par audio darba radīšanu, manipulējot, pārkombinējot, miksējot un atkārtoti atskaņojot iepriekš ierakstītas skaņas. @lv
scope note: Neietver remiksēšanas darbības, kas būtiski nemaina oriģinālā darba būtību un saturu, kā arī ierakstu celiņu apvienošanu vienā ieraksta celiņā. @lv
label: 有合成艺术家个人 @zh-hans
definition: 将一种作品与通过操纵、重新组合、混合和复制事先录制的声音而负责创建一种音频作品的一个个人关联起来。 @zh-hans
toolkit label: 合成艺术家个人 @zh-hans
toolkit definition: 通过操纵、重新组合、混合和复制事先录制的声音而负责创建一种音频作品的一个个人 @zh-hans
scope note: 不包括不实质性改变原作品的性质和内容的合成活动、以及将录制的音轨混合成一个连续的音轨的活动。 @zh-hans
has subproperty: P10449
label: remix sanatçısı kişisi ile ilişkilidir @tr
definition: Bir eseri önceden kaydedilmiş sesleri değiştirerek, yeniden birleştirerek, karıştırarak ve yeniden üreterek bir ses eseri yaratmaktan sorumlu olan bir kişiyle ilişkilendirir. @tr

has representative expression
status: Published
type: Property
lexical alias: representativeExpression.en
definition: Relates a work to an expression that is considered a canonical source of data for identifying a work.
domain: C10001
toolkit label: representative expression
has element type: 2
toolkit definition: An expression that is considered a canonical source of data for identifying a work.
label: edustava ekspressio @fi
definition: Liittää teoksen ekspressioon, jota pidetään kanonisena tietolähteenä teoksen identifioinnissa. @fi
toolkit label: edustava ekspressio @fi
toolkit definition: Ekspressio, jota pidetään kanonisena tietolähteenä teoksen identifioinnissa. @fi
label: har representativt uttrykk @no
definition: Relaterer et verk til et uttrykk som er en anerkjent datakilde for identifisering av et verk. @no
toolkit label: representativt uttrykk @no
toolkit definition: Et uttrykk som er en anerkjent datakilde for identifisering av et verk. @no
sub property of: has expression of work
label: heeft representatieve expressie @nl
definition: Relateert een werk aan een expressie die beschouwd wordt als canonieke bron van data voor het identificeren van een werk. @nl
toolkit label: representatieve expressie @nl
toolkit definition: Een expressie die beschouwd wordt als canonieke bron van data voor het identificeren van een werk. @nl
label: له تعبيرة ممثِلة @ar
definition: يربط بين عمل وتعبيرة تُعد مصدرًا أساسيًا للبيانات لتحديد عمل. @ar
toolkit label: تعبيرة ممثِلة @ar
toolkit definition: تعبيرة تُعد مصدرًا أساسيًا للبيانات لتحديد عمل. @ar
label: té com a expressió representativa @ca
definition: Relaciona una obra amb una expressió que es considera una font canònica de dades per identificar una obra. @ca
toolkit label: expressió representativa @ca
toolkit definition: Expressió que es considera una font canònica de dades per identificar una obra. @ca
label: har repræsentativt udtryk @da
definition: Relaterer et værk til et udtryk, som er en anerkendt datakilde for identificering af et værk. @da
toolkit label: repræsentativt udtryk @da
toolkit definition: Udtryk, som er en anerkendt datakilde for identificering af et værk. @da
label: iseloomulik väljendus @et
definition: Seostab teose väljendusega, mida peetakse teose identifitseerimisel kanooniliseks andmeallikaks. @et
toolkit label: iseloomulik väljendus @et
toolkit definition: Väljendus, mida peetakse teose identifitseerimisel kanooniliseks andmeallikaks. @et
label: hat repräsentative Expression @de
definition: Setzt ein Werk in Beziehung zu einer Expression, die als anerkannte Datenquelle zur Identifizierung eines Werks gilt. @de
toolkit label: Repräsentative Expression @de
toolkit definition: Eine Expression, die als anerkannte Datenquelle zur Identifizierung eines Werks gilt. @de
label: reprezentatív kifejezési formája a következő: @hu
definition: Egy művet hozzákapcsol egy kifejezési formához, amely kanonizált adatforrásnak tekinthető egy mű azonosításához. @hu
toolkit label: reprezentatív kifejezési forma @hu
toolkit definition: Egy kifejezési forma, amely kanonizált adatforrásnak tekinthető egy mű azonosításához. @hu
label: ha come espressione rappresentativa @it
definition: Correla un’opera a un’espressione che è considerata la fonte convenzionale dei dati per identificare un’opera. @it
toolkit label: espressione rappresentativa @it
toolkit definition: Espressione che è considerata la fonte dei dati convenzionale per identificare un’opera. @it
label: a pour expression représentative @fr
definition: Met une œuvre en relation avec une expression qui est considérée comme une source canonique de données pour l’identification d’une œuvre. @fr
toolkit label: expression représentative @fr
toolkit definition: Expression qui est considérée comme une source canonique de données pour l’identification d’une œuvre. @fr
label: reprezentatīvā izteiksme @lv
definition: Sasaista darbu ar izteiksmi, ko uzskata par kanonisku datu avotu darba identificēšanai. @lv
toolkit label: reprezentatīvā izteiksme @lv
toolkit definition: Izteiksme, ko uzskata par kanonisku datu avotu darba identificēšanai. @lv
label: 有代表性内容表达 @zh-hans
definition: 将一种作品与被认为是标识一种作品的数据之典范信息源的一种内容表达关联起来。 @zh-hans
toolkit label: 代表性内容表达 @zh-hans
toolkit definition: 被认为是标识一种作品的数据之典范信息源的一种内容表达 @zh-hans
has subproperty: P10346
label: temsili anlatım ile ilişkilidir @tr
definition: Bir eseri, bir eseri tanımlamak için doğrulanmış bir veri kaynağı olarak kabul edilen bir anlatımla ilişkilendirir. @tr
toolkit label: temsili anlatım @tr
toolkit definition: Bir eseri tanımlamak için kanonik bir veri kaynağı olarak kabul edilen bir anlatım. @tr

has researcher agent
status: Published
type: Property
lexical alias: researcherAgent.en
definition: Relates a work to an agent who does research in support of the creation of a work.
domain: C10001
toolkit label: researcher agent
toolkit definition: An agent who does research in support of the creation of a work.
sub property of: has creator agent of work
toolkit label: investigador @es
toolkit definition: Una persona, familia o entidad corporativa que realiza la investigación de apoyo para la creación de una obra. @es
instruction number: 18.5
label: har agent, som er researcher @da
definition: Relaterer et værk til en agent, som udfører research til at understøtte skabelsen af et værk. @da
toolkit label: agent, som er researcher @da
toolkit definition: Agent, som udfører research til at understøtte skabelsen af et værk. @da
label: có nhà nghiên cứu @vi
definition: Liên kết tác phẩm với tác nhân tiến hành nghiên cứu để hỗ trợ sáng tạo tác phẩm. @vi
toolkit label: nhà nghiên cứu @vi
toolkit definition: Tác nhân tiến hành nghiên cứu để hỗ trợ sáng tạo tác phẩm. @vi
label: hat Forscherin/Forscher (Akteur) @de
definition: Setzt ein Werk in Beziehung zu einem Akteur, der Forschung betreibt, um das Schaffen eines Werks zu unterstützen. @de
toolkit label: Forscherin/Forscher (Akteur) @de
toolkit definition: Ein Akteur, der Forschung betreibt, um das Schaffen eines Werks zu unterstützen. @de
definition: Liittää teoksen toimijaan, joka tukee teoksen syntymistä tutkimuksellaan. @fi
toolkit label: tutkija (toimija) @fi
toolkit definition: Toimija, joka tukee teoksen syntymistä tutkimuksellaan. @fi
toolkit label: forsker (agent) @no
toolkit definition: En agent som forsker som støtte til å skape et verk. @no
label: té com a agent investigador @ca
definition: Relaciona una obra amb un agent que fa recerca per donar suport a la creació d’una obra. @ca
toolkit label: agent investigador @ca
toolkit definition: Agent que fa recerca per donar suport a la creació d’una obra. @ca
label: a pour agent recherchiste @fr
definition: Met une œuvre en relation avec un agent qui effectue des recherches pour aider à la création d’une œuvre. @fr
toolkit label: agent recherchiste @fr
toolkit definition: Agent qui effectue des recherches pour aider à la création d’une œuvre. @fr
has element type: 2
label: έχει ερευνητή @el
definition: Συνδέει ένα έργο με έναν φορέα, ο οποίος διεξάγει έρευνα υποστηρικτικά της δημιουργίας ενός έργου. @el
toolkit label: ερευνητής @el
toolkit definition: Ένας φορέας, ο οποίος διεξάγει έρευνα υποστηρικτικά της δημιουργίας ενός έργου. @el
label: kutató ágense a következő: @hu
definition: Hozzákapcsol egy művet egy ágenshez, amely kutatást végez egy mű megalkotásának támogatására. @hu
toolkit label: kutató ágens: @hu
toolkit definition: Egy ágens, amely kutatást végez egy mű megalkotásának támogatására. @hu
alternative label: researcher
alternative label: tutkija @fi
label: tutkija (toimija) @fi
label: har forsker (agent) @no
definition: Relaterer et verk til en agent som forsker som støtte til å skape et verk. @no
alternative label: forsker @no
label: heeft onderzoeker-actor @nl
definition: Relateert een werk aan een actor die onderzoek doet ter ondersteuning van de creatie van een werk. @nl
toolkit label: onderzoeker-actor @nl
toolkit definition: Een actor die onderzoek doet ter ondersteuning van de creatie van een werk. @nl
label: له وكيل باحث @ar
definition: يربط بين عمل ووكيل يقوم بإجراء بحث لدعم إنشاء عمل. @ar
alternative label: باحث @ar
toolkit label: وكيل باحث @ar
toolkit definition: وكيل يقوم بإجراء بحث لدعم إنشاء عمل. @ar
alternative label: investigador @ca
label: uurija (tegija) @et
definition: Seostab teose tegijaga, kes teeb teose loomise heaks uurimistööd. @et
alternative label: uurija @et
toolkit label: uurija (tegija) @et
toolkit definition: Tegija, kes teeb teose loomise heaks uurimistööd. @et
alternative label: kutató: @hu
label: ha come ricercatore agente @it
definition: Correla un’opera a un agente che fa ricerche a supporto della creazione di un’opera. @it
alternative label: ricercatore @it
toolkit label: ricercatore agente @it
toolkit definition: Agente che fa ricerche a supporto della creazione di un’opera. @it
alternative label: recherchiste @fr
label: pētnieks (aģents) @lv
definition: Sasaista darbu ar aģentu, kas veicis pētniecību darba radīšanai. @lv
toolkit label: pētnieks (aģents) @lv
toolkit definition: Aģents, kas veicis pētniecību darba radīšanai. @lv
alternative label: Forscher @de
alternative label: 研究者 @zh-hans
toolkit label: 研究者行为者 @zh-hans

has researcher collective agent
status: Published
lexical alias: researcherCollectiveAgent.en
definition: Relates a work to a collective agent who does research in support of the creation of a work.
toolkit label: researcher collective agent
toolkit definition: A collective agent who does research in support of the creation of a work.
type: Property
domain: C10001
has element type: 2
sub property of: has creator collective agent of work
sub property of: has researcher agent
label: tutkija (yhteistoimija) @fi
definition: Liittää teoksen yhteistoimijaan, joka tukee teoksen syntymistä tutkimuksellaan. @fi
toolkit label: tutkija (yhteistoimija) @fi
toolkit definition: Yhteistoimija, joka tukee teoksen syntymistä tutkimuksellaan. @fi
label: har forsker (kollektiv agent) @no
definition: Relaterer et verk til en kollektiv agent som forsker som bidrag til å skape et verk. @no
toolkit label: forsker (kollektiv agent) @no
toolkit definition: En kollektiv agent som forsker som bidrag til å skape et verk. @no
label: heeft onderzoeker-collectieve actor @nl
definition: Relateert een werk aan een collectieve actor die onderzoek doet ter ondersteuning van de creatie van een werk. @nl
toolkit label: onderzoeker-collectieve actor @nl
toolkit definition: Een collectieve actor die onderzoek doet ter ondersteuning van de creatie van een werk. @nl
label: له وكيل جماعي باحث @ar
definition: يربط بين عمل ووكيل جماعي يجري بحوث لدعم إنشاء عمل. @ar
toolkit label: وكيل جماعي باحث @ar
toolkit definition: وكيل جماعي يجري بحوث لدعم إنشاء عمل. @ar
label: té com a agent col·lectiu investigador @ca
definition: Relaciona una obra amb un agent col·lectiu que fa recerca per donar suport a la creació d’una obra. @ca
toolkit label: agent col·lectiu investigador @ca
toolkit definition: Agent col·lectiu que fa que fa recerca per donar suport a la creació d’una obra. @ca
label: har kollektiv agent, som er researcher @da
definition: Relaterer et værk til en kollektiv agent, som udfører research til at understøtte skabelsen af et værk. @da
toolkit label: kollektiv agent, som er researcher @da
toolkit definition: Kollektiv agent, som udfører research til at understøtte skabelsen af et værk. @da
label: uurija (kollektiiv) @et
definition: Seostab teose kollektiiviga, kes teeb teose loomise heaks uurimistööd. @et
toolkit label: uurija (kollektiiv) @et
toolkit definition: Kollektiiv, kes teeb teose loomise heaks uurimistööd. @et
label: hat Forscherin/Forscher (Gemeinschaftlicher Akteur) @de
definition: Setzt ein Werk in Beziehung zu einem gemeinschaftlichen Akteur, der Forschung betreibt, um das Schaffen eines Werks zu unterstützen. @de
toolkit label: Forscherin/Forscher (Gemeinschaftlicher Akteur) @de
toolkit definition: Ein gemeinschaftlicher Akteur, der Forschung betreibt, um das Schaffen eines Werks zu unterstützen. @de
label: kutató kollektív ágense a következő: @hu
definition: Hozzákapcsol egy művet egy kollektív ágenshez, amely kutatást végez egy mű megalkotásának támogatására. @hu
toolkit label: kutató kollektív ágens: @hu
toolkit definition: Egy kollektív ágens, mely kutatást végez egy mű megalkotásának támogatására. @hu
label: ha come ricercatore agente collettivo @it
definition: Correla un'opera a un agente collettivo che svolge ricerche a supporto della creazione di un'opera. @it
toolkit label: ricercatore agente collettivo @it
toolkit definition: Agente collettivo che svolge ricerche a supporto della creazione di un'opera. @it
label: a pour agent collectif recherchiste @fr
definition: Met une œuvre en relation avec un agent collectif qui effectue des recherches pour aider à la création d’une œuvre. @fr
toolkit label: agent collectif recherchiste @fr
toolkit definition: Agent collectif qui effectue des recherches pour aider à la création d’une œuvre. @fr
label: pētnieks (grupa) @lv
definition: Sasaista darbu ar grupu, kas veikusi pētniecību darba radīšanai. @lv
toolkit label: pētnieks (grupa) @lv
toolkit definition: Grupa, kas veikusi pētniecību darba radīšanai. @lv
label: 有研究者集体行为者 @zh-hans
definition: 将一种作品与从事研究以支持一种作品的创作的一个集体行为者关联起来。 @zh-hans
toolkit label: 研究者集体行为者 @zh-hans
toolkit definition: 从事研究以支持一种作品的创作的一个集体行为者 @zh-hans
has subproperty: has researcher corporate body
has subproperty: has researcher family
has subproperty: P10463
label: araştırmacı kolektif temsilcisi ile ilişkilidir @tr
definition: Bir eseri, bir eserin oluşturulmasını desteklemek için araştırma yapan kolektif bir temsilci ile ilişkilendirir. @tr
toolkit label: araştırmacı kolektif temsilci @tr
toolkit definition: Bir eserin yaratılmasını desteklemek için araştırma yapan kolektif bir temsilci. @tr

has researcher corporate body
status: Published
lexical alias: researcherCorporateBody.en
definition: Relates a work to a corporate body who does research in support of the creation of a work.
toolkit label: researcher corporate body
toolkit definition: A corporate body who does research in support of the creation of a work.
type: Property
domain: C10001
has element type: 2
sub property of: has creator corporate body of work
sub property of: has researcher collective agent
label: tutkija (yhteisö) @fi
definition: Liittää teoksen yhteisöön, joka tukee teoksen syntymistä tutkimuksellaan. @fi
toolkit label: tutkija (yhteisö) @fi
toolkit definition: Yhteisö, joka tukee teoksen syntymistä tutkimuksellaan. @fi
label: har forsker (korporasjon) @no
definition: Relaterer et verk til en korporasjon som forsker som bidrag til å skape et verk. @no
toolkit label: forsker (korporasjon) @no
toolkit definition: En korporasjon som forsker som bidrag til å skape et verk. @no
label: heeft onderzoeker-corporatie @nl
definition: Relateert een werk aan een corporatie die onderzoek doet ter ondersteuning van de creatie van een werk. @nl
toolkit label: onderzoeker-corporatie @nl
toolkit definition: Een corporatie die onderzoek doet ter ondersteuning van de creatie van een werk. @nl
label: له هيئة باحثة @ar
definition: يربط بين عمل وهيئة تجري بحوث لدعم إنشاء عمل. @ar
toolkit label: هيئة باحثة @ar
toolkit definition: هيئة تجري بحوث لدعم إنشاء عمل. @ar
label: té com a entitat corporativa investigadora @ca
definition: Relaciona una obra amb una entitat corporativa que fa recerca per donar suport a la creació d’una obra. @ca
toolkit label: entitat corporativa investigadora @ca
toolkit definition: Entitat corporativa que fa recerca per donar suport a la creació d’una obra. @ca
label: har korporation, som er researcher @da
definition: Relaterer et værk til en korporation, som udfører research til at understøtte skabelsen af et værk. @da
toolkit label: korporation, som er researcher @da
toolkit definition: Korporation, som udfører research til at understøtte skabelsen af et værk. @da
label: uurija (asutus) @et
definition: Seostab teose asutusega, kes teeb teose loomise heaks uurimistööd. @et
toolkit label: uurija (asutus) @et
toolkit definition: Asutus, kes teeb teose loomise heaks uurimistööd. @et
label: hat Forscherin/Forscher (Körperschaft) @de
definition: Setzt ein Werk in Beziehung zu einer Körperschaft, die Forschung betreibt, um das Schaffen eines Werks zu unterstützen. @de
toolkit label: Forscherin/Forscher (Körperschaft) @de
toolkit definition: Eine Körperschaft, die Forschung betreibt, um das Schaffen eines Werks zu unterstützen. @de
label: kutató testülete a következő: @hu
definition: Hozzákapcsol egy művet egy testülethez, amely kutatást végez egy mű megalkotásának támogatására. @hu
toolkit label: kutató testület: @hu
toolkit definition: Egy testület, amely kutatást végez egy mű megalkotásának támogatására. @hu
label: ha come ricercatore ente @it
definition: Correla un'opera a un ente che svolge ricerche a supporto della creazione di un'opera. @it
toolkit label: ricercatore ente @it
toolkit definition: Ente che svolge ricerche a supporto della creazione di un'opera. @it
label: a pour collectivité recherchiste @fr
definition: Met une œuvre en relation avec une collectivité qui effectue des recherches pour aider à la création d’une œuvre. @fr
toolkit label: collectivité recherchiste @fr
toolkit definition: Collectivité qui effectue des recherches pour aider à la création d’une œuvre. @fr
label: pētnieks (institūcija) @lv
definition: Sasaista darbu ar institūciju, kas veikusi pētniecību darba radīšanai. @lv
toolkit label: pētnieks (institūcija) @lv
toolkit definition: Institūcija, kas veikusi pētniecību darba radīšanai. @lv
label: 有研究者团体 @zh-hans
definition: 将一种作品与从事研究以支持一种作品的创作的一个团体关联起来。 @zh-hans
toolkit label: 研究者团体 @zh-hans
toolkit definition: 从事研究以支持一种作品的创作的一个团体 @zh-hans
has subproperty: P10510
label: araştırmacı tüzel kişisi ile ilişkilidir @tr
definition: Bir eseri, bir eserin oluşturulmasını desteklemek için araştırma yapan tüzel kişi ile ilişkilendirir. @tr
toolkit label: araştırmacı tüzel kişi @tr
toolkit definition: Bir eserin yaratılmasını desteklemek için araştırma yapan bir tüzel kişilik. @tr

has researcher family
status: Published
lexical alias: researcherFamily.en
definition: Relates a work to a family who does research in support of the creation of a work.
toolkit label: researcher family
toolkit definition: A family who does research in support of the creation of a work.
type: Property
domain: C10001
has element type: 2
sub property of: has creator family of work
sub property of: has researcher collective agent
label: tutkija (suku) @fi
definition: Liittää teoksen sukuun, joka tukee teoksen syntymistä tutkimuksellaan @fi
toolkit label: tutkija (suku) @fi
toolkit definition: Suku, joka tukee teoksen syntymistä tutkimuksellaan @fi
label: har forsker (familie) @no
definition: Relaterer et verk til en familie som forsker som bidrag til å skape et verk. @no
toolkit label: forsker (familie) @no
toolkit definition: En familie som forsker som bidrag til å skape et verk. @no
label: heeft onderzoeker-familie @nl
definition: Relateert een werk aan een familie die onderzoek doet ter ondersteuning van de creatie van een werk. @nl
toolkit label: onderzoeker-familie @nl
toolkit definition: Een familie die onderzoek doet ter ondersteuning van de creatie van een werk. @nl
label: له عائلة باحثة @ar
definition: يربط بين عمل وعائلة تجري بحوث لدعم إنشاء عمل. @ar
toolkit label: عائلة باحثة @ar
toolkit definition: عائلة تجري بحوث لدعم إنشاء عمل. @ar
label: té com a família investigadora @ca
definition: Relaciona una obra amb una família que fa recerca per donar suport a la creació d’una obra. @ca
toolkit label: família investigadora @ca
toolkit definition: Família que fa recerca per donar suport a la creació d’una obra. @ca
label: har familie, som er researcher @da
definition: Relaterer et værk til en familie, som udfører research til at understøtte skabelsen af et værk. @da
toolkit label: familie, som er researcher @da
toolkit definition: Familie, som udfører research til at understøtte skabelsen af et værk. @da
label: uurija (perekond) @et
definition: Seostab teose perekonnaga, kes teeb teose loomise heaks uurimistööd. @et
toolkit label: uurija (perekond) @et
toolkit definition: Perekond, kes teeb teose loomise heaks uurimistööd. @et
label: hat Forscherin/Forscher (Familie) @de
definition: Setzt ein Werk in Beziehung zu einer Familie, die Forschung betreibt, um das Schaffen eines Werks zu unterstützen. @de
toolkit label: Forscherin/Forscher (Familie) @de
toolkit definition: Eine Familie, die Forschung betreibt, um das Schaffen eines Werks zu unterstützen. @de
label: kutató családja a következő: @hu
definition: Hozzákapcsol egy művet egy családhoz, amely kutatást végez egy mű megalkotásának támogatására. @hu
toolkit label: kutató család: @hu
toolkit definition: Egy család, amely kutatást végez egy mű megalkotásának támogatására. @hu
label: ha come ricercatore famiglia @it
definition: Correla un'opera a una famiglia che svolge ricerche a supporto della creazione di un'opera. @it
toolkit label: ricercatore famiglia @it
toolkit definition: Famiglia che svolge ricerche a supporto della creazione di un'opera. @it
label: a pour famille recherchiste @fr
definition: Met une œuvre en relation avec une famille qui effectue des recherches pour aider à la création d’une œuvre. @fr
toolkit label: famille recherchiste @fr
toolkit definition: Famille qui effectue des recherches pour aider à la création d’une œuvre. @fr
label: pētnieks (dzimta/ģimene) @lv
definition: Sasaista darbu ar dzimtu/ģimeni, kas veikusi pētniecību darba radīšanai. @lv
toolkit label: pētnieks (dzimta/ģimene) @lv
toolkit definition: Dzimta/ģimene, kas veikusi pētniecību darba radīšanai. @lv
label: 有研究者家族 @zh-hans
definition: 将一种作品与从事研究以支持一种作品的创作的一个家族关联起来。 @zh-hans
toolkit label: 研究者家族 @zh-hans
toolkit definition: 从事研究以支持一种作品的创作的一个家族 @zh-hans
has subproperty: P10557
label: araştırmacı ailesi ile ilişkilidir @tr
definition: Bir eseri, oluşturulmasını desteklemek için araştırma yapan bir aileyi bir eserle ilişkilendirir. @tr
toolkit label: araştırmacı aile @tr
toolkit definition: Bir eserin oluşmasına destek olmak için araştırma yapan bir aile. @tr

has researcher person
status: Published
lexical alias: researcherPerson.en
definition: Relates a work to a person who does research in support of the creation of a work.
toolkit label: researcher person
toolkit definition: A person who does research in support of the creation of a work.
type: Property
domain: C10001
has element type: 2
sub property of: has creator person of work
sub property of: has researcher agent
label: tutkija (henkilö) @fi
definition: Liittää teoksen henkilöön, joka tukee teoksen syntymistä tutkimuksellaan @fi
toolkit label: tutkija (henkilö) @fi
toolkit definition: Henkilö, joka tukee teoksen syntymistä tutkimuksellaan @fi
label: har forsker (person) @no
definition: Relaterer et verk til en person som forsker som bidrag til å skape et verk. @no
toolkit label: forsker (person) @no
toolkit definition: En person som forsker som bidrag til å skape et verk. @no
label: heeft onderzoeker-persoon @nl
definition: Relateert een werk aan een persoon die onderzoek doet ter ondersteuning van de creatie van een werk. @nl
toolkit label: onderzoeker-persoon @nl
toolkit definition: Een persoon die onderzoek doet ter ondersteuning van de creatie van een werk. @nl
label: له شخص باحث @ar
definition: يربط بين عمل وشخص يجري بحوث لدعم إنشاء عمل. @ar
toolkit label: شخص باحث @ar
toolkit definition: شخص يجري بحوث لدعم إنشاء عمل. @ar
label: té com a persona investigadora @ca
definition: Relaciona una obra amb una persona que fa recerca per donar suport a la creació d’una obra. @ca
toolkit label: persona investigadora @ca
toolkit definition: Persona que fa recerca per donar suport a la creació d’una obra. @ca
label: har person, som er researcher @da
definition: Relaterer et værk til en person, som udfører research til at understøtte skabelsen af et værk. @da
toolkit label: person, som er researcher @da
toolkit definition: Person, som udfører research til at understøtte skabelsen af et værk. @da
label: uurija (isik) @et
definition: Seostab teose isikuga, kes teeb teose loomise heaks uurimistööd. @et
toolkit label: uurija (isik) @et
toolkit definition: Isik, kes teeb teose loomise heaks uurimistööd. @et
label: hat Forscherin/Forscher (Person) @de
definition: Setzt ein Werk in Beziehung zu einer Person, die Forschung betreibt, um die Schaffung eines Werks zu unterstützen. @de
toolkit label: Forscherin/Forscher (Person) @de
toolkit definition: Eine Person, die Forschung betreibt, um die Schaffung eines Werks zu unterstützen. @de
label: kutató személye a következő: @hu
definition: Hozzákapcsol egy művet egy személyhez, aki kutatást végez egy mű megalkotásának támogatására. @hu
toolkit label: kutató személy: @hu
toolkit definition: Egy személy, aki kutatást végez egy mű megalkotásának támogatására. @hu
label: ha come ricercatore persona @it
definition: Correla un'opera a una persona che svolge ricerche a supporto della creazione di un'opera. @it
toolkit label: ricercatore persona @it
toolkit definition: Persona che svolge ricerche a supporto della creazione di un'opera. @it
label: a pour personne recherchiste @fr
definition: Met une œuvre en relation avec une personne qui effectue des recherches pour aider à la création d’une œuvre. @fr
toolkit label: personne recherchiste @fr
toolkit definition: Personne qui effectue des recherches pour aider à la création d’une œuvre. @fr
label: pētnieks (persona) @lv
definition: Sasaista darbu ar personu, kura veikusi pētniecību darba radīšanai. @lv
toolkit label: pētnieks (persona) @lv
toolkit definition: Persona, kura veikusi pētniecību darba radīšanai. @lv
label: 有研究者个人 @zh-hans
definition: 将一种作品与从事研究以支持一种作品的创作的一个个人关联起来。 @zh-hans
toolkit label: 研究者个人 @zh-hans
toolkit definition: 从事研究以支持一种作品的创作的一个个人 @zh-hans
has subproperty: P10416
label: araştırmacı kişisi ile ilişkilidir @tr
definition: Bir eseri, bir eserin oluşturulmasını desteklemek için araştırma yapan kişi ile ilişkilendirir. @tr
toolkit label: araştırmacı kişi @tr
toolkit definition: Bir eserin oluşturulmasını desteklemek için araştırma yapan kişi. @tr

has research supervisor
status: Published
lexical alias: researchSupervisor.en
definition: Relates a work to a person who is an academic supervisor who is responsible for advising or supervising research that results in a work.
toolkit label: research supervisor
toolkit definition: A person who is an academic supervisor who is responsible for advising or supervising research that results in a work.
type: Property
domain: C10001
has element type: 2
sub property of: has academic supervisor
label: tutkimuksen ohjaaja @fi
definition: Liittää teoksen henkilöön, joka on akateeminen ohjaaja, joka on vastuussa teokseen johtavan tutkimuksen neuvonnasta tai ohjaamisesta. @fi
toolkit label: tutkimuksen ohjaaja @fi
toolkit definition: Henkilö, joka on akateeminen ohjaaja, joka on vastuussa teokseen johtavan tutkimuksen neuvonnasta tai ohjaamisesta. @fi
label: har forskningsveileder @no
definition: Relaterer et verk til en akademisk veileder som er ansvarlig for å veilede eller føre tilsyn med forskning som resulterer i et verk. @no
toolkit label: forskningsveileder @no
toolkit definition: En akademisk veileder som er ansvarlig for å veilede eller føre tilsyn @no
label: heeft onderzoeksbegeleider @nl
definition: Relateert een werk aan een persoon die is een academische toezichthouder die verantwoordelijk is voor het adviseren of toezichthouden op onderzoek dat resulteert in een werk. @nl
toolkit label: onderzoeksbegeleider @nl
toolkit definition: Een persoon die is een academische toezichthouder die verantwoordelijk is voor het adviseren of toezichthouden op onderzoek dat resulteert in een werk. @nl
label: له مشرف بحوث @ar
definition: يربط بين عمل وشخص يكون مشرفا أكاديميا مسئولاً عن تقديم المشورة أو الإشراف على الأبحاث التي تؤدي إلى عمل. @ar
toolkit label: مشرف بحث @ar
toolkit definition: شخص يكون مشرفا أكاديميا مسئولاً عن تقديم المشورة أو الإشراف على الأبحاث التي تؤدي إلى عمل. @ar
label: té com a supervisor de recerca @ca
definition: Relaciona una obra amb una persona que és un supervisor acadèmic que és responsable d’assessorar o supervisar una recerca que dona com a resultat una obra. @ca
toolkit label: supervisor de recerca @ca
toolkit definition: Persona que és un supervisor acadèmic que és responsable d’assessorar o supervisar una recerca que dona com a resultat una obra. @ca
label: har forskningsvejleder @da
definition: Relaterer et værk til en forskningsvejleder, som er ansvarlig for vejledning eller tilsynsføring med forskning, som resulterer i et værk. @da
toolkit label: forskningsvejleder @da
toolkit definition: Forskningsvejleder, som er ansvarlig for vejledning eller tilsynsføring med forskning, som resulterer i et værk. @da
label: uurimistöö juhendaja @et
definition: Seostab teose akadeemilise juhendajaga, kes vastutab teoses väljenduva uurimistöö nõustamise või ülevaatamise eest. @et
toolkit label: uurimistöö juhendaja @et
toolkit definition: Akadeemiline juhendaja, kes vastutab teoses väljenduva uurimistöö nõustamise või ülevaatamise eest. @et
label: hat Betreuerin/Betreuer von Forschungstätigkeiten @de
definition: Setzt ein Werk in Beziehung zu einer akademischen Betreuerin/einem akademischen Betreuer (Person), die/der Forschungstätigkeiten beaufsichtigt oder betreut, die zu einem Werk führen. @de
toolkit label: Betreuerin/Betreuer von Forschungstätigkeiten @de
toolkit definition: Eine akademische Betreuerin/Ein akademischer Betreuer (Person), die/der Forschungstätigkeiten beaufsichtigt oder betreut, die zu einem Werk führen. @de
label: kutatás témavezetője a következő: @hu
definition: Hozzákapcsol egy művet egy tudományos témavezető személyhez, aki egy olyan kutatás tanácsadója és témavezetője, amely egy művet eredményez. @hu
toolkit label: kutatás témavezetője: @hu
toolkit definition: Egy tudományos témavezető személy, aki egy olyan kutatás tanácsadója és témavezetője, amely egy művet eredményez. @hu
label: ha come supervisore di ricerca @it
definition: Correla un'opera al supervisore accademico responsabile della consulenza o supervisione su una ricerca che produce un'opera. @it
toolkit label: supervisore di ricerca @it
toolkit definition: Supervisore accademico responsabile della consulenza o supervisione su una ricerca, che produce un'opera. @it
label: a pour superviseur de recherche @fr
definition: Met une œuvre en relation avec une personne qui est un superviseur académique responsable de guider ou de superviser des travaux de recherche entraînant la création d’une œuvre. @fr
toolkit label: superviseur de recherche @fr
toolkit definition: Personne qui est un superviseur académique responsable de guider ou de superviser des travaux de recherche entraînant la création d’une œuvre. @fr
label: pētnieciskā darba vadītājs @lv
definition: Sasaista darbu ar personu, kura ir akadēmiskais vadītājs, kura pienākums ir konsultēt vai uzraudzīt pētījumu, kura rezultāts ir darbs. @lv
toolkit label: pētnieciskā darba vadītājs @lv
toolkit definition: Akadēmiskais vadītājs, kura pienākums ir konsultēt vai uzraudzīt pētījumu, kura rezultāts ir darbs. @lv
label: 有研究主管 @zh-hans
definition: 将一种作品与负责为导致一种作品的研究作咨询和监督的作为学术主管的一个个人关联起来。 @zh-hans
toolkit label: 研究主管 @zh-hans
toolkit definition: 负责为导致一种作品的研究作咨询和监督的作为学术主管的一个个人 @zh-hans
has subproperty: P10409
label: araştırma danışmanı ile ilişkilidir @tr
definition: Bir eseri, bir eser olarak sonuçlanan araştırmaya danışmanlık yapmaktan veya denetlemekten sorumlu akademik danışman olan kişiyle ilişkilendirir. @tr
toolkit label: araştırma danışmanı @tr
toolkit definition: Bir çalışma ile sonuçlanan araştırmalara danışmanlık yapmaktan veya denetlemekten sorumlu akademik danışman olan kişi. @tr

has numbering of part
status: Published
definition: Relates a work to a designation that is assigned to a work to identify its position in a sequence of individual parts of a larger work.
type: Property
domain: C10001
lexical alias: numberingOfPart.en
instruction number: 24.6
toolkit label: numbering of part
toolkit definition: A designation that is assigned to a work to identify its position in a sequence of individual parts of a larger work.
toolkit label: numérotation de partie @fr
toolkit definition: Désignation qui est attribuée à une œuvre pour identifier sa position dans une séquence de parties individuelles d’une œuvre plus vaste. @fr
toolkit label: numeración de la parte @es
toolkit definition: Una designación de la secuencia de una parte o partes dentro de una obra mayor. @es
label: har numrering av del @sv
toolkit label: numrering av del @sv
label: har nummerering af del @da
definition: Relaterer et værk til en betegnelse, som er tildelt et værk for at identificere dets position i en rækkefølge af individuelle dele af et større værk. @da
scope note: Nummerering kan omfatte datoer eller andre tidsperioder, alfanumerisk tegnsæt eller andre skrifttegn. @da
toolkit label: nummerering af del @da
toolkit definition: Betegnelse, som er tildelt et værk for at identificere dets position i en rækkefølge af individuelle dele af et større værk. @da
definition: Met une œuvre en relation avec une désignation qui est attribuée à une œuvre pour identifier sa position dans une séquence de parties individuelles d’une œuvre plus vaste. @fr
label: có đánh số phần @vi
definition: Liên kết tác phẩm với định danh của sắp xếp thứ tự của phần hoặc các phẩm bên trong tác phẩm lớn hơn. @vi
scope note: Đánh số vao gồm chưc số, chữ cái, ký tự bấy kỳ khác, hoặc tổ hợp của chùng có hoặc không kèm theo đầu đề, và/hoặc định danh biên niên. @vi
toolkit label: đánh số phần @vi
toolkit definition: Định danh của sắp xếp thứ tự của phần hoặc các phẩm bên trong tác phẩm lớn hơn. @vi
label: hat Zählung eines Teils @de
definition: Setzt ein Werk in Beziehung zu einer Bezeichnung, die einem Werk zugewiesen wird, um seine Position in einer Abfolge von einzelnen Teilen eines größeren Werks zu identifizieren. @de
scope note: Darunter fallen Daten oder andere Zeiträume sowie alphanumerische oder andere Zeichen. @de
toolkit label: Zählung eines Teils @de
toolkit definition: Eine Bezeichnung, die einem Werk zugewiesen wird, um seine Position in einer Abfolge von einzelnen Teilen eines größeren Werks zu identifizieren. @de
label: a pour numérotation de partie @fr
definition: Liittää teoksen määritteeseen, joka on annettu teokselle sen aseman identifioimiseksi laajemman teoksen yksittäisten osien sarjassa. @fi
toolkit label: osan numerointi @fi
toolkit definition: Teoksen määrite, joka on annettu teokselle sen aseman identifioimiseksi laajemman teoksen yksittäisten osien sarjassa. @fi
toolkit label: nummerering av del @no
toolkit definition: En betegnelse som er tildelt et verk for å identifisere verkets posisjon i en nummerering av individuelle deler i et større verk. @no
label: té com a numeració d’una part @ca
definition: Relaciona una obra amb una designació que s’assigna a una obra per identificar la seva posició en una seqüència de parts individuals d’una obra més àmplia. @ca
scope note: La numeració pot incloure dates o altres intervals de temps i caràcters alfanumèrics o altres caràcters. @ca
toolkit label: numeració d’una part @ca
toolkit definition: Designació que s’assigna a una obra per identificar la seva posició en una seqüència de parts individuals d’una obra més àmplia. @ca
scope note: La numérotation peut inclure des dates ou d’autres laps de temps, ainsi que des caractères alphanumériques ou autres. @fr
has element type: 6
label: έχει αρίθμηση του μέρους @el
definition: Συνδέει ένα έργο με έναν προσδιορισμό μιας ακολουθίας ενός μέρους ή μερών εντός ενός μεγαλύτερου έργου. @el
scope note: Η αρίθμηση περιλαμβάνει ένα αριθμητικό, ένα γράμμα, οποιονδήποτε άλλο χαρακτήρα ή τον συνδυασμό τους με ή χωρίς συνοδευτική κεφαλίδα ή/και χρονολογικό προσδιορισμό. @el
toolkit label: αρίθμηση του μέρους @el
toolkit definition: Ένας προσδιορισμός μιας ακολουθίας ενός μέρους ή μερών εντός ενός μεγαλύτερου έργου. @el
label: részszámozása a következő: @hu
definition: Egy művet hozzákapcsol egy a műhöz hozzárendelt jelöléshez, amely azonosítja a mű elhelyezkedését az egyedi részek sorrendiségében egy nagyobb művön belül. @hu
scope note: A számozás jelenthet dátumokat vagy egyéb időtartamokat, és alfanumerikus vagy egyéb karaktereket is. @hu
toolkit label: részszámozása: @hu
toolkit definition: Egy műhöz hozzárendelt jelölés, amely azonosítja a mű elhelyezkedését az egyedi részek sorrendiségében egy nagyobb művön belül. @hu
scope note: Numbering may include dates or other timespans, and alphanumeric or other characters.
scope note: Numerointi voi sisältää päivämääriä tai muita ajanjaksoja sekä aakkosnumeerisia tai muita merkkejä. @fi
label: osan numerointi @fi
label: har nummerering av del @no
definition: Relaterer et verk til en betegnelse som er tildelt et verk for å identifisere verkets posisjon i en nummerering av individuelle deler i et større verk. @no
scope note: Nummerering kan inkludere datoer eller andre tidsrom og alfanumerisk eller annen tegnsetting. @no
label: heeft nummering van deel @nl
definition: Relateert een werk aan een aanduiding die is toegekend aan een werk om zijn positie te identificeren in een rangorde van individuele delen van een groter werk. @nl
scope note: Nummering kan data of andere tijdspannes omvatten en alfanumerieke of andere tekens. @nl
toolkit label: nummering van deel @nl
toolkit definition: Een aanduiding die is toegekend aan een werk om zijn positie te identificeren in een rangorde van individuele delen van een groter werk. @nl
label: له ترقيم لجزء @ar
definition: يربط بين عمل وتعيين يتم تخصيصه لعمل لتحديد موقعه في تسلسل أجزاء فردية لعمل أكبر. @ar
scope note: قد يتضمن الترقيم تواريخ أو فترات زمنية أخرى، وحروف هجائية رقمية أو تمثيلات أخرى. @ar
toolkit label: ترقيم لجزء @ar
toolkit definition: تعيين يتم تخصيصه لعمل لتحديد موقعه في تسلسل أجزاء فردية لعمل أكبر. @ar
label: osa number @et
definition: Seostab teose tähistusega, mis on antud teosele selle asendi tuvastamiseks suurema teose üksikosade jadas. @et
scope note: Number võib sisaldada daatumeid või muid ajavahemikke ning tähtnumbrilisi või muid märke. @et
toolkit label: osa number @et
toolkit definition: Tähistus, mis on antud teosele selle asendi tuvastamiseks suurema teose üksikosade jadas. @et
label: ha come numerazione della parte @it
definition: Correla un’opera a una designazione assegnata a un'opera per identificare la sua posizione in una sequenza di singole parti di un’opera più ampia. @it
scope note: La numerazione può includere date o altri intervalli di tempo, e caratteri alfanumerici o di altro genere. @it
toolkit label: numerazione della parte @it
toolkit definition: Designazione assegnata a un'opera per identificare la sua posizione in una sequenza di singole parti di un'opera più ampia. @it

has participant in treaty
status: Published
type: Property
lexical alias: participantInTreaty.en
definition: Relates a work to a corporate body who has signed, ratified, or acceded to a treaty.
domain: C10001
toolkit label: participant in treaty
toolkit definition: A corporate body who has signed, ratified, or acceded to a treaty.
toolkit label: participant à un traité @fr
toolkit definition: Collectivité qui a signé ou ratifié un traité ou y a adhéré. @fr
sub property of: has creator corporate body of work
toolkit label: participante en un tratado @es
toolkit definition: Un gobierno, entidad intergubernamental internacional o entidad corporativa que ha firmado, ratificado o accedido a un tratado. @es
instruction number: 18.5
label: har traktatdeltager @da
definition: Relaterer et værk til en korporation, som har underskrevet, ratificeret eller tiltrådt en traktat. @da
toolkit label: traktatdeltager @da
toolkit definition: Korporation, som har underskrevet, ratificeret eller tiltrådt en traktat. @da
definition: Met une œuvre en relation avec une collectivité qui a signé ou ratifié un traité ou y a adhéré. @fr
label: có bên tham gia hiệp ước @vi
definition: Liên kết tác phẩm với tập thể chính phủ, liên chính phủ quốc tế, hoặc tập thể khác ký, phê chuẩn, hoặc gia nhập hiệp ước. @vi
toolkit label: bên tham gia hiệp ước @vi
toolkit definition: Tập thể chính phủ, liên chính phủ quốc tế, hoặc tập thể khác ký, phê chuẩn, hoặc gia nhập hiệp ước. @vi
label: hat Vertragspartnerin/Vertragspartner @de
definition: Setzt ein Werk in Beziehung zu einer Körperschaft, die ein Abkommen unterzeichnet, ratifiziert hat oder ihm beigetreten ist. @de
toolkit label: Vertragspartnerin/Vertragspartner @de
toolkit definition: Eine Körperschaft, die ein Abkommen unterzeichnet, ratifiziert hat oder ihm beigetreten ist. @de
label: a pour participant à un traité @fr
definition: Liittää teoksen yhteisöön, joka on allekirjoittanut, ratifioinut tai liittynyt valtiosopimukseen. @fi
toolkit label: valtiosopimuksen allekirjoittaja @fi
toolkit definition: Yhteisö, joka on allekirjoittanut, ratifioinut tai liittynyt valtiosopimukseen. @fi
toolkit label: part i traktat @no
toolkit definition: En korporasjon som har undertegnet, ratifisert eller sluttet seg til en traktat. @no
label: té com a participant en un tractat @ca
definition: Relaciona una obra amb una entitat corporativa que ha signat, ratificat o accedit a un tractat. @ca
toolkit label: participant en un tractat @ca
toolkit definition: Entitat corporativa que ha signat, ratificat o accedit a un tractat. @ca
has element type: 2
label: έχει συμμετέχοντα σε συνθήκη @el
definition: Συνδέει ένα έργο με ένα κυβερνητικό, διεθνές διακυβερνητικό συλλογικό όργανο ή άλλο συλλογικό όργανο, το οποίο έχει υπογράψει, επικυρώσει ή προσχωρήσει σε μια συνθήκη. @el
toolkit label: συμμετέχων σε συνθήκη @el
toolkit definition: Ένα κυβερνητικό, διεθνές διακυβερνητικό συλλογικό όργανο ή άλλο συλλογικό όργανο, το οποίο έχει υπογράψει, επικυρώσει ή προσχωρήσει σε μια συνθήκη. @el
label: szerződés résztvevője a következő: @hu
definition: Hozzákapcsol egy művet egy testülethez, amely aláírt, ratifikált vagy jóváhagyott egy szerződést. @hu
toolkit label: szerződés résztvevője: @hu
toolkit definition: Egy testület, amely egy szerződést aláírt, ratifikált vagy jóváhagyott. @hu
label: valtiosopimuksen allekirjoittaja @fi
label: har part i traktat @no
definition: Relaterer et verk til en korporasjon som har undertegnet, ratifisert eller sluttet seg til en traktat. @no
label: heeft deelnemer in verdrag @nl
definition: Relateert een werk aan een corporatie die heeft getekend, geratificeerd of is toegetreden aan een verdrag. @nl
toolkit label: deelnemer in verdrag @nl
toolkit definition: Een corporatie die heeft getekend, geratificeerd of is toegetreden aan een verdrag. @nl
label: له مشارك في معاهدة @ar
definition: يربط بين عمل وهيئة وقعت معاهدة، أو صادقت عليها، أو انضمت إليها. @ar
toolkit label: مشارك في معاهدة @ar
toolkit definition: هيئة وقعت معاهدة، أو صادقت عليها، أو انضمت إليها. @ar
label: rahvusvahelise lepingu osaline @et
definition: Seostab teose asutusega, kes on rahvusvahelise lepingu alla kirjutanud, ratifitseerinud või sellega ühinenud. @et
toolkit label: rahvusvahelise lepingu osaline @et
toolkit definition: Asutus, kes on rahvusvahelise lepingu alla kirjutanud, ratifitseerinud või sellega ühinenud. @et
label: ha come partecipante a un trattato @it
definition: Correla un’opera a un ente che ha firmato, ratificato o aderito a un trattato. @it
toolkit label: partecipante a un trattato @it
toolkit definition: Ente che ha firmato, ratificato o aderito a un trattato. @it
label: līgumslēdzējs @lv
definition: Sasaista darbu ar institūciju, kas ir parakstījusi, ratificējusi vai pievienojusies līgumam. @lv
toolkit label: līgumslēdzējs @lv
toolkit definition: Institūcija, kas ir parakstījusi, ratificējusi vai pievienojusies līgumam. @lv
label: 有条约的参与者 @zh-hans
definition: 将一种作品与签署、批准或加入一个条约的一个团体关联起来。 @zh-hans
toolkit label: 条约的参与者 @zh-hans
toolkit definition: 签署、批准或加入一个条约的一个团体 @zh-hans
has subproperty: P10292
label: antlaşmanın katılımcısı ile ilişkilidir @tr
definition: Bir eseri, bir anlaşmayı imzalayan, onaylayan veya anlaşmaya katılan tüzel kişi ile ilişkilendirir. @tr
toolkit label: anlaşma iştirakçisi @tr
toolkit definition: Bir anlaşmayı imzalayan, onaylayan veya anlaşmaya katılan bir tüzel kişilik. @tr

is review of RDA entity
status: Published
lexical alias: reviewOfRDAEntity.en
definition: Relates a work to an RDA entity that is briefly evaluated by a work.
toolkit label: review of RDA entity
toolkit definition: An RDA entity that is briefly evaluated by a work.
type: Property
domain: C10001
has element type: 2
label: arvostelu RDA-entiteetistä @fi
definition: Liittää teoksen lyhyen arvioinnin perustana käytettyyn RDA-entiteettiin. @fi
toolkit label: arvostelu RDA-entiteetistä @fi
toolkit definition: Teoksen lyhyen arvioinnin perustana käytetty RDA-entiteetti. @fi
label: er anmeldelse av RDA-entitet @no
definition: Relaterer et verk til en RDA-entitet brukt som utgangspunkt for en kortfattet evaluering. @no
toolkit label: anmeldelse av RDA-entitet @no
toolkit definition: En RDA-entitet brukt som utgangspunkt for en kortfattet evaluering. @no
label: is recensie van RDA-entiteit @nl
definition: Relateert een werk aan een RDA-entiteit gebruikt als een basis voor een korte beschouwing. @nl
toolkit label: recensie van RDA-entiteit @nl
toolkit definition: Een RDA-entiteit gebruikt als een basis voor een korte beschouwing. @nl
label: هو مراجعة لكيان "وام" @ar
definition: يربط بين عمل وكيان "وام" مستخدم كأساس لتقييم موجز. @ar
toolkit label: مراجعة كيان "وام" @ar
toolkit definition: كيان "وام" مستخدم كأساس لتقييم موجز. @ar
label: és revisió d’una entitat RDA @ca
definition: Relaciona una obra amb una entitat RDA que és avaluada breument per una obra. @ca
toolkit label: revisió d’una entitat RDA @ca
toolkit definition: Entitat RDA que és avaluada breument per una obra. @ca
label: er anmeldelse af RDA-entitet @da
definition: Relaterer et værk til en RDA-entitet, som anvendes som grundlag for en kortfattet evaluering. @da
toolkit label: anmeldelse af RDA-entitet @da
toolkit definition: RDA-entitet, som anvendes som grundlag for en kortfattet evaluering. @da
label: ülevaade RDA olemist @et
definition: Seostab teose RDA olemiga, mis on lühihinnangu aluseks. @et
toolkit label: ülevaade RDA olemist @et
toolkit definition: RDA olem, mis on lühihinnangu aluseks. @et
label: ist Rezension von (RDA-Entität) @de
definition: Setzt ein Werk in Beziehung zu einer RDA-Entität, die als Grundlage für eine kurze Untersuchung verwendet wird. @de
toolkit label: Rezension von (RDA-Entität) @de
toolkit definition: Eine RDA-Entität, die als Grundlage für eine kurze Untersuchung verwendet wird. @de
label: szemlézi a következő RDA-entitást @hu
definition: Hozzákapcsol egy művet egy RDA-entitáshoz, amelyet egy rövid kiértékelés alapjaként használnak. @hu
toolkit label: szemlézett RDA-entitás @hu
toolkit definition: Egy RDA-entitás, amelyet egy rövid kiértékelés alapjaként használnak. @hu
label: è recensione di entità RDA @it
definition: Correla un’opera a un’entità RDA utilizzata come base per una breve valutazione. @it
toolkit label: recensione di entità RDA @it
toolkit definition: Entità RDA utilizzata come base per una breve valutazione. @it
label: est une recension d’une entité RDA @fr
definition: Met une œuvre en relation avec une entité RDA qui est brièvement évaluée par une œuvre. @fr
toolkit label: recension d’une entité RDA @fr
toolkit definition: Entité RDA qui est brièvement évaluée par une œuvre. @fr
sub property of: is evaluation of RDA entity
label: ir recenzija RDA entītei @lv
definition: Sasaista darbu ar RDA entīti, kas izmantota par pamatu īsam novērtējumam. @lv
toolkit label: recenzija RDA entītei @lv
toolkit definition: RDA entīte, kas izmantota par pamatu īsam novērtējumam. @lv
label: 是RDA实体的评论 @zh-hans
definition: 将一种作品与被一种作品简要评价的一个RDA实体关联起来。 @zh-hans
toolkit label: RDA实体的评论 @zh-hans
toolkit definition: 被一种作品简要评价的一个RDA实体 @zh-hans
has subproperty: P10362
label: RDA varlığının incelemesidir @tr
definition: Bir eseri, bir eser tarafından kısaca değerlendirilen bir RDA varlığıyla ilişkilendirir. @tr
toolkit label: RDA varlığının incelenmesi @tr
toolkit definition: Bir çalışma tarafından kısaca değerlendirilen bir RDA varlığı. @tr

has scale of representative expression
status: Published
type: Property
lexical alias: scaleOfRepresentativeExpression.en
definition: Relates a work to a ratio of the dimensions of a representative expression of an image or three-dimensional form to the dimensions of the thing that is represented.
domain: C10001
toolkit label: scale of representative expression
has element type: 3
toolkit definition: A ratio of the dimensions of a representative expression of an image or three-dimensional form to the dimensions of the thing that is represented.
label: edustavan ekspression mittakaava @fi
definition: Liittää teoksen kuvan tai kolmiulotteisen muodon edustavan ekspression mittojen suhteeseen esitetyn kohteen mittoihin. @fi
toolkit label: edustavan ekspression mittakaava @fi
toolkit definition: Kuvan tai esineen edustavan ekspression mittojen suhde esitetyn kohteen mittoihin. @fi
label: har målestokk for representativt uttrykk @no
definition: Relaterer et verk til et forhold mellom størrelsen til et representativt uttrykk av et bilde eller en tredimensjonal form og størrelsen på det som gjengis. @no
toolkit label: målestokk for representativt uttrykk @no
toolkit definition: Et forhold mellom størrelsen til et representativt uttrykk av et bilde eller en tredimensjonal form og størrelsen på det som gjengis. @no
label: heeft schaal van representatieve expressie @nl
definition: Relateert een werk aan een verhouding van de afmetingen van een representatieve expressie van een beeld of driedimensionale vorm tot de afmetingen van het ding dat voorgesteld wordt. @nl
toolkit label: schaal van representatieve expressie @nl
toolkit definition: Een verhouding van de afmetingen van een representatieve expressie van een beeld of driedimensionale vorm tot de afmetingen van het ding dat voorgesteld wordt. @nl
label: له مقياس رسم لتعبيرة ممثِلة @ar
definition: يربط بين عمل ونسبة أبعاد تعبيرة ممثِلة لصورة أو شكل ثلاثي الأبعاد إلى أبعاد الشيء الممثَّل. @ar
toolkit label: مقياس رسم لتعبيرة ممثِلة @ar
toolkit definition: نسبة أبعاد تعبيرة ممثِلة لصورة أو شكل ثلاثي الأبعاد إلى أبعاد الشيء الممثَّل. @ar
label: té com a escala d’una expressió representativa @ca
definition: Relaciona una obra amb una relació entre les dimensions d’una expressió representativa d’una imatge o d’una forma tridimensional i les dimensions de la cosa que representa. @ca
toolkit label: escala d’una expressió representativa @ca
toolkit definition: Relació entre les dimensions d’una expressió representativa d’una imatge o d’una forma tridimensional i les dimensions de la cosa que representa. @ca
label: har målestoksforhold for repræsentativt udtryk @da
definition: Relaterer et værk til et forhold mellem et billedes repræsentative udtryk eller en tredimensionel form og dimensionerne for den ting, billedet eller formen repræsenterer. @da
toolkit label: målestoksforhold for repræsentativt udtryk @da
toolkit definition: Forhold mellem et billedes repræsentative udtryk eller en tredimensionel form og dimensionerne for den ting, billedet eller formen repræsenterer. @da
label: iseloomuliku väljenduse mõõtkava @et
definition: Seostab teose suhtarvuga, mis näitab pildi või kolmemõõtmelise vormi iseloomuliku väljenduse ning kujutatud eseme mõõtmete suhet. @et
toolkit label: iseloomuliku väljenduse mõõtkava @et
toolkit definition: Suhtarv, mis näitab pildi või kolmemõõtmelise vormi iseloomuliku väljenduse ning kujutatud eseme mõõtmete suhet. @et
label: hat Maßstab einer repräsentativen Expression @de
definition: Setzt ein Werk in Beziehung zu einem Verhältnis der Maße einer repräsentativen Expression eines Bilds oder einer dreidimensionalen Form zu den Maßen der Sache, die es/sie repräsentiert. @de
toolkit label: Maßstab einer repräsentativen Expression @de
toolkit definition: Ein Verhältnis der Maße einer repräsentativen Expression eines Bilds oder einer dreidimensionalen Form zu den Maßen der Sache, die es/sie repräsentiert. @de
label: reprezentatív kifejezési forma méretaránya a következő: @hu
definition: Hozzákapcsol egy forrást egy kép vagy háromdimenziós forma reprezentatív kifejezési formája méretének és az általa ábrázolt dolog méretének viszonyításához. @hu
toolkit label: reprezentatív kifejezési formához tartozó méretarány @hu
toolkit definition: Egy kép vagy háromdimenziós forma reprezentatív kifejezési formájának mérete és az általa ábrázolt dolog méretének viszonyítása. @hu
label: ha come scala dell'espressione rappresentativa @it
definition: Correla un’opera a un rapporto tra le dimensioni di un’espressione rappresentativa di un'immagine o forma tridimensionale e le dimensioni dell'entità che è rappresentata. @it
toolkit label: scala dell'espressione rappresentativa @it
toolkit definition: Rapporto tra le dimensioni di un’espressione rappresentativa di un'immagine o forma tridimensionale e le dimensioni dell'entità che è rappresentata. @it
label: a pour échelle d’une expression représentative @fr
definition: Met une œuvre en relation avec un rapport entre les dimensions d’une expression représentative d’une image ou d’une forme tridimensionnelle et les dimensions de la chose représentée. @fr
toolkit label: échelle d’une expression représentative @fr
toolkit definition: Rapport entre les dimensions d’une expression représentative d’une image ou d’une forme tridimensionnelle et les dimensions de la chose représentée. @fr
label: reprezentatīvās izteiksmes mērogs @lv
definition: Sasaista darbu ar attēla vai trīsdimensiju formas reprezentatīvās izteiksmes izmēru attiecību pret izmēriem dabā. @lv
toolkit label: reprezentatīvās izteiksmes mērogs @lv
toolkit definition: Attēla vai trīsdimensiju formas reprezentatīvās izteiksmes izmēru attiecība pret izmēriem dabā. @lv
label: 有代表性内容表达的比例尺 @zh-hans
definition: 将一种作品与一种图像或三维形式的代表性内容表达的尺寸与其所代表的东西的尺寸之比关联起来。 @zh-hans
toolkit label: 代表性内容表达的比例尺 @zh-hans
toolkit definition: 一种图像或三维形式的代表性内容表达的尺寸与其所代表的东西的尺寸之比 @zh-hans
has subproperty: P10356
label: temsili anlatımın ölçeği ile ilişkilidir @tr
definition: Bir eseri, durağan bir görüntünün veya üç boyutlu formun temsili anlatımının boyutlarının temsil edilen şeyin boyutlarına oranıyla ilişkilendirir. @tr
toolkit label: temsili anlatım ölçeği @tr
toolkit definition: Bir görüntünün veya üç boyutlu bir formun temsil edici anlatımının boyutlarının temsil edilen şeyin boyutlarına oranı. @tr

has scope of validity
status: Published
lexical alias: scopeOfValidity.en
definition: Relates a work to an unstructured or structured description of a set of entities for which the value of a metadata work is valid.
toolkit label: scope of validity
toolkit definition: An unstructured or structured description of a set of entities for which the value of a metadata work is valid.
type: Property
domain: C10001
has element type: 6
label: voimassaoloala @fi
definition: Liittää teoksen rakenteistamattomaan tai rakenteistettuun kuvailuun entiteettien joukosta, johon metatietoteoksen arvo pätee. @fi
toolkit label: voimassaoloala @fi
toolkit definition: Rakenteistamaton tai rakenteistettu kuvailu entiteettien joukosta, johon metatietoteoksen arvo pätee. @fi
label: har omfang for gyldighet @no
definition: Relaterer et verk til en ustrukturert eller strukturert beskrivelse av en rekke verk som verdien av et metadataverk er gyldig for. @no
toolkit label: omfang for gyldighet @no
toolkit definition: En ustrukturert eller strukturert beskrivelse av en rekke verk som verdien av et metadataverk er gyldig for. @no
label: heeft scope van validiteit @nl
definition: Relateert een werk aan een ongestructureerde of gestructureerde beschrijving van een verzameling van entiteiten waarvoor de waarde van een metadatawerk geldig is. @nl
toolkit label: scope van validiteit @nl
toolkit definition: Een ongestructureerde of gestructureerde beschrijving van een verzameling van entiteiten waarvoor de waarde van een metadatawerk geldig is. @nl
label: له نطاق صلاحية @ar
definition: يربط بين عمل ووصف غير محدد أو محدد لمجموعة كيانات تصلح لها قيمة عمل ميتاداتا. @ar
toolkit label: نطاق صلاحية @ar
toolkit definition: وصف غير محدد أو محدد لمجموعة كيانات تصلح لها قيمة عمل ميتاداتا. @ar
label: té com a abast de validesa @ca
definition: Relaciona una obra amb una descripció no estructurada o estructurada d’un grup d’entitats d’obres per a les quals és vàlid el valor d’una obra de metadades. @ca
toolkit label: abast de validesa @ca
toolkit definition: Descripció no estructurada o estructurada d’un grup d’entitats d’obres per a les quals és vàlid el valor d’una obra de metadades. @ca
label: har rækkevidde for validitet @da
definition: Relaterer et værk til en ustruktureret eller struktureret beskrivelse af en række værker, for hvem værdien af et metadataværk er gyldig. @da
toolkit label: rækkevidde for validitet @da
toolkit definition: Ustruktureret eller struktureret beskrivelse af en række værker, for hvem værdien af et metadataværk er gyldig. @da
label: kehtivusala @et
definition: Seostab teose struktureerimata või struktureeritud kirjeldusega teoste hulga kohta, mille kohta metaandmeteos kehtib. @et
toolkit label: kehtivusala @et
toolkit definition: Struktureerimata või struktureeritud kirjeldus teoste hulga kohta, mille kohta metaandmeteos kehtib. @et
label: hat Gültigkeitsbereich @de
definition: Setzt ein Werk in Beziehung zu einer unstrukturierten oder strukturierten Beschreibung einer Menge von Entitäten, für die der Wert eines Metadatenwerks gültig ist. @de
toolkit label: Gültigkeitsbereich @de
toolkit definition: Eine unstrukturierte oder strukturierte Beschreibung einer Menge von Entitäten, für die der Wert eines Metadatenwerks gültig ist. @de
label: érvényes alkalmazási területe a következő: @hu
definition: Hozzákapcsol egy művet egy entitáshalmaz struktúrálatlan vagy struktúrált leírásához, amelyre érvényes egy metaadatmű értéke. @hu
toolkit label: érvényes alkalmazási területe: @hu
toolkit definition: Egy entitáshalmaz struktúrálatlan vagy struktúrált leírása, amelyre érvényes egy metaadatmű értéke. @hu
label: ha come ambito di validità @it
definition: Correla un'opera a una descrizione strutturata o non strutturata di un intervallo di opere per le quali è valido il valore di un'opera di metadati. @it
toolkit label: ambito di validità @it
toolkit definition: Descrizione strutturata o non strutturata di un intervallo di opere per le quali è valido il valore di un'opera di metadati. @it
label: a pour champ de validité @fr
definition: Met une œuvre en relation avec une description non structurée ou structurée d’un ensemble d’entités pour laquelle la valeur d’une œuvre de métadonnées est valide. @fr
toolkit label: champ de validité @fr
toolkit definition: Description non structurée ou structurée d’un ensemble d’entités pour laquelle la valeur d’une œuvre de métadonnées est valide. @fr
label: derīguma joma @lv
definition: Sasaista darbu ar pielietojuma diapazona nestrukturētu vai strukturētu aprakstu darbiem, kuriem metadatu vērtība ir derīga. @lv
toolkit label: derīguma joma @lv
toolkit definition: Pielietojuma diapazona nestrukturēts vai strukturēts apraksts darbiem, kuriem metadatu vērtība ir derīga @lv
label: 有适用范围 @zh-hans
definition: 将一种作品与一种元数据作品的取值对其有效的一个实体的集合的非结构化或结构化描述关联起来。 @zh-hans
toolkit label: 适用范围 @zh-hans
toolkit definition: 一种元数据作品的取值对其有效的一个实体的集合的非结构化或结构化描述 @zh-hans
has subproperty: P10403
label: geçerlilik kapsamı ile ilişkilidir @tr
definition: Bir eseri, bir üstveri eserinin değerinin geçerli olduğu bir varlık setinin yapılandırılmamış veya yapılandırılmış tanımı ile ilişkilendirir. @tr
toolkit label: geçerlilik kapsamı @tr
toolkit definition: Bir üst veri çalışmasının değerinin geçerli olduğu bir varlık kümesinin yapılandırılmamış veya yapılandırılmış açıklaması. @tr

has screenwriter agent
status: Published
definition: Relates a work to an agent who is an author of a screenplay, script, or scene.
type: Property
domain: C10001
sub property of: has author agent
lexical alias: screenwriterAgent.en
toolkit label: screenwriter agent
toolkit definition: An agent who is an author of a screenplay, script, or scene.
toolkit label: agent scénariste @fr
toolkit definition: Agent auteur d’un scénario, d’un script ou d’une scène. @fr
toolkit label: guionista @es
toolkit definition: Un autor de un guión o escena. @es
instruction number: 18.5
label: har agent, som er manuskriptforfatter @da
definition: Relaterer et værk til en agent, som er forfatter af et manuskript, drejebog eller scene. @da
toolkit label: agent, som er manuskriptforfatter @da
toolkit definition: Agent, som er forfatter af et manuskript, drejebog eller scene. @da
definition: Met une œuvre en relation avec un agent auteur d’un scénario, d’un script ou d’une scène. @fr
label: có người viết kịch bản @vi
definition: Liên kết tác phẩm với tác giả của kịch bản, bản phát thanh, hoặc cảnh. @vi
toolkit label: người viết kịch bản @vi
toolkit definition: Tác giả của kịch bản, bản phát thanh, hoặc cảnh. @vi
label: hat Drehbuchautorin/Drehbuchautor (Akteur) @de
definition: Setzt ein Werk in Beziehung zu einer Verfasserin/einem Verfasser (Akteur) eines Drehbuchs, eines Skripts oder einer Szene. @de
toolkit label: Drehbuchautorin/Drehbuchautor (Akteur) @de
toolkit definition: Eine Verfasserin/Ein Verfasser (Akteur) eines Drehbuchs, eines Skripts oder einer Szene. @de
label: a pour agent scénariste @fr
definition: Liittää teoksen toimijaan, joka on käsikirjoituksen tai kohtauksen kirjoittaja. @fi
toolkit label: käsikirjoittaja (toimija) @fi
toolkit definition: Toimija, joka on käsikirjoituksen tai kohtauksen kirjoittaja. @fi
toolkit label: manusforfatter (agent) @no
toolkit definition: En agent som er en forfatter av et skuespill, et manuskript eller en scene. @no
label: té com a agent guionista @ca
definition: Relaciona una obra amb un agent que és un autor d’un guió, un argument o una escena. @ca
toolkit label: agent guionista @ca
toolkit definition: Agent que és un autor d’un guió, un argument o una escena. @ca
has element type: 2
label: έχει σεναριογράφο @el
definition: Συνδέει ένα έργο με έναν συγγραφέα ενός σεναρίου, των διαλόγων ή των σκηνών. @el
toolkit label: σεναριογράφος @el
toolkit definition: Ένας συγγραφέας ενός σεναρίου, των διαλόγων ή των σκηνών. @el
label: forgatókönyvíró ágense a következő: @hu
definition: Hozzákapcsol egy művet egy ágenshez, amely szerzője egy forgatókönyvnek, szövegkönyvnek vagy jelenetnek. @hu
toolkit label: forgatókönyvíró ágens: @hu
toolkit definition: Egy ágens, amely szerzője egy forgatókönyvnek, szövegkönyvnek vagy jelenetnek. @hu
alternative label: screenwriter
alternative label: käsikirjoittaja @fi
label: käsikirjoittaja (toimija) @fi
label: har manusforfatter (agent) @no
definition: Relaterer et verk til en agent som er en forfatter av et skuespill, et manuskript eller en scene. @no
alternative label: manusforfatter @no
label: heeft scenarioschrijver-actor @nl
definition: Relateert een werk aan een actor die een auteur is van een scenario, script of scène. @nl
toolkit label: scenarioschrijver-actor @nl
toolkit definition: Een actor die een auteur is van een scenario, script of scène. @nl
label: له وكيل كاتب سيناريو @ar
definition: يربط بين عمل ووكيل يكون مؤلف سيناريو، أو نص، أو مشهد. @ar
alternative label: كاتب سيناريو @ar
toolkit label: وكيل كاتب سيناريو @ar
toolkit definition: وكيل يكون مؤلف سيناريو، أو نص، أو مشهد. @ar
alternative label: guionista @ca
alternative label: manuskriptforfatter @da
label: stsenarist (tegija) @et
definition: Seostab teose tegijaga, kes on stsenaariumi või stseeni autor. @et
alternative label: stsenarist @et
toolkit label: stsenarist (tegija) @et
toolkit definition: Tegija, kes on stsenaariumi või stseeni autor. @et
alternative label: forgatókönyvíró: @hu
label: ha come sceneggiatore agente @it
definition: Correla un’opera con un agente autore di una sceneggiatura, copione o scena. @it
alternative label: sceneggiatore @it
toolkit label: sceneggiatore agente @it
toolkit definition: Agente autore di una sceneggiatura, copione o scena. @it
alternative label: scénariste @fr
label: scenārists (aģents) @lv
definition: Sasaista darbu ar aģentu, kas ir scenārija, uzveduma plāna vai ainas autors. @lv
toolkit label: scenārists (aģents) @lv
toolkit definition: Aģents, kas ir scenārija, uzveduma plāna vai ainas autors. @lv
alternative label: Drehbuchautor @de
toolkit label: 影视剧编剧行为者 @zh-hans

has screenwriter collective agent
status: Published
lexical alias: screenwriterCollectiveAgent.en
definition: Relates a work to a collective agent who is an author of a screenplay, script, or scene.
toolkit label: screenwriter collective agent
toolkit definition: A collective agent who is an author of a screenplay, script, or scene.
type: Property
domain: C10001
has element type: 2
sub property of: has author collective agent
sub property of: has screenwriter agent
label: käsikirjoittaja (yhteistoimija) @fi
definition: Liittää teoksen yhteistoimijaan, joka on käsikirjoituksen tai kohtauksen kirjoittaja. @fi
toolkit label: käsikirjoittaja (yhteistoimija) @fi
toolkit definition: Yhteistoimija, joka on käsikirjoituksen tai kohtauksen kirjoittaja. @fi
label: har manusforfatter (kollektiv agent) @no
definition: Relaterer et verk til en kollektiv agent som er en forfatter av et skuespill, et manuskript eller en scene. @no
toolkit label: manusforfatter (kollektiv agent) @no
toolkit definition: En kollektiv agent som er en forfatter av et skuespill, et manuskript eller en scene. @no
label: heeft scenarioschrijver-collectieve actor @nl
definition: Relateert een werk aan een collectieve actor die een auteur is van een scenario, script of scène. @nl
toolkit label: scenarioschrijver-collectieve actor @nl
toolkit definition: Een collectieve actor die een auteur is van een scenario, script of scène. @nl
label: له وكيل جماعي كاتب سيناريو @ar
definition: يربط بين عمل ووكيل جماعي يكون مؤلف سيناريو، أو نص، أو مشهد. @ar
toolkit label: وكيل جماعي كاتب سيناريو @ar
toolkit definition: وكيل جماعي يكون مؤلف سيناريو، أو نص، أو مشهد. @ar
label: té com a agent col·lectiu guionista @ca
definition: Relaciona una obra amb un agent col·lectiu que és un autor d’un guió, un argument o una escena. @ca
toolkit label: agent col·lectiu guionista @ca
toolkit definition: Agent col·lectiu que és un autor d’un guió, un argument o una escena. @ca
label: har kollektiv agent, som er manuskriptforfatter @da
definition: Relaterer et værk til en kollektiv agent, som er forfatter af et manuskript, drejebog eller scene. @da
toolkit label: kollektiv agent, som er manuskriptforfatter @da
toolkit definition: Kollektiv agent, som er forfatter af et manuskript, drejebog eller scene. @da
label: stsenarist (kollektiiv) @et
definition: Seostab teose kollektiiviga, kes on stsenaariumi või stseeni autor. @et
toolkit label: stsenarist (kollektiiv) @et
toolkit definition: Kollektiiv, kes on stsenaariumi või stseeni autor. @et
label: hat Drehbuchautorin/Drehbuchautor (Gemeinschaftlicher Akteur) @de
definition: Setzt ein Werk in Beziehung zu einer Verfasserin/einem Verfasser (Gemeinschaftlicher Akteur) eines Drehbuchs, eines Skripts oder einer Szene. @de
toolkit label: Drehbuchautorin/Drehbuchautor (Gemeinschaftlicher Akteur) @de
toolkit definition: Eine Verfasserin/Ein Verfasser (Gemeinschaftlicher Akteur) eines Drehbuchs, eines Skripts oder einer Szene. @de
label: forgatókönyvíró kollektív ágense a következő: @hu
definition: Hozzákapcsol egy művet egy kollektív ágenshez, amely szerzője egy forgatókönyvnek, szövegkönyvnek vagy jelenetnek. @hu
toolkit label: forgatókönyvíró kollektív ágens: @hu
toolkit definition: Egy kollektív ágens, amely szerzője egy forgatókönyvnek, szövegkönyvnek vagy jelenetnek. @hu
label: ha come sceneggiatore agente collettivo @it
definition: Correla un'opera a un agente collettivo, che è autore di una sceneggiatura, copione o scena. @it
toolkit label: sceneggiatore agente collettivo @it
toolkit definition: Agente collettivo autore di una sceneggiatura, copione o scena. @it
label: a pour agent collectif scénariste @fr
definition: Met une œuvre en relation avec un agent collectif auteur d’un scénario, d’un script ou d’une scène. @fr
toolkit label: agent collectif scénariste @fr
toolkit definition: Agent collectif auteur d’un scénario, d’un script ou d’une scène. @fr
label: scenārists (grupa) @lv
definition: Sasaista darbu ar grupu, kas ir scenārija, uzveduma plāna vai ainas autors. @lv
toolkit label: scenārists (grupa) @lv
toolkit definition: Grupa, kas ir scenārija, uzveduma plāna vai ainas autors. @lv
label: 有影视剧编剧集体行为者 @zh-hans
definition: 将一种作品与作为影视剧剧本、脚本或场景著者的一个集体行为者关联起来。 @zh-hans
toolkit label: 影视剧编剧集体行为者 @zh-hans
toolkit definition: 作为影视剧剧本、脚本或场景著者的一个集体行为者 @zh-hans
has subproperty: has screenwriter corporate body
has subproperty: has screenwriter family
has subproperty: P10476
label: senarist kolektif temsilcisi ile ilişkilidir @tr
definition: Bir eseri, senaryo, metin veya sahne yazarı olan kolektif bir temsilci ile ilişkilendirir. @tr
toolkit label: senarist kolektif temsilci @tr
toolkit definition: Senaryo, metin veya sahne yazan kolektif bir temsilci @tr

has screenwriter corporate body
status: Published
lexical alias: screenwriterCorporateBody.en
definition: Relates a work to a corporate body who is an author of a screenplay, script, or scene.
toolkit label: screenwriter corporate body
toolkit definition: A corporate body who is an author of a screenplay, script, or scene.
type: Property
domain: C10001
has element type: 2
sub property of: has author corporate body
sub property of: has screenwriter collective agent
label: käsikirjoittaja (yhteisö) @fi
definition: Liittää teoksen yhteisöön, joka on käsikirjoituksen tai kohtauksen kirjoittaja. @fi
toolkit label: käsikirjoittaja (yhteisö) @fi
toolkit definition: Yhteisö, joka on käsikirjoituksen tai kohtauksen kirjoittaja. @fi
label: har manusforfatter (korporasjon) @no
definition: Relaterer et verk til en korporasjon som er en forfatter av et skuespill, et manuskript eller en scene. @no
toolkit label: manusforfatter (korporasjon) @no
toolkit definition: En korporasjon som er en forfatter av et skuespill, et manuskript eller en scene. @no
label: heeft scenarioschrijver-corporatie @nl
definition: Relateert een werk aan een corporatie die een auteur is van een scenario, script of scène. @nl
toolkit label: scenarioschrijver-corporatie @nl
toolkit definition: Een corporatie die een auteur is van een scenario, script of scène. @nl
label: له هيئة كاتبة سيناريو @ar
definition: بريط بين عمل وهيئة تكون كاتب سيناريو، أو نص، أو مشهد. @ar
toolkit label: هيئة كاتبة سيناريو @ar
toolkit definition: هيئة تكون كاتب سيناريو، أو نص، أو مشهد. @ar
label: té com a entitat corporativa guionista @ca
definition: Relaciona una obra amb una entitat corporativa que és un autor d’un guió, un argument o una escena. @ca
toolkit label: entitat corporativa guionista @ca
toolkit definition: Entitat corporativa que és un autor d’un guió, un argument o una escena. @ca
label: har korporation, som er manuskriptforfatter @da
definition: Relaterer et værk til en korporation, som er forfatter af et manuskript, drejebog eller scene. @da
toolkit label: korporation, som er manuskriptforfatter @da
toolkit definition: Korporation, som er forfatter af et manuskript, drejebog eller scene. @da
label: stsenarist (asutus) @et
definition: Seostab teose asutusega, kes on stsenaariumi või stseeni autor. @et
toolkit label: stsenarist (asutus) @et
toolkit definition: Asutus, kes on stsenaariumi või stseeni autor. @et
label: hat Drehbuchautorin/Drehbuchautor (Körperschaft) @de
definition: Setzt ein Werk in Beziehung zu einer Verfasserin/einem Verfasser (Körperschaft) eines Drehbuchs, eines Skripts oder einer Szene. @de
toolkit label: Drehbuchautorin/Drehbuchautor (Körperschaft) @de
toolkit definition: Eine Verfasserin/Ein Verfasser eines Drehbuchs, eines Skripts oder einer Szene. @de
label: forgatókönyvíró testülete a következő: @hu
definition: Hozzákapcsol egy művet egy testülethez, amely szerzője egy forgatókönyvnek, szövegkönyvnek vagy jelenetnek. @hu
toolkit label: forgatókönyvíró testület: @hu
toolkit definition: Egy testület, amely szerzője egy forgatókönyvnek, szövegkönyvnek vagy jelenetnek. @hu
label: ha come sceneggiatore ente @it
definition: Correla un'opera a un ente autore di una sceneggiatura, copione o scena. @it
toolkit label: scenaggiatore ente @it
toolkit definition: Ente autore di una sceneggiatura, copione o scena. @it
label: a pour collectivité scénariste @fr
definition: Met une œuvre en relation avec une collectivité autrice d’un scénario, d’un script ou d’une scène. @fr
toolkit label: collectivité scénariste @fr
toolkit definition: Collectivité autrice d’un scénario, d’un script ou d’une scène. @fr
label: scenārists (institūcija) @lv
definition: Sasaista darbu ar institūciju, kas ir scenārija, uzveduma plāna vai ainas autors. @lv
toolkit label: scenārists (institūcija) @lv
toolkit definition: Institūcija, kas ir scenārija, uzveduma plāna vai ainas autors. @lv
label: 有影视剧编剧团体 @zh-hans
definition: 将一种作品与作为影视剧剧本、脚本或场景著者的一个团体关联起来。 @zh-hans
toolkit label: 影视剧编剧团体 @zh-hans
toolkit definition: 作为影视剧剧本、脚本或场景著者的一个团体 @zh-hans
has subproperty: P10523
label: senarist tüzel kişisi ile ilişkilidir @tr
definition: Bir eseri, senaryo, metin veya sahne yazarı olan tüzel kişi ile ilişkilendirir. @tr
toolkit label: senarist tüzel kişisi @tr
toolkit definition: Bir senaryo, metin ya da sahne yazarı olan bir tüzel kişi. @tr

has screenwriter family
status: Published
lexical alias: screenwriterFamily.en
definition: Relates a work to a family who is an author of a screenplay, script, or scene.
toolkit label: screenwriter family
toolkit definition: A family who is an author of a screenplay, script, or scene.
type: Property
domain: C10001
has element type: 2
sub property of: has author family
sub property of: has screenwriter collective agent
label: käsikirjoittaja (suku) @fi
definition: Liittää teoksen sukuun, joka on käsikirjoituksen tai kohtauksen kirjoittaja. @fi
toolkit label: käsikirjoittaja (suku) @fi
toolkit definition: Suku, joka on käsikirjoituksen tai kohtauksen kirjoittaja. @fi
label: har manusforfatter (familie) @no
definition: Relaterer et verk til en familie som er en forfatter av et skuespill, et manuskript eller en scene. @no
toolkit label: manusforfatter (familie) @no
toolkit definition: En familie som er en forfatter av et skuespill, et manuskript eller en scene. @no
label: heeft scenarioschrijver-familie @nl
definition: Relateert een werk aan een familie die een auteur is van een scenario, script of scène. @nl
toolkit label: scenarioschrijver-familie @nl
toolkit definition: Een familie die een auteur is van een scenario, script of scène. @nl
label: له عائلة كاتبة سيناريو @ar
definition: يربط بين عمل وعائلة تكون كاتبة سيناريو، أو نص، أو مشهد. @ar
toolkit label: عائلة كاتبة سيناريو @ar
toolkit definition: عائلة تكون كاتبة سيناريو، أو نص، أو مشهد. @ar
label: té com a família guionista @ca
definition: Relaciona una obra amb una família que és un autor d’un guió, un argument o una escena. @ca
toolkit label: família guionista @ca
toolkit definition: Família que és un autor d’un guió, un argument o una escena. @ca
label: har familie, som er manuskriptforfatter @da
definition: Relaterer et værk til en familie, som er forfatter af et manuskript, drejebog eller scene. @da
toolkit label: familie, som er manuskriptforfatter @da
toolkit definition: Familie, som er forfatter af et manuskript, drejebog eller scene. @da
label: stsenarist (perekond) @et
definition: Seostab teose perekonnaga, kes on stsenaariumi või stseeni autor. @et
toolkit label: stsenarist (perekond) @et
toolkit definition: Perekond, kes on stsenaariumi või stseeni autor. @et
label: hat Drehbuchautorin/Drehbuchautor (Familie) @de
definition: Setzt ein Werk in Beziehung zu einer Verfasserin/einem Verfasser (Familie) eines Drehbuchs, eines Skripts oder einer Szene. @de
toolkit label: Drehbuchautorin/Drehbuchautor (Familie) @de
toolkit definition: Eine Verfasserin/Ein Verfasser (Familie) eines Drehbuchs, eines Skripts oder einer Szene. @de
label: forgatókönyvíró családja a következő: @hu
definition: Hozzákapcsol egy művet egy családhoz, amely szerzője egy forgatókönyvnek, szövegkönyvnek vagy jelenetnek. @hu
toolkit label: forgatókönyvíró család: @hu
toolkit definition: Egy család, amely szerzője egy forgatókönyvnek, szövegkönyvnek vagy jelenetnek. @hu
label: ha come sceneggiatore famiglia @it
definition: Correla un'opera a una famiglia autore di una sceneggiatura, copione o scena. @it
toolkit label: sceneggiatore famiglia @it
toolkit definition: Famiglia autore di una sceneggiatura, copione o scena. @it
label: a pour famille scénariste @fr
definition: Met une œuvre en relation avec une famille autrice d’un scénario, d’un script ou d’une scène. @fr
toolkit label: famille scénariste @fr
toolkit definition: Famille autrice d’un scénario, d’un script ou d’une scène. @fr
label: scenārists (dzimta/ģimene) @lv
definition: Sasaista darbu ar dzimtu/ģimeni, kas ir scenārija, uzveduma plāna vai ainas autors. @lv
toolkit label: scenārists (dzimta/ģimene) @lv
toolkit definition: Dzimta/ģimene, kas ir scenārija, uzveduma plāna vai ainas autors. @lv
label: 有影视剧编剧家族 @zh-hans
definition: 将一种作品与作为影视剧剧本、脚本或场景著者的一个家族关联起来。 @zh-hans
toolkit label: 影视剧编剧家族 @zh-hans
toolkit definition: 作为影视剧剧本、脚本或场景著者的一个家族 @zh-hans
has subproperty: P10570
label: senarist ailesi ile ilişkilidir @tr
definition: Bir eseri, senaryo, metin veya sahne yazarı olan bir aileyle ilişkilendirir. @tr
toolkit label: senarist ailesi @tr
toolkit definition: Bir senaryo veya sahne yazarı olan bir aile. @tr

has screenwriter person
status: Published
lexical alias: screenwriterPerson.en
definition: Relates a work to a person who is an author of a screenplay, script, or scene.
toolkit label: screenwriter person
toolkit definition: A person who is an author of a screenplay, script, or scene.
type: Property
domain: C10001
has element type: 2
sub property of: has author person
sub property of: has screenwriter agent
label: käsikirjoittaja (henkilö) @fi
definition: Liittää teoksen henkilöön, joka on käsikirjoituksen tai kohtauksen kirjoittaja. @fi
toolkit label: käsikirjoittaja (henkilö) @fi
toolkit definition: Henkilö, joka on käsikirjoituksen tai kohtauksen kirjoittaja. @fi
label: har manusforfatter (person) @no
definition: Relaterer et verk til en person som er en forfatter av et skuespill, et manuskript eller en scene. @no
toolkit label: manusforfatter (person) @no
toolkit definition: En person som er en forfatter av et skuespill, et manuskript eller en scene. @no
label: heeft scenarioschrijver-persoon @nl
definition: Relateert een werk aan een persoon die een auteur is van een scenario, script of scène. @nl
toolkit label: scenarioschrijver-persoon @nl
toolkit definition: Een persoon die een auteur is van een scenario, script of scène. @nl
label: له شخص كاتب سيناريو @ar
definition: يربط بين عمل وشخص يكون مؤلف سيناريو، أو نص، أو مشهد. @ar
toolkit label: شخص كاتب سيناريو @ar
toolkit definition: شخص يكون مؤلف سيناريو، أو نص، أو مشهد. @ar
label: té com a persona guionista @ca
definition: Relaciona una obra amb una persona que és un autor d’un guió, un argument o una escena. @ca
toolkit label: persona guionista @ca
toolkit definition: Persona que és un autor d’un guió, un argument o una escena. @ca
label: har person, som er manuskriptforfatter @da
definition: Relaterer et værk til en person, som er forfatter af et manuskript, drejebog eller scene. @da
toolkit label: person, som er manuskriptforfatter @da
toolkit definition: Person, som er forfatter af et manuskript, drejebog eller scene. @da
label: stsenarist (isik) @et
definition: Seostab teose isikuga, kes on stsenaariumi või stseeni autor. @et
toolkit label: stsenarist (isik) @et
toolkit definition: Isik, kes on stsenaariumi või stseeni autor. @et
label: hat Drehbuchautorin/Drehbuchautor (Person) @de
definition: Setzt ein Werk in Beziehung zu einer Verfasserin/einem Verfasser (Person) eines Drehbuchs, eines Skripts oder einer Szene. @de
toolkit label: Drehbuchautorin/Drehbuchautor (Person) @de
toolkit definition: Eine Verfasserin/Ein Verfasser (Person) eines Drehbuchs, eines Skripts oder einer Szene. @de
label: forgatókönyvíró személye a következő: @hu
definition: Hozzákapcsol egy művet egy személyhez, aki szerzője egy forgatókönyvnek, szövegkönyvnek vagy jelenetnek. @hu
toolkit label: forgatókönyvíró személy: @hu
toolkit definition: Egy személy, aki szerzője egy forgatókönyvnek, szövegkönyvnek vagy jelenetnek. @hu
label: ha come sceneggiatore persona @it
definition: Correla un'opera a una persona autore di una sceneggiatura, copione o scena. @it
toolkit label: sceneggiatore persona @it
toolkit definition: Persona autore di una sceneggiatura, copione o scena. @it
label: a pour personne scénariste @fr
definition: Met une œuvre en relation avec une personne autrice d’un scénario, d’un script ou d’une scène. @fr
toolkit label: personne scénariste @fr
toolkit definition: Personne autrice d’un scénario, d’un script ou d’une scène. @fr
label: scenārists (persona) @lv
definition: Sasaista darbu ar personu, kura ir scenārija, uzveduma plāna vai ainas autors. @lv
toolkit label: scenārists (persona) @lv
toolkit definition: Persona, kura ir scenārija, uzveduma plāna vai ainas autors. @lv
label: 有影视剧编剧个人 @zh-hans
definition: 将一种作品与作为影视剧剧本、脚本或场景著者的一个个人关联起来。 @zh-hans
toolkit label: 影视剧编剧个人 @zh-hans
toolkit definition: 作为影视剧剧本、脚本或场景著者的一个个人 @zh-hans
has subproperty: P10429
label: senarist kişisi ile ilişkilidir @tr
definition: Bir eseri senaryo, metin veya sahne yazarı olan kişiyle ilişkilendirir. @tr
toolkit label: senarist kişi @tr
toolkit definition: Bir senaryo, diyalog veya sahnenin yazarı olan kişi. @tr

has script of representative expression
status: Published
type: Property
lexical alias: scriptOfRepresentativeExpression.en
definition: Relates a work to a set of characters or symbols used to express written language content of a representative expression of a work.
domain: C10001
toolkit label: script of representative expression
has element type: 5
toolkit definition: A set of characters or symbols used to express written language content of a representative expression of a work.
label: edustavan ekspression kirjoitusjärjestelmä @fi
definition: Liittää teoksen joukkoon merkkejä tai symboleja, joita käytetään teoksen edustavan ekspression kirjoitetun kielellisen sisällön ilmaisemiseen. @fi
toolkit label: edustavan ekspression kirjoitusjärjestelmä @fi
toolkit definition: Joukko merkkejä tai symboleja, joita käytetään teoksen edustavan ekspression kirjoitetun kielellisen sisällön ilmaisemiseen. @fi
label: har skriftsystem for representativt uttrykk @no
definition: Relaterer et verk til et sett med tegn eller symboler brukt til å uttrykke det skriftlige språkinnholdet i et representativt uttrykk av et verk. @no
toolkit label: skriftsystem for representativt uttrykk @no
toolkit definition: Et sett med tegn eller symboler brukt til å uttrykke det skriftlige språkinnholdet i et representativt uttrykk av et verk. @no
label: heeft schrift van representatieve expressie @nl
definition: Relateert een werk aan een set van karakters of symbolen gebruikt om geschreven taalcontent uit te drukken van een representatieve expressie van een werk. @nl
toolkit label: schrift van representatieve expressie @nl
toolkit definition: Een set van karakters of symbolen gebruikt om geschreven taalcontent uit te drukken van een representatieve expressie van een werk. @nl
label: له نص لتعبيرة ممثِلة @ar
definition: يربط بين عمل ومجموعة تمثيلات أو رموز مستخدمة للتعبير عن محتوى لغة مكتوبة لتعبيرة ممثِلة عمل. @ar
toolkit label: نص لتعبيرة ممثِلة @ar
toolkit definition: مجموعة تمثيلات أو رموز مستخدمة للتعبير عن محتوى لغة مكتوبة لتعبيرة ممثِلة عمل. @ar
label: té com a escriptura d’una expressió representativa @ca
definition: Relaciona una obra amb un conjunt de caràcters o de símbols usats per expressar el contingut lingüístic escrit d’una expressió representativa d’una obra. @ca
toolkit label: escriptura d’una expressió representativa @ca
toolkit definition: Conjunt de caràcters o de símbols usats per expressar el contingut lingüístic escrit d’una expressió representativa d’una obra. @ca
label: har skriftsystem for repræsentativt udtryk @da
definition: Relaterer et værk til et sæt af tegn eller symboler, brugt til at udtrykke skriftligt sprogindhold i et værks repræsentative udtryk. @da
toolkit label: skriftsystem for repræsentativt udtryk @da
toolkit definition: Sæt af tegn eller symboler, brugt til at udtrykke skriftligt sprogindhold i et værks repræsentative udtryk. @da
label: iseloomuliku väljenduse kirjasüsteem @et
definition: Seostab teose märkide või sümbolite kogumiga, mida on kasutatud teose iseloomuliku väljenduse kirjaliku sisu väljendamiseks. @et
toolkit label: iseloomuliku väljenduse kirjasüsteem @et
toolkit definition: Märkide või sümbolite kogum, mida on kasutatud teose iseloomuliku väljenduse kirjaliku sisu väljendamiseks. @et
label: hat Schrift einer repräsentativen Expression @de
definition: Setzt ein Werk in Beziehung zu einem Satz von Zeichen oder Symbolen der verwendet wird, um den geschriebenen Sprachinhalt einer repräsentativen Expression eines Werks auszudrücken. @de
toolkit label: Schrift einer repräsentativen Expression @de
toolkit definition: Ein Satz von Zeichen oder Symbolen der verwendet wird, um den geschriebenen Sprachinhalt einer repräsentativen Expression eines Werks auszudrücken. @de
label: reprezentatív kifejezési forma szövegkönyve a következő: @hu
definition: Hozzákapcsol egy művet karakterek vagy szimbólumok egy csoportjához, amelyet arra használnak, hogy egy mű reprezentatív kifejezési formájának nyelvi tartalmát kifejezze. @hu
toolkit label: reprezentatív kifejezési formához tartozó leírás @hu
toolkit definition: Karakterek vagy szimbólumok egy csoportja, amelyet arra használnak, hogy egy mű reprezentatív kifejezési formájának nyelvi tartalmát kifejezze. @hu
label: ha come scrittura dell'espressione rappresentativa @it
definition: Correla un’opera a un insieme di caratteri o simboli utilizzati per esprimere il contenuto, in linguaggio scritto, di un’espressione rappresentativa di un’opera. @it
toolkit label: scrittura dell'espressione rappresentativa @it
toolkit definition: Insieme di caratteri o simboli utilizzati per esprimere il contenuto, in linguaggio scritto, di un’espressione rappresentativa di un’opera. @it
label: a pour écriture d’une expression représentative @fr
definition: Met une œuvre en relation avec un ensemble de caractères ou de symboles utilisé pour exprimer un contenu linguistique écrit d’une expression représentative d’une œuvre. @fr
toolkit label: écriture d’une expression représentative @fr
toolkit definition: Ensemble de caractères ou de symboles utilisé pour exprimer un contenu linguistique écrit d’une expression représentative d’une œuvre. @fr
label: reprezentatīvās izteiksmes pieraksts @lv
definition: Sasaista darbu ar rakstzīmju vai simbolu kopumu, ko izmanto, lai izteiktu darba reprezentatīvas izteiksmes saturu rakstiski. @lv
toolkit label: reprezentatīvās izteiksmes pieraksts @lv
toolkit definition: Rakstzīmju vai simbolu kopums, ko izmanto, lai izteiktu darba reprezentatīvas izteiksmes saturu rakstiski. @lv
label: 有代表性内容表达的文字 @zh-hans
definition: 将一种作品与用于表达一种作品的一种代表性内容表达的书写语言内容的字符或符号的集合关联起来。 @zh-hans
toolkit label: 代表性内容表达的文字 @zh-hans
toolkit definition: 用于表达一种作品的一种代表性内容表达的书写语言内容的字符或符号的集合 @zh-hans
has subproperty: P10357
label: temsili anlatımın yazı sistemi ile ilişkilidir @tr
definition: Bir eseri, bir eserin temsili anlatımının yazılı dil içeriğini ifade etmek için kullanılan bir dizi karakter veya sembolle ilişkilendirir. @tr
toolkit label: temsili anlatım metni @tr
toolkit definition: Bir eserin temsili anlatımının yazılı dil içeriğini ifade etmek için kullanılan karakterler veya semboller kümesi. @tr

has sculptor agent
status: Published
definition: Relates a work to an agent who is an artist who is responsible for creating a three-dimensional work by modeling, carving, or similar technique.
type: Property
domain: C10001
sub property of: has artist agent
lexical alias: sculptorAgent.en
toolkit label: sculptor agent
toolkit definition: An agent who is an artist who is responsible for creating a three-dimensional work by modeling, carving, or similar technique.
toolkit label: agent sculpteur @fr
toolkit definition: Agent artiste qui est responsable de la création d’une œuvre tridimensionnelle par le modelage, la taille ou une technique similaire. @fr
toolkit label: escultor @es
toolkit definition: Un artista responsable de la creación de una obra tridimensional mediante modelado, tallado o técnica similar. @es
instruction number: 18.5
label: har agent, som er skulptør @da
definition: Relaterer et værk til en agent, som er en kunstner, som er ansvarlig for at skabe et tredimensionelt værk vha. modellering, udskæring eller lignende teknik. @da
toolkit label: agent, som er skulptør @da
toolkit definition: Agent, som er en kunstner, som er ansvarlig for at skabe et tredimensionelt værk vha. modellering, udskæring eller lignende teknik. @da
definition: Met une œuvre en relation avec un agent artiste qui est responsable de la création d’une œuvre tridimensionnelle par le modelage, la taille ou une technique similaire. @fr
label: có nhà điêu khắc @vi
definition: Liên kết tác phẩm với nghệ sỹ có trách nhiệm tạo lập tác phẩm ba chiều bởi làm mô hình, khắc, hoặc kỹ thuật tương tự. @vi
toolkit label: nhà điêu khắc @vi
toolkit definition: Nghệ sỹ có trách nhiệm tạo lập tác phẩm ba chiều bởi làm mô hình, khắc, hoặc kỹ thuật tương tự. @vi
label: hat Bildhauerin/Bildhauer (Akteur) @de
definition: Setzt ein Werk in Beziehung zu einer Künstlerin/einem Künstler (Akteur), die/der für die Schaffung eines dreidimensionalen Werks durch Modellieren, Schnitzen oder ähnliche Techniken verantwortlich ist. @de
toolkit label: Bildhauerin/Bildhauer (Akteur) @de
toolkit definition: Eine Künstlerin/Ein Künstler (Akteur), die/der für die Schaffung eines dreidimensionalen Werks durch Modellieren, Schnitzen oder ähnliche Techniken verantwortlich ist. @de
label: a pour agent sculpteur @fr
definition: Liittää teoksen toimijaan, joka on taiteilija, joka on vastuussa kolmiulotteisen teoksen luomisesta muovaamalla, veistämällä tai vastaavalla tekniikalla. @fi
toolkit label: kuvanveistäjä (toimija) @fi
toolkit definition: Toimija, joka on taiteilija, joka on vastuussa kolmiulotteisen teoksen luomisesta muovaamalla, veistämällä tai vastaavalla tekniikalla. @fi
toolkit label: skulptør (agent) @no
toolkit definition: En agent som er en kunstner med ansvar for å skape et tredimensjonalt verk gjennom modellering, utskjæring eller lignende teknikker. @no
label: té com a agent escultor @ca
definition: Relaciona una obra amb un agent que és un artista que és responsable de la creació d’una obra tridimensional a partir del modelatge, la talla o una tècnica similar. @ca
toolkit label: agent escultor @ca
toolkit definition: Agent que és un artista que és responsable de la creació d’una obra tridimensional a partir del modelatge, la talla o una tècnica similar. @ca
has element type: 2
label: έχει γλύπτη @el
definition: Συνδέει ένα έργο με έναν καλλιτέχνη υπεύθυνο για τη δημιουργία ενός τρισδιάστατου έργου μέσω του μοντελισμού, της γλυπτικής ή μιας παρόμοιας τεχνικής. @el
toolkit label: γλύπτης @el
toolkit definition: Ένας καλλιτέχνης υπεύθυνος για τη δημιουργία ενός τρισδιάστατου έργου μέσω του μοντελισμού, της γλυπτικής ή μιας παρόμοιας τεχνικής. @el
label: szobrász ágense a következő: @hu
definition: Hozzákapcsol egy művet egy művész ágenshez, amely felelős egy háromdimenziós mű megalkotásáért modellezési, faragási vagy hasonló technikával. @hu
toolkit label: szobrász ágens: @hu
toolkit definition: Egy művész ágens, amely felelős egy háromdimenziós mű megalkotásáért modellezési, faragási vagy hasonló technikával. @hu
alternative label: sculptor
alternative label: kuvanveistäjä @fi
label: kuvanveistäjä (toimija) @fi
label: har skulptør (agent) @no
definition: Relaterer et verk til en agent som er en kunstner med ansvar for å skape et tredimensjonalt verk gjennom modellering, utskjæring eller lignende teknikker. @no
alternative label: skulptør @no
label: heeft beeldhouwer-actor @nl
definition: Relateert een werk aan een actor die een kunstenaar is die verantwoordelijk is voor het creëren van driedimensionaal modelleren, snijden of gelijksoortige techniek. @nl
toolkit label: beeldhouwer-actor @nl
toolkit definition: Een actor die een kunstenaar is die verantwoordelijk is voor het creëren van driedimensionaal modelleren, snijden of gelijksoortige techniek. @nl
label: له وكيل نحات @ar
definition: يربط بين عمل ووكيل يكون فنانًا مسئولاً عن إنشاء عمل ثلاثي الأبعاد عن طريق النمذجة، أو النحت، أو تقنية مشابهة. @ar
alternative label: نحات @ar
toolkit label: وكيل نحات @ar
toolkit definition: وكيل يكون فنانًا مسئولاً عن إنشاء عمل ثلاثي الأبعاد عن طريق النمذجة، أو النحت، أو تقنية مشابهة. @ar
alternative label: escultor @ca
label: skulptor (tegija) @et
definition: Seostab teose tegijaga, kes on modelleerimise, nikerdamise või muu säärase tehnika teel loodud kolmemõõtmelise teose eest vastutav kunstnik. @et
alternative label: skulptor @et
toolkit label: skulptor (tegija) @et
toolkit definition: Tegija, kes on modelleerimise, nikerdamise või muu säärase tehnika teel loodud kolmemõõtmelise teose eest vastutav kunstnik. @et
alternative label: szobrász: @hu
label: ha come scultore agente @it
definition: Correla un’opera all'agente artista responsabile della creazione di un’opera tridimensionale tramite modellatura, intaglio o tecnica simile. @it
alternative label: scultore @it
toolkit label: scultore agente @it
toolkit definition: Agente artista responsabile della creazione di un’opera tridimensionale tramite modellatura, intaglio o tecnica simile. @it
alternative label: sculpteur @fr
label: tēlnieks (aģents) @lv
definition: Sasaista darbu ar aģentu - mākslinieks, kurš ir atbildīgs par trīsdimensiju darba radīšanu, to veidojot, grebjot vai izmantojot līdzīgu tehniku. @lv
toolkit label: tēlnieks (aģents) @lv
toolkit definition: Aģents - mākslinieks, kurš ir atbildīgs par trīsdimensiju darba radīšanu, to veidojot, grebjot vai izmantojot līdzīgu tehniku. @lv
alternative label: Bildhauer @de
alternative label: 雕塑家 @zh-hans
toolkit label: 雕塑家行为者 @zh-hans

has sculptor collective agent
status: Published
lexical alias: sculptorCollectiveAgent.en
definition: Relates a work to a collective agent who is an artist who is responsible for creating a three-dimensional work by modeling, carving, or similar technique.
toolkit label: sculptor collective agent
toolkit definition: A collective agent who is an artist who is responsible for creating a three-dimensional work by modeling, carving, or similar technique.
type: Property
domain: C10001
has element type: 2
sub property of: has artist collective agent
sub property of: has sculptor agent
label: kuvanveistäjä (yhteistoimija) @fi
definition: Liittää teoksen yhteistoimijaan, joka on taiteilija, joka on vastuussa kolmiulotteisen teoksen luomisesta muovaamalla, veistämällä tai vastaavalla tekniikalla. @fi
toolkit label: kuvanveistäjä (yhteistoimija) @fi
toolkit definition: Yhteistoimija, joka on taiteilija, joka on vastuussa kolmiulotteisen teoksen luomisesta muovaamalla, veistämällä tai vastaavalla tekniikalla. @fi
label: har skulptør (kollektiv agent) @no
definition: Relaterer et verk til en kollektiv agent som er en kunstner med ansvar for å skape et tredimensjonalt verk gjennom modellering, utskjæring eller lignende teknikker. @no
toolkit label: skulptør (kollektiv agent) @no
toolkit definition: En kollektiv agent som er en kunstner med ansvar for å skape et tredimensjonalt verk gjennom modellering, utskjæring eller lignende teknikker. @no
label: heeft beeldhouwer-collectieve actor @nl
definition: Relateert een werk aan een collectieve actor die een kunstenaar is die verantwoordelijk is voor het creëren van driedimensionaal modelleren, snijden of gelijksoortige techniek. @nl
toolkit label: beeldhouwer-collectieve actor @nl
toolkit definition: Een collectieve actor die een kunstenaar is die verantwoordelijk is voor het creëren van driedimensionaal modelleren, snijden of gelijksoortige techniek. @nl
label: له وكيل جماعي نحات @ar
definition: يربط بين عمل ووكيل جماعي يكون فنانًا مسئولاً عن إنشاء عمل ثلاثي الأبعاد من خلال النمذجة، أو النحت، أو تقنية مشابهة. @ar
toolkit label: وكيل جماعي نحات @ar
toolkit definition: وكيل جماعي يكون فنانًا مسئولاً عن إنشاء عمل ثلاثي الأبعاد من خلال النمذجة، أو النحت، أو تقنية مشابهة. @ar
label: té com a agent col·lectiu escultor @ca
definition: Relaciona una obra amb un agent col·lectiu que és un artista que és responsable de la creació d’una obra tridimensional mitjançant l’escultura, la talla o una tècnica similar. @ca
toolkit label: agent col·lectiu escultor @ca
toolkit definition: Agent col·lectiu que és un artista que és responsable de la creació d’una obra tridimensional mitjançant l’escultura, la talla o una tècnica similar. @ca
label: har kollektiv agent, som er skulptør @da
definition: Relaterer et værk til en kollektiv agent, som er en kunstner, som er ansvarlig for at skabe et tredimensionelt værk vha. modellering, udskæring eller lignende teknik. @da
toolkit label: kollektiv agent, som er skulptør @da
toolkit definition: Kollektiv agent, som er en kunstner, som er ansvarlig for at skabe et tredimensionelt værk vha. modellering, udskæring eller lignende teknik. @da
label: skulptor (kollektiiv) @et
definition: Seostab teose kollektiiviga, kes on modelleerimise, nikerdamise või muu säärase tehnika teel loodud kolmemõõtmelise teose eest vastutav kunstnik. @et
toolkit label: skulptor (kollektiiv) @et
toolkit definition: Kollektiiv, kes on modelleerimise, nikerdamise või muu säärase tehnika teel loodud kolmemõõtmelise teose eest vastutav kunstnik. @et
label: hat Bildhauerin/Bildhauer (Gemeinschaftlicher Akteur) @de
definition: Setzt ein Werk in Beziehung zu einer Künstlerin/einem Künstler (Gemeinschaftlicher Akteur), die/der für die Schaffung eines dreidimensionalen Werks durch Modellieren, Schnitzen oder ähnliche Techniken verantwortlich ist. @de
toolkit label: Bildhauerin/Bildhauer (Gemeinschaftlicher Akteur) @de
toolkit definition: Eine Künstlerin/Ein Künstler (Gemeinschaftlicher Akteur), die/der für die Schaffung eines dreidimensionalen Werks durch Modellieren, Schnitzen oder ähnliche Techniken verantwortlich ist. @de
label: szobrász kollektív ágense a következő: @hu
definition: Hozzákapcsol egy művet egy művész kollektív ágenshez, amely felelős egy háromdimenziós mű megalkotásáért modellezési, faragási vagy hasonló technikával. @hu
toolkit label: szobrász kollektív ágens: @hu
toolkit definition: Egy művész kollektív ágens, amely felelős egy háromdimenziós mű megalkotásáért modellezési, faragási vagy hasonló technikával. @hu
label: ha come scultore agente collettivo @it
definition: Correla un'opera all'agente collettivo artista responsabile della creazione di un'opera tridimensionale tramite modellatura, intaglio o tecnica simile. @it
toolkit label: scultore agente collettivo @it
toolkit definition: Agente collettivo artista responsabile della creazione di un'opera tridimensionale tramite modellatura, intaglio o tecnica simile. @it
label: a pour agent collectif sculpteur @fr
definition: Met une œuvre en relation avec un agent collectif artiste qui est responsable de la création d’une œuvre tridimensionnelle par le modelage, la taille ou une technique similaire. @fr
toolkit label: agent collectif sculpteur @fr
toolkit definition: Agent collectif artiste qui est responsable de la création d’une œuvre tridimensionnelle par le modelage, la taille ou une technique similaire. @fr
label: tēlnieks (grupa) @lv
definition: Sasaista darbu ar grupu - mākslinieks, kura ir atbildīga par trīsdimensiju darba radīšanu, to veidojot, grebjot vai izmantojot līdzīgu tehniku. @lv
toolkit label: tēlnieks (grupa) @lv
toolkit definition: Grupa - mākslinieks, kura ir atbildīga par trīsdimensiju darba radīšanu, to veidojot, grebjot vai izmantojot līdzīgu tehniku. @lv
label: 有雕塑家集体行为者 @zh-hans
definition: 将一种作品与作为一个艺术家并通过模型、雕刻或类似技术负责创建一种三维作品的一个集体行为者关联起来。 @zh-hans
toolkit label: 雕塑家集体行为者 @zh-hans
toolkit definition: 作为一个艺术家并通过模型、雕刻或类似技术负责创建一种三维作品的一个集体行为者 @zh-hans
has subproperty: has sculptor corporate body
has subproperty: has sculptor family
has subproperty: P10474
label: heykeltıraş kolektif temsilcisi ile ilişkilidir @tr
definition: Bir eseri, modelleme, oyma veya benzeri bir teknikle üç boyutlu bir eser oluşturmaktan sorumlu bir sanatçı olan kolektif bir temsilci ile ilişkilendirir. @tr
toolkit label: heykeltıraş kolektif temsilci @tr
toolkit definition: Modelleme, oyma veya benzeri bir teknikle üç boyutlu bir eser yaratmaktan sorumlu bir sanatçı olan kolektif bir temsilci. @tr

has sculptor corporate body
status: Published
lexical alias: sculptorCorporateBody.en
definition: Relates a work to a corporate body who is an artist who is responsible for creating a three-dimensional work by modeling, carving, or similar technique.
toolkit label: sculptor corporate body
toolkit definition: A corporate body who is an artist who is responsible for creating a three-dimensional work by modeling, carving, or similar technique.
type: Property
domain: C10001
has element type: 2
sub property of: has artist corporate body
sub property of: has sculptor collective agent
label: kuvanveistäjä (yhteisö) @fi
definition: Liittää teoksen yhteisöön, joka on taiteilija, joka on vastuussa kolmiulotteisen teoksen luomisesta muovaamalla, veistämällä tai vastaavalla tekniikalla. @fi
toolkit label: kuvanveistäjä (yhteisö) @fi
toolkit definition: Yhteisö, joka on taiteilija, joka on vastuussa kolmiulotteisen teoksen luomisesta muovaamalla, veistämällä tai vastaavalla tekniikalla. @fi
label: har skulptør (korporasjon) @no
definition: Relaterer et verk til en korporasjon som er en kunstner med ansvar for å skape et tredimensjonalt verk gjennom modellering, utskjæring eller lignende teknikker. @no
toolkit label: skulptør (korporasjon) @no
toolkit definition: En korporasjon som er en kunstner med ansvar for å skape et tredimensjonalt verk gjennom modellering, utskjæring eller lignende teknikker. @no
label: heeft beeldhouwer-corporatie @nl
definition: Relateert een werk aan een corporatie die een kunstenaar is die verantwoordelijk is voor het creëren van driedimensionaal modelleren, snijden of gelijksoortige techniek. @nl
toolkit label: beeldhouwer-corporatie @nl
toolkit definition: Een corporatie die een kunstenaar is die verantwoordelijk is voor het creëren van driedimensionaal modelleren, snijden of gelijksoortige techniek. @nl
label: له هيئة نحاتة @ar
definition: يربط بين عمل وهيئة تكون فنانة مسئولة عن إنشاء عمل ثلاثي الأبعاد من خلال النمذجة، أو النحت، أو تقنية مشابهة. @ar
toolkit label: هيئة نحاتة @ar
toolkit definition: هيئة تكون فنانة مسئولة عن إنشاء عمل ثلاثي الأبعاد من خلال النمذجة، أو النحت، أو تقنية مشابهة. @ar
label: té com a entitat corporativa escultora @ca
definition: Relaciona una obra amb una entitat corporativa que és un artista que és responsable de la creació d’una obra tridimensional mitjançant l’escultura, la talla o una tècnica similar. @ca
toolkit label: entitat corporativa escultora @ca
toolkit definition: Entitat corporativa que és un artista que és responsable de la creació d’una obra tridimensional mitjançant l’escultura, la talla o una tècnica similar. @ca
label: har korporation, som er skulptør @da
definition: Relaterer et værk til en korporation, som er en kunstner, som er ansvarlig for at skabe et tredimensionelt værk vha. modellering, udskæring eller lignende teknik. @da
toolkit label: korporation, som er skulptør @da
toolkit definition: Korporation, som er en kunstner, som er ansvarlig for at skabe et tredimensionelt værk vha. modellering, udskæring eller lignende teknik. @da
label: skulptor (asutus) @et
definition: Seostab teose asutusega, kes on modelleerimise, nikerdamise või muu säärase tehnika teel loodud kolmemõõtmelise teose eest vastutav kunstnik. @et
toolkit label: skulptor (asutus) @et
toolkit definition: Asutus, kes on modelleerimise, nikerdamise või muu säärase tehnika teel loodud kolmemõõtmelise teose eest vastutav kunstnik. @et
label: hat Bildhauerin/Bildhauer (Körperschaft) @de
definition: Setzt ein Werk in Beziehung zu einer Künstlerin/einem Künstler (Körperschaft), die/der für die Schaffung eines dreidimensionalen Werks durch Modellieren, Schnitzen oder ähnliche Techniken verantwortlich ist. @de
toolkit label: Bildhauerin/Bildhauer (Körperschaft) @de
toolkit definition: Eine Künstlerin/Ein Künstler (Körperschaft), die/der für die Schaffung eines dreidimensionalen Werks durch Modellieren, Schnitzen oder ähnliche Techniken verantwortlich ist. @de
label: szobrász testülete a következő: @hu
definition: Hozzákapcsol egy művet egy művész testülethez, amely felelős egy háromdimenziós mű megalkotásáért modellezési, faragási vagy hasonló technikával. @hu
toolkit label: szobrász testület: @hu
toolkit definition: Egy művész testület, amely felelős egy háromdimenziós mű megalkotásáért modellezési, faragási vagy hasonló technikával. @hu
label: ha come scultore ente @it
definition: Correla un'opera a un ente artista responsabile della creazione di un'opera tridimensionale tramite modellatura, intaglio o tecnica simile. @it
toolkit label: scultore ente @it
toolkit definition: Ente artista responsabile della creazione di un'opera tridimensionale tramite modellatura, intaglio o tecnica simile. @it
label: a pour collectivité sculptrice @fr
definition: Met une œuvre en relation avec une collectivité artiste qui est responsable de la création d’une œuvre tridimensionnelle par le modelage, la taille ou une technique similaire. @fr
toolkit label: collectivité sculptrice @fr
toolkit definition: Collectivité artiste qui est responsable de la création d’une œuvre tridimensionnelle par le modelage, la taille ou une technique similaire. @fr
label: tēlnieks (institūcija) @lv
definition: Sasaista darbu ar institūciju - mākslinieks, kura ir atbildīga par trīsdimensiju darba radīšanu, to veidojot, grebjot vai izmantojot līdzīgu tehniku. @lv
toolkit label: tēlnieks (institūcija) @lv
toolkit definition: Institūcija - mākslinieks, kura ir atbildīga par trīsdimensiju darba radīšanu, to veidojot, grebjot vai izmantojot līdzīgu tehniku. @lv
label: 有雕塑家团体 @zh-hans
definition: 将一种作品与作为一个艺术家并通过模型、雕刻或类似技术负责创建一种三维作品的一个团体关联起来。 @zh-hans
toolkit label: 雕塑家团体 @zh-hans
toolkit definition: 作为一个艺术家并通过模型、雕刻或类似技术负责创建一种三维作品的一个团体 @zh-hans
has subproperty: P10521
label: heykeltıraş tüzel kişisi ile ilişkilidir @tr
definition: Bir eseri, modelleme, oyma veya benzeri bir teknikle üç boyutlu bir eser oluşturmaktan sorumlu tüzel kişi olan sanatçı ile ilişkilendirir. @tr
toolkit label: heykeltıraş tüzel kişi @tr
toolkit definition: Modelleme, oyma veya benzeri bir teknikle üç boyutlu bir eser yaratmaktan sorumlu sanatçı olan tüzel kişi. @tr

has sculptor family
status: Published
lexical alias: sculptorFamily.en
definition: Relates a work to a family who is an artist who is responsible for creating a three-dimensional work by modeling, carving, or similar technique.
toolkit label: sculptor family
toolkit definition: A family who is an artist who is responsible for creating a three-dimensional work by modeling, carving, or similar technique.
type: Property
domain: C10001
has element type: 2
sub property of: has artist family
sub property of: has sculptor collective agent
label: kuvanveistäjä (suku) @fi
definition: Liittää teoksen sukuun, joka on taiteilija, joka on vastuussa kolmiulotteisen teoksen luomisesta muovaamalla, veistämällä tai vastaavalla tekniikalla. @fi
toolkit label: kuvanveistäjä (suku) @fi
toolkit definition: Suku, joka on taiteilija, joka on vastuussa kolmiulotteisen teoksen luomisesta muovaamalla, veistämällä tai vastaavalla tekniikalla. @fi
label: har skulptør (familie) @no
definition: Relaterer et verk til en familie som er en kunstner med ansvar for å skape et tredimensjonalt verk gjennom modellering, utskjæring eller lignende teknikker. @no
toolkit label: skulptør (familie) @no
toolkit definition: En familie som er en kunstner med ansvar for å skape et tredimensjonalt verk gjennom modellering, utskjæring eller lignende teknikker. @no
label: heeft beeldhouwer-familie @nl
definition: Relateert een werk aan een familie die een kunstenaar is die verantwoordelijk is voor het creëren van driedimensionaal modelleren, snijden of gelijksoortige techniek. @nl
toolkit label: beeldhouwer-familie @nl
toolkit definition: Een familie die een kunstenaar is die verantwoordelijk is voor het creëren van driedimensionaal modelleren, snijden of gelijksoortige techniek. @nl
label: له عائلة نحاتة @ar
definition: يربط بين عمل وعائلة تكون فنانة مسئولة عن إنشاء عمل ثلاثي الأبعاد عن طريق النمذجة، أو النحت، أو تقنية مشابهة. @ar
toolkit label: عائلة نحاتة @ar
toolkit definition: عائلة تكون فنانة مسئولة عن إنشاء عمل ثلاثي الأبعاد عن طريق النمذجة، أو النحت، أو تقنية مشابهة. @ar
label: té com a família escultora @ca
definition: Relaciona una obra amb una família que és un artista que és responsable de la creació d’una obra tridimensional a partir del modelatge, la talla o una tècnica similar. @ca
toolkit label: família escultora @ca
toolkit definition: Família que és un artista que és responsable de la creació d’una obra tridimensional a partir del modelatge, la talla o una tècnica similar. @ca
label: har familie, som er skulptør @da
definition: Relaterer et værk til en familie, som er en kunstner, som er ansvarlig for at skabe et tredimensionelt værk vha. modellering, udskæring eller lignende teknik. @da
toolkit label: familie, som er skulptør @da
toolkit definition: Familie, som er en kunstner, som er ansvarlig for at skabe et tredimensionelt værk vha. modellering, udskæring eller lignende teknik. @da
label: skulptor (perekond) @et
definition: Seostab teose perekonnaga, kes on modelleerimise, nikerdamise või muu säärase tehnika teel loodud kolmemõõtmelise teose eest vastutav kunstnik. @et
toolkit label: skulptor (perekond) @et
toolkit definition: Perekond, kes on modelleerimise, nikerdamise või muu säärase tehnika teel loodud kolmemõõtmelise teose eest vastutav kunstnik. @et
label: hat Bildhauerin/Bildhauer (Familie) @de
definition: Setzt ein Werk in Beziehung zu einer Künstlerin/einem Künstler (Familie), die/der für die Schaffung eines dreidimensionalen Werks durch Modellieren, Schnitzen oder ähnliche Techniken verantwortlich ist. @de
toolkit label: Bildhauerin/Bildhauer (Familie) @de
toolkit definition: Eine Künstlerin/Ein Künstler (Familie), die/der für die Schaffung eines dreidimensionalen Werks durch Modellieren, Schnitzen oder ähnliche Techniken verantwortlich ist. @de
label: szobrász családja a következő: @hu
definition: Hozzákapcsol egy művet egy művész családhoz, amely felelős egy háromdimenziós mű megalkotásáért modellezési, faragási vagy hasonló technikával. @hu
toolkit label: szobrász család: @hu
toolkit definition: Egy művész család, amely felelős egy háromdimenziós mű megalkotásáért modellezési, faragási vagy hasonló technikával. @hu
label: ha come scultore famiglia @it
definition: Correla un'opera alla famiglia artista responsabile della creazione di un'opera tridimensionale tramite modellatura, intaglio o tecnica simile. @it
toolkit label: scultore famiglia @it
toolkit definition: Famiglia artista responsabile della creazione di un'opera tridimensionale tramite modellatura, intaglio o tecnica simile. @it
label: a pour famille sculptrice @fr
definition: Met une œuvre en relation avec une famille artiste qui est responsable de la création d’une œuvre tridimensionnelle par le modelage, la taille ou une technique similaire. @fr
toolkit label: famille sculptrice @fr
toolkit definition: Famille artiste qui est responsable de la création d’une œuvre tridimensionnelle par le modelage, la taille ou une technique similaire. @fr
label: tēlnieks (dzimta/ģimene) @lv
definition: Sasaista darbu ar dzimtu/ģimeni - mākslinieks, kura ir atbildīga par trīsdimensiju darba radīšanu, to veidojot, grebjot vai izmantojot līdzīgu tehniku. @lv
toolkit label: tēlnieks (dzimta/ģimene) @lv
toolkit definition: Dzimta/ģimene - mākslinieks, kura ir atbildīga par trīsdimensiju darba radīšanu, to veidojot, grebjot vai izmantojot līdzīgu tehniku. @lv
label: 有雕塑家家族 @zh-hans
definition: 将一种作品与作为艺术家并通过模型、雕刻或类似技术负责创建一种三维作品的一个家族关联起来。 @zh-hans
toolkit label: 雕塑家家族 @zh-hans
toolkit definition: 作为艺术家并通过模型、雕刻或类似技术负责创建一种三维作品的一个家族 @zh-hans
has subproperty: P10568
label: heykeltıraş ailesi ile ilişkilidir @tr
definition: Bir eseri, modelleme, oyma veya benzeri bir teknikle üç boyutlu bir eser oluşturmaktan sorumlu tüzel kişi olan sanatçı olan bir aileyle ilişkilendirir. @tr
toolkit label: heykeltıraş aile @tr
toolkit definition: Modelleme, oyma veya benzeri bir teknikle üç boyutlu bir eser yaratmaktan sorumlu sanatçı olan bir aile. @tr

has sculptor person
status: Published
lexical alias: sculptorPerson.en
definition: Relates a work to a person who is an artist who is responsible for creating a three-dimensional work by modeling, carving, or similar technique.
toolkit label: sculptor person
toolkit definition: A person who is an artist who is responsible for creating a three-dimensional work by modeling, carving, or similar technique.
type: Property
domain: C10001
has element type: 2
sub property of: has artist person
sub property of: has sculptor agent
label: kuvanveistäjä (henkilö) @fi
definition: Liittää teoksen henkilöön, joka on taiteilija, joka on vastuussa kolmiulotteisen teoksen luomisesta muovaamalla, veistämällä tai vastaavalla tekniikalla. @fi
toolkit label: kuvanveistäjä (henkilö) @fi
toolkit definition: Henkilö, joka on taiteilija, joka on vastuussa kolmiulotteisen teoksen luomisesta muovaamalla, veistämällä tai vastaavalla tekniikalla. @fi
label: har skulptør (person) @no
definition: Relaterer et verk til en person som er en kunstner med ansvar for å skape et tredimensjonalt verk gjennom modellering, utskjæring eller lignende teknikker. @no
toolkit label: skulptør (person) @no
toolkit definition: En person som er en kunstner med ansvar for å skape et tredimensjonalt verk gjennom modellering, utskjæring eller lignende teknikker. @no
label: heeft beeldhouwer-persoon @nl
definition: Relateert een werk aan een persoon die een kunstenaar is die verantwoordelijk is voor het creëren van driedimensionaal modelleren, snijden of gelijksoortige techniek. @nl
toolkit label: beeldhouwer-persoon @nl
toolkit definition: Een persoon die een kunstenaar is die verantwoordelijk is voor het creëren van driedimensionaal modelleren, snijden of gelijksoortige techniek. @nl
label: له شخص نحات @ar
definition: يربط بين عمل وشخص يكون فنانا مسئولاً عن إنشاء عمل ثلاثي الأبعاد عن طريق النمذجة، أو النحت، أو تقنية مشابهة. @ar
toolkit label: شخص نحات @ar
toolkit definition: شخص يكون فنانا مسئولاً عن إنشاء عمل ثلاثي الأبعاد عن طريق النمذجة، أو النحت، أو تقنية مشابهة. @ar
label: té com a persona escultora @ca
definition: Relaciona una obra amb una persona que és un artista que és responsable de la creació d’una obra tridimensional a partir del modelatge, la talla o una tècnica similar. @ca
toolkit label: persona escultora @ca
toolkit definition: Persona que és un artista que és responsable de la creació d’una obra tridimensional a partir del modelatge, la talla o una tècnica similar. @ca
label: har person, som er skulptør @da
definition: Relaterer et værk til en person, som er en kunstner, som er ansvarlig for at skabe et tredimensionelt værk vha. modellering, udskæring eller lignende teknik. @da
toolkit label: person, som er skulptør @da
toolkit definition: Person, som er en kunstner, som er ansvarlig for at skabe et tredimensionelt værk vha. modellering, udskæring eller lignende teknik. @da
label: skulptor (isik) @et
definition: Seostab teose isikuga, kes on modelleerimise, nikerdamise või muu säärase tehnika teel loodud kolmemõõtmelise teose eest vastutav kunstnik. @et
toolkit label: skulptor (isik) @et
toolkit definition: Isik, kes on modelleerimise, nikerdamise või muu säärase tehnika teel loodud kolmemõõtmelise teose eest vastutav kunstnik. @et
label: hat Bildhauerin/Bildhauer (Person) @de
definition: Setzt ein Werk in Beziehung zu einer Künstlerin/einem Künstler (Person), die/der für die Schaffung eines dreidimensionalen Werks durch Modellieren, Schnitzen oder ähnliche Techniken verantwortlich ist. @de
toolkit label: Bildhauerin/Bildhauer (Person) @de
toolkit definition: Eine Künstlerin/Ein Künstler (Person), die/der für die Schaffung eines dreidimensionalen Werks durch Modellieren, Schnitzen oder ähnliche Techniken verantwortlich ist. @de
label: szobrász személye a következő: @hu
definition: Hozzákapcsol egy művet egy művész személyhez, aki felelős egy háromdimenziós mű megalkotásáért modellezési, faragási vagy hasonló technikával. @hu
toolkit label: szobrász személy: @hu
toolkit definition: Egy művész személy, aki felelős egy háromdimenziós mű megalkotásáért modellezési, faragási vagy hasonló technikával. @hu
label: ha come scultore persona @it
definition: Correla un'opera alla persona artista responsabile della creazione di un'opera tridimensionale tramite modellatura, intaglio o tecnica simile. @it
toolkit label: scultore persona @it
toolkit definition: Persona artista responsabile della creazione di un'opera tridimensionale tramite modellatura, intaglio o tecnica simile. @it
label: a pour personne sculptrice @fr
definition: Met une œuvre en relation avec une personne artiste qui est responsable de la création d’une œuvre tridimensionnelle par le modelage, la taille ou une technique similaire. @fr
toolkit label: personne sculptrice @fr
toolkit definition: Personne artiste qui est responsable de la création d’une œuvre tridimensionnelle par le modelage, la taille ou une technique similaire. @fr
label: tēlnieks (persona) @lv
definition: Sasaista darbu ar personu - mākslinieks, kurš ir atbildīgs par trīsdimensiju darba radīšanu, to veidojot, grebjot vai izmantojot līdzīgu tehniku. @lv
toolkit label: tēlnieks (persona) @lv
toolkit definition: Persona - mākslinieks, kurš ir atbildīgs par trīsdimensiju darba radīšanu, to veidojot, grebjot vai izmantojot līdzīgu tehniku. @lv
label: 有雕塑家个人 @zh-hans
definition: 将一种作品与作为一个艺术家并通过模型、雕刻或类似技术负责创建一种三维作品的一个个人关联起来。 @zh-hans
toolkit label: 雕塑家个人 @zh-hans
toolkit definition: 作为一个艺术家并通过模型、雕刻或类似技术负责创建一种三维作品的一个个人 @zh-hans
has subproperty: P10427
label: heykeltıraş kişisi ile ilişkilidir @tr
definition: Bir eseri, modelleme, oyma veya benzeri bir teknikle üç boyutlu bir eser oluşturmaktan sorumlu sanatçı olan kişiyle ilişkilendirir. @tr
toolkit label: heykeltıraş kişi @tr
toolkit definition: Modelleme, oyma veya benzeri bir teknikle üç boyutlu bir eser meydana getirmekle sorumlu bir sanatçı olan kişi. @tr

is separated into work
status: Published
definition: Relates a work to a work that is a diachronic work that continues the partial content of another diachronic work that is continuing.
type: Property
domain: C10001
sub property of: is succeeded by work
lexical alias: separatedIntoWork.en
toolkit label: separated into work
toolkit definition: A work that is a diachronic work that continues the partial content of another diachronic work that is continuing.
toolkit label: continué en partie par une œuvre @fr
toolkit definition: Œuvre diachronique qui continue le contenu partiel d’une autre œuvre diachronique qui se poursuit. @fr
toolkit label: continuada en parte por (obra) @es
toolkit definition: Una obra de la cual parte de su contenido se separa de una obra anterior para formar una nueva obra. @es
scope note: This element applies in general to a successive work.
instruction number: 24.5
label: er delvis fortsat i (værk) @da
definition: Relaterer et værk til et værk, hvoraf en del af indholdet er udskilt fra et tidligere værk, så et nyt værk er dannet. @da
scope note: Anvend generelt for periodika. @da
toolkit label: delvis fortsat i (værk) @da
toolkit definition: Værk, hvoraf en del af indholdet er udskilt fra et tidligere værk, så et nyt værk er dannet. @da
definition: Met une œuvre en relation avec une œuvre diachronique qui continue le contenu partiel d’une autre œuvre diachronique qui se poursuit. @fr
label: được tiếp tục một phần bởi (tác phẩm) @vi
definition: Liên kết tác phẩm với tác phẩm mà phần của nội dung của nó được phân tách từ tác phẩm trước đây để tạo thành tác phẩm mới. @vi
scope note: Mối quan hệ này áp dụng tổng quát cho ấn phẩm nhiều kỳ. @vi
toolkit label: được tiếp tục một phần bởi (tác phẩm) @vi
toolkit definition: Tác phẩm mà phần của nội dung của nó được phân tách từ tác phẩm trước đây để tạo thành tác phẩm mới. @vi
label: ist teilweise fortgesetzt von (Werk) @de
definition: Setzt ein Werk in Beziehung zu einem diachronen Werk, das teilweise den Inhalt eines anderen fortlaufenden diachronen Werks fortführt. @de
scope note: Im Allgemeinen trifft dieses Element auf ein sukzessives Werk zu. @de
toolkit label: Teilweise fortgesetzt von (Werk) @de
toolkit definition: Ein diachrones Werk, das teilweise den Inhalt eines anderen fortlaufenden diachronen Werks fortführt. @de
label: est continué en partie par une œuvre @fr
definition: Liittää teoksen teokseen, joka on diakroninen teos, joka jatkaa toisen diakronisen jatkuvan teoksen sisältöä osittain. @fi
toolkit label: eronnut teokseksi @fi
toolkit definition: Teos, joka on diakroninen teos, joka jatkaa toisen diakronisen jatkuvan teoksen sisältöä osittain. @fi
toolkit label: fortsettes delvis i verk @no
toolkit definition: Et verk som er et diakronisk verk som er en delvis fortsettelse av innholdet av et annet løpende diakronisk verk. @no
label: és separat en una obra @ca
definition: Relaciona una obra amb una obra que és una obra diacrònica que continua el contingut parcial d’una altra obra diacrònica que és contínua. @ca
scope note: En general, aquest element s’aplica a una obra successiva. @ca
toolkit label: separat en una obra @ca
toolkit definition: Obra que és una obra diacrònica que continua el contingut parcial d’una altra obra diacrònica que és contínua. @ca
scope note: Cet élément s’applique généralement à une œuvre successive. @fr
has element type: 2
label: συνεχίζεται μερικώς από (έργο) @el
definition: Συνδέει ένα έργο με ένα έργο, μέρος του περιεχομένου του οποίου διαχωρίστηκε από ένα προηγούμενο έργο για να σχηματίσει ένα νέο έργο. @el
scope note: Αυτή η σχέση βρίσκει γενική εφαρμογή στα περιοδικά. @el
toolkit label: συνεχίζεται μερικώς από (έργο) @el
toolkit definition: Ένα έργο, μέρος του περιεχομένου του οποίου διαχωρίστηκε από ένα προηγούμενο έργο για να σχηματίσει ένα νέο έργο. @el
label: kivált a következő műbe: @hu
definition: Hozzákapcsol egy művet egy diakronikus műhöz, amely egy másik folytatódó diakronikus mű részleges tartalmát folytatja. @hu
scope note: részekben folytatódik a következőben (mű): @hu
toolkit label: részben kivált mű @hu
toolkit definition: Egy diakronikus mű, amely egy másik folytatódó diakronikus mű részleges tartalmát folytatja. @hu
alternative label: continued in part by (work)
scope note: Tämä elementti soveltuu yleensä peräkkäisesti ilmestyvään teokseen. @fi
alternative label: jatkuu osittain teoksessa @fi
label: eronnut teokseksi @fi
label: fortsettes delvis i verk @no
definition: Relaterer et verk til et verk som er et diakronisk verk som er en delvis fortsettelse av innholdet av et annet løpende diakronisk verk. @no
scope note: Dette elementet gjelder som oftest for et påfølgende verk. @no
label: is afgesplitst in werk @nl
definition: Relateert een werk aan een werk dat een diachronisch werk is dat de gedeeltelijke content voortzet van een ander diachronisch werk dat voortgezet wordt. @nl
scope note: Dit element is over het algemeen van toepassing op een successief werk. @nl
toolkit label: afgesplitst in werk @nl
toolkit definition: Een werk dat een diachronisch werk is dat de gedeeltelijke content voortzet van een ander diachronisch werk dat voortgezet wordt. @nl
label: هو منفصل إلى عمل @ar
definition: يربط عمل بعمل ممتد زمنيًا يُكْمل المحتوى الجزئي لعمل آخر ممتد زمنيًا ومستمر. @ar
scope note: ينطبق هذا العنصر بشكل عام على عمل متتالٍ. @ar
alternative label: مستمر في جزء من (عمل) @ar
toolkit label: منفصل إلى عمل @ar
toolkit definition: عمل ممتد زمنيًا يُكْمل المحتوى الجزئي لعمل آخر ممتد زمنيًا ومستمر. @ar
alternative label: continuat en part per (obra) @ca
label: eraldunud teos @et
definition: Seostab teose diakroonilise teosega, mis jätkab osaliselt teise, jätkuva diakroonilise teose sisu. @et
scope note: Elementi rakendatakse peamiselt järgteose puhul. @et
toolkit label: eraldunud teos @et
toolkit definition: Diakrooniline teos, mis jätkab osaliselt teise, jätkuva diakroonilise teose sisu. @et
label: è distinta in opera @it
definition: Correla un’opera a un’opera che è un’opera diacronica che continua in parte il contenuto di un’altra opera diacronica che continua. @it

has sequel work
status: Published
definition: Relates a work to a work that extends the narrative of another work forwards in time.
type: Property
domain: C10001
sub property of: has related work of work
lexical alias: sequelWork.en
toolkit label: sequel work
toolkit definition: A work that extends the narrative of another work forwards in time.
toolkit label: suite (œuvre) @fr
toolkit definition: Œuvre qui prolonge le récit d’une autre œuvre sur une période plus récente dans le temps. @fr
toolkit label: secuela @es
toolkit definition: Una obra posterior que continúa la narración de una obra anterior. @es
instruction number: 24.5
label: har værk, som er efterfølger @da
definition: Relaterer et værk til et værk, som forlænger et andet værks fortælling i tid. @da
toolkit label: værk, som er efterfølger @da
toolkit definition: Værk, som forlænger et andet værks fortælling i tid. @da
definition: Met une œuvre en relation avec une œuvre qui prolonge le récit d’une autre œuvre sur une période plus récente dans le temps. @fr
label: là tiếp theo @vi
definition: Liên kết tác phẩm với tác phẩm sau này tiếp tục chuyện kể của tác phẩm trước đây. @vi
toolkit label: tiếp theo @vi
toolkit definition: Tác phẩm sau này tiếp tục chuyện kể của tác phẩm trước đây. @vi
label: hat Sequel (Werk) @de
definition: Setzt ein Werk in Beziehung zu einem Werk, das den Erzählstrang eines anderen Werks zeitlich vorwärts erweitert. @de
toolkit label: Sequel (Werk) @de
toolkit definition: Ein Werk, das den Erzählstrang eines anderen Werks zeitlich vorwärts erweitert. @de
label: a pour suite (œuvre) @fr
definition: Liittää teoksen teokseen, joka laajentaa toisen teoksen kerrontaa ajassa eteenpäin. @fi
toolkit label: jatko-osa (teos) @fi
toolkit definition: Teos, joka laajentaa toisen teoksen kerrontaa ajassa eteenpäin. @fi
toolkit label: etterfølger (verk) @no
toolkit definition: Et verk hvor hendelsesforløpet fra et annet verk fortsetter i tid. @no
label: té com a obra de seqüela @ca
definition: Relaciona una obra amb una obra que allarga el contingut narratiu d’una altra obra cap endavant en el temps. @ca
toolkit label: obra de seqüela @ca
toolkit definition: Obra que allarga el contingut narratiu d’una altra obra cap endavant en el temps. @ca
has element type: 2
label: είναι συνέχεια @el
definition: Συνδέει ένα έργο με ένα μεταγενέστερο έργο που συνεχίζει την αφήγηση ενός προηγούμενου έργου. @el
toolkit label: είναι συνέχεια @el
toolkit definition: Ένα μεταγενέστερο έργο που συνεχίζει την αφήγηση ενός προηγούμενου έργου. @el
label: folytatása a következő: @hu
definition: Hozzákapcsol egy művet egy műhoz, amely kiterjeszti egy másik mű narratíváját időben előre. @hu
toolkit label: folytatásmű @hu
toolkit definition: Egy mű, amely kiterjeszti egy másik mű narratíváját időben előre. @hu
alternative label: sequel
label: jatko-osa (teos) @fi
label: har etterfølger (verk) @no
definition: Relaterer et verk til et verk hvor hendelsesforløpet fra et annet verk fortsetter i tid. @no
alternative label: forløper til @no
label: heeft sequel-werk @nl
definition: Relateert een werk aan een werk dat de narratie van een ander werk uitbreidt, voorwaarts in de tijd. @nl
toolkit label: sequel-werk @nl
toolkit definition: Een werk dat de narratie van een ander werk uitbreidt, voorwaarts in de tijd. @nl
label: له عمل تتمة @ar
definition: يربط عمل بعمل يمتد من خلاله سرد عمل آخر للأمام عبر الزمن. @ar
alternative label: بادئة @ar
toolkit label: عمل تتمة @ar
toolkit definition: عمل يمتد من خلاله سرد عمل آخر للأمام عبر الزمن. @ar
alternative label: forløber til @da
label: järg (teos) @et
definition: Seostab teose teosega, mis laiendab teise teose sündmuste esitust ajas edasi. @et
toolkit label: järg (teos) @et
toolkit definition: Teos, mis laiendab teise teose sündmuste esitust ajas edasi. @et
alternative label: előzménye: @hu
label: ha come opera successiva @it
definition: Correla un’opera a un’opera la cui narrazione è proseguita da un'altra opera consecutiva. @it
alternative label: prequel di @it
toolkit label: opera successiva @it
toolkit definition: Opera la cui narrazione è proseguita da un'altra opera consecutiva. @it
alternative label: prequel to
label: darbs: pēcstāsts @lv
definition: Sasaista darbu ar darbu (sīkvels), kura sižets risinās pēc sākotnējā darba notikumu laika. @lv
toolkit label: darbs: pēcstāsts @lv
toolkit definition: Darbs (sīkvels), kura sižets risinās pēc sākotnējā darba notikumu laika. @lv
alternative label: Prequel @de
label: 有续篇作品 @zh-hans
definition: 将一种作品与把另一种作品的叙述在时间上往前延伸的一种作品关联起来。 @zh-hans
toolkit label: 续篇作品 @zh-hans

has sequential version
status: Published
lexical alias: sequentialVersion.en
definition: Relates a work to a work that is created by changing the extension plan of a work from integrating to successive.
toolkit label: sequential version
toolkit definition: A work that is created by changing the extension plan of a work from integrating to successive.
type: Property
domain: C10001
sub property of: has transformation by extension plan
has element type: 2
label: peräkkäisversio @fi
definition: Liittää teoksen teokseen, joka on luotu muuttamalla teoksen laajennussuunnitelmaa päivittyvästä peräkkäiseksi. @fi
toolkit label: peräkkäisversio @fi
toolkit definition: Teos, joka on luotu muuttamalla teoksen laajennussuunnitelmaa päivittyvästä peräkkäiseksi. @fi
label: har etterfølgende versjon @no
definition: Relaterer et verk til et verk som er skapt ved endring av utvidelsesplanen for et verk fra integrerende til fortløpende. @no
toolkit label: etterfølgende versjon @no
toolkit definition: Et verk som er skapt ved endring av utvidelsesplanen for et verk fra integrerende til fortløpende. @no
label: heeft sequentiële versie @nl
definition: Relateert een werk aan een werk dat gevormd is door het extensieplan te veranderen van geïntegreerd naar successief. @nl
toolkit label: sequentiële versie @nl
toolkit definition: Een werk dat gevormd is door het extensieplan te veranderen van geïntegreerd naar successief. @nl
label: له إصدارة متتالية @ar
definition: يربط عمل بعمل يتم إنشاؤه عن طريق تغيير خطة توسع لعمل من متكامل إلى متتالٍ. @ar
toolkit label: إصدارة متتالية @ar
toolkit definition: عمل تم إنشاؤه عن طريق تغيير خطة توسع لعمل من متكامل إلى متتالٍ. @ar
label: té com a versió seqüencial @ca
definition: Relaciona una obra amb una obra que es crea canviant el pla d’extensió d’una obra d’integrant a successiu. @ca
toolkit label: versió seqüencial @ca
toolkit definition: Obra que es crea canviant el pla d’extensió d’una obra d’integrant a successiu. @ca
label: har efterfølgende version @da
definition: Relaterer et værk til et værk, som er skabt ved at ændre udvidelsesplanen for et værk fra integrerende til fortløbende. @da
toolkit label: efterfølgende version @da
toolkit definition: Værk, som er skabt ved at ændre udvidelsesplanen for et værk fra integrerende til fortløbende. @da
label: järjestikune versioon @et
definition: Seostab teose teosega, mis on loodud, muutes teose jätkamiskava täienevast järjestikuseks. @et
toolkit label: järjestikune versioon @et
toolkit definition: Teos, mis on loodud, muutes teose jätkamiskava täienevast järjestikuseks. @et
label: hat fortlaufende Version @de
definition: Setzt ein Werk in Beziehung zu einem Werk, das durch Änderung des Erweiterungsplans eines Werks von integrierend auf sukzessiv erstellt wird. @de
toolkit label: Fortlaufende Version @de
toolkit definition: Ein Werk, das durch Änderung des Erweiterungsplans eines Werks von integrierend auf sukzessiv erstellt wird. @de
label: szekvenciális változata a következő: @hu
definition: Hozzákapcsol egy művet egy műhöz, amely egy mű közlési tervének integrálóról folyamatossá való változásával jött létre. @hu
toolkit label: szekvenciális változata: @hu
toolkit definition: Egy mű, amely egy mű közlési tervének integrálóról folyamatossá való változásával jött létre. @hu
label: ha come versione sequenziale @it
definition: Correla un'opera a un'opera creata cambiando il piano di estensione di un'opera da integrativo a consecutivo. @it
toolkit label: versione sequenziale @it
toolkit definition: Opera creata cambiando il piano di estensione di un'opera da integrativo a consecutivo. @it
label: a pour version séquentielle @fr
definition: Met une œuvre en relation avec une œuvre qui est créée en modifiant le plan d’extension intégrateur d’une œuvre en plan successif. @fr
toolkit label: version séquentielle @fr
toolkit definition: Œuvre qui est créée en modifiant le plan d’extension intégrateur d’une œuvre en plan successif. @fr
label: secīgā versija @lv
definition: Sasaista darbu ar darbu, kas radīts, mainot darba paplašināšanas plānu no veselā uz secīgo. @lv
toolkit label: secīgā versija @lv
toolkit definition: Darbs, kas radīts, mainot darba paplašināšanas plānu no veselā uz secīgo. @lv
label: 有序列版本 @zh-hans
definition: 将一种作品与通过将一种作品的扩充计划从集成性改变为相继性而被创建的一种作品关联起来。 @zh-hans
toolkit label: 序列版本 @zh-hans
toolkit definition: 通过将一种作品的扩充计划从集成性改变为相继性而被创建的一种作品 @zh-hans
has subproperty: P10379
label: sonraki sürüm ile ilişkilidir @tr
definition: Bir eseri, bir eserin genişletme planını birleştiriciden ardışık hale değiştirilerek oluşturulan bir eserle ilişkilendirir. @tr
toolkit label: sıralı versiyon @tr
toolkit definition: Bir eserin genişletme planının bütünleyiciden ardışıka doğru değiştirilmesiyle oluşturulan eser. @tr

is sequential version of
status: Published
lexical alias: sequentialVersionOf.en
definition: Relates a work to a work that has an extension plan that is changed from successive to integrating to create a work.
toolkit label: sequential version of
toolkit definition: A work that has an extension plan that is changed from successive to integrating to create a work.
type: Property
domain: C10001
sub property of: is transformation by extension plan of
has element type: 2
label: peräkkäisversio teoksesta @fi
definition: Liittää teoksen teokseen, jolla on laajennussuunnitelma, jota on muutettu peräkkäisestä päivittyväksi teoksen luomiseksi. @fi
toolkit label: peräkkäisversio teoksesta @fi
toolkit definition: Teos, jolla on laajennussuunnitelma, jota on muutettu peräkkäisestä päivittyväksi teoksen luomiseksi. @fi
label: er etterfølgende versjon av @no
definition: Relaterer et verk til et verk som har en utvidelsesplan som er endret fra fortløpende til integrerende for å skape et verk. @no
toolkit label: etterfølgende versjon av @no
toolkit definition: Et verk som har en utvidelsesplan som er endret fra fortløpende til integrerende for å skape et verk. @no
label: is sequentiële versie van @nl
definition: Relateert een werk aan een werk dat een extensieplan heeft dat veranderd is van successief naar geïntegreerd om een werk te vormen. @nl
toolkit label: sequentiële versie van @nl
toolkit definition: Een werk dat een extensieplan heeft dat veranderd is van successief naar geïntegreerd om een werk te vormen. @nl
label: هو إصدارة متتالية @ar
definition: يربط عمل بعمل له خطة توسع يتم تغييرها من متتالٍ إلى متكامل لإنشاء عمل. @ar
toolkit label: إصدارة متتالية لـ @ar
toolkit definition: عمل له خطة توسع يتم تغييرها من متتالٍ إلى متكامل لإنشاء عمل. @ar
label: és versió seqüencial de @ca
definition: Relaciona una obra amb una obra que té un pla d’extensió que es canvia de successiu a integrant per crear una obra. @ca
toolkit label: versió seqüencial de @ca
toolkit definition: Obra que té un pla d’extensió que es canvia de successiu a integrant per crear una obra. @ca
label: er efterfølgende version af @da
definition: Relaterer et værk til et værk, som har en udvidelsesplan, som, for at skabe et værk, ændres fra integrerende til fortløbende. @da
toolkit label: efterfølgende version af @da
toolkit definition: Værk, som har en udvidelsesplan, som, for at skabe et værk, ændres fra integrerende til fortløbende. @da
label: järjestikune versioon teosest @et
definition: Seostab teose teosega, mille jätkamiskava on teose loomiseks muudetud järjestikusest täienevaks. @et
toolkit label: järjestikune versioon teosest @et
toolkit definition: Teos, mille jätkamiskava on teose loomiseks muudetud järjestikusest täienevaks. @et
label: ist fortlaufende Version von @de
definition: Setzt ein Werk in Beziehung zu einem Werk, dessen Erweiterungsplan von sukzessiv auf integrierend geändert wird, um ein Werk zu erstellen. @de
toolkit label: Fortlaufende Version von @de
toolkit definition: Ein Werk, dessen Erweiterungsplan von sukzessiv auf integrierend geändert wird, um ein Werk zu erstellen. @de
label: szekvenciális változata a következőnek: @hu
definition: Hozzákapcsol egy művet egy műhöz, amelynek a közlési terve folyamatosról integrálóvá változott egy mű létrejövetele érdekében. @hu
toolkit label: szekvenciális változata: @hu
toolkit definition: Egy mű, amelynek a közlési terve folyamatosról integrálóvá változott egy mű létrejövetele érdekében. @hu
label: è versione sequenziale di @it
definition: Correla un'opera a un'opera che ha un piano di estensione cambiato da integrativo a consecutivo per creare un'opera. @it
toolkit label: versione sequenziale di @it
toolkit definition: Opera che ha un piano di estensione cambiato da integrativo a consecutivo per creare un'opera. @it
label: est une version séquentielle de @fr
definition: Met une œuvre en relation avec une œuvre dont le plan d’extension intégrateur est modifié en plan successif pour créer une œuvre. @fr
toolkit label: version séquentielle de @fr
toolkit definition: Œuvre dont le plan d’extension intégrateur est modifié en plan successif pour créer une œuvre. @fr
label: ir secīgā versija no @lv
definition: Sasaista darbu ar darbu, kam paplašināšanas plāns ticis mainīts no veselā uz secīgu, lai izveidotu darbu. @lv
toolkit label: secīgā versija no @lv
toolkit definition: Darbs, kam paplašināšanas plāns ticis mainīts no veselā uz secīgu, lai izveidotu darbu. @lv
label: 是……的序列版本 @zh-hans
definition: 将一种作品与有扩充计划并被改变为从相继性到集成性以创建一种作品的一种作品关联起来。 @zh-hans
toolkit label: ……的序列版本 @zh-hans
toolkit definition: 有扩充计划并被改变为从相继性到集成性以创建一种作品的一种作品 @zh-hans
has subproperty: P10380
label: sıralı sürümüdür @tr
definition: Bir eseri, bir eser oluşturmak için ardışıktan birleştirmeye değiştirilen bir genişletme planına sahip bir eser ile ilişkilendirir. @tr
toolkit label: sıralı versiyon @tr
toolkit definition: Bir eser oluşturmak için ardışıktan bütünleştiriciye değiştirilen bir uzatma planına sahip bir eser. @tr

har sekventiel værk-relation med
status: Deprecated
type: Property
domain: C10001
scope note: Sequential works include sequels, prequels, continuations, superseding works, etc.
lexical alias: sequentialWorkRelationship.en
toolkit label: relation d’œuvre séquentielle @fr
toolkit definition: Œuvre qui est précédée ou suivie par une autre œuvre. @fr
toolkit label: relaciones de obra secuencial @es
toolkit definition: Una obra que es precedido por o sucedida por la obra. @es
instruction number: 24.5
sub property of: has related work of work
definition: Relaterer et værk til et værk der er forudgået af eller efterfulgt af et værk. @da
toolkit label: sekventiel værkrelation @da
toolkit definition: Værk der er forudgået af eller efterfulgt af et værk. @da
definition: Met une œuvre en relation avec une œuvre qui est précédée ou suivie par une autre œuvre. @fr
label: có mối quan hệ tác phẩm tiếp theo với @vi
definition: Liên kết tác phẩm với tác phẩm được đi trước bởi hoặc tiếp theo bởi tác phẩm khác. @vi
scope note: Tác phẩm tiếp theo bao gồm cả tác phẩm đoạn theo, mô tả trước, tiếp tục, thay thế, v.v... @vi
toolkit label: mối quan hệ tác phẩm tiếp theoi @vi
toolkit definition: Tác phẩm được đi trước bởi hoặc tiếp theo bởi tác phẩm khác. @vi
label: hat Nachfolge-Beziehung auf Werkebene @de
definition: Setzt ein Werk mit einem Werk, dem ein anderes Werk voranging oder folgte, in Beziehung. @de
scope note: Dazu gehören Sequels, Prequels, Fortsetzungen usw. @de
toolkit label: Nachfolge-Beziehung auf Werkebene @de
toolkit definition: Ein Werk, dem ein anderes Werk voranging oder folgte. @de
label: a pour relation d’œuvre séquentielle @fr
label: teoksen jatkuvuussuhde @fi
definition: Liittää teoksen teokseen, jota edeltää tai seuraa toinen teos. @fi
toolkit label: teoksen jatkuvuussuhde @fi
toolkit definition: Teos, jota edeltää tai seuraa toinen teos. Peräkkäisiä teoksia ovat jatko-osat, esiosat, seuraajat, edeltävät teokset tms @fi
toolkit label: relasjonstypen etterfølgende verk @no
toolkit definition: Et verk som avløser eller avløses av et annet verk. @no
label: té com a relació d’obra seqüencial @ca
definition: Relaciona una obra amb una obra que és precedida o seguida per una altra obra. @ca
scope note: Les obres seqüencials inclouen seqüeles, preqüeles, continuacions, obres que es reemplacen, etc. @ca
toolkit label: relació d’obra seqüencial @ca
toolkit definition: Obra que és precedida o seguida per una altra obra. @ca
scope note: Les œuvres séquentielles comprennent les suites, les antépisodes, les continuations, les œuvres qui en remplacent d’autres, etc. @fr
label: έχει ακολουθιακή σχέση έργου με @el
definition: Συνδέει ένα έργο με ένα έργο το οποίο προηγείται ή έπεται ενός άλλου έργου. @el
scope note: Τα διαδοχικά έργα περιλαμβάνουν συνέχειες, προοίμια, αντικατάσεις έργων κ.λπ. @el
toolkit label: ακολουθιακή σχέση έργου με @el
toolkit definition: Ένα έργο το οποίο προηγείται ή έπεται ενός άλλου έργου. @el
has subproperty: P10231

has serialized version
status: Published
lexical alias: serializedVersion.en
definition: Relates a work to a work that is created by changing the extension plan of a work from static to successive.
toolkit label: serialized version
toolkit definition: A work that is created by changing the extension plan of a work from static to successive.
type: Property
domain: C10001
sub property of: has transformation by extension plan
has element type: 2
label: sarjaversio @fi
definition: Liittää teoksen teokseen, joka on luotu muuttamalla teoksen laajennussuunnitelmaa staattisesta peräkkäiseksi. @fi
toolkit label: sarjaversio @fi
toolkit definition: Teos, joka on luotu muuttamalla teoksen laajennussuunnitelmaa staattisesta peräkkäiseksi. @fi
label: har serialisert versjon @no
definition: Relaterer et verk til et verk som er skapt ved endring av utgivelsesplan for et verk fra statisk til fortløpende. @no
toolkit label: serialisert versjon @no
toolkit definition: Et verk som er skapt ved endring av utgivelsesplan for et verk fra statisk til fortløpende. @no
label: heeft seriële versie @nl
definition: Relateert een werk aan een werk dat gevormd is door het extensieplan te veranderen van statisch naar successief. @nl
toolkit label: seriële versie @nl
toolkit definition: Een werk dat gevormd is door het extensieplan te veranderen van statisch naar successief. @nl
label: له إصدارة متسلسلة @ar
definition: يربط عمل بعمل يتم إنشاؤه عن طريق تغيير خطة توسع لعمل من ثابت إلى متتالٍ. @ar
toolkit label: إصدارة متسلسلة @ar
toolkit definition: عمل يتم إنشاؤه عن طريق تغيير خطة توسع لعمل من ثابت إلى متتالٍ. @ar
label: té com a versió serialitzada @ca
definition: Relaciona una obra amb una obra que es crea canviant el pla d’extensió d’una obra d’estàtic a successiu. @ca
toolkit label: versió serialitzada @ca
toolkit definition: Obra que es crea canviant el pla d’extensió d’una obra d’estàtic a successiu. @ca
label: har serialiseret version @da
definition: Relaterer et værk til et værk, som er skabt ved at ændre udvidelsesplanen for et værk fra statisk til fortløbende. @da
toolkit label: serialiseret version @da
toolkit definition: Værk, som er skabt ved at ændre et udvidelsesplanen for et værk fra statisk til fortløbende. @da
label: sarjaversioon @et
definition: Seostab teose teosega, mis on loodud, muutes teose jätkamiskava staatilisest järjestikuseks. @et
toolkit label: sarjaversioon @et
toolkit definition: Teos, mis on loodud, muutes teose jätkamiskava staatilisest järjestikuseks. @et
label: hat Fortsetzungs-Version @de
definition: Setzt ein Werk in Beziehung zu einem Werk, das durch Änderung des Erweiterungsplans eines Werks von statisch auf sukzessiv erstellt wird. @de
toolkit label: Fortsetzungs-Version @de
toolkit definition: Ein Werk, das durch Änderung des Erweiterungsplans eines Werks von statisch auf sukzessiv erstellt wird. @de
label: sorozati változata a következő: @hu
definition: Hozzákapcsol egy művet egy műhöz, amely egy mű közlési tervének statikusról folyamatossá való változásával jött létre. @hu
toolkit label: sorozati változata: @hu
toolkit definition: Egy mű, amely egy mű közlési tervének statikusról folyamatossá való változásával jött létre. @hu
label: ha come versione serializzata @it
definition: Correla un'opera a un'opera creata cambiando il piano di estensione da statico a consecutivo. @it
toolkit label: versione serializzata @it
toolkit definition: Opera creata cambiando il piano di estensione da statico a consecutivo. @it
label: a pour version en série @fr
definition: Met une œuvre en relation avec une œuvre qui est créée en modifiant le plan d’extension statique d’une œuvre en plan successif. @fr
toolkit label: version en série @fr
toolkit definition: Œuvre qui est créée en modifiant le plan d’extension statique d’une œuvre en plan successif. @fr
label: sērijveida versija @lv
definition: Sasaista darbu ar darbu, kas radīts, mainot darba paplašināšanas plānu no statiska uz secīgu. @lv
toolkit label: sērijveida versija @lv
toolkit definition: Darbs, kas radīts, mainot darba paplašināšanas plānu no statiska uz secīgu. @lv
label: 有序列化的版本 @zh-hans
definition: 将一种作品与通过将一种作品的扩充计划从静态到相继性变化而被创建的一种作品关联起来。 @zh-hans
toolkit label: 序列化的版本 @zh-hans
toolkit definition: 通过将一种作品的扩充计划从静态到相继性变化而被创建的一种作品 @zh-hans
has subproperty: P10381
label: serileştirilmiş sürüm ile ilişkilidir @tr
definition: Bir eseri, bir eserin genişletme planını durağandan ardışık hale değiştirilerek oluşturulan bir eserle ilişkilendirir. @tr
toolkit label: serileştirilmiş versiyon @tr
toolkit definition: Bir eserin genişletme planının sabitten ardışık plana değiştirilmesiyle oluşturulan bir eser. @tr

is serialized version of
status: Published
lexical alias: serializedVersionOf.en
definition: Relates a work to a work that has an extension plan that is changed from successive to static to create a work.
toolkit label: serialized version of
toolkit definition: A work that has an extension plan that is changed from successive to static to create a work.
type: Property
domain: C10001
sub property of: is transformation by extension plan of
has element type: 2
label: sarjaversio teoksesta @fi
definition: Liittää teoksen teokseen, jolla on laajennussuunnitelma, joka on muutettu peräkkäisestä staattiseksi teoksen luomiseksi. @fi
toolkit label: sarjaversio teoksesta @fi
toolkit definition: Teos, jolla on laajennussuunnitelma, joka on muutettu peräkkäisestä staattiseksi teoksen luomiseksi. @fi
label: er serialisert versjon av @no
definition: Relaterer et verk til et verk som har en utvidelelsesplan som er endret fra fortløpende til statisk for å skape et verk. @no
toolkit label: serialisert versjon av @no
toolkit definition: Et verk som har en utvidelsesplan som er endret fra fortløpende til statisk for å skape et verk. @no
label: is seriële versie van @nl
definition: Relateert een werk aan een werk dat een extensieplan heeft dat veranderd is van successief naar statisch om een werk te vormen. @nl
toolkit label: seriële versie van @nl
toolkit definition: Een werk dat een extensieplan heeft dat veranderd is van successief naar statisch om een werk te vormen. @nl
label: هو إصدارة متسلسلة من @ar
definition: يربط عمل بعمل له خطة توسع تم تغييرها من متتالٍ إلى ثابت لإنشاء عمل. @ar
toolkit label: إصدارة متسلسلة من @ar
toolkit definition: عمل له خطة توسع تم تغييرها من متتالٍ إلى ثابت لإنشاء عمل. @ar
label: és versió serialitzada de @ca
definition: Relaciona una obra amb una obra que té un pla d’extensió que es canvia de successiu a estàtic per crear una obra. @ca
toolkit label: versió serialitzada de @ca
toolkit definition: Obra que té un pla d’extensió que es canvia de successiu a estàtic per crear una obra. @ca
label: er serialiseret version af @da
definition: Relaterer et værk til et værk, som har en udvidelsesplan, som, for at skabe et værk, ændres fra fortløbende til statisk. @da
toolkit label: serialiseret version af @da
toolkit definition: Værk, som har en udvidelsesplan, som, for at skabe et værk, ændres fra fortløbende til statisk. @da
label: sarjaversioon teosest @et
definition: Seostab teose teosega, mille jätkamiskava on teose loomiseks muudetud järjestikusest staatiliseks. @et
toolkit label: sarjaversioon teosest @et
toolkit definition: Teos, mille jätkamiskava on teose loomiseks muudetud järjestikusest staatiliseks. @et
label: ist Fortsetzungs-Version von @de
definition: Setzt ein Werk in Beziehung zu einem Werk, dessen Erweiterungsplan von sukzessiv auf statisch geändert wird, um ein Werk zu schaffen. @de
toolkit label: Fortsetzungs-Version von @de
toolkit definition: Ein Werk, dessen Erweiterungsplan von sukzessiv auf statisch geändert wird, um ein Werk zu schaffen. @de
label: sorozati változata a következőnek: @hu
definition: Hozzákapcsol egy művet egy műhöz, amelynek a közlési terve folyamatosról statikussá változott egy mű létrejövetele érdekében. @hu
toolkit label: sorozati változata: @hu
toolkit definition: Egy mű, amelynek a közlési terve folyamatosról statikussá változott egy mű létrejövetele érdekében. @hu
label: è versione serializzata di @it
definition: Correla un'opera a un'opera che ha un piano di estensione cambiato da consecutivo a statico per creare un'opera. @it
toolkit label: versione serializzata di @it
toolkit definition: Opera che ha un piano di estensione cambiato da consecutivo a statico per creare un'opera. @it
label: est une version en série de @fr
definition: Met une œuvre en relation avec une œuvre dont le plan d’extension successif est modifié en plan statique pour créer une œuvre. @fr
toolkit label: version en série de @fr
toolkit definition: Œuvre dont le plan d’extension successif est modifié en plan statique pour créer une œuvre. @fr
label: ir sērijveida versija no @lv
definition: Sasaista darbu ar darbu, kam paplašināšanas plāns ticis mainīts no statiska uz secīgu, lai izveidotu darbu. @lv
toolkit label: sērijveida versija no @lv
toolkit definition: Darbs, kam paplašināšanas plāns ticis mainīts no statiska uz secīgu, lai izveidotu darbu. @lv
label: 是……的序列化的版本 @zh-hans
definition: 将一种作品与有扩充计划并被从相继性改变为静态以创建一种作品的一种作品关联起来。 @zh-hans
toolkit label: ……的序列化的版本 @zh-hans
toolkit definition: 有扩充计划并被从相继性改变为静态以创建一种作品的一种作品 @zh-hans
has subproperty: P10391
label: serileştirilmiş sürümüdür @tr
definition: Bir eseri, bir eser oluşturmak için ardışıktan durağana değiştirilen bir genişletme planına sahip bir eser ile ilişkilendirir. @tr
toolkit label: serileştirilmiş versiyon @tr
toolkit definition: Bir eser oluşturmak için ardışıktan statik hale değiştirilen bir uzatma planına sahip bir eser. @tr

has serial number of musical work
status: Published
type: Property
lexical alias: serialNumberOfMusicalWork.en
domain: C10001
toolkit label: serial number of musical work
sub property of: has numeric designation of musical work
has element type: 3
instruction number: 6.16.1.3.1
definition: Relates a work to a nomen that is a numeric designation of musical work that is assigned by a composer or a reference source that indicates a sequence of musical works that share the same title or that share the same title and the same representative medium of performance.
toolkit definition: A nomen that is a numeric designation of musical work that is assigned by a composer or a reference source that indicates a sequence of musical works that share the same title or that share the same title and the same representative medium of performance.
label: musiikkiteoksen järjestysnumero @fi
definition: Liittää teoksen nomeniin, joka on säveltäjän tai tietolähteen antama musiikkiteoksen numerointi, joka osoittaa sellaisten musiikkiteosten järjestyksen, jotka jakavat saman nimekkeen tai jotka jakavat saman nimekkeen ja saman edustavan esityskokoonpanon. @fi
toolkit label: musiikkiteoksen järjestysnumero @fi
toolkit definition: Nomen, joka on säveltäjän tai tietolähteen antama musiikkiteoksen numerointi, joka osoittaa sellaisten musiikkiteosten järjestyksen, jotka jakavat saman nimekkeen tai jotka jakavat saman nimekkeen ja saman edustavan esityskokoonpanon. @fi
label: har serienummer for musikalsk verk @no
definition: Relaterer et verk til en numerisk betegnelse på musikalsk verk som er tildelt av en komponist eller en referansekilde som viser en sekvens av muskalske verk som har samme tittel eller som har samme tittel og den samme besetningen. @no
toolkit label: serienummer for musikalsk verk @no
toolkit definition: En numerisk betegnelse på musikalsk verk som er tildelt av en komponist eller en referansekilde som viser en sekvens av muskalske verk som har samme tittel eller som har samme tittel og den samme besetningen. @no
label: heeft serienummer van muziekwerk @nl
definition: Relateert een werk aan een nomen dat is een numerieke aanduiding van muziekwerk dat is toegekend door een componist of een naslagwerk dat een volgorde aangeeft van muziekwerken die dezelfde titel hebben of die dezelfde titel en representatieve uitvoeringsmedium delen. @nl
toolkit label: serienummer van muziekwerk @nl
toolkit definition: Een nomen dat is een numerieke aanduiding van muziekwerk dat is toegekend door een componist of een naslagwerk dat een volgorde aangeeft van muziekwerken die dezelfde titel hebben of die dezelfde titel en representatieve uitvoeringsmedium delen. @nl
label: له رقم مسلسل لعمل موسيقي @ar
definition: يربط بين عمل وتسمية عبارة عن تعيين رقمي لعمل موسيقي يخصصه ملحن أو مصدر مرجعي يشير إلى تسلسل الأعمال الموسيقية تحت نفس العنوان، أو تحت نفس العنوان ووسيلة الأداء. @ar
toolkit label: رقم مسلسل لعمل موسيقي @ar
toolkit definition: سمية عبارة عن تعيين رقمي لعمل موسيقي يخصصه ملحن أو مصدر مرجعي يشير إلى تسلسل الأعمال الموسيقية تحت نفس العنوان، أو تحت نفس العنوان ووسيلة الأداء. @ar
label: té com a número d’ordre d’una obra musical @ca
definition: Relaciona una obra amb un nomen que és una designació numèrica d’una obra musical que és assignada per un compositor o una font de referència que indica una seqüència d’obres musicals que comparteixen el mateix títol o que comparteixen el mateix títol i el mateix repartiment d’execució representatiu. @ca
toolkit label: número d’ordre d’una obra musical @ca
toolkit definition: Nomen que és una designació numèrica d’una obra musical que és assignada per un compositor o una font de referència que indica una seqüència d’obres musicals que comparteixen el mateix títol o que comparteixen el mateix títol i el mateix repartiment d’execució representatiu. @ca
label: har serienummer for musikværk @da
definition: Relaterer et værk til en numerisk betegnelse for musikværk, angivet af en komponist eller en referencekilde, som angiver en sekvens af musikværk, som deler samme titel, eller som deler samme titel og samme repræsentative besætning. @da
toolkit label: serienummer for musikværk @da
toolkit definition: Numerisk betegnelse for musikværk, angivet af en komponist eller en referencekilde, som angiver en sekvens af musikværk, som deler samme titel, eller som deler samme titel og samme repræsentative besætning. @da
label: muusikateose järjenumber @et
definition: Seostab teose muusikateose numbrilise tähistusega, mille on andnud helilooja või mis on antud teatmeallikas. Järjenumber näitab selliste muusikateoste järjestust, mis kannavad ühesugust pealkirja või ühesugust pealkirja koos iseloomuliku esituskoosseisuga. @et
toolkit label: muusikateose järjenumber @et
toolkit definition: Muusikateose numbriline tähistus, mille on andnud helilooja või mis on antud teatmeallikas. Järjenumber näitab selliste muusikateoste järjestust, mis kannavad ühesugust pealkirja või ühesugust pealkirja koos iseloomuliku esituskoosseisuga. @et
label: hat laufende Nummer eines Musikwerks @de
definition: Setzt ein Werk in Beziehung zu einer numerischen Bezeichnung eines Musikwerks, die von einer Komponistin/einem Komponisten vergeben oder aus einem Nachschlagewerk entnommen wird und auf eine Folge von Musikwerken hinweist, die den gleichen Titel oder den gleichen Titel und die gleiche repräsentative Besetzung haben. @de
toolkit label: Laufende Nummer eines Musikwerks @de
toolkit definition: Eine numerischen Bezeichnung eines Musikwerks, die von einer Komponistin/einem Komponisten vergeben oder aus einem Nachschlagewerk entnommen wird und auf eine Folge von Musikwerken hinweist, die den gleichen Titel oder den gleichen Titel und die gleiche repräsentative Besetzung haben. @de
label: zenemű sorozatszáma a következő: @hu
definition: Hozzákapcsol egy művet egy nomenhez, egy zenemű számjelzéséhez, amelyet egy zeneszerző vagy hivatkozási forrás rendelt hozzá, amely az olyan zeneművek sorrendjét jelöli, amelyek azonos címűek, vagy azonos a címük és jellegzetes az előadásmédiumuk. @hu
toolkit label: zenemű-sorozatszám @hu
toolkit definition: Egy nomen, egy zenemű számjelzése, amelyet egy zeneszerző vagy hivatkozási forrás rendelt hozzá, amely az olyan zeneművek sorrendjét jelöli, amelyek azonos címűek, vagy azonos a címük és jellegzetes az előadásmédiumuk. @hu
label: ha come numero seriale di opera musicale @it
definition: Correla un’opera a una designazione numerica di opera musicale assegnata dal compositore o da una fonte di reference che ordina una sequenza di opere musicali che condividono lo stesso titolo o lo stesso mezzo d’interpretazione caratteristico. @it
toolkit label: numero seriale di opera musicale @it
toolkit definition: Designazione numerica di opera musicale assegnata dal compositore o da una fonte di reference che ordina una sequenza di opere musicali che condividono lo stesso titolo o lo stesso mezzo d’interpretazione caratteristico. @it
label: a pour numéro d’ordre d’une œuvre musicale @fr
definition: Met une œuvre en relation avec un nomen qui est une désignation numérique d’une œuvre musicale attribuée par un compositeur ou une source de référence et indiquant une séquence d’œuvres musicales ayant le même titre ou ayant le même titre et la même distribution d’exécution représentative. @fr
toolkit label: numéro d’ordre d’une œuvre musicale @fr
toolkit definition: Nomen qui est une désignation numérique d’une œuvre musicale attribuée par un compositeur ou une source de référence et indiquant une séquence d’œuvres musicales ayant le même titre ou ayant le même titre et la même distribution d’exécution représentative. @fr
label: mūzikas darba kārtas numurs @lv
toolkit label: mūzikas darba kārtas numurs @lv
definition: Sasaista darbu ar nomenu, kas ir mūzikas darba numerācijas apzīmējums, ko piešķīris komponists vai uzziņu avots un kurš norāda uz vienāda nosaukuma vai vienāda nosaukuma un vienāda oriģinālā izpildījuma veida mūzikas darbu secību. @lv
toolkit definition: Mūzikas darba numerācijas apzīmējums, ko piešķīris komponists vai uzziņu avots un kurš norāda uz vienāda nosaukuma vai vienāda nosaukuma un vienāda oriģinālā izpildījuma veida mūzikas darbu secību. @lv
label: 有音乐作品的序列号 @zh-hans
toolkit label: 音乐作品的序列号 @zh-hans
definition: 将一种资源与作为由作曲者或参考信息源分配、表示有同样题名或者同样题名和同样表演表现媒介的音乐作品序列的音乐作品的数字标识的一个命名关联起来。 @zh-hans
toolkit definition: 作为由作曲者或参考信息源分配、表示有同样题名或者同样题名和同样表演表现媒介的音乐作品序列的音乐作品的数字标识的一个命名 @zh-hans
has subproperty: P10334
label: müzik eserinin seri numarası ile ilişkilidir @tr
toolkit label: müzik eserinin seri numarası @tr
definition: Bir eseri, bir besteci veya aynı başlığı paylaşan veya aynı başlığı ve aynı temsili performans ortamını paylaşan bir dizi müzik eserini gösteren bir referans kaynağı tarafından atanan müzik eserinin sayısal belirteci olan bir isimle ilişkilendirir. @tr
toolkit definition: Aynı başlığı paylaşan veya aynı başlığı ve aynı temsili icra ortamını paylaşan bir dizi müzik eserini gösteren, bir besteci veya bir referans kaynağı tarafından atanan müzik eserinin sayısal bir tanımı olan bir isim. @tr

has sound content of representative expression
status: Published
type: Property
lexical alias: soundContentOfRepresentativeExpression.en
definition: Relates a work to a presence or absence of sound in a representative expression of a work.
domain: C10001
toolkit label: sound content of representative expression
has element type: 4
toolkit definition: A presence or absence of sound in a representative expression of a work.
label: edustavan ekspression äänisisältö @fi
definition: Liittää teoksen äänen läsnäoloon tai puuttumiseen teoksen edustavassa ekspressiossa. @fi
toolkit label: edustavan ekspression äänisisältö @fi
toolkit definition: Äänen läsnäolo tai puuttuminen teoksen edustavassa ekspressiossa. @fi
label: har lydinnhold for et representativt uttrykk @no
definition: Relaterer et verk til en tilstedeværelse eller et fravær av lyd i et representativt uttrykk av et verk. @no
toolkit label: lydinnhold for et representativt uttrykk @no
toolkit definition: En tilstedeværelse eller et fravær av lyd i et representativt uttrykk av et verk. @no
label: heeft geluidscontent van representatieve expressie @nl
definition: Relateert een werk aan een aanwezigheid of afwezigheid van geluid in een representatieve expressie van een werk. @nl
toolkit label: geluidscontent van representatieve expressie @nl
toolkit definition: Een aanwezigheid of afwezigheid van geluid in een representatieve expressie van een werk. @nl
label: له محتوى صوت لتعبيرة ممثِلة @ar
definition: يربط بين عمل ووجود صوت أو عدم وجوده في تعبيرة ممثِلة لعمل. @ar
toolkit label: محتوى صوت لتعبيرة ممثِلة @ar
toolkit definition: وجود صوت أو عدم وجوده في تعبيرة ممثِلة لعمل. @ar
label: té com a contingut sonor d’una expressió representativa @ca
definition: Relaciona una obra amb la presència o absència de so en una expressió representativa d’una obra. @ca
toolkit label: contingut sonor d’una expressió representativa @ca
toolkit definition: Presència o absència de so en una expressió representativa d’una obra. @ca
label: har lydindhold for repræsentativt udtryk @da
definition: Relaterer et værk til en tilstedeværelse eller fravær af lyd i et værks repræsentative udtryk. @da
toolkit label: lydindhold for repræsentativt udtryk @da
toolkit definition: Tilstedeværelse eller fravær af lyd i et værks repræsentative udtryk. @da
label: iseloomuliku väljenduse helisisu @et
definition: Seostab teose heli olemasolu või puudumisega teose iseloomulikus väljenduses. @et
toolkit label: iseloomuliku väljenduse helisisu @et
toolkit definition: Heli olemasolu või puudumine teose iseloomulikus väljenduses. @et
label: hat Toninhalt einer repräsentativen Expression @de
definition: Setzt ein Werk in Beziehung zum Vorhandensein beziehungsweise Nichtvorhandensein von Ton in einer repräsentativen Expression eines Werks. @de
toolkit label: Toninhalt einer repräsentativen Expression @de
toolkit definition: Ein Vorhandensein beziehungsweise Nichtvorhandensein von Ton in einer repräsentativen Expression eines Werks. @de
label: reprezentatív kifejezési forma hangtartalma a következő: @hu
definition: Egy művet hozzákapcsol hang jelenlétéhez vagy hiányához egy reprezentatív kifejezési formájában. @hu
toolkit label: reprezentatív kifejezési formához tartozó hangtartalom @hu
toolkit definition: Hang jelenléte vagy hiánya egy mű egy reprezentatív kifejezési formájában. @hu
label: ha come contenuto sonoro di un'espressione rappresentativa @it
definition: Correla un’opera a una presenza o assenza di suono in un’espressione rappresentativa di un’opera. @it
toolkit label: contenuto sonoro di un'espressione rappresentativa @it
toolkit definition: Presenza o assenza di suono in un’espressione rappresentativa di un’opera. @it
label: a pour contenu sonore d’une expression représentative @fr
definition: Met une œuvre en relation avec une présence ou une absence de son dans une expression représentative d’une œuvre. @fr
toolkit label: contenu sonore d’une expression représentative @fr
toolkit definition: Présence ou absence de son dans une expression représentative d’une œuvre. @fr
label: reprezentatīvās izteiksmes skaņas saturs @lv
definition: Sasaista darbu ar skaņas esamību vai tās trūkumu darba reprezentatīvajā izteiksmē. @lv
toolkit label: reprezentatīvās izteiksmes skaņas saturs @lv
toolkit definition: Skaņas esamība vai tās trūkums darba reprezentatīvajā izteiksmē. @lv
label: 有代表性内容表达的声音内容 @zh-hans
definition: 将一种作品与一种作品的一种代表性内容表达中声音出现或不出现的指示关联起来。 @zh-hans
toolkit label: 代表性内容表达的声音内容 @zh-hans
toolkit definition: 一种作品的一种代表性内容表达中声音出现或不出现的指示 @zh-hans
has subproperty: P10358
label: temsili anlatımın ses içeriği ile ilişkilidir @tr
definition: Bir eseri, temsili bir anlatımın sesin varlığı veya yokluğu ile ilişkilendirir. @tr
toolkit label: temsili ifadenin ses içeriği @tr
toolkit definition: Bir eserin temsili anlatımında sesin varlığı veya yokluğu. @tr

is sounds for work
status: Published
lexical alias: soundsForWork.en
toolkit label: sounds for work
type: Property
domain: C10001
sub property of: is complemented by work
has element type: 2
definition: Relates a work to a work that is complemented by a work that is realized as sound.
toolkit definition: A work that is complemented by a work that is realized as sound.
label: ääni teokseen @fi
definition: Liittää teoksen teokseen, jota täydentää teos, joka toteutuu äänenä. @fi
toolkit label: ääni teokseen @fi
toolkit definition: Teos, jota täydentää teos, joka toteutuu äänenä. @fi
label: er lyd for verk @no
definition: Relaterer et verk til et verk som utfylles av et verk som realiseres som lyd. @no
toolkit label: lyd for verk @no
toolkit definition: Et verk som utfylles av et verk som realiseres som lyd. @no
label: is geluiden voor werk @nl
definition: Relateert een werk aan een werk dat gecomplementeerd wordt door een werk dat gerealiseerd is als geluid. @nl
toolkit label: geluiden voor werk @nl
toolkit definition: Een werk dat gecomplementeerd wordt door een werk dat gerealiseerd is als geluid. @nl
label: هو أصوات لعمل @ar
definition: يربط عمل بعمل يكمله عمل يتم تحقيقه على أنه صوت. @ar
toolkit label: أصوات لعمل @ar
toolkit definition: عمل يكمله عمل يتم تحقيقه على أنه صوت. @ar
label: és sons per a una obra @ca
definition: Relaciona una obra amb una obra que es complementa amb una obra que es realitza com a so. @ca
toolkit label: sons per a una obra @ca
toolkit definition: Obra que es complementa amb una obra que es realitza com a so. @ca
label: er lyde til værk @da
definition: Relaterer et værk til et værk, som er komplementeret af et værk, som realiseres som lyd. @da
toolkit label: lyde til værk @da
toolkit definition: Værk, som er komplementeret af et værk, som realiseres som lyd. @da
label: heli teosele @et
definition: Seostab teose teosega, mis on täiendatud helidena realiseeritud teosega. @et
toolkit label: heli teosele @et
toolkit definition: Teos, mis on täiendatud helidena realiseeritud teosega. @et
label: ist Töne für (Werk) @de
definition: Setzt ein Werk in Beziehung zu einem Werk, das durch ein Werk aus Tönen vervollständigt wird. @de
toolkit label: Töne für (Werk) @de
toolkit definition: Ein Werk, das durch ein Werk aus Tönen vervollständigt wird. @de
label: hangokban kifejezett kiegészítője a következő műnek: @hu
definition: Hozzákapcsol egy művet egy műhöz, amelyet egy hangként kifejezett mű egészít ki. @hu
toolkit label: hangművel ellátott mű @hu
toolkit definition: Egy mű, amelyet egy hangként kifejezett mű egészít ki. @hu
label: è suono per opera @it
definition: Correla un'opera a un'opera completata da un'opera realizzata come suono. @it
toolkit label: suono per opera @it
toolkit definition: Opera completata da un'opera realizzata come suono. @it
label: consiste en sons pour une œuvre @fr
definition: Met une œuvre en relation avec une œuvre qui est complétée par une œuvre réalisée sous forme de sons. @fr
toolkit label: sons pour une œuvre @fr
toolkit definition: Œuvre qui est complétée par une œuvre réalisée sous forme de sons. @fr
label: ir skaņas darbam @lv
toolkit label: skaņas darbam @lv
definition: Sasaista darbu ar darbu, kas ir papildināts ar darbu, kas realizēts kā skaņa. @lv
toolkit definition: Darbs, kas ir papildināts ar darbu, kas realizēts kā skaņa. @lv
label: 是作品的声音 @zh-hans
toolkit label: 作品的声音 @zh-hans
definition: 将一种作品与被一种作品补充并被实现为声音的一种作品关联起来。 @zh-hans
toolkit definition: 被一种作品补充并被实现为声音的一种作品 @zh-hans
has subproperty: P10376
label: Eser için ses @tr
toolkit label: eser için sesler @tr
definition: Bir eseri, ses olarak gerçekleştirilen bir eserle tamamlanan bir eserle ilişkilendirir. @tr
toolkit definition: Ses olarak gerçekleştirilen bir eserle tamamlanan bir eser. @tr

has sounds work
status: Published
lexical alias: soundsWork.en
toolkit label: sounds work
type: Property
domain: C10001
sub property of: is complemented by work
has element type: 2
definition: Relates a work to a work that is realized as sound and that complements a work.
toolkit definition: A work that is realized as sound and that complements a work.
label: ääniteos @fi
definition: Liittää teoksen teokseen, joka toteutuu äänenä ja joka täydentää teosta. @fi
toolkit label: ääniteos @fi
toolkit definition: Teos, joka toteutuu äänenä ja joka täydentää teosta. @fi
label: har lyd (verk) @no
definition: Relaterer et verk til et verk som realiseres som lyd som utfyller et verk. @no
toolkit label: lyd (verk) @no
toolkit definition: Et verk som realiseres som lyd som utfyller et verk. @no
label: heeft geluidswerk @nl
definition: Relateert een werk aan een werk dat is gerealiseerd als geluid en dat een werk complementeert. @nl
toolkit label: geluidswerk @nl
toolkit definition: Een werk dat is gerealiseerd als geluid en dat een werk complementeert. @nl
label: له عمل أصوات @ar
definition: يربط عمل بعمل يتم تحقيقه على أنه صوت ويكمل عملا. @ar
toolkit label: عمل أصوات @ar
toolkit definition: عمل يتم تحقيقه على أنه صوت ويكمل عملا. @ar
label: té com a obra de sons @ca
definition: Relaciona una obra amb una obra que es realitza com a so i que complementa una obra. @ca
toolkit label: obra de sons @ca
toolkit definition: Obra que es realitza com a so i que complementa una obra. @ca
label: har lydværk @da
definition: Relaterer et værk til et værk, som realiseres som lyd, som komplementerer et værk. @da
toolkit label: lydværk @da
toolkit definition: Værk, som realiseres som lyd, som komplementerer et værk. @da
label: heli (teos) @et
definition: Seostab teose teosega, mis on realiseeritud helidena ja täiendab teost. @et
toolkit label: heli (teos) @et
toolkit definition: Teos, mis on realiseeritud helidena ja täiendab teost. @et
label: hat Töne (Werk) @de
definition: Setzt ein Werk in Beziehung zu einem Werk aus Tönen, das ein Werk ergänzt. @de
toolkit label: Töne (Werk) @de
toolkit definition: Ein Werk aus Tönen, das ein Werk ergänzt. @de
label: hangokban kifejezett kiegészítője a következő: @hu
definition: Hozzákapcsol egy művet egy műhöz, amely egy művet kiegészítő hangban fejeződik ki. @hu
toolkit label: hangmű @hu
toolkit definition: Egy mű, amely egy művet kiegészítő hangban fejeződik ki. @hu
label: ha come sonoro opera @it
definition: Correla un'opera a un'opera realizzata come suono, che completa un'opera. @it
toolkit label: sonoro opera @it
toolkit definition: Opera realizzata come suono che completa un'opera. @it
label: a pour sons (œuvre) @fr
definition: Met une œuvre en relation avec une œuvre qui est réalisée sous forme de sons et qui complète une œuvre. @fr
toolkit label: sons (œuvre) @fr
toolkit definition: Œuvre qui est réalisée sous forme de sons et qui complète une œuvre. @fr
label: darbs: skaņas @lv
toolkit label: darbs: skaņas @lv
definition: Sasaista darbu ar darbu, kas ir realizēts kā skaņa, kas papildina citu darbu. @lv
toolkit definition: Darbs, kas ir realizēts kā skaņa, kas papildina citu darbu. @lv
label: 有声音作品 @zh-hans
toolkit label: 将一种作品与被实现为声音并补充一种作品的一种作品关联起来。 @zh-hans
definition: 声音作品 @zh-hans
toolkit definition: 被实现为声音并补充一种作品的一种作品 @zh-hans
has subproperty: P10374
label: ses eseri ile ilişkilidir @tr
toolkit label: ses eserleri @tr
definition: Bir eseri, ses olarak gerçekleştirilen ve bir eseri tamamlayan bir eserle ilişkilendirir. @tr
toolkit definition: Ses olarak gerçekleştirilen ve bir eseri tamamlayan bir eser. @tr

has source consulted
status: Published
lexical alias: sourceConsulted.en
definition: Relates a work to a manifestation in which there is evidence for a metadata work.
toolkit label: source consulted
toolkit definition: A manifestation in which there is evidence for a metadata work.
type: Property
domain: C10001
sub property of: has related manifestation of work
has element type: 2
label: käytetty lähde @fi
definition: Liittää teoksen manifestaatioon, jossa on metatietoteoksessa käytettäviä tietoja. @fi
toolkit label: käytetty lähde @fi
toolkit definition: Manifestaatio, jossa on metatietoteoksessa käytettäviä tietoja. @fi
label: har konsultert kilde @no
definition: Relaterer et verk til en manifestasjon som inneholder belegg for et metadataverk. @no
toolkit label: konsultert kilde @no
toolkit definition: En manifestasjon som inneholder belegg for et metadataverk. @no
label: heeft geraadpleegde bron @nl
definition: Relateert een werk aan een manifestatie waarin bewijs staat voor een metadatawerk. @nl
toolkit label: geraadpleegde bron @nl
toolkit definition: Een manifestatie waarin bewijs staat voor een metadatawerk. @nl
label: له مصدر استشارة @ar
definition: يربط بين عمل وتجسيدة بها دليل على عمل ميتاداتا. @ar
toolkit label: مصدر استشارة @ar
toolkit definition: تجسيدة بها دليل على عمل ميتاداتا. @ar
label: té com a font consultada @ca
definition: Relaciona una obra amb una manifestació en la qual hi ha evidència per a una obra de metadades. @ca
toolkit label: font consultada @ca
toolkit definition: Manifestació en la qual hi ha evidència per a una obra de metadades. @ca
label: har konsulteret kilde @da
definition: Relaterer et værk til en manifestation, hvori der er belæg for et metadataværk. @da
toolkit label: konsulteret kilde @da
toolkit definition: Manifestation, hvori der er belæg for et metadataværk. @da
label: kasutatud allikas @et
definition: Seostab teose kehastusega, kus leidub fakte metaandmeteose jaoks. @et
toolkit label: kasutatud allikas @et
toolkit definition: Kehastus, kus leidub fakte metaandmeteose jaoks. @et
label: hat konsultierte Quelle @de
definition: Setzt ein Werk in Beziehung zu einer Manifestation, die Hinweise auf ein Metadatenwerk enthält. @de
toolkit label: Konsultierte Quelle @de
toolkit definition: Eine Manifestation, die Hinweise auf ein Metadatenwerk enthält. @de
label: felhasznált forrása a következő: @hu
definition: Hozzákapcsol egy művet egy megjelenési formához, amelyben egy metaadatművet alátámasztó bizonyíték található. @hu
toolkit label: felhasznált forrása: @hu
toolkit definition: Egy megjelenési forma, amelyben egy metaadatművet alátámasztó bizonyíték található. @hu
label: ha come fonte consultata @it
definition: Correla un'opera a una manifestazione nella quale ci sono prove per un'opera di metadati. @it
toolkit label: fonte consultata @it
toolkit definition: Manifestazione nella quale ci sono prove per un'opera di metadati. @it
label: a pour source consultée @fr
definition: Met une œuvre en relation avec une manifestation dans laquelle sont fournies des preuves pour une œuvre de métadonnées. @fr
toolkit label: source consultée @fr
toolkit definition: Manifestation dans laquelle sont fournies des preuves pour une œuvre de métadonnées. @fr
label: vēres avots @lv
definition: Sasaista darbu ar manifestāciju, kurā ir informācija metadatu izveidei. @lv
toolkit label: vēres avots @lv
toolkit definition: Manifestācija, kurā ir informācija metadatu izveidei. @lv
label: 有被查阅的信息源 @zh-hans
definition: 将一种作品与其中有元数据作品之证据的一种载体表现关联起来。 @zh-hans
toolkit label: 被查阅的信息源 @zh-hans
toolkit definition: 其中有元数据作品之证据的一种载体表现 @zh-hans
has subproperty: P10406
label: başvurulan kaynak ile ilişkilidir @tr
definition: Bir eseri, bir üstveri eseri için kanıt bulunan bir gösterim ile ilişkilendirir. @tr
toolkit label: danışılan kaynak @tr
toolkit definition: Bir üst veri çalışması için kanıt bulunan bir gösterim. @tr

has special issue
status: Published
lexical alias: specialIssue.en
definition: Relates a work to a work that is an issue that is devoted to a specific topic.
toolkit label: special issue
toolkit definition: A work that is an issue that is devoted to a specific topic.
type: Property
domain: C10001
sub property of: has issue
has element type: 2
label: erikoisnumero @fi
definition: Liittää teoksen teokseen, joka on numero, joka on omistettu tietylle aiheelle. @fi
toolkit label: erikoisnumero @fi
toolkit definition: Teos, joka on numero, joka on omistettu tietylle aiheelle. @fi
label: har spesialnummer @no
definition: Relaterer et verk til et verk som er et hefte som er dedikert til et bestemt tema. @no
toolkit label: spesialnummer @no
toolkit definition: Et verk som er et hefte som er dedikert til et bestemt tema. @no
label: heeft themanummer @nl
definition: Relateert een werk aan een werk dat een aflevering is dat in het teken staat van een specifiek onderwerp. @nl
toolkit label: themanummer @nl
toolkit definition: Een werk dat een aflevering is dat in het teken staat van een specifiek onderwerp. @nl
label: له إصدار خاص @ar
definition: يربط عمل بعمل عبارة عن عدد مخصص لموضوع محدد. @ar
toolkit label: إصدار خاص @ar
toolkit definition: عمل عبارة عن إصدار مخصص لموضوع محدد. @ar
label: té com a número especial @ca
definition: Relaciona una obra amb una obra que és un número que es dedica a un tema específic. @ca
toolkit label: número especial @ca
toolkit definition: Obra que és un número que es dedica a un tema específic. @ca
label: har specialnummer @da
definition: Relaterer et værk til et værk, som er et nummer, som er dedikeret til et bestemt tema. @da
toolkit label: specialnummer @da
toolkit definition: Værk, som er et nummer, som er dedikeret til et bestemt tema. @da
label: erinumber @et
definition: Seostab teose teosega, mis on kindlale teemale pühendatud number. @et
toolkit label: erinumber @et
toolkit definition: Teos, mis on kindlale teemale pühendatud number. @et
label: hat Sonderausgabe @de
definition: Setzt ein Werk in Beziehung zu einer Ausgabe, die einem bestimmten Thema gewidmet ist. @de
toolkit label: Sonderausgabe @de
toolkit definition: Eine Ausgabe, die einem bestimmten Thema gewidmet ist. @de
label: különszáma a következő: @hu
definition: Hozzákapcsol egy művet egy műhöz, amely egy adott témának szentelt szám. @hu
toolkit label: különszáma: @hu
toolkit definition: Egy mű, amely egy speciális témának szentelt szám. @hu
label: ha come fascicolo speciale @it
definition: Correla un'opera a un'opera costituita da un fascicolo dedicato a un argomento specifico. @it
toolkit label: fascicolo speciale @it
toolkit definition: Opera costituita da un fascicolo dedicato a un argomento specifico. @it
label: a pour numéro spécial @fr
definition: Met une œuvre en relation avec une œuvre qui consiste en une livraison consacrée à un sujet spécifique. @fr
toolkit label: numéro spécial @fr
toolkit definition: Œuvre qui consiste en une livraison consacrée à un sujet spécifique. @fr
label: speciāllaidiens @lv
definition: Sasaista darbu ar darbu, kas ir laidiens, kas veltīts noteiktai tēmai. @lv
toolkit label: speciāllaidiens @lv
toolkit definition: Darbs, kas ir laidiens, kas veltīts noteiktai tēmai. @lv
label: 有特刊 @zh-hans
definition: 将一种作品与作为完全关于一个特定话题的一期的一种作品关联起来。 @zh-hans
toolkit label: 特刊 @zh-hans
toolkit definition: 作为完全关于一个特定话题的一期的一种作品 @zh-hans
has subproperty: P10410
label: özel sayı ile ilişkilidir @tr
definition: Bir eseri, belirli bir konuya ayrılmış bir sayı olan bir eserle ilişkilendirir. @tr
toolkit label: özel sayı @tr
toolkit definition: Belirli bir konuya ayrılmış bir sayı olan bir eser. @tr

is special issue of
status: Published
lexical alias: specialIssueOf.en
definition: Relates a work to a work that has an issue that is devoted to a specific topic.
toolkit label: special issue of
toolkit definition: A work that has an issue that is devoted to a specific topic.
type: Property
domain: C10001
sub property of: is issue of
has element type: 2
label: erikoisnumero teokselle @fi
definition: Liittää teoksen teokseen, jolla on numero, joka on omistettu tietylle aiheelle. @fi
toolkit label: erikoisnumero teokselle @fi
toolkit definition: Teos, jolla on numero, joka on omistettu tietylle aiheelle. @fi
label: er spesialnummer av @no
definition: Relaterer et verk til et verk som har et hefte som er dedikert til et bestemt tema. @no
toolkit label: spesialnummer av @no
toolkit definition: Et verk som har et hefte som er dedikert til et bestemt tema. @no
label: is themanummer van @nl
definition: Relateert een werk aan een werk dat een aflevering heeft dat in het teken staat van een specifiek onderwerp. @nl
toolkit label: themanummer van @nl
toolkit definition: Een werk dat een aflevering heeft dat in het teken staat van een specifiek onderwerp. @nl
label: هو إصدار خاص لـ @ar
definition: يربط عمل بعمل به إصدار مخصص لموضوع محدد. @ar
toolkit label: إصدار خاص لـ @ar
toolkit definition: عمل به إصدار مخصص لموضوع محدد. @ar
label: és número especial de @ca
definition: Relaciona una obra amb una obra que té un número que es dedica a un tema específic. @ca
toolkit label: número especial de @ca
toolkit definition: Obra que té un número que es dedica a un tema específic. @ca
label: er specialnummer af @da
definition: Relaterer et værk til et værk, som har et nummer, som er dedikeret til et bestemt tema. @da
toolkit label: specialnummer af @da
toolkit definition: Værk, som har et nummer, som er dedikeret til et bestemt tema. @da
label: erinumber teosest @et
definition: Seostab teose teosega, millel on kindlale teemale pühendatud number. @et
toolkit label: erinumber teosest @et
toolkit definition: Teos, millel on kindlale teemale pühendatud number. @et
label: ist Sonderausgabe von @de
definition: Setzt ein Werk in Beziehung zu einem Werk, das eine Ausgabe einem bestimmten Thema widmet. @de
toolkit label: Sonderausgabe von @de
toolkit definition: Ein Werk, das eine Ausgabe einem bestimmten Thema widmet. @de
label: különszáma a következőnek: @hu
definition: Hozzákapcsol egy művet egy műhöz, amely egy adott témának szentelt számmal rendelkezik. @hu
toolkit label: különszáma: @hu
toolkit definition: Egy mű, amely egy adott témának szentelt számmal rendelkezik. @hu
label: è fascicolo speciale di @it
definition: Correla un'opera a un'opera che ha un fascicolo dedicato a un argomento specifico. @it
toolkit label: fascicolo speciale di @it
toolkit definition: Opera che ha un fascicolo dedicato a un argomento specifico. @it
label: est un numéro spécial de @fr
definition: Met une œuvre en relation avec une œuvre qui possède une livraison consacrée à un sujet spécifique. @fr
toolkit label: numéro spécial de @fr
toolkit definition: Œuvre qui possède une livraison consacrée à un sujet spécifique. @fr
label: ir speciāllaidiens no @lv
definition: Sasaista darbu ar darbu, kam ir laidiens, kas veltīts noteiktai tēmai. @lv
toolkit label: speciāllaidiens no @lv
toolkit definition: Darbs, kam ir laidiens, kas veltīts noteiktai tēmai. @lv
label: 是……的特刊 @zh-hans
definition: 将一种作品与有完全关于一个特定话题的一期的一种作品关联起来。 @zh-hans
toolkit label: ……的特刊 @zh-hans
toolkit definition: 有完全关于一个特定话题的一期的一种作品 @zh-hans
has subproperty: P10411
label: özel konusu @tr
definition: Bir eseri, belirli bir konuya adanmış bir sayısı olan bir eser ile ilişkilendirir. @tr
toolkit label: özel sayı @tr
toolkit definition: Belirli bir konuya ayrılmış bir sayısı olan bir eser. @tr

is split from work
status: Published
definition: Relates a work to a work that is a diachronic work that is completed whose partial content is continued by another diachronic work.
type: Property
domain: C10001
sub property of: is preceded by work
lexical alias: splitFromWork.en
toolkit label: split from work
toolkit definition: A work that is a diachronic work that is completed whose partial content is continued by another diachronic work.
toolkit label: scindé à partir d’une œuvre @fr
toolkit definition: Œuvre diachronique qui est terminée et dont le contenu partiel est continué par une autre œuvre diachronique. @fr
toolkit label: continúa en parte (obra) @es
toolkit definition: Una obra que se divide en dos o más obras separadas con títulos nuevos. @es
scope note: This element applies in general to a successive work.
instruction number: 24.5
label: er delt fra værk @da
definition: Relaterer et værk til et værk, som er et diakronisk værk, der er fuldstændigt, men hvis delvise indhold fortsættes af et andet diakronisk værk. @da
scope note: Dette element gælder generelt for et fortløbende værk. @da
toolkit label: delt fra værk @da
toolkit definition: Værk, som er et diakronisk værk, der er fuldstændigt, men hvis delvise indhold fortsættes af et andet diakronisk værk. @da
definition: Met une œuvre en relation avec une œuvre diachronique qui est terminée et dont le contenu partiel est continué par une autre œuvre diachronique. @fr
label: là tiếp tục một phần của (tác phẩm) @vi
definition: Liên kết tác phẩm với tác phẩm chia thành hai hoặc nhiều hơn tác phẩm tách biệt với các nhàn đề mới. @vi
scope note: Mối quan hệ này áp dụng tổng quát cho ấn phẩm nhiều kỳ. @vi
toolkit label: tiếp tục một phần của (tác phẩm) @vi
toolkit definition: Tác phẩm chia thành hai hoặc nhiều hơn tác phẩm tách biệt với các nhàn đề mới. @vi
label: ist teilweise Fortsetzung von (Werk) @de
definition: Setzt ein Werk in Beziehung zu einem abgeschlossenen diachronen Werk, dessen Inhalt teilweise durch ein anderes diachrones Werk fortgeführt wird. @de
scope note: Im Allgemeinen trifft dieses Element auf ein sukzessives Werk zu. @de
toolkit label: Teilweise Fortsetzung von (Werk) @de
toolkit definition: Ein abgeschlossenes diachrones Werk, dessen Inhalt teilweise durch ein anderes diachrones Werk fortgeführt wird. @de
label: est scindé à partir d’une œuvre @fr
definition: Liittää teoksen teokseen, joka on valmis diakroninen teos, jonka osittaista sisältöä jatkaa toinen diakroninen teos. @fi
toolkit label: jakautunut teoksesta @fi
toolkit definition: Teos, joka on valmis diakroninen teos, jonka osittaista sisältöä jatkaa toinen diakroninen teos. @fi
toolkit label: delvis fortsettelse av verk @no
toolkit definition: Et verk som er et komplett diakronisk verk hvor deler av innholdet fortsettes av et annet diakronisk verk. @no
label: és escindit d’una obra @ca
definition: Relaciona una obra amb una obra que és una obra diacrònica que és completa, el contingut parcial de la qual és continuat per una altra obra diacrònica. @ca
scope note: En general, aquest element s’aplica a una obra successiva. @ca
toolkit label: escindit d’una obra @ca
toolkit definition: Obra que és una obra diacrònica que és completa, el contingut parcial de la qual és continuat per una altra obra diacrònica. @ca
scope note: Cet élément s’applique généralement à une œuvre successive. @fr
has element type: 2
label: είναι συνέχεια σε μέρη του (έργου) @el
definition: Συνδέει ένα έργο με ένα έργο το οποίο χωρίζεται σε δύο ή περισσότερα διακριτά έργα με νέους τίτλους. @el
scope note: Αυτή η σχέση βρίσκει γενική εφαρμογή στα περιοδικά. @el
toolkit label: συνέχεια σε μέρη του (έργο) @el
toolkit definition: Ένα έργο το οποίο χωρίζεται σε δύο ή περισσότερα διακριτά έργα με νέους τίτλους. @el
label: kivált a következő műből: @hu
definition: Hozzákapcsol egy művet egy befejezett diakronikus műhöz, amelynek részleges tartalmát egy másik diakronikus mű folytatja. @hu
scope note: részekbeni folytatása a következőnek (mű): @hu
toolkit label: szétváló mű @hu
toolkit definition: Egy befejezett diakronikus mű, amelynek részleges tartalmát egy másik diakronikus mű folytatja. @hu
alternative label: continuation in part of (work)
scope note: Tämä elementti soveltuu yleensä peräkkäisesti ilmestyvään teokseen. @fi
alternative label: jatkaa osittain teosta @fi
label: jakautunut teoksesta @fi
label: er delvis fortsettelse av verk @no
definition: Relaterer et verk til et verk som er et komplett diakronisk verk hvor deler av innholdet fortsettes av et annet diakronisk verk. @no
scope note: Dette elementet gjelder som oftest for et påfølgende verk. @no
alternative label: fortsetter i deler av verk @no
label: is gesplitst uit werk @nl
definition: Relateert een werk aan een werk dat een diachronisch werk is dat afgesloten is waarvan gedeeltelijke content voortgezet wordt door een ander diachronisch werk. @nl
scope note: Dit element is over het algemeen van toepassing op een successief werk. @nl
toolkit label: afsplitsing van werk @nl
toolkit definition: Een werk dat een diachronisch werk is dat afgesloten is waarvan gedeeltelijke content voortgezet wordt door een ander diachronisch werk. @nl
label: هو منشطر من عمل @ar
definition: يربط عمل بعمل عبارة عن عمل ممتد زمنيًا، ومكتمل، ومحتواه الجزئي مستمر من خلال عمل آخر ممتد زمنيًا. @ar
scope note: ينطبق هذا العنصر عامة على عمل متتالٍ. @ar
alternative label: استمرار في جزء من (عمل) @ar
toolkit label: منشطر من عمل @ar
toolkit definition: عمل ممتد زمنيًا، ومكتمل، ومحتواه الجزئي مستمر من خلال عمل آخر ممتد زمنيًا. @ar
alternative label: continuació en part d’una obra @ca
alternative label: fortsættelse i del af værk @da
label: osaline jätk teosele @et
definition: Seostab teose diakroonilise teosega, mis on lõpetatud ja mille sisu osaliselt jätkab teine diakrooniline teos. @et
scope note: Elementi rakendatakse peamiselt järgteose puhul. @et
toolkit label: osaline jätk teosele @et
toolkit definition: Diakrooniline teos, mis on lõpetatud ja mille sisu osaliselt jätkab teine diakrooniline teos. @et

is spoken word for work
status: Published
lexical alias: spokenWordForWork.en
toolkit label: spoken word for work
type: Property
domain: C10001
sub property of: is complemented by work
has element type: 2
definition: Relates a work to a work that is complemented by a vocal work.
toolkit definition: A work that is complemented by a vocal work.
label: puhe teokseen @fi
definition: Liittää teoksen teokseen, jota täydentää puheteos. @fi
toolkit label: puhe teokseen @fi
toolkit definition: Teos, jota täydentää puheteos. @fi
label: er tale for verk @no
definition: Relaterer et verk til et verk som utfylles av et verk som realiseres som tale. @no
toolkit label: tale for verk @no
toolkit definition: Et verk som utfylles av et verk som realiseres som tale. @no
label: is gesproken woord voor werk @nl
definition: Relateert een werk aan een werk dat gecomplementeerd wordt door een vocaal werk. @nl
toolkit label: gesproken woord voor werk @nl
toolkit definition: Een werk dat gecomplementeerd wordt door een vocaal werk. @nl
label: هو كلمات منطوقة لعمل @ar
definition: يربط عمل بعمل يكمله عمل محقق على أنه كلمة منطوقة. @ar
toolkit label: كلمات منطوقة لعمل @ar
toolkit definition: عمل يكمله عمل محقق على أنه كلمة منطوقة. @ar
label: és paraula parlada per a una obra @ca
definition: Relaciona una obra amb una obra que es complementa amb una obra vocal. @ca
toolkit label: paraula parlada per a una obra @ca
toolkit definition: Obra que es complementa amb una obra vocal. @ca
label: er tale til værk @da
definition: Relaterer et værk til et værk, som er komplementeret af et værk, som realiseres som tale. @da
toolkit label: tale til værk @da
toolkit definition: Værk, som er komplementeret af et værk, som realiseres som tale. @da
label: kõne teosele @et
definition: Seostab teose teosega, mis on täiendatud kõnena realiseeritud teosega. @et
toolkit label: kõne teosele @et
toolkit definition: Teos, mis on täiendatud kõnena realiseeritud teosega. @et
label: ist gesprochenes Wort für (Werk) @de
definition: Setzt ein Werk in Beziehung zu einem Werk, das durch ein gesprochenes Werk vervollständigt wird. @de
toolkit label: Gesprochenes Wort für (Werk) @de
toolkit definition: Ein Werk, das durch ein gesprochenes Werk vervollständigt wird. @de
label: beszéd a következő forráshoz: @hu
definition: Hozzákapcsol egy művet egy műhöz, amelyet egy beszédmű egészít ki. @hu
toolkit label: beszéd a következő forráshoz: @hu
toolkit definition: Egy mű, amelyet egy beszédmű egészít ki. @hu
label: è parlato per opera @it
definition: Correla un'opera a un'opera completata da un'opera realizzata come parlato. @it
toolkit label: parlato per opera @it
toolkit definition: Opera completata da un'opera realizzata come parlato. @it
label: est une œuvre orale pour une œuvre @fr
definition: Met une œuvre en relation avec une œuvre qui est complétée par une œuvre vocale. @fr
toolkit label: œuvre orale pour une œuvre @fr
toolkit definition: Œuvre qui est complétée par une œuvre vocale. @fr
label: ir mutvārdi darbam @lv
toolkit label: mutvārdi darbam @lv
definition: Sasaista darbu ar darbu, kas ir papildināts ar darbu, kas realizēts kā mutvārdi. @lv
toolkit definition: Darbs, kas ir papildināts ar darbu, kas realizēts kā mutvārdi. @lv
label: 是作品的口语 @zh-hans
toolkit label: 作品的口语 @zh-hans
definition: 将一种作品与被一种人声作品补充的一种作品关联起来。 @zh-hans
toolkit definition: 被一种人声作品补充的一种作品 @zh-hans
has subproperty: P10375
label: Eser için sözlü ifade @tr
toolkit label: eser için söz @tr
definition: Bir eseri, sesli bir eser tarafından tamamlanan bir eser ile ilişkilendirir. @tr
toolkit definition: Sesli bir çalışma ile tamamlanan bir eser @tr

has spoken word work
status: Published
lexical alias: spokenWordWork.en
toolkit label: spoken word work
type: Property
domain: C10001
sub property of: is complemented by work
has element type: 2
definition: Relates a work to a work that is a vocal work and that complements a work.
toolkit definition: A work that is a vocal work and that complements a work.
label: puheteos @fi
definition: Liittää teoksen teokseen, joka on puheteos ja joka täydentää teosta. @fi
toolkit label: puheteos @fi
toolkit definition: Teos, joka on puheteos ja joka täydentää teosta. @fi
label: har tale (verk) @no
definition: Relaterer et verk til et verk som realiseres som tale som utfyller et verk. @no
toolkit label: tale (verk) @no
toolkit definition: Et verk som realiseres som tale som utfyller et verk. @no
label: heeft gesproken woord-werk @nl
definition: Relateert een werk aan een werk dat is een vocaal werk en dat een werk complementeert. @nl
toolkit label: gesproken woord-werk @nl
toolkit definition: Een werk dat is een vocaal werk en dat een werk complementeert. @nl
label: له عمل كلمات منطوقة @ar
definition: يربط عمل بعمل يتم تحقيقه على أنه كلمة منطوقة ويكمل عملا. @ar
toolkit label: عمل كلمات منطوقة @ar
toolkit definition: عمل يتم تحقيقه على أنه كلمة منطوقة ويكمل عملا. @ar
label: té com a obra de paraula parlada @ca
definition: Relaciona una obra amb una obra que és una obra vocal i que complementa una obra. @ca
toolkit label: obra de paraula parlada @ca
toolkit definition: Obra que és una obra vocal i que complementa una obra. @ca
label: har taleværk @da
definition: Relaterer et værk til et værk, som realiseres som tale, som komplementerer et værk. @da
toolkit label: taleværk @da
toolkit definition: Værk, som realiseres som tale, som komplementerer et værk. @da
label: kõne (teos) @et
definition: Seostab teose teosega, mis on realiseeritud kõnena ja täiendab teost. @et
toolkit label: kõne (teos) @et
toolkit definition: Teos, mis on realiseeritud kõnena ja täiendab teost. @et
label: hat gesprochenes Wort (Werk) @de
definition: Setzt ein Werk in Beziehung zu einem gesprochenen Werk, das ein Werk ergänzt. @de
toolkit label: Gesprochenes Wort (Werk) @de
toolkit definition: Ein gesprochenes Werk, das ein Werk ergänzt. @de
label: beszédben kifejezett forrása a következő: @hu
definition: Hozzákapcsol egy művet egy beszédműhöz, amelyet egy mű egészít ki. @hu
toolkit label: élőszavas mű @hu
toolkit definition: Egy beszédmű, amelyet egy mű egészít ki. @hu
label: ha come parlato opera @it
definition: Correla un'opera a un'opera realizzata come parlato che completa un'opera. @it
toolkit label: parlato opera @it
toolkit definition: Opera realizzata come parlato che completa un'opera. @it
label: a pour œuvre orale @fr
definition: Met une œuvre en relation avec une œuvre vocale qui complète une œuvre. @fr
toolkit label: œuvre orale @fr
toolkit definition: Œuvre vocale qui complète une œuvre. @fr
label: darbs: mutvārdi @lv
toolkit label: darbs: mutvārdi @lv
definition: Sasaista darbu ar darbu, kas ir realizēts kā mutvārdi, kas papildina citu darbu. @lv
toolkit definition: Darbs, kas ir realizēts kā mutvārdi, kas papildina citu darbu. @lv
label: 有口语作品 @zh-hans
toolkit label: 口语作品 @zh-hans
definition: 将一种作品与被作为一种人声作品并补充一种作品的一种作品关联起来。 @zh-hans
toolkit definition: 作为一种人声作品并补充一种作品的一种作品 @zh-hans
has subproperty: P10373
label: sözlü eser ile ilişkilidir @tr
toolkit label: sözlü eser @tr
definition: Bir eseri, sesli bir eser olan ve bir eseri tamamlayan bir eserle ilişkilendirir. @tr
toolkit definition: Sesli bir eser olan ve bir eseri tamamlayan bir çalışma. @tr

has sponsoring agent of work
status: Published
definition: Relates a work to an agent who sponsors some aspect of a work.
type: Property
domain: C10001
lexical alias: sponsoringAgentOfWork.en
toolkit label: sponsoring agent of work
toolkit definition: An agent who sponsors some aspect of a work.
toolkit label: agent parraineur d’une œuvre @fr
toolkit definition: Agent qui parraine un aspect quelconque d’une œuvre. @fr
toolkit label: entidad patrocinadora @es
toolkit definition: Una persona, familia o entidad corporativa que patrocina algún aspecto de una obra, por ej., financiando una investigación, patrocinando un evento. @es
instruction number: 18.5
label: har agent, som er sponsor af værk @da
definition: Relaterer et værk til en agent, som sponsorerer et aspekt af et værk. @da
toolkit label: agent, som er sponsor af værk @da
toolkit definition: Agent, som sponsorerer et aspekt af et værk. @da
definition: Met une œuvre en relation avec un agent qui parraine un aspect quelconque d’une œuvre. @fr
label: có tập thể tài trợ @vi
definition: Liên kết tác phẩm với tác nhân tài trợ khía cạnh nào đó của tác phẩm như là hỗ trợ nghiên cứu hoặc tài trợ sự kiện. @vi
toolkit label: tập thể tài trợ @vi
toolkit definition: Tác nhân tài trợ khía cạnh nào đó của tác phẩm như là hỗ trợ nghiên cứu hoặc tài trợ sự kiện. @vi
label: hat Trägerin/Träger eines Werks (Akteur) @de
definition: Setzt ein Werk in Beziehung zu einem Akteur, der einzelne Aspekte eines Werks finanziell unterstützt. @de
toolkit label: Trägerin/Träger eines Werks (Akteur) @de
toolkit definition: Ein Akteur, der einzelne Aspekte eines Werks finanziell unterstützt. @de
label: a pour agent parraineur d’une œuvre @fr
definition: Liittää teoksen toimijaan, joka sponsoroi teosta. @fi
toolkit label: teoksen sponsori (toimija) @fi
toolkit definition: Toimija, joka sponsoroi teosta. @fi
toolkit label: sponsor for verk (agent) @no
toolkit definition: En agent som er sponsor for et aspekt ved et verk. @no
label: té com a agent patrocinador d’una obra @ca
definition: Relaciona una obra amb un agent que patrocina algun aspecte d’una obra. @ca
toolkit label: agent patrocinador d’una obra @ca
toolkit definition: Agent que patrocina algun aspecte d’una obra. @ca
has element type: 2
label: έχει φορέα επιχορήγησης @el
definition: Συνδέει ένα έργο με έναν φορέα που χρηματοδοτεί κάποια πτυχή ενός έργου, όπως μια επιδοτούμενη έρευνα ή χρηματοδότηση ενός συμβάντος. @el
toolkit label: φορέας επιχορήγησης @el
toolkit definition: Ένας φορέας που χρηματοδοτεί κάποια πτυχή ενός έργου, όπως επιδοτούμενη έρευνα ή χρηματοδότηση ενός συμβάντος. @el
label: mű szponzoráló ágense a következő: @hu
definition: Hozzákapcsol egy művet egy ágenshez, amely egy művet valamilyen tekintetben szponzorál. @hu
toolkit label: műszponzoráló ágens: @hu
toolkit definition: Egy ágens, amely egy művet valamilyen tekintetben szponzorál. @hu
scope note: Includes funding research and sponsoring an event that is the basis of a work.
alternative label: sponsoring body
scope note: Kattaa tutkimuksen rahoituksen ja teoksen perustana olevan tapahtuman sponsoroinnin. @fi
alternative label: sponsori @fi
label: teoksen sponsori (toimija) @fi
label: har sponsor for verk (agent) @no
definition: Relaterer et verk til en agent som er sponsor for et aspekt ved et verk. @no
scope note: Inkluderer finansiering av forskning og økonomisk støtte til et arrangement som er grunnlaget for et verk. @no
alternative label: sponsor @no
sub property of: has related agent of work
label: heeft sponsor van werk-actor @nl
definition: Relateert een werk aan een actor die enige aspecten van een werk sponsort. @nl
scope note: Omvat het financieren van onderzoek en het sponsoren van een evenement dat de basis vormt van een werk. @nl
toolkit label: sponsor van werk-actor @nl
toolkit definition: Een actor die enige aspecten van een werk sponsort. @nl
label: له وكيل راعٍ لعمل @ar
definition: يربط بين عمل ووكيل يرعى بعض جوانب عمل. @ar
scope note: يشمل تمويل البحث ورعاية حدث يمثل أساس عمل. @ar
alternative label: هيئة راعية @ar
toolkit label: وكيل راعٍ لعمل @ar
toolkit definition: وكيل يرعى بعض جوانب عمل. @ar
scope note: Inclou el finançament de la recerca i el patrocini d’un esdeveniment que és la base d’una obra. @ca
alternative label: entitat patrocinadora @ca
scope note: Omfatter finansiering af forskning og sponsorering af et arrangement, som er grundlag for et værk. @da
alternative label: sponsorerende institution @da
label: teose toetaja (tegija) @et
definition: Seostab teose tegijaga, kes mingil viisil majanduslikult toetab teose loomist. @et
scope note: Hõlmab ka uurimistöö rahastamist ja teose aluseks oleva ürituse majanduslikku toetamist. @et
alternative label: teose toetaja @et
toolkit label: teose toetaja (tegija) @et
toolkit definition: Tegija, kes mingil viisil majanduslikult toetab teose loomist. @et
scope note: Darunter fallen Forschungsförderungen und die finanzielle Unterstützung einer Veranstaltung, die die Grundlage eines Werks bilden. @de
alternative label: Sponsor @de
scope note: szponzor: @hu
alternative label: Egy mű alapját képező kutatás finanszírozása és esemény szponzorálása is idetartozik. @hu

has sponsoring collective agent of work
status: Published
lexical alias: sponsoringCollectiveAgentOfWork.en
definition: Relates a work to a collective agent who sponsors some aspect of a work.
scope note: Includes funding research and sponsoring an event that is the basis of a work.
toolkit label: sponsoring collective agent of work
toolkit definition: A collective agent who sponsors some aspect of a work.
type: Property
domain: C10001
sub property of: has sponsoring agent of work
has element type: 2
label: teoksen sponsori (yhteistoimija) @fi
definition: Liittää teoksen yhteistoimijaan, joka sponsoroi teosta. @fi
toolkit label: teoksen sponsori (yhteistoimija) @fi
toolkit definition: Yhteistoimija, joka sponsoroi teosta. @fi
scope note: Kattaa tutkimuksen rahoituksen ja teoksen perustana olevan tapahtuman sponsoroinnin. @fi
label: har sponsor for verk (kollektiv agent) @no
definition: Relaterer et verk til en kollektiv agent som er sponsor for et aspekt ved et verk. @no
scope note: Inkluderer finansiering av forskning og økonomisk støtte til et arrangement som er grunnlaget for et verk. @no
toolkit label: sponsor for verk (kollektiv agent) @no
toolkit definition: En kollektiv agent som er sponsor for et aspekt ved et verk. @no
sub property of: has related collective agent of work
label: heeft sponsor van werk-collectieve actor @nl
definition: Relateert een werk aan een collectieve actor die enige aspecten van een werk sponsort. @nl
scope note: Omvat het financieren van onderzoek en het sponsoren van een evenement dat de basis vormt van een werk. @nl
toolkit label: sponsor van werk-collectieve actor @nl
toolkit definition: Een collectieve actor die enige aspecten van een werk sponsort. @nl
label: له وكيل جماعي راعٍ لعمل @ar
definition: يربط بين عمل ووكيل جماعي يرعى بعض جوانب عمل. @ar
scope note: يشمل ذلك تمويل البحث ورعاية حدث يمثل أساس عمل. @ar
toolkit label: وكيل جماعي راعٍ لعمل @ar
toolkit definition: وكيل جماعي يرعى بعض جوانب عمل. @ar
label: té com a agent col·lectiu patrocinador d’una obra @ca
definition: Relaciona una obra amb un agent col·lectiu que patrocina algun aspecte d’una obra. @ca
scope note: Inclou el finançament de la recerca i el patrocini d’un esdeveniment que és la base d’una obra. @ca
toolkit label: agent col·lectiu patrocinador d’una obra @ca
toolkit definition: Agent col·lectiu que patrocina algun aspecte d’una obra. @ca
label: har kollektiv agent, som er sponsor af værk @da
definition: Relaterer et værk til en kollektiv agent, som sponsorerer et aspekt af et værk. @da
scope note: Omfatter finansiering af forskning og sponsorering af et arrangement, som danner grundlag for et værk. @da
toolkit label: kollektiv agent, som er sponsor af værk @da
toolkit definition: Kollektiv agent, som sponsorerer et aspekt af et værk. @da
label: teose toetaja (kollektiiv) @et
definition: Seostab teose kollektiiviga, kes mingil viisil majanduslikult toetab teose loomist. @et
scope note: Hõlmab ka uurimistöö rahastamist ja teose aluseks oleva ürituse majanduslikku toetamist. @et
toolkit label: teose toetaja (kollektiiv) @et
toolkit definition: Kollektiiv, kes mingil viisil majanduslikult toetab teose loomist. @et
label: hat Trägerin/Träger eines Werks (Gemeinschaftlicher Akteur) @de
definition: Setzt ein Werk in Beziehung zu einem gemeinschaftlichen Akteur, der einzelne Aspekte eines Werks finanziell unterstützt. @de
scope note: Darunter fallen Forschungsförderungen und die finanzielle Unterstützung einer Veranstaltung, die die Grundlage eines Werks bilden. @de
toolkit label: Trägerin/Träger eines Werks (Gemeinschaftlicher Akteur) @de
toolkit definition: Ein gemeinschaftlicher Akteur, der einzelne Aspekte eines Werks finanziell unterstützt. @de
label: mű szponzoráló kollektív ágense a következő: @hu
definition: Hozzákapcsol egy művet egy kollektív ágenshez, amely egy művet valamilyen tekintetben szponzorál. @hu
scope note: Egy mű alapját képező kutatás finanszírozása és esemény szponzorálása is idetartozik. @hu
toolkit label: műszponzoráló kollektív ágens: @hu
toolkit definition: Egy kollektív ágens, amely egy művet valamilyen tekintetben szponzorál. @hu
label: ha come sponsor agente collettivo di opera @it
definition: Correla un'opera a un agente collettivo che sponsorizza qualche aspetto di un'opera. @it
scope note: Comprende la ricerca di fondi e la sponsorizzazione di un evento, che è la base di un'opera. @it
toolkit label: sponsor gente collettivo di opera @it
toolkit definition: Agente collettivo che sponsorizza qualche aspetto di un'opera. @it
label: a pour agent collectif parraineur d’une œuvre @fr
definition: Met une œuvre en relation avec un agent collectif qui parraine un aspect quelconque d’une œuvre. @fr
scope note: Comprend le financement de la recherche et le parrainage d’un événement qui constitue la base d’une œuvre. @fr
toolkit label: agent collectif parraineur d’une œuvre @fr
toolkit definition: Agent collectif qui parraine un aspect quelconque d’une œuvre. @fr
label: darba sponsors (grupa) @lv
definition: Sasaista darbu ar grupu, kas sponsorē dažus darba aspektus. @lv
scope note: Ietver pētījumu finansēšanu un pasākuma sponsorēšanu, kas ir darba pamatā. @lv
toolkit label: darba sponsors (grupa) @lv
toolkit definition: Grupa, kas sponsorē dažus darba aspektus. @lv
label: 有作品的赞助集体行为者 @zh-hans
definition: 将一种作品与赞助一种作品某方面的一个集体行为者关联起来。 @zh-hans
scope note: 包括资助作为一种作品之基础的研究以及赞助作为一种作品之基础的一项活动。 @zh-hans
toolkit label: 作品的赞助集体行为者 @zh-hans
toolkit definition: 赞助一种作品某方面的一个集体行为者 @zh-hans
has subproperty: has sponsoring corporate body of work
has subproperty: has sponsoring family of work
has subproperty: P10604

has sponsoring corporate body of work
status: Published
lexical alias: sponsoringCorporateBodyOfWork.en
definition: Relates a work to a corporate body who sponsors some aspect of a work.
scope note: Includes funding research and sponsoring an event that is the basis of a work.
toolkit label: sponsoring corporate body of work
toolkit definition: A corporate body who sponsors some aspect of a work.
type: Property
domain: C10001
has element type: 2
sub property of: has sponsoring collective agent of work
label: teoksen sponsori (yhteisö) @fi
definition: Liittää teoksen yhteisöön, joka sponsoroi teosta. @fi
toolkit label: teoksen sponsori (yhteisö) @fi
toolkit definition: Yhteisö, joka sponsoroi teosta. @fi
scope note: Kattaa tutkimuksen rahoituksen ja teoksen perustana olevan tapahtuman sponsoroinnin. @fi
label: har sponsor for verk (korporasjon) @no
definition: Relaterer et verk til en korporasjon som er sponsor for et aspekt ved et verk. @no
scope note: Inkluderer finansiering av forskning og økonomisk støtte til et arrangement som er grunnlaget for et verk. @no
toolkit label: sponsor for verk (korporasjon) @no
toolkit definition: En korporasjon som er sponsor for et aspekt ved et verk. @no
sub property of: has related corporate body of work
label: heeft sponsor van werk-corporatie @nl
definition: Relateert een werk aan een corporatie die enige aspecten van een werk sponsort. @nl
scope note: Omvat het financieren van onderzoek en het sponsoren van een evenement dat de basis vormt van een werk. @nl
toolkit label: sponsor van werk-corporatie @nl
toolkit definition: Een corporatie die enige aspecten van een werk sponsort. @nl
label: له هيئة راعية لعمل @ar
definition: يربط بين عمل وهيئة ترعى بعض جوانب عمل. @ar
scope note: يشمل ذلك تمويل البحث ورعاية حدث يمثل أساس عمل. @ar
toolkit label: هيئة راعية لعمل @ar
toolkit definition: هيئة ترعى بعض جوانب عمل. @ar
label: té com a entitat corporativa patrocinadora d’una obra @ca
definition: Relaciona una obra amb una entitat corporativa que patrocina algun aspecte d’una obra. @ca
scope note: Inclou el finançament de la recerca i el patrocini d’un esdeveniment que és la base d’una obra. @ca
toolkit label: entitat corporativa patrocinadora d’una obra @ca
toolkit definition: Entitat corporativa que patrocina algun aspecte d’una obra. @ca
label: har korporation, som er sponsor af værk @da
definition: Relaterer et værk til en korporation, som sponsorerer et aspekt af et værk. @da
scope note: Omfatter finansiering af forskning og sponsorering af et arrangement, som danner grundlag for et værk. @da
toolkit label: korporation, som er sponsor af værk @da
toolkit definition: Korporation, som sponsorerer et aspekt af et værk. @da
label: teose toetaja (asutus) @et
definition: Seostab teose asutusega, kes mingil viisil majanduslikult toetab teose loomist. @et
scope note: Hõlmab ka uurimistöö rahastamist ja teose aluseks oleva ürituse majanduslikku toetamist. @et
toolkit label: teose toetaja (asutus) @et
toolkit definition: Asutus, kes mingil viisil majanduslikult toetab teose loomist. @et
label: hat Trägerin/Träger eines Werks (Körperschaft) @de
definition: Setzt ein Werk in Beziehung zu einer Körperschaft, die einzelne Aspekte eines Werks finanziell unterstützt. @de
scope note: Darunter fallen Forschungsförderungen und die finanzielle Unterstützung einer Veranstaltung, die die Grundlage eines Werks bilden. @de
toolkit label: Trägerin/Träger eines Werks (Körperschaft) @de
toolkit definition: Eine Körperschaft, die einzelne Aspekte eines Werks finanziell unterstützt. @de
label: mű szponzoráló testülete a következő: @hu
definition: Hozzákapcsol egy művet egy testülethez, amely egy művet valamilyen tekintetben szponzorál. @hu
scope note: Egy mű alapját képező kutatás finanszírozása és esemény szponzorálása is idetartozik. @hu
toolkit label: műszponzoráló testület: @hu
toolkit definition: Egy testület, amely egy művet valamilyen tekintetben szponzorál. @hu
label: ha come sponsor ente di opera @it
definition: Correla un'opera a un ente che sponsorizza qualche aspetto di un'opera. @it
scope note: Comprende la ricerca di fondi e la sponsorizzazione di un evento, che è la base di un'opera. @it
toolkit label: sponsor ente di opera @it
toolkit definition: Ente che sponsorizza qualche aspetto di un'opera. @it
label: a pour collectivité parraineuse d’une œuvre @fr
definition: Met une œuvre en relation avec une collectivité qui parraine un aspect quelconque d’une œuvre. @fr
scope note: Comprend le financement de la recherche et le parrainage d’un événement qui constitue la base d’une œuvre. @fr
toolkit label: collectivité parraineuse d’une œuvre @fr
toolkit definition: Collectivité qui parraine un aspect quelconque d’une œuvre. @fr
label: darba sponsors (institūcija) @lv
definition: Sasaista darbu ar institūciju, kas sponsorē dažus darba aspektus. @lv
scope note: Ietver pētījumu finansēšanu un pasākuma sponsorēšanu, kas ir darba pamatā. @lv
toolkit label: darba sponsors (institūcija) @lv
toolkit definition: Institūcija, kas sponsorē dažus darba aspektus. @lv
label: 有作品的赞助团体 @zh-hans
definition: 将一种作品与赞助一种作品某方面的一个团体关联起来。 @zh-hans
scope note: 包括资助作为一种作品之基础的研究以及赞助作为一种作品之基础的一项活动。 @zh-hans
toolkit label: 作品的赞助团体 @zh-hans
toolkit definition: 赞助一种作品某方面的一个团体 @zh-hans
has subproperty: P10605
label: eserin sponsoru olan tüzel kişi ile ilişkilidir @tr
definition: Bir eseri, bir eserin bazı yönlerine sponsor olan tüzel kişi ile ilişkilendirir. @tr

has sponsoring family of work
status: Published
lexical alias: sponsoringFamilyOfWork.en
definition: Relates a work to a family who sponsors some aspect of a work.
scope note: Includes funding research and sponsoring an event that is the basis of a work.
toolkit label: sponsoring family of work
toolkit definition: A family who sponsors some aspect of a work.
type: Property
domain: C10001
has element type: 2
sub property of: has sponsoring collective agent of work
label: teoksen sponsori (suku) @fi
definition: Liittää teoksen sukuun, joka sponsoroi teosta. @fi
toolkit label: teoksen sponsori (suku) @fi
toolkit definition: Suku, joka sponsoroi teosta. @fi
scope note: Kattaa tutkimuksen rahoituksen ja teoksen perustana olevan tapahtuman sponsoroinnin. @fi
label: har sponsor for verk (familie) @no
definition: Relaterer et verk til en familie som er sponsor for et aspekt ved et verk. @no
scope note: Inkluderer finansiering av forskning og økonomisk støtte til et arrangement som er grunnlaget for et verk. @no
toolkit label: sponsor for verk (familie) @no
toolkit definition: En familie som er sponsor for et aspekt ved et verk. @no
sub property of: has related family of work
label: heeft sponsor van werk-familie @nl
definition: Relateert een werk aan een familie die enige aspecten van een werk sponsort. @nl
scope note: Omvat het financieren van onderzoek en het sponsoren van een evenement dat de basis vormt van een werk. @nl
toolkit label: sponsor van werk-familie @nl
toolkit definition: Een familie die enige aspecten van een werk sponsort. @nl
label: له عائلة راعية لعمل @ar
definition: يربط بين عمل وعائلة ترعى بعض جوانب عمل. @ar
scope note: يشمل ذلك تمويل البحث ورعاية حدث يمثل أساس عمل. @ar
toolkit label: عائلة راعية لعمل @ar
toolkit definition: عائلة ترعى بعض جوانب عمل. @ar
label: té com a família patrocinadora d’una obra @ca
definition: Relaciona una obra amb una família que patrocina algun aspecte d’una obra. @ca
scope note: Inclou el finançament de la recerca i el patrocini d’un esdeveniment que és la base d’una obra. @ca
toolkit label: família patrocinadora d’una obra @ca
toolkit definition: Família que patrocina algun aspecte d’una obra. @ca
label: har familie, som er sponsor af værk @da
definition: Relaterer et værk til en familie, som sponsorerer et aspekt af et værk. @da
scope note: Omfatter finansiering af forskning og sponsorering af et arrangement, som danner grundlag for et værk. @da
toolkit label: familie, som er sponsor af værk @da
toolkit definition: Familie, som sponsorerer et aspekt af et værk. @da
label: teose toetaja (perekond) @et
definition: Seostab teose perekonnaga, kes mingil viisil majanduslikult toetab teose loomist. @et
scope note: Hõlmab ka uurimistöö rahastamist ja teose aluseks oleva ürituse majanduslikku toetamist. @et
toolkit label: teose toetaja (perekond) @et
toolkit definition: Perekond, kes mingil viisil majanduslikult toetab teose loomist. @et
label: hat Trägerin/Träger eines Werks (Familie) @de
definition: Setzt ein Werk in Beziehung zu einer Familie, die einzelne Aspekte eines Werks finanziell unterstützt. @de
scope note: Darunter fallen Forschungsförderungen und die finanzielle Unterstützung einer Veranstaltung, die die Grundlage eines Werks bilden. @de
toolkit label: Trägerin/Träger eines Werks (Familie) @de
toolkit definition: Eine Familie, die einzelne Aspekte eines Werks finanziell unterstützt. @de
label: mű szponzoráló családja a következő: @hu
definition: Hozzákapcsol egy művet egy családhoz, amely egy művet valamilyen tekintetben szponzorál. @hu
scope note: Egy mű alapját képező kutatás finanszírozása és esemény szponzorálása is idetartozik. @hu
toolkit label: műszponzoráló család: @hu
toolkit definition: Egy család, amely egy művet valamilyen tekintetben szponzorál. @hu
label: ha come sponsor famiglia di opera @it
definition: Correla un'opera a una famiglia che sponsorizza qualche aspetto di un'opera. @it
scope note: Comprende la ricerca di fondi e la sponsorizzazione di un evento, che è la base di un'opera. @it
toolkit label: sponsor famiglia di opera @it
toolkit definition: Famiglia che sponsorizza qualche aspetto di un'opera. @it
label: a pour famille parraineuse d’une œuvre @fr
definition: Met une œuvre en relation avec une famille qui parraine un aspect quelconque d’une œuvre. @fr
scope note: Comprend le financement de la recherche et le parrainage d’un événement qui constitue la base d’une œuvre. @fr
toolkit label: famille parraineuse d’une œuvre @fr
toolkit definition: Famille qui parraine un aspect quelconque d’une œuvre. @fr
label: darba sponsors (dzimta/ģimene @lv
definition: Sasaista darbu ar dzimtu/ģimeni, kas sponsorē dažus darba aspektus. @lv
scope note: Ietver pētījumu finansēšanu un pasākuma sponsorēšanu, kas ir darba pamatā. @lv
toolkit label: darba sponsors (dzimta/ģimene @lv
toolkit definition: Dzimta/ģimene, kas sponsorē dažus darba aspektus. @lv
label: 有作品的赞助家族 @zh-hans
definition: 将一种作品与赞助一种作品某方面的一个家族关联起来。 @zh-hans
scope note: 包括资助作为一种作品之基础的研究以及赞助作为一种作品之基础的一项活动。 @zh-hans
toolkit label: 作品的赞助家族 @zh-hans
toolkit definition: 赞助一种作品某方面的一个家族 @zh-hans
has subproperty: P10606
label: eserin sponsoru olan aile ile ilişkilidir @tr
definition: Bir eseri, bir eserin bazı yönlerine sponsor olan bir aileyle ilişkilendirir. @tr

has sponsoring person of work
status: Published
lexical alias: sponsoringPersonOfWork.en
definition: Relates a work to a person who sponsors some aspect of a work.
scope note: Includes funding research and sponsoring an event that is the basis of a work.
toolkit label: sponsoring person of work
toolkit definition: A person who sponsors some aspect of a work.
type: Property
domain: C10001
sub property of: has sponsoring agent of work
has element type: 2
label: teoksen sponsori (henkilö) @fi
definition: Liittää teoksen henkilöön, joka sponsoroi teosta. @fi
toolkit label: teoksen sponsori (henkilö) @fi
toolkit definition: Henkilö, joka sponsoroi teosta. @fi
scope note: Kattaa tutkimuksen rahoituksen ja teoksen perustana olevan tapahtuman sponsoroinnin. @fi
label: har sponsor for verk (person) @no
definition: Relaterer et verk til en person som er sponsor for et aspekt ved et verk. @no
scope note: Inkluderer finansiering av forskning og økonomisk støtte til et arrangement som er grunnlaget for et verk. @no
toolkit label: sponsor for verk (person) @no
toolkit definition: En person som er sponsor for et aspekt ved et verk. @no
sub property of: has related person of work
label: heeft sponsor van werk-persoon @nl
definition: Relateert een werk aan een persoon die enige aspecten van een werk sponsort. @nl
scope note: Omvat het financieren van onderzoek en het sponsoren van een evenement dat de basis vormt van een werk. @nl
toolkit label: sponsor van werk-persoon @nl
toolkit definition: Een persoon die enige aspecten van een werk sponsort. @nl
label: له شخص راعٍ لعمل @ar
definition: يربط بين عمل وشخص يرعى بعض جوانب عمل. @ar
scope note: يشمل ذلك تمويل البحث ورعاية حدث يمثل أساس عمل. @ar
toolkit label: له شخص راعٍ لعمل @ar
toolkit definition: شخص يرعى بعض جوانب عمل. @ar
label: té com a persona patrocinadora d’una obra @ca
definition: Relaciona una obra amb una persona que patrocina algun aspecte d’una obra. @ca
scope note: Inclou el finançament de la recerca i el patrocini d’un esdeveniment que és la base d’una obra. @ca
toolkit label: persona patrocinadora d’una obra @ca
toolkit definition: Persona que patrocina algun aspecte d’una obra. @ca
label: har person, som er sponsor af værk @da
definition: Relaterer et værk til en person, som sponsorerer et aspekt af et værk. @da
scope note: Omfatter finansiering af forskning og sponsorering af et arrangement, som danner grundlag for et værk. @da
toolkit label: person, som er sponsor af værk @da
toolkit definition: Person, som sponsorerer et aspekt af et værk. @da
label: teose toetaja (isik) @et
definition: Seostab teose isikuga, kes mingil viisil majanduslikult toetab teose loomist. @et
scope note: Hõlmab ka uurimistöö rahastamist ja teose aluseks oleva ürituse majanduslikku toetamist. @et
toolkit label: teose toetaja (isik) @et
toolkit definition: Isik, kes mingil viisil majanduslikult toetab teose loomist. @et
label: hat Trägerin/Träger eines Werks (Person) @de
definition: Setzt ein Werk in Beziehung zu einer Person, die einzelne Aspekte eines Werks finanziell unterstützt. @de
scope note: Darunter fallen Forschungsförderungen und die finanzielle Unterstützung einer Veranstaltung, die die Grundlage eines Werks bilden. @de
toolkit label: Trägerin/Träger eines Werks (Person) @de
toolkit definition: Eine Person, die einzelne Aspekte eines Werks finanziell unterstützt. @de
label: mű szponzoráló személye a következő: @hu
definition: Hozzákapcsol egy művet egy személyhez, aki egy művet valamilyen tekintetben szponzorál. @hu
scope note: Egy mű alapját képező kutatás finanszírozása és esemény szponzorálása is idetartozik. @hu
toolkit label: műszponzoráló személy: @hu
toolkit definition: Egy személy, aki egy művet valamilyen tekintetben szponzorál. @hu
label: ha come sponsor persona di opera @it
definition: Correla un'opera a una persona che sponsorizza qualche aspetto di un'opera. @it
scope note: Comprende la ricerca di fondi e la sponsorizzazione di un evento, che è la base di un'opera. @it
toolkit label: sponsor persona di opera @it
toolkit definition: Persona che sponsorizza qualche aspetto di un'opera. @it
label: a pour personne parraineuse d’une œuvre @fr
definition: Met une œuvre en relation avec une personne qui parraine un aspect quelconque d’une œuvre. @fr
scope note: Comprend le financement de la recherche et le parrainage d’un événement qui constitue la base d’une œuvre. @fr
toolkit label: personne parraineuse d’une œuvre @fr
toolkit definition: Personne qui parraine un aspect quelconque d’une œuvre. @fr
label: darba sponsors (persona) @lv
definition: Sasaista darbu ar personu, kura sponsorē dažus darba aspektus. @lv
scope note: Ietver pētījumu finansēšanu un pasākuma sponsorēšanu, kas ir darba pamatā. @lv
toolkit label: darba sponsors (persona) @lv
toolkit definition: Persona, kura sponsorē dažus darba aspektus. @lv
label: 有作品的赞助个人 @zh-hans
definition: 将一种作品与赞助一种作品某方面的一个个人关联起来。 @zh-hans
scope note: 包括资助作为一种作品之基础的研究以及赞助作为一种作品之基础的一项活动。 @zh-hans
toolkit label: 作品的赞助个人 @zh-hans
toolkit definition: 赞助一种作品某方面的一个个人 @zh-hans
has subproperty: P10607
label: eserin sponsoru olan kişi ile ilişkilidir @tr
definition: Bir eseri, eserin bazı yönlerine sponsor olan bir kişiyle ilişkilendirir. @tr

has static version
status: Published
lexical alias: staticVersion.en
definition: Relates a work to a work that is created by changing the extension plan of a work from integrating to static.
toolkit label: static version
toolkit definition: A work that is created by changing the extension plan of a work from integrating to static.
type: Property
domain: C10001
sub property of: has transformation by extension plan
has element type: 2
label: staattinen versio @fi
definition: Liittää teoksen teokseen, joka on luotu muuttamalla teoksen laajennussuunnitelmaa päivittyvästä staattiseksi. @fi
toolkit label: staattinen versio @fi
toolkit definition: Teos, joka on luotu muuttamalla teoksen laajennussuunnitelmaa päivittyvästä staattiseksi. @fi
label: har statisk versjon @no
definition: Relaterer et verk til et verk som er skapt ved endring av utvidelsesplan for et verk fra integrerende til statisk. @no
toolkit label: statisk versjon @no
toolkit definition: Et verk som er skapt ved endring av utvidelsesplan for et verk fra integrerende til statisk. @no
label: heeft statische versie @nl
definition: Relateert een werk aan een werk dat gevormd is door het veranderen van een extensieplan van geïntegreerd naar statisch. @nl
toolkit label: statische versie @nl
toolkit definition: Een werk dat gevormd is door het veranderen van een extensieplan van geïntegreerd naar statisch. @nl
label: له إصدارة ثابتة @ar
definition: يربط عمل بعمل يتم إنشاؤه عن طريق تغيير خطة توسع لعمل من متكامل إلى ثابت. @ar
toolkit label: إصدارة ثابتة @ar
toolkit definition: عمل يتم إنشاؤه عن طريق تغيير خطة توسع لعمل من متكامل إلى ثابت. @ar
label: té com a versió estàtica @ca
definition: Relaciona una obra amb una obra que es crea canviant el pla d’extensió d’una obra d’integrant a estàtic. @ca
toolkit label: versió estàtica @ca
toolkit definition: Obra que es crea canviant el pla d’extensió d’una obra d’integrant a estàtic. @ca
label: har statisk version @da
definition: Relaterer et værk til et værk, som er skabt ved at ændre udvidelsesplanen for et værk fra integrerende til statisk. @da
toolkit label: statisk version @da
toolkit definition: Værk, som er skabt ved at ændre udvidelsesplanen for et værk fra integrerende til statisk. @da
label: staatiline versioon @et
definition: Seostab teose teosega, mis on loodud, muutes teose jätkamiskava järjestikusest staatiliseks. @et
toolkit label: staatiline versioon @et
toolkit definition: Teos, mis on loodud, muutes teose jätkamiskava järjestikusest staatiliseks. @et
label: hat statische Version @de
definition: Setzt ein Werk in Beziehung zu einem Werk, das durch Änderung des Erweiterungsplans eines Werks von integrierend auf statisch erstellt wird. @de
toolkit label: Statische Version @de
toolkit definition: Ein Werk, das durch Änderung des Erweiterungsplans eines Werks von integrierend auf statisch erstellt wird. @de
label: statikus változata a következő: @hu
definition: Hozzákapcsol egy művet egy műhöz, amely egy mű közlési tervének integrálóról statikussá való változásával jött létre. @hu
toolkit label: statikus változata: @hu
toolkit definition: Egy mű, amely egy mű közlési tervének integrálóról folyamatossá való változásával jött létre. @hu
label: ha come versione statica @it
definition: Correla un'opera a un'opera creata cambiando il piano di estensione di un'opera da integrativo a statico. @it
toolkit label: versione statica @it
toolkit definition: Opera creata cambiando il piano di estensione di un'opera da integrativo a statico. @it
label: a pour version statique @fr
definition: Met une œuvre en relation avec une œuvre qui est créée en modifiant le plan d’extension intégrateur d’une œuvre en plan statique. @fr
toolkit label: version statique @fr
toolkit definition: Œuvre qui est créée en modifiant le plan d’extension intégrateur d’une œuvre en plan statique. @fr
label: statiska versija @lv
definition: Sasaista darbu ar darbu, kas radīts, mainot darba paplašināšanas plānu no integrētā uz statisku. @lv
toolkit label: statiska versija @lv
toolkit definition: Darbs, kas radīts, mainot darba paplašināšanas plānu no integrētā uz statisku. @lv
label: 有静态版本 @zh-hans
definition: 将一种作品与通过将一种作品的扩充计划从集成性到静态变化而被创建的一种作品关联起来。 @zh-hans
toolkit label: 静态版本 @zh-hans
toolkit definition: 通过将一种作品的扩充计划从集成性到静态变化而被创建的一种作品 @zh-hans
has subproperty: P10382
label: durağan sürüm ile ilişkilidir @tr
definition: Bir eseri, bir eserin genişletme planı birleştiriciden durağan hale değiştirilerek oluşturulan bir eserle ilişkilendirir. @tr
toolkit label: durağan sürüm @tr
toolkit definition: Bir eserin genişletme planının bütünleştiriciden durağana değiştirilmesiyle oluşturulan eser. @tr

is static version of
status: Published
lexical alias: staticVersionOf.en
definition: Relates a work to a work that has an extension plan that is changed from static to integrating to create a work.
toolkit label: static version of
toolkit definition: A work that has an extension plan that is changed from static to integrating to create a work.
type: Property
domain: C10001
sub property of: is transformation by extension plan of
has element type: 2
label: staattinen versio teoksesta @fi
definition: Liittää teoksen teokseen, jolla on laajennussuunnitelma, joka on muutettu staattisesta päivittyväksi teoksen luomiseksi. @fi
toolkit label: staattinen versio teoksesta @fi
toolkit definition: Teos, jolla on laajennussuunnitelma, joka on muutettu staattisesta päivittyväksi teoksen luomiseksi. @fi
label: er statisk versjon av @no
definition: Relaterer et verk til et verk som har en utvidelsesplan som er endret fra statisk til integrerende for å skape et verk. @no
toolkit label: statisk versjon av @no
toolkit definition: Et verk som har en utvidelsesplan som er endret fra statisk til integrerende for å skape et verk. @no
label: is statische versie van @nl
definition: Relateert een werk aan een werk dat een extensieplan heeft dat is veranderd van statisch naar geïntegreerd om een nieuw werk te vormen. @nl
toolkit label: statische versie van @nl
toolkit definition: Een werk dat een extensieplan heeft dat is veranderd van statisch naar geïntegreerd om een nieuw werk te vormen. @nl
label: هو إصدارة ثابتة لـ @ar
definition: يربط عمل بعمل يحتوي على خطة توسع تم تغييرها من ثابت إلى متكامل لإنشاء عمل. @ar
toolkit label: إصدارة ثابتة لـ @ar
toolkit definition: عمل يحتوي على خطة توسع تم تغييرها من ثابت إلى متكامل لإنشاء عمل. @ar
label: és versió estàtica de @ca
definition: Relaciona una obra amb una obra que té un pla d’extensió que es canvia d’estàtic a integrant per crear una obra. @ca
toolkit label: versió estàtica de @ca
toolkit definition: Obra que té un pla d’extensió que es canvia d’estàtic a integrant per crear una obra. @ca
label: er statisk version af @da
definition: Relaterer et værk til et værk, som har en udvidelsesplan, som, for at skabe et værk, ændres fra statisk til integrerende. @da
toolkit label: statisk version af @da
toolkit definition: Værk, som har en udvidelsesplan, som, for at skabe et værk, ændres fra statisk til integrerende. @da
label: staatiline versioon teosest @et
definition: Seostab teose teosega, mille jätkamiskava on teose loomiseks muudetud staatilisest täienevaks. @et
toolkit label: staatiline versioon teosest @et
toolkit definition: Teos, mille jätkamiskava on teose loomiseks muudetud staatilisest täienevaks. @et
label: ist statische Version von @de
definition: Setzt ein Werk in Beziehung zu einem Werk, dessen Erweiterungsplan von statisch auf integrierend geändert wird, um ein Werk zu schaffen. @de
toolkit label: Statische Version von @de
toolkit definition: Ein Werk, dessen Erweiterungsplan von statisch auf integrierend geändert wird, um ein Werk zu schaffen. @de
label: statikus változata a következőnek: @hu
definition: Hozzákapcsol egy művet egy műhöz, amelynek a közlési terve statikusról integrálóvá változott egy mű létrejövetele érdekében. @hu
toolkit label: statikus változata: @hu
toolkit definition: Egy mű, amelynek a közlési terve statikusról integrálóvá változott egy mű létrejövetele érdekében. @hu
label: è versione statica di @it
definition: Correla un'opera a un'opera che ha un piano di estensione cambiato da statico a integrato per creare un'opera. @it
toolkit label: versione statica di @it
toolkit definition: Opera che ha un piano di estensione cambiato da statico a integrato per creare un'opera. @it
label: est une version statique de @fr
definition: Met une œuvre en relation avec une œuvre dont le plan d’extension statique est modifié en plan intégrateur pour créer une œuvre. @fr
toolkit label: version statique de @fr
toolkit definition: Œuvre dont le plan d’extension statique est modifié en plan intégrateur pour créer une œuvre. @fr
label: ir statiska versija no @lv
definition: Sasaista darbu ar darbu, kam ir paplašināšanas plāns, kas ticis mainīts no statiskā uz integrēto, lai radītu darbu. @lv
toolkit label: statiska versija no @lv
toolkit definition: Darbs, kam ir paplašināšanas plāns, kas ticis mainīts no statiskā uz integrēto, lai radītu darbu @lv
label: 是……的静态版本 @zh-hans
definition: 将一种作品与有扩充计划并被从静态改变为集成性以创建一种作品的一种作品关联起来。 @zh-hans
toolkit label: ……的静态版本 @zh-hans
toolkit definition: 有扩充计划并被从静态改变为集成性以创建一种作品的一种作品 @zh-hans
has subproperty: P10392
label: Sabit sürümüdür @tr
definition: Bir eseri, bir eser oluşturmak için durağandan ardışığa değiştirilen bir genişletme planına sahip bir eser ile ilişkilendirir. @tr
toolkit label: durağan sürüm @tr
toolkit definition: Bir eser oluşturmak için statikten bütünleştiriciye değiştirilen bir uzatma planına sahip bir eser @tr

has subject RDA entity
status: Published
type: Property
lexical alias: subjectRDAEntity.en
definition: Relates a work to an RDA entity that a work is about.
domain: C10001
label: har RDA-entitet, som er subjekt @da
definition: Relaterer et værk til en RDA-entitet, som et værk handler om. @da
label: có chủ đề (thực thể) @vi
definition: Liên kết tác phẩm với thực thể mà tác phẩm nói về. @vi
toolkit definition: Thực thể mà tác phẩm nói về. @vi
definition: Liittää teoksen RDA-entiteettiin, jota teos koskee. @fi
toolkit label: aiheena oleva RDA-entiteetti @fi
toolkit definition: RDA-entiteetti, jota teos koskee. @fi
label: té com a entitat RDA de matèria @ca
definition: Relaciona una obra amb una entitat RDA sobre la qual tracta una obra. @ca
label: a pour entité RDA sujet @fr
definition: Met une œuvre en relation avec un entité RDA dont traite une œuvre. @fr
toolkit label: subject RDA entity
toolkit definition: An RDA entity that a work is about.
sub property of: has related RDA entity of work
has element type: 2
sub property of: has subject
label: έχει θέμα (οντότητα) @el
definition: Συνδέει ένα έργο με μια οντότητα στην οποία αναφέρεται ένα έργο. @el
label: tárgya a következő entitás: @hu
definition: Hozzákapcsol egy művet egy RDA-entitáshoz, amelyről egy mű szól. @hu
label: aiheena oleva RDA-entiteetti @fi
label: har emne RDA-entitet @no
definition: Relaterer et verk til en RDA-entitet som et verk handler om. @no
toolkit label: emne RDA-entitet @no
toolkit definition: En RDA-entitet som et verk handler om. @no
label: heeft RDA-entiteit als onderwerp @nl
definition: Relateert een werk aan een RDA-entiteit waar een werk over gaat. @nl
toolkit label: RDA-entiteit als onderwerp @nl
toolkit definition: Een RDA-entiteit waar een werk over gaat. @nl
label: له كيان "وام" موضوع @ar
definition: يربط بين عمل وكيان "وام" يدور حوله عمل. @ar
toolkit label: كيان "وام" موضوع @ar
toolkit definition: كيان "وام" يدور حوله عمل. @ar
toolkit label: entitat RDA de matèria @ca
toolkit definition: Entitat RDA sobre la qual tracta una obra. @ca
toolkit label: RDA-entitet, som er subjekt @da
toolkit definition: RDA-entitet, som et værk handler om. @da
label: teema (RDA olem) @et
definition: Seostab teose RDA olemiga, mille kohta teos on. @et
toolkit label: teema (RDA olem) @et
toolkit definition: RDA olem, mille kohta teos on. @et
label: hat Thema (RDA-Entität) @de
definition: Setzt ein Werk in Beziehung zu einer RDA-Entität, von der ein Werk handelt. @de
toolkit label: Thema (RDA-Entität) @de
toolkit definition: Eine RDA-Entität, von der ein Werk handelt. @de
toolkit label: tárgyalt entitás: @hu
toolkit definition: Egy RDA-entitás, amelyről egy mű szól. @hu
label: ha come soggetto entità RDA @it
definition: Correla un'opera con un'entità RDA di cui l'opera tratta. @it
toolkit label: soggetto entità RDA @it
toolkit definition: Entità RDA di cui l'opera tratta. @it
toolkit label: entité RDA sujet @fr
toolkit definition: Entité RDA dont traite une œuvre. @fr
label: temats (RDA entīte) @lv
definition: Sasaista darbu ar RDA entīti, par kuru ir darbs. @lv
toolkit label: temats (RDA entīte) @lv
toolkit definition: RDA entīte, par kuru ir darbs. @lv
label: 有主题RDA实体 @zh-hans
definition: 将一种作品与一种作品所关于的一个RDA实体关联起来。 @zh-hans
toolkit label: 主题RDA实体 @zh-hans
toolkit definition: 一种作品所关于的一个RDA实体 @zh-hans
has subproperty: is description of RDA entity
has subproperty: is evaluation of RDA entity
has subproperty: has subject agent
has subproperty: has subject place
has subproperty: has subject timespan
has subproperty: has subject expression
has subproperty: has subject manifestation
has subproperty: has subject work
has subproperty: has subject nomen
has subproperty: has subject item
has subproperty: P10324
label: konu alınan RDA varlığı ile ilişkilidir @tr

has derivative work
status: Published
definition: Relates a work to a work that is a modification of another work.
type: Property
domain: C10001
sub property of: has transformation by genre
lexical alias: derivativeWork.en
toolkit label: derivative work
toolkit definition: A work that is a modification of another work.
toolkit label: œuvre dérivée @fr
toolkit definition: Œuvre qui est une modification d’une autre œuvre. @fr
toolkit label: obra derivada @es
toolkit definition: Una obra que es una modificación de una obra fuente. @es
instruction number: 24.5
label: har afledt værk @da
definition: Relaterer et værk til et værk, som er en tilpasning af et andet værk. @da
toolkit label: afledt værk @da
toolkit definition: Værk, som er en tilpasning af et andet værk. @da
definition: Met une œuvre en relation avec une œuvre qui est une modification d’une autre œuvre. @fr
label: là dẫn xuất (tác phẩm) @vi
definition: Liên kết tác phẩm với tác phẩm là sửa đổi của tác phẩm nguồn. @vi
toolkit label: dẫn xuất (tác phẩm) @vi
toolkit definition: Tác phẩm là sửa đổi của tác phẩm nguồn. @vi
label: hat abgeleitetes Werk @de
definition: Setzt ein Werk in Beziehung zu einem Werk, das eine Variante eines anderen Werks darstellt. @de
toolkit label: Abgeleitetes Werk @de
toolkit definition: Ein Werk, das eine Variante eines anderen Werks darstellt. @de
label: a pour œuvre dérivée @fr
definition: Liittää teoksen teokseen, joka on toisen teoksen muunnos. @fi
toolkit label: johdannaisteos @fi
toolkit definition: Teos, joka on toisen teoksen muunnos. @fi
toolkit label: avledet verk @no
toolkit definition: Et verk som er en endring av et annet verk. @no
label: té com a obra derivada @ca
definition: Relaciona una obra amb una obra que és una modificació d’una altra obra. @ca
toolkit definition: Obra que és una modificació d’una altra obra. @ca
has element type: 2
label: είναι παράγωγο (έργο) @el
definition: Συνδέει ένα έργο με ένα έργο το οποίο συνιστά τροποποίηση ενός έργου-πηγής. @el
toolkit label: παράγωγο (έργο) @el
toolkit definition: Ένα έργο το οποίο συνιστά τροποποίηση ενός έργου-πηγής. @el
label: származékos műve a következő: @hu
definition: Hozzákapcsol egy művet egy műhöz, amely egy másik mű módosítása. @hu
toolkit label: származékmű @hu
toolkit definition: Egy mű, amely egy másik mű módosítása. @hu
label: johdannaisteos @fi
label: har avledet verk @no
definition: Relaterer et verk til et verk som er en endring av et annet verk. @no
label: heeft afgeleid werk @nl
definition: Relateert een werk aan een werk dat is een aanpassing van een ander werk. @nl
toolkit label: afgeleid werk @nl
toolkit definition: Een werk dat is een aanpassing van een ander werk. @nl
label: له عمل مشتق @ar
definition: يربط عمل بعمل عبارة عن تعديل لعمل آخر. @ar
toolkit label: عمل مشتق @ar
toolkit definition: عمل عبارة عن تعديل لعمل آخر. @ar
label: tuletatud teos @et
definition: Seostab teose teosega, mis on teise teose teisendus. @et
toolkit label: tuletatud teos @et
toolkit definition: Teos, mis on teise teose teisendus. @et
label: ha come opera derivata @it
definition: Correla un'opera a un'opera che è una modifica di un'altra opera. @it
toolkit label: opera derivata @it
toolkit definition: Opera che è una modifica di un'altra opera. @it
label: atvasinātais darbs @lv
definition: Sasaista darbu ar darbu, kas ir pamatdarba modifikācija. @lv
toolkit label: atvasinātais darbs @lv
toolkit definition: Darbs, kas ir pamatdarba modifikācija. @lv
label: 有衍生作品 @zh-hans
definition: 将一种作品与作为另一种作品之修改的一种作品关联起来。 @zh-hans
toolkit label: 衍生作品 @zh-hans
toolkit definition: 作为另一种作品之修改的一种作品 @zh-hans
has subproperty: is indexed in work (Deprecated)
has subproperty: is abstracted in work
has subproperty: is adapted as work
has subproperty: is expanded as work
has subproperty: is digested as work
has subproperty: is abridged as work
has subproperty: is set to music as work
has subproperty: is modified by variation as work

has latitude
status: Published
type: Property
lexical alias: latitude.en
definition: Relates a work to the distance of a place on a planet or satellite that is measured north and south from the equator.
domain: C10001
toolkit label: latitude
toolkit definition: The distance of a place on a planet or satellite that is measured north and south from the equator.
instruction number: 7.4.2
label: har breddegrad @da
definition: Relaterer et værk til en afstand fra et punkt på en planet eller satellit målt nord og syd fra ækvator. @da
toolkit label: breddegrad @da
toolkit definition: Afstand fra et punkt på en planet eller satellit målt nord og syd fra ækvator. @da
label: có vĩ độ @vi
definition: Liên kết tác phẩm với khoảng cách của một điểm trên hành tinh hoặc vệ tinh được đo theo hướng bắc và nam từ xích đạo. @vi
toolkit label: vĩ độ @vi
toolkit definition: Khoảng cách của một điểm trên hành tinh hoặc vệ tinh được đo theo hướng bắc và nam từ xích đạo. @vi
label: hat Breitengrad @de
definition: Setzt ein Werk in Beziehung zu einer Entfernung eines Gebiets auf einem Planeten oder Satelliten, das nördlich oder südlich vom Äquator gemessen wird. @de
toolkit label: Breitengrad @de
toolkit definition: Die Entfernung eines Gebiets auf einem Planeten oder Satelliten, das nördlich oder südlich vom Äquator gemessen wird. @de
definition: Liittää teoksen planeetalla tai kuussa olevan paikan etäisyyteen, joka on mitattu pohjoiseen ja etelään päiväntasaajasta. @fi
toolkit label: leveysaste @fi
toolkit definition: Planeetalla tai kuussa olevan paikan etäisyys, joka on mitattu pohjoiseen ja etelään päiväntasaajasta. @fi
toolkit definition: Avstanden til et punkt på en planet eller satellitt målt nord eller sør fra ekvator. @no
label: té com a latitud @ca
definition: Relaciona una obra amb una distància d’un lloc sobre un planeta o un satèl·lit que es mesura al nord i al sud de l’equador. @ca
toolkit label: latitud @ca
toolkit definition: Distància d’un lloc sobre un planeta o un satèl·lit que es mesura al nord i al sud de l’equador. @ca
label: a pour latitude @fr
definition: Met une œuvre en relation avec une distance d’un lieu sur une planète ou un satellite qui est mesurée au nord et au sud de l’équateur. @fr
toolkit definition: Distance d’un lieu sur une planète ou un satellite qui est mesurée au nord et au sud de l’équateur. @fr
has element type: 6
label: έχει γεωγραφικό πλάτος @el
definition: Συνδέει ένα έργο με μια απόσταση ενός σημείου πάνω σε έναν πλανήτη ή δορυφόρο που μετράται βόρεια και νότια από τον ισημερινό. @el
toolkit label: γεωγραφικό πλάτος @el
toolkit definition: Μια απόσταση ενός σημείου πάνω σε έναν πλανήτη ή δορυφόρο που μετράται βόρεια και νότια από τον ισημερινό. @el
label: szélességi foka a következő: @hu
definition: Hozzákapcsol egy művet egy bolygó vagy hold egy pontjának az egyenlítőtől északra vagy délre mért távolságához. @hu
toolkit label: szélességi foka: @hu
toolkit definition: Egy bolygó vagy hold egy pontjának az egyenlítőtől északra vagy délre mért távolsága. @hu
label: leveysaste @fi
definition: Relaterer et verk til avstanden til et punkt på en planet eller satellitt målt nord eller sør fra ekvator. @no
label: heeft breedtegraad @nl
definition: Relateert een werk aan de afstand van een plaats op een planeet of satelliet dat is gemeten noord en zuid van de evenaar. @nl
toolkit label: breedtegraad @nl
toolkit definition: De afstand van een plaats op een planeet of satelliet dat is gemeten noord en zuid van de evenaar. @nl
label: له خط عرض @ar
definition: يربط بين عمل ومسافة نقطة على كوكب أو قمر اصطناعي مقاسة شمالًا وجنوبا من خط الاستواء. @ar
toolkit label: خط عرض @ar
toolkit definition: مسافة نقطة على كوكب أو قمر اصطناعي مقاسة شمالًا وجنوبا من خط الاستواء. @ar
label: laiuskraad @et
definition: Seostab teose planeedi või selle kaaslase pinnapunkti kaugusega ekvaatorist põhja või lõuna suunas @et
toolkit label: laiuskraad @et
toolkit definition: Planeedi või selle kaaslase pinnapunkti kaugus ekvaatorist põhja või lõuna suunas @et
label: ha come latitudine @it
definition: Correla un’opera a una distanza di un punto su un pianeta o satellite misurata a Nord e a Sud dell’equatore. @it
toolkit label: latitudine @it
toolkit definition: Distanza di un punto su un pianeta o satellite misurata a Nord e a Sud dell’equatore. @it
label: ģeogrāfiskais platums @lv
definition: Sasaista darbu ar planētas vai satelīta punkta attālumu no ekvatora uz ziemeļiem un dienvidiem. @lv
toolkit label: ģeogrāfiskais platums @lv
toolkit definition: Planētas vai satelīta punkta attālums no ekvatora uz ziemeļiem un dienvidiem. @lv
label: 有纬度 @zh-hans
definition: 将一种作品与从行星或卫星的赤道向北和向南到行星或卫星上一个地点所测量的距离关联起来。 @zh-hans
toolkit label: 纬度 @zh-hans
toolkit definition: 从行星或卫星的赤道向北和向南到行星或卫星上一个地点所测量的距离 @zh-hans
has subproperty: P10300
label: enlem ile ilişkilidir @tr
definition: Bir eseri, bir gezegen veya uydu üzerindeki bir yerin ekvatordan kuzey ve güneye ölçülen mesafesiyle ilişkilendirir. @tr
toolkit label: enlem @tr
toolkit definition: Bir gezegen veya uydu üzerindeki bir yerin ekvatordan kuzey ve güneye ölçülen mesafesi. @tr

is description of person
status: Published
sub property of: has subject person
type: Property
lexical alias: descriptionOfPerson.en
definition: Relates a work to a person who is described by a work.
domain: C10001
instruction number: 23.5
toolkit label: description of person
toolkit definition: A person who is described by a work.
label: er beskrivelse af person @da
definition: Relaterer et værk til en person, som er beskrevet af et værk. @da
toolkit label: beskrivelse af person @da
toolkit definition: Person, som er beskrevet af et værk. @da
label: là mô tả của (cá nhân) @vi
definition: Liên kết tác phẩm với cá nhân mà tác phẩm nói về. @vi
toolkit label: mô tả của (cá nhân) @vi
toolkit definition: Cá nhân mà tác phẩm nói về. @vi
label: ist Beschreibung von (Person) @de
definition: Setzt ein Werk in Beziehung zu einer Person, die von einem Werk beschrieben wird. @de
toolkit label: Beschreibung von (Person) @de
toolkit definition: Eine Person, die von einem Werk beschrieben wird. @de
definition: Liittää teoksen henkilöön, jota teos kuvaa. @fi
toolkit label: kuvaus henkilöstä @fi
toolkit definition: Henkilö, jota teos kuvaa. @fi
toolkit label: beskrivelse av person @no
toolkit definition: En person som beskrives av et verk. @no
label: és descripció d’una persona @ca
definition: Relaciona una obra amb una persona que és descrita per una obra. @ca
toolkit label: descripció d’una persona @ca
toolkit definition: Persona que és descrita per una obra. @ca
label: est une description d’une personne @fr
definition: Met une œuvre en relation avec une personne qui est décrite par une œuvre. @fr
toolkit label: description d’une personne @fr
toolkit definition: Personne qui est décrite par une œuvre. @fr
sub property of: is description of agent
has element type: 2
label: είναι περιγραφή του (φυσικό πρόσωπο) @el
definition: Συνδέει ένα έργο με ένα φυσικό πρόσωπο που περιγράφεται από ένα περιγραφικό έργο. @el
toolkit label: περιγραφή του (φυσικό πρόσωπο) @el
toolkit definition: Ένα φυσικό πρόσωπο που περιγράφεται από ένα περιγραφικό έργο. @el
label: leírása a következő személynek: @hu
definition: Hozzákapcsol egy művet egy személyhez, akit egy mű leír. @hu
toolkit definition: Egy személy, akit egy mű leír. @hu
label: kuvaus henkilöstä @fi
label: er beskrivelse av person @no
definition: Relaterer et verk til en person som beskrives av et verk. @no
label: is beschrijving van persoon @nl
definition: Relateert een werk aan een persoon die beschreven wordt door een werk. @nl
toolkit label: beschrijving van persoon @nl
toolkit definition: Een persoon die beschreven wordt door een werk. @nl
label: هو وصف لشخص @ar
definition: يربط بين عمل وشخص موصوف في عمل. @ar
toolkit label: وصف لشخص @ar
toolkit definition: شخص موصوف في عمل. @ar
label: kirjeldatud isik @et
definition: Seostab teose isikuga, keda teoses on kirjeldatud. @et
toolkit label: kirjeldatud isik @et
toolkit definition: Isik, keda teoses on kirjeldatud. @et
toolkit label: leírt személy: @hu
label: è descrizione di persona @it
definition: Correla un'opera a una persona che è descritta da un'opera. @it
toolkit label: descrizione di persona @it
toolkit definition: Persona che è descritta da un'opera. @it
label: ir apraksts personai @lv
definition: Sasaista darbu ar personu, kura aprakstīta darbā. @lv
toolkit label: apraksts personai @lv
toolkit definition: Persona, kura aprakstīta darbā. @lv
label: 是个人的描述 @zh-hans
definition: 将一种作品与被一种作品描述的一个个人关联起来。 @zh-hans
toolkit label: 个人的描述 @zh-hans
toolkit definition: 被一种作品描述的一个个人 @zh-hans
has subproperty: is metadata description of person
has subproperty: P10325
label: kişinin tanımıdır @tr
definition: Bir eseri, eser tarafından tanımlanan bir kişiyle ilişkilendirir. @tr
toolkit label: kişinin tanımı @tr
toolkit definition: Bir eser tarafından tanımlanan kişi. @tr

has system of organization
status: Published
definition: Relates a work to a system of arranging materials in an archival resource or a collection.
type: Property
domain: C10001
lexical alias: systemOfOrganization.en
instruction number: 7.8
toolkit label: system of organization
toolkit definition: A system of arranging materials in an archival resource or a collection.
toolkit label: système d’organisation @fr
toolkit definition: Système de classement des documents dans une ressource archivistique ou une collection. @fr
toolkit label: sistema de organización @es
toolkit definition: Un sistema de arreglo de los materiales dentro de un recurso de archivo o de una colección. @es
label: har arkivstruktur @sv
toolkit label: arkivstruktur @sv
label: har system for organisering @da
definition: Relaterer et værk til et system for organisering af materialer i en arkivressource eller samling. @da
toolkit label: system for organisering @da
toolkit definition: System for organisering af materialer i en arkivressource eller samling. @da
definition: Met une œuvre en relation avec un système de classement des documents dans une ressource archivistique ou une collection. @fr
label: có hệ thống tổ chức @vi
definition: Liên kết tác phẩm với hệ thống bố trí tài liệu trong tài nguyên lưu trữ hoặc bộ sưu tập. @vi
toolkit label: hệ thống tổ chức @vi
toolkit definition: Hệ thống bố trí tài liệu trong tài nguyên lưu trữ hoặc bộ sưu tập. @vi
label: hat Ordnungssystem @de
definition: Setzt ein Werk in Beziehung zu einem System, um Materialien in einer archivalischen Ressource oder einer Sammlung zu ordnen. @de
toolkit label: Ordnungssystem @de
toolkit definition: Ein System, um Materialien in einer archivalischen Ressource oder einer Sammlung zu ordnen. @de
label: a pour système d’organisation @fr
definition: Liittää teoksen arkistoaineiston tai kokoelman aineistojen järjestämisen menetelmään. @fi
toolkit label: järjestämisperiaate @fi
toolkit definition: Arkistoaineiston tai kokoelman aineistojen järjestämisen menetelmä. @fi
toolkit definition: Et ordningssystem i en arkivressurs eller en samling. @no
label: té com a sistema d’organització @ca
definition: Relaciona una obra amb un sistema de classificació dels materials d’un recurs o una col·lecció de recursos arxivístic. @ca
toolkit label: sistema d’organització @ca
toolkit definition: Sistema de classificació dels materials d’un recurs o una col·lecció de recursos arxivístic. @ca
has element type: 6
label: έχει σύστημα του οργανισμού @el
definition: Συνδέει ένα έργο με ένα σύστημα οργάνωσης του υλικού σε έναν αρχειακό πόρο ή μια συλλογή. @el
toolkit label: σύστημα του οργανισμού @el
toolkit definition: Ένα σύστημα οργάνωσης του υλικού σε έναν αρχειακό πόρο ή μια συλλογή. @el
label: szervezeti rendszere a következő: @hu
definition: Hozzákapcsol egy művet egy anyagok rendezésére szolgáló rendszerhez egy levéltári forrásban vagy gyűjteményben. @hu
toolkit label: szervezeti rendszere: @hu
toolkit definition: Egy anyagok rendezésére szolgáló rendszer egy levéltári forrásban vagy gyűjteményben. @hu
label: järjestämisperiaate @fi
definition: Relaterer et verk til et ordningssystem i en arkivressurs eller en samling. @no
label: heeft systeem van organisatie @nl
definition: Relateert een werk aan een systeem van het ordenen van materiaal in een archiefstuk of een collectie. @nl
toolkit label: systeem van organisatie @nl
toolkit definition: Een systeem van het ordenen van materiaal in een archiefstuk of een collectie. @nl
label: له نظام للترتيب @ar
definition: يربط بين عمل ونظام ترتيب المواد في مصدر أرشيفي أو مجموعة أرشيفية. @ar
toolkit label: نظام للترتيب @ar
toolkit definition: نظام ترتيب المواد في مصدر أرشيفي أو مجموعة أرشيفية. @ar
label: korrastussüsteem @et
definition: Seostab teose arhivaali või arhiivikogu materjalide korrastamise süsteemiga. @et
toolkit label: korrastussüsteem @et
toolkit definition: Arhivaali või arhiivikogu materjalide korrastamise süsteem. @et
label: ha come sistema di organizzazione @it
definition: Correla un’opera a un sistema di disposizione dei materiali in una risorsa archivistica o in una collezione. @it
toolkit label: sistema di organizzazione @it
toolkit definition: Sistema di disposizione dei materiali in una risorsa archivistica o in una collezione. @it
label: organizācijas sistēma @lv
definition: Sasaista darbu ar materiālu sakārtošanas sistēmu arhīva resursā vai kolekcijā. @lv
toolkit label: organizācijas sistēma @lv
toolkit definition: Materiālu sakārtošanas sistēma arhīva resursā vai kolekcijā. @lv
label: 有组织体系 @zh-hans
definition: 将一种作品与一种档案资源或一种收藏中编排资料的一个体系关联起来。 @zh-hans
toolkit label: 组织体系 @zh-hans
toolkit definition: 一种档案资源或一种收藏中编排资料的一个体系 @zh-hans
has subproperty: P10084
label: organizasyon sistemi ile ilişkilidir @tr
definition: Bir eseri, bir arşiv kaynağı veya koleksiyondaki materyalleri düzenleme sistemiyle ilişkilendirir. @tr
toolkit label: organizasyon sistemi @tr
toolkit definition: Bir arşiv kaynağı veya bir koleksiyondaki materyalleri düzenleme sistemi. @tr

is script for radio program work
status: Published
definition: Relates a work to a work that is a radio program that is complemented by a textual work.
type: Property
domain: C10001
sub property of: is text for work
lexical alias: scriptForRadioProgramWork.en
toolkit label: script for radio program work
toolkit definition: A work that is a radio program that is complemented by a textual work.
toolkit label: script pour une émission de radio (œuvre) @fr
toolkit definition: Œuvre qui consiste en une émission de radio qui est complétée par une œuvre textuelle. @fr
toolkit label: guión para programa de radio (obra) @es
toolkit definition: Una obra que utiliza el texto como guión para un programa de radio. @es
instruction number: 24.5
label: er manuskript til radioprogramværk @da
definition: Relaterer et værk til et værk, som er en radioprogram, som er komplementeret af et tekstværk. @da
toolkit label: manuskript til radioprogramværk @da
toolkit definition: Værk, som er en radioprogram, som er komplementeret af et tekstværk. @da
definition: Met une œuvre en relation avec une œuvre qui consiste en une émission de radio qui est complétée par une œuvre textuelle. @fr
label: là kịch bản cho chương trình truyền thanh (tác phẩm) @vi
definition: Liên kết tác phẩm với tác phẩm sử dụng văn bản như là kịch bản cho chương trình truyền thanh. @vi
toolkit label: kịch bản cho chương trình truyền thanh (tác phẩm) @vi
toolkit definition: Tác phẩm sử dụng văn bản như là kịch bản cho chương trình truyền thanh. @vi
label: ist Skript für Hörfunksendung (Werk) @de
definition: Setzt ein Werk in Beziehung zu einer Hörfunksendung (Werk), die durch ein textliches Werk vervollständigt wird. @de
toolkit label: Skript für Hörfunksendung (Werk) @de
toolkit definition: Eine Hörfunksendung (Werk), die durch ein textliches Werk vervollständigt wird. @de
label: est un script pour une émission de radio (œuvre) @fr
definition: Liittää teoksen teokseen, joka on radio-ohjelma, jota täydentää tekstiteos. @fi
toolkit label: käsikirjoitus radio-ohjelmaan (teos) @fi
toolkit definition: Teos, joka on radio-ohjelma, jota täydentää tekstiteos. @fi
toolkit label: manus for radioprogram (verk) @no
toolkit definition: Et verk som er et radioprgram som utfylles av et tekstlig verk. @no
label: és obra de guió per a programa radiofònic @ca
definition: Relaciona una obra amb una obra que és un programa radiofònic que es complementa amb una obra textual. @ca
toolkit label: obra de guió per a programa radiofònic @ca
toolkit definition: Obra que és un programa radiofònic que es complementa amb una obra textual. @ca
has element type: 2
label: είναι σενάριο για ραδιοφωνικό πρόγραμμα (έργο) @el
definition: Συνδέει ένα έργο με ένα έργο το οποίο χρησιμοποιεί το κείμενο ως σενάριο για ένα ραδιοφωνικό πρόγραμμα. @el
toolkit label: σενάριο για ραδιοφωνικό πρόγραμμα (έργο) @el
toolkit definition: Ένα έργο το οποίο χρησιμοποιεί το κείμενο ως σενάριο για ένα ραδιοφωνικό πρόγραμμα. @el
label: szövegkönyve a következő rádióműsornak: @hu
definition: Hozzákapcsol egy művet egy rádióműsor-műhöz, amelyet egy szöveges mű egészít ki. @hu
toolkit label: szövegkönyvvel ellátott rádióműsormű @hu
toolkit definition: Egy rádióműsor-mű, amelyet egy szöveges forrás egészít ki. @hu
label: käsikirjoitus radio-ohjelmaan (teos) @fi
label: er manus for radioprogram (verk) @no
definition: Relaterer et verk til et verk som er et radioprgram som utfylles av et tekstlig verk. @no
label: is script voor radioprogrammawerk @nl
definition: Relateert een werk aan een werk dat een radioprogramma is dat is gecomplementeerd door een tekstwerk. @nl
toolkit label: script voor radioprogrammawerk @nl
toolkit definition: Een werk dat een radioprogramma is dat is gecomplementeerd door een tekstwerk. @nl
label: هو نص لعمل برنامج إذاعي @ar
definition: يربط عمل بعمل عبارة عن برنامج إذاعي يكمله عمل نصي. @ar
toolkit label: نص لعمل برنامج إذاعي @ar
toolkit definition: عمل عبارة عن برنامج إذاعي يكمله عمل نصي. @ar
label: stsenaarium raadioteosele @et
definition: Seostab teose raadioteosega, mis on täiendatud tekstteosega. @et
toolkit label: stsenaarium raadioteosele @et
toolkit definition: Raadioteos, mis on täiendatud tekstteosega. @et
label: è sceneggiatura per programma radiofonico opera @it
definition: Correla un’opera a un’opera che è un programma radiofonico completata da un’opera testuale. @it
toolkit label: sceneggiatura per opera programma radiofonico @it
toolkit definition: Opera che è un programma radiofonico completata da un’opera testuale. @it
label: ir radio raidījuma scenārijs darbam @lv
definition: Sasaista darbu ar darbu, kas ir radio raidījums, kurā tiek izmantots tekstuāls darbs kā scenārijs. @lv
toolkit label: radio raidījuma scenārijs darbam @lv
toolkit definition: Darbs, kas ir radio raidījums, kurā tiek izmantots tekstuāls darbs kā scenārijs. @lv
label: 是广播节目作品的文稿 @zh-hans
definition: 将一种作品与作为一种广播节目并被一种文字作品补充的一种作品关联起来。 @zh-hans
toolkit label: 广播节目作品的文稿 @zh-hans
toolkit definition: 作为一种广播节目并被一种文字作品补充的一种作品 @zh-hans
has subproperty: P10176
label: radyo programı çalışması için komut dosyasıdır @tr
definition: Bir eseri, metinsel bir eserle tamamlanan bir radyo programı olan bir eserle ilişkilendirir. @tr
toolkit label: radyo programı eseri için senaryo @tr
toolkit definition: Metinsel bir eserle tamamlanan bir radyo programı olan bir çalışma @tr

is screenplay for television program work
status: Published
definition: Relates a work to a work that is a television program that is complemented by a textual work.
type: Property
domain: C10001
sub property of: is screenplay for work
lexical alias: screenplayForTelevisionProgramWork.en
toolkit label: screenplay for television program work
toolkit definition: A work that is a television program that is complemented by a textual work.
toolkit label: scénario pour une émission de télévision (œuvre) @fr
toolkit definition: Œuvre qui consiste en une émission de télévision qui est complétée par une œuvre textuelle. @fr
toolkit label: guión para programa de televisión (obra) @es
toolkit definition: Una obra que utiliza el texto como guión para un programa de televisión. @es
instruction number: 24.5
label: er manuskript til tv-programværk @da
definition: Relaterer et værk til et værk, som er et tv-program, som er komplementeret af et tekstværk. @da
toolkit label: manuskript til tv-programværk @da
toolkit definition: Værk, som er et tv-program, som er komplementeret af et tekstværk. @da
definition: Met une œuvre en relation avec une œuvre qui consiste en une émission de télévision qui est complétée par une œuvre textuelle. @fr
label: là kịch bản cho chương trình truyền hình (tác phẩm) @vi
definition: Liên kết tác phẩm với tác phẩm sử dụng văn bản như là kịch bản cho chương trình truyền hình. @vi
toolkit label: kịch bản cho chương trình truyền hình (tác phẩm) @vi
toolkit definition: Tác phẩm sử dụng văn bản như là kịch bản cho chương trình truyền hình. @vi
label: ist Drehbuch für Fernsehsendung (Werk) @de
definition: Setzt ein Werk in Beziehung zu einer Fernsehsendung (Werk), die durch ein textliches Werk vervollständigt wird. @de
toolkit label: Drehbuch für Fernsehsendung (Werk) @de
toolkit definition: Eine Fernsehsendung (Werk), die durch ein textliches Werk vervollständigt wird. @de
label: est un scénario pour une émission de télévision (œuvre) @fr
definition: Liittää teoksen teokseen, joka on televisio-ohjelma, jota täydentää tekstiteos. @fi
toolkit label: käsikirjoitus televisio-ohjelmaan (teos) @fi
toolkit definition: Teos, joka on televisio-ohjelma, jota täydentää tekstiteos. @fi
toolkit label: manus for fjernsynsprogram (verk) @no
toolkit definition: Et verk som er et fjernsysnsprogram som utfylles av et tekstlig verk. @no
label: és obra de guió per a programa de televisió @ca
definition: Relaciona una obra amb una obra que és un programa de televisió que es complementa amb una obra textual. @ca
toolkit label: obra de guió per a programa de televisió @ca
toolkit definition: Obra que és un programa de televisió que es complementa amb una obra textual. @ca
has element type: 2
label: είναι σενάριο για τηλεοπτικό πρόγραμμα (έκφραση) @el
definition: Συνδέει ένα έργο με ένα έργο το οποίο χρησιμοποιεί το κείμενο ως σενάριο για ένα τηλεοπτικό πρόγραμμα. @el
toolkit label: σενάριο για τηλεοπτικό πρόγραμμα (έργο) @el
toolkit definition: Ένα έργο το οποίο χρησιμοποιεί το κείμενο ως σενάριο για ένα τηλεοπτικό πρόγραμμα. @el
label: forgatókönyve a következő tévéműsornak: @hu
definition: Hozzákapcsol egy művet egy televízióműsor-műhöz, amelyet egy szöveges mű egészít ki. @hu
toolkit label: tévéműsormű-forgatókönyv @hu
toolkit definition: Egy televízióműsor-mű, amelyet egy szöveges mű egészít ki. @hu
label: käsikirjoitus televisio-ohjelmaan (teos) @fi
label: er manus for fjernsynsprogram (verk) @no
definition: Relaterer et verk til et verk som er et fjernsysnsprogram som utfylles av et tekstlig verk. @no
label: is scenario voor televisieprogrammawerk @nl
definition: Relateert een werk aan een werk dat een televisieprogramma is dat is gecomplementeerd door een tekstwerk. @nl
toolkit label: scenario voor televisieprogrammawerk @nl
toolkit definition: Een werk dat een televisieprogramma is dat is gecomplementeerd door een tekstwerk. @nl
label: هو سيناريو عمل برنامج تليفزيوني @ar
definition: يربط عمل بعمل عبارة عن برنامج تليفزيوني يكمله عمل نصي. @ar
toolkit label: سيناريو عمل برنامج تليفزيوني @ar
toolkit definition: عمل عبارة عن برنامج تليفزيوني يكمله عمل نصي. @ar
label: stsenaarium teleteosele @et
definition: Seostab teose teleteosega, mis on täiendatud tekstteosega. @et
toolkit label: stsenaarium teleteosele @et
toolkit definition: Teleteos, mis on täiendatud tekstteosega. @et
label: è sceneggiatura per programma televisivo opera @it
definition: Correla un’opera a un’opera che è un programma televisivo che è completata da un’opera testuale. @it
toolkit label: sceneggiatura per opera programma televisivo @it
toolkit definition: Opera che è un programma televisivo completata da un’opera testuale. @it
label: ir televīzijas raidījuma scenārijs darbam @lv
definition: Sasaista darbu ar darbu, kas ir televīzijas raidījums, kurā izmantots tekstuāls darbs kā scenārijs. @lv
toolkit label: televīzijas raidījuma scenārijs darbam @lv
toolkit definition: Darbs, kas ir televīzijas raidījums, kurā izmantots tekstuāls darbs kā scenārijs. @lv
label: 是电视节目作品的剧本 @zh-hans
definition: 将一种作品与作为一种电视节目并被一种文字作品补充的一种作品关联起来。 @zh-hans
toolkit label: 电视节目作品的剧本 @zh-hans
toolkit definition: 作为一种电视节目并被一种文字作品补充的一种作品 @zh-hans
has subproperty: P10174
label: televizyon programı eserinin senaryosudur @tr
definition: Bir eseri, metinsel bir eserle tamamlanan bir televizyon programı olan bir eserle ilişkilendirir. @tr
toolkit label: televizyon programı eseri için senaryosu @tr
toolkit definition: Metinsel bir eserle tamamlanan bir televizyon programı olan bir çalışma. @tr

is screenplay for video work
status: Published
definition: Relates a work to a work that is a video that is complemented by a textual work.
type: Property
domain: C10001
sub property of: is screenplay for work
lexical alias: screenplayForVideoWork.en
toolkit label: screenplay for video work
toolkit definition: A work that is a video that is complemented by a textual work.
toolkit label: scénario pour une vidéo (œuvre) @fr
toolkit definition: Œuvre qui consiste en une vidéo qui est complétée par une œuvre textuelle. @fr
toolkit label: guión para programa de vídeo (obra) @es
toolkit definition: Una obra que utiliza el texto como guión para un vídeo. @es
instruction number: 24.5
label: er manuskript til videoværk @da
definition: Relaterer et værk til et værk, som er en video, som er komplementeret af et tekstværk. @da
toolkit label: manuskript til videoværk @da
toolkit definition: Værk, som er en video, som er komplementeret af et tekstværk. @da
definition: Met une œuvre en relation avec une œuvre qui consiste en une vidéo qui est complétée par une œuvre textuelle. @fr
label: là kịch bản cho video (tác phẩm) @vi
definition: Liên kết tác phẩm với tác phẩm sử dụng văn bản như là kịch bản cho video. @vi
toolkit label: kịch bản cho video (tác phẩm) @vi
toolkit definition: Tác phẩm sử dụng văn bản như là kịch bản cho video. @vi
label: ist Drehbuch für Video (Werk) @de
definition: Setzt ein Werk in Beziehung zu einem Videowerk, das durch ein textliches Werk ergänzt wird. @de
toolkit label: Drehbuch für Video (Werk) @de
toolkit definition: Ein Videowerk, das durch ein textliches Werk ergänzt wird. @de
label: est un scénario pour une vidéo (œuvre) @fr
definition: Liittää teoksen teokseen, joka on video, jota täydentää tekstiteos. @fi
toolkit label: käsikirjoitus videoon (teos) @fi
toolkit definition: Teos, joka on video, jota täydentää tekstiteos. @fi
toolkit label: manus for video (verk) @no
toolkit definition: Et verk som er en video som utfylles av et tekstlig verk. @no
label: és obra de guió per a vídeo @ca
definition: Relaciona una obra amb una obra que és un vídeo que es complementa amb una obra textual. @ca
toolkit label: obra de guió per a vídeo @ca
toolkit definition: Obra que és un vídeo que es complementa amb una obra textual. @ca
has element type: 2
label: είναι σενάριο για βίντεο (έργο) @el
definition: Συνδέει ένα έργο με ένα έργο το οποίο χρησιμοποιεί το κείμενο ως σενάριο για ένα βίντεο. @el
toolkit label: σενάριο για βίντεο (έργο) @el
toolkit definition: Ένα έργο το οποίο χρησιμοποιεί το κείμενο ως σενάριο για ένα βίντεο. @el
label: forgatókönyve a következő videónak: @hu
definition: Hozzákapcsol egy művet egy videóműhöz, amelyet egy szöveges mű egészít ki. @hu
toolkit label: videómű-forgatókönyv @hu
toolkit definition: Egy videómű, amelyet egy szöveges forrás egészít ki. @hu
label: käsikirjoitus videoon (teos) @fi
label: er manus for video (verk) @no
definition: Relaterer et verk til et verk som er en video som utfylles av et tekstlig verk. @no
label: is scenario voor videowerk @nl
definition: Relateert een werk aan een werk dat een video is dat is gecomplementeerd door een tekstwerk. @nl
toolkit label: scenario voor videowerk @nl
toolkit definition: Een werk dat een video is dat is gecomplementeerd door een tekstwerk. @nl
label: هو سيناريو لعمل فيديوي @ar
definition: يربط عمل بعمل عبارة عن فيديو يكمله عمل نصي. @ar
toolkit label: سيناريو لعمل فيديوي @ar
toolkit definition: عمل عبارة عن فيديو يكمله عمل نصي. @ar
label: stsenaarium videoteosele @et
definition: Seostab teose videoteosega, mis on täiendatud tekstteosega. @et
toolkit label: stsenaarium videoteosele @et
toolkit definition: Videoteos, mis on täiendatud tekstteosega. @et
label: è sceneggiatura per video opera @it
definition: Correla un’opera a un’opera che è un video completata da un’opera testuale. @it
toolkit label: sceneggiatura per opera video @it
toolkit definition: Opera che è un video completata da un’opera testuale. @it
label: ir videoscenārijs darbam @lv
definition: Sasaista darbu ar darbu, kas ir video, kurā izmantots tekstuāls darbs kā scenārijs. @lv
toolkit label: videoscenārijs darbam @lv
toolkit definition: Darbs, kas ir video, kurā izmantots tekstuāls darbs kā scenārijs. @lv
label: 是视频作品的剧本 @zh-hans
definition: 将一种作品与作为一种视频并被一种文字作品补充的一种作品关联起来。 @zh-hans
toolkit label: 视频作品的剧本 @zh-hans
toolkit definition: 作为一种视频并被一种文字作品补充的一种作品 @zh-hans
has subproperty: P10175
label: video eserinin senaryosudur @tr
definition: Bir eseri, metinsel bir eserle tamamlanan bir video olan bir eserle ilişkilendirir. @tr
toolkit label: video eseri için senaryosu @tr
toolkit definition: Metinsel bir eserle tamamlanan video olan bir çalışma. @tr

has supplement work
status: Published
definition: Relates a work to a work that updates or otherwise complements a predominant work.
type: Property
domain: C10001
sub property of: is augmented by work
lexical alias: supplementWork.en
toolkit label: supplement work
toolkit definition: A work that updates or otherwise complements a predominant work.
toolkit label: supplément (œuvre) @fr
toolkit definition: Œuvre qui met à jour ou complète d’une autre façon une œuvre prédominante. @fr
toolkit label: suplemento (obra) @es
toolkit definition: Una obra que actualiza o complementa la obra predominante. @es
instruction number: 24.5
label: har supplementværk @da
definition: Relaterer et værk til et værk, som opdaterer eller på anden måde komplementerer et fremtrædende værk. @da
toolkit label: supplementværk @da
toolkit definition: Værk, som opdaterer eller på anden måde komplementerer et fremtrædende værk. @da
definition: Met une œuvre en relation avec une œuvre qui met à jour ou complète d’une autre façon une œuvre prédominante. @fr
label: là phụ bản (tác phẩm) @vi
definition: Liên kết tác phẩm với tác phẩm cập nhật hoặc nếu không thì bổ sung cho tác phẩm nổi trội. @vi
toolkit label: phụ bản (tác phẩm) @vi
toolkit definition: Tác phẩm cập nhật hoặc nếu không thì bổ sung cho tác phẩm nổi trội. @vi
label: hat Supplement (Werk) @de
definition: Setzt ein Werk in Beziehung zu einem Werk, das ein Hauptwerk aktualisiert oder auf andere Weise ergänzt. @de
toolkit label: Supplement (Werk) @de
toolkit definition: Ein Werk, das ein Hauptwerk aktualisiert oder auf andere Weise ergänzt. @de
label: a pour supplément (œuvre) @fr
definition: Liittää teoksen teokseen, joka päivittää tai muuten täydentää pääteosta. @fi
toolkit label: suplementti (teos) @fi
toolkit definition: Teos, joka päivittää tai muuten täydentää pääteosta. @fi
toolkit label: supplement (verk) @no
toolkit definition: Et verk som oppdaterer eller på annen måte utfyller et mer fremtredende verk. @no
label: té com a obra de suplement @ca
definition: Relaciona una obra amb una obra que actualitza o altrament complementa una obra predominant. @ca
toolkit label: obra de suplement @ca
toolkit definition: Obra que actualitza o altrament complementa una obra predominant. @ca
has element type: 2
label: είναι συμπλήρωμα (έργο) @el
definition: Συνδέει ένα έργο με ένα έργο το οποίο ενημερώνει ή αλλιώς συμπληρώνει ένα κύριο έργο. @el
toolkit label: συμπλήρωμα (έργο) @el
toolkit definition: Ένα έργο το οποίο ενημερώνει ή αλλιώς συμπληρώνει ένα κύριο έργο. @el
label: szuplementum-műve a következő: @hu
definition: Hozzákapcsol egy művet egy műhöz, amely frissít vagy más módon kiegészít egy domináns művet. @hu
toolkit label: szuplementummű @hu
toolkit definition: Egy mű, amely frissít vagy más módon kiegészít egy domináns művet. @hu
label: suplementti (teos) @fi
label: har supplement (verk) @no
definition: Relaterer et verk til et verk som oppdaterer eller på annen måte utfyller et mer fremtredende verk. @no
label: heeft supplementwerk @nl
definition: Relateert een werk aan een werk dat een hoofdwerk updatet of anderszins complementeert. @nl
toolkit label: supplementwerk @nl
toolkit definition: Een werk dat een hoofdwerk updatet of anderszins complementeert. @nl
label: له عمل مكمل @ar
definition: يربط عمل بعمل يحدِّث عملا سائدا أو، خلاف ذلك، يكمله. @ar
toolkit label: عمل مكمل @ar
toolkit definition: عمل يحدِّث عملا سائدا أو، خلاف ذلك، يكمله. @ar
label: suplement (teos) @et
definition: Seostab teose teosega, millega dominantset teost on uuendatud või muul viisil täiendatud. @et
toolkit label: suplement (teos) @et
toolkit definition: Teos, millega dominantset teost on uuendatud või muul viisil täiendatud. @et
label: ha come supplemento opera @it
definition: Correla un’opera a un’opera che aggiorna o completa in altro modo un’opera predominante. @it
toolkit label: supplemento opera @it
toolkit definition: Opera che aggiorna o completa in altro modo un’opera predominante. @it
label: darbs: papildinājums @lv
definition: Sasaista darbu ar darbu, kas atjauno vai citādi papildina pamatdarbu. @lv
toolkit label: darbs: papildinājums @lv
toolkit definition: Darbs, kas atjauno vai citādi papildina pamatdarbu. @lv
label: 有补编作品 @zh-hans
definition: 将一种作品与更新或补充一种主要作品的一种作品关联起来。 @zh-hans
toolkit label: 补编作品 @zh-hans
toolkit definition: 更新或补充一种主要作品的一种作品 @zh-hans
has subproperty: P10172
label: ek eser ile ilişkilidir @tr
definition: Bir eseri, öncelikli bir eseri güncelleyen veya başka bir şekilde tamamlayan bir eserle ilişkilendirir. @tr
toolkit label: tamamlayıcı eser @tr
toolkit definition: Öncül bir eseri güncelleyen veya başka bir şekilde tamamlayan bir eser. @tr

has subject agent
status: Published
sub property of: has related agent of work
type: Property
lexical alias: subjectAgent.en
definition: Relates a work to an agent whom a work is about.
domain: C10001
label: har agent, som er subjekt @da
definition: Relaterer et værk til en agent, som et værk handler om. @da
label: có chủ đề (tác nhân) @vi
definition: Liên kết tác phẩm với tác nhân mà tác phẩm nói về. @vi
toolkit definition: Tác nhân mà tác phẩm nói về. @vi
definition: Liittää teoksen toimijaan, jota teos koskee. @fi
toolkit label: aiheena oleva toimija @fi
toolkit definition: Toimija, jota teos koskee. @fi
label: té com a agent de matèria @ca
definition: Relaciona una obra amb un agent sobre el qual tracta una obra. @ca
label: a pour agent sujet @fr
definition: Met une œuvre en relation avec un agent dont traite une œuvre. @fr
toolkit label: subject agent
toolkit definition: An agent whom a work is about.
sub property of: has subject RDA entity
has element type: 2
label: έχει θέμα (φορέας) @el
definition: Συνδέει ένα έργο με έναν φορέα στον οποίο αναφέρεται ένα έργο. @el
label: tárgya a következő ágens: @hu
definition: Hozzákapcsol egy művet egy ágenshez, amelyről egy mű szól. @hu
label: aiheena oleva toimija @fi
label: har emne agent @no
definition: Relaterer et verk til en agent som et verk handler om. @no
toolkit label: emne agent @no
toolkit definition: En agent som et verk handler om. @no
label: heeft actor als onderwerp @nl
definition: Relateert een werk aan een actor waar een werk over gaat. @nl
toolkit label: actor als onderwerp @nl
toolkit definition: Een actor waar een werk over gaat. @nl
label: له وكيل موضوع @ar
definition: يربط بين عمل ووكيل يدور حوله عمل. @ar
toolkit label: وكيل موضوع @ar
toolkit definition: وكيل يدور حوله عمل. @ar
toolkit label: agent de matèria @ca
toolkit definition: Agent sobre el qual tracta una obra. @ca
toolkit label: agent, som er subjekt @da
toolkit definition: Agent, som et værk handler om. @da
label: teema (tegija) @et
definition: Seostab teose tegijaga, kelle kohta teos on. @et
toolkit label: teema (tegija) @et
toolkit definition: Tegija, kelle kohta teos on. @et
label: hat Thema (Akteur) @de
definition: Setzt ein Werk in Beziehung zu einem Akteur, von dem ein Werk handelt. @de
toolkit label: Thema (Akteur) @de
toolkit definition: Ein Akteur, von dem ein Werk handelt. @de
toolkit label: tárgyalt ágens: @hu
toolkit definition: Egy ágens, amelyről egy mű szól. @hu
label: ha come soggetto agente @it
definition: Correla un'opera a un agente di cui l'opera tratta. @it
toolkit label: soggetto agente @it
toolkit definition: Agente di cui l'opera tratta. @it
toolkit label: agent sujet @fr
toolkit definition: Agent dont traite une œuvre. @fr
label: temats (aģents) @lv
definition: Sasaista darbu ar aģentu, par kuru ir darbs. @lv
toolkit label: temats (aģents) @lv
toolkit definition: Aģents, par kuru ir darbs. @lv
label: 有主题行为者 @zh-hans
definition: 将一种作品与一种作品所关于的一个行为者关联起来。 @zh-hans
toolkit label: 主题行为者 @zh-hans
toolkit definition: 一种作品所关于的一个行为者 @zh-hans
has subproperty: is description of agent
has subproperty: has subject collective agent
has subproperty: has subject person
has subproperty: P10319
label: konu alınan temsilci ile ilişkilidir @tr
definition: Bir eseri, kendisi hakkında olan bir temsilciyle ilişkilendirir. @tr
toolkit label: konu alınan temsilci @tr
toolkit definition: Bir eserin hakkında olduğu bir temsilci. @tr

has subject family
status: Published
type: Property
lexical alias: subjectFamily.en
definition: Relates a work to a family whom a work is about.
domain: C10001
toolkit label: subject family
toolkit definition: A family whom a work is about.
sub property of: has related family of work
toolkit label: materia (familia) @es
toolkit definition: Una familia sobre la que trata la obra. @es
label: har familie, som er subjekt @da
definition: Relaterer et værk til en familie, som et værk handler om. @da
toolkit label: familie, som er subjekt @da
toolkit definition: Familie, som et værk handler om. @da
label: có chủ đề (gia đình) @vi
definition: Liên kết tác phẩm với gia đình mà tác phẩm nói về. @vi
toolkit label: chủ đề (gia đình) @vi
toolkit definition: Gia đình mà tác phẩm nói về. @vi
label: hat Thema (Familie) @de
definition: Setzt ein Werk in Beziehung zu einer Familie, von der ein Werk handelt. @de
toolkit label: Thema (Familie) @de
toolkit definition: Eine Familie, von der ein Werk handelt. @de
definition: Liittää teoksen sukuun, jota teos koskee. @fi
toolkit label: aiheena oleva suku @fi
toolkit definition: Suku, jota teos koskee. @fi
toolkit label: emne (familie) @no
toolkit definition: En familie som et verk handler om. @no
label: té com a família de matèria @ca
definition: Relaciona una obra amb una família sobre la qual tracta una obra. @ca
toolkit label: família de matèria @ca
toolkit definition: Família sobre la qual tracta una obra. @ca
label: a pour famille sujet @fr
definition: Met une œuvre en relation avec une famille dont traite une œuvre. @fr
toolkit label: famille sujet @fr
toolkit definition: Famille dont traite une œuvre. @fr
sub property of: has subject collective agent
has element type: 2
label: έχει θέμα (οικογένεια) @el
definition: Συνδέει ένα έργο με μια οικογένεια στην οποία αναφέρεται ένα έργο. @el
toolkit label: θέμα (οικογένεια) @el
toolkit definition: Μια οικογένεια στην οποία αναφέρεται ένα έργο. @el
label: tárgya a következő család: @hu
definition: Hozzákapcsol egy művet egy családhoz, amelyről egy mű szól. @hu
toolkit label: tárgyalt család: @hu
toolkit definition: Egy család, amelyről egy mű szól. @hu
label: aiheena oleva suku @fi
label: har emne (familie) @no
definition: Relaterer et verk til en familie som et verk handler om. @no
label: heeft familie als onderwerp @nl
definition: Relateert een werk aan een familie waar een werk over gaat. @nl
toolkit label: familie als onderwerp @nl
toolkit definition: Een familie waar een werk over gaat. @nl
label: له عائلة موضوع @ar
definition: يربط بين عمل وعائلة يدور حولها عمل. @ar
toolkit label: عائلة موضوع @ar
toolkit definition: عائلة يدور حولها عمل. @ar
label: teema (perekond) @et
definition: Seostab teose perekonnaga, kelle kohta teos on. @et
toolkit label: teema (perekond) @et
toolkit definition: Perekond, kelle kohta teos on. @et
label: ha come soggetto famiglia @it
definition: Correla un’opera a una famiglia di cui un’opera tratta. @it
toolkit label: soggetto famiglia @it
toolkit definition: Famiglia di cui un’opera tratta. @it
label: temats (dzimta/ģimene) @lv
definition: Sasaista darbu ar dzimtu/ģimeni, par kuru ir darbs. @lv
toolkit label: temats (dzimta/ģimene) @lv
toolkit definition: Dzimta/ģimene, par kuru ir darbs. @lv
label: 有主题家族 @zh-hans
definition: 将一种作品与一种作品所关于的一个家族关联起来。 @zh-hans
toolkit label: 主题家族 @zh-hans
toolkit definition: 一种作品所关于的一个家族 @zh-hans
has subproperty: is description of family
has subproperty: P10262
label: konu alınan aile ile ilişkilidir @tr
definition: Bir eseri, kendisi hakkında olan bir aileyle ilişkilendirir. @tr
toolkit label: konu alınan aile @tr
toolkit definition: Bir eserin konusu olan aile. @tr

has subject place
status: Published
sub property of: has related place of work
type: Property
lexical alias: subjectPlace.en
definition: Relates a work to a place that a work is about.
domain: C10001
label: har sted, som er subjekt @da
definition: Relaterer et værk til et sted, som et værk handler om. @da
label: có chủ đề (địa điểm) @vi
definition: Liên kết tác phẩm với địa điểm mà tác phẩm nói về. @vi
toolkit definition: Địa điểm mà tác phẩm nói về. @vi
definition: Liittää teoksen paikkaan, jota teos koskee. @fi
toolkit label: aiheena oleva paikka @fi
toolkit definition: Paikka, jota teos koskee. @fi
label: té com a lloc de matèria @ca
definition: Relaciona una obra amb un lloc sobre el qual tracta una obra. @ca
label: a pour lieu sujet @fr
definition: Met une œuvre en relation avec un lieu dont traite une œuvre. @fr
toolkit label: subject place
toolkit definition: A place that a work is about.
sub property of: has subject RDA entity
has element type: 2
label: έχει θέμα (τόπος) @el
definition: Συνδέει ένα έργο με έναν τόπο στον οποίο αναφέρεται ένα έργο. @el
label: tárgya a következő hely: @hu
definition: Hozzákapcsol egy művet egy helyhez, amelyről egy mű szól. @hu
label: aiheena oleva paikka @fi
label: har emne sted @no
definition: Relaterer et verk til et sted som et verk handler om. @no
toolkit label: emne sted @no
toolkit definition: Et sted som et verk handler om. @no
label: heeft plaats als onderwerp @nl
definition: Relateert een werk aan een plaats waar een werk over gaat. @nl
toolkit label: plaats als onderwerp @nl
toolkit definition: Een plaats waar een werk over gaat. @nl
label: له مكان موضوع @ar
definition: يربط بين عمل ومكان يدور حوله عمل. @ar
toolkit label: مكان موضوع @ar
toolkit definition: مكان يدور حوله عمل. @ar
toolkit label: lloc de matèria @ca
toolkit definition: Lloc sobre el qual tracta una obra. @ca
toolkit label: sted, som er subjekt @da
toolkit definition: Sted, som et værk handler om. @da
label: teema (koht) @et
definition: Seostab teose kohaga, mille kohta teos on. @et
toolkit label: teema (koht) @et
toolkit definition: Koht, mille kohta teos on. @et
label: hat Thema (Geografikum) @de
definition: Setzt ein Werk in Beziehung zu einem Geografikum, von dem ein Werk handelt. @de
toolkit label: Thema (Geografikum) @de
toolkit definition: Ein Geografikum, von dem ein Werk handelt. @de
toolkit label: tárgyalt hely: @hu
toolkit definition: Egy hely, amelyről egy mű szól. @hu
label: ha come soggetto luogo @it
definition: Correla un'opera a un luogo di cui l'opera tratta. @it
toolkit label: soggetto luogo @it
toolkit definition: Luogo di cui l'opera tratta. @it
toolkit label: lieu sujet @fr
toolkit definition: Lieu dont traite une œuvre. @fr
label: temats (vieta) @lv
definition: Sasaista darbu ar vietu, par kuru ir darbs. @lv
toolkit label: temats (vieta) @lv
toolkit definition: Vieta, par kuru ir darbs. @lv
label: 有主题地点 @zh-hans
definition: 将一种作品与一种作品所关于的一个地点关联起来。 @zh-hans
toolkit label: 主题地点 @zh-hans
toolkit definition: 一种作品所关于的一个地点 @zh-hans
has subproperty: is description of place
has subproperty: P10321
label: konu alınan yer ile ilişkilidir @tr
definition: Bir eseri, kendisi hakkında olan bir yerle ilişkilendirir. @tr
toolkit label: konu akınan yer @tr
toolkit definition: Bir eserin konusu olan yer. @tr

has subject timespan
status: Published
sub property of: has related timespan of work
type: Property
lexical alias: subjectTimespan.en
definition: Relates a work to a timespan that a work is about.
domain: C10001
label: har tidsperiode, som er subjekt @da
definition: Relaterer et værk til en tidsperiode, som et værk handler om. @da
label: có chủ đề (khoảng thời gian) @vi
definition: Liên kết tác phẩm với khoảng thời gian mà tác phẩm nói về. @vi
toolkit definition: Khoảng thời gian mà tác phẩm nói về. @vi
definition: Liittää teoksen ajanjaksoon, jota teos koskee. @fi
toolkit label: aiheena oleva ajanjakso @fi
toolkit definition: Ajanjakso, jota teos koskee. @fi
label: té com a interval de temps de matèria @ca
definition: Relaciona una obra amb un interval de temps sobre el qual tracta una obra. @ca
label: a pour laps de temps sujet @fr
definition: Met une œuvre en relation avec un laps de temps dont traite une œuvre. @fr
toolkit label: subject timespan
toolkit definition: A timespan that a work is about.
sub property of: has subject RDA entity
has element type: 2
label: έχει θέμα (χρονικό διάστημα) @el
definition: Συνδέει ένα έργο με ένα χρονικό διάστημα στο οποίο αναφέρεται ένα έργο. @el
label: tárgya a következő időtartam: @hu
definition: Hozzákapcsol egy művet egy időtartamhoz, amelyről egy mű szól. @hu
label: aiheena oleva ajanjakso @fi
label: har emne tidsrom @no
definition: Relaterer et verk til et tidsrom som et verk handler om. @no
toolkit label: emne tidsrom @no
toolkit definition: Et tidsrom som et verk handler om. @no
label: heeft tijdspanne als onderwerp @nl
definition: Relateert een werk aan een tijdspanne waar een werk over gaat. @nl
toolkit label: tijdspanne als onderwerp @nl
toolkit definition: Een tijdspanne waar een werk over gaat. @nl
label: له فترة زمنية موضوع @ar
definition: يربط بين عمل وفترة زمنية يدور حولها عمل. @ar
toolkit label: فترة زمنية موضوع @ar
toolkit definition: فترة زمنية يدور حولها عمل. @ar
toolkit label: interval de temps de matèria @ca
toolkit definition: Interval de temps sobre el qual tracta una obra. @ca
toolkit label: tidsperiode, som er subjekt @da
toolkit definition: Tidsperiode, som et værk handler om. @da
label: teema (ajavahemik) @et
definition: Seostab teose ajavahemikuga, mille kohta teos on. @et
toolkit label: teema (ajavahemik) @et
toolkit definition: Ajavahemik, mille kohta teos on. @et
label: hat Thema (Zeitraum) @de
definition: Setzt ein Werk in Beziehung zu einem Zeitraum, von dem ein Werk handelt. @de
toolkit label: Thema (Zeitraum) @de
toolkit definition: Ein Zeitraum, von dem ein Werk handelt. @de
toolkit label: tárgyalt időtartam: @hu
toolkit definition: Egy időtartam, amelyről egy mű szól. @hu
label: ha come soggetto intervallo di tempo @it
definition: Correla un'opera a un intervallo di tempo di cui l'opera tratta. @it
toolkit label: soggetto intervallo di tempo @it
toolkit definition: Intervallo di tempo di cui l'opera tratta. @it
toolkit label: laps de temps sujet @fr
toolkit definition: Laps de temps dont traite une œuvre. @fr
label: temats (laikposms) @lv
definition: Sasaista darbu ar laikposmu, par kuru ir darbs. @lv
toolkit label: temats (laikposms) @lv
toolkit definition: Laikposms, par kuru ir darbs. @lv
label: 有主题时间段 @zh-hans
definition: 将一种作品与一种作品所关于的一个时间段关联起来。 @zh-hans
toolkit label: 主题时间段 @zh-hans
toolkit definition: 一种作品所关于的一个时间段 @zh-hans
has subproperty: is description of timespan
has subproperty: P10322
label: konu alınan zaman aralığı ile ilişkilidir @tr
definition: Bir eseri, kendisi hakkında olan bir zaman aralığıyla ilişkilendirir. @tr
toolkit label: konu alınan zaman aralığı @tr
toolkit definition: Bir eserin konusu olan zaman aralığı. @tr

has subject
status: Published
type: Property
lexical alias: subject.en
definition: Relates a work to a topic that a work is about.
domain: C10001
instruction number: 23.5
toolkit label: subject
toolkit definition: A topic that a work is about.
toolkit label: relación de materia @es
toolkit definition: La relación entre una obra y un identificador, un punto de acceso autorizado y/o una descripción que indica de que trata la obra. @es
label: har ämnesrelation @sv
toolkit label: ämnesrelation @sv
sub property of: has related entity of work
label: har subjekt @da
definition: Relaterer et værk til et emne, som et værk handler om. @da
toolkit label: subjekt @da
toolkit definition: Emne, som et værk handler om. @da
label: có mối quan hệ chủ đề @vi
definition: Liên kết tác phẩm với thuật ngữ, cụm từ, chỉ số phân loại, v.v..., chỉ ra tác phẩm nói về cái gì. @vi
toolkit label: mối quan hệ chủ đề @vi
toolkit definition: Thuật ngữ, cụm từ, chỉ số phân loại, v.v..., chỉ ra tác phẩm nói về cái gì. @vi
label: hat Thema @de
definition: Setzt ein Werk in Beziehung zu einem Thema, von dem ein Werk handelt. @de
toolkit label: Thema @de
toolkit definition: Ein Thema, von dem ein Werk handelt. @de
definition: Liittää teoksen aiheeseen, jota teos koskee. @fi
toolkit label: aihe @fi
toolkit definition: Aihe, jota teos koskee. @fi
toolkit label: emne @no
toolkit definition: Et emne som verket handler om. @no
label: té com a matèria @ca
definition: Relaciona una obra amb un tema sobre el qual tracta una obra. @ca
toolkit label: matèria @ca
toolkit definition: Tema sobre el qual tracta una obra. @ca
label: a pour sujet @fr
definition: Met une œuvre en relation avec un sujet dont traite une œuvre. @fr
toolkit label: sujet @fr
toolkit definition: Sujet dont traite une œuvre. @fr
has element type: 5
label: έχει σχέση θέματος @el
definition: Συνδέει ένα έργο με έναν όρο, μια φράση, έναν ταξινομικό αριθμό κ.λπ. που δηλώνει σε τι αναφέρεται ένα έργο. @el
toolkit label: σχέση θέματος @el
toolkit definition: Μια σχέση μεταξύ ενός έργου και ενός αναγνωριστικού, ενός καθιερωμένου σημείου πρόσβασης ή μιας περιγραφής που δηλώνει σε τι αναφέρεται ένα έργο. @el
label: tárgya a következő: @hu
definition: Hozzákapcsol egy művet egy témához, amelyről egy mű szól. @hu
toolkit label: tárgy: @hu
toolkit definition: Egy téma, amelyről egy mű szól. @hu
alternative label: subject relationship
label: aihe @fi
label: har emne @no
definition: Relaterer et verk til et emne som verket handler om. @no
label: heeft onderwerp @nl
definition: Relateert een werk aan een onderwerp waar een werk over gaat. @nl
toolkit label: onderwerp @nl
toolkit definition: Een onderwerp waar een werk over gaat. @nl
alternative label: aihesuhde @fi
label: له موضوع @ar
definition: يربط بين عمل وموضوع يدور حوله عمل. @ar
toolkit label: موضوع @ar
toolkit definition: موضوع يدور حوله عمل. @ar
label: teema @et
definition: Seostab teose teemaga, mille kohta teos on. @et
toolkit label: teema @et
toolkit definition: Teema, mille kohta teos on. @et
label: ha come soggetto @it
definition: Correla un’opera a un argomento di cui un’opera tratta. @it
toolkit label: soggetto @it
toolkit definition: Argomento di cui tratta un’opera. @it
label: temats @lv
definition: Sasaista darbu ar tematu, par ko ir darbs. @lv
toolkit label: temats @lv
toolkit definition: Temats, par ko ir darbs. @lv
alternative label: علاقة موضوع @ar
alternative label: Themenbeziehung @de
alternative label: relació de matèria @ca
alternative label: 主题关系 @zh-hans
label: 有主题 @zh-hans
definition: 将一种作品与一种作品所关于的一个论题关联起来。 @zh-hans
toolkit label: 主题 @zh-hans

is subject of (Deprecated)
status: Deprecated
type: Property
lexical alias: subjectOf.en
definition: Relates an entity to a work that is about an entity. (Deprecated)
toolkit label: subject of (Deprecated)
toolkit label: relación de materia de @es
toolkit definition: Una obra que trata sobre la entidad. @es
label: er emnerelation til @da
definition: Relaterer en entitet til et værk der handler om en entitet. @da
toolkit label: emnerelation til @da
toolkit definition: Værk der handler om en entitet. @da
label: là mối quan hệ chủ đề của @vi
definition: Liên kết thực thể với tác phẩm về thực thể. @vi
toolkit label: mối quan hệ chủ đề của @vi
toolkit definition: Liên kết thực thể với tác phẩm về thực thể. @vi
label: ist Themenbeziehung von @de
definition: Setzt eine Entität mit einem Werk, das von einer Entität handelt, in Beziehung. @de
toolkit label: Themenbeziehung von @de
toolkit definition: Ein Werk, das von einer Entität handelt. @de
label: suhde aiheeseen liittyvään teokseen @fi
definition: Liittää entiteetin teokseen, jonka aiheena on entiteetti. @fi
toolkit label: suhde aiheeseen liittyvään teokseen @fi
toolkit definition: Teos, jonka aiheena on entiteetti. @fi
toolkit label: emnerelasjon for @no
toolkit definition: Et verk som handler om en entitet. @no
label: és relació de matèria de @ca
definition: Relaciona una obra amb una obra que tracta d’una entitat. @ca
toolkit label: relació de matèria de @ca
toolkit definition: Obra que tracta d’una entitat. @ca
label: est une relation de sujet de @fr
definition: Met une œuvre en relation avec une œuvre qui traite d’une entité. @fr
toolkit label: relation de sujet de @fr
toolkit definition: Œuvre qui traite d’une entité. @fr
has element type: 2
toolkit definition: A work that is about a topic. (Deprecated)
label: είναι σχέση θέματος του @el
definition: Συνδέει μια οντότητα με ένα έργο που αναφέρεται σε μια οντότητα. @el
toolkit label: σχέση θέματος του @el
toolkit definition: Ένα έργο που αναφέρεται σε μια οντότητα. @el
label: tárgykapcsolata @hu
definition: Egy entitást hozzákapcsol egy műhöz, amely egy entitásról szól. @hu
toolkit label: tárgykapcsolata @hu
toolkit definition: Egy mű, amely egy entitásról szól. @hu
has subproperty: P10283

has subject expression
status: Published
type: Property
lexical alias: subjectExpression.en
definition: Relates a work to an expression that a work is about.
domain: C10001
toolkit label: subject expression
toolkit definition: An expression that a work is about.
sub property of: has related expression of work
toolkit label: materia (expresión) @es
toolkit definition: Una expresión sobre la que trata la obra. @es
label: har udtryk, som er subjekt @da
definition: Relaterer et værk til et udtryk som et værk handler om. @da
toolkit label: udtryk, som er subjekt @da
toolkit definition: Udtryk, som et værk handler om. @da
label: có chủ đề (biểu hiện) @vi
definition: Liên kết tác phẩm với biểu hiện mà tác phẩm nói về. @vi
toolkit label: chủ đề (biểu hiện) @vi
toolkit definition: Biểu hiện mà tác phẩm nói về. @vi
label: hat Thema (Expression) @de
definition: Setzt ein Werk in Beziehung zu einer Expression, von der ein Werk handelt. @de
toolkit label: Thema (Expression) @de
toolkit definition: Eine Expression, von der ein Werk handelt. @de
definition: Liittää teoksen ekspressioon, jota teos koskee. @fi
toolkit label: aiheena oleva ekspressio @fi
toolkit definition: Ekspressio, jota teos koskee. @fi
toolkit label: emne (uttrykk) @no
toolkit definition: Et uttrykk som et verk handler om. @no
label: té com a expressió de matèria @ca
definition: Relaciona una obra amb una expressió sobre la qual tracta una obra. @ca
toolkit label: expressió de matèria @ca
toolkit definition: Expressió sobre la qual tracta una obra. @ca
label: a pour expression sujet @fr
definition: Met une œuvre en relation avec une expression dont traite une œuvre. @fr
toolkit label: expression sujet @fr
toolkit definition: Expression dont traite une œuvre. @fr
has element type: 2
sub property of: has subject RDA entity
label: έχει θέμα (έκφραση) @el
definition: Συνδέει ένα έργο με μια έκφραση στην οποία αναφέρεται ένα έργο. @el
toolkit label: θέμα (έκφραση) @el
toolkit definition: Μια έκφραση στην οποία αναφέρεται ένα έργο. @el
label: tárgya a következő kifejezési forma: @hu
definition: Hozzákapcsol egy művet egy kifejezési formához, amelyről egy mű szól. @hu
toolkit label: tárgyalt kifejezési forma: @hu
toolkit definition: Egy kifejezési forma, amelyről egy mű szól. @hu
label: aiheena oleva ekspressio @fi
label: har emne (uttrykk) @no
definition: Relaterer et verk til et uttrykk som et verk handler om. @no
label: heeft expressie als onderwerp @nl
definition: Relateert een werk aan een expressie waar een werk over gaat. @nl
toolkit label: expressie als onderwerp @nl
toolkit definition: Een expressie waar een werk over gaat. @nl
label: له تعبيرة موضوع @ar
definition: يربط بين عمل وتعبيرة يدور حولها عمل. @ar
toolkit label: تعبيرة موضوع @ar
toolkit definition: تعبيرة يدور حولها عمل. @ar
label: teema (väljendus) @et
definition: Seostab teose väljendusega, mille kohta teos on. @et
toolkit label: teema (väljendus) @et
toolkit definition: Väljendus, mille kohta teos on. @et
label: ha come soggetto espressione @it
definition: Correla un’opera a un’espressione di cui un’opera tratta. @it
toolkit label: soggetto espressione @it
toolkit definition: Espressione di cui tratta un’opera @it
label: temats (izteiksme) @lv
definition: Sasaista darbu ar izteiksmi, par kuru ir darbs. @lv
toolkit label: temats (izteiksme) @lv
toolkit definition: Izteiksme, par kuru ir darbs. @lv
label: 有主题内容表达 @zh-hans
definition: 将一种作品与一种作品所关于的一种内容表达关联起来。 @zh-hans
toolkit label: 主题内容表达 @zh-hans
toolkit definition: 一种作品所关于的一种内容表达 @zh-hans
has subproperty: is evaluation of expression
has subproperty: is description of expression
has subproperty: P10258
label: konu alınan anlatım ile ilişkilidir @tr
definition: Bir eseri, kendisi hakkında olduğu bir anlatımla ilişkilendirir. @tr
toolkit label: konu alınan anlatım @tr
toolkit definition: Bir eserin hakkında olduğu bir anlatım. @tr

has subject collective agent
status: Published
type: Property
lexical alias: subjectCollectiveAgent.en
definition: Relates a work to a collective agent whom a work is about.
domain: C10001
sub property of: has related collective agent of work
label: har kollektiv agent, som er subjekt @da
definition: Relaterer et værk til en kollektiv agent, som et værk handler om. @da
label: có chủ đề (tác nhân tập thể) @vi
definition: Liên kết tác phẩm với tác nhân tập thể mà tác phẩm nói về. @vi
toolkit definition: Tác nhân tập thể mà tác phẩm nói về. @vi
definition: Liittää teoksen yhteistoimijaan, jota teos koskee. @fi
toolkit label: aiheena oleva yhteistoimija @fi
toolkit definition: Yhteistoimija, jota teos koskee. @fi
label: té com a agent col·lectiu de matèria @ca
definition: Relaciona una obra amb un agent col·lectiu sobre el qual tracta una obra. @ca
label: a pour agent collectif sujet @fr
definition: Met une œuvre en relation avec un agent collectif dont traite une œuvre. @fr
toolkit label: subject collective agent
toolkit definition: A collective agent whom a work is about.
has element type: 2
sub property of: has subject agent
label: έχει θέμα (συλλογικός φορέας) @el
definition: Συνδέει ένα έργο με έναν συλλογικό φορέα στον οποίο αναφέρεται ένα έργο. @el
label: tárgya a következő kollektív ágens: @hu
definition: Hozzákapcsol egy művet egy kollektív ágenshez, amelyről egy mű szól. @hu
label: aiheena oleva yhteistoimija @fi
label: har emne kollektiv agent @no
definition: Relaterer et verk til en kollektiv agent som et verk handler om. @no
toolkit label: emne kollektiv agent @no
toolkit definition: En kollektiv agent som et verk handler om. @no
label: heeft collectieve actor als onderwerp @nl
definition: Relateert een werk aan een collectieve actor waar een werk over gaat. @nl
toolkit label: collectieve actor als onderwerp @nl
toolkit definition: Een collectieve actor waar een werk over gaat. @nl
label: له وكيل جماعي موضوع @ar
definition: يربط بين عمل ووكيل جماعي يدور حوله عمل. @ar
toolkit label: وكيل جماعي موضوع @ar
toolkit definition: وكيل جماعي يدور حوله عمل. @ar
toolkit label: agent col·lectiu de matèria @ca
toolkit definition: Agent col·lectiu sobre el qual tracta una obra. @ca
toolkit label: kollektiv agent, som er subjekt @da
toolkit definition: Kollektiv agent, som et værk handler om. @da
label: teema (kollektiiv) @et
definition: Seostab teose kollektiiviga, kelle kohta teos on. @et
toolkit label: teema (kollektiiv) @et
toolkit definition: Kollektiiv, kelle kohta teos on. @et
label: hat Thema (Gemeinschaftlicher Akteur) @de
definition: Setzt ein Werk in Beziehung zu einem gemeinschaftlichen Akteur, von dem ein Werk handelt. @de
toolkit label: Thema (Gemeinschaftlicher Akteur) @de
toolkit definition: Ein gemeinschaftlicher Akteur, von dem ein Werk handelt. @de
toolkit label: tárgyalt kollektív ágens: @hu
toolkit definition: Egy kollektív ágens, amelyről egy mű szól. @hu
label: ha come soggetto agente collettivo @it
definition: Correla un'opera a un agente collettivo di cui l'opera tratta. @it
toolkit label: soggetto agente collettivo @it
toolkit definition: Agente collettivo di cui l'opera tratta. @it
toolkit label: agent collectif sujet @fr
toolkit definition: Agent collectif dont traite une œuvre. @fr
label: temats (grupa) @lv
definition: Sasaista darbu ar grupu, par kuru ir darbs. @lv
toolkit label: temats (grupa) @lv
toolkit definition: Grupa, par kuru ir darbs. @lv
label: 有主题集体行为者 @zh-hans
definition: 将一种作品与一种作品所关于的一个集体行为者关联起来。 @zh-hans
toolkit label: 主题集体行为者 @zh-hans
toolkit definition: 一种作品所关于的一个集体行为者 @zh-hans
has subproperty: is description of collective agent
has subproperty: has subject family
has subproperty: has subject corporate body
has subproperty: P10320
label: konu alınan kolektif temsilci ile ilişkilidir @tr
definition: Bir eseri, kendisi hakkında olan kolektif bir temsilci ile ilişkilendirir. @tr
toolkit label: konu alınan kolektif temsilci @tr
toolkit definition: Bir eserin hakkında çalışıldığı kolektif temsilci. @tr

has subject manifestation
status: Published
type: Property
lexical alias: subjectManifestation.en
definition: Relates a work to a manifestation that a work is about.
domain: C10001
toolkit label: subject manifestation
toolkit definition: A manifestation that a work is about.
sub property of: has related manifestation of work
toolkit label: materia (manifestación) @es
toolkit definition: Una manifestación sobre la que trata la obra. @es
label: har manifestation, som er subjekt @da
definition: Relaterer et værk til en manifestation, som et værk handler om. @da
toolkit label: manifestation, som er subjekt @da
toolkit definition: Manifestation, som et værk handler om. @da
label: có chủ đề (biểu thị) @vi
definition: Liên kết tác phẩm với biểu thị mà tác phẩm nói về. @vi
toolkit label: chủ đề (biểu thị) @vi
toolkit definition: Biểu thị mà tác phẩm nói về. @vi
label: hat Thema (Manifestation) @de
definition: Setzt ein Werk in Beziehung zu einer Manifestation, von der ein Werk handelt. @de
toolkit label: Thema (Manifestation) @de
toolkit definition: Eine Manifestation, von der ein Werk handelt. @de
definition: Liittää teoksen manifestaatioon, jota teos koskee. @fi
toolkit label: aiheena oleva manifestaatio @fi
toolkit definition: Manifestaatio, jota teos koskee. @fi
toolkit label: emne (manifestasjon) @no
toolkit definition: En manifestasjon som et verk handler om. @no
label: té com a manifestació de matèria @ca
definition: Relaciona una obra amb una manifestació sobre la qual tracta una obra. @ca
toolkit label: manifestació de matèria @ca
toolkit definition: Manifestació sobre la qual tracta una obra. @ca
label: a pour manifestation sujet @fr
definition: Met une œuvre en relation avec une manifestation dont traite une œuvre. @fr
toolkit label: manifestation sujet @fr
toolkit definition: Manifestation dont traite une œuvre. @fr
has element type: 2
sub property of: has subject RDA entity
label: έχει θέμα (εκδήλωση) @el
definition: Συνδέει ένα έργο με μια εκδήλωση στην οποία αναφέρεται ένα έργο. @el
toolkit label: θέμα (εκδήλωση) @el
toolkit definition: Μια εκδήλωση στην οποία αναφέρεται ένα έργο. @el
label: tárgya a következő megjelenési forma: @hu
definition: Hozzákapcsol egy művet egy megjelenési formához, amelyről egy mű szól. @hu
toolkit label: tárgyalt megjelenési forma: @hu
toolkit definition: Egy megjelenési forma, amelyről egy mű szól. @hu
label: aiheena oleva manifestaatio @fi
label: har emne (manifestasjon) @no
definition: Relaterer et verk til en manifestasjon som et verk handler om. @no
label: heeft manifestatie als onderwerp @nl
definition: Relateert een werk aan een manifestatie waar een werk over gaat. @nl
toolkit label: manifestatie als onderwerp @nl
toolkit definition: Een manifestatie waar een werk over gaat. @nl
label: له تجسيدة موضوع @ar
definition: يربط بين عمل وتجسيدة يدور حولها عمل. @ar
toolkit label: تجسيدة موضوع @ar
toolkit definition: تجسيدة يدور حولها عمل. @ar
label: teema (kehastus) @et
definition: Seostab teose kehastusega, mille kohta teos on. @et
toolkit label: teema (kehastus) @et
toolkit definition: Kehastus, mille kohta teos on. @et
label: ha come soggetto manifestazione @it
definition: Correla un’opera a una manifestazione di cui un’opera tratta. @it
toolkit label: soggetto manifestazione @it
toolkit definition: Manifestazione di cui tratta un’opera @it
label: temats (manifestācija) @lv
definition: Sasaista darbu ar manifestāciju, par kuru ir darbs. @lv
toolkit label: temats (manifestācija) @lv
toolkit definition: Manifestācija, par kuru ir darbs. @lv
label: 有主题载体表现 @zh-hans
definition: 将一种作品与一种作品所关于的一种载体表现关联起来。 @zh-hans
toolkit label: 主题载体表现 @zh-hans
toolkit definition: 一种作品所关于的一种载体表现 @zh-hans
has subproperty: is evaluation of manifestation
has subproperty: is description of manifestation
has subproperty: P10259
label: konu alınan gösterim ile ilişkilidir @tr
definition: Bir eseri, o çalışmanın hakkında olan gösterimle ilişkilendirir. @tr
toolkit label: konu alınan gösterim @tr
toolkit definition: Bir eserin hakkında olan gösterim. @tr

has subject work
status: Published
type: Property
lexical alias: subjectWork.en
definition: Relates a work to a work that a work is about.
domain: C10001
toolkit label: subject work
toolkit definition: A work that a work is about.
sub property of: has related work of work
toolkit label: materia (obra) @es
toolkit definition: Una obra sobre la que trata la obra. @es
label: har værk, som er subjekt @da
definition: Relaterer et værk til et værk, som et værk handler om. @da
toolkit label: værk, som er subjekt @da
toolkit definition: Værk, som et værk handler om. @da
label: có chủ đề (tác phẩm) @vi
definition: Liên kết tác phẩm với tác phẩm mà tác phẩm nói về. @vi
toolkit label: chủ đề (tác phẩm) @vi
toolkit definition: Tác phẩm mà tác phẩm nói về. @vi
label: hat Thema (Werk) @de
definition: Setzt ein Werk in Beziehung zu einem Werk, von dem ein Werk handelt. @de
toolkit label: Thema (Werk) @de
toolkit definition: Ein Werk, von dem ein Werk handelt. @de
definition: Liittää teoksen teokseen, jota teos koskee. @fi
toolkit label: aiheena oleva teos @fi
toolkit definition: Teos, jota teos koskee. @fi
toolkit label: emne (verk) @no
toolkit definition: Et verk som et verk handler om. @no
label: té com a obra de matèria @ca
definition: Relaciona una obra amb una obra sobre la qual tracta una obra. @ca
toolkit label: obra de matèria @ca
toolkit definition: Obra sobre la qual tracta una obra. @ca
label: a pour œuvre sujet @fr
definition: Met une œuvre en relation avec une œuvre dont traite une œuvre. @fr
toolkit label: œuvre sujet @fr
toolkit definition: Œuvre dont traite une œuvre. @fr
has element type: 2
sub property of: has subject RDA entity
label: έχει θέμα (έργο) @el
definition: Συνδέει ένα έργο με ένα έργο στο οποίο αναφέρεται ένα έργο. @el
toolkit label: θέμα (έργο) @el
toolkit definition: Ένα έργο στο οποίο αναφέρεται ένα έργο. @el
label: tárgya a következő mű: @hu
definition: Hozzákapcsol egy művet egy műhöz, amelyről egy mű szól. @hu
toolkit label: tárgyalt mű: @hu
toolkit definition: Egy mű, amelyről egy mű szól. @hu
label: aiheena oleva teos @fi
label: har emne (verk) @no
definition: Relaterer et verk til et verk som et verk handler om. @no
label: heeft werk als onderwerp @nl
definition: Relateert een werk aan een werk waar een werk over gaat. @nl
toolkit label: werk als onderwerp @nl
toolkit definition: Een werk waar een werk over gaat. @nl
label: له عمل موضوع @ar
definition: يربط عمل بعمل يدور حوله عمل. @ar
toolkit label: عمل موضوع @ar
toolkit definition: عمل يدور حوله عمل. @ar
label: teema (teos) @et
definition: Seostab teose teosega, mille kohta teos on. @et
toolkit label: teema (teos) @et
toolkit definition: Teos, mille kohta teos on. @et
label: ha come soggetto opera @it
definition: Correla un’opera a un’opera di cui un’opera tratta. @it
toolkit label: soggetto opera @it
toolkit definition: Opera di cui un’opera tratta. @it
label: temats (darbs) @lv
definition: Sasaista darbu ar darbu, par kuru ir darbs. @lv
toolkit label: temats (darbs) @lv
toolkit definition: Darbs, par kuru ir darbs. @lv
label: 有主题作品 @zh-hans
definition: 将一种作品与一种作品所关于的一种作品关联起来。 @zh-hans
toolkit label: 主题作品 @zh-hans
toolkit definition: 一种作品所关于的一种作品 @zh-hans
has subproperty: is evaluation of work
has subproperty: is description of work
has subproperty: P10257
label: konu alınan eser ile ilişkilidir @tr
definition: Bir eseri, eseri hakkındaki bir eserle ilişkilendirir. @tr
toolkit label: konu alınan eser @tr
toolkit definition: Bir eserin konusu olan başka bir eser. @tr

has subject nomen
status: Published
sub property of: has related nomen of work
type: Property
lexical alias: subjectNomen.en
definition: Relates a work to a nomen that a work is about.
domain: C10001
label: har nomen, som er subjekt @da
definition: Relaterer et værk til et nomen, som et værk handler om. @da
label: có chủ đề (danh pháp) @vi
definition: Liên kết tác phẩm với danh pháp mà tác phẩm nói về. @vi
toolkit definition: Danh pháp mà tác phẩm nói về. @vi
definition: Liittää teoksen nomeniin, jota teos koskee. @fi
toolkit label: aiheena oleva nomen @fi
toolkit definition: Nomen, jota teos koskee. @fi
label: té com a nomen de matèria @ca
definition: Relaciona una obra amb un nomen sobre el qual tracta una obra. @ca
label: a pour nomen sujet @fr
definition: Met une œuvre en relation avec un nomen dont traite une œuvre. @fr
toolkit label: subject nomen
toolkit definition: A nomen that a work is about.
sub property of: has subject RDA entity
has element type: 2
label: έχει οντότητα (όνομα) @el
definition: Συνδέει ένα έργο με ένα όνομα στο οποίο αναφέρεται ένα έργο. @el
label: tárgya a következő nomen: @hu
definition: Hozzákapcsol egy művet egy nomenhez, amelyről egy mű szól. @hu
label: aiheena oleva nomen @fi
label: har emne nomen @no
definition: Relaterer et verk til et nomen som et verk handler om. @no
toolkit label: emne nomen @no
toolkit definition: Et nomen som et verk handler om. @no
label: heeft nomen als onderwerp @nl
definition: Relateert een werk aan een nomen waar een werk over gaat. @nl
toolkit label: nomen als onderwerp @nl
toolkit definition: Een nomen waar een werk over gaat. @nl
label: له تسمية موضوع @ar
definition: يربط بين عمل وتسمية يدور حولها عمل. @ar
toolkit label: تسمية موضوع @ar
toolkit definition: تسمية يدور حولها عمل. @ar
toolkit label: nomen de matèria @ca
toolkit definition: Nomen sobre el qual tracta una obra. @ca
toolkit label: nomen, som er subjekt @da
toolkit definition: Nomen, som et værk handler om. @da
label: teema (nomen) @et
definition: Seostab teose nomen'iga, mille kohta teos on. @et
toolkit label: teema (nomen) @et
toolkit definition: Nomen, mille kohta teos on. @et
label: hat Thema (Nomen) @de
definition: Setzt ein Werk in Beziehung zu einem Nomen, von dem ein Werk handelt. @de
toolkit label: Thema (Nomen) @de
toolkit definition: Ein Nomen, von dem ein Werk handelt. @de
toolkit label: tárgyalt nomen: @hu
toolkit definition: Egy nomen, amelyről egy mű szól. @hu
label: ha come soggetto nomen @it
definition: Correla un'opera con un nomen di cui l'opera tratta. @it
toolkit label: soggetto nomen @it
toolkit definition: Nomen di cui l'opera tratta. @it
toolkit label: nomen sujet @fr
toolkit definition: Nomen dont traite une œuvre. @fr
label: temats (nomens) @lv
definition: Sasaista darbu ar nomenu, par kuru ir darbs. @lv
toolkit label: temats (nomens) @lv
toolkit definition: Nomens, par kuru ir darbs. @lv
label: 有主题命名 @zh-hans
definition: 将一种作品与一种作品所关于的一个命名关联起来。 @zh-hans
toolkit label: 主题命名 @zh-hans
toolkit definition: 一种作品所关于的一个命名 @zh-hans
has subproperty: is description of nomen
has subproperty: P10323
label: konu alınan isim ile ilişkilidir @tr
definition: Bir eseri, o eserin konusu olan bir isimle ilişkilendirir. @tr
toolkit label: konu alınan isim @tr
toolkit definition: Bir eserin konusu olan bir isim. @tr

has subject item
status: Published
type: Property
lexical alias: subjectItem.en
definition: Relates a work to an item that a work is about.
domain: C10001
toolkit label: subject item
toolkit definition: An item that a work is about.
sub property of: has related item of work
toolkit label: materia (ítem) @es
toolkit definition: Un ítem sobre el que trata la obra. @es
label: har eksemplar, som er subjekt @da
definition: Relaterer et værk til et eksemplar, som et værk handler om. @da
toolkit label: eksemplar, som er subjekt @da
toolkit definition: Eksemplar, som et værk hander om. @da
label: có chủ đề (bản) @vi
definition: Liên kết tác phẩm với bản mà tác phẩm nói về. @vi
toolkit label: chủ đề (bản) @vi
toolkit definition: Bản mà tác phẩm nói về. @vi
label: hat Thema (Exemplar) @de
definition: Setzt ein Werk in Beziehung zu einem Exemplar, von dem ein Werk handelt. @de
toolkit label: Thema (Exemplar) @de
toolkit definition: Ein Exemplar, von dem ein Werk handelt. @de
definition: Liittää teoksen kappaleeseen, jota teos koskee. @fi
toolkit label: aiheena oleva kappale @fi
toolkit definition: Kappale, jota teos koskee. @fi
toolkit label: emne (eksemplar) @no
toolkit definition: Et eksemplar som et verk handler om. @no
label: té com a ítem de matèria @ca
definition: Relaciona una obra amb un ítem sobre el qual tracta una obra. @ca
toolkit label: ítem de matèria @ca
toolkit definition: Ítem sobre el qual tracta una obra. @ca
label: a pour item sujet @fr
definition: Met une œuvre en relation avec un item dont traite une œuvre. @fr
toolkit label: item sujet @fr
toolkit definition: Item dont traite une œuvre. @fr
has element type: 2
sub property of: has subject RDA entity
label: έχει θέμα (αντίτυπο) @el
definition: Συνδέει ένα έργο με ένα αντίτυπο στο οποίο αναφέρεται ένα έργο. @el
toolkit label: θέμα (αντίτυπο) @el
toolkit definition: Ένα αντίτυπο στο οποίο αναφέρεται ένα έργο. @el
label: tárgya a következő példány: @hu
definition: Hozzákapcsol egy művet egy példányhoz, amelyről egy mű szól. @hu
toolkit label: tárgyalt példány: @hu
toolkit definition: Egy példány, amelyről egy mű szól. @hu
label: aiheena oleva kappale @fi
label: har emne (eksemplar) @no
definition: Relaterer et verk til et eksemplar som et verk handler om. @no
label: heeft item als onderwerp @nl
definition: Relateert een werk aan een item waar een werk over gaat. @nl
toolkit label: item als onderwerp @nl
toolkit definition: Een item waar een werk over gaat. @nl
label: له مفردة موضوع @ar
definition: يربط بين عمل ومفردة يدور حولها عمل. @ar
toolkit label: مفردة موضوع @ar
toolkit definition: مفردة يدور حولها عمل. @ar
label: teema (eksemplar) @et
definition: Seostab teose eksemplariga, mille kohta teos on. @et
toolkit label: teema (eksemplar) @et
toolkit definition: Eksemplar, mille kohta teos on. @et
label: ha come soggetto item @it
definition: Correla un’opera a un item di cui un’opera tratta. @it
toolkit label: soggetto item @it
toolkit definition: Item di cui un’opera tratta. @it
label: temats (vienība) @lv
definition: Sasaista darbu ar vienību, par kuru ir darbs. @lv
toolkit label: temats (vienība) @lv
toolkit definition: Vienība, par kuru ir darbs. @lv
label: 有主题单件 @zh-hans
definition: 将一种作品与一种作品所关于的一个单件关联起来。 @zh-hans
toolkit label: 主题单件 @zh-hans
toolkit definition: 一种作品所关于的一个单件 @zh-hans
has subproperty: is description of item
has subproperty: P10260
label: konu alınan kopya ile ilişkilidir @tr
definition: Bir eseri, eserin hakkında olduğu bir kopyayla ilişkilendirir. @tr
toolkit label: konu alınan kopya @tr
toolkit definition: Bir eserin konusu olan bir kopya. @tr

has subject person
status: Published
type: Property
lexical alias: subjectPerson.en
definition: Relates a work to a person whom a work is about.
domain: C10001
toolkit label: subject person
toolkit definition: A person whom a work is about.
sub property of: has related person of work
toolkit label: materia (persona) @es
toolkit definition: Una persona sobre la que trata la obra. @es
label: har person, som er subjekt @da
definition: Relaterer et værk til en person, som et værk handler om. @da
toolkit label: person, som er subjekt @da
toolkit definition: Person, som et værk handler om. @da
label: có chủ đề (cá nhân) @vi
definition: Liên kết tác phẩm với cá nhân mà tác phẩm nói về. @vi
toolkit label: chủ đề (cá nhân) @vi
toolkit definition: Cá nhân mà tác phẩm nói về. @vi
label: hat Thema (Person) @de
definition: Setzt ein Werk in Beziehung zu einer Person, von der ein Werk handelt. @de
toolkit label: Thema (Person) @de
toolkit definition: Eine Person, von der ein Werk handelt. @de
definition: Liittää teoksen henkilöön, jota teos koskee. @fi
toolkit label: aiheena oleva henkilö @fi
toolkit definition: Henkilö, jota teos koskee. @fi
toolkit label: emne (person) @no
toolkit definition: En person som et verk handler om. @no
label: té com a persona de matèria @ca
definition: Relaciona una obra amb una persona sobre la qual tracta una obra. @ca
toolkit label: persona de matèria @ca
toolkit definition: Persona sobre la qual tracta una obra. @ca
label: a pour personne sujet @fr
definition: Met une œuvre en relation avec une personne dont traite une œuvre. @fr
toolkit label: personne sujet @fr
toolkit definition: Personne dont traite une œuvre. @fr
has element type: 2
sub property of: has subject agent
label: έχει θέμα (φυσικό πρόσωπο) @el
definition: Συνδέει ένα έργο με ένα φυσικό πρόσωπο στο οποίο αναφέρεται ένα έργο. @el
toolkit label: θέμα (φυσικό πρόσωπο) @el
toolkit definition: Ένα φυσικό πρόσωπο στο οποίο αναφέρεται ένα έργο. @el
label: tárgya a következő személy: @hu
definition: Hozzákapcsol egy művet egy személyhez, akiről egy mű szól. @hu
toolkit label: tárgyalt személy: @hu
toolkit definition: Egy személy, akiről egy mű szól. @hu
label: aiheena oleva henkilö @fi
label: har emne (person) @no
definition: Relaterer et verk til en person som et verk handler om. @no
label: heeft persoon als onderwerp @nl
definition: Relateert een werk aan een persoon waar een werk over gaat. @nl
toolkit label: persoon als onderwerp @nl
toolkit definition: Een persoon waar een werk over gaat. @nl
label: له شخص موضوع @ar
definition: يربط بين عمل وشخص يدور حوله عمل. @ar
toolkit label: شخص موضوع @ar
toolkit definition: شخص يدور حوله عمل. @ar
label: teema (isik) @et
definition: Seostab teose isikuga, kelle kohta teos on. @et
toolkit label: teema (isik) @et
toolkit definition: Isik, kelle kohta teos on. @et
label: ha come soggetto persona @it
definition: Correla un’opera a una persona di cui un’opera tratta. @it
toolkit label: soggetto persona @it
toolkit definition: Persona di cui un’opera tratta. @it
label: temats (persona) @lv
definition: Sasaista darbu ar personu, par kuru ir darbs. @lv
toolkit label: temats (persona) @lv
toolkit definition: Persona, par kuru ir darbs. @lv
label: 有主题个人 @zh-hans
definition: 将一种作品与一种作品所关于的一个个人关联起来。 @zh-hans
toolkit label: 主题个人 @zh-hans
toolkit definition: 一种作品所关于的一个个人 @zh-hans
has subproperty: is description of person
has subproperty: P10261
label: konu alınan kişi ile ilişkilidir @tr
definition: Bir eseri, kendisi hakkında olan kişiyle ilişkilendirir. @tr
toolkit label: konu alınan kişi @tr
toolkit definition: Bir eserin konusu olan bir kişi. @tr

has subject corporate body
status: Published
type: Property
lexical alias: subjectCorporateBody.en
definition: Relates a work to a corporate body whom a work is about.
domain: C10001
toolkit label: subject corporate body
toolkit definition: A corporate body whom a work is about.
sub property of: has related corporate body of work
toolkit label: materia (entidad corporativa) @es
toolkit definition: Una entidad corporativa sobre la que trata la obra. @es
label: har korporation, som er subjekt @da
definition: Relaterer et værk til en korporation, som et værk handler om. @da
toolkit label: korporation, som er subjekt @da
toolkit definition: Korporation, som et værk handler om. @da
label: có chủ đề (tập thể) @vi
definition: Liên kết tác phẩm với tập thể mà tác phẩm nói về. @vi
toolkit label: chủ đề (tập thể) @vi
toolkit definition: Tập thể mà tác phẩm nói về. @vi
label: hat Thema (Körperschaft) @de
definition: Setzt ein Werk in Beziehung zu einer Körperschaft, von der ein Werk handelt. @de
toolkit label: Thema (Körperschaft) @de
toolkit definition: Eine Körperschaft, von der ein Werk handelt. @de
definition: Liittää teoksen yhteisöön, jota teos koskee. @fi
toolkit label: aiheena oleva yhteisö @fi
toolkit definition: Yhteisö, jota teos koskee. @fi
toolkit label: emne (korporasjon) @no
toolkit definition: En korporasjon som et verk handler om. @no
label: té com a entitat corporativa de matèria @ca
definition: Relaciona una obra amb una entitat corporativa sobre la qual tracta una obra. @ca
toolkit label: entitat corporativa de matèria @ca
toolkit definition: Entitat corporativa sobre la qual tracta una obra. @ca
label: a pour collectivité sujet @fr
definition: Met une œuvre en relation avec une collectivité dont traite une œuvre. @fr
toolkit label: collectivité sujet @fr
toolkit definition: Collectivité dont traite une œuvre. @fr
has element type: 2
sub property of: has subject collective agent
label: έχει θέμα (συλλογικό όργανο) @el
definition: Συνδέει ένα έργο με ένα συλλογικό όργανο στο οποίο αναφέρεται ένα έργο. @el
toolkit label: θέμα (συλλογικό όργανο) @el
toolkit definition: Ένα συλλογικό όργανο στο οποίο αναφέρεται ένα έργο. @el
label: tárgya a következő testület: @hu
definition: Hozzákapcsol egy művet egy testülethez, amelyről egy mű szól. @hu
toolkit label: tárgyalt testület: @hu
toolkit definition: Egy testület, amelyről egy mű szól. @hu
label: aiheena oleva yhteisö @fi
label: har emne (korporasjon) @no
definition: Relaterer et verk til en korporasjon som et verk handler om. @no
label: heeft corporatie als onderwerp @nl
definition: Relateert een werk aan een corporatie waar een werk over gaat. @nl
toolkit label: corporatie als onderwerp @nl
toolkit definition: Een corporatie waar een werk over gaat. @nl
label: له هيئة موضوع @ar
definition: يربط بين عمل وهيئة يدور حولها عمل. @ar
toolkit label: هيئة موضوع @ar
toolkit definition: هيئة يدور حولها عمل. @ar
label: teema (asutus) @et
definition: Seostab teose asutusega, mille kohta teos on. @et
toolkit label: teema (asutus) @et
toolkit definition: Asutus, mille kohta teos on. @et
label: ha come soggetto ente @it
definition: Correla un’opera a un ente di cui un’opera tratta. @it
toolkit label: soggetto ente @it
toolkit definition: Ente di cui un’opera tratta. @it
label: temats (institūcija) @lv
definition: Sasaista darbu ar institūciju, par kuru ir darbs. @lv
toolkit label: temats (institūcija) @lv
toolkit definition: Institūcija, par kuru ir darbs. @lv
label: 有主题团体 @zh-hans
definition: 将一种作品与一种作品所关于的一个团体关联起来。 @zh-hans
toolkit label: 主题团体 @zh-hans
toolkit definition: 一种作品所关于的一个团体 @zh-hans
has subproperty: is description of corporate body
has subproperty: P10263
label: konu alınan tüzel kişi ile ilişkilidir @tr
definition: Bir eseri, kendisi hakkında olan tüzel kişi ile ilişkilendirir. @tr
toolkit label: konu alınan tüzel kişi @tr
toolkit definition: Hakkında çalışılan tüzel kişilik @tr

has coverage of content
status: Published
definition: Relates a work to a chronological or geographic coverage of the content of a work.
type: Property
domain: C10001
lexical alias: coverageOfContent.en
instruction number: 7.3
toolkit label: coverage of content
toolkit definition: A chronological or geographic coverage of the content of a work.
toolkit label: couverture du contenu @fr
toolkit definition: Couverture chronologique ou géographique du contenu d’une œuvre. @fr
toolkit label: cobertura del contenido @es
toolkit definition: La cobertura cronológica o geográfica del contenido de un recurso. @es
label: har innehållets täckning @sv
toolkit label: innehållets täckning @sv
label: har dækning af indhold @da
definition: Relaterer et værk til en kronologisk eller geografisk dækning af et værks indhold. @da
toolkit label: dækning af indhold @da
toolkit definition: Kronologisk eller geografisk dækning af et værks indhold. @da
definition: Met une œuvre en relation avec une couverture chronologique ou géographique du contenu d’une œuvre. @fr
label: có bao quát của nội dung @vi
definition: Liên kết tác phẩm với độ bao quát theo biên niên hoặc địa lý của nội dung của tác phẩm. @vi
toolkit label: bao quát của nội dung @vi
toolkit definition: Độ bao quát theo biên niên hoặc địa lý của nội dung của tác phẩm. @vi
label: hat inhaltlichen Bezugsrahmen @de
definition: Setzt ein Werk in Beziehung zu einem chronologischen oder geografischen Bezugsrahmen des Inhalts eines Werks. @de
toolkit label: Inhaltlicher Bezugsrahmen @de
toolkit definition: Ein chronologischer oder geografischer Bezugsrahmen des Inhalts eines Werks. @de
label: a pour couverture du contenu @fr
definition: Liittää teoksen teoksen sisällön ajalliseen tai maantieteelliseen kattavuuteen. @fi
toolkit label: sisällön kattavuus @fi
toolkit definition: Teoksen sisällön ajallinen tai maantieteellinen kattavuus. @fi
toolkit label: innholdsmessig dekning @no
toolkit definition: En kronologisk eller geografisk dekning for innholdet i et verk. @no
label: té com a cobertura de contingut @ca
definition: Relaciona una obra amb una cobertura cronològica o geogràfica del contingut d’una obra. @ca
toolkit label: cobertura de contingut @ca
toolkit definition: Cobertura cronològica o geogràfica del contingut d’una obra. @ca
has element type: 6
label: έχει κάλυψη του περιεχομένου @el
definition: Συνδέει ένα έργο με μια χρονολογική ή γεωγραφική κάλυψη του περιεχομένου ενός έργου. @el
toolkit label: κάλυψη του περιεχομένου @el
toolkit definition: Μια χρονολογική ή γεωγραφική κάλυψη του περιεχομένου ενός έργου. @el
label: tartalmi vonatkozása a következő: @hu
definition: Hozzákapcsol egy művet egy mű tartalmának kronológiai vagy földrajzi vonatkozásához. @hu
toolkit label: tartalmi vonatkozása: @hu
toolkit definition: Egy mű tartalmának kronológiai vagy földrajzi vonatkozásához. @hu
label: sisällön kattavuus @fi
label: har innholdsmessig dekning @no
definition: Relaterer et verk til en kronologisk eller geografisk dekning for innholdet i et verk. @no
label: heeft bereik van content @nl
definition: Relateert een werk aan een chronologisch of geografisch bereik van de content van een werk. @nl
toolkit label: bereik van content @nl
toolkit definition: Een chronologisch of geografisch bereik van de content van een werk. @nl
label: له تغطية لمحتوى @ar
definition: يربط بين عمل وتغطية زمنية أو جغرافية لمحتوى عمل. @ar
toolkit label: تغطية لمحتوى @ar
toolkit definition: تغطية زمنية أو جغرافية لمحتوى عمل. @ar
label: sisu ulatus @et
definition: Seostab teose teose sisu kronoloogilise või geograafilise ulatusega. @et
toolkit label: sisu ulatus @et
toolkit definition: Teose sisu kronoloogiline või geograafiline ulatus. @et
label: ha come copertura del contenuto @it
definition: Correla un’opera a una copertura cronologica o geografica del contenuto di un’opera. @it
toolkit label: copertura del contenuto @it
toolkit definition: Copertura cronologica o geografica del contenuto di un’opera. @it
label: satura aptvērums laikā (?) @lv
definition: Sasaista darbu ar darba satura hronoloģisku vai ģeogrāfisku aptvērumu. @lv
toolkit label: satura aptvērums laikā (?) @lv
toolkit definition: Darba satura hronoloģisks vai ģeogrāfisks aptvērums. @lv
label: 有内容的覆盖面 @zh-hans
definition: 将一种作品与一种作品之内容的时间覆盖面或地理覆盖面关联起来。 @zh-hans
toolkit label: 内容的覆盖面 @zh-hans
toolkit definition: 一种作品之内容的时间覆盖面或地理覆盖面 @zh-hans
has subproperty: P10216
label: içerik kapsamı ile ilişkilidir @tr
definition: Bir eseri, bir eserin içeriğinin kronolojik veya coğrafi kapsamıyla ilişkilendirir. @tr
toolkit label: içerik kapsamı @tr
toolkit definition: Bir eserin içeriğinin kronolojik veya coğrafi kapsamı. @tr

has nature of content
status: Published
definition: Relates a work to a specific character of the primary content of a work.
type: Property
domain: C10001
lexical alias: natureOfContent.en
instruction number: 7.2
toolkit label: nature of content
toolkit definition: A specific character of the primary content of a work.
toolkit label: nature du contenu @fr
toolkit definition: Caractéristique spécifique du contenu principal d’une œuvre. @fr
toolkit label: naturaleza del contenido @es
toolkit definition: El carácter específico del contenido primario del recurso (p.ej., artículos jurídicos; informe provisional). @es
label: har innehållets karaktär @sv
toolkit label: innehållets karaktär @sv
label: har art af indhold @da
definition: Relaterer et værk til en specifik egenskab ved et værks primære indhold. @da
toolkit label: art af indhold @da
toolkit definition: Specifik egenskab ved et værks primære indhold. @da
definition: Met une œuvre en relation avec une caractéristique spécifique du contenu principal d’une œuvre. @fr
label: có bản chất của nội dung @vi
definition: Liên kết tác phẩm với đặc trưng cụ thể của nội dung cơ bản của tác phẩm. @vi
toolkit label: bản chất của nội dung @vi
toolkit definition: Đặc trưng cụ thể của nội dung cơ bản của tác phẩm. @vi
label: hat Art des Inhalts @de
definition: Setzt ein Werk in Beziehung zu einer spezifischen Eigenschaft des primären Inhalts eines Werks. @de
toolkit label: Art des Inhalts @de
toolkit definition: Eine spezifische Eigenschaft des primären Inhalts eines Werks. @de
label: a pour nature du contenu @fr
definition: Liittää teoksen teoksen pääasiallisen sisällön erityispiirteeseen. @fi
toolkit label: sisällön luonne @fi
toolkit definition: Teoksen pääasiallisen sisällön erityispiirre. @fi
toolkit label: innhold @no
toolkit definition: Et bestemt særpreg ved hovedinnholdet til et verk. @no
label: té com a natura de contingut @ca
definition: Relaciona una obra amb una característica específica del contingut principal d’una obra. @ca
toolkit label: natura de contingut @ca
toolkit definition: Característica específica del contingut principal d’una obra. @ca
has element type: 6
label: έχει φύση του περιεχομένου @el
definition: Συνδέει ένα έργο με έναν συγκεκριμένο χαρακτήρα του κύριου περιεχομένου ενός έργου. @el
toolkit label: φύση του περιεχομένου @el
toolkit definition: Ένας συγκεκριμένος χαρακτήρας του κύριου περιεχομένου ενός έργου. @el
label: tartalmának jellege a következő: @hu
definition: Hozzákapcsol egy művet egy mű elsődleges tartalmának adott jellegzetességéhez. @hu
toolkit label: tartalmának jellege: @hu
toolkit definition: Egy mű elsődleges tartalmának sajátos jellegzetessége. @hu
label: sisällön luonne @fi
label: har innhold @no
definition: Relaterer et verk til et bestemt særpreg ved hovedinnholdet til et verk. @no
label: heeft aard van content @nl
definition: Relateert een werk aan een specifiek karakter van de primaire content van een werk. @nl
toolkit label: aard van content @nl
toolkit definition: Een specifiek karakter van de primaire content van een werk. @nl
label: له طبيعة محتوى @ar
definition: يربط بين عمل وخاصية معينة للمحتوى الأساسي لعمل. @ar
toolkit label: طبيعة لمحتوى @ar
toolkit definition: خاصية معينة للمحتوى الأساسي لعمل. @ar
label: sisu olemus @et
definition: Seostab teose selle esmase sisu erijoontega. @et
toolkit label: sisu olemus @et
toolkit definition: Seostab teose selle esmase sisu erijoontega. @et
label: ha come natura del contenuto @it
definition: Correla un’opera a una caratteristica specifica del contenuto principale di un’opera. @it
toolkit label: natura del contenuto @it
toolkit definition: Caratteristica specifica del contenuto principale di un’opera. @it
label: satura raksturojums @lv
definition: Sasaista darbu ar darba pamatsatura būtisku raksturojumu. @lv
toolkit label: satura raksturojums @lv
toolkit definition: Darba pamatsatura būtisks raksturojums. @lv
label: 有内容的性质 @zh-hans
definition: 将一种作品与一种作品的主要内容的特定特征关联起来。 @zh-hans
toolkit label: 内容的性质 @zh-hans
toolkit definition: 一种作品的主要内容的特定特征 @zh-hans
has subproperty: P10222
label: içeriğin niteliği ile ilişkilidir @tr
definition: Bir eseri, eserin birincil içeriğinin belirli bir özelliğiyle ilişkilendirir. @tr
toolkit label: içeriğin niteliği @tr
toolkit definition: Bir eserin temel içeriğinin belirli özelliği. @tr

has television director agent
status: Published
definition: Relates a work to an agent who is a director who is responsible for the general management and supervision of a television program.
type: Property
domain: C10001
sub property of: has director agent
lexical alias: televisionDirectorAgent.en
toolkit label: television director agent
toolkit definition: An agent who is a director who is responsible for the general management and supervision of a television program.
toolkit label: agent réalisateur de télévision @fr
toolkit definition: Agent réalisateur qui est responsable de la gestion et de la supervision générales d’une émission de télévision. @fr
toolkit label: director de televisión @es
toolkit definition: Un director responsable por la dirección y supervisión general de un programa de televisión. @es
instruction number: 18.5
label: har agent, som er tv-regissør @da
definition: Relaterer et værk til en agent, som er instruktør, som er ansvarlig for den generelle ledelse af- og tilsyn med et tv-program. @da
toolkit label: agent, som er tv-regissør @da
toolkit definition: Agent, som er instruktør, som er ansvarlig for den generelle ledelse af- og tilsyn med et tv-program. @da
definition: Met une œuvre en relation avec un agent réalisateur qui est responsable de la gestion et de la supervision générales d’une émission de télévision. @fr
label: có đạo diễn truyền hình @vi
definition: Liên kết tác phẩm với đạo diễn có trách nhiệm về quản lý và giám sát chung của chương trình truyền hình. @vi
toolkit label: đạo diễn truyền hình @vi
toolkit definition: Đạo diễn có trách nhiệm về quản lý và giám sát chung của chương trình truyền hình. @vi
label: hat Fernsehregisseurin/Fernsehregisseur (Akteur) @de
definition: Setzt ein Werk in Beziehung zu einer Regisseurin/einem Regisseur (Akteur), die/der für das allgemeine Management und die Leitung einer Fernsehsendung verantwortlich ist. @de
toolkit label: Fernsehregisseurin/Fernsehregisseur (Akteur) @de
toolkit definition: Eine Regisseurin/Ein Regisseur (Akteur), die/der für das allgemeine Management und die Leitung einer Fernsehsendung verantwortlich ist. @de
label: a pour agent réalisateur de télévision @fr
definition: Liittää teoksen toimijaan, joka on ohjaaja, joka on vastuussa televisio-ohjelman yleisestä johtamisesta ja valvonnasta. @fi
toolkit label: televisio-ohjaaja (toimija) @fi
toolkit definition: Toimija, joka on ohjaaja, joka on vastuussa televisio-ohjelman yleisestä johtamisesta ja valvonnasta. @fi
toolkit label: fjernsynsregissør (agent) @no
toolkit definition: En agent som er regissør med ansvar for generell ledelse av et fjernsynsprogram. @no
label: té com a agent realitzador de televisió @ca
definition: Relaciona una obra amb un agent que és un realitzador que és responsable de la gestió general i la supervisió d’un programa de televisió. @ca
toolkit label: agent realitzador de televisió @ca
toolkit definition: Agent que és un realitzador que és responsable de la gestió general i la supervisió d’un programa de televisió. @ca
has element type: 2
label: έχει τηλεοπτικό διευθυντή @el
definition: Συνδέει ένα έργο με έναν διευθυντή υπεύθυνο για τη γενική διεύθυνση και εποπτεία ενός τηλεοπτικού προγράμματος. @el
toolkit label: τηλεοπτικός διευθυντής @el
toolkit definition: Ένας διευθυντής υπεύθυνος για τη γενική διεύθυνση και εποπτεία ενός τηλεοπτικού προγράμματος. @el
label: televíziós rendező ágense a következő: @hu
definition: Hozzákapcsol egy művet egy rendező ágenshez, amely felelős egy televízióműsor általános menedzseléséért és felügyeletéért. @hu
toolkit label: televíziós rendező ágens: @hu
toolkit definition: Egy rendező ágens, amely felelős egy televízióműsor általános menedzseléséért és felügyeletéért. @hu
alternative label: television director
alternative label: televisio-ohjaaja @fi
label: televisio-ohjaaja (toimija) @fi
label: har fjernsynsregissør (agent) @no
definition: Relaterer et verk til en agent som er regissør med ansvar for generell ledelse av et fjernsynsprogram. @no
alternative label: fjernsynsregissør @no
label: heeft televisieregisseur-actor @nl
definition: Relateert een werk aan een actor die een regisseur is die verantwoordelijk is voor het algemeen beheer en toezicht van een televisieprogramma. @nl
toolkit label: televisieregisseur-actor @nl
toolkit definition: Een actor die een regisseur is die verantwoordelijk is voor het algemeen beheer en toezicht van een televisieprogramma. @nl
label: له وكيل مخرج تليفزيوني @ar
definition: يربط بين عمل ووكيل يكون مخرجا مسئولاً عن الإدارة العامة والإشراف على برنامج تليفزيوني. @ar
alternative label: مخرج تليفزيوني @ar
toolkit label: وكيل مخرج تليفزيوني @ar
toolkit definition: وكيل يكون مديرا مسئولاً عن الإدارة العامة والإشراف على برنامج تليفزيوني. @ar
alternative label: realitzador de televisió @ca
alternative label: tv-instruktør @da
label: telerežissöör (tegija) @et
definition: Seostab teose tegijaga, kes on telesaate üldise juhtimise ja juhendamise eest vastutav režissöör. @et
alternative label: telerežissöör @et
alternative label: telelavastaja (tegija) @et
toolkit label: telerežissöör (tegija) @et
toolkit definition: Tegija, kes on telesaate üldise juhtimise ja juhendamise eest vastutav režissöör. @et
alternative label: televíziós rendező: @hu
label: ha come regista televisivo agente @it
definition: Correla un’opera all'agente regista responsabile dell'organizzazione e della supervisione generali di un programma televisivo. @it
alternative label: regista televisivo @it
toolkit label: regista televisivo agente @it
toolkit definition: Agente responsabile dell'organizzazione e della supervisione generali di programma televisivo. @it
alternative label: réalisateur de télévision @fr
label: televīzijas raidījuma režisors (aģents) @lv
definition: Sasaista darbu ar aģentu - režisors, kurš ir atbildīgs par televīzijas raidījuma vispārēju vadību un uzraudzību. @lv
toolkit label: televīzijas raidījuma režisors (aģents) @lv
toolkit definition: Aģents - režisors, kurš ir atbildīgs par televīzijas raidījuma vispārēju vadību un uzraudzību. @lv
toolkit label: 电视导演行为者 @zh-hans

has television director collective agent
status: Published
lexical alias: televisionDirectorCollectiveAgent.en
definition: Relates a work to a collective agent who is a director who is responsible for the general management and supervision of a television program.
toolkit label: television director collective agent
toolkit definition: A collective agent who is a director who is responsible for the general management and supervision of a television program.
type: Property
domain: C10001
has element type: 2
sub property of: has director collective agent
sub property of: has television director agent
label: televisio-ohjaaja (yhteistoimija) @fi
definition: Liittää teoksen yhteistoimijaan, joka on ohjaaja, joka on vastuussa televisio-ohjelman yleisestä johtamisesta ja valvonnasta. @fi
toolkit label: televisio-ohjaaja (yhteistoimija) @fi
toolkit definition: Yhteistoimija, joka on ohjaaja, joka on vastuussa televisio-ohjelman yleisestä johtamisesta ja valvonnasta. @fi
label: har fjernsynsregissør (kollektiv agent) @no
definition: Relaterer et verk til en kollektiv agent som er regissør med ansvar for generell ledelse av et fjernsynsprogram. @no
toolkit label: fjernsynsregissør (kollektiv agent) @no
toolkit definition: En kollektiv agent som er regissør med ansvar for generell ledelse av et fjernsynsprogram. @no
label: heeft televisieregisseur-collectieve actor @nl
definition: Relateert een werk aan een collectieve actor die een regisseur is die verantwoordelijk is voor het algemeen beheer en toezicht van een televisieprogramma. @nl
toolkit label: televisieregisseur-collectieve actor @nl
toolkit definition: Een collectieve actor die een regisseur is die verantwoordelijk is voor het algemeen beheer en toezicht van een televisieprogramma. @nl
label: له وكيل جماعي مخرج تليفزيوني @ar
definition: يربط بين عمل ووكيل جماعي يكون مديرًا مسئولاً عن الإدارة العامة والإشراف على برنامج تليفزيوني. @ar
toolkit label: وكيل جماعي مخرج تليفزيوني @ar
toolkit definition: وكيل جماعي يكون مديرًا مسئولاً عن الإدارة العامة والإشراف على برنامج تليفزيوني. @ar
label: té com a agent col·lectiu realitzador de televisió @ca
definition: Relaciona una obra amb un agent col·lectiu que és un realitzador que és responsable de la gestió i supervisió d’un programa de televisió. @ca
toolkit label: agent col·lectiu realitzador de televisió @ca
toolkit definition: Agent col·lectiu que és un realitzador que és responsable de la gestió i supervisió d’un programa de televisió. @ca
label: har kollektiv agent, som er tv-regissør @da
definition: Relaterer et værk til en kollektiv agent, som er instruktør, som er ansvarlig for den generelle ledelse af- og tilsyn med et tv-program. @da
toolkit label: kollektiv agent, som er tv-regissør @da
toolkit definition: Kollektiv agent, som er instruktør, som er ansvarlig for den generelle ledelse af- og tilsyn med et tv-program. @da
label: telerežissöör (kollektiiv) @et
definition: Seostab teose kollektiiviga, kes on telesaate üldise juhtimise ja juhendamise eest vastutav režissöör. @et
alternative label: telelavastaja (kollektiiv) @et
toolkit label: telerežissöör (kollektiiv) @et
toolkit definition: Kollektiiv, kes on telesaate üldise juhtimise ja juhendamise eest vastutav režissöör. @et
label: hat Fernsehregisseurin/Fernsehregisseur (Gemeinschaftlicher Akteur) @de
definition: Setzt ein Werk in Beziehung zu einer Regiesseurin/einem Regisseur (Gemeinschaftlicher Akteur), die/der für das allgemeine Management und die Leitung einer Fernsehsendung verantwortlich ist. @de
toolkit label: Fernsehregisseurin/Fernsehregisseur (Gemeinschaftlicher Akteur) @de
toolkit definition: Eine Regisseurin/Ein Regisseur (Gemeinschaftlicher Akteur), die/der für das allgemeine Management und die Leitung einer Fernsehsendung verantwortlich ist. @de
label: televíziós rendező kollektív ágense a következő: @hu
definition: Hozzákapcsol egy művet egy rendező kollektív ágenshez, amely felelős egy televízióműsor általános menedzseléséért és felügyeletéért. @hu
toolkit label: televíziós rendező kollektív ágens: @hu
toolkit definition: Egy rendező kollektív ágens, amely felelős egy televízióműsor általános menedzseléséért és felügyeletéért. @hu
label: ha come regista televisivo agente collettivo @it
definition: Correla un'opera all'agente collettivo regista responsabile della gestione generale e della supervisione di un programma televisivo. @it
toolkit label: regista televisivo agente collettivo @it
toolkit definition: Agente collettivo regista responsabile della gestione generale e della supervisione di un programma televisivo. @it
label: a pour agent collectif réalisateur de télévision @fr
definition: Met une œuvre en relation avec un agent collectif réalisateur qui est responsable de la gestion et de la supervision générales d’une émission de télévision. @fr
toolkit label: agent collectif réalisateur de télévision @fr
toolkit definition: Agent collectif réalisateur qui est responsable de la gestion et de la supervision générales d’une émission de télévision. @fr
label: televīzijas raidījuma režisors (grupa) @lv
definition: Sasaista darbu ar grupu - režisors, kura ir atbildīga par televīzijas raidījuma vispārēju vadību un uzraudzību. @lv
toolkit label: televīzijas raidījuma režisors (grupa) @lv
toolkit definition: Grupa - režisors, kura ir atbildīga par televīzijas raidījuma vispārēju vadību un uzraudzību. @lv
label: 有电视导演集体行为者 @zh-hans
definition: 将一种作品与作为一个导演并负责电视节目的总体管理和监督的一个集体行为者关联起来。 @zh-hans
toolkit label: 电视导演集体行为者 @zh-hans
toolkit definition: 作为一个导演并负责电视节目的总体管理和监督的一个集体行为者 @zh-hans
has subproperty: has television director corporate body
has subproperty: has television director family
has subproperty: P10467
label: televizyon yönetmeni kolektif temsilcisi ile ilişkilidir @tr
definition: Bir eseri, bir televizyon programının genel yönetimi ve denetiminden sorumlu yönetmen olan kolektif bir temsilci ile ilişkilendirir. @tr
toolkit label: televizyon yönetmeni kolektif temsilci @tr
toolkit definition: Bir televizyon programının genel yönetimi ve denetiminden sorumlu yönetmen olan kolektif bir temsilci. @tr

has television director corporate body
status: Published
lexical alias: televisionDirectorCorporateBody.en
definition: Relates a work to a corporate body who is a director who is responsible for the general management and supervision of a television program.
toolkit label: television director corporate body
toolkit definition: A corporate body who is a director who is responsible for the general management and supervision of a television program.
type: Property
domain: C10001
has element type: 2
sub property of: has director corporate body
sub property of: has television director collective agent
label: televisio-ohjaaja (yhteisö) @fi
definition: Liittää teoksen yhteisöön, joka on ohjaaja, joka on vastuussa televisio-ohjelman yleisestä johtamisesta ja valvonnasta. @fi
toolkit label: televisio-ohjaaja (yhteisö) @fi
toolkit definition: Yhteisö, joka on ohjaaja, joka on vastuussa televisio-ohjelman yleisestä johtamisesta ja valvonnasta. @fi
label: har fjernsynsregissør (korporasjon) @no
definition: Relaterer et verk til en korporasjon som er regissør med ansvar for generell ledelse av et fjernsynsprogram. @no
toolkit label: fjernsynsregissør (korporasjon) @no
toolkit definition: En korporasjon som er regissør med ansvar for generell ledelse av et fjernsynsprogram. @no
label: heeft televisieregisseur-corporatie @nl
definition: Relateert een werk aan een corporatie die een regisseur is die verantwoordelijk is voor het algemeen beheer en toezicht van een televisieprogramma. @nl
toolkit label: televisieregisseur-corporatie @nl
toolkit definition: Een corporatie die een regisseur is die verantwoordelijk is voor het algemeen beheer en toezicht van een televisieprogramma. @nl
label: له هيئة مخرجة تليفزيونية @ar
definition: يربط بين عمل وهيئة تكون مديرة مسئولة عن الإدارة العامة والإشراف على برنامج تليفزيوني. @ar
toolkit label: هيئة مخرجة تليفزيونية @ar
toolkit definition: هيئة تكون مديرة مسئولة عن الإدارة العامة والإشراف على برنامج تليفزيوني. @ar
label: té com a entitat corporativa realitzadora de televisió @ca
definition: Relaciona una obra amb una entitat corporativa que és un realitzador que és responsable de la gestió i supervisió d’un programa de televisió. @ca
toolkit label: entitat corporativa realitzadora de televisió @ca
toolkit definition: Entitat corporativa que és un realitzador que és responsable de la gestió i supervisió d’un programa de televisió. @ca
label: har korporation, som er tv-regissør @da
definition: Relaterer et værk til en korporation, som er instruktør, som er ansvarlig for den generelle ledelse af- og tilsyn med et tv-program. @da
toolkit label: korporation, som er tv-regissør @da
toolkit definition: Korporation, som er instruktør, som er ansvarlig for den generelle ledelse af- og tilsyn med et tv-program. @da
label: telerežissöör (asutus) @et
definition: Seostab teose asutusega, kes on telesaate üldise juhtimise ja juhendamise eest vastutav režissöör. @et
alternative label: telelavastaja (asutus) @et
toolkit label: telerežissöör (asutus) @et
toolkit definition: Asutus, kes on telesaate üldise juhtimise ja juhendamise eest vastutav režissöör. @et
label: hat Fernsehregisseur/Fernsehregisseur (Körperschaft) @de
definition: Setzt ein Werk in Beziehung zu einer Regisseurin/einem Regisseur (Körperschaft), die/der für das allgemeine Management und die Leitung einer Fernsehsendung verantwortlich ist. @de
toolkit label: Fernsehregisseur/Fernsehregisseur (Körperschaft) @de
toolkit definition: Eine Regisseurin/Ein Regisseur (Körperschaft), die/der für das allgemeine Management und die Leitung einer Fernsehsendung verantwortlich ist. @de
label: televíziós rendező testülete a következő: @hu
definition: Hozzákapcsol egy művet egy rendező testülethez, amely felelős egy televízióműsor általános menedzseléséért és felügyeletéért. @hu
toolkit label: televíziós rendező testület: @hu
toolkit definition: Egy rendező testület, amely felelős egy televízióműsor általános menedzseléséért és felügyeletéért. @hu
label: ha come regista televisivo ente @it
definition: Correla un'opera a un ente regista responsabile della gestione generale e della supervisione di un programma televisivo. @it
toolkit label: regista televisivo ente @it
toolkit definition: Ente regista responsabile della gestione generale e della supervisione di un programma televisivo. @it
label: a pour collectivité réalisatrice de télévision @fr
definition: Met une œuvre en relation avec une collectivité réalisatrice qui est responsable de la gestion et de la supervision générales d’une émission de télévision. @fr
toolkit label: collectivité réalisatrice de télévision @fr
toolkit definition: Collectivité réalisatrice qui est responsable de la gestion et de la supervision générales d’une émission de télévision. @fr
label: televīzijas raidījuma režisors (institūcija) @lv
definition: Sasaista darbu ar institūciju - režisors, kura atbildīga par televīzijas raidījuma vispārēju vadību un uzraudzību. @lv
toolkit label: televīzijas raidījuma režisors (institūcija) @lv
toolkit definition: Institūcija - režisors, kura atbildīga par televīzijas raidījuma vispārēju vadību un uzraudzību. @lv
label: 有电视导演团体 @zh-hans
definition: 将一种作品与作为一个导演并负责电视节目的总体管理和监督的一个团体关联起来。 @zh-hans
toolkit label: 电视导演团体 @zh-hans
toolkit definition: 作为一个导演并负责电视节目的总体管理和监督的一个团体 @zh-hans
has subproperty: P10514
label: televizyon yönetmeni tüzel kişisi ile ilişkilidir @tr
definition: Bir eseri, bir televizyon programının genel yönetim ve denetiminden sorumlu yönetici olan tüzel kişi ile ilişkilendirir. @tr
toolkit label: televizyon yönetmeni tüzel kişi @tr
toolkit definition: Bir televizyon programının genel yönetim ve denetiminden sorumlu yönetici olan tüzel kişilik. @tr

has television director family
status: Published
lexical alias: televisionDirectorFamily.en
definition: Relates a work to a family who is a director who is responsible for the general management and supervision of a television program.
toolkit label: television director family
toolkit definition: A family who is a director who is responsible for the general management and supervision of a television program.
type: Property
domain: C10001
has element type: 2
sub property of: has director family
sub property of: has television director collective agent
label: televisio-ohjaaja (suku) @fi
definition: Liittää teoksen sukuun, joka on ohjaaja, joka on vastuussa televisio-ohjelman yleisestä johtamisesta ja valvonnasta. @fi
toolkit label: televisio-ohjaaja (suku) @fi
toolkit definition: Suku, joka on ohjaaja, joka on vastuussa televisio-ohjelman yleisestä johtamisesta ja valvonnasta. @fi
label: har fjernsynsregissør (familie) @no
definition: Relaterer et verk til en familie som er regissør med ansvar for generell ledelse av et fjernsynsprogram. @no
toolkit label: fjernsynsregissør (familie) @no
toolkit definition: En familie som er regissør med ansvar for generell ledelse av et fjernsynsprogram. @no
label: heeft televisieregisseur-familie @nl
definition: Relateert een werk aan een familie die een regisseur is die verantwoordelijk is voor het algemeen beheer en toezicht van een televisieprogramma. @nl
toolkit label: televisieregisseur-familie @nl
toolkit definition: Een familie die een regisseur is die verantwoordelijk is voor het algemeen beheer en toezicht van een televisieprogramma. @nl
label: له عائلة مخرجة تليفزيونية @ar
definition: يربط بين عمل وعائلة تكون مديرة مسئولة عن الإدارة العامة والإشراف على برنامج تليفزيوني. @ar
toolkit label: عائلة مخرجة تليفزيونية @ar
toolkit definition: عائلة تكون مديرة مسئولة عن الإدارة العامة والإشراف على برنامج تليفزيوني. @ar
label: té com a família realitzadora de televisió @ca
definition: Relaciona una obra amb una família que és un realitzador responsable de la gestió general i la supervisió d’un programa de televisió. @ca
toolkit label: família realitzadora de televisió @ca
toolkit definition: Família que és un realitzador responsable de la gestió general i la supervisió d’un programa de televisió. @ca
label: har familie, som er tv-regissør @da
definition: Relaterer et værk til en familie, som er instruktør, som er ansvarlig for den generelle ledelse af- og tilsyn med et tv-program. @da
toolkit label: familie, som er tv-regissør @da
toolkit definition: Familie, som er instruktør, som er ansvarlig for den generelle ledelse af- og tilsyn med et tv-program. @da
label: telerežissöör (perekond) @et
definition: Seostab teose perekonnaga, kes on telesaate üldise juhtimise ja juhendamise eest vastutav režissöör. @et
alternative label: telelavastaja (perekond) @et
toolkit label: telerežissöör (perekond) @et
toolkit definition: Perekond, kes on telesaate üldise juhtimise ja juhendamise eest vastutav režissöör. @et
label: hat Fernsehregisseurin/Fernsehregisseur (Familie) @de
definition: Setzt ein Werk in Beziehung zu einer Regisseurin/einem Regisseur (Familie), die/der für das allgemeine Management und die Leitung einer Fernsehsendung verantwortlich ist. @de
toolkit label: Fernsehregisseurin/Fernsehregisseur (Familie) @de
toolkit definition: Eine Regisseurin/Ein Regisseur (Familie), die/der für das allgemeine Management und die Leitung einer Fernsehsendung verantwortlich ist. @de
label: televíziós rendező családja a következő: @hu
definition: Hozzákapcsol egy művet egy rendező családhoz, amely felelős egy televízióműsor általános menedzseléséért és felügyeletéért. @hu
toolkit label: televíziós rendező család: @hu
toolkit definition: Egy rendező család, amely felelős egy televízióműsor általános menedzseléséért és felügyeletéért. @hu
label: ha come regista televisivo famiglia @it
definition: Correla un'opera alla famiglia regista responsabile della gestione generale e della supervisione di un programma televisivo. @it
toolkit label: regista televisivo famiglia @it
toolkit definition: Famiglia regista responsabile della gestione generale e della supervisione di un programma televisivo. @it
label: a pour famille réalisatrice de télévision @fr
definition: Met une œuvre en relation avec une famille réalisatrice qui est responsable de la gestion et de la supervision générales d’une émission de télévision. @fr
toolkit label: famille réalisatrice de télévision @fr
toolkit definition: Famille réalisatrice qui est responsable de la gestion et de la supervision générales d’une émission de télévision. @fr
label: televīzijas raidījuma režisors (dzimta/ģimene) @lv
definition: Sasaista darbu ar dzimtu/ģimeni - režisors, kura atbildīga televīzijas raidījuma vispārēju vadību un uzraudzību. @lv
toolkit label: televīzijas raidījuma režisors (dzimta/ģimene) @lv
toolkit definition: Dzimta/ģimene - režisors, kura atbildīga televīzijas raidījuma vispārēju vadību un uzraudzību. @lv
label: 有电视导演家族 @zh-hans
definition: 将一种作品与作为一个导演并负责电视节目的总体管理和监督的一个家族关联起来。 @zh-hans
toolkit label: 电视导演家族 @zh-hans
toolkit definition: 作为一个导演并负责电视节目的总体管理和监督的一个家族 @zh-hans
has subproperty: P10561
label: televizyon yönetmeni ailesi ile ilişkilidir @tr
definition: Bir eseri, bir televizyon programının genel yönetimi ve denetiminden sorumlu yönetmen bir aileyle ilişkilendirir. @tr
toolkit label: televizyon yönetmeni aile @tr
toolkit definition: Bir televizyon programının genel yönetim ve denetiminden sorumlu yönetmen olan aile. @tr

has television director person
status: Published
lexical alias: televisionDirectorPerson.en
definition: Relates a work to a person who is a director who is responsible for the general management and supervision of a television program.
toolkit label: television director person
toolkit definition: A person who is a director who is responsible for the general management and supervision of a television program.
type: Property
domain: C10001
has element type: 2
sub property of: has director person
sub property of: has television director agent
label: televisio-ohjaaja (henkilö) @fi
definition: Liittää teoksen henkilöön, joka on ohjaaja, joka on vastuussa televisio-ohjelman yleisestä johtamisesta ja valvonnasta. @fi
toolkit label: televisio-ohjaaja (henkilö) @fi
toolkit definition: Henkilö, joka on ohjaaja, joka on vastuussa televisio-ohjelman yleisestä johtamisesta ja valvonnasta. @fi
label: har fjernsynsregissør (person) @no
definition: Relaterer et verk til en person som er regissør med ansvar for generell ledelse av et fjernsynsprogram. @no
toolkit label: fjernsynsregissør (person) @no
toolkit definition: En person som er regissør med ansvar for generell ledelse av et fjernsynsprogram. @no
label: heeft televisieregisseur-persoon @nl
definition: Relateert een werk aan een persoon die een regisseur is die verantwoordelijk is voor het algemeen beheer en toezicht van een televisieprogramma. @nl
toolkit label: televisieregisseur-persoon @nl
toolkit definition: Een persoon die een regisseur is die verantwoordelijk is voor het algemeen beheer en toezicht van een televisieprogramma. @nl
label: له شخص مخرج تليفزيوني @ar
definition: يربط بين عمل وشخص يكون مديرًا مسئولاً عن الإدارة العامة والإشراف على برنامج تليفزيوني. @ar
toolkit label: شخص مخرج تليفزيوني @ar
toolkit definition: شخص يكون مديرًا مسئولاً عن الإدارة العامة والإشراف على برنامج تليفزيوني. @ar
label: té com a persona realitzadora de televisió @ca
definition: Relaciona una obra amb una persona que és un realitzador que és responsable de la gestió general i la supervisió d’un programa de televisió. @ca
toolkit label: persona realitzadora de televisió @ca
toolkit definition: Persona que és un realitzador que és responsable de la gestió general i la supervisió d’un programa de televisió. @ca
label: har person, som er tv-regissør @da
definition: Relaterer et værk til en person, som er instruktør, som er ansvarlig for den generelle ledelse af- og tilsyn med et tv-program. @da
toolkit label: person, som er tv-regissør @da
toolkit definition: Person, som er instruktør, som er ansvarlig for den generelle ledelse af- og tilsyn med et tv-program. @da
label: telerežissöör (isik) @et
definition: Seostab teose isikuga, kes on telesaate üldise juhtimise ja juhendamise eest vastutav režissöör. @et
alternative label: telelavastaja (isik) @et
toolkit label: telerežissöör (isik) @et
toolkit definition: Isik, kes on telesaate üldise juhtimise ja juhendamise eest vastutav režissöör. @et
label: hat Fernsehregisseurin/Fernsehregisseur (Person) @de
definition: Setzt ein Werk in Beziehung zu einer Regisseurin/einem Regisseur (Person), die/der für das allgemeine Management und die Leitung einer Fernsehsendung verantwortlich ist. @de
toolkit label: Fernsehregisseurin/Fernsehregisseur (Person) @de
toolkit definition: Eine Regisseurin/Ein Regisseur (Person), die/der für das allgemeine Management und die Leitung einer Fernsehsendung verantwortlich ist. @de
label: televíziós rendező személye a következő: @hu
definition: Hozzákapcsol egy művet egy rendező személyhez, aki felelős egy televízióműsor általános menedzseléséért és felügyeletéért. @hu
toolkit label: televíziós rendező személy: @hu
toolkit definition: Egy rendező személy, aki felelős egy televízióműsor általános menedzseléséért és felügyeletéért. @hu
label: ha come regista televisivo persona @it
definition: Correla un'opera alla persona regista responsabile della gestione generale e della supervisione di un programma televisivo. @it
toolkit label: regista televisivo persona @it
toolkit definition: Persona regista responsabile della gestione generale e della supervisione di un programma televisivo @it
label: a pour personne réalisatrice de télévision @fr
definition: Met une œuvre en relation avec une personne réalisatrice qui est responsable de la gestion et de la supervision générales d’une émission de télévision. @fr
toolkit label: personne réalisatrice de télévision @fr
toolkit definition: Personne réalisatrice qui est responsable de la gestion et de la supervision générales d’une émission de télévision. @fr
label: televīzijas raidījuma režisors (persona) @lv
definition: Sasaista darbu ar personu - režisors, kura atbildīga par televīzijas raidījuma vispārēju vadību un uzraudzību. @lv
toolkit label: televīzijas raidījuma režisors (persona) @lv
toolkit definition: Persona - režisors, kura atbildīga par televīzijas raidījuma vispārēju vadību un uzraudzību. @lv
label: 有电视导演个人 @zh-hans
definition: 将一种作品与作为一个导演并负责电视节目的总体管理和监督的一个个人关联起来。 @zh-hans
toolkit label: 电视导演个人 @zh-hans
toolkit definition: 作为一个导演并负责电视节目的总体管理和监督的一个个人 @zh-hans
has subproperty: P10420
label: televizyon yönetmeni kişisi ile ilişkilidir @tr
definition: Bir eseri, bir televizyon programının genel yönetim ve denetiminden sorumlu yönetmen olan kişiyle ilişkilendirir. @tr
toolkit label: televizyon yönetmeni olan kişi @tr
toolkit definition: Bir televizyon programının genel yönetim ve denetiminden sorumlu olan yönetmen kişi. @tr

has television producer agent
status: Published
definition: Relates a work to an agent who is a producer who is responsible for most of the business aspects of a television program.
type: Property
domain: C10001
sub property of: has producer agent
lexical alias: televisionProducerAgent.en
toolkit label: television producer agent
toolkit definition: An agent who is a producer who is responsible for most of the business aspects of a television program.
toolkit label: agent producteur de télévision @fr
toolkit definition: Agent producteur qui est responsable de la majeure partie des aspects commerciaux d’une émission de télévision. @fr
toolkit label: productor de televisión @es
toolkit definition: Un productor responsable de la mayor parte de los aspectos empresariales relacionados con un programa de televisión. @es
instruction number: 18.5
label: har agent, som er tv-producer @da
definition: Relaterer et værk til en agent, som er en producer, som er ansvarlig for størstedelen af de forretningsmæssige aspekter ved et tv-program. @da
toolkit label: agent, som er tv-producer @da
toolkit definition: Agent, som er en producer, som er ansvarlig for størstedelen af de forretningsmæssige aspekter ved et tv-program. @da
definition: Met une œuvre en relation avec un agent producteur qui est responsable de la majeure partie des aspects commerciaux d’une émission de télévision. @fr
label: có nhà sản xuất truyền hình @vi
definition: Liên kết tác phẩm với nhà sản xuất có trách nhiệm về phần lớn khía cạnh kinh doanh của chương trình truyền hình. @vi
toolkit label: nhà sản xuất truyền hình @vi
toolkit definition: Nhà sản xuất có trách nhiệm về phần lớn khía cạnh kinh doanh của chương trình truyền hình. @vi
label: hat Fernsehproduzentin/Fernsehproduzenten (Akteur) @de
definition: Setzt ein Werk in Beziehung zu einer Produzentin/einem Produzenten (Akteur), die/der für die meisten geschäftlichen Aspekte einer Fernsehsendung verantwortlich ist. @de
toolkit label: Fernsehproduzentin/Fernsehproduzent (Akteur) @de
toolkit definition: Eine Produzentin/Ein Produzent (Akteur), die/der für die meisten geschäftlichen Aspekte einer Fernsehsendung verantwortlich ist. @de
label: a pour agent producteur de télévision @fr
definition: Liittää teoksen toimijaan, joka on tuottaja, joka on vastuussa suurimmasta osasta televisio-ohjelman liiketoiminnasta. @fi
toolkit label: televisiotuottaja (toimija) @fi
toolkit definition: Toimija, joka on tuottaja, joka on vastuussa suurimmasta osasta televisio-ohjelman liiketoiminnasta. @fi
toolkit label: fjernsynsprodusent (agent) @no
toolkit definition: En agent som er en produsent med ansvar for de fleste forretningsmessige aspektene ved et fjernsynsprogram. @no
label: té com a agent productor de televisió @ca
definition: Relaciona una obra amb un agent que és un productor que és responsable de la majoria dels aspectes comercials d’un programa de televisió. @ca
toolkit label: agent productor de televisió @ca
toolkit definition: Agent que és un productor que és responsable de la majoria dels aspectes comercials d’un programa de televisió. @ca
has element type: 2
label: έχει τηλεοπτικό παραγωγό @el
definition: Συνδέει ένα έργο με έναν παραγωγό υπεύθυνο για τις περισσότερες επιχειρηματικές πτυχές ενός τηλεοπτικού προγράμματος. @el
toolkit label: τηλεοπτικός παραγωγός @el
toolkit definition: Ένας παραγωγός υπεύθυνος για τις περισσότερες επιχειρηματικές πτυχές ενός τηλεοπτικού προγράμματος. @el
label: televízió-producer ágense a következő: @hu
definition: Hozzákapcsol egy művet egy producer ágenshez, amely felelős egy televízióműsor üzleti vonatkozásainak a zöméért. @hu
toolkit label: televízió-producer ágense: @hu
toolkit definition: Egy producer ágens, amely felelős egy televízióműsor üzleti vonatkozásainak a zöméért. @hu
alternative label: television producer
alternative label: televisiotuottaja @fi
label: televisiotuottaja (toimija) @fi
label: har fjernsynsprodusent (agent) @no
definition: Relaterer et verk til en agent som er en produsent med ansvar for de fleste forretningsmessige aspektene ved et fjernsynsprogram. @no
alternative label: fjernsynsprodusent @no
label: heeft televisieproducent-actor @nl
definition: Relateert een werk aan een actor die een producer is die verantwoordelijk is voor het merendeel van de zakelijke aspecten van een televisieprogramma. @nl
toolkit label: televisieproducent-actor @nl
toolkit definition: Een actor die een producer is die verantwoordelijk is voor het merendeel van de zakelijke aspecten van een televisieprogramma. @nl
label: له وكيل منتج تليفزيوني @ar
definition: يربط بين عمل ووكيل عبارة عن منتج مسئول عن معظم جوانب العمل في برنامج تليفزيوني. @ar
alternative label: منتج تليفزيوني @ar
toolkit label: وكيل منتج تليفزيوني @ar
toolkit definition: وكيل عبارة عن منتج مسئول عن معظم جوانب العمل في برنامج تليفزيوني. @ar
alternative label: productor de televisió @ca
alternative label: tv-producer @da
label: teleprodutsent (tegija) @et
definition: Seostab teose tegijaga, kes produtsendina vastutab enamiku äriliste aspektide eest telesaate tootmisel. @et
alternative label: teleprodutsent @et
toolkit label: teleprodutsent (tegija) @et
toolkit definition: Tegija, kes produtsendina vastutab enamiku äriliste aspektide eest telesaate tootmisel. @et
alternative label: televízió-producer: @hu
label: ha come produttore televisivo agente @it
definition: Correla un'opera all'agente produttore responsabile della maggior parte degli aspetti commerciali di un programma televisivo. @it
alternative label: produttore televisivo @it
toolkit label: produttore televisivo agente @it
toolkit definition: Agente produttore responsabile della maggior parte degli aspetti commerciali di un programma televisivo. @it
alternative label: producteur de télévision @fr
label: televīzijas raidījuma producents (aģents) @lv
definition: Sasaista darbu ar aģentu - producents, kurš atbildīgs par televīzijas raidījuma biznesa aspektiem. @lv
toolkit label: televīzijas raidījuma producents (aģents) @lv
toolkit definition: Aģents - producents, kurš atbildīgs par televīzijas raidījuma biznesa aspektiem. @lv
alternative label: Fernsehproduzent @de
toolkit label: 电视制作者行为者 @zh-hans

has television producer collective agent
status: Published
lexical alias: televisionProducerCollectiveAgent.en
definition: Relates a work to a collective agent who is a producer who is responsible for most of the business aspects of a television program.
toolkit label: television producer collective agent
toolkit definition: A collective agent who is a producer who is responsible for most of the business aspects of a television program.
type: Property
domain: C10001
has element type: 2
sub property of: has producer collective agent
sub property of: has television producer agent
label: televisiotuottaja (yhteistoimija) @fi
definition: Liittää teoksen yhteistoimijaan, joka on tuottaja, joka on vastuussa suurimmasta osasta televisio-ohjelman liiketoiminnasta. @fi
toolkit label: televisiotuottaja (yhteistoimija) @fi
toolkit definition: Yhteistoimija, joka on tuottaja, joka on vastuussa suurimmasta osasta televisio-ohjelman liiketoiminnasta. @fi
label: har fjernsynsprodusent (kollektiv agent) @no
definition: Relaterer et verk til en kollektiv agent som er en produsent med ansvar for de fleste forretningsmessige aspektene ved et fjernsynsprogram. @no
toolkit label: fjernsynsprodusent (kollektiv agent) @no
toolkit definition: En kollektiv agent som er en produsent med ansvar for de fleste forretningsmessige aspektene ved et fjernsynsprogram. @no
label: heeft televisieproducent-collectieve actor @nl
definition: Relateert een werk aan een collectieve actor die een producer is die verantwoordelijk is voor het merendeel van de zakelijke aspecten van een televisieprogramma. @nl
toolkit label: televisieproducent-collectieve actor @nl
toolkit definition: Een collectieve actor die een producer is die verantwoordelijk is voor het merendeel van de zakelijke aspecten van een televisieprogramma. @nl
label: له وكيل جماعي منتج تليفزيوني @ar
definition: يربط بين عمل ووكيل جماعي يكون منتجًا مسئولاً عن معظم جوانب العمل في برنامج تليفزيوني. @ar
toolkit label: وكيل جماعي منتج تليفزيوني @ar
toolkit definition: وكيل جماعي يكون منتجًا مسئولاً عن معظم جوانب العمل في برنامج إذاعي. @ar
label: té com a agent col·lectiu productor de televisió @ca
definition: Relaciona una obra amb un agent col·lectiu que és un productor que és responsable de la majoria dels aspectes comercials d’un programa de televisió. @ca
toolkit label: agent col·lectiu productor de televisió @ca
toolkit definition: Agent col·lectiu que és un productor que és responsable de la majoria dels aspectes comercials d’un programa de televisió. @ca
label: har kollektiv agent, som er tv-producer @da
definition: Relaterer et værk til en kollektiv agent, som er en producer, som er ansvarlig for størstedelen af de forretningsmæssige aspekter ved et tv-program. @da
toolkit label: kollektiv agent, som er tv-producer @da
toolkit definition: Kollektiv agent, som er en producer, som er ansvarlig for størstedelen af de forretningsmæssige aspekter ved et tv-program. @da
label: teleprodutsent (kollektiiv) @et
definition: Seostab teose kollektiiviga, kes produtsendina vastutab enamiku äriliste aspektide eest telesaate tootmisel. @et
toolkit label: teleprodutsent (kollektiiv) @et
toolkit definition: Kollektiiv, kes produtsendina vastutab enamiku äriliste aspektide eest telesaate tootmisel. @et
label: hat Fernsehproduzentin/Fernsehproduzenten (Gemeinschaftlicher Akteur) @de
definition: Setzt ein Werk in Beziehung zu einer Produzentin/einem Produzenten (Gemeinschaftlicher Akteur), die/der für die meisten geschäftlichen Aspekte einer Fernsehsendung verantwortlich ist. @de
toolkit label: Fernsehproduzentin/Fernsehproduzent (Gemeinschaftlicher Akteur) @de
toolkit definition: Eine Produzentin/Ein Produzent (Gemeinschaftlicher Akteur), die/der für die meisten geschäftlichen Aspekte einer Fernsehsendung verantwortlich ist. @de
label: televízióproducer kollektív ágense a következő: @hu
definition: Hozzákapcsol egy művet egy producer kollektív ágenshez, amely felelős egy televízióműsor üzleti vonatkozásainak a zöméért. @hu
toolkit label: televízióproducer kollektív ágens: @hu
toolkit definition: Egy producer kollektív ágens, amely felelős egy televízióműsor üzleti vonatkozásainak a zöméért. @hu
label: ha come produttore televisivo agente collettivo @it
definition: Correla un'opera all'agente collettivo produttore responsabile della gestione della maggior parte degli aspetti commerciali di un programma televisivo. @it
toolkit label: produttore televisivo agente collettivo @it
toolkit definition: Agente collettivo produttore responsabile della gestione della maggior parte degli aspetti commerciali di un programma televisivo. @it
label: a pour agent collectif producteur de télévision @fr
definition: Met une œuvre en relation avec un agent collectif producteur qui est responsable de la majeure partie des aspects commerciaux d’une émission de télévision. @fr
toolkit label: agent collectif producteur de télévision @fr
toolkit definition: Agent collectif producteur qui est responsable de la majeure partie des aspects commerciaux d’une émission de télévision. @fr
label: televīzijas raidījuma producents (grupa) @lv
definition: Sasaista darbu ar grupu - producents, kura atbildīga par televīzijas raidījuma biznesa aspektiem. @lv
toolkit label: televīzijas raidījuma producents (grupa) @lv
toolkit definition: Grupa - producents, kura atbildīga par televīzijas raidījuma biznesa aspektiem. @lv
label: 有电视制作者集体行为者 @zh-hans
definition: 将一种作品与作为制作者并负责电视节目的大部分商业运作的一个集体行为者关联起来。 @zh-hans
toolkit label: 电视制作者集体行为者 @zh-hans
toolkit definition: 作为制作者并负责电视节目的大部分商业运作的一个集体行为者 @zh-hans
has subproperty: has television producer corporate body
has subproperty: has television producer family
has subproperty: P10471
label: televizyon yapımcısı kolektif temsilcisi ile ilişkilidir @tr
definition: Bir eseri, bir televizyon programının ticari yönlerinin çoğundan sorumlu yapımcı olan kolektif bir temsilci ile ilişkilendirir. @tr
toolkit label: televizyon yapımcısı kolektif temsilci @tr
toolkit definition: Bir televizyon programının ticari yönlerinin çoğundan sorumlu olan bir yapımcı olan kolektif bir temsilci. @tr

has television producer corporate body
status: Published
lexical alias: televisionProducerCorporateBody.en
definition: Relates a work to a corporate body who is a producer who is responsible for most of the business aspects of a television program.
toolkit label: television producer corporate body
toolkit definition: A corporate body who is a producer who is responsible for most of the business aspects of a television program.
type: Property
domain: C10001
has element type: 2
sub property of: has producer corporate body
sub property of: has television producer collective agent
label: televisiotuottaja (yhteisö) @fi
definition: Liittää teoksen yhteisöön, joka on tuottaja, joka on vastuussa suurimmasta osasta televisio-ohjelman liiketoiminnasta. @fi
toolkit label: televisiotuottaja (yhteisö) @fi
toolkit definition: Yhteisö, joka on tuottaja, joka on vastuussa suurimmasta osasta televisio-ohjelman liiketoiminnasta. @fi
label: har fjernsynsprodusent (korporasjon) @no
definition: Relaterer et verk til en korporasjon som er en produsent med ansvar for de fleste forretningsmessige aspektene ved et fjernsynsprogram. @no
toolkit label: fjernsynsprodusent (korporasjon) @no
toolkit definition: En korporasjon som er en produsent med ansvar for de fleste forretningsmessige aspektene ved et fjernsynsprogram. @no
label: heeft televisieproducent-corporatie @nl
definition: Relateert een werk aan een corporatie die een producer is die verantwoordelijk is voor het merendeel van de zakelijke aspecten van een televisieprogramma. @nl
toolkit label: televisieproducent-corporatie @nl
toolkit definition: Een corporatie die een producer is die verantwoordelijk is voor het merendeel van de zakelijke aspecten van een televisieprogramma. @nl
label: له هيئة منتجة تليفزيونية @ar
definition: يربط بين عمل وهيئة تكون منتجة مسئولة عن معظم جوانب العمل في برنامج تليفزيوني. @ar
toolkit label: هيئة منتجة تليفزيونية @ar
toolkit definition: هيئة تكون منتجة مسئولة عن معظم جوانب العمل في برنامج تليفزيوني. @ar
label: té com a entitat corporativa productora de televisió @ca
definition: Relaciona una obra amb una entitat corporativa que és un productor que és responsable de la majoria dels aspectes comercials d’un programa de televisió. @ca
toolkit label: entitat corporativa productora de televisió @ca
toolkit definition: Entitat corporativa que és un productor que és responsable de la majoria dels aspectes comercials d’un programa de televisió. @ca
label: har korporation, som er tv-producer @da
definition: Relaterer et værk til en korporation, som er en producer, som er ansvarlig for størstedelen af de forretningsmæssige aspekter ved et tv-program. @da
toolkit label: korporation, som er tv-producer @da
toolkit definition: Korporation, som er en producer, som er ansvarlig for størstedelen af de forretningsmæssige aspekter ved et tv-program. @da
label: teleprodutsent (asutus) @et
definition: Seostab teose asutusega, kes produtsendina vastutab enamiku äriliste aspektide eest telesaate tootmisel. @et
toolkit label: teleprodutsent (asutus) @et
toolkit definition: Asutus, kes produtsendina vastutab enamiku äriliste aspektide eest telesaate tootmisel. @et
label: hat Fernsehproduzentin/Fernsehproduzenten (Körperschaft) @de
definition: Setzt ein Werk in Beziehung zu einer Produzentin/einem Produzenten (Körperschaft), die/der für die meisten geschäftlichen Aspekte einer Fernsehsendung verantwortlich ist. @de
toolkit label: Fernsehproduzentin/Fernsehproduzent (Körperschaft) @de
toolkit definition: Eine Produzentin/Ein Produzent (Körperschaft), die/der für die meisten geschäftlichen Aspekte einer Fernsehsendung verantwortlich ist. @de
label: televízió-producer testülete a következő: @hu
definition: Hozzákapcsol egy művet egy producer testülethez, amely felelős egy televízióműsor üzleti vonatkozásainak a zöméért. @hu
toolkit label: televízió-producer testület: @hu
toolkit definition: Egy producer testület, amely felelős egy televízióműsor üzleti vonatkozásainak a zöméért. @hu
label: ha come produttore televisivo ente @it
definition: Correla un'opera a un ente produttore responsabile della gestione della maggior parte degli aspetti commerciali di un programma televisivo. @it
toolkit label: produttore televisivo ente @it
toolkit definition: Ente produttore responsabile della gestione della maggior parte degli aspetti commerciali di un programma televisivo. @it
label: a pour collectivité productrice de télévision @fr
definition: Met une œuvre en relation avec une collectivité productrice qui est responsable de la majeure partie des aspects commerciaux d’une émission de télévision. @fr
toolkit label: collectivité productrice de télévision @fr
toolkit definition: Collectivité productrice qui est responsable de la majeure partie des aspects commerciaux d’une émission de télévision. @fr
label: televīzijas raidījuma producents (institūcija) @lv
definition: Sasaista darbu ar institūciju - producents, kura atbildīga par televīzijas raidījuma biznesa aspektiem. @lv
toolkit label: televīzijas raidījuma producents (institūcija) @lv
toolkit definition: Institūcija - producents, kura atbildīga par televīzijas raidījuma biznesa aspektiem. @lv
label: 有电视制作者团体 @zh-hans
definition: 将一种作品与作为制作者并负责电视节目的大部分商业运作的一个团体关联起来。 @zh-hans
toolkit label: 电视制作者团体 @zh-hans
toolkit definition: 作为制作者并负责电视节目的大部分商业运作的一个团体 @zh-hans
has subproperty: P10518
label: televizyon yapımcısı tüzel kişisi ile ilişkilidir @tr
definition: Bir eseri, bir televizyon programının ticari yönlerinin çoğundan sorumlu olan bir yapımcı olan bir tüzel kişi ile ilişkilendirir. @tr
toolkit label: televizyon yapımcısı tüzel kişi @tr
toolkit definition: Bir televizyon programının ticari yönlerinin çoğundan sorumlu olan yapımcı olan bir tüzel kişi. @tr

has television producer family
status: Published
lexical alias: televisionProducerFamily.en
definition: Relates a work to a family who is a producer who is responsible for most of the business aspects of a television program.
toolkit label: television producer family
toolkit definition: A family who is a producer who is responsible for most of the business aspects of a television program.
type: Property
domain: C10001
has element type: 2
sub property of: has producer family
sub property of: has television producer collective agent
label: televisiotuottaja (suku) @fi
definition: Liittää teoksen sukuun, joka on tuottaja, joka on vastuussa suurimmasta osasta televisio-ohjelman liiketoiminnasta. @fi
toolkit label: televisiotuottaja (suku) @fi
toolkit definition: Suku, joka on tuottaja, joka on vastuussa suurimmasta osasta televisio-ohjelman liiketoiminnasta. @fi
label: har fjernsynsprogram (familie) @no
definition: Relaterer et verk til en familie som er en produsent med ansvar for de fleste forretningsmessige aspektene ved et fjernsynsprogram. @no
toolkit label: fjernsynsprogram (familie) @no
toolkit definition: En familie som er en produsent med ansvar for de fleste forretningsmessige aspektene ved et fjernsynsprogram. @no
label: heeft televisieproducent-familie @nl
definition: Relateert een werk aan een familie die een producer is die verantwoordelijk is voor het merendeel van de zakelijke aspecten van een televisieprogramma. @nl
toolkit label: televisieproducent-familie @nl
toolkit definition: Een familie die een producer is die verantwoordelijk is voor het merendeel van de zakelijke aspecten van een televisieprogramma. @nl
label: له عائلة منتجة تليفزيونية @ar
definition: يربط بين عمل وعائلة تكون منتجة مسئولة عن معظم جوانب العمل في برنامج تليفزيوني. @ar
toolkit label: عائلة منتجة تليفزيونية @ar
toolkit definition: عائلة تكون منتجة مسئولة عن معظم جوانب العمل في برنامج تليفزيوني. @ar
label: té com a família productora de televisió @ca
definition: Relaciona una obra amb una família que és un productor que és responsable de la majoria dels aspectes comercials d’un programa de televisió. @ca
toolkit label: família productora de televisió @ca
toolkit definition: Família que és un productor que és responsable de la majoria dels aspectes comercials d’un programa de televisió. @ca
label: har familie, som er tv-producer @da
definition: Relaterer et værk til en familie, som er en producer, som er ansvarlig for størstedelen af de forretningsmæssige aspekter ved et tv-program. @da
toolkit label: familie, som er tv-producer @da
toolkit definition: Familie, som er en producer, som er ansvarlig for størstedelen af de forretningsmæssige aspekter ved et tv-program. @da
label: teleprodutsent (perekond) @et
definition: Seostab teose perekonnaga, kes produtsendina vastutab enamiku äriliste aspektide eest telesaate tootmisel. @et
toolkit label: teleprodutsent (perekond) @et
toolkit definition: Perekond, kes produtsendina vastutab enamiku äriliste aspektide eest telesaate tootmisel. @et
label: hat Fernsehproduzentin/Fernsehproduzenten (Familie) @de
definition: Setzt ein Werk in Beziehung zu einer Produzentin/einem Produzenten (Familie), die/der für die meisten geschäftlichen Aspekte einer Fernsehsendung verantwortlich ist. @de
toolkit label: Fernsehproduzentin/Fernsehproduzent (Familie) @de
toolkit definition: Eine Produzentin/Ein Produzent (Familie), die/der für die meisten geschäftlichen Aspekte einer Fernsehsendung verantwortlich ist. @de
label: televízió-producer családja a következő: @hu
definition: Hozzákapcsol egy művet egy producer családhoz, amely felelős egy televízióműsor üzleti vonatkozásainak a zöméért. @hu
toolkit label: televízió-producer család: @hu
toolkit definition: Egy producer család, amely felelős egy televízióműsor üzleti vonatkozásainak a zöméért. @hu
label: ha come produttore televisivo famiglia @it
definition: Correla un'opera alla famiglia produttore responsabile della gestione della maggior parte degli aspetti commerciali di un programma televisivo. @it
toolkit label: produttore televisivo famiglia @it
toolkit definition: Famiglia produttore responsabile della gestione della maggior parte degli aspetti commerciali di un programma televisivo. @it
label: a pour famille productrice de télévision @fr
definition: Met une œuvre en relation avec une famille productrice qui est responsable de la majeure partie des aspects commerciaux d’une émission de télévision. @fr
toolkit label: famille productrice de télévision @fr
toolkit definition: Famille productrice qui est responsable de la majeure partie des aspects commerciaux d’une émission de télévision. @fr
label: televīzijas raidījuma producents (dzimta/ģimene) @lv
definition: Sasaista darbu ar dzimtu/ģimeni - producents, kura atbildīga par televīzijas raidījuma biznesa aspektiem. @lv
toolkit label: televīzijas raidījuma producents (dzimta/ģimene) @lv
toolkit definition: Dzimta/ģimene - producents, kura atbildīga par televīzijas raidījuma biznesa aspektiem. @lv
label: 有电视制作者家族 @zh-hans
definition: 将一种作品与作为制作者并负责电视节目的大部分商业运作的一个家族关联起来。 @zh-hans
toolkit label: 电视制作者家族 @zh-hans
toolkit definition: 作为制作者并负责电视节目的大部分商业运作的一个家族 @zh-hans
has subproperty: P10565
label: televizyon yapımcısı ailesi ile ilişkilidir @tr
definition: Bir eseri, bir televizyon programının ticari yönlerinin çoğundan sorumlu olan yapımcı bir aileyle ilişkilendirir. @tr
toolkit label: televizyon yapımcısı aile @tr
toolkit definition: Bir televizyon programının ticari yönlerinin çoğundan sorumlu olan bir yapımcı olan bir aile. @tr

has television producer person
status: Published
lexical alias: televisionProducerPerson.en
definition: Relates a work to a person who is a producer who is responsible for most of the business aspects of a television program.
toolkit label: television producer person
toolkit definition: A person who is a producer who is responsible for most of the business aspects of a television program.
type: Property
domain: C10001
has element type: 2
sub property of: has producer person
sub property of: has television producer agent
label: televisiotuottaja (henkilö) @fi
definition: Liittää teoksen henkilöön, joka on tuottaja, joka on vastuussa suurimmasta osasta televisio-ohjelman liiketoiminnasta. @fi
toolkit label: televisiotuottaja (henkilö) @fi
toolkit definition: Henkilö, joka on tuottaja, joka on vastuussa suurimmasta osasta televisio-ohjelman liiketoiminnasta. @fi
label: har fjernsynsprodusent (person) @no
definition: Relaterer et verk til en person som er en produsent med ansvar for de fleste forretningsmessige aspektene ved et fjernsynsprogram. @no
toolkit label: fjernsynsprodusent (person) @no
toolkit definition: En person som er en produsent med ansvar for de fleste forretningsmessige aspektene ved et fjernsynsprogram. @no
label: heeft televisieproducent-persoon @nl
definition: Relateert een werk aan een persoon die een producer is die verantwoordelijk is voor het merendeel van de zakelijke aspecten van een televisieprogramma. @nl
toolkit label: televisieproducent-persoon @nl
toolkit definition: Een persoon die een producer is die verantwoordelijk is voor het merendeel van de zakelijke aspecten van een televisieprogramma. @nl
label: له شخص منتج تليفزيوني @ar
definition: يربط بين عمل وشخص يكون منتجًا مسئولاً عن معظم جوانب العمل في برنامج تليفزيوني. @ar
toolkit label: شخص منتج تليفزيوني @ar
toolkit definition: شخص يكون منتجًا مسئولاً عن معظم جوانب العمل في برنامج تليفزيوني. @ar
label: té com a persona productora de televisió @ca
definition: Relaciona una obra amb una persona que és un productor que és responsable de la majoria dels aspectes comercials d’un programa de televisió. @ca
toolkit label: persona productora de televisió @ca
toolkit definition: Persona que és un productor que és responsable de la majoria dels aspectes comercials d’un programa de televisió. @ca
label: har person, som er tv-producer @da
definition: Relaterer et værk til en person, som er en producer, som er ansvarlig for størstedelen af de forretningsmæssige aspekter ved et tv-program. @da
toolkit label: person, som er tv-producer @da
toolkit definition: Person, som er en producer, som er ansvarlig for størstedelen af de forretningsmæssige aspekter ved et tv-program. @da
label: teleprodutsent (isik) @et
definition: Seostab teose isikuga, kes produtsendina vastutab enamiku äriliste aspektide eest telesaate tootmisel. @et
toolkit label: teleprodutsent (isik) @et
toolkit definition: Isik, kes produtsendina vastutab enamiku äriliste aspektide eest telesaate tootmisel. @et
label: hat Fernsehproduzentin/Fernsehproduzenten (Person) @de
definition: Setzt ein Werk in Beziehung zu einer Produzentin/einem Produzenten (Person), die/der für die meisten geschäftlichen Aspekte einer Fernsehsendung verantwortlich ist. @de
toolkit label: Fernsehproduzentin/Fernsehproduzent (Person) @de
toolkit definition: Eine Produzentin/Ein Produzent (Person), die/der für die meisten geschäftlichen Aspekte einer Fernsehsendung verantwortlich ist. @de
label: televízió-producer személye a következő: @hu
definition: Hozzákapcsol egy művet egy producer személyhez, aki felelős egy televízióműsor üzleti vonatkozásainak a zöméért. @hu
toolkit label: televízió-producer személy: @hu
toolkit definition: Egy producer személy, aki felelős egy televízióműsor üzleti vonatkozásainak a zöméért. @hu
label: ha come produttore televisivo persona @it
definition: Correla un'opera alla persona produttore responsabile della gestione della maggior parte degli aspetti commerciali di un programma televisivo. @it
toolkit label: produttore televisivo persona @it
toolkit definition: Persona produttore responsabile della gestione per la maggior parte degli aspetti commerciali di un programma televisivo. @it
label: a pour personne productrice de télévision @fr
definition: Met une œuvre en relation avec une personne productrice qui est responsable de la majeure partie des aspects commerciaux d’une émission de télévision. @fr
toolkit label: personne productrice de télévision @fr
toolkit definition: Personne productrice qui est responsable de la majeure partie des aspects commerciaux d’une émission de télévision. @fr
label: televīzijas raidījuma producents (persona) @lv
definition: Sasaista darbu ar personu - producents, kura atbildīga par televīzijas raidījuma biznesa aspektiem. @lv
toolkit label: televīzijas raidījuma producents (persona) @lv
toolkit definition: Persona - producents, kura atbildīga par televīzijas raidījuma biznesa aspektiem. @lv
label: 有电视制作者个人 @zh-hans
definition: 将一种作品与作为制作者并负责电视节目的大部分商业运作的一个个人关联起来。 @zh-hans
toolkit label: 电视制作者个人 @zh-hans
toolkit definition: 作为制作者并负责电视节目的大部分商业运作的一个个人 @zh-hans
has subproperty: P10424
label: televizyon yapımcısı kişisi ile ilişkilidir @tr
definition: Bir eseri, bir televizyon programının ticari yönlerinin çoğunu yönetmekten sorumlu yapımcı olan kişiyle ilişkilendirir. @tr
toolkit label: televizyon yapımcısı olan kişi @tr
toolkit definition: Bir televizyon programının ticari yönlerinin çoğunu yönetmekten sorumlu olan yapımcı kişi. @tr

has television screenplay work
status: Published
definition: Relates a work to a work that is a textual work that complements a work that is a television program.
type: Property
domain: C10001
sub property of: has screenplay work
lexical alias: televisionScreenplayWork.en
toolkit label: television screenplay work
toolkit definition: A work that is a textual work that complements a work that is a television program.
toolkit label: scénario de télévision (œuvre) @fr
toolkit definition: Œuvre textuelle qui complète une œuvre consistant en une émission de télévision. @fr
toolkit label: guión de televisión (obra) @es
toolkit definition: Una obra que proporciona el texto para un programa de televisión. @es
instruction number: 24.5
label: har tv-manuskriptværk @da
definition: Relaterer et værk til et værk, som er et tekstværk, som komplementerer et værk, som er et tv-program. @da
toolkit label: tv-manuskriptværk @da
toolkit definition: Værk, som er et tekstværk, som komplementerer et værk, som er et tv-program. @da
definition: Met une œuvre en relation avec une œuvre textuelle qui complète une œuvre consistant en une émission de télévision. @fr
label: kịch bản truyền hình (tác phẩm) @vi
definition: Liên kết tác phẩm với tác phẩm cung cấp văn bản cho chương trình truyền hình. @vi
toolkit label: kịch bản truyền hình (tác phẩm) @vi
toolkit definition: Tác phẩm cung cấp văn bản cho chương trình truyền hình. @vi
label: hat Fernsehdrehbuch (Werk) @de
definition: Setzt ein Werk in Beziehung zu einem textlichen Werk, das eine Fernsehsendung (Werk) ergänzt. @de
toolkit label: Fernsehdrehbuch (Werk) @de
toolkit definition: Ein textliches Werk, das eine Fernsehsendung (Werk) ergänzt. @de
label: a pour scénario de télévision (œuvre) @fr
definition: Liittää teoksen teokseen, joka on tekstiteos, joka täydentää teosta, joka on televisio-ohjelma. @fi
toolkit label: televisio-ohjelman käsikirjoitus (teos) @fi
toolkit definition: Teos, joka on tekstiteos, joka täydentää teosta, joka on televisio-ohjelma. @fi
toolkit label: fjernsynsmanus (verk) @no
toolkit definition: Et verk som er et tekstlig verk som utfyller et verk som er et fjernsynsprogram. @no
label: té com a obra de guió de televisió @ca
definition: Relaciona una obra amb una obra que és una obra textual que complementa una obra que és un programa de televisió. @ca
toolkit label: obra de guió de televisió @ca
toolkit definition: Obra que és una obra textual que complementa una obra que és un programa de televisió. @ca
has element type: 2
label: είναι τηλεοπτικό σενάριο (έργο) @el
definition: Συνδέει ένα έργο με ένα έργο το οποίο παρέχει κείμενο για ένα τηλεοπτιικό πρόγραμμα. @el
toolkit label: τηλεοπτικό σενάριο (έργο) @el
toolkit definition: Ένα έργο το οποίο παρέχει κείμενο για ένα τηλεοπτιικό πρόγραμμα. @el
label: televíziós forgatókönyv-műve a következő: @hu
definition: Hozzákapcsol egy művet egy szöveges műhöz, amely kiegészít egy televízióműsor művet. @hu
toolkit label: televíziós forgatókönyvmű @hu
toolkit definition: Egy szöveges mű, amely kiegészít egy televízióműsor művet. @hu
label: televisio-ohjelman käsikirjoitus (teos) @fi
label: har fjernsynsmanus (verk) @no
definition: Relaterer et verk til et verk som er et tekstlig verk som utfyller et verk som er et fjernsynsprogram. @no
label: heeft televisiescenariowerk @nl
definition: Relateert een werk aan een werk dat een tekstwerk is dat een werk complementeert dat een televisieprogramma is. @nl
toolkit label: televisiescenariowerk @nl
toolkit definition: Een werk dat een tekstwerk is dat een werk complementeert dat een televisieprogramma is. @nl
label: له عمل سيناريو تليفزيوني @ar
definition: يربط عمل بعمل نصي يكمل عملًا عبارة عن برنامج تليفزيوني. @ar
toolkit label: عمل سيناريو تليفزيوني @ar
toolkit definition: عمل عبارة عن عمل نصي يكمل عملًا عبارة عن برنامج تليفزيوني. @ar
label: telestsenaarium (teos) @et
definition: Seostab teose tekstteosega, mis täiendab teleteost. @et
toolkit label: telestsenaarium (teos) @et
toolkit definition: Tekstteos, mis täiendab teleteost. @et
label: ha come sceneggiatura televisiva opera @it
definition: Correla un’opera a un’opera testuale che completa un’opera che è un programma televisivo. @it
toolkit label: sceneggiatura televisiva opera @it
toolkit definition: Opera testuale che completa un’opera che è un programma televisivo. @it
label: darbs: televīzijas raidījuma scenārijs @lv
definition: Sasaista darbu ar darbu, kas ir realizēts kā teksts, kas papildina darbu, kas ir televīzijas raidījums. @lv
toolkit label: darbs: televīzijas raidījuma scenārijs @lv
toolkit definition: Darbs, kas ir realizēts kā teksts, kas papildina darbu, kas ir televīzijas raidījums. @lv
label: 有电视剧本作品 @zh-hans
definition: 将一种作品与补充作为一种电视节目的一种作品的作为一种文字作品的一种作品关联起来。 @zh-hans
toolkit label: 电视剧本作品 @zh-hans
toolkit definition: 补充作为一种电视节目的一种作品的作为一种文字作品的一种作品 @zh-hans
has subproperty: P10163
label: televizyon senaryosu eseri ile ilişkilidir @tr
definition: Bir eseri, televizyon programı olan bir eseri tamamlayan metinsel bir eser olan bir eserle ilişkilendirir. @tr
toolkit label: televizyon senaryosu eseri @tr
toolkit definition: Televizyon programı olan bir eseri tamamlayan metinsel bir eser olan bir çalışma. @tr

has degree supervisor
status: Published
definition: Relates a work to a person who is an academic supervisor who is responsible for advising or overseeing thesis or dissertation research for an academic degree that results in a work.
type: Property
domain: C10001
lexical alias: degreeSupervisor.en
toolkit label: degree supervisor
toolkit definition: A person who is an academic supervisor who is responsible for advising or overseeing thesis or dissertation research for an academic degree that results in a work.
toolkit label: superviseur de thèse @fr
toolkit definition: Personne qui est un superviseur académique responsable de guider ou de superviser des travaux de thèse ou de mémoire menant à l’obtention d’un grade universitaire et entraînant la création d’une œuvre. @fr
toolkit label: supervisor de grado @es
toolkit definition: Una persona, tal como un director o supervisor de tesis de grado o investigación, que supervisa un grado académico o tesis. @es
instruction number: 18.5
label: har hovedvejleder @da
definition: Relaterer et værk til en akademisk vejleder, som har ansvar for at rådgive eller overvåge forskning til en akademisk grads afhandling eller speciale, som resulterer i et værk. @da
toolkit label: hovedvejleder @da
toolkit definition: Akademisk vejleder, som har ansvar for at rådgive eller overvåge forskning til en akademisk grads afhandling eller speciale, som resulterer i et værk. @da
definition: Met une œuvre en relation avec une personne qui est un superviseur académique responsable de guider ou de superviser des travaux de thèse ou de mémoire menant à l’obtention d’un grade universitaire et entraînant la création d’une œuvre. @fr
label: có người giám sát văn bằng @vi
definition: Liên kết tác phẩm với cá nhân, như là cố vấn hoặc người giám sát của nghiên cứu luận văn hoặc luận án, giám sát hoặc văn bằng học thuật hoặc luận đề. @vi
toolkit label: người giám sát văn bằng @vi
toolkit definition: Cá nhân, như là cố vấn hoặc người giám sát của nghiên cứu luận văn hoặc luận án, giám sát hoặc văn bằng học thuật hoặc luận đề. @vi
label: hat Betreuerin/Betreuer einer Hochschulschrift @de
definition: Setzt ein Werk in Beziehung zu einer akademischen Betreuerin/einem akademischen Betreuer (Person), die/der für die Beratung und Aufsicht von Forschungstätigkeiten im Rahmen einer Hochschulschrift verantwortlich ist, die zur Erlangung eines akademischen Grads und zu einem Werk führen. @de
toolkit label: Betreuerin/Betreuer einer Hochschulschrift @de
toolkit definition: Eine akademische Betreuerin/Ein akademischer Betreuer (Person), die/der für die Beratung und Aufsicht von Forschungstätigkeiten im Rahmen einer Hochschulschrift verantwortlich ist, die zur Erlangung eines akademischen Grads und zu einem Werk führen. @de
label: a pour superviseur de thèse @fr
definition: Liittää teoksen henkilöön, joka on akateeminen ohjaaja, joka on vastuussa teokseen johtavan akateemisen opinnäyte- tai väitöskirjatutkimuksen neuvomisesta tai valvonnasta. @fi
toolkit label: opinnäytteen ohjaaja @fi
toolkit definition: Henkilö, joka on akateeminen ohjaaja, joka on vastuussa teokseen johtavan akateemisen opinnäyte- tai väitöskirjatutkimuksen neuvomisesta tai valvonnasta. @fi
toolkit label: veileder @no
toolkit definition: En veileder som er ansvarlig for rådgiving eller tilsyn med forskning knyttet til avhandlinger eller masteroppgaver som resulterer i et verk. @no
label: té com a supervisor de grau acadèmic @ca
definition: Relaciona una obra amb una persona que és un supervisor acadèmic que és responsable d’assessorar o supervisar una tesi o una dissertació d’una recerca per a l’obtenció d’un grau acadèmic que dona com a resultat una obra. @ca
toolkit label: supervisor de grau acadèmic @ca
toolkit definition: Persona que és un supervisor acadèmic que és responsable d’assessorar o supervisar una tesi o una dissertació d’una recerca per a l’obtenció d’un grau acadèmic que dona com a resultat una obra. @ca
has element type: 2
label: έχει επόπτη καθηγητή @el
definition: Συνδέει ένα έργο με ένα φυσικό πρόσωπο, όπως έναν σύμβουλο ή επόπτη μιας γραπτής εργασίας ή διατριβής ή διδακτορικής έρευνας, είτε για την απόκτηση ανώτερου εκπαιδευτικού επιπέδου πτυχίου είτε διδακτορικού. @el
toolkit label: επόπτης καθηγητής @el
toolkit definition: Συνδέει ένα έργο με ένα φυσικό πρόσωπο, όπως έναν σύμβουλο ή επόπτη μιας γραπτής εργασίας ή διατριβής ή διδακτορικής έρευνας, είτε για την απόκτηση ανώτερου εκπαιδευτικού επιπέδου πτυχίου είτε διδακτορικού. @el
label: témavezetője a következő: @hu
definition: Hozzákapcsol egy művet egy tudományos témavezető személyhez, egy szakdolgozati vagy disszertációs kutatás tanácsadójához vagy felügyelőjéhez, aki egy tudományos fokozatot vagy értekezést ellenőriz. @hu
toolkit label: témavezető: @hu
toolkit definition: Egy tudományos témavezető személy, egy szakdolgozati vagy disszertációs kutatás tanácsadója vagy felügyelője, aki egy tudományos fokozatot vagy értekezést ellenőriz. @hu
scope note: Includes an advisor or supervisor of thesis or dissertation research.
sub property of: has academic supervisor
scope note: Kattaa opinnäytteen tai väitöskirjan ohjaajan. @fi
label: opinnäytteen ohjaaja @fi
label: har veileder @no
definition: Relaterer et verk til en veileder som er ansvarlig for rådgiving eller tilsyn med forskning knyttet til avhandlinger eller masteroppgaver som resulterer i et verk. @no
scope note: Inkluderer en rådgiver eller veileder for forskning knyttet til en avhandling eller masteroppgave. @no
label: heeft graad-begeleider @nl
definition: Relateert een werk aan een persoon die is een academische begeleider die verantwoordelijk is voor advisering of begeleiding van scriptie- of proefschriftonderzoek voor een academische graad dat resulteert in een werk. @nl
scope note: Omvat een adviseur of begeleider van een scriptie- of proefschriftonderzoek. @nl
toolkit label: graad-begeleider @nl
toolkit definition: Een persoon die is een academische begeleider die verantwoordelijk is voor advisering of begeleiding van scriptie- of proefschriftonderzoek voor een academische graad dat resulteert in een werk. @nl
label: له مشرف درجة علمية @ar
definition: يربط بين عمل وشخص هو مشرف أكاديمي مسئول عن تقديم المشورة أو الإشراف على أطروحة ماجستير أو دكتوراه للحصول على درجة أكاديمية تسفر عن عمل. @ar
scope note: يشمل مستشار أو مشرف على أطروحة ماجستير أو دكتوراه. @ar
toolkit label: مشرف درجة علمية @ar
toolkit definition: شخص هو مشرف أكاديمي مسئول عن تقديم المشورة أو الإشراف على أطروحة ماجستير أو دكتوراه للحصول على درجة أكاديمية تسفر عن عمل. @ar
scope note: Inclou un tutor o un supervisor d’una tesi o una dissertació d’una recerca. @ca
scope note: Omfatter en rådgiver eller vejleder til forskning til en afhandling eller speciale. @da
label: väitekirja juhendaja @et
definition: Seostab teose akadeemilise juhendajaga, kes vastutab akadeemilise kraadi saamiseks tehtava ja teoses väljenduva uurimistöö nõustamise või ülevaatamise eest. @et
scope note: Hõlmab väitekirja konsultanti ja juhendajat. @et
toolkit label: väitekirja juhendaja @et
toolkit definition: Akadeemiline juhendaja, kes vastutab akadeemilise kraadi saamiseks tehtava ja teoses väljenduva uurimistöö nõustamise või ülevaatamise eest. @et
scope note: Darunter fallen Beraterinnen/Berater oder Betreuerinnen/Betreuer von Forschungstätigkeiten im Rahmen einer Hochschulschrift. @de
scope note: Magában foglalja a szakdolgozati vagy disszertációs kutatás tanácsadóját vagy témavezetőjét. @hu
label: ha come supervisore accademico @it
definition: Correla un’opera a un supervisore accademico che svolge funzioni di consulenza o supervisione per una tesi o per ricerche per redigere una dissertazione necessaria all’ottenimento di un titolo accademico. @it
scope note: Include un consulente o un supervisore accademico per tesi o ricerche @it
toolkit label: supervisore accademico @it
toolkit definition: Supervisore accademico che svolge funzioni di consulenza o supervisione per una tesi o per ricerche per redigere una dissertazione necessaria all’ottenimento di un titolo accademico. @it
scope note: Comprend un conseiller ou un directeur de thèse ou de mémoire. @fr
label: promocijas darba vadītājs @lv
definition: Sasaista darbu ar personu, kura pārrauga akadēmisko promocijas darbu. @lv
toolkit label: promocijas darba vadītājs @lv

has coordinates of cartographic content
status: Published
definition: Relates a work to a place that is the area of coverage of a cartographic work that is described using a mathematical system to identify its boundaries or location.
type: Property
scope note: Coordinates may be expressed by means of longitude and latitude on the surface of planets or by the angles of right ascension and declination for celestial charts.
domain: C10001
lexical alias: coordinatesOfCartographicContent.en
instruction number: 7.4
toolkit label: coordinates of cartographic content
toolkit definition: A place that is the area of coverage of a cartographic work that is described using a mathematical system to identify its boundaries or location.
toolkit label: coordonnées d’un contenu cartographique @fr
toolkit definition: Lieu qui constitue la zone de couverture d’une œuvre cartographique décrite à l’aide d’un système mathématique permettant d'identifier ses limites ou son emplacement. @fr
toolkit label: coordenadas del contenido cartográfico @es
toolkit definition: Un sistema matemático para la identificación del área incluida en el contenido cartográfico de un recurso. @es
label: har koordinater (kartografiska resurser) @sv
toolkit label: koordinater (kartografiska resurser) @sv
label: har koordinater for kartografisk indhold @da
definition: Relaterer et værk til et matematisk system til at identifice et sted, som dækkes af et værks kartografiske indhold. @da
scope note: Koordinater kan udtrykkes vha. længdegrad og breddegrad på planeters overflader eller vha. vinklerne for rektascension og deklination for himmellegemer. @da
toolkit label: koordinater for kartografisk indhold @da
toolkit definition: Matematisk system til at identifice et sted, som dækkes af et værks kartografiske indhold. @da
definition: Met une œuvre en relation avec un lieu qui constitue la zone de couverture d’une œuvre cartographique décrite à l’aide d’un système mathématique permettant d'identifier ses limites ou son emplacement. @fr
label: có toạ độ của nội dung bản đồ @vi
definition: Liên kết tác phẩm với hệ thống toán học dùng để nhận dạng khu vực được bao quát bởi nội dung bản đồ của tác phẩm. @vi
scope note: Toạ độ có thể được thể hiện bằng kinh độ và vĩ độ trên bề mặt của hành tinh hoặc bằng các góc của độ xích kinh và độ lẹch cho biểu đồ bầu trời. @vi
toolkit label: toạ độ của nội dung bản đồ @vi
toolkit definition: Hệ thống toán học dùng để nhận dạng khu vực được bao quát bởi nội dung bản đồ của tác phẩm. @vi
label: hat Koordinaten von kartografischem Inhalt @de
definition: Setzt ein Werk in Beziehung zu einem Gebiet, das den Abdeckungsbereich eines kartografischen Werks darstellt und mit Hilfe eines mathematischen Systems beschrieben wird, um seine Grenzen oder Lage zu identifizieren. @de
scope note: Koordinaten können durch Längen- und Breitengrade auf der Oberfläche von Planeten oder durch die Winkel der Rektaszension und Deklination bei Himmelskarten ausgedrückt werden. @de
toolkit label: Koordinaten von kartografischem Inhalt @de
toolkit definition: Ein Gebiet, das den Abdeckungsbereich eines kartografischen Werks darstellt und mit Hilfe eines mathematischen Systems beschrieben wird, um seine Grenzen oder Lage zu identifizieren. @de
label: a pour coordonnées d’un contenu cartographique @fr
definition: Liittää teoksen paikkaan, joka on kartografisen teoksen kattama alue, joka on kuvattu matemaattisen järjestelmän avulla sen rajojen tai sijainnin identifioimiseksi. @fi
toolkit label: kartografisen sisällön koordinaatit @fi
toolkit definition: Paikka, joka on kartografisen teoksen kattama alue, joka on kuvattu matemaattisen järjestelmän avulla sen rajojen tai sijainnin identifioimiseksi. @fi
toolkit label: koordinater for kartografisk innhold @no
toolkit definition: Et matematisk system for å identifisere et sted som dekkes av det kartografiske innholdet til et verk. @no
label: té com a coordenades d’un contingut cartogràfic @ca
definition: Relaciona una obra amb un lloc que és l’àrea de cobertura d’una obra cartogràfica que es descriu usant un sistema matemàtic per identificar els seus límits o la seva localització. @ca
scope note: Les coordenades s’expressen o bé mitjançant la longitud i la latitud sobre la superfície dels planetes, o bé mitjançant els angles de l’ascensió recta i de la declinació en el cas de les cartes celestes. @ca
toolkit label: coordenades d’un contingut cartogràfic @ca
toolkit definition: Lloc que és l’àrea de cobertura d’una obra cartogràfica que es descriu usant un sistema matemàtic per identificar els seus límits o la seva localització. @ca
scope note: Les coordonnées peuvent s’exprimer au moyen de la longitude et de la latitude sur la surface des planètes ou bien par les angles de l’ascension droite et de la déclinaison pour les cartes célestes. @fr
sub property of: has related place of work
has element type: 3
label: έχει συντεταγμένες του χαρτογραφικού περιεχομένου @el
definition: Συνδέει ένα έργο με ένα μαθηματικό σύστημα για την ταύτιση μιας περιοχής που καλύπτεται από το χαρτογραφικό περιεχόμενο ενός έργου. @el
scope note: Οι συντεταγμένες μπορεί να εκφραστούν μέσω γεωγραφικού μήκους και πλάτους στην επιφάνεια των πλανητών ή μέσω των γωνιών της ορθής αναφοράς και απόκλισης για τους ουράνιους χάρτες. @el
toolkit label: συντεταγμένες χαρτογραφικού περιεχομένου @el
toolkit definition: Ένα μαθηματικό σύστημα για την ταύτιση μιας περιοχής που καλύπτεται από το χαρτογραφικό περιεχόμενο ενός έργου. @el
label: kartografikus tartalomhoz tartozó koordináták a következők: @hu
definition: Hozzákapcsol egy művet egy helyhez, egy kartográfiai mű által lefedett területhez, amelyet matematikai módszert használva írnak le, hogy meghatározzák a határát vagy a helyzetét. @hu
scope note: kartografikus tartalomhoz tartozó koordináták: @hu
toolkit label: Egy hely, egy kartográfiai mű által lefedett terület, amelyet matematikai módszert használva írnak le, hogy meghatározzák a határát vagy a helyzetét. @hu
toolkit definition: A koordinátákat ki lehet fejezni a hosszúság és a szélesség segítségével a bolygók felszínén, vagy a jobboldali emelkedéssel és elhajlással a csillagászati diagramokon. @hu
scope note: Koordinaatit voidaan ilmaista pituus- ja leveysasteilla planeettojen pinnalla tai rektaskension ja deklinaation kulmilla taivaankappaleissa. @fi
label: kartografisen sisällön koordinaatit @fi
label: har koordinater for kartografisk innhold @no
definition: Relaterer et verk til et matematisk system for å identifisere et sted som dekkes av det kartografiske innholdet til et verk. @no
scope note: Koordinater kan uttrykkes gjennom lengdegrad og breddegrad på planeters overflate eller gjennom vinklene for rektascensjon og deklinasjon for stjernekart. @no
label: heeft coördinaten van cartografische content @nl
definition: Relateert een werk aan een plaats die is het bestreken gebied van een cartografisch werk dat is beschreven met gebruikmaking van een mathematisch systeem voor het identificeren van zijn grenzen of locatie. @nl
scope note: Coördinaten kunnen uitgedrukt worden door lengtegraad en breedtegraad op het oppervlak van planeten of door de hoeken van rechte klimming en declinatie voor hemelkaarten. @nl
toolkit label: coördinaten van cartografische content @nl
toolkit definition: Een plaats die is het bestreken gebied van een cartografisch werk dat is beschreven met gebruikmaking van een mathematisch systeem voor het identificeren van zijn grenzen of locatie. @nl
label: له إحداثيات محتوى رسم خرائطي @ar
definition: يربط عمل بعمل عبار عن نطاق تغطية عمل رسم خرائطي موصوف باستخدام نظام رياضي لتحديد حدوده أو موقعه. @ar
scope note: يمكن التعبير عن الإحداثيات عن طريق خطوط الطول والعرض على سطح الكواكب أو بزوايا الصعود المستقيم والانحراف للمخططات السماوية. @ar
toolkit label: إحداثيات محتوى رسم خرائطي @ar
toolkit definition: مكان عبارة عن نطاق تغطية عمل رسم خرائطي موصوف باستخدام نظام رياضي لتحديد حدوده أو موقعه. @ar
label: kartograafilise sisu koordinaadid @et
definition: Seostab teose matemaatilise süsteemiga, mille abil tuvastatakse teose kartograafilise sisuga hõlmatud koht. @et
scope note: Koordinaate väljendatakse planeetide pinnal pikkus- ja laiuskraadidena ning taevakaartidel otsetõusu ja käände nurgamõõtudena. @et
toolkit label: kartograafilise sisu koordinaadid @et
toolkit definition: Matemaatiline süsteem, mille abil tuvastatakse teose kartograafilise sisuga hõlmatud koht. @et
alternative label: Koordinaten von kartographischem Inhalt @de
label: ha come coordinate di contenuto cartografico @it
definition: Correla un’opera a un sistema matematico per identificare un luogo coperto dal contenuto cartografico di un’opera. @it
scope note: Le coordinate possono essere espresse per mezzo di longitudine e latitudine sulla superficie dei pianeti o per mezzo degli angoli di ascensione retta e declinazione per le carte celesti. @it

is description of corporate body
status: Published
sub property of: has subject corporate body
type: Property
lexical alias: descriptionOfCorporateBody.en
definition: Relates a work to a corporate body who is described by a work.
domain: C10001
instruction number: 23.5
toolkit label: description of corporate body
toolkit definition: A corporate body who is described by a work.
label: er beskrivelse af korporation @da
definition: Relaterer et værk til en korporation, som er beskrevet af et værk. @da
toolkit label: beskrivelse af korporation @da
toolkit definition: Korporation, som er beskrevet af et værk. @da
label: là mô tả của (tập thể) @vi
definition: Liên kết tác phẩm với tập thể mà tác phẩm nói về. @vi
toolkit label: mô tả của (tập thể) @vi
toolkit definition: Tập thể mà tác phẩm nói về. @vi
label: ist Beschreibung von (Körperschaft) @de
definition: Setzt ein Werk in Beziehung zu einer Körperschaft, die von einem Werk beschrieben wird. @de
toolkit label: Beschreibung von (Körperschaft) @de
toolkit definition: Eine Körperschaft, die von einem Werk beschrieben wird. @de
definition: Liittää teoksen yhteisöön, jota teos kuvaa. @fi
toolkit label: kuvaus yhteisöstä @fi
toolkit definition: Yhteisö, jota teos kuvaa. @fi
toolkit label: beskrivelse av korporasjon @no
toolkit definition: En korporasjon som beskrives av et verk. @no
label: és descripció d’una entitat corporativa @ca
definition: Relaciona una obra amb una entitat corporativa que és descrita per una obra. @ca
toolkit label: descripció d’una entitat corporativa @ca
toolkit definition: Entitat corporativa que és descrita per una obra. @ca
label: est une description d’une collectivité @fr
definition: Met une œuvre en relation avec une collectivité qui est décrite par une œuvre. @fr
toolkit label: description d’une collectivité @fr
toolkit definition: Collectivité qui est décrite par une œuvre. @fr
sub property of: is description of collective agent
has element type: 2
label: είναι περιγραφή του (συλλογικό όργανο) @el
definition: Συνδέει ένα έργο με ένα συλλογικό όργανο που περιγράφεται από ένα περιγραφικό έργο. @el
toolkit label: περιγραφή του (συλλογικό όργανο) @el
toolkit definition: Ένα συλλογικό όργανο που περιγράφεται από ένα περιγραφικό έργο. @el
label: leírása a következő testületnek: @hu
definition: Hozzákapcsol egy művet egy testülethez, amelyet egy mű leír. @hu
toolkit definition: Egy testület, amelyet egy mű leír. @hu
label: kuvaus yhteisöstä @fi
label: er beskrivelse av korporasjon @no
definition: Relaterer et verk til en korporasjon som beskrives av et verk. @no
label: is beschrijving van corporatie @nl
definition: Relateert een werk aan een corporatie die beschreven wordt door een werk. @nl
toolkit label: beschrijving van corporatie @nl
toolkit definition: Een corporatie die beschreven wordt door een werk. @nl
label: هو وصف لهيئة @ar
definition: يربط بين عمل وهيئة موصوفة في عمل. @ar
toolkit label: هو وصف لهيئة @ar
toolkit definition: هيئة موصوفة في عمل. @ar
label: kirjeldatud asutus @et
definition: Seostab teose asutusega, mida teoses on kirjeldatud. @et
toolkit label: kirjeldatud asutus @et
toolkit definition: Asutus, mida teoses on kirjeldatud. @et
toolkit label: leírt testület: @hu
label: è descrizione di ente @it
definition: Correla un'opera a un ente che è descritto da un'opera. @it
toolkit label: descrizione di ente @it
toolkit definition: Ente che è descritto da un'opera. @it
label: ir apraksts institūcijai @lv
definition: Sasaista darbu ar institūciju, kas aprakstīta darbā. @lv
toolkit label: apraksts institūcijai @lv
toolkit definition: Institūcija, kas aprakstīta darbā. @lv
label: 是团体的描述 @zh-hans
definition: 将一种作品与被一种作品描述的一个团体关联起来。 @zh-hans
toolkit label: 团体的描述 @zh-hans
toolkit definition: 被一种作品描述的一个团体 @zh-hans
has subproperty: is metadata description of corporate body
has subproperty: P10326
label: tüzel kişinin tanımıdır @tr
definition: Bir eseri, eser tarafından tanımlanan tüzel kişi ile ilişkilendirir. @tr
toolkit label: tüzel kişinin tanım @tr
toolkit definition: Bir eser tarafından tanımlanan tüzel kişi. @tr

is adapted as television program work
status: Published
definition: Relates a work to a work that is a television program that is based on another work.
type: Property
domain: C10001
sub property of: is adapted as work
lexical alias: adaptedAsTelevisionProgramWork.en
toolkit label: adapted as television program work
toolkit definition: A work that is a television program that is based on another work.
toolkit label: adapté en émission de télévision (œuvre) @fr
toolkit definition: Œuvre qui consiste en une émission de télévision basée sur une autre œuvre. @fr
toolkit label: adaptada como programa para televisión (obra) @es
toolkit definition: Un programa de televisión basado en la obra fuente @es
instruction number: 24.5
label: er bearbejdet til tv-programværk @da
definition: Relaterer et værk til et tv-program, baseret på et oprindeligt værk. @da
toolkit label: bearbejdet til tv-programværk @da
toolkit definition: Tv-program, baseret på et oprindeligt værk. @da
definition: Met une œuvre en relation avec une œuvre qui consiste en une émission de télévision basée sur une autre œuvre. @fr
label: được phỏng theo như là chương trình truyền hình (tác phẩm) @vi
definition: Liên kết tác phẩm với chương trình truyền hình dựa trên tác phẩm nguồn. @vi
toolkit label: được phỏng theo như là chương trình truyền hình (tác phẩm) @vi
toolkit definition: Chương trình truyền hình dựa trên tác phẩm nguồn. @vi
label: ist bearbeitet als Fernsehsendung (Werk) @de
definition: Setzt ein Werk in Beziehung zu einer Fernsehsendung (Werk), die auf einem anderen Werk basiert. @de
toolkit label: Bearbeitet als Fernsehsendung (Werk) @de
toolkit definition: Eine Fernsehsendung (Werk), die auf einem anderen Werk basiert. @de
label: est adapté en émission de télévision (œuvre) @fr
definition: Liittää teoksen teokseen, joka on televisio-ohjelma, joka perustuu toiseen teokseen. @fi
toolkit label: televisiosovitus (teos) @fi
toolkit definition: Teos, joka on televisio-ohjelma, joka perustuu toiseen teokseen. @fi
toolkit label: bearbeidet som fjernsynsprogram (verk) @no
toolkit definition: Et fjernsynsprogram basert på et kildeverk. @no
label: és adaptat com a obra de programa de televisió @ca
definition: Relaciona una obra amb una obra que és un programa de televisió que es basa en una altra obra. @ca
toolkit label: adaptat com a obra de programa de televisió @ca
toolkit definition: Obra que és un programa de televisió que es basa en una altra obra. @ca
has element type: 2
label: είναι προσαρμοσμένο ως τηλεοπτικό πρόγραμμα (έργο) @el
definition: Συνδέει ένα έργο με ένα τηλεοπτικό πρόγραμμα που βασίζεται σε ένα έργο-πηγή. @el
toolkit label: προσαρμοσμένο ως τηλεοπτικό πρόγραμμα (έργο) @el
toolkit definition: Ένα τηλεοπτικό πρόγραμμα που βασίζεται σε ένα έργο-πηγή. @el
label: tévéműsormű-feldolgozása a következő: @hu
definition: Hozzákapcsol egy művet egy műhöz, egy televízióműsorhoz, amely egy másik művön alapul. @hu
toolkit label: tévéműsormű-feldolgozás @hu
toolkit definition: Egy mű, egy televízióműsor, amely egy másik művön alapul. @hu
label: televisiosovitus (teos) @fi
label: er bearbeidet som fjernsynsprogram (verk) @no
definition: Relaterer et verk til et fjernsynsprogram basert på et kildeverk. @no
label: is bewerkt als televisieprogrammawerk @nl
definition: Relateert een werk aan een werk dat is een televisieprogramma dat is gebaseerd op een ander werk. @nl
toolkit label: bewerkt als televisieprogrammawerk @nl
toolkit definition: Een werk dat is een televisieprogramma dat is gebaseerd op een ander werk. @nl
label: هو معالج كعمل برنامج تليفزيوني @ar
definition: يربط عمل بعمل عبارة عن برنامج تليفزيوني مبني على عمل آخر. @ar
toolkit label: معالج كعمل برنامج تليفزيوني @ar
toolkit definition: برنامج تليفزيوني مبني على عمل آخر. @ar
label: adapteeritud telesaatena (teos) @et
definition: Seostab teose allikteosel põhineva telesaatega. @et
toolkit label: adapteeritud telesaatena (teos) @et
toolkit definition: Allikteosel põhinev telesaade. @et
label: è adattata come opera in forma di programma televisivo @it
definition: Correla un’opera a un programma televisivo basato su un’opera di partenza. @it
toolkit label: adattata come opera in forma di programma televisivo @it
toolkit definition: Programma televisivo basato su un’opera di partenza. @it
label: ir adaptēts kā televīzijas raidījums (darbs) @lv
definition: Sasaista darbu ar darbu, kas ir televīzijas raidījums, veidots pēc pamatdarba. @lv
toolkit label: adaptēts kā darbs: televīzijas raidījums @lv
toolkit definition: Televīzijas raidījums, veidots pēc pamatdarba. @lv
label: 被改编为电视节目作品 @zh-hans
definition: 将一种作品与作为基于另一种作品的一种电视节目的一种作品关联起来。 @zh-hans
toolkit label: 被改编为电视节目作品 @zh-hans
toolkit definition: 作为基于另一种作品的一种电视节目的一种作品 @zh-hans
has subproperty: P10085
label: televizyon programı eseri olarak uyarlanmıştır @tr
definition: Bir eseri, başka bir eserden uyarlanmış televizyon programın olan bir eserle ilişkilendirir. @tr
toolkit label: Televizyon programı çalışması olarak uyarlanan @tr
toolkit definition: Başka bir eserden uyarlanmış televizyon programın olan bir çalışma @tr

has television program music work
status: Published
definition: Relates a work to a work that is a musical work that complements a work that is a television program.
type: Property
domain: C10001
sub property of: has music work
lexical alias: televisionProgramMusicWork.en
toolkit label: television program music work
toolkit definition: A work that is a musical work that complements a work that is a television program.
toolkit label: musique d’émission de télévision (œuvre) @fr
toolkit definition: Œuvre musicale qui complète une œuvre consistant en une émission de télévision. @fr
toolkit label: música de programa de televisión (obra) @es
toolkit definition: Una obra musical utilizada en un programa de televisión. @es
instruction number: 24.5
label: har tv-programmusikværk @da
definition: Relaterer et værk til et musikværk, som komplementerer et værk, som er et tv-program. @da
toolkit label: tv-programmusikværk @da
toolkit definition: Musikværk, som komplementerer et værk, som er et tv-program. @da
definition: Met une œuvre en relation avec une œuvre musicale qui complète une œuvre consistant en une émission de télévision. @fr
label: là âm nhạc chương trình truyền hình (tác phẩm) @vi
definition: Liên kết tác phẩm với tác phẩm âm nhạc được sử dụng trong chương trình truyền hình. @vi
toolkit label: âm nhạc chương trình truyền hình (tác phẩm) @vi
toolkit definition: Tác phẩm âm nhạc được sử dụng trong chương trình truyền hình. @vi
label: hat Fernsehsendungsmusik (Werk) @de
definition: Setzt ein Werk in Beziehung zu einem Musikwerk, das eine Fernsehsendung ergänzt. @de
toolkit label: Fernsehsendungsmusik (Werk) @de
toolkit definition: Ein Musikwerk, das eine Fernsehsendung ergänzt. @de
label: a pour musique d’émission de télévision (œuvre) @fr
definition: Liittää teoksen musiikkiteokseen, joka täydentää teosta, joka on televisio-ohjelma. @fi
toolkit label: televisio-ohjelman musiikki (teos) @fi
toolkit definition: Musiikkiteos, joka täydentää teosta, joka on televisio-ohjelma. @fi
toolkit label: fjernsynsmusikk (verk) @no
toolkit definition: Et musikalsk verk som utfyller et fjernsynsprogram. @no
label: té com a obra de música de programa de televisió @ca
definition: Relaciona una obra amb una obra que és una obra musical que complementa una obra que és un programa de televisió. @ca
toolkit label: obra de música de programa de televisió @ca
toolkit definition: Obra que és una obra musical que complementa una obra que és un programa de televisió. @ca
has element type: 2
label: είναι μουσική τηλεοπτικού προγράμματος (έργο) @el
definition: Συνδέει ένα έργο με ένα μουσικό έργο το οποίο χρησιμοποιείται σε ένα τηλεοπτικό πρόγραμμα. @el
toolkit label: μουσική τηλεοπτικού προγράμματος (έργο) @el
toolkit definition: Ένα μουσικό έργο το οποίο χρησιμοποιείται σε ένα τηλεοπτικό πρόγραμμα. @el
label: televízióműsorzene-műve a következő: @hu
definition: Hozzákapcsol egy művet egy zeneműhöz, amely kiegészít egy televízióműsor-művet. @hu
toolkit label: tévéműsor-zenemű @hu
toolkit definition: Egy zenemű, amely kiegészít egy televízióműsor-művet. @hu
label: televisio-ohjelman musiikki (teos) @fi
label: har fjernsynsmusikk (verk) @no
definition: Relaterer et verk til et musikalsk verk som utfyller et fjernsynsprogram. @no
label: heeft televisieprogrammamuziek-werk @nl
definition: Relateert een werk aan een muziekwerk dat een werk complementeert dat een televisieprogramma is. @nl
toolkit label: televisieprogrammamuziek-werk @nl
toolkit definition: Een muziekwerk dat een werk complementeert dat een televisieprogramma is. @nl
label: له عمل موسيقي لبرنامج تليفزيوني @ar
definition: يربط عمل بعمل موسيقي يكمل عملاً عبارة عن برنامج تليفزيوني. @ar
toolkit label: عمل موسيقي لبرنامج تليفزيوني @ar
toolkit definition: عمل موسيقي يكمل عملاً عبارة عن برنامج تليفزيوني. @ar
label: telesaate muusika (teos) @et
definition: Seostab teose muusikateosega, mis täiendab telesaatena esinevat teost. @et
toolkit label: telesaate muusika (teos) @et
toolkit definition: Muusikateos, mis täiendab telesaatena esinevat teost. @et
label: ha come musica per programma televisivo opera @it
definition: Correla un’opera a un’opera musicale che completa un’opera che è un programma televisivo. @it
toolkit label: musica per programma televisivo opera @it
toolkit definition: Opera musicale che completa un’opera che è un programma televisivo. @it
label: darbs: televīzijas raidījuma mūzika @lv
definition: Sasaista darbu ar mūzikas darbu, kas papildina darbu, kas ir televīzijas raidījums. @lv
toolkit label: darbs: televīzijas raidījuma mūzika @lv
toolkit definition: Mūzikas darbs, kas papildina darbu, kas ir televīzijas raidījums. @lv
label: 有电视节目音乐作品 @zh-hans
definition: 将一种作品与作为一种音乐作品并补充作为一种电视节目的一种作品的一种作品关联起来。 @zh-hans
toolkit label: 电视节目音乐作品 @zh-hans
toolkit definition: 作为一种音乐作品并补充作为一种电视节目的一种作品的一种作品 @zh-hans
has subproperty: P10241
label: televizyon programı müziği eseri ile ilişkilidir @tr
definition: Bir eseri, televizyon programı olan bir eseri tamamlayan müzik eseri olan bir eserle ilişkilendirir. @tr
toolkit label: televizyon programı müzik eseri @tr
toolkit definition: Bir televizyon programını tamamlayan bir müzik eseri olan bir eser. @tr

is adapted as television screenplay work
status: Published
definition: Relates a work to a work that consists of a screenplay for a television program, based on another work.
type: Property
domain: C10001
sub property of: is adapted as screenplay work
lexical alias: adaptedAsTelevisionScreenplayWork.en
toolkit label: adapted as television screenplay work
toolkit definition: A work that consists of a screenplay for a television program, based on another work.
toolkit label: adapté en scénario de télévision (œuvre) @fr
toolkit definition: Œuvre qui consiste en un scénario d’émission de télévision basé sur une autre œuvre. @fr
toolkit label: adaptada como guión para televisión (obra) @es
toolkit definition: Una obra que consiste en un guión para un programa de televisión, basado en la obra fuente. @es
instruction number: 24.5
label: er bearbejdet til tv-manuskriptværk @da
definition: Relaterer et værk til et værk, som består af et manuskript til et tv-program, baseret på et oprindeligt værk. @da
toolkit label: bearbejdet til tv-manuskriptværk @da
toolkit definition: Værk, som består af et manuskript til et tv-program, baseret på et oprindeligt værk. @da
definition: Met une œuvre en relation avec une œuvre qui consiste en un scénario d’émission de télévision basé sur une autre œuvre. @fr
label: được phỏng theo như là tác phẩm kịch bản truyền hình @vi
definition: Liên kết tác phẩm với tác phẩm có chứa kịch bản của chương trình truyền hình, dựa trên tác phẩm nguồn. @vi
toolkit label: được phỏng theo như là kịch bản truyền hình (tác phẩm) @vi
toolkit definition: Tác phẩm có chứa kịch bản của chương trình truyền hình, dựa trên tác phẩm nguồn. @vi
label: ist bearbeitet als Fernsehdrehbuch (Werk) @de
definition: Setzt ein Werk in Beziehung zu einem Werk, das aus einem Drehbuch für eine Fernsehsendung besteht, das auf einem anderen Werk basiert. @de
toolkit label: Bearbeitet als Fernsehdrehbuch (Werk) @de
toolkit definition: Ein Werk, das aus einem Drehbuch für eine Fernsehsendung besteht, das auf einem anderen Werk basiert. @de
label: est adapté en scénario de télévision (œuvre) @fr
definition: Liittää teoksen teokseen, joka koostuu toiseen teokseen perustuvasta televisio-ohjelman käsikirjoituksesta. @fi
toolkit label: sovitettu televisiokäsikirjoitukseksi (teos) @fi
toolkit definition: Teos, joka koostuu toiseen teokseen perustuvasta televisio-ohjelman käsikirjoituksesta. @fi
toolkit label: bearbeidet som manus for fjernsyn (verk) @no
toolkit definition: Et verk som består av et manuskript for et fjernsynsprogram, basert på et kildeverk. @no
label: és adaptat com a obra de guió de televisió @ca
definition: Relaciona una obra amb una obra que consisteix en un guió d’un programa de televisió basat en una altra obra. @ca
toolkit label: adaptat com a obra de guió de televisió @ca
toolkit definition: Obra que consisteix en un guió d’un programa de televisió basat en una altra obra. @ca
has element type: 2
label: είναι προσαρμοσμένο ως τηλεοπτικό σενάριο (έργο) @el
definition: Συνδέει ένα έργο με ένα έργο που συνίσταται από ένα σενάριο για ένα τηλεοπτικό πρόγραμμα βασισμένο σε ένα έργο-πηγή. @el
toolkit label: προσαρμοσμένο ως τηλεοπτικό σενάριο (έργο) @el
toolkit definition: Ένα έργο που συνίσταται από ένα σενάριο για ένα τηλεοπτικό πρόγραμμα βασισμένο σε ένα έργο-πηγή. @el
label: tévésforgatókönyvmű-feldolgozása a következő: @hu
definition: Hozzákapcsol egy művet egy műhöz, amely egy másik művön alapuló televízióműsor forgatókönyvéből áll. @hu
toolkit label: tévésforgatókönyv-feldolgozása a következő: @hu
toolkit definition: Egy mű, amely egy másik művön alapuló televízióműsor forgatókönyvéből áll. @hu
label: sovitettu televisiokäsikirjoitukseksi (teos) @fi
label: er bearbeidet som manus for fjernsyn (verk) @no
definition: Relaterer et verk til et verk som består av et manuskript for et fjernsynsprogram, basert på et kildeverk. @no
label: is bewerkt als televiescenariowerk @nl
definition: Relateert een werk aan een werk dat bestaat uit een scenario voor een televisieprogramma, gebaseerd op een ander werk. @nl
toolkit label: bewerkt als televiescenariowerk @nl
toolkit definition: Een werk dat bestaat uit een scenario voor een televisieprogramma, gebaseerd op een ander werk. @nl
label: هو معالج كعمل سيناريو تليفزيون @ar
definition: يربط عمل بعمل يتكون من سيناريو فيلم سينمائي لبرنامج تليفزيوني، مبني على عمل آخر. @ar
toolkit label: معالج كعمل سيناريو تليفزيون @ar
toolkit definition: عمل يتكون من سيناريو فيلم سينمائي لبرنامج تليفزيوني، مبني على عمل آخر. @ar
label: adapteeritud telestsenaariumina (teos) @et
definition: Seostab teose teosega, mis on allikteosel põhinev stsenaarium telesaate jaoks. @et
toolkit label: adapteeritud telestsenaariumina (teos) @et
toolkit definition: Teos, mis on allikteosel põhinev stsenaarium telesaate jaoks. @et
label: è adattata come opera in forma di sceneggiatura televisiva @it
definition: Correla un’opera a un’opera che consiste di una sceneggiatura per un programma televisivo, basata su un’opera di partenza. @it
toolkit label: adattata come opera in forma di sceneggiatura televisiva @it
toolkit definition: Opera che consiste di una sceneggiatura per un programma televisivo, basata su un’opera di partenza. @it
label: ir adaptēts kā televīzijas raidījuma scenārijs (darbs) @lv
definition: Sasaista darbu ar darbu - televīzijas raidījuma scenārijs veidots pēc pamatdarba. @lv
toolkit label: adaptēts kā darbs: televīzijas raidījuma scenārijs @lv
toolkit definition: Darbs - televīzijas raidījuma scenārijs veidots pēc pamatdarba. @lv
label: 被改编为电视节目剧本作品 @zh-hans
definition: 将一种作品与由基于另一种作品的一种电视节目的剧本组成的一种作品关联起来。 @zh-hans
toolkit label: 被改编为电视节目剧本作品 @zh-hans
toolkit definition: 由基于另一种作品的一种电视节目的剧本组成的一种作品 @zh-hans
has subproperty: P10096
label: televizyon senaryosu eseri olarak uyarlanmıştır @tr
definition: Bir eseri, başka bir eserden uyarlanan bir televizyon programı senaryosundan oluşan bir eserle ilişkilendirir. @tr
toolkit label: Televizyon senaryosu çalışması olarak uyarlanan @tr
toolkit definition: Başka bir esere dayalı olarak bir televizyon programı için yazılmış bir senaryodan oluşan eser. @tr

is text for work
status: Published
lexical alias: textForWork.en
toolkit label: text for work
type: Property
domain: C10001
sub property of: is complemented by work
has element type: 2
definition: Relates a work to a work that is complemented by a work that is a textual work.
toolkit definition: A work that is complemented by a work that is a textual work.
label: teksti teokseen @fi
definition: Liittää teoksen teokseen, jota täydentää teos, joka on tekstiteos. @fi
toolkit label: teksti teokseen @fi
toolkit definition: Teos, jota täydentää teos, joka on tekstiteos. @fi
label: er tekst for verk @no
definition: Relaterer et verk til et verk som utfylles av et verk som er et tekstlig verk. @no
toolkit label: tekst for verk @no
toolkit definition: Et verk som utfylles av et verk som er et tekstlig verk. @no
label: is tekst voor werk @nl
definition: Relateert een werk aan een werk dat is gecomplementeerd met een werk dat een tekstwerk is. @nl
toolkit label: tekst voor werk @nl
toolkit definition: Een werk dat is gecomplementeerd met een werk dat een tekstwerk is. @nl
label: هو نص لعمل @ar
definition: يربط عمل بعمل يكمله عمل عبارة عن عمل نصي. @ar
toolkit label: نص لعمل @ar
toolkit definition: عمل يكمله عمل عبارة عن عمل نصي. @ar
label: és text per a una obra @ca
definition: Relaciona una obra amb una obra que es complementa amb una obra que és una obra textual. @ca
toolkit label: text per a una obra @ca
toolkit definition: Obra que es complementa amb una obra que és una obra textual. @ca
label: er tekst til værk @da
definition: Relaterer et værk til et værk, som er komplementeret af et værk, som er et tekstværk. @da
toolkit label: tekst til værk @da
toolkit definition: Værk, som er komplementeret af et værk, som er et tekstværk. @da
label: tekst teosele @et
definition: Seostab teose teosega, mis on täiendatud tekstteosega. @et
toolkit label: tekst teosele @et
toolkit definition: Teos, mis on täiendatud tekstteosega. @et
label: ist Text für (Werk) @de
definition: Setzt ein Werk in Beziehung zu einem Werk, das durch ein textliches Werk vervollständigt wird. @de
toolkit label: Text für (Werk) @de
toolkit definition: Ein Werk, das durch ein textliches Werk vervollständigt wird. @de
label: szövege a következő műnek: @hu
definition: Hozzákapcsol egy művet egy műhöz, amelyet egy szöveges mű egészít ki. @hu
toolkit label: szöveggel ellátott mű @hu
toolkit definition: Egy mű, amelyet egy szöveges mű egészít ki. @hu
label: è testo per opera @it
definition: Correla un'opera a un'opera che è completata da un'opera testuale. @it
toolkit label: testo per opera @it
toolkit definition: Opera completata da un'opera testuale. @it
label: est un texte pour une œuvre @fr
definition: Met une œuvre en relation avec une œuvre qui est complétée par une œuvre textuelle. @fr
toolkit label: texte pour une œuvre @fr
toolkit definition: Œuvre qui est complétée par une œuvre textuelle. @fr
label: ir teksts darbam @lv
toolkit label: teksts darbam @lv
definition: Sasaista darbu ar darbu, kas ir papildināts ar darbu, kas realizēts kā teksts. @lv
toolkit definition: Darbs, kas ir papildināts ar darbu, kas realizēts kā teksts. @lv
label: 是作品的文本 @zh-hans
toolkit label: 作品的文本 @zh-hans
definition: 将一种作品与被一种作品补充并是一种文字作品的一种作品关联起来。 @zh-hans
toolkit definition: 被一种作品补充并是一种文字作品的一种作品 @zh-hans
has subproperty: is lyrics for work
has subproperty: is screenplay for work
has subproperty: is libretto for work
has subproperty: is script for radio program work
has subproperty: P10372
label: Eser için metin @tr
toolkit label: eser için metin @tr
definition: Bir eseri, metinsel bir eser olan bir eserle tamamlanan eserle ilişkilendirir. @tr
toolkit definition: Metinsel bir çalışma olan bir eser ile tamamlanan bir eser @tr

has text work
status: Published
lexical alias: textWork.en
toolkit label: text work
type: Property
domain: C10001
sub property of: is complemented by work
has element type: 2
definition: Relates a work to a work that is a textual work that complements a work.
toolkit definition: A work that is a textual work that complements a work.
label: tekstiteos @fi
definition: Liittää teoksen teokseen, joka on tekstiteos, joka täydentää teosta. @fi
toolkit label: tekstiteos @fi
toolkit definition: Teos, joka on tekstiteos, joka täydentää teosta. @fi
label: har tekstlig verk @no
definition: Relaterer et verk til et verk som er et tekstlig verk som utfyller et verk. @no
toolkit label: tekstlig verk @no
toolkit definition: Et verk som er et tekstlig verk som utfyller et verk. @no
label: heeft tekstwerk @nl
definition: Relateert een werk aan een werk dat een tekstwerk is dat een werk complementeert. @nl
toolkit label: tekstwerk @nl
toolkit definition: Een werk dat een tekstwerk is dat een werk complementeert. @nl
label: له عمل نصي @ar
definition: يربط عمل بعمل عبارة عن عمل نصي يكمل عملا. @ar
toolkit label: عمل نصي @ar
toolkit definition: عمل عبارة عن عمل نصي يكمل عملا. @ar
label: té com a obra de text @ca
definition: Relaciona una obra amb una obra que és una obra textual que complementa una obra. @ca
toolkit label: obra de text @ca
toolkit definition: Obra que és una obra textual que complementa una obra. @ca
label: har tekstværk @da
definition: Relaterer et værk til et værk, som er et tekstværk, som komplementerer et værk. @da
toolkit label: tekstværk @da
toolkit definition: Værk, som er et tekstværk, som komplementerer et værk. @da
label: tekst (teos) @et
definition: Seostab teose teost täiendava tekstteosega. @et
toolkit label: tekst (teos) @et
toolkit definition: Teost täiendav tekstteos. @et
label: hat Text (Werk) @de
definition: Setzt ein Werk in Beziehung zu einem textlichen Werk, das ein Werk ergänzt. @de
toolkit label: Text (Werk) @de
toolkit definition: Ein textliches Werk, das ein Werk ergänzt. @de
label: szöveges műve a következő: @hu
definition: Hozzákapcsol egy művet egy szöveges műhöz, amelyet egy mű egészít ki. @hu
toolkit label: szövegmű @hu
toolkit definition: Egy szöveges mű. Amelyet egy mű egészít ki. @hu
label: ha come testo opera @it
definition: Correla un'opera a un'opera, che è un'opera testuale che completa un'opera. @it
toolkit label: testo opera @it
toolkit definition: Opera testuale che completa un'opera. @it
label: a pour texte (œuvre) @fr
definition: Met une œuvre en relation avec une œuvre textuelle qui complète une œuvre. @fr
toolkit label: texte (œuvre) @fr
toolkit definition: Œuvre textuelle qui complète une œuvre. @fr
label: darbs: teksts @lv
toolkit label: darbs: teksts @lv
definition: Sasaista darbu ar darbu, kas ir realizēts kā teksts, kas papildina citu darbu. @lv
toolkit definition: Darbs, kas ir realizēts kā teksts, kas papildina citu darbu. @lv
label: 有文本作品 @zh-hans
toolkit label: 文本作品 @zh-hans
definition: 将一种作品与作为一种文字作品并补充一种作品的一种作品关联起来。 @zh-hans
toolkit definition: 作为一种文字作品并补充一种作品的一种作品 @zh-hans
has subproperty: has screenplay work
has subproperty: has libretto work
has subproperty: has lyrics work
has subproperty: has radio script work
has subproperty: P10371
label: metin eseri ile ilişkilidir @tr
toolkit label: eser metni @tr
definition: Bir eseri, bir eseri tamamlayan metinsel bir eserle ilişkilendirir. @tr
toolkit definition: Bir eseri tamamlayan metinsel bir eser. @tr

has thematic index number
status: Published
type: Property
lexical alias: thematicIndexNumber.en
definition: Relates a work to a nomen that is a numeric designation of musical work that is assigned from a list of works of a composer, usually arranged in chronological order or by categories, with the theme given for each composition or for each section of large compositions.
domain: C10001
toolkit label: thematic index number
toolkit definition: A nomen that is a numeric designation of musical work that is assigned from a list of works of a composer, usually arranged in chronological order or by categories, with the theme given for each composition or for each section of large compositions.
sub property of: has numeric designation of musical work
has element type: 3
instruction number: 6.16.1.3.3
label: temaattisen teosluettelon numero @fi
definition: Liittää teoksen nomeniin, joka on musiikkiteoksen numerointi, joka on annettu säveltäjän teosluettelossa, joka on yleensä järjestetty aikajärjestykseen tai luokittain ja johon sisältyy teema jokaisesta sävellyksestä tai suurten sävellysten jokaisesta osasta. @fi
toolkit label: temaattisen teosluettelon numero @fi
toolkit definition: Nomen, joka on musiikkiteoksen numerointi, joka on annettu säveltäjän teosluettelossa, joka on yleensä järjestetty aikajärjestykseen tai luokittain ja johon sisältyy teema jokaisesta sävellyksestä tai suurten sävellysten jokaisesta osasta. @fi
label: har tematisk indeksnummer @no
definition: Relaterer et verk til en numerisk betegnelse på musikalsk verk som er tildelt fra en fortegnelse over en komponists verk, vanligvis ført opp i kronologisk orden eller etter kategorier, med temaet angitt for hver komposisjon eller hver seksjon av større komposisjoner. @no
toolkit label: tematisk indeksnummer @no
toolkit definition: En numerisk betegnelse på musikalsk verk som er tildelt fra en fortegnelse over en komponists verk, vanligvis ført opp i kronologisk orden eller etter kategorier, med temaet angitt for hver komposisjon eller hver seksjon av større komposisjoner. @no
label: heeft thematische index-nummer @nl
definition: Relateert een werk aan een nomen dat is een numerieke aanduiding van muziekwerk dat toegekend is uit een lijst van werken van een componist, meestal gerangschikt in chronologische volgorde of per categorie, met het thema gegeven voor elke compositie of voor elke sectie van grote composities. @nl
toolkit label: thematische index-nummer @nl
toolkit definition: Een nomen dat is een numerieke aanduiding van muziekwerk dat toegekend is uit een lijst van werken van een componist, meestal gerangschikt in chronologische volgorde of per categorie, met het thema gegeven voor elke compositie of voor elke sectie van grote composities. @nl
label: له رقم كشاف موضوعي @ar
definition: يربط بين عمل وتسمية عبارة عن تعيين رقمي لعمل موسيقي محدَد من قائمة أعمال ملحن، عادة مرتبة ترتيبا زمنيا أو حسب الفئة، مع تحديد الموضوع لكل تلحين أو لكل قسم من المقطوعات الكبيرة. @ar
toolkit label: رقم كشاف موضوعي @ar
toolkit definition: تسمية عبارة عن تعيين رقمي لعمل موسيقي محدَد من قائمة أعمال ملحن، عادة مرتبة ترتيبا زمنيا أو حسب الفئة، مع تحديد الموضوع لكل تلحين أو لكل قسم من المقطوعات الكبيرة. @ar
label: té com a número d’índex temàtic @ca
definition: Relaciona una obra amb un nomen que és una designació numèrica d’una obra musical que s’assigna a partir d’una llista d’obres d’un compositor, normalment ordenada per ordre cronològic o per categories, amb el tema donat a cada composició o cada secció de composicions llargues. @ca
toolkit label: número d’índex temàtic @ca
toolkit definition: Nomen que és una designació numèrica d’una obra musical que s’assigna a partir d’una llista d’obres d’un compositor, normalment ordenada per ordre cronològic o per categories, amb el tema donat a cada composició o cada secció de composicions llargues. @ca
definition: Relaterer et værk til en numerisk betegnelse, tildelt udfra en liste over en komponists værker, sædvanligvis arrangeret i kronologisk rækkefølge eller efter kategorier, med givet tema for hver komposition eller for hver del af store kompositioner. @da
toolkit definition: Numerisk betegnelse, tildelt udfra en liste over en komponists værker, sædvanligvis arrangeret i kronologisk rækkefølge eller efter kategorier, med givet tema for hver komposition eller for hver del af store kompositioner. @da
label: temaatilise kataloogi number @et
definition: Seostab teose muusikateose numbrilise tähistusega, mis on võetud helilooja teoste nimestikust. Nimestik on tavaliselt korrastatud kronoloogiliselt või žanrite kaupa ja sisaldab iga heliteose või suuremate teoste puhul iga osa teemat. @et
toolkit label: temaatilise kataloogi number @et
toolkit definition: Muusikateose numbriline tähistus, mis on võetud helilooja teoste nimestikust. Nimestik on tavaliselt korrastatud kronoloogiliselt või žanrite kaupa ja sisaldab iga heliteose või suuremate teoste puhul iga osa teemat. @et
label: hat Werkverzeichnisnummer @de
definition: Setzt ein Werk in Beziehung zu einer numerischen Bezeichnung eines Musikwerks aus einem Werkverzeichnis einer Komponistin/eines Komponisten, das in einer chronologischen Reihenfolge oder nach Kategorien angeordnet ist. Zusätzlich können darin Notenzitate in Form von Incipits oder thematischem Material für jede Komposition oder für jede Passage längerer Kompositionen aufgeführt sein. @de
toolkit label: Werkverzeichnisnummer @de
toolkit definition: Eine numerische Bezeichnung eines Musikwerks aus einem Werkverzeichnis einer Komponistin/eines Komponisten, das in einer chronologischen Reihenfolge oder nach Kategorien angeordnet ist. Zusätzlich können darin Notenzitate in Form von Incipits oder thematischem Material für jede Komposition oder für jede Passage längerer Kompositionen aufgeführt sein. @de
label: tematikus indexszáma a következő: @hu
definition: Hozzákapcsol egy művet egy nomenhez, egy zenemű számjelzéséhez, amelyet egy zeneszerző műveinek a komponálás kronológiai sorrendje vagy kategóriák szerint rendezett jegyzékéből rendeltek hozzá, amely minden zeneművet vagy a nagyobb zeneművek egyes szakaszait témával látja el. @hu
toolkit label: tematikus indexszáma: @hu
toolkit definition: Egy nomen, egy zenemű számjelzése, amelyet egy zeneszerző műveinek a komponálás kronológiai sorrendje vagy kategóriák szerint rendezett jegyzékéből rendeltek hozzá, amely minden zeneművet vagy a nagyobb zeneművek egyes szakaszait témával látja el. @hu
label: ha come numero di catalogo tematico @it
definition: Correla un’opera a una designazione numerica di opera musicale assegnata da un elenco di opere di un compositore di solito organizzato in ordine cronologico o per categorie, con il tema assegnato a ogni composizione o a ogni sezione di grandi composizioni. @it
toolkit label: numero di catalogo tematico @it
toolkit definition: Designazione numerica di opera musicale assegnata da un elenco di opere di un compositore di solito organizzato in ordine cronologico o per categorie, con il tema assegnato a ogni composizione o a ogni sezione di grandi composizioni. @it
label: a pour numéro de catalogue thématique @fr
definition: Met une œuvre en relation avec un nomen qui est une désignation numérique d’une œuvre musicale attribuée à partir d’une liste des œuvres d’un compositeur dans laquelle celles-ci sont ordinairement classées par ordre chronologique ou par catégories, avec le thème de chaque composition ou de chaque section d’une composition dans le cas des compositions d’envergure. @fr
toolkit label: numéro de catalogue thématique @fr
toolkit definition: Nomen qui est une désignation numérique d’une œuvre musicale attribuée à partir d’une liste des œuvres d’un compositeur dans laquelle celles-ci sont ordinairement classées par ordre chronologique ou par catégories, avec le thème de chaque composition ou de chaque section d’une composition dans le cas des compositions d’envergure. @fr
label: skaņdarbu rādītāja numurs @lv
definition: Sasaista darbu ar nomenu, kas ir muzikas darba numerācijas apzīmējums, kuru piešķir saskaņā ar komponista darbu sarakstu, kas parasti ir sakārtots kategorijās vai hronoloģiskā secībā, katrai kompozīcijai vai lielas kompozīcijas katrai daļai piešķirot tematisko apzīmējumu. @lv
toolkit label: skaņdarbu rādītāja numurs @lv
toolkit definition: Muzikas darba numerācijas apzīmējums, kuru piešķir saskaņā ar komponista darbu sarakstu, kas parasti ir sakārtots kategorijās vai hronoloģiskā secībā, katrai kompozīcijai vai lielas kompozīcijas katrai daļai piešķirot tematisko apzīmējumu. @lv
label: 有主题索引号 @zh-hans
definition: 将一种作品与根据作曲者的作品列表分配、通常按年代顺序或类别顺序排列、并有每个谱曲或更大谱曲每个部分的主题的音乐作品的数字标识关联起来。 @zh-hans
toolkit label: 主题索引号 @zh-hans
toolkit definition: 根据作曲者的作品列表分配、通常按年代顺序或类别顺序排列、并有每个谱曲或更大谱曲每个部分的主题的音乐作品的数字标识 @zh-hans
has subproperty: P10335
label: tematik dizin numarası ile ilişkilidir @tr
definition: Bir eseri, bir bestecinin eserlerinden oluşan bir listeden belirlenen, genellikle kronolojik sıraya veya kategorilere göre düzenlenmiş, her bir beste veya büyük bestelerin her bir bölümü için temanın verildiği müzik eserinin sayısal bir belirteci olan bir isimle ilişkilendirir. @tr
toolkit label: tematik dizin numarası @tr
toolkit definition: Bir bestecinin, genellikle kronolojik sıraya veya kategorilere göre düzenlenmiş, her bir beste veya büyük bestelerin her bir bölümü için temanın verildiği bir eser listesinden atanan müzik eserinin sayısal bir tanımı olan isim. @tr

has enacting government
status: Published
definition: Relates a work to a corporate body who is a government enacting a work that is a law, regulation, constitution, court rule, or other legislation.
type: Property
domain: C10001
toolkit label: enacting government
toolkit definition: A corporate body who is a government enacting a work that is a law, regulation, constitution, court rule, or other legislation.
toolkit label: gouvernement promulgateur @fr
toolkit definition: Collectivité qui constitue un gouvernement promulguant une œuvre qui consiste en une loi, un règlement, une constitution, une règle de pratique de tribunal ou une autre mesure législative. @fr
toolkit label: jurisdicción promulgadora @es
toolkit definition: Una jurisdicción que promulga una ley, disposición, constitución, reglamento de tribunal, etc. @es
instruction number: 18.5
label: har udøvende jurisdiktion @da
definition: Relaterer et værk til en korporation, som er en regering, som vedtager et værk, der er en lov, forordning, forfatning, retsplejeregel eller anden lovgivning. @da
toolkit label: udøvende jurisdiktion @da
toolkit definition: Korporation, som er en regering, som vedtager et værk, der er en lov, forordning, forfatning, retsplejeregel eller anden lovgivning. @da
definition: Met une œuvre en relation avec une collectivité qui constitue un gouvernement promulguant une œuvre qui consiste en une loi, un règlement, une constitution, une règle de pratique de tribunal ou une autre mesure législative. @fr
label: có thẩm quyền thực thi pháp lý @vi
definition: Liên kết tác phẩm với khu vực pháp quyền ban hành luật, quyết định, hiến pháp, quy tắc toà án, v.v... @vi
toolkit label: thẩm quyền thực thi pháp lý @vi
toolkit definition: Khu vực pháp quyền ban hành luật, quyết định, hiến pháp, quy tắc toà án, v.v... @vi
label: Normerlassende Gebietskörperschaft @de
definition: Setzt ein Werk in Beziehung zu einer Regierung (Körperschaft), die ein Werk erlässt, bei dem es sich um ein Gesetz, eine Verordnung, eine Verfassung, eine Rechtsverordnung oder eine andere Gesetzgebung handelt. @de
toolkit label: Normerlassende Gebietskörperschaft von @de
toolkit definition: Eine Regierung (Körperschaft), die ein Werk erlässt, bei dem es sich um ein Gesetz, eine Verordnung, eine Verfassung, eine Rechtsverordnung oder eine andere Gesetzgebung handelt. @de
label: a pour gouvernement promulgateur @fr
definition: Liittää teoksen yhteisöön, joka on teoksen, joka on laki, asetus, perustuslaki, tuomioistuinta koskeva sääntö tai muu säädös, säätävä hallintoelin. @fi
toolkit label: säätävä hallintoelin @fi
toolkit definition: Yhteisö, joka on teoksen, joka on laki, asetus, perustuslaki, tuomioistuinta koskeva sääntö tai muu säädös, säätävä hallintoelin. @fi
toolkit label: vedtakende jurisdiksjon @no
toolkit definition: En korporasjon som er en offentlig myndighet som vedtar et verk som er en lov, vedtekt, grunnlov, rettergangsregel eller annen lovgiving. @no
label: té com a govern promulgador @ca
definition: Relaciona una obra amb una entitat corporativa que és un govern que promulga una obra que és una llei, un reglament, una constitució, una regla de funcionament d’un tribunal o qualsevol altra legislació. @ca
toolkit label: govern promulgador @ca
toolkit definition: Entitat corporativa que és un govern que promulga una obra que és una llei, un reglament, una constitució, una regla de funcionament d’un tribunal o qualsevol altra legislació. @ca
has element type: 2
label: έχει θεσπισμένη δικαιοδοσία @el
definition: Συνδέει ένα έργο με μια δικαιοδοσία, που θεσπίζει έναν νόμο, κανονισμό, σύνταγμα, κανόνα δικαστηρίου κ.λπ. @el
toolkit label: θεσπισμένη δικαιοδοσία @el
toolkit definition: Mια δικαιοδοσία, που θεσπίζει έναν νόμο, κανονισμό, σύνταγμα, κανόνα δικαστηρίου κ.λπ. @el
label: törvényalkotási joghatósága a következő: @hu
definition: Hozzákapcsol egy művet egy testülethez, amely egy igazgatási szerv, amely kiad egy művet, ami egy törvény, rendelet, alkotmány, törvényszéki szabályzat vagy egyéb jogszabály. @hu
toolkit label: törvényalkotási joghatósága a következő: @hu
toolkit definition: Egy testület, amely egy igazgatási szerv, amely kiad egy művet, ami egy törvény, rendelet, alkotmány, törvényszéki szabályzat vagy egyéb jogszabály. @hu
label: säätävä hallintoelin @fi
label: har vedtakende jurisdiksjon @no
definition: Relaterer et verk til en korporasjon som er en offentlig myndighet som vedtar et verk som er en lov, vedtekt, grunnlov, rettergangsregel eller annen lovgiving. @no
sub property of: has creator corporate body of work
label: heeft vaststellende regering @nl
definition: Relateert een werk aan een corporatie die een regering is die een werk vaststelt dat een wet, regeling, grondwet, rechterlijke uitspraak of andere wetgeving is. @nl
toolkit label: vaststellende regering @nl
toolkit definition: Een corporatie die een regering is die een werk vaststelt dat een wet, regeling, grondwet, rechterlijke uitspraak of andere wetgeving is. @nl
label: له سلطة سن القوانين @ar
definition: يربط بين عمل وهيئة عبارة عن حكومة تسن عملا عبارة عن قانون، أو لائحة، أو دستور، أو حكم قضائي، أو تشريع آخر. @ar
toolkit label: سن الولاية القضائية @ar
toolkit definition: هيئة عبارة عن حكومة تسن عملا عبارة عن قانون، أو لائحة، أو دستور، أو حكم قضائي، أو تشريع آخر. @ar
label: kehtestav võimkond @et
definition: Seostab teose asutusega, kes on seadust, määrust, konstitutsiooni, menetluseeskirja või muud õigusaktina loodud teost kehtestav valitsus. @et
toolkit label: kehtestav võimkond @et
toolkit definition: Asutus, kes on seadust, määrust, konstitutsiooni, menetluseeskirja või muud õigusaktina loodud teost kehtestav valitsus. @et
label: ha come giurisdizione emanante @it
definition: Correla un’opera a un ente che è un governo che emana un’opera che è una legge, regolamento, costituzione, regolamento della corte o altra legislazione. @it
toolkit label: giurisdizione emanante @it
toolkit definition: Ente che è un governo che emana un’opera che è una legge, regolamento, costituzione, regolamento della corte o altra legislazione. @it
label: ieviesējjurisdikcija @lv
definition: Sasaista darbu ar institūciju, kas ir valsts pārvaldes iestāde un ir tiesīga ieviest likumus, noteikumus, konstitūciju, tiesas nolēmumus vai citus tiesību aktus. @lv
toolkit label: ieviesējjurisdikcija @lv
toolkit definition: Institūcija, kas ir valsts pārvaldes iestāde un ir tiesīga ieviest likumus, noteikumus, konstitūciju, tiesas nolēmumus vai citus tiesību aktus. @lv
lexical alias: enactingGovernment.en
label: 有颁布政府 @zh-hans
definition: 将一种作品与作为一个政府颁布作为法律、法规、宪法、法院规则或其他立法的一种作品的一个团体关联起来。 @zh-hans
toolkit label: 颁布政府 @zh-hans
toolkit definition: 作为一个政府颁布作为法律、法规、宪法、法院规则或其他立法的一种作品的一个团体 @zh-hans
alternative label: juridiction promulgatrice @fr
alternative label: gouvernement édicteur @fr
has subproperty: P10017
label: yasa çıkaran hükümet ile ilişkilidir @tr
definition: Bir eseri, kanun, yönetmelik, anayasa, mahkeme kuralı veya diğer mevzuat olan bir eseri yürürlüğe koyan hükümet olan tüzel kişi ile ilişkilendirir. @tr
toolkit label: yargı yetkisini yürürlüğe koyma @tr
toolkit definition: Kanun, yönetmelik, anayasa, mahkeme kuralı veya diğer mevzuat olan bir eseri yürürlüğe koyan bir devlet kurumu olan tüzel bir kişilik. @tr

has transformation
status: Published
type: Property
lexical alias: transformation.en
domain: C10001
definition: Relates a work to a work that is created by changing the scope or editorial policy, the genre or literary form, the target audience, or the style of a work.
toolkit label: transformation
toolkit definition: A work that is created by changing the scope or editorial policy, the genre or literary form, the target audience, or the style of a work.
sub property of: has related work of work
has element type: 2
label: muunnos @fi
definition: Liittää teoksen teokseen, joka on luotu muuttamalla teoksen toiminta-alaa tai toimituslinjaa, genreä tai kirjallista muotoa, kohdeyleisöä tai tyyliä. @fi
toolkit label: muunnos @fi
toolkit definition: Teos, joka on luotu muuttamalla teoksen toiminta-alaa tai toimituslinjaa, genreä tai kirjallista muotoa, kohdeyleisöä tai tyyliä. @fi
label: har transformasjon @no
definition: Relaterer et verk til et verk som er skapt ved endring av omfanget eller de redaksjonelle retningslinjene, sjangeren eller den litterære formen, målgruppen eller stilen til et verk. @no
toolkit label: transformasjon @no
toolkit definition: Et verk som er skapt ved endring av omfanget eller de redaksjonelle retningslinjene, sjangeren eller den litterære formen, målgruppen eller stilen til et verk. @no
label: heeft transformatie @nl
definition: Relateert een werk aan een werk dat gecreëerd is door het veranderen van de scope of redactiebeleid, het genre of de literaire vorm, de doelgroep of de stijl van een werk. @nl
toolkit label: transformatie @nl
toolkit definition: Een werk dat gecreëerd is door het veranderen van de scope of redactiebeleid, het genre of de literaire vorm, de doelgroep of de stijl van een werk. @nl
label: له تحول @ar
definition: يربط عمل بعمل تم إنشاؤه عن طريق تغيير مجال عمل أو سياسته التحريرية، أو نوعه أو شكله الأدبي، أو جمهوره المستهدف، أو أسلوبه. @ar
toolkit label: تحول @ar
toolkit definition: عمل تم إنشاؤه عن طريق تغيير مجال عمل أو سياسته التحريرية، أو نوعه أو شكله الأدبي، أو جمهوره المستهدف، أو أسلوبه. @ar
label: té com a transformació @ca
definition: Relaciona una obra amb una obra que es crea canviant l’abast o la política editorial, el gènere o la forma literària, els destinataris previstos o l’estil d’una obra. @ca
toolkit label: transformació @ca
toolkit definition: Obra que es crea canviant l’abast o la política editorial, el gènere o la forma literària, els destinataris previstos o l’estil d’una obra. @ca
label: har transformation @da
definition: Relaterer et værk til et værk, som er skabt ved ændring af et værks rækkevidde eller redaktionelle retningslinje, genre eller litterære form, målgruppe eller stil. @da
toolkit definition: Værk, som er skabt ved ændring af et værks rækkevidde eller redaktionelle retningslinje, genre eller litterære form, målgruppe eller stil. @da
label: ümberkujundus @et
definition: Seostab teose teosega, mis on loodud, muutes teose käsitlusala või toimetamispõhimõtteid, žanri või kirjanduslikku vormi, sihtrühma või stiili. @et
toolkit label: ümberkujundus @et
toolkit definition: Teos, mis on loodud, muutes teose käsitlusala või toimetamispõhimõtteid, žanri või kirjanduslikku vormi, sihtrühma või stiili. @et
label: hat Transformation @de
definition: Setzt ein Werk in Beziehung zu einem Werk, das durch eine Änderung des Geltungsbereichs, der redaktionelle Vorgehensweise, des Genres oder der literarischen Form, der Zielgruppe oder des Stils eines Werks erstellt wird. @de
toolkit label: Transformation @de
toolkit definition: Ein Werk, das durch eine Änderung des Geltungsbereichs, der redaktionelle Vorgehensweise, des Genres oder der literarischen Form, der Zielgruppe oder des Stils eines Werks erstellt wird. @de
label: átalakítása a következő: @hu
definition: Hozzákapcsol egy művet egy műhöz, amely egy mű alkalmazási területének vagy szerkesztési elveinek, a műfajának vagy műnemének, a célközönségének vagy a stílusának megváltoztatásával jött létre. @hu
toolkit label: átalakítás @hu
toolkit definition: Egy mű, amely egy mű alkalmazási területének vagy szerkesztési elveinek, a műfajának vagy műnemének, a célközönségének vagy a stílusának megváltoztatásával jött létre. @hu
label: ha come trasformazione @it
definition: Correla un’opera a un’opera che è creata cambiando l’oggetto o la politica editoriale, il genere o la forma letteraria, il pubblico di riferimento o lo stile di un’opera. @it
toolkit label: trasformazione @it
toolkit definition: Opera che è creata cambiando l’oggetto o la politica editoriale, il genere o la forma letteraria, il pubblico di riferimento o lo stile di un’opera. @it
label: a pour transformation @fr
definition: Met une œuvre en relation avec une œuvre qui est créée en modifiant la portée ou la politique éditoriale, le genre ou la forme littéraire, le public cible ou le style d’une œuvre. @fr
toolkit definition: Œuvre qui est créée en modifiant la portée ou la politique éditoriale, le genre ou la forme littéraire, le public cible ou le style d’une œuvre. @fr
label: pārveidojums @lv
definition: Sasaista darbu ar darbu, kas radīts, mainot darbības jomu vai izdošanas politiku, žanru vai literāro formu, mērķauditoriju vai darba stilu. @lv
toolkit label: pārveidojums @lv
toolkit definition: Darbs, kas radīts, mainot darbības jomu vai izdošanas politiku, žanru vai literāro formu, mērķauditoriju vai darba stilu. @lv
label: 有转换 @zh-hans
definition: 将一种作品与通过改变一种作品的范围或编辑政策、体裁或文学形式、目标受众或风格而被创建的一种作品关联起来。 @zh-hans
toolkit label: 转换 @zh-hans
toolkit definition: 通过改变一种作品的范围或编辑政策、体裁或文学形式、目标受众或风格而被创建的一种作品 @zh-hans
has subproperty: has transformation by audience
has subproperty: has transformation by genre
has subproperty: has transformation by policy
has subproperty: has transformation by style
has subproperty: P10336
label: dönüşüm ile ilişkilidir @tr
definition: Bir eseri, kapsamını veya yayın politikasını, türünü veya edebi biçimini, hedef kitlesini veya biçimini değiştirerek oluşturulan bir eserle ilişkilendirir. @tr
toolkit label: dönüşüm @tr
toolkit definition: Kapsamı veya yayın politikasının, türü veya edebi biçiminin, hedef kitlesi veya üslubunun değiştirilmesiyle oluşturulan bir eser. @tr

has transformation by audience
status: Published
lexical alias: transformationByAudience.en
definition: Relates a work to a work that is created by changing the audience of a work.
toolkit label: transformation by audience
toolkit definition: A work that is created by changing the audience of a work.
type: Property
domain: C10001
sub property of: has transformation
has element type: 2
label: muunnos yleisössä @fi
definition: Liittää teoksen teokseen, joka on luotu muuttamalla teoksen yleisöä. @fi
toolkit label: muunnos yleisössä @fi
toolkit definition: Teos, joka on luotu muuttamalla teoksen yleisöä. @fi
label: har transformasjon ved målgruppe @no
definition: Relaterer et verk til et verk som er skapt ved endring av målgruppen for et verk. @no
toolkit label: transformasjon ved målgruppe @no
toolkit definition: Et verk som er skapt ved endring av målgruppen for et verk. @no
label: heeft transformatie door doelgroep @nl
definition: Relateert een werk aan een werk dat is gecreëerd door het wijzigen van de doelgroep van een werk. @nl
toolkit label: transformatie door doelgroep @nl
toolkit definition: Een werk dat is gecreëerd door het wijzigen van de doelgroep van een werk. @nl
label: له تحول وفق الجمهور @ar
definition: يربط عمل بعمل يتم إنشاؤه عن طريق تغيير جمهور عمل. @ar
toolkit label: تحول وفق الجمهور @ar
toolkit definition: عمل يتم إنشاؤه عن طريق تغيير جمهور عمل. @ar
label: té com a transformació de destinataris @ca
definition: Relaciona una obra amb una obra que es crea canviant els destinataris d’una obra. @ca
toolkit label: transformació de destinataris @ca
toolkit definition: Obra que es crea canviant els destinataris d’una obra. @ca
label: har transformation ved målgruppe @da
definition: Relaterer et værk til et værk, som er skabt ved at ændre målgruppen for et værk. @da
toolkit label: transformation ved målgruppe @da
toolkit definition: Værk, som er skabt ved at ændre målgruppen for et værk. @da
label: ümberkujundus sihtrühma alusel @et
definition: Seostab teose teosega, mis on loodud, muutes teose sihtrühma. @et
toolkit label: ümberkujundus sihtrühma alusel @et
toolkit definition: Teos, mis on loodud, muutes teose sihtrühma. @et
label: hat Transformation hinsichtlich der Zielgruppe @de
definition: Setzt ein Werk in Beziehung zu einem Werk, das aufgrund einer Änderung der Zielgruppe eines Werks erstellt wird. @de
toolkit label: Transformation hinsichtlich der Zielgruppe @de
toolkit definition: Ein Werk, das aufgrund einer Änderung der Zielgruppe eines Werks erstellt wird. @de
label: közönség miatti átalakítása a következő: @hu
definition: Hozzákapcsol egy művet egy műhöz, amely egy mű közönségének megváltozása következtében jött létre. @hu
toolkit label: közönség miatti átalakítása: @hu
toolkit definition: Egy mű, amely egy mű közönségének megváltozása következtében jött létre. @hu
label: ha come traformazione nei destinatari @it
definition: Correla un'opera a un'opera creata cambiando i destinatari di un'opera. @it
toolkit label: trasformazione nei destinatari @it
toolkit definition: Opera creata cambiando i destinatari di un'opera. @it
label: a pour transformation par changement de public @fr
definition: Met une œuvre en relation avec une œuvre qui est créée en modifiant le public d’une œuvre. @fr
toolkit label: transformation par changement de public @fr
toolkit definition: Œuvre qui est créée en modifiant le public d’une œuvre. @fr
label: pārveidojums, mainot mērķauditoriju @lv
definition: Sasaista darbu ar darbu, kas radīts, mainot darba auditoriju. @lv
toolkit label: pārveidojums, mainot mērķauditoriju @lv
toolkit definition: Darbs, kas radīts, mainot darba auditoriju. @lv
label: 有按受众的转换 @zh-hans
definition: 将一种作品与通过改变一种作品的受众而被创建的一种作品关联起来。 @zh-hans
toolkit label: 按受众的转换 @zh-hans
toolkit definition: 通过改变一种作品的受众而被创建的一种作品 @zh-hans
has subproperty: has carrier version
has subproperty: has language version
has subproperty: has regional version
has subproperty: P10383
label: hedef kitleye göre dönüşüm ile ilişkilidir @tr
definition: Bir eseri, bir eserin hedef kitlesi değiştirilerek oluşturulan bir eserle ilişkilendirir. @tr
toolkit label: hedef kitleye göre dönüşüm @tr
toolkit definition: Bir eserin hedef kitlesi değiştirilerek oluşturulan bir eser. @tr

is transformation by audience of
status: Published
lexical alias: transformationByAudienceOf.en
definition: Relates a work to a work that has an audience that is changed to create a work.
toolkit label: transformation by audience of
toolkit definition: A work that has an audience that is changed to create a work.
type: Property
domain: C10001
sub property of: is transformation of
has element type: 2
label: muunnos yleisössä teoksesta @fi
definition: Liittää teoksen teokseen, jolla on yleisö, jota on muutettu teoksen luomiseksi. @fi
toolkit label: muunnos yleisössä teoksesta @fi
toolkit definition: Teos, jolla on yleisö, jota on muutettu teoksen luomiseksi. @fi
label: er transformasjon ved målgruppe for @no
definition: Relaterer et verk til et verk som har en målgruppe som er endret for å skape et verk. @no
toolkit label: transformasjon ved målgruppe for @no
toolkit definition: Et verk som har en målgruppe som er endret for å skape et verk. @no
label: is transformatie door doelgroep van @nl
definition: Relateert een werk aan een werk dat een doelgroep heeft dat gewijzigd wordt om een werk te creëren. @nl
toolkit label: transformatie door doelgroep van @nl
toolkit definition: Een werk dat een doelgroep heeft dat gewijzigd wordt om een werk te creëren. @nl
label: هو تحول وفق جمهور لـ @ar
definition: يربط عمل بعمل له جمهور يتم تغييره لإنشاء عمل. @ar
toolkit label: تحول وفق جمهور لـ @ar
toolkit definition: عمل له جمهور يتم تغييره لإنشاء عمل. @ar
label: és transformació de destinataris de @ca
definition: Relaciona una obra amb una obra que té uns destinataris que es canvien per crear una obra. @ca
toolkit label: transformació de destinataris de @ca
toolkit definition: Obra que té uns destinataris que es canvien per crear una obra. @ca
label: er transformation ved målgruppe af @da
definition: Relaterer et værk til et værk, som har en målgruppe, som ændres for at skabe et værk. @da
toolkit label: transformation ved målgruppe af @da
toolkit definition: Værk til et værk, som har en målgruppe, som ændres for at skabe et værk. @da
label: ümberkujundus sihtrühma alusel teosest @et
definition: Seostab teose teosega, mille sihtrühma on teose loomiseks muudetud. @et
toolkit label: ümberkujundus sihtrühma alusel teosest @et
toolkit definition: Teos, mille sihtrühma on teose loomiseks muudetud. @et
label: ist Transformation hinsichtlich der Zielgruppe von @de
definition: Setzt ein Werk in Beziehung zu einem Werk, dessen Zielgruppe geändert wird, um ein Werk zu erstellen. @de
toolkit label: Transformation hinsichtlich der Zielgruppe von @de
toolkit definition: Ein Werk, dessen Zielgruppe geändert wird, um ein Werk zu erstellen. @de
label: a közönség miatti átalakítása a következőnek: @hu
definition: Hozzákapcsol egy művet egy műhöz, amelynek a közönsége megváltozott egy mű létrejövetele érdekében. @hu
toolkit label: közönség miatti átalakítása: @hu
toolkit definition: Egy mű, amelynek a közönsége megváltozott egy mű létrejövetele érdekében. @hu
label: è trasformazione nei destinatari di @it
definition: Correla un'opera a un'opera i cui destinatari sono cambiati per creare un'opera. @it
toolkit label: trasformazione nei destinatari di @it
toolkit definition: Opera i cui destinatari sono cambiati per creare un'opera. @it
label: est une transformation par changement de public de @fr
definition: Met une œuvre en relation avec une œuvre dont le public cible est modifié pour créer une œuvre. @fr
toolkit label: transformation par changement de public de @fr
toolkit definition: Œuvre dont le public cible est modifié pour créer une œuvre. @fr
label: ir pārveidojums, mainot mērķauditoriju, no @lv
definition: Sasaista darbu ar darbu, kam auditorija tikusi mainīta, lai radītu darbu. @lv
toolkit label: pārveidojums, mainot mērķauditoriju, no @lv
toolkit definition: Darbs, kam auditorija tikusi mainīta, lai radītu darbu. @lv
label: 是……的按受众的转换 @zh-hans
definition: 将一种作品与有受众并被改变以创建一种作品的一种作品关联起来。 @zh-hans
toolkit label: ……的按受众的转换 @zh-hans
toolkit definition: 有受众并被改变以创建一种作品的一种作品 @zh-hans
has subproperty: is carrier version of
has subproperty: is language version of
has subproperty: is regional version of
has subproperty: P10384
label: izleyicisinin değişimidir @tr
definition: Bir eseri, bir eser oluşturmak için değiştirilen bir kitleye sahip bir eser ile ilişkilendirir. @tr
toolkit label: hedef kitleye göre dönüşüm @tr
toolkit definition: Bir eser ortaya çıkarmak için değiştirilen bir hedef kitleye sahip bir eser. @tr

has transformation by extension plan
status: Published
lexical alias: transformationByExtensionPlan.en
definition: Relates a work to a work that is created by changing the extension plan of a work.
toolkit label: transformation by extension plan
toolkit definition: A work that is created by changing the extension plan of a work.
type: Property
domain: C10001
sub property of: has transformation by policy
has element type: 2
label: muunnos laajennussuunnitelmassa @fi
definition: Liittää teoksen teokseen, joka on luotu muuttamalla teoksen laajennussuunnitelmaa. @fi
toolkit label: muunnos laajennussuunnitelmassa @fi
toolkit definition: Teos, joka on luotu muuttamalla teoksen laajennussuunnitelmaa. @fi
label: har transformasjon ved utvidelsesplan @no
definition: Relaterer et verk til et verk som er skapt ved endring av utvidelsesplanen for et verk. @no
toolkit label: transformasjon ved utvidelsesplan @no
toolkit definition: Et verk som er skapt ved endring av utvidelsesplanen for et verk. @no
label: heeft transformatie door extensieplan @nl
definition: Relateert een werk aan een werk dat gecreëerd is door het extensieplan van een werk te veranderen. @nl
toolkit label: transformatie door extensieplan @nl
toolkit definition: Een werk dat gecreëerd is door het extensieplan van een werk te veranderen. @nl
label: له تحول وفق خطة توسع @ar
definition: يربط عمل بعمل يتم إنشاؤه عن طريق تغيير خطة توسع لعمل. @ar
toolkit label: تحول وفق خطة توسع @ar
toolkit definition: عمل يتم إنشاؤه عن طريق تغيير خطة توسع لعمل. @ar
label: té com a transformació d’un pla d’extensió @ca
definition: Relaciona una obra amb una obra que es crea canviant el pla d’extensió d’una obra. @ca
toolkit label: transformació d’un pla d’extensió @ca
toolkit definition: Obra que es crea canviant el pla d’extensió d’una obra. @ca
label: har transformation ved udvidelsesplan @da
definition: Relaterer et værk til et værk, som er skabt ved at ændre udvidelsesplanen for et værk. @da
toolkit label: transformation ved udvidelsesplan @da
toolkit definition: Værk, som er skabt ved at ændre udvidelsesplanen for et værk. @da
label: ümberkujundus jätkamiskavas @et
definition: Seostab teose teosega, mis on loodud, muutes teose jätkamiskava. @et
toolkit label: ümberkujundus jätkamiskavas @et
toolkit definition: Teos, mis on loodud, muutes teose jätkamiskava. @et
label: hat Transformation hinsichtlich des Erweiterungsplans @de
definition: Setzt ein Werk in Beziehung zu einem Werk, das aufgrund einer Änderung des Erweiterungsplans eines Werks erstellt wird. @de
toolkit label: Transformation hinsichtlich des Erweiterungsplans @de
toolkit definition: Ein Werk, das aufgrund einer Änderung des Erweiterungsplans eines Werks erstellt wird. @de
label: közlési terv változása miatti átalakítása a következő: @hu
definition: Hozzákapcsol egy művet egy műhöz, amely egy mű közlési tervének megváltozása következtében jött létre. @hu
toolkit label: közlési terv változása miatti átalakítása: @hu
toolkit definition: Egy mű, amely egy mű közlési tervének megváltozása következtében jött létre. @hu
label: ha come trasformazione nel piano di estensione @it
definition: Correla un'opera a un'opera creata modificando il piano di estensione di un'opera. @it
toolkit label: trasformazione nel piano di estensione @it
toolkit definition: Opera creata modificando il piano di estensione di un'opera. @it
label: a pour transformation par changement de plan d’extension @fr
definition: Met une œuvre en relation avec une œuvre qui est créée en modifiant le plan d’extension d’une œuvre. @fr
toolkit label: transformation par changement de plan d’extension @fr
toolkit definition: Œuvre qui est créée en modifiant le plan d’extension d’une œuvre. @fr
label: pārveidojums, mainot paplašināšanas plānu @lv
definition: Sasaista darbu ar darbu, kas radīts, mainot paplašināšanas plānu. @lv
toolkit label: pārveidojums, mainot paplašināšanas plānu @lv
toolkit definition: Darbs, kas radīts, mainot paplašināšanas plānu. @lv
label: 有通过扩充计划的转换 @zh-hans
definition: 将一种作品与通过改变一种作品的扩充计划而创建的一种作品关联起来。 @zh-hans
toolkit label: 通过扩充计划的转换 @zh-hans
toolkit definition: 通过改变一种作品的扩充计划而创建的一种作品 @zh-hans
has subproperty: has sequential version
has subproperty: has serialized version
has subproperty: has static version
has subproperty: P10377
label: genişletme planına göre dönüşüm ile ilişkilidir @tr
definition: Bir eseri, bir eserin genişletme planı değiştirilerek oluşturulan eserle ilişkilendirir. @tr
toolkit label: genişletme planına göre dönüşüm @tr
toolkit definition: Bir eserin genişletme planının değiştirilmesiyle oluşturulan bir eser. @tr

is transformation by extension plan of
status: Published
lexical alias: transformationByExtensionPlanOf.en
definition: Relates a work to a work that has an extension plan that is changed to create a work.
toolkit label: transformation by extension plan of
toolkit definition: A work that has an extension plan that is changed to create a work.
type: Property
domain: C10001
sub property of: is transformation by policy of
has element type: 2
label: muunnos laajennussuunnitelmassa teoksesta @fi
definition: Liittää teoksen teokseen, jolla on laajennussuunnitelma, jota on muutettu teoksen luomiseksi. @fi
toolkit label: muunnos laajennussuunnitelmassa teoksesta @fi
toolkit definition: Teos, jolla on laajennussuunnitelma, jota on muutettu teoksen luomiseksi. @fi
label: er transformasjon ved utvidelsesplan for @no
definition: Relaterer et verk til et verk som har en utvidelsesplan som er endret for å skape et verk. @no
toolkit label: transformasjon ved utvidelsesplan for @no
toolkit definition: Et verk som har en utvidelsesplan som er endret for å skape et verk. @no
label: is transformatie door extensieplan van @nl
definition: Relateert een werk aan een werk dat een extensieplan heeft dat veranderd is om een werk te creëren. @nl
toolkit label: transformatie door extensieplan van @nl
toolkit definition: Een werk dat een extensieplan heeft dat veranderd is om een werk te creëren. @nl
label: هو تحول وفق خطة توسع لـ @ar
definition: يربط عمل بعمل يحتوي على خطة توسع يتم تغييرها لإنشاء عمل. @ar
toolkit label: تحول وفق خطة توسع لـ @ar
toolkit definition: عمل يحتوي على خطة توسع يتم تغييرها لإنشاء عمل. @ar
label: és transformació d’un pla d’extensió de @ca
definition: Relaciona una obra amb una obra que té un pla d’extensió que es canvia per crear una obra. @ca
toolkit label: transformació d’un pla d’extensió de @ca
toolkit definition: Obra que té un pla d’extensió que es canvia per crear una obra. @ca
label: er transformation ved udvidelsesplan af @da
definition: Relaterer et værk til et værk, som har en udvidelsesplan, som ændres for at skabe et værk. @da
toolkit label: transformation ved udvidelsesplan af @da
toolkit definition: Værk, som har en udvidelsesplan, som ændres for at skabe et værk. @da
label: ümberkujundus jätkamiskavas teosest @et
definition: Seostab teose teosega, mille jätkamiskava on teose loomiseks muudetud. @et
toolkit label: ümberkujundus jätkamiskavas teosest @et
toolkit definition: Teos, mille jätkamiskava on teose loomiseks muudetud. @et
label: ist Transformation hinsichtlich des Erweiterungsplans von @de
definition: Setzt ein Werk in Beziehung zu einem Werk, dessen Erweiterungsplan geändert wird, um ein Werk zu erstellen. @de
toolkit label: Transformation hinsichtlich des Erweiterungsplans von @de
toolkit definition: Ein Werk, dessen Erweiterungsplan geändert wird, um ein Werk zu erstellen. @de
label: a közlési terv változása miatti átalakítása a következőnek: @hu
definition: Hozzákapcsol egy művet egy műhöz, amelynek a közlési terve megváltozott egy mű létrejövetele érdekében. @hu
toolkit label: közlési terv változása miatti átalakítása: @hu
toolkit definition: Egy mű, amelynek a közlési terve megváltozott egy mű létrejövetele érdekében. @hu
label: è trasformazione del piano di estensione di @it
definition: Correla un'opera a un'opera che ha un piano di estensione che viene modificato per creare un'opera. @it
toolkit label: trasformazione del piano di estensione di @it
toolkit definition: Opera che ha un piano di estensione che viene modificato per creare un'opera. @it
label: est une transformation par changement de plan d’extension de @fr
definition: Met une œuvre en relation avec une œuvre dont le plan d’extension est modifié pour créer une œuvre. @fr
toolkit label: transformation par changement de plan d’extension de @fr
toolkit definition: Œuvre dont le plan d’extension est modifié pour créer une œuvre. @fr
label: ir pārveidojums, mainot paplašināšanas plānu, no @lv
definition: Sasaista darbu ar darbu, kam paplašināšanas plāns mainīts, lai radītu darbu. @lv
toolkit label: pārveidojums, mainot paplašināšanas plānu, no @lv
toolkit definition: Darbs, kam paplašināšanas plāns mainīts, lai radītu darbu. @lv
label: 是通过……的扩充计划的转换 @zh-hans
definition: 将一种作品与有一种扩充计划并被改变以创建一种作品的一种作品关联起来。 @zh-hans
toolkit label: 通过……的扩充计划的转换 @zh-hans
toolkit definition: 有一种扩充计划并被改变以创建一种作品的一种作品 @zh-hans
has subproperty: is sequential version of
has subproperty: is serialized version of
has subproperty: is static version of
has subproperty: P10378
label: genişletme planının değişimidir @tr
definition: Bir eseri, bir eser oluşturmak için değiştirilen bir genişletme planına sahip bir eser ile ilişkilendirir. @tr
toolkit label: genişletme planına göre dönüşüm @tr
toolkit definition: Bir eser oluşturmak için değiştirilen bir uzatma planına sahip bir eser. @tr

has transformation by genre
status: Published
type: Property
lexical alias: transformationByGenre.en
definition: Relates a work to a work that is created by changing the genre or literary form of a work.
domain: C10001
sub property of: has transformation
toolkit label: transformation by genre
toolkit definition: A work that is created by changing the genre or literary form of a work.
has element type: 2
label: muunnos genressä @fi
definition: Liittää teoksen teokseen, joka on luotu muuttamalla teoksen genreä tai kirjallista muotoa. @fi
toolkit label: muunnos genressä @fi
toolkit definition: Teos, joka on luotu muuttamalla teoksen genreä tai kirjallista muotoa. @fi
label: har transformasjon av sjanger @no
definition: Relaterer et verk til et verk som er skapt ved endring av sjangeren eller den litterære formen for et verk. @no
toolkit label: transformasjon av sjanger @no
toolkit definition: Et verk som er skapt ved endring av sjangeren eller den litterære formen for et verk. @no
label: heeft transformatie door genre @nl
definition: Relateert een werk aan een werk dat gecreëerd is door het veranderen van het genre of de literaire vorm van een werk. @nl
toolkit label: transformatie door genre @nl
toolkit definition: Een werk dat gecreëerd is door het veranderen van het genre of de literaire vorm van een werk. @nl
label: له تحول وفق النوع الأدبي @ar
definition: يربط عمل بعمل تم إنشاؤه عن طريق تغيير النوع أو الشكل الأدبي لعمل. @ar
toolkit label: تحول وفق النوع الأدبي @ar
toolkit definition: عمل تم إنشاؤه عن طريق تغيير النوع أو الشكل الأدبي لعمل. @ar
label: té com a transformació de gènere @ca
definition: Relaciona una obra amb una obra que es crea canviant el gènere o la forma literària d’una obra. @ca
toolkit label: transformació de gènere @ca
toolkit definition: Obra que es crea canviant el gènere o la forma literària d’una obra. @ca
label: har transformation ved genre @da
definition: Relaterer et værk til et værk, som er skabt ved at ændre et værks genre eller litterære form. @da
toolkit label: transformation ved genre @da
toolkit definition: Værk, som er skabt ved at ændre et værks genre eller litterære form. @da
label: žanriline ümberkujundus @et
definition: Seostab teose teosega, mis on loodud, muutes teose žanri või kirjanduslikku vormi. @et
toolkit label: žanriline ümberkujundus @et
toolkit definition: Teos, mis on loodud, muutes teose žanri või kirjanduslikku vormi. @et
label: hat Transformation hinsichtlich des Genres @de
definition: Setzt ein Werk in Beziehung zu einem Werk, das aufgrund einer Änderung des Genres oder der literarischen Form eines Werks erstellt wird. @de
toolkit label: Transformation hinsichtlich des Genres @de
toolkit definition: Ein Werk, das aufgrund einer Änderung des Genres oder der literarischen Form eines Werks erstellt wird. @de
label: műfaj szerinti átalakítása a következő: @hu
definition: Hozzákapcsol egy művet egy műhöz, amely egy mű műfajának vagy műnemének a megváltoztatásával jött létre. @hu
toolkit label: műfaj szerinti átalakítása: @hu
toolkit definition: Egy mű, amely egy mű műfajának vagy műnemének a megváltoztatásával jött létre. @hu
label: ha come trasformazione di genere @it
definition: Correla un’opera a un’opera che è creata cambiando il genere o la forma letteraria di un’opera. @it
toolkit label: trasformazione di genere @it
toolkit definition: Opera che è creata cambiando il genere o la forma letteraria di un’opera. @it
label: a pour transformation par changement de genre @fr
definition: Met une œuvre en relation avec une œuvre qui est créée en modifiant le genre ou la forme littéraire d’une œuvre. @fr
toolkit label: transformation par changement de genre @fr
toolkit definition: Œuvre qui est créée en modifiant le genre ou la forme littéraire d’une œuvre. @fr
label: pārveidojums, mainot žanru @lv
definition: Sasaista darbu ar darbu, kas radīts, mainot žanru vai darba literāro formu. @lv
toolkit label: pārveidojums, mainot žanru @lv
toolkit definition: Darbs, kas radīts, mainot žanru vai darba literāro formu. @lv
label: 有按体裁的转换 @zh-hans
definition: 将一种作品与通过改变一种作品的体裁或文学形式而被创建的一种作品关联起来。 @zh-hans
toolkit label: 按体裁的转换 @zh-hans
toolkit definition: 通过改变一种作品的体裁或文学形式而被创建的一种作品 @zh-hans
has subproperty: has derivative work
has subproperty: P10342
label: türe göre dönüşüm ile ilişkilidir @tr
definition: Bir eseri, bir eserin türünü veya edebi biçimini değiştirerek oluşturulan bir eserle ilişkilendirir. @tr
toolkit label: türe göre dönüşüm @tr
toolkit definition: Bir eserin türünün veya edebi biçiminin değiştirilmesiyle oluşturulan bir eser. @tr

is transformation by genre of
status: Published
type: Property
lexical alias: transformationByGenreOf.en
domain: C10001
sub property of: is transformation of
toolkit label: transformation by genre of
has element type: 2
definition: Relates a work to a work that has a genre that is changed to create a work.
toolkit definition: A work that has a genre that is changed to create a work.
label: muunnos genressä teoksesta @fi
definition: Liittää teoksen teokseen, jolla on genre, jota on muutettu teoksen luomiseksi. @fi
toolkit label: muunnos genressä teoksesta @fi
toolkit definition: Teos, jolla on genre, jota on muutettu teoksen luomiseksi. @fi
label: er transformasjon av sjanger fra @no
definition: Relaterer et verk til et verk som har en sjanger som er endret for å skape et verk. @no
toolkit label: transformasjon av sjanger fra @no
toolkit definition: Et verk som har en sjanger som er endret for å skape et verk. @no
label: is transformatie door genre van @nl
definition: Relateert een werk aan een werk dat een genre heeft dat veranderd is om een werk te creëren. @nl
toolkit label: transformatie door genre van @nl
toolkit definition: Een werk dat een genre heeft dat veranderd is om een werk te creëren. @nl
label: هو تحول وفق النوع الأدبي لـ @ar
definition: يربط عمل بعمل له نوع أدبي يتم تغييره لإنشاء عمل. @ar
toolkit label: تحول وفق النوع الأدبي لـ @ar
toolkit definition: عمل له نوع أدبي يتم تغييره لإنشاء عمل. @ar
label: és transformació de gènere de @ca
definition: Relaciona una obra amb una obra que té un gènere que es canvia per crear una obra. @ca
toolkit label: transformació de gènere de @ca
toolkit definition: Obra que té un gènere que es canvia per crear una obra. @ca
label: er transformation ved genre af @da
definition: Relaterer et værk til et værk, som har en genre, som ændres for at skabe et værk. @da
toolkit label: transformation ved genre af @da
toolkit definition: Værk, som har en genre, som ændres for at skabe et værk. @da
label: žanriline ümberkujundus teosest @et
definition: Seostab teose teosega, mille žanri on teose loomiseks muudetud. @et
toolkit label: žanriline ümberkujundus teosest @et
toolkit definition: Teos, mille žanri on teose loomiseks muudetud. @et
label: ist Transformation hinsichtlich des Genres von @de
definition: Setzt ein Werk in Beziehung zu einem Werk, dessen Genre geändert wird, um ein Werk zu erstellen. @de
toolkit label: Transformation hinsichtlich des Genres von @de
toolkit definition: Ein Werk, dessen Genre geändert wird, um ein Werk zu erstellen. @de
label: műfaj szerinti átalakítása a következőnek: @hu
definition: Hozzákapcsol egy művet egy műhöz, amelynek a műfaja megváltozott egy mű létrejövetele érdekében. @hu
toolkit label: műfaj szerinti átalakítása: @hu
toolkit definition: Egy mű, amelynek a műfaja megváltozott egy mű létrejövetele érdekében. @hu
label: è trasformazione di genere di @it
definition: Correla un’opera a un’opera che ha un genere che è cambiato per creare un’opera. @it
toolkit label: trasformazione di genere di @it
toolkit definition: Opera che ha un genere che è cambiato per creare un’opera. @it
label: est une transformation par changement de genre de @fr
definition: Met une œuvre en relation avec une œuvre dont le genre est modifié pour créer une œuvre. @fr
toolkit label: transformation par changement de genre de @fr
toolkit definition: Œuvre dont le genre est modifié pour créer une œuvre. @fr
label: ir pārveidojums, mainot žanru, no @lv
toolkit label: pārveidojums, mainot žanru, no @lv
definition: Sasaista darbu ar darbu, kam žanrs mainīts, lai radītu darbu. @lv
toolkit definition: Darbs, kam žanrs mainīts, lai radītu darbu. @lv
label: 是……的按体裁的转换 @zh-hans
toolkit label: ……的按体裁的转换 @zh-hans
definition: 将一种作品与有体裁并被改变以创建一种作品的一种作品关联起来。 @zh-hans
toolkit definition: 有体裁并被改变以创建一种作品的一种作品 @zh-hans
has subproperty: has source work
has subproperty: P10343
label: türüne göre değişimidir @tr
toolkit label: türe göre dönüşüm @tr
definition: Bir eseri, bir eser oluşturmak için değiştirilen bir türe sahip bir eserle ilişkilendirir. @tr
toolkit definition: Bir eserin, türü değiştirilerek oluşturulduğu bir eser. @tr

has transformation by policy
status: Published
type: Property
lexical alias: transformationByPolicy.en
definition: Relates a work to a work that is created by changing the scope or editorial policy of a work.
domain: C10001
sub property of: has transformation
toolkit label: transformation by policy
toolkit definition: A work that is created by changing the scope or editorial policy of a work.
has element type: 2
label: muunnos linjassa @fi
definition: Liittää teoksen teokseen, joka on luotu muuttamalla teoksen toiminta-alaa tai toimituslinjaa. @fi
toolkit label: muunnos linjassa @fi
toolkit definition: Teos, joka on luotu muuttamalla teoksen toiminta-alaa tai toimituslinjaa. @fi
label: har transformasjon av retningslinjer @no
definition: Relaterer et verk til et verk som er skapt ved endring av omfanget eller de redaksjonelle retningslinjene til et verk. @no
toolkit label: transformasjon av retningslinjer @no
toolkit definition: Et verk som er skapt ved endring av omfanget eller de redaksjonelle retningslinjene til et verk. @no
label: heeft transformatie door beleid @nl
definition: Relateert een werk aan een werk dat gecreëerd is door de scope of redactionele beleid van een werk te veranderen. @nl
toolkit label: transformatie door beleid @nl
toolkit definition: Een werk dat gecreëerd is door de scope of redactionele beleid van een werk te veranderen. @nl
label: له تحول وفق سياسة @ar
definition: يربط عمل بعمل تم إنشاؤه عن طريق تغيير المجال أو السياسة التحريرية لعمل. @ar
toolkit label: تحول وفق سياسة @ar
toolkit definition: عمل تم إنشاؤه عن طريق تغيير المجال أو السياسة التحريرية لعمل. @ar
label: té com a transformació de política @ca
definition: Relaciona una obra amb una obra que es crea canviant l’abast o la política editorial d’una obra. @ca
toolkit label: transformació de política @ca
toolkit definition: Obra que es crea canviant l’abast o la política editorial d’una obra. @ca
label: har transformation ved retningslinje @da
definition: Relaterer et værk til et værk, som er skabt ved at ændre et værks rækkevidde eller redaktionelle retningslinje. @da
toolkit label: transformation ved retningslinje @da
toolkit definition: Værk, som er skabt ved at ændre et værks rækkevidde eller redaktionelle retningslinje. @da
label: sisuline ümberkujundus @et
definition: Seostab teose teosega, mis on loodud, muutes teose käsitlusala või toimetamispõhimõtteid. @et
toolkit label: sisuline ümberkujundus @et
toolkit definition: Teos, mis on loodud, muutes teose käsitlusala või toimetamispõhimõtteid. @et
label: hat Transformation hinsichtlich der Vorgehensweise @de
definition: Setzt ein Werk in Beziehung zu einem Werk, das aufgrund einer Änderung des Geltungsbereichs oder der redaktionellen Vorgehensweise eines Werks erstellt wird. @de
toolkit label: Transformation hinsichtlich der Vorgehensweise @de
toolkit definition: Ein Werk, das aufgrund einer Änderung des Geltungsbereichs oder der redaktionellen Vorgehensweise eines Werks erstellt wird. @de
label: szerkesztési elvek szerinti átalakítása a következő: @hu
definition: Hozzákapcsol egy művet egy műhöz, amely egy mű alkalmazási területének vagy szerkesztési elveinek a megváltoztatásával jött létre. @hu
toolkit label: szerkesztési elvek szerinti átalakítása: @hu
toolkit definition: Egy mű, amely egy mű alkalmazási területének vagy szerkesztési elveinek a megváltoztatásával jött létre. @hu
label: ha come trasformazione di politica @it
definition: Correla un’opera a un’opera che è creata cambiando il l'oggetto o la politica editoriale di un’opera. @it
toolkit label: trasformazione di politica @it
toolkit definition: Opera che è creata cambiando l'oggetto o la politica editoriale di un’opera. @it
label: a pour transformation par changement de politique @fr
definition: Met une œuvre en relation avec une œuvre qui est créée en modifiant la portée ou la politique éditoriale d’une œuvre. @fr
toolkit label: transformation par changement de politique @fr
toolkit definition: Œuvre qui est créée en modifiant la portée ou la politique éditoriale d’une œuvre. @fr
label: pārveidojums, mainot izdošanas politiku @lv
definition: Sasaista darbu ar darbu, kas radīts, mainot darbības jomu vai izdošanas politiku. @lv
toolkit label: pārveidojums, mainot izdošanas politiku @lv
toolkit definition: Darbs, kas radīts, mainot darbības jomu vai izdošanas politiku. @lv
label: 有按政策的转换 @zh-hans
definition: 将一种作品与通过改变一种作品的范围或编辑政策而被创建的一种作品关联起来。 @zh-hans
toolkit label: 按政策的转换 @zh-hans
toolkit definition: 通过改变一种作品的范围或编辑政策而被创建的一种作品 @zh-hans
has subproperty: is succeeded by work
has subproperty: has transformation by extension plan
has subproperty: P10344
label: ilkeye göre dönüşüm ile ilişkilidir @tr
definition: Bir eseri, bir eserin kapsamını veya yayın politikasını değiştirerek oluşturulan bir eserle ilişkilendirir. @tr
toolkit label: ilkeye göre dönüşüm @tr
toolkit definition: Bir eserin kapsamı veya yayın politikasının değiştirilmesiyle oluşturulan bir eser. @tr

is transformation by policy of
status: Published
type: Property
lexical alias: transformationByPolicyOf.en
domain: C10001
sub property of: is transformation of
toolkit label: transformation by policy of
has element type: 2
definition: Relates a work to a work that has a scope or editorial policy that is changed to create a work.
toolkit definition: A work that has a scope or editorial policy that is changed to create a work.
label: muunnos linjassa teoksesta @fi
definition: Liittää teoksen teokseen, jolla on toiminta-ala tai toimituslinja, jota on muutettu teoksen luomiseksi. @fi
toolkit label: muunnos linjassa teoksesta @fi
toolkit definition: Teos, jolla on toiminta-ala tai toimituslinja, jota on muutettu teoksen luomiseksi. @fi
label: er transformasjon av retningslinjer fra @no
definition: Relaterer et verk til et verk som har et omfang eller redaksjonelle retningslinjer som er endret for å skape et verk. @no
toolkit label: transformasjon av retningslinjer fra @no
toolkit definition: Et verk som har et omfang eller redaksjonelle retningslinjer som er endret for å skape et verk. @no
label: is transformatie door beleid van @nl
definition: Relateert een werk aan een werk dat een scope of redactioneel beleid heeft die veranderd is om een werk te creëren. @nl
toolkit label: transformatie door beleid van @nl
toolkit definition: Een werk dat een scope of redactioneel beleid heeft die veranderd is om een werk te creëren. @nl
label: هو تحول وفق سياسة لـ @ar
definition: يربط عمل بعمل له مجال أو سياسة تحريرية يتم تغييرها لإنشاء عمل. @ar
toolkit label: تحول وفق سياسة لـ @ar
toolkit definition: عمل له مجال أو سياسة تحريرية يتم تغييرها لإنشاء عمل. @ar
label: és transformació de política de @ca
definition: Relaciona una obra amb una obra que té un abast o una política editorial que es canvia per crear una obra. @ca
toolkit label: transformació de política de @ca
toolkit definition: Obra que té un abast o una política editorial que es canvia per crear una obra. @ca
label: er transformation ved retningslinje af @da
definition: Relaterer et værk til et værk, som har en rækkevidde eller redaktionel retningslinje, som ændres for at skabe et værk. @da
toolkit label: transformation ved retningslinje af @da
toolkit definition: Værk, som har en rækkevidde eller redaktionel retningslinje, som ændres for at skabe et værk. @da
label: sisuline ümberkujundus teosest @et
definition: Seostab teose teosega, mille käsitlusala või toimetamispõhimõtteid on teose loomiseks muudetud. @et
toolkit label: sisuline ümberkujundus teosest @et
toolkit definition: Teos, mille käsitlusala või toimetamispõhimõtteid on teose loomiseks muudetud. @et
label: ist Transformation hinsichtlich der Vorgehensweise von @de
definition: Setzt ein Werk in Beziehung zu einem Werk, dessen Geltungsbereich oder redaktionelle Vorgehensweise geändert wird, um ein Werk zu erstellen. @de
toolkit label: Transformation hinsichtlich der Vorgehensweise von @de
toolkit definition: Ein Werk, dessen Geltungsbereich oder redaktionelle Vorgehensweise geändert wird, um ein Werk zu erstellen. @de
label: szerkesztési elvek szerinti átalakítása a következőnek: @hu
definition: Hozzákapcsol egy művet egy műhöz, amelynek a területének vagy szerkesztési elvei megváltoztak egy mű létrejövetele érdekében. @hu
toolkit label: szerkesztési elvek szerinti átalakítása: @hu
toolkit definition: Egy mű, amelynek a területének vagy szerkesztési elvei megváltoztak egy mű létrejövetele érdekében. @hu
label: è trasformazione di politica di @it
definition: Correla un’opera a un’opera che ha un oggetto o politica editoriale che è cambiato per creare un’opera. @it
toolkit label: trasformazione di politica di @it
toolkit definition: Opera che ha un oggetto o politica editoriale che è cambiato per creare un’opera. @it
label: est une transformation par changement de politique de @fr
definition: Met une œuvre en relation avec une œuvre dont la portée ou la politique éditoriale sont modifiées pour créer une œuvre. @fr
toolkit label: transformation par changement de politique de @fr
toolkit definition: Œuvre dont la portée ou la politique éditoriale sont modifiées pour créer une œuvre. @fr
label: ir pārveidojums, mainot izdošanas politiku, no @lv
toolkit label: pārveidojums, mainot izdošanas politiku, no @lv
definition: Sasaista darbu ar darbu, kam izdošanas politika mainīta, lai radītu darbu. @lv
toolkit definition: Darbs, kam izdošanas politika mainīta, lai radītu darbu. @lv
label: 是……的按政策的转换 @zh-hans
toolkit label: ……的按政策的转换 @zh-hans
definition: 将一种作品与有范围或编辑政策并被改变以创建一种作品的一种作品关联起来。 @zh-hans
toolkit definition: 有范围或编辑政策并被改变以创建一种作品的一种作品 @zh-hans
has subproperty: is preceded by work
has subproperty: is transformation by extension plan of
has subproperty: P10345
label: ilkesel değişimdir @tr
toolkit label: ilkeye göre dönüşüm @tr
definition: Bir eseri, bir eser oluşturmak için değiştirilen bir kapsam veya yayın politikasına sahip bir eserle ilişkilendirir. @tr
toolkit definition: Bir eserin, kapsamı veya yayın politikası değiştirilerek oluşturulduğu bir eser. @tr

has transformation by style
status: Published
type: Property
lexical alias: transformationByStyle.en
definition: Relates a work to a work that is created by changing the style of a work.
domain: C10001
sub property of: has transformation
toolkit label: transformation by style
toolkit definition: A work that is created by changing the style of a work.
has element type: 2
label: muunnos tyylissä @fi
definition: Liittää teoksen teokseen, joka on luotu muuttamalla teoksen tyyliä. @fi
toolkit label: muunnos tyylissä @fi
toolkit definition: Teos, joka on luotu muuttamalla teoksen tyyliä. @fi
label: har transformasjon av stil @no
definition: Relaterer et verk til et verk som er skapt ved endring av stilen for et verk. @no
toolkit label: transformasjon av stil @no
toolkit definition: Et verk som er skapt ved endring av stilen for et verk. @no
label: heeft transformatie door stijl @nl
definition: Relateert een werk aan een werk dat gecreëerd is door het veranderen van de stijl van een werk. @nl
toolkit label: transformatie door stijl @nl
toolkit definition: Een werk dat gecreëerd is door het veranderen van de stijl van een werk. @nl
label: له تحول وفق نمط @ar
definition: يربط عمل بعمل تم إنشاؤه عن طريق تغيير نمط عمل. @ar
toolkit label: تحول وفق نمط @ar
toolkit definition: عمل تم إنشاؤه عن طريق تغيير نمط عمل. @ar
label: té com a transformació d’estil @ca
definition: Relaciona una obra amb una obra que es crea canviant l’estil d’una obra. @ca
toolkit label: transformació d’estil @ca
toolkit definition: Obra que es crea canviant l’estil d’una obra. @ca
label: har transformation ved stil @da
definition: Relaterer et værk til et værk, som er skabt ved at ændre et værks stil. @da
toolkit label: transformation ved stil @da
toolkit definition: Værk, som er skabt ved at ændre et værks stil. @da
label: stiililine ümberkujundus @et
definition: Seostab teose teosega, mis on loodud, muutes teose stiili. @et
toolkit label: stiililine ümberkujundus @et
toolkit definition: Teos, mis on loodud, muutes teose stiili. @et
label: hat Transformation hinsichtlich des Stils @de
definition: Setzt ein Werk in Beziehung zu einem Werk, das aufgrund einer Änderung des Stils eines Werks erstellt wird. @de
toolkit label: Transformation hinsichtlich des Stils @de
toolkit definition: Ein Werk, das aufgrund einer Änderung des Stils eines Werks erstellt wird. @de
label: stílus szerinti átalakítása a következő: @hu
definition: Hozzákapcsol egy művet egy műhöz, amely egy mű stílusának megváltozása következtében jött létre. @hu
toolkit label: stílus szerinti átalakítása: @hu
toolkit definition: Egy mű, amely egy mű stílusának megváltozása következtében jött létre. @hu
label: ha come trasformazione di stile @it
definition: Correla un’opera a un’opera che è creata cambiando lo stile di un’opera. @it
toolkit label: trasformazione di stile @it
toolkit definition: Opera che è creata cambiando lo stile di un’opera. @it
label: a pour transformation par changement de style @fr
definition: Met une œuvre en relation avec une œuvre qui est créée en modifiant le style d’une œuvre. @fr
toolkit label: transformation par changement de style @fr
toolkit definition: Œuvre qui est créée en modifiant le style d’une œuvre. @fr
label: pārveidojums, mainot stilu @lv
definition: Sasaista darbu ar darbu, kas radīts, mainot darba stilu. @lv
toolkit label: pārveidojums, mainot stilu @lv
toolkit definition: Darbs, kas radīts, mainot darba stilu. @lv
label: 有按风格的转换 @zh-hans
definition: 将一种作品与通过改变一种作品的风格而被创建的一种作品关联起来。 @zh-hans
toolkit label: 按风格的转换 @zh-hans
toolkit definition: 通过改变一种作品的风格而被创建的一种作品 @zh-hans
has subproperty: is paraphrased as work
has subproperty: is freely translated as work
has subproperty: is remade as work
has subproperty: is imitated as work
has subproperty: P10340
label: biçime göre dönüşüm ile ilişkilidir @tr
definition: Bir eseri, bir eserin biçimi değiştirerek oluşturulan bir eserle ilişkilendirir. @tr
toolkit label: biçime göre dönüşüm @tr
toolkit definition: Bir eserin biçimi değiştirilerek oluşturulan bir eser. @tr

is transformation by style of
status: Published
type: Property
lexical alias: transformationByStyleOf.en
domain: C10001
sub property of: is transformation of
toolkit label: transformation by style of
has element type: 2
definition: Relates a work to a work that has a style that is changed to create a work.
toolkit definition: A work that has a style that is changed to create a work.
label: muunnos tyylissä teoksesta @fi
definition: Liittää teoksen teokseen, jolla on tyyli, jota on muutettu teoksen luomiseksi. @fi
toolkit label: muunnos tyylissä teoksesta @fi
toolkit definition: Teos, jolla on tyyli, jota on muutettu teoksen luomiseksi. @fi
label: er transformasjon av stil fra @no
definition: Relaterer et verk til et verk som har en stil som er endret for å skape et verk. @no
toolkit label: transformasjon av stil fra @no
toolkit definition: Et verk som har en stil som er endret for å skape et verk. @no
label: is transformatie door stijl van @nl
definition: Relateert een werk aan een werk dat een stijl heeft die veranderd is om een werk te creëren. @nl
toolkit label: transformatie door stijl van @nl
toolkit definition: Een werk dat een stijl heeft die veranderd is om een werk te creëren. @nl
label: هو تحول وفق نمط @ar
definition: يربط عمل بعمل له نمط يتم تغييره لإنشاء عمل. @ar
toolkit label: تحول وفق نمط @ar
toolkit definition: عمل له نمط يتم تغييره لإنشاء عمل. @ar
label: és transformació d’estil de @ca
definition: Relaciona una obra amb una obra que té un estil que es canvia per crear una obra. @ca
toolkit label: transformació d’estil de @ca
toolkit definition: Obra que té un estil que es canvia per crear una obra. @ca
label: er transformation ved stil af @da
definition: Relaterer et værk til et værk, som har en stil, som ændres for at skabe et værk. @da
toolkit label: transformation ved stil af @da
toolkit definition: Værk, som har en stil, som ændres for at skabe et værk. @da
label: stiililine ümberkujundus teosest @et
definition: Seostab teose teosega, mille stiili on teose loomiseks muudetud. @et
toolkit label: stiililine ümberkujundus teosest @et
toolkit definition: Teos, mille stiili on teose loomiseks muudetud. @et
label: ist Transformation hinsichtlich des Stil von @de
definition: Setzt ein Werk in Beziehung zu einem Werk, dessen Stil geändert wird, um ein Werk zu erstellen. @de
toolkit label: Transformation hinsichtlich des Stil von @de
toolkit definition: Ein Werk, dessen Stil geändert wird, um ein Werk zu erstellen. @de
label: stílus szerinti átalakítása a következőnek: @hu
definition: Hozzákapcsol egy művet egy műhöz, amelynek a stílusa megváltozott egy mű létrejövetele érdekében. @hu
toolkit label: stílus szerinti átalakítása: @hu
toolkit definition: Egy mű, amelynek a stílusa megváltozott egy mű létrejövetele érdekében. @hu
label: è trasformazione di stile di @it
definition: Correla un’opera a un’opera che ha uno stile che è cambiato per creare un’opera. @it
toolkit label: trasformazione di stile di @it
toolkit definition: Opera che ha uno stile che è cambiato per creare un’opera. @it
label: est une transformation par changement de style de @fr
definition: Met une œuvre en relation avec une œuvre dont le style est modifié pour créer une œuvre. @fr
toolkit label: transformation par changement de style de @fr
toolkit definition: Œuvre dont le style est modifié pour créer une œuvre. @fr
label: ir pārveidojums, mainot stilu, no @lv
toolkit label: pārveidojums, mainot stilu, no @lv
definition: Sasaista darbu ar darbu, kam stils mainīts, lai radītu darbu. @lv
toolkit definition: Darbs, kam stils mainīts, lai radītu darbu. @lv
label: 是……的按风格的转换 @zh-hans
toolkit label: ……的按风格的转换 @zh-hans
definition: 将一种作品与有风格并被改变以创建一种作品的一种作品关联起来。 @zh-hans
toolkit definition: 有风格并被改变以创建一种作品的一种作品 @zh-hans
has subproperty: is paraphrase of work
has subproperty: is free translation of work
has subproperty: is remake of work
has subproperty: is imitation of work
has subproperty: P10341
label: biçime göre değişmesidir @tr
toolkit label: biçime göre dönüşüm @tr
definition: Bir eseri, bir eser oluşturmak için değiştirilen bir biçime sahip bir eserle ilişkilendirir. @tr
toolkit definition: Bir eserin, biçimi değiştirilerek oluşturulduğu bir eser. @tr

is transformation of
status: Published
type: Property
lexical alias: transformationOf.en
domain: C10001
toolkit label: transformation of
sub property of: has related work of work
has element type: 2
definition: Relates a work to a work that has a scope or editorial policy, genre or literary form, target audience, or style that is changed to create a work.
toolkit definition: A work that has a scope or editorial policy, genre or literary form, target audience, or style that is changed to create a work.
label: muunnos teoksesta @fi
definition: Liittää teoksen teokseen, jolla on toiminta-ala tai toimituslinja, genre tai kirjallinen muoto, kohdeyleisö tai tyyli, jota on muutettu teoksen luomiseksi. @fi
toolkit label: muunnos teoksesta @fi
toolkit definition: Teos, jolla on toiminta-ala tai toimituslinja, genre tai kirjallinen muoto, kohdeyleisö tai tyyli, jota on muutettu teoksen luomiseksi. @fi
label: er transformasjon av @no
definition: Relaterer et verk til et verk som har fått endret omfang eller redaksjonelle retningslinjer, sjanger eller litterær form, målgruppe eller stil for å skape et verk. @no
toolkit label: transformasjon av @no
toolkit definition: Et verk som har fått endret omfang eller redaksjonelle retningslinjer, sjanger eller litterær form, målgruppe eller stil for å skape et verk. @no
label: is transformatie van @nl
definition: Relateert een werk aan een werk dat een scope of redactioneel beleid, genre of literaire vorm, doelgroep of stijl heeft die veranderd is om een werk te creëren. @nl
toolkit label: transformatie van @nl
toolkit definition: Een werk dat een scope of redactioneel beleid, genre of literaire vorm, doelgroep of stijl heeft die veranderd is om een werk te creëren. @nl
label: هو تحول لـ @ar
definition: يربط عمل بعمل يتم تغيير مجاله أو سياسته التحريرية، أو نوعه أو شكله الأدبي، أو جمهوره المستهدف، أو أسلوبه لإنشاء عمل. @ar
toolkit label: تحول لـ @ar
toolkit definition: عمل يتم تغيير مجاله أو سياسته التحريرية، أو نوعه أو شكله الأدبي، أو جمهوره المستهدف، أو أسلوبه لإنشاء عمل. @ar
label: és transformació de @ca
definition: Relaciona una obra amb una obra que té un abast o una política editorial, un gènere o una forma literària, uns destinataris previstos o un estil que es canvia per crear una obra. @ca
toolkit label: transformació de @ca
toolkit definition: Obra que té un abast o una política editorial, un gènere o una forma literària, uns destinataris previstos o un estil que es canvia per crear una obra. @ca
label: er transformation af @da
definition: Relaterer et værk til et værk, som har en rækkevidde eller redaktionel retningslinje, genre eller litterære form, målgruppe eller stil. @da
toolkit label: transformation af @da
toolkit definition: Værk, som har en rækkevidde eller redaktionel retningslinje, genre eller litterære form, målgruppe eller stil. @da
label: ümberkujundus teosest @et
definition: Seostab teose teosega, mille käsitlusala või toimetamispõhimõtteid, žanri või kirjanduslikku vormi, sihtrühma või stiili on teose loomiseks muudetud. @et
toolkit label: ümberkujundus teosest @et
toolkit definition: Teos, mille käsitlusala või toimetamispõhimõtteid, žanri või kirjanduslikku vormi, sihtrühma või stiili on teose loomiseks muudetud. @et
label: ist Transformation von @de
definition: Setzt ein Werk in Beziehung zu einem Werk, dessen Geltungsbereich, redaktionelle Vorgehensweise, Genre oder literarische Form, Zielgruppe oder Stil geändert wird, um ein Werk zu erstellen. @de
toolkit label: Transformation von @de
toolkit definition: Ein Werk, dessen Geltungsbereich, redaktionelle Vorgehensweise, Genre oder literarische Form, Zielgruppe oder Stil geändert wird, um ein Werk zu erstellen. @de
label: átalakítása a következőnek: @hu
definition: Hozzákapcsol egy művet egy műhöz, amelynek alkalmazási területe vagy szerkesztési elvei, a műfaja vagy műneme, a célközönsége vagy a stílusa megváltoztak egy mű létrejövetele érdekében. @hu
toolkit label: átalakítása: @hu
toolkit definition: Egy mű, amelynek alkalmazási területe vagy szerkesztési elvei, a műfaja vagy műneme, a célközönsége vagy a stílusa megváltoztak egy mű létrejövetele érdekében. @hu
label: è trasformazione di @it
definition: Correla un’opera a un’opera che ha un oggetto o politica editoriale, genere o forma letteraria, pubblico di riferimento o stile che sono cambiati per creare un’opera. @it
toolkit label: trasformazione di @it
toolkit definition: Opera che ha un oggetto o politica editoriale, genere o forma letteraria, pubblico di riferimento o stile che sono cambiati per creare un’opera. @it
label: est une transformation de @fr
definition: Met une œuvre en relation avec une œuvre dont la portée ou la politique éditoriale, le genre ou la forme littéraire, le public cible ou le style sont modifiés pour créer une œuvre. @fr
toolkit label: transformation de @fr
toolkit definition: Œuvre dont la portée ou la politique éditoriale, le genre ou la forme littéraire, le public cible ou le style sont modifiés pour créer une œuvre. @fr
label: ir pārveidojums no @lv
toolkit label: pārveidojums no @lv
definition: Sasaista darbu ar darbu, kam darbības joma vai izdošanas politika, žanrs vai literārā forma, mērķauditorija vai stils tiek mainīts, lai izveidotu darbu. @lv
toolkit definition: Darbs, kam darbības joma vai izdošanas politika, žanrs vai literārā forma, mērķauditorija vai stils tiek mainīts, lai izveidotu darbu. @lv
label: 是……的转换 @zh-hans
toolkit label: ……的转换 @zh-hans
definition: 将一种作品与有范围或编辑政策、体裁或文学形式、目标受众或风格并被改变以创建一种作品的一种作品关联起来。 @zh-hans
toolkit definition: 有范围或编辑政策、体裁或文学形式、目标受众或风格并被改变以创建一种作品的一种作品 @zh-hans
has subproperty: is transformation by audience of
has subproperty: is transformation by genre of
has subproperty: is transformation by policy of
has subproperty: is transformation by style of
has subproperty: P10337
label: değişime @tr
toolkit label: dönüşüm @tr
definition: Bir eseri, kapsamı veya yayın politikası, türü veya edebi biçimi, hedef kitlesi veya tarzı bir eser oluşturmak için değiştirilen bir eser ile ilişkilendirir. @tr
toolkit definition: Bir eserin, kapsamı veya yayın politikası, türü veya edebi biçimi, hedef kitlesi veya tarzı değiştirilerek oluşturulduğu bir eser. @tr

has academic degree
status: Published
definition: Relates a work to a rank conferred as a guarantee of academic proficiency.
type: Property
domain: C10001
lexical alias: academicDegree.en
instruction number: 7.9.2
toolkit label: academic degree
toolkit definition: A rank conferred as a guarantee of academic proficiency.
toolkit label: grade universitaire @fr
toolkit definition: Rang conféré comme garantie de compétence universitaire. @fr
toolkit label: grado académico @es
toolkit definition: Un rango conferido como garantía de capacidad acedémica. @es
label: har akademisk grad @sv
toolkit label: akademisk grad @sv
definition: Relaterer et værk til en rang, som tildeles som garanti for akademisk færdighed. @da
toolkit definition: Rang, som tildeles som garanti for akademisk færdighed. @da
definition: Met une œuvre en relation avec un rang conféré comme garantie de compétence universitaire. @fr
label: có văn bằng học thuật @vi
definition: Liên kết tác phẩm với thứ bậc được trao như là chứng nhận về tinh thông học thuật. @vi
toolkit label: văn bằng học thuật @vi
toolkit definition: Thứ bậc được trao như là chứng nhận về tinh thông học thuật. @vi
label: hat akademischen Grad @de
definition: Setzt ein Werk in Beziehung zu einem Rang, der als Bestätigung für wissenschaftliche Leistungen verliehen wird. @de
toolkit label: Akademischer Grad @de
toolkit definition: Ein Rang, der als Bestätigung für wissenschaftliche Leistungen verliehen wird. @de
label: a pour grade universitaire @fr
definition: Liittää teoksen akateemisten opintojen perusteella myönnettyyn oppiarvoon. @fi
toolkit label: akateeminen oppiarvo @fi
toolkit definition: Akateemisten opintojen perusteella myönnetty oppiarvo. @fi
toolkit definition: En grad tildelt som en garanti for akademisk kompetanse. @no
label: té com a títol acadèmic @ca
definition: Relaciona una obra amb un grau concedit com a garantia d’un nivell acadèmic. @ca
toolkit label: títol acadèmic @ca
toolkit definition: Grau concedit com a garantia d’un nivell acadèmic. @ca
has element type: 2
label: έχει ανώτερου εκπαιδευτικού επιπέδου πτυχίο @el
definition: Συνδέει ένα έργο με μια ιεραρχία που υποδηλώνεται ως η εγγύηση της ακαδημαϊκής αριστείας. @el
toolkit label: ανώτερο εκπαιδευτικού επιπέδου πτυχίο @el
toolkit definition: Μια ιεραρχία που υποδηλώνεται ως η εγγύηση της ακαδημαϊκής αριστείας. @el
label: tudományos fokozata a következő: @hu
definition: Hozzákapcsol egy művet egy ranghoz, amelyet tudományos jártasság garanciájaként adományoznak. @hu
toolkit label: tudományos fokozata: @hu
toolkit definition: Egy rang, amelyet tudományos jártasság garanciájaként adományoznak. @hu
label: akateeminen oppiarvo @fi
definition: Relaterer et verk til en grad tildelt som en garanti for akademisk kompetanse. @no
label: heeft academische graad @nl
definition: Relateert een werk aan een rang verleend als een garantie van academische vakkundigheid. @nl
toolkit label: academische graad @nl
toolkit definition: Een rang verleend als een garantie van academische vakkundigheid. @nl
label: له درجة أكاديمية @ar
definition: يربط بين عمل ورتبة تمنح كضمان للكفاءة الأكاديمية. @ar
toolkit label: درجة أكاديمية @ar
toolkit definition: رتبة تمنح كضمان للكفاءة الأكاديمية. @ar
label: akadeemiline kraad @et
definition: Seostab teose auastmega, mis on antud akadeemilise pädevuse kinnituseks. @et
toolkit label: akadeemiline kraad @et
toolkit definition: Auaste, mis on antud akadeemilise pädevuse kinnituseks. @et
label: ha come titolo accademico @it
definition: Correla un'opera a un grado conferito a garanzia di competenza accademica. @it
toolkit label: titolo accademico @it
toolkit definition: Grado conferito a garanzia di competenza accademica. @it
label: akadēmiskais grāds @lv
definition: Sasaista darbu ar akadēmiskas izglītības ieguves apliecinājumu. @lv
toolkit label: akadēmiskais grāds @lv
toolkit definition: Akadēmiskas izglītības ieguves apliecinājums. @lv
label: 有学位 @zh-hans
definition: 将一种作品与作为学术能力担保的一种等级关联起来。 @zh-hans
toolkit label: 学位 @zh-hans
toolkit definition: 作为学术能力担保的一种等级 @zh-hans
has subproperty: P10077
label: akademik derece ile ilişkilidir @tr
definition: Bir eseri, akademik yeterliliğin kanıtı olarak verilen bir dereceyle ilişkilendirir. @tr
toolkit label: akademik derece @tr
toolkit definition: Akademik yeterliliğin göstergesi olarak verilen bir derece. @tr

has guide work
status: Published
definition: Relates a work to a work that guides a user through the use of a predominant work, using notes, learning and study aids, exercises, problems, questions and answers, instructor or student materials, etc.
type: Property
domain: C10001
sub property of: is augmented by work
lexical alias: guideWork.en
toolkit label: guide work
toolkit definition: A work that guides a user through the use of a predominant work, using notes, learning and study aids, exercises, problems, questions and answers, instructor or student materials, etc.
toolkit label: guide (œuvre) @fr
toolkit definition: Œuvre qui guide un utilisateur à travers une œuvre prédominante au moyen de notes, d’outils pédagogiques, d’exercices, de problèmes, de questions et réponses, de matériel didactique, etc. @fr
toolkit label: guía (obra) @es
toolkit definition: Una obra que guía al usuario en el uso de la obra principal, utilizando notas, ayudas de aprendizaje y estudio, ejercicios, problemas, preguntas y respuestas, materiales para el instructor o el estudiante, etc. @es
instruction number: 24.5
label: har vejledningsværk @da
definition: Relater et værk til et værk, som hjælper en bruger med at anvende et fremtrædende værk vha. noter, lære- og studiehjælpemidler, øvelser, problemstillinger, spørgsmål og svar, lærer- og elevmaterialer etc. @da
toolkit label: vejledningsværk @da
toolkit definition: Værk, som hjælper en bruger med at anvende et fremtrædende værk vha. noter, lære- og studiehjælpemidler, øvelser, problemstillinger, spørgsmål og svar, lærer- og elevmaterialer etc. @da
definition: Met une œuvre en relation avec une œuvre qui guide un utilisateur à travers une œuvre prédominante au moyen de notes, d’outils pédagogiques, d’exercices, de problèmes, de questions et réponses, de matériel didactique, etc. @fr
label: là chỉ dẫn (tác phẩm) @vi
definition: Liên kết tác phẩm với tác phẩm chỉ dẫn người dùng qua sử dụng tác phẩm nổi trội, sử dụng ghi chú, trợ giúp học tập và nghiên cứu, bài tập, vấn đề, câu hỏi và trả lời, tài liệu giảng viên hoặc sinh viên, v.v... @vi
toolkit label: chỉ dẫn (tác phẩm) @vi
toolkit definition: Tác phẩm chỉ dẫn người dùng qua sử dụng tác phẩm nổi trội, sử dụng ghi chú, trợ giúp học tập và nghiên cứu, bài tập, vấn đề, câu hỏi và trả lời, tài liệu giảng viên hoặc sinh viên, v.v... @vi
label: hat Orientierungshilfe (Werk) @de
definition: Setzt ein Werk in Beziehung zu einem Werk, das Benutzende durch die Verwendung von Anmerkungen, Lern- und Studienhilfen, Übungen, Problemstellungen, Fragen und Antwort oder anderen Lehr- oder Schülermaterialien durch die Nutzung eines Hauptwerks führt. @de
toolkit label: Orientierungshilfe (Werk) @de
toolkit definition: Ein Werk, das Benutzende durch die Verwendung von Anmerkungen, Lern- und Studienhilfen, Übungen, Problemstellungen, Fragen und Antwort oder anderen Lehr- oder Schülermaterialien durch die Nutzung eines Hauptwerks führt. @de
label: a pour guide (œuvre) @fr
definition: Liittää teoksen teokseen, joka opastaa käyttäjää vallitsevan teoksen käytössä huomautusten, harjoitusten, kysymysten ja vastausten, harjoitus- tai oppimateriaalin tms. avulla. @fi
toolkit label: opas (teos) @fi
toolkit definition: Teos, joka opastaa käyttäjää vallitsevan teoksen käytössä huomautusten, harjoitusten, kysymysten ja vastausten, harjoitus- tai oppimateriaalin tms. avulla. @fi
toolkit label: studieveiledning (verk) @no
toolkit definition: Et verk som veileder en bruker gjennom bruken av et mer fremtredende verk ved hjelp av noter, pedagogiske hjelpemidler, øvelser, oppgaver, spørsmål og svar, lære- eller studiemateriell, etc. @no
label: té com a obra de guia @ca
definition: Relaciona una obra amb una obra que guia un usuari en l’ús d’una obra predominant, usant notes, ajudes a l’aprenentatge i l’estudi, exercicis, problemes, preguntes i respostes, materials per al professor o l’estudiant, etc. @ca
toolkit label: obra de guia @ca
toolkit definition: Obra que guia un usuari en l’ús d’una obra predominant, usant notes, ajudes a l’aprenentatge i l’estudi, exercicis, problemes, preguntes i respostes, materials per al professor o l’estudiant, etc. @ca
has element type: 2
label: είναι οδηγός (έργο) @el
definition: Συνδέει ένα έργο με ένα έργο το οποίο καθοδηγεί τον χρήστη μέσω της χρήσης ενός κύριου έργου, με τη χρήση σημειώσεων, βοηθημάτων μάθησης και μελέτης, ασκήσεων, προβλημάτων, ερωταποκρίσεων, υλικού για τον εκπαιδευτή ή τον μαθητή κ.λπ. @el
toolkit label: οδηγός (έργο) @el
toolkit definition: Ένα έργο το οποίο καθοδηγεί τον χρήστη μέσω της χρήσης ενός κύριου έργου με τη χρήση σημειώσεων, βοηθημάτων μάθησης και μελέτης, ασκήσεων, προβλημάτων, ερωταποκρίσεων, υλικού για τον εκπαιδευτή ή τον μαθητή κ.λπ. @el
label: kalauzműve a következő: @hu
definition: Hozzákapcsol egy művet egy műhöz, amely a használót végigvezeti egy domináns mű használatán jegyzetek, tanulási és tanulmányi segédletek, gyakorlatok, problémák, kérdések és válaszok, oktatói vagy diákanyagok stb. felhasználásával. @hu
toolkit label: kalauzmű @hu
toolkit definition: Egy mű, amely a használót végigvezeti egy domináns mű használatán jegyzetek, tanulási és tanulmányi segédletek, gyakorlatok, problémák, kérdések és válaszok, oktatói vagy diákanyagok stb. felhasználásával. @hu
label: opas (teos) @fi
label: har studieveiledning (verk) @no
definition: Relaterer et verk til et verk som veileder en bruker gjennom bruken av et mer fremtredende verk ved hjelp av noter, pedagogiske hjelpemidler, øvelser, oppgaver, spørsmål og svar, lære- eller studiemateriell, etc. @no
label: heeft gidswerk @nl
definition: Relateert een werk aan een werk dat een gebruiker geleidt door het gebruik van een hoofdwerk, met behulp van noten, leer- en studiehulpmiddelen, oefeningen, vraagstukken, vragen en antwoorden, instructie- of studentenmateriaal etc. @nl
toolkit label: gidswerk @nl
toolkit definition: Een werk dat een gebruiker geleidt door het gebruik van een hoofdwerk, met behulp van noten, leer- en studiehulpmiddelen, oefeningen, vraagstukken, vragen en antwoorden, instructie- of studentenmateriaal etc. @nl
label: له عمل دليل إرشادي @ar
definition: يربط عمل بعمل يرشد المستخدم إلى كيفية استخدام العمل السائد، باستخدام الملاحظات، ووسائل التعلم والدراسة، والتمارين، والمسائل، والأسئلة والأجوبة، ومواد المعلم أو الطلاب، إلخ. @ar
toolkit label: عمل دليل إرشادي @ar
toolkit definition: عمل يرشد المستخدم إلى كيفية استخدام العمل السائد، باستخدام الملاحظات، ووسائل التعلم والدراسة، والتمارين، والمسائل، والأسئلة والأجوبة، ومواد المعلم أو الطلاب، إلخ. @ar
label: käsiraamat (teos) @et
definition: Seostab teose teosega, milles juhendatakse kasutama dominantset teost märkuste, õpijuhiste, harjutuste, ülesannete, küsimuste ja vastuste, õpetaja või õpilase materjalide jms abil. @et
toolkit label: käsiraamat (teos) @et
toolkit definition: Teos, milles juhendatakse kasutama dominantset teost märkuste, õpijuhiste, harjutuste, ülesannete, küsimuste ja vastuste, õpetaja või õpilase materjalide jms abil. @et
label: ha come guida opera @it
definition: Correla un’opera a un’opera che guida l’utente all’utilizzo dell’opera principale mediante l’utilizzo di note, sussidi per l’apprendimento e lo studio, esercizi, problemi, domande e risposte, materiali per l’insegnante o per gli studenti, etc. @it
toolkit label: guida opera @it
toolkit definition: Opera che guida l’utente all’utilizzo dell’opera principale mediante l’utilizzo di note, sussidi per l’apprendimento e lo studio, esercizi, problemi, domande e risposte, materiali per l’insegnante o per gli studenti, etc @it
label: palīglīdzeklis: darbs @lv
definition: Sasaista darbu ar darbu – palīglīdzeklis pamatdarba lietošanai. @lv
toolkit label: palīglīdzeklis: darbs @lv
toolkit definition: Darbs – palīglīdzeklis pamatdarba lietošanai. @lv
label: 有指南作品 @zh-hans
definition: 将一种作品与用注释、学习和研究工具、练习、提问、问题与答案、教师或学生参考资料等对使用者使用主要作品提供指导的一种作品关联起来。 @zh-hans
toolkit label: 指南作品 @zh-hans
toolkit definition: 用注释、学习和研究工具、练习、提问、问题与答案、教师或学生参考资料等对使用者使用主要作品提供指导的一种作品 @zh-hans
has subproperty: P10124
label: rehber eser ile ilişkilidir @tr
definition: Bir eseri, notlar, öğrenme ve çalışma araçları, alıştırmalar, problemler, sorular ve cevaplar, eğitmen veya öğrenci materyalleri vb. kullanarak bir kullanıcıya baskın bir eserin kullanımı boyunca rehberlik eden bir eserle ilişkilendirir. @tr
toolkit label: çalışma rehberi @tr
toolkit definition: Bir ana eserin kullanımını kullanıcıya rehberlik eden bir eser; notlar, öğrenme ve çalışma yardımları, alıştırmalar, problemler, sorular ve cevaplar, öğretmen veya öğrenci materyalleri gibi öğeler kullanır. @tr

has respondent
status: Published
definition: Relates a work to a person who is a candidate for a degree who defends or opposes a thesis provided by the praeses in an academic disputation.
type: Property
domain: C10001
sub property of: has creator person of work
lexical alias: respondent.en
toolkit label: respondent
toolkit definition: A person who is a candidate for a degree who defends or opposes a thesis provided by the praeses in an academic disputation.
toolkit label: répondant @fr
toolkit definition: Personne candidate à un grade universitaire qui défend ou réfute une thèse proposée par le praeses lors d’une disputation académique. @fr
toolkit label: sustentante @es
toolkit definition: Un candidato para un título que defiende o se opone a una tesis proporcionada por los moderadores académicos en un debate académico. @es
instruction number: 18.5
label: har respondent @da
definition: Relaterer et værk til en person, som er kandidat til en akademisk grad, som forsvarer eller opponerer mod en tese, som er fremsat af præses i et akademisk afhandlingsforsvar. @da
toolkit definition: Person, som er kandidat til en akademisk grad, som forsvarer eller opponerer mod en tese, som er fremsat af præses i et akademisk afhandlingsforsvar. @da
definition: Met une œuvre en relation avec une personne candidate à un grade universitaire qui défend ou réfute une thèse proposée par le praeses lors d’une disputation académique. @fr
label: có thí sinh @vi
definition: Liên kết tác phẩm với ứng viên của học vị, người bảo vệ hoặc dự thi một luận văn do hội đồng tổ chức trong cuộc tranh luận học thuật @vi
toolkit label: thí sinh @vi
toolkit definition: Ứng viên của học vị, người bảo vệ hoặc dự thi một luận văn do hội đồng tổ chức trong cuộc tranh luận học thuật @vi
label: hat Respondentin/Respondent @de
definition: Setzt ein Werk in Beziehung zu einer Kandidatin/einem Kandidaten (Person) für einen akademischen Grad, die/der eine These, die vom Praeses in einer akademischen Disputation aufgestellt wird, verteidigt oder ablehnt. @de
toolkit label: Respondentin/Respondent @de
toolkit definition: Eine Kandidatin/Ein Kandidat für einen akademischen Grad, die/der eine These, die vom Praeses in einer akademischen Disputation aufgestellt wird, verteidigt oder ablehnt. @de
label: a pour répondant @fr
definition: Liittää teoksen henkilöön, joka on oppiarvoa tavoitteleva kandidaatti, joka akateemisessa väitöstilaisuudessa puolustaa tai opponoi preeseksen esittelemää väitöskirjaa. @fi
toolkit label: respondentti @fi
toolkit definition: Henkilö, joka on oppiarvoa tavoiteleva kandidaatti, joka akateemisessa väitöstilaisuudessa puolustaa tai opponoi preeseksen esittelemää väitöskirjaa. @fi
toolkit definition: En person som er en kandidat for en grad, som forsvarer eller bestrider en avhandling levert av preses i en akademisk disputas. @no
label: té com a respondens @ca
definition: Relaciona una obra amb una persona que és un candidat a un grau que defensa o s’oposa a una tesi proposada pel praeses en una disputa acadèmica. @ca
toolkit label: respondens @ca
toolkit definition: Persona que és un candidat a un grau que defensa o s’oposa a una tesi proposada pel praeses en una disputa acadèmica. @ca
has element type: 2
label: έχει συμμετέχοντα @el
definition: Συνδέει ένα έργο με έναν υποψήφιο διδάκτορα για ένα πτυχίο που επιχειρηματολογεί υπέρ ή κατά μιας θέσης που παρέχεται από τον επόπτη σε μια διατριβή. @el
toolkit label: συμμετέχων @el
toolkit definition: Ένας υποψήφιος διδάκτορας για ένα πτυχίο που επιχειρηματολογεί υπέρ ή κατά μιας θέσης που παρέχεται από τον επόπτη σε μια διατριβή. @el
label: válaszadója a következő: @hu
definition: Hozzákapcsol egy művet egy személyhez, aki az elnök által előterjesztett értekezést megvédi vagy opponálja egy tudományos vitában. @hu
toolkit label: válaszadó: @hu
toolkit definition: Egy személy, aki az elnök által előterjesztett értekezést megvédi vagy opponálja egy tudományos vitában. @hu
label: respondentti @fi
definition: Relaterer et verk til en person som er en kandidat for en grad, som forsvarer eller bestrider en avhandling levert av preses i en akademisk disputas. @no
label: heeft respondent @nl
definition: Relateert een werk aan een persoon die een kandidaat is voor een graad die een stelling verstrekt door de preses in een academische disputatie weerlegt of verdedigt. @nl
toolkit definition: Een persoon die een kandidaat is voor een graad die een stelling verstrekt door de preses in een academische disputatie weerlegt of verdedigt. @nl
label: له مبحوث/ مستجيب @ar
definition: يربط بين عمل وشخص مرشح للحصول على درجة علمية يدافع عن أطروحة مقدمة من رؤساء جلسة علمية في مناظرة أكاديمية أو يعارضها. @ar
toolkit label: مستجيب @ar
toolkit definition: شخص مرشح للحصول على درجة علمية يدافع عن أطروحة مقدمة من رؤساء جلسة علمية في مناظرة أكاديمية أو يعارضها. @ar
label: respondens @et
definition: Seostab teose kraadi taotleva isikuga, kes akadeemilises väitluses kaitseb või oponeerib praeses'e esitletud teese. @et
toolkit definition: Kraadi taotlev isik, kes akadeemilises väitluses kaitseb või oponeerib praeses'e esitletud teese. @et
label: ha come candidato @it
definition: Correla un'opera a una persona candidata al conseguimento di un titolo accademico, che difende o si oppone a una tesi proposta dal relatore nell'ambito di una disputa accademica. @it
toolkit label: candidato @it
toolkit definition: Persona candidata al conseguimento di un titolo accademico, che difende o si oppone a una tesi proposta dal relatore nell'ambito di una disputa accademica. @it
label: akadēmiskā disputa respondents @lv
definition: Sasaista darbu ar personu, kura ir kandidāts grāda iegūšanai, kurš aizstāv vai oponē akadēmiskā disputa vadītāja piedāvātajām tēzēm. @lv
toolkit label: akadēmiskā disputa respondents @lv
toolkit definition: Kandidāts grāda iegūšanai, kurš aizstāv vai oponē akadēmiskā disputa vadītāja piedāvātajām tēzēm. @lv
label: 有答辩人 @zh-hans
definition: 将一种作品与作为学位候选人对在学位论文答辩中评审人提供的一篇论文提出支持或反对的一个个人关联起来。 @zh-hans
toolkit label: 答辩人 @zh-hans
toolkit definition: 作为学位候选人对在学位论文答辩中评审人提供的一篇论文提出支持或反对的一个个人 @zh-hans
has subproperty: P10001
label: tez yazarı ile ilişkilidir @tr
definition: Bir eseri, danışmanlar tarafından ortaya konan akademik bir tartışmada bir tezi savunan veya karşı çıkan bir mezun adayı olan kişiyle ilişkilendirir. @tr
toolkit label: tez savunan kişi @tr
toolkit definition: Akademik bir tartışmada danışmanlar tarafından ortaya konan bir tezi savunan veya karşı çıkan bir derece adayı olan kişi. @tr

has variant access point for work
status: Published
type: Property
lexical alias: variantAccessPointForWork.en
definition: Relates a work to a nomen that is an access point of work that is not selected for preference in a specific vocabulary encoding scheme.
sub property of: has access point for work
domain: C10001
toolkit label: variant access point for work
toolkit definition: A nomen that is an access point of work that is not selected for preference in a specific vocabulary encoding scheme.
has element type: 3
sub property of: P00022
label: teoksen varianttihakutieto @fi
definition: Liittää teoksen nomeniin, joka on teoksen hakutieto, jota ei ole valittu ensisijaiseksi tietyssä sanaston merkintäjärjestelmässä. @fi
toolkit label: teoksen varianttihakutieto @fi
toolkit definition: Nomen, joka on teoksen hakutieto, jota ei ole valittu ensisijaiseksi tietyssä sanaston merkintäjärjestelmässä. @fi
label: har alternativ søkeinngang for verk @no
definition: Relaterer et verk til en søkeinngang for verk som ikke er valgt som preferanse i et bestemt kodeskjema for vokabular. @no
toolkit label: alternativ søkeinngang for verk @no
toolkit definition: En søkeinngang for verk som ikke er valgt som preferanse i et bestemt kodeskjema for vokabular. @no
label: heeft variant ingang voor werk @nl
definition: Relateert een werk aan een nomen dat is een ingang voor werk die niet bij voorkeur geselecteerd is in een specifiek vocabulair coderingssysteem. @nl
toolkit label: variant ingang voor werk @nl
toolkit definition: Een nomen dat is een ingang voor werk die niet bij voorkeur geselecteerd is in een specifiek vocabulair coderingssysteem. @nl
label: له نقطة وصول متغيرة لعمل @ar
definition: يربط بين عمل وتسمية عبارة عن نقطة وصول لعمل لم يتم اختيارها بتفضيل استخدامها في خطة ترميز مفردات معينة. @ar
toolkit label: نقطة وصول متغيرة لعمل @ar
toolkit definition: تسمية عبارة عن نقطة وصول لعمل لم يتم اختيارها بتفضيل استخدامها في خطة ترميز مفردات معينة. @ar
label: té com a variant de punt d’accés d’obra @ca
definition: Relaciona una obra amb un nomen que és un punt d’accés d’obra que no se selecciona com a preferent en un esquema de codificació de vocabulari específic. @ca
toolkit label: variant de punt d’accés d’obra @ca
toolkit definition: Nomen que és un punt d’accés d’obra que no se selecciona com a preferent en un esquema de codificació de vocabulari específic. @ca
label: har variant af søgeindgang for værk @da
definition: Relaterer et værk til en søgeindgang for værk, som ikke er valgt som præference i et specifikt vokabularkodningsskema. @da
toolkit label: variant af søgeindgang for værk @da
toolkit definition: Søgeindgang for værk, som ikke er valgt som præference i et specifikt vokabularkodningsskema. @da
label: teose otsielemendi variant @et
definition: Seostab teose teose otsielemendiga, mis ei ole valitud eelistatuks vastavas leksikaalses märkimissüsteemis. @et
toolkit label: teose otsielemendi variant @et
toolkit definition: Teose otsielement, mis ei ole valitud eelistatuks vastavas leksikaalses märkimissüsteemis. @et
label: hat zusätzlichen Sucheinstieg für ein Werk @de
definition: Setzt ein Werk in Beziehung zu einem Sucheinstieg für ein Werk, der in einem bestimmten Vocabulary Encoding Scheme nicht als Vorzugsform bestimmt wird. @de
toolkit label: Zusätzlicher Sucheinstieg für ein Werk @de
toolkit definition: Ein Sucheinstieg für ein Werk, der in einem bestimmten Vocabulary Encoding Scheme nicht als Vorzugsform bestimmt wird. @de
label: mű hozzáférésipont-változata a következő: @hu
definition: Hozzákapcsol egy művet egy nomenhez, egy olyan hozzáférési ponthoz mű számára, amelyet egy adott szótárkódolási sémában nem részesítenek előnyben. @hu
toolkit label: mű hozzáférésipont-változata: @hu
toolkit definition: Egy nomen, egy olyan hozzáférési pont mű számára, amelyet egy adott szótárkódolási sémában nem részesítenek előnyben. @hu
label: ha come punto d'accesso variante per opera @it
definition: Correla un’opera a un punto d’accesso per l’opera che non è selezionato come preferito in uno specifico schema di codifica di vocabolario. @it
toolkit label: punto d'accesso variante per opera @it
toolkit definition: Punto d’accesso per l’opera che non è selezionato come preferito in uno specifico schema di codifica di vocabolario. @it
label: a pour variante de point d’accès d’une œuvre @fr
definition: Met une œuvre en relation avec un nomen qui est un point d’accès d’une œuvre ne faisant pas l’objet d’un choix privilégié dans un schéma d’encodage de vocabulaire spécifique. @fr
toolkit label: variante de point d’accès d’une œuvre @fr
toolkit definition: Nomen qui est un point d’accès d’une œuvre ne faisant pas l’objet d’un choix privilégié dans un schéma d’encodage de vocabulaire spécifique. @fr
label: darba papildforma @lv
definition: Sasaista darbu ar nomenu, kas ir piekļuves punkts darbam, kas nav izvēlēts kā prioritārs noteiktai kontrolētas vārdnīcas shēmai. @lv
toolkit label: darba papildforma @lv
toolkit definition: Piekļuves punkts darbam, kas nav izvēlēts kā prioritārs noteiktai kontrolētas vārdnīcas shēmai. @lv
label: 有作品的变异检索点 @zh-hans
definition: 将一种作品与作为一种作品的检索点、并没有在一个特定的词表编码体系中被首选的一个命名关联起来。 @zh-hans
toolkit label: 作品的变异检索点 @zh-hans
toolkit definition: 作为一种作品的检索点、并没有在一个特定的词表编码体系中被首选的一个命名 @zh-hans
has subproperty: P10332
label: eser için alternatif erişim noktası ile ilişkilidir @tr
definition: Bir eseri, belirli bir kelime kodlama şemasında tercih için seçilmemiş bir eser erişim noktası olan bir isimle ilişkilendirir. @tr
toolkit label: eser için alternatif erişim noktası @tr
toolkit definition: Belirli bir kelime kodlama şemasında tercih için seçilmemiş bir eserin erişim noktası olan isim. @tr

is adapted in verse as work
status: Published
definition: Relates a work to a work that is a literary composition in verse form adapted from another work.
type: Property
domain: C10001
sub property of: is adapted as work
lexical alias: adaptedInVerseAsWork.en
toolkit label: adapted in verse as work
toolkit definition: A work that is a literary composition in verse form adapted from another work.
toolkit label: adapté en vers comme une œuvre @fr
toolkit definition: Œuvre qui consiste en une composition littéraire en vers adaptée d’une œuvre source. @fr
toolkit label: adaptada en verso como (obra) @es
toolkit definition: Una composición literaria en verso adaptada de la obra fuente. @es
instruction number: 24.5
label: er bearbejdet i versform som værk @da
definition: Relaterer et værk til en litterær komposition i versform, bearbejdet ud fra et oprindeligt værk. @da
toolkit label: bearbejdet i versform som værk @da
toolkit definition: Litterær komposition i versform, bearbejdet ud fra et oprindeligt værk. @da
definition: Met une œuvre en relation avec une œuvre qui consiste en une composition littéraire en vers adaptée d’une œuvre source. @fr
label: được phỏng theo ở thể thơ của (tác phẩm) @vi
definition: Liên kết tác phẩm với tác phẩm văn chương ở thể thơ phỏng theo tác phẩm nguồn. @vi
toolkit label: được phỏng theo ở thể thơ của (tác phẩm) @vi
toolkit definition: Tác phẩm văn chương ở thể thơ phỏng theo tác phẩm nguồn. @vi
label: ist bearbeitet als Gedicht (Werk) @de
definition: Setzt ein Werk in Beziehung zu einer literarischen Dichtung in Versform (Werk), die auf einem anderen Werk basiert. @de
toolkit label: Bearbeitet als Gedicht (Werk) @de
toolkit definition: Eine literarische Dichtung in Versform (Werk), die auf einem anderen Werk basiert. @de
label: est adapté en vers comme une œuvre @fr
definition: Liittää teoksen teokseen, joka on toisesta teoksesta runomuotoon sovitettu teos. @fi
toolkit label: runomukaelma (teos) @fi
toolkit definition: Teos, joka on toisesta teoksesta runomuotoon sovitettu teos. @fi
toolkit label: bearbeidet til verseform som verk @no
toolkit definition: En litterær komposisjon i verseform bearbeidet fra et kildeverk. @no
label: és adaptat en vers com a obra @ca
definition: Relaciona una obra amb obra que és una composició literària en vers adaptada d’una altra obra. @ca
toolkit label: adaptat en vers com a obra @ca
toolkit definition: Obra que és una composició literària en vers adaptada d’una altra obra. @ca
has element type: 2
label: είναι προσαρμοσμένο σε έμμετρο λόγο ως (έργο) @el
definition: Συνδέει ένα έργο με μια λογοτεχνική σύνθεση σε έμμετρη μορφή προσαρμοσμένη από ένα έργο-πηγή. @el
toolkit label: προσαρμοσμένο σε έμμετρο λόγο ως (έργο) @el
toolkit definition: Μια λογοτεχνική σύνθεση σε έμμετρη μορφή προσαρμοσμένη από ένα έργο-πηγή. @el
label: versmű-átdolgozása a következő: @hu
definition: Hozzákapcsol egy művet egy műhöz, amely egy másik műből átdolgozott verses formájú irodalmi alkotáshoz. @hu
toolkit label: versmű-átdolgozás @hu
toolkit definition: Egy mű, amely egy másik műből átdolgozott verses formájú irodalmi alkotás. @hu
label: runomukaelma (teos) @fi
label: er bearbeidet til verseform som verk @no
definition: Relaterer et verk til en litterær komposisjon i verseform bearbeidet fra et kildeverk. @no
label: is bewerkt in versvorm als werk @nl
definition: Relateert een werk aan een werk dat is een literaire compositie in versvorm bewerkt van een ander werk. @nl
toolkit label: bewerkt in versvorm als werk @nl
toolkit definition: Een werk dat is een literaire compositie in versvorm bewerkt van een ander werk. @nl
label: هو معالج شعريا كعمل @ar
definition: يربط عمل بعمل عبارة عن تركيب أدبي في شكل شعر مقتبس من عمل آخر. @ar
toolkit label: معالج شعريا كعمل @ar
toolkit definition: عمل عبارة عن تركيب أدبي في شكل شعر مقتبس من عمل آخر. @ar
label: adapteeritud värssteosena @et
definition: Seostab teose värsivormis kirjandusliku kompositsiooniga, mis on adapteeritud allikteosest. @et
toolkit label: adapteeritud värssteosena @et
toolkit definition: Värsivormis kirjanduslik kompositsioon, mis on adapteeritud allikteosest. @et
label: è adattata in versi come opera @it
definition: Correla un’opera a una composizione letteraria in versi adattata da un’opera di partenza. @it
toolkit label: adattata in versi come opera @it
toolkit definition: Composizione letteraria in versi adattata da un’opera di partenza. @it
label: ir adaptēts kā darbs dzejā @lv
definition: Sasaista darbu ar darbu, kas ir literārs darbs vārsmās veidots no pamatdarba. @lv
toolkit label: adaptēts kā darbs dzejā @lv
toolkit definition: Literārs darbs vārsmās veidots no pamatdarba. @lv
label: 被改编成韵文作为作品 @zh-hans
definition: 将一种作品与被改编自另一种作品的一种文学韵文写作的一种作品关联起来。 @zh-hans
toolkit label: 被改编成韵文作为作品 @zh-hans
toolkit definition: 被改编自另一种作品的一种文学韵文写作的一种作品 @zh-hans
has subproperty: P10023
label: manzum eser olarak uyarlanmıştır @tr
definition: Bir eseri, başka bir eserden uyarlanan nazım edebî bir eser olan eserle ilişkilendirir. @tr
toolkit label: Manzum eser olarak uyarlanan @tr
toolkit definition: Başka bir eserden uyarlanmış, nazım biçiminde yazılmış edebi bir eser. @tr

is adapted as video screenplay work
status: Published
definition: Relates a work to a work that consists of a screenplay for a video, based on another work.
type: Property
domain: C10001
sub property of: is adapted as screenplay work
lexical alias: adaptedAsVideoScreenplayWork.en
toolkit label: adapted as video screenplay work
toolkit definition: A work that consists of a screenplay for a video, based on another work.
toolkit label: adapté en scénario de vidéo (œuvre) @fr
toolkit definition: Œuvre qui consiste en un scénario de vidéo basé sur une autre œuvre. @fr
toolkit label: adaptada como guión para video (obra) @es
toolkit definition: Una obra que consiste en un guión para video, basado en la obra fuente. @es
instruction number: 24.5
label: er bearbejdet til videomanuskriptværk @da
definition: Relaterer et værk til et værk, som består af et manuskript til en video, baseret på et oprindeligt værk. @da
toolkit label: bearbejdet til videomanuskriptværk @da
toolkit definition: Værk, som består af et manuskript til en video, baseret på et oprindeligt værk. @da
definition: Met une œuvre en relation avec une œuvre qui consiste en un scénario de vidéo basé sur une autre œuvre. @fr
label: được phỏng theo như là kịch bản video (tác phẩm) @vi
definition: Liên kết tác phẩm với tác phẩm có chứa kịch bản của video, dựa trên tác phẩm nguồn. @vi
toolkit label: được phỏng theo như là tác phẩm kịch bản video @vi
toolkit definition: Tác phẩm có chứa kịch bản của video, dựa trên tác phẩm nguồn. @vi
label: ist bearbeitet als Videodrehbuch (Werk) @de
definition: Setzt ein Werk in Beziehung zu einem Werk, das aus einem Drehbuch für ein Video besteht, das auf einem anderen Werk basiert. @de
toolkit label: Bearbeitet als Videodrehbuch (Werk) @de
toolkit definition: Ein Werk, das aus einem Drehbuch für ein Video besteht, das auf einem anderen Werk basiert. @de
label: est adapté en scénario de vidéo (œuvre) @fr
definition: Liittää teoksen teokseen, joka koostuu toiseen teokseen perustuvasta videokäsikirjoituksesta. @fi
toolkit label: sovitettu videokäsikirjoitukseksi (teos) @fi
toolkit definition: Teos, joka koostuu toiseen teokseen perustuvasta videokäsikirjoituksesta. @fi
toolkit label: bearbeidet som manus for video (verk) @no
toolkit definition: Et verk som består av et manuskript for en video, basert på et kildeverk. @no
label: és adaptat com a obra de guió de vídeo @ca
definition: Relaciona una obra amb una obra que consisteix en un guió d’un vídeo basat en una altra obra. @ca
toolkit label: adaptat com a obra de guió de vídeo @ca
toolkit definition: Obra que consisteix en un guió d’un vídeo basat en una altra obra. @ca
has element type: 2
label: είναι προσαρμοσμένο ως σενάριο για βίντεο (έργο) @el
definition: Συνδέει ένα έργο με ένα έργο που συνίσταται από ένα σενάριο για ένα βίντεο βασισμένο σε ένα έργο-πηγή. @el
toolkit label: προσαρμοσμένο ως σενάριο για βίντεο (έργο) @el
toolkit definition: Ένα έργο που συνίσταται από ένα σενάριο για ένα βίντεο βασισμένο σε ένα έργο-πηγή. @el
label: videóforgatókönyv-feldolgozása a következő: @hu
definition: Hozzákapcsol egy művet egy műhöz, amely egy másik művön alapuló videó forgatókönyvéből áll. @hu
toolkit label: videóforgatókönyv-feldolgozása a következő: @hu
toolkit definition: Egy mű, amely egy másik művön alapuló videó forgatókönyvéből áll. @hu
label: sovitettu videokäsikirjoitukseksi (teos) @fi
label: er bearbeidet som manus for video (verk) @no
definition: Relaterer et verk til et verk som består av et manuskript for en video, basert på et kildeverk. @no
label: is bewerkt als videoscenariowerk @nl
definition: Relateert een werk aan een werk dat bestaat uit een scenario voor een video, gebaseerd op een ander werk. @nl
toolkit label: bewerkt als videoscenariowerk @nl
toolkit definition: Een werk dat bestaat uit een scenario voor een video, gebaseerd op een ander werk. @nl
label: هو معالج كعمل سيناريو فيديو @ar
definition: يربط عمل بعمل يتكون من سيناريو فيلم سينمائي لفيديو، مبني على عمل آخر. @ar
toolkit label: معالج كعمل سيناريو فيديو @ar
toolkit definition: عمل يتكون من سيناريو فيلم سينمائي لفيديو، مبني على عمل آخر. @ar
label: adapteeritud videostsenaariumina (teos) @et
definition: Seostab teose teosega, mis on allikteosel põhinev stsenaarium video jaoks. @et
toolkit label: adapteeritud videostsenaariumina (teos) @et
toolkit definition: Teos, mis on allikteosel põhinev stsenaarium video jaoks. @et
label: è adattata come opera in forma di sceneggiatura per video @it
definition: Correla un’opera a un’opera che consiste di una sceneggiatura per un video, basata su un’opera di partenza. @it
toolkit label: adattata come opera in forma di sceneggiatura per video @it
toolkit definition: Opera che consiste di una sceneggiatura per un video, basata su un’opera di partenza. @it
label: ir adaptēts kā videoscenārijs (darbs) @lv
definition: Sasaista darbu ar darbu - videoscenārijs, veidots pēc pamatdarba. @lv
toolkit label: adaptēts kā darbs: videoscenārijs @lv
toolkit definition: Darbs - videoscenārijs, veidots pēc pamatdarba. @lv
label: 被改编为视频剧本作品 @zh-hans
definition: 将一种作品与由基于另一种作品的一种视频的剧本组成的一种作品关联起来。 @zh-hans
toolkit label: 被改编为视频剧本作品 @zh-hans
toolkit definition: 由基于另一种作品的一种视频的剧本组成的一种作品 @zh-hans
has subproperty: P10097
label: video senaryosu eseri olarak uyarlanmıştır @tr
definition: Bir eseri, başka bir eserden uyarlanan bir video senaryosundan oluşan eserle ilişkilendirir. @tr
toolkit label: Video senaryosu çalışması olarak uyarlanan @tr
toolkit definition: Başka bir esere dayalı olarak bir video için yazılmış bir senaryodan oluşan eser. @tr

is adapted as video game work
status: Published
type: Property
lexical alias: adaptedAsVideoGameWork.en
definition: Relates a work to a work that is a video game that is based on another work.
domain: C10001
toolkit label: adapted as video game work
toolkit definition: A work that is a video game that is based on another work.
toolkit label: adapté en jeu vidéo (œuvre) @fr
toolkit definition: Œuvre qui consiste en un jeu vidéo basé sur une autre œuvre. @fr
sub property of: is adapted as work
toolkit label: adaptada como video juego (obra) @es
toolkit definition: Un video juego basado en la obra fuente. @es
instruction number: 24.5
label: er bearbejdet til computerspilværk @da
definition: Relaterer et værk til et videospil, baseret på et oprindeligt værk. @da
toolkit label: bearbejdet til computerspilværk @da
toolkit definition: Videospil, baseret på et oprindeligt værk. @da
definition: Met une œuvre en relation avec une œuvre qui consiste en un jeu vidéo basé sur une autre œuvre. @fr
label: được phỏng theo như là trò chơi video (tác phẩm) @vi
definition: Liên kết tác phẩm với trò chơi video dựa trên tác phẩm nguồn. @vi
toolkit label: được phỏng theo như là trò chơi video (tác phẩm) @vi
toolkit definition: Trò chơi video dựa trên tác phẩm nguồn. @vi
label: ist bearbeitet als Videospiel (Werk) @de
definition: Setzt ein Werk in Beziehung zu einem Videospiel (Werk), das auf einem anderen Werk basiert. @de
toolkit label: Bearbeitet als Videospiel (Werk) @de
toolkit definition: Ein Videospiel (Werk), das auf einem anderen Werk basiert. @de
label: est adapté en jeu vidéo (œuvre) @fr
definition: Liittää teoksen teokseen, joka on videopeli, joka perustuu toiseen teokseen. @fi
toolkit label: videopelisovitus (teos) @fi
toolkit definition: Teos, joka on videopeli, joka perustuu toiseen teokseen. @fi
toolkit label: bearbeidet som videospill (verk) @no
toolkit definition: Et videospill basert på et kildeverk. @no
label: és adaptat com a obra de videojoc @ca
definition: Obra que és un videojoc que es basa en una obra font. @ca
toolkit label: adaptat com a obra de videojoc @ca
toolkit definition: Relaciona una obra amb una obra que és un videojoc que es basa en una obra font. @ca
has element type: 2
label: είναι προσαρμοσμένο ως video game (έργο) @el
definition: Συνδέει ένα έργο με ένα video game βασισμένο σε ένα έργο-πηγή. @el
toolkit label: προσαρμοσμένο ως video game (έργο) @el
toolkit definition: Ένα video game βασισμένο σε ένα έργο-πηγή. @el
label: videójátékmű-átdolgozása a következő: @hu
definition: Egy művet hozzákapcsol egy forrásművön alapuló videójátékhoz. @hu
toolkit label: videójátékmű-átdolgozása a következő: @hu
toolkit definition: Egy forrásművön alapuló videójáték. @hu
label: videopelisovitus (teos) @fi
label: er bearbeidet som videospill (verk) @no
definition: Relaterer et verk til et videospill basert på et kildeverk. @no
label: is bewerkt als computerspel-werk @nl
definition: Relateert een werk aan een werk dat is een computerspel dat is gebaseerd op een ander werk. @nl
toolkit label: bewerkt als computerspel-werk @nl
toolkit definition: Een werk dat is een computerspel dat is gebaseerd op een ander werk. @nl
label: هو معالج كعمل لعبة فيديو @ar
definition: يربط عمل بعمل عبارة عن لعبة فيديو معتمدة على عمل آخر. @ar
toolkit label: معالج كعمل لعبة فيديو @ar
toolkit definition: عمل عبارة عن لعبة فيديو معتمدة على عمل آخر. @ar
label: adapteeritud videomänguna (teos) @et
definition: Seostab teose allikteosel põhineva videomänguga. @et
toolkit label: adapteeritud videomänguna (teos) @et
toolkit definition: Allikteosel põhinev videomäng. @et
label: è adattata come opera in forma di videogioco @it
definition: Correla un’opera a un videogioco basato su un’opera di partenza. @it
toolkit label: adattata come opera in forma di videogioco @it
toolkit definition: Videogioco basato su un’opera di partenza. @it
label: ir adaptēts kā videospēle (darbs) @lv
definition: Sasaista darbu ar darbu, kas ir videospēle veidota pēc pamatdarba. @lv
toolkit label: adaptēts kā darbs: videospēle @lv
toolkit definition: Videospēle veidota pēc pamatdarba. @lv
label: 被改编为视频游戏作品 @zh-hans
definition: 将一种作品与作为一种视频游戏并基于另一种作品的一种作品关联起来。 @zh-hans
toolkit label: 被改编为视频游戏作品 @zh-hans
toolkit definition: 作为一种视频游戏并基于另一种作品的一种作品 @zh-hans
has subproperty: P10249
label: video oyunu eseri olarak uyarlanmıştır @tr
definition: Bir eseri, başka bir eserden uyarlanan bir video oyunu olan bir eserle ilişkilendirir. @tr
toolkit label: Video oyunu çalışması olarak uyarlanan @tr
toolkit definition: Başka bir esere dayanan video oyunu olan bir çalışma. @tr

is adapted as video work
status: Published
definition: Relates a work to a work that is a video that is based on another work.
type: Property
domain: C10001
sub property of: is adapted as work
lexical alias: adaptedAsVideoWork.en
toolkit label: adapted as video work
toolkit definition: A work that is a video that is based on another work.
toolkit label: adapté en vidéo (œuvre) @fr
toolkit definition: Œuvre qui consiste en une vidéo basée sur une autre œuvre. @fr
toolkit label: adaptada como video (obra) @es
toolkit definition: Un video basado en la obra fuente. @es
instruction number: 24.5
label: er bearbejdet til videoværk @da
definition: Relaterer et værk til en video, baseret på et oprindeligt værk. @da
toolkit label: bearbejdet til videoværk @da
toolkit definition: Video, baseret på et oprindeligt værk. @da
definition: Met une œuvre en relation avec une œuvre qui consiste en une vidéo basée sur une autre œuvre. @fr
label: được phỏng theo như là video (tác phẩm) @vi
definition: Liên kết tác phẩm với video dựa trên tác phẩm nguồn. @vi
toolkit label: được phỏng theo như là video (tác phẩm) @vi
toolkit definition: Video dựa trên tác phẩm nguồn. @vi
label: ist bearbeitet als Video (Werk) @de
definition: Setzt ein Werk in Beziehung zu einem Video (Werk), das auf einem anderen Werk basiert. @de
toolkit label: Bearbeitet als Video (Werk) @de
toolkit definition: Ein Video (Werk), das auf einem anderen Werk basiert. @de
label: est adapté en vidéo (œuvre) @fr
definition: Liittää teoksen teokseen, joka on video, joka perustuu toiseen teokseen. @fi
toolkit label: videosovitus (teos) @fi
toolkit definition: Teos, joka on video, joka perustuu toiseen teokseen. @fi
toolkit label: bearbeidet som video (verk) @no
toolkit definition: En video basert på et kildeverk. @no
label: és adaptat com a obra de vídeo @ca
definition: Relaciona una obra amb una obra que és un vídeo que es basa en una altra obra. @ca
toolkit label: adaptat com a obra de vídeo @ca
toolkit definition: Obra que és un vídeo que es basa en una altra obra. @ca
has element type: 2
label: είναι προσαρμοσμένο ως βίντεο (έργο) @el
definition: Συνδέει ένα έργο με ένα βίντεο βασισμένο σε ένα έργο-πηγή. @el
toolkit label: προσαρμοσμένο ως βίντεο (έργο) @el
toolkit definition: Ένα βίντεο βασισμενο σε ένα έργο-πηγή. @el
label: videómű-átdolgozása a következő: @hu
definition: Egy művet hozzákapcsol egy forrásművön alapuló videóhoz. @hu
toolkit label: videómű-átdolgozása a következő: @hu
toolkit definition: Egy forrásművön alapuló videó. @hu
label: videosovitus (teos) @fi
label: er bearbeidet som video (verk) @no
definition: Relaterer et verk til en video basert på et kildeverk. @no
label: is bewerkt als videowerk @nl
definition: Relateert een werk aan een werk dat is een video die is gebaseerd op een ander werk. @nl
toolkit label: bewerkt als videowerk @nl
toolkit definition: Een werk dat is een video die is gebaseerd op een ander werk. @nl
label: هو معالج كعمل فيديو @ar
definition: يربط عمل بعمل عبارة عن فيديو مبني على عمل آخر. @ar
toolkit label: هو معالج كعمل فيديو @ar
toolkit definition: فيديو مبني على عمل آخر. @ar
label: adapteeritud videoteosena @et
definition: Seostab teose allikteosel põhineva videofilmiga. @et
toolkit label: adapteeritud videoteosena @et
toolkit definition: Allikteosel põhinev videofilm. @et
label: è adattata come opera in forma di video @it
definition: Correla un’opera a un video basato su un’opera di partenza. @it
toolkit label: adattata come opera in forma di video @it
toolkit definition: Video basato su un’opera di partenza. @it
label: ir adaptēts kā video (darbs) @lv
definition: Sasaista darbu ar darbu, kas ir video veidots pēc pamatdarba. @lv
toolkit label: adaptēts kā darbs: video @lv
toolkit definition: Video veidots pēc pamatdarba @lv
label: 被改编为视频作品 @zh-hans
definition: 将一种作品与作为基于另一种作品的一种视频的一种作品关联起来。 @zh-hans
toolkit label: 被改编为视频作品 @zh-hans
toolkit definition: 作为基于另一种作品的一种视频的一种作品 @zh-hans
has subproperty: P10087
label: video eseri olarak uyarlanmıştır @tr
definition: Bir eseri, başka bir eserden uyarlanmış video olan bir eserle ilişkilendirir. @tr
toolkit label: Video eseri olarak uyarlanan @tr
toolkit definition: Başka bir esere dayanan video olan bir çalışma. @tr

has video screenplay work
status: Published
definition: Relates a work to a work that is a textual work that complements a work that is a video.
type: Property
domain: C10001
sub property of: has screenplay work
lexical alias: videoScreenplayWork.en
toolkit label: video screenplay work
toolkit definition: A work that is a textual work that complements a work that is a video.
toolkit label: scénario de vidéo (œuvre) @fr
toolkit definition: Œuvre textuelle qui complète une œuvre consistant en une vidéo. @fr
toolkit label: guión de video (obra) @es
toolkit definition: Una obra que proporciona el texto para un video. @es
instruction number: 24.5
label: har videomanuskriptværk @da
definition: Relaterer et værk til et værk, som er et tekstværk, som komplementerer et værk, som er en video. @da
toolkit label: videomanuskriptværk @da
toolkit definition: Værk, som er et tekstværk, som komplementerer et værk, som er en video. @da
definition: Met une œuvre en relation avec une œuvre textuelle qui complète une œuvre consistant en une vidéo. @fr
label: tác phẩm kịch bản video @vi
definition: Liên kết tác phẩm với tác phẩm cung cấp văn bản cho video. @vi
toolkit label: kịch bản video (tác phẩm) @vi
toolkit definition: Tác phẩm cung cấp văn bản cho video. @vi
label: hat Videodrehbuch (Werk) @de
definition: Setzt ein Werk in Beziehung zu einem textlichen Werk, das ein Videowerk ergänzt. @de
toolkit label: Videodrehbuch (Werk) @de
toolkit definition: Ein textliches Werk, das ein Videowerk ergänzt. @de
label: a pour scénario de vidéo (œuvre) @fr
definition: Liittää teoksen teokseen, joka on tekstiteos, joka täydentää teosta, joka on video. @fi
toolkit label: videon käsikirjoitus (teos) @fi
toolkit definition: Teos, joka on tekstiteos, joka täydentää teosta, joka on video. @fi
toolkit label: videomanus (verk) @no
toolkit definition: Et verk som er et tekstlig verk som utfyller et verk som er en video. @no
label: té com a obra de guió de vídeo @ca
definition: Relaciona una obra amb una obra que és una obra textual que complementa una obra que és un vídeo. @ca
toolkit label: obra de guió de vídeo @ca
toolkit definition: Obra que és una obra textual que complementa una obra que és un vídeo. @ca
has element type: 2
label: είναι σενάριο βίντεο (έργο) @el
definition: Συνδέει ένα έργο με ένα έργο το οποίο παρέχει κείμενο για ένα βίντεο. @el
toolkit label: σενάριο βίντεο (έργο) @el
toolkit definition: Ένα έργο το οποίο παρέχει κείμενο για ένα βίντεο. @el
label: videóforgatókönyv-műve a következő: @hu
definition: Hozzákapcsol egy művet egy szöveges műhöz, amely kiegészít egy videóművet. @hu
toolkit label: videóforgatókönyvmű @hu
toolkit definition: Egy szöveges mű, amely kiegészít egy videóművet. @hu
label: videon käsikirjoitus (teos) @fi
label: har videomanus (verk) @no
definition: Relaterer et verk til et verk som er et tekstlig verk som utfyller et verk som er en video. @no
label: heeft videoscenariowerk @nl
definition: Relateert een werk aan een werk dat een tekstwerk is dat een werk complementeert dat een video is. @nl
toolkit label: videoscenariowerk @nl
toolkit definition: Een werk dat een tekstwerk is dat een werk complementeert dat een video is. @nl
label: له عمل سيناريو فيديو @ar
definition: يربط عمل بعمل عبارة عن عمل نصي يكمل عملًا عبارة عن فيديو. @ar
toolkit label: عمل سيناريو فيديو @ar
toolkit definition: عمل عبارة عن عمل نصي يكمل عملًا عبارة عن فيديو. @ar
label: videostsenaarium (teos) @et
definition: Seostab teose tekstteosega, mis täiendab videoteost. @et
toolkit label: videostsenaarium (teos) @et
toolkit definition: Tekstteos, mis täiendab videoteost. @et
label: ha come sceneggiatura per video opera @it
definition: Correla un’opera a un’opera testuale che completa un’opera che è un video. @it
toolkit label: sceneggiaatura per video opera @it
toolkit definition: Opera testuale che completa un’opera che è un video. @it
label: darbs: videoscenārijs @lv
definition: Sasaista darbu ar darbu, kas ir realizēts kā teksts, kas papildina darbu, kas ir video. @lv
toolkit label: darbs: videoscenārijs @lv
toolkit definition: Darbs, kas ir realizēts kā teksts, kas papildina darbu, kas ir video. @lv
label: 有视频剧本作品 @zh-hans
definition: 将一种作品与补充作为一种视频的一种作品的作为一种文字作品的一种作品关联起来。 @zh-hans
toolkit label: 视频剧本作品 @zh-hans
toolkit definition: 补充作为一种视频的一种作品的作为一种文字作品的一种作品 @zh-hans
has subproperty: P10164
label: video senaryosu eseri ile ilişkilidir @tr
definition: Bir eseri, video olan bir eseri tamamlayan metinsel bir eser olan bir eserle ilişkilendirir. @tr
toolkit label: video senaryo eseri @tr
toolkit definition: Video olan bir eseri tamamlayan metinsel bir çalışma. @tr

has video music work
status: Published
definition: Relates a work to a work that is a musical work that complements a work that is a video.
type: Property
domain: C10001
sub property of: has music work
lexical alias: videoMusicWork.en
toolkit label: video music work
toolkit definition: A work that is a musical work that complements a work that is a video.
toolkit label: musique de vidéo (œuvre) @fr
toolkit definition: Œuvre musicale qui complète une œuvre consistant en une vidéo. @fr
toolkit label: música de video (obra) @es
toolkit definition: Una obra musical utilizada en un video. @es
instruction number: 24.5
label: har videomusikværk @da
definition: Relaterer et værk til et musikværk, som komplementerer et værk, som er en video. @da
toolkit label: videomusikværk @da
toolkit definition: Musikværk, som komplementerer et værk, som er en video. @da
definition: Met une œuvre en relation avec une œuvre musicale qui complète une œuvre consistant en une vidéo. @fr
label: là âm nhạc video (tác phẩm) @vi
definition: Liên kết tác phẩm với tác phẩm âm nhạc được sử dụng trong video. @vi
toolkit label: âm nhạc video (tác phẩm) @vi
toolkit definition: Tác phẩm âm nhạc được sử dụng trong video. @vi
label: hat Videomusik (Werk) @de
definition: Setzt ein Werk in Beziehung zu einem Musikwerk, das ein Video ergänzt. @de
toolkit label: Videomusik (Werk) @de
toolkit definition: Ein Musikwerk, das ein Video ergänzt. @de
label: a pour musique de vidéo (œuvre) @fr
definition: Liittää teoksen musiikkiteokseen, joka täydentää teosta, joka on video. @fi
toolkit label: videon musiikki (teos) @fi
toolkit definition: Musiikkiteos, joka täydentää teosta, joka on video. @fi
toolkit label: videomusikk (verk) @no
toolkit definition: Et musikalsk verk som utfyller en video. @no
label: té com a obra de música de vídeo @ca
definition: Relaciona una obra amb una obra que és una obra musical que complementa una obra que és un vídeo. @ca
toolkit label: obra de música de vídeo @ca
toolkit definition: Obra que és una obra musical que complementa una obra que és un vídeo. @ca
has element type: 2
label: είναι βίντεο μουσική (έργο) @el
definition: Συνδέει ένα έργο με ένα μουσικό έργο το οποίο χρησιμοποιείται σε ένα βίντεο. @el
toolkit label: βίντεο μουσική (έργο) @el
toolkit definition: Ένα μουσικό έργο το οποίο χρησιμοποιείται σε ένα βίντεο. @el
label: videozene-műve a következő: @hu
definition: Hozzákapcsol egy művet egy zeneműhöz, amely kiegészít egy videóművet. @hu
toolkit label: videózenemű @hu
toolkit definition: Egy zenemű, amely kiegészít egy videóművet. @hu
label: videon musiikki (teos) @fi
label: har videomusikk (verk) @no
definition: Relaterer et verk til et musikalsk verk som utfyller en video. @no
label: heeft videomuziek-werk @nl
definition: Relateert een werk aan een muziekwerk dat een werk complementeert dat een video is. @nl
toolkit label: videomuziek-werk @nl
toolkit definition: Een muziekwerk dat een werk complementeert dat een video is. @nl
label: له عمل موسيقي لفيديو @ar
definition: يربط عمل بعمل موسيقي يكمل عملًا عبارة عن فيديو. @ar
toolkit label: عمل موسيقى لفيديو @ar
toolkit definition: عمل موسيقي يكمل عملًا عبارة عن فيديو. @ar
label: videofilmi muusika (teos) @et
definition: Seostab teose muusikateosega, mis täiendab videofilmina esinevat teost. @et
toolkit label: videofilmi muusika (teos) @et
toolkit definition: Muusikateos, mis täiendab videofilmina esinevat teost. @et
label: ha come musica da video opera @it
definition: Correla un’opera a un’opera musicale che completa un’opera che è un video. @it
toolkit label: musica da video opera @it
toolkit definition: Opera musicale che completa un’opera che è un video. @it
label: darbs: videomūzika @lv
definition: Sasaista darbu ar mūzikas darbu, kas papildina darbu, kas ir video. @lv
toolkit label: darbs: videomūzika @lv
toolkit definition: Mūzikas darbs, kas papildina darbu, kas ir video. @lv
label: 有视频音乐作品 @zh-hans
definition: 将一种作品与作为一种音乐作品并补充作为一种视频的一种作品的一种作品关联起来。 @zh-hans
toolkit label: 视频音乐作品 @zh-hans
toolkit definition: 作为一种音乐作品并补充作为一种视频的一种作品的一种作品 @zh-hans
has subproperty: P10239
label: video müziği eseri ile ilişkilidir @tr
definition: Bir eseri, video olan bir eser, tamamlayan müzik eseri olan bir eserle ilişkilendirir. @tr
toolkit label: video müziği eseri @tr
toolkit definition: Bir videoyu tamamlayan bir müzik eseri olan bir eser. @tr

is work analysed in
status: Published
definition: Relates a work to a work that describes the structure and composition of another work.
type: Property
domain: C10001
sub property of: is work described by
lexical alias: workAnalysedIn.en
toolkit label: work analysed in
toolkit definition: A work that describes the structure and composition of another work.
toolkit label: œuvre analysée dans @fr
toolkit definition: Œuvre qui décrit la structure et la composition d’une autre œuvre. @fr
toolkit label: analizada en (obra) @es
toolkit definition: Una obra que examina la obra fuente para identificar sus componentes y sus relaciones. @es
instruction number: 23.5
label: er værk analyseret i @da
definition: Relaterer et værk til et værk, som beskriver strukturen og sammensætning af et andet værk. @da
toolkit label: værk analyseret i @da
toolkit definition: Værk, som beskriver strukturen og sammensætning af et andet værk. @da
definition: Met une œuvre en relation avec une œuvre qui décrit la structure et la composition d’une autre œuvre. @fr
label: được phân tích trong (tác phẩm) @vi
definition: Liên kết tác phẩm với tác phẩm kiểm tra tác phẩm nguồn để nhận dạng các bộ phận cấu thành và quan hệ của chúng. @vi
toolkit label: được phân tích trong (tác phẩm) @vi
toolkit definition: Tác phẩm kiểm tra tác phẩm nguồn để nhận dạng các bộ phận cấu thành và quan hệ của chúng. @vi
label: ist Werk analysiert in @de
definition: Setzt ein Werk in Beziehung zu einem Werk, das den Aufbau und die Zusammensetzung eines anderen Werks beschreibt. @de
toolkit label: Werk analysiert in @de
toolkit definition: Ein Werk, das den Aufbau und die Zusammensetzung eines anderen Werks beschreibt. @de
label: est une œuvre analysée dans @fr
definition: Liittää teoksen teokseen, joka kuvaa toisen teoksen rakennetta ja koostumusta. @fi
toolkit label: teoksen analyysi @fi
toolkit definition: Teos, joka kuvaa toisen teoksen rakennetta ja koostumusta. @fi
toolkit label: verk analysert i @no
toolkit definition: Et verk som beskriver strukturen og oppbyggingen av et annet verk. @no
label: és obra analitzada en @ca
definition: Relaciona una obra amb una obra que descriu l’estructura i la composició d’una altra obra. @ca
toolkit label: obra analitzada en @ca
toolkit definition: Obra que descriu l’estructura i la composició d’una altra obra. @ca
has element type: 2
label: αναλύεται στο (έργο) @el
definition: Συνδέει ένα έργο με ένα έργο το οποίο εξετάζει ένα έργο-πηγή για την ταύτιση των συστατικών του και τις σχέσεις τους. @el
toolkit label: αναλύεται στο (έργο) @el
toolkit definition: Ένα έργο το οποίο εξετάζει ένα έργο-πηγή για την ταύτιση των συστατικών του και τις σχέσεις τους. @el
label: mű elemezve a következőben: @hu
definition: Hozzákapcsol egy művet egy műhöz, amelyet egy másik mű vizsgál, hogy leírhassa annak alkotóelemeit és azok viszonyait. @hu
toolkit label: mű elemezve a következőben: @hu
toolkit definition: Egy mű, amelyet egy másik mű vizsgál, hogy leírhassa annak alkotóelemeit és azok viszonyait. @hu
alternative label: analysed in (work)
alternative label: analysoitu teoksessa @fi
label: teoksen analyysi @fi
label: er verk analysert i @no
definition: Relaterer et verk til et verk som beskriver strukturen og oppbyggingen av et annet verk. @no
alternative label: analysert i (verk) @no
label: is werk geanalyseerd in @nl
definition: Relateert een werk aan een werk dat de structuur en compositie beschrijft van een ander werk. @nl
toolkit label: werk geanalyseerd in @nl
toolkit definition: Een werk dat de structuur en compositie beschrijft van een ander werk. @nl
label: هو عمل محلَّل في @ar
definition: يربط عمل بعمل يصف بنية عمل آخر وتكوينه. @ar
alternative label: محلَّل في (عمل) @ar
toolkit label: عمل محلَّل في @ar
toolkit definition: عمل يصف بنية عمل آخر وتكوينه. @ar
alternative label: analitzat en (obra) @ca
alternative label: analyseret i værk @da
label: teose analüüs @et
definition: Seostab teose teosega, milles kirjeldatakse teise teose struktuuri ja kompositsiooni. @et
toolkit label: teose analüüs @et
toolkit definition: Teos, milles kirjeldatakse teise teose struktuuri ja kompositsiooni. @et
alternative label: elemezve a következőben (mű): @hu
label: è opera analizzata in @it
definition: Correla un’opera a un’opera che descrive struttura e composizione di un’altra opera. @it
alternative label: analizzata in (opera) @it
toolkit label: opera analizzata in @it
toolkit definition: Opera che descrive struttura e composizione di un’altra opera. @it
alternative label: analysé dans (œuvre) @fr
label: ir darba analīze @lv
definition: Sasaista darbu ar darbu, kas analizē pamatdarba sastāvdaļas un to attiecības. @lv
toolkit label: darba analīze @lv
toolkit definition: Darbs, kas analizē pamatdarba sastāvdaļas un to attiecības. @lv
alternative label: Analysiert in (Werk) @de
alternative label: 被分析于（作品） @zh-hans
toolkit label: 被分析于……的作品 @zh-hans

is music for motion picture work
status: Published
definition: Relates a work to a work that is a motion picture that is complemented by a musical work.
type: Property
domain: C10001
sub property of: is music for work
lexical alias: musicForMotionPictureWork.en
toolkit label: music for motion picture work
toolkit definition: A work that is a motion picture that is complemented by a musical work.
toolkit label: musique pour un film (œuvre) @fr
toolkit definition: Œuvre cinématographique qui est complétée par une œuvre musicale. @fr
toolkit label: musica para película cinematográfica (obra) @es
toolkit definition: Una obra que utiliza la obra musical en una película. @es
instruction number: 24.5
label: er musik til filmværk @da
definition: Relaterer et værk til et værk, som er er en spillefilm, som er komplementeret af et musikværk. @da
toolkit label: musik til filmværk @da
toolkit definition: Værk, som er er en spillefilm, som er komplementeret af et musikværk. @da
definition: Met une œuvre en relation avec une œuvre cinématographique qui est complétée par une œuvre musicale. @fr
label: là âm nhạc cho điện ảnh (tác phẩm) @vi
definition: Liên kết tác phẩm với tác phẩm âm nhạc được sử dụng trong phim điện ảnh. @vi
toolkit label: âm nhạc cho điện ảnh (tác phẩm) @vi
toolkit definition: Tác phẩm âm nhạc được sử dụng trong phim điện ảnh. @vi
label: ist Musik für Film (Werk) @de
definition: Setzt ein Werk in Beziehung zu einem Filmwerk, das durch ein Musikwerk vervollständigt wird. @de
toolkit label: Musik für Film (Werk) @de
toolkit definition: Ein Filmwerk, das durch ein Musikwerk vervollständigt wird. @de
label: est une musique pour un film (œuvre) @fr
definition: Liittää teoksen teokseen, joka on elokuva, jota musiikkiteos täydentää. @fi
toolkit label: musiikki elokuvaan (teos) @fi
toolkit definition: Teos, joka on elokuva, jota musiikkiteos täydentää. @fi
toolkit label: filmmusikk for verk @no
toolkit definition: Et verk som er en spillefilm som utfylles av et musikalsk verk. @no
label: és música per a una obra de pel·lícula cinematogràfica @ca
definition: Relaciona una obra amb una obra que és una pel·lícula cinematogràfica que es complementa amb una obra musical. @ca
toolkit label: música per a una obra de pel·lícula cinematogràfica @ca
toolkit definition: Obra que és una pel·lícula cinematogràfica que es complementa amb una obra musical. @ca
has element type: 2
label: είναι μουσική για κινηματογραφική ταινία (έργο) @el
definition: Συνδέει ένα έργο με ένα έργο το οποίο χρησιμοποιεί ένα μουσικό έργο σε μια κινηματογραφική ταινία. @el
toolkit label: μουσική για κινηματογραφική ταινία (έργο) @el
toolkit definition: Ένα έργο το οποίο χρησιμοποιεί ένα μουσικό έργο σε μια κινηματογραφική ταινία. @el
label: filmzenéje a következő műnek: @hu
definition: Hozzákapcsol egy művet egy mozgókép-műhöz, amelyet egy zenemű egészít ki. @hu
toolkit label: zenével ellátott mozgóképmű: @hu
toolkit definition: Egy mozgókép-mű, amelyet egy zenemű egészít ki. @hu
label: musiikki elokuvaan (teos) @fi
label: er filmmusikk (verk) @no
definition: Relaterer et verk til et verk som er en spillefilm som utfylles av et musikalsk verk. @no
label: is muziek voor speelfilmwerk @nl
definition: Relateert een werk aan een werk dat een speelfilm is dat is gecomplementeerd door een muziekwerk. @nl
toolkit label: muziek voor speelfilmwerk @nl
toolkit definition: Een werk dat een speelfilm is dat is gecomplementeerd door een muziekwerk. @nl
label: هو موسيقى لعمل فيلم سينمائي @ar
definition: يربط عمل بعمل عبارة عن فيلم سينمائي يكمله عمل موسيقي. @ar
toolkit label: موسيقى لعمل فيلم سينمائي @ar
toolkit definition: عمل عبارة عن فيلم سينمائي يكمله عمل موسيقي. @ar
label: muusika filmile (teos) @et
definition: Seostab teose filmiteosega, mis on täiendatud muusikateosega. @et
toolkit label: muusika filmile (teos) @et
toolkit definition: Filmiteos, mis on täiendatud muusikateosega. @et
label: è musica per opera cinematografica @it
definition: Correla un’opera a un’opera che è un film che è completato da un’opera musicale. @it
toolkit label: musica per opera cinematografica @it
toolkit definition: Opera che è un film che è completato da un’opera musicale. @it
label: ir mūzika kino darbam @lv
definition: Sasaista darbu ar darbu, kas ir kinofilma, kurā izmantots muzikāls darbs. @lv
toolkit label: mūzika kino darbam @lv
toolkit definition: Darbs, kas ir kinofilma, kurā izmantots muzikāls darbs. @lv
label: 是用于电影作品的音乐 @zh-hans
definition: 将一种作品与作为一种电影并被一种音乐作品补充的一种作品关联起来。 @zh-hans
toolkit label: 用于电影作品的音乐 @zh-hans
toolkit definition: 作为一种电影并被一种音乐作品补充的一种作品 @zh-hans
has subproperty: P10245
label: sinema filmi eseri müziğidir @tr
definition: Bir eseri, bir müzik eseriyle tamamlanan bir sinema filmi olan bir eserle ilişkilendirir. @tr
toolkit label: sinema filmi çalışmasının müziği @tr
toolkit definition: Bir müzik eseriyle tamamlanan bir sinema filmi olan bir eser. @tr

has music work
status: Published
definition: Relates a work to a work that is a musical work that complements a work.
type: Property
domain: C10001
sub property of: is complemented by work
lexical alias: musicWork.en
toolkit label: music work
toolkit definition: A work that is a musical work that complements a work.
toolkit label: musique (œuvre) @fr
toolkit definition: Œuvre musicale qui complète une œuvre. @fr
toolkit label: música (obra) @es
toolkit definition: Una obra musical usada en una película, obra de teatro, programa de televisión, etc. @es
instruction number: 24.5
label: har musikværk @da
definition: Relaterer et værk til et musikværk, som komplementerer et værk. @da
toolkit label: musikværk @da
toolkit definition: Musikværk, som komplementerer et andet værk. @da
definition: Met une œuvre en relation avec une œuvre musicale qui complète une œuvre. @fr
label: là âm nhạc (tác phẩm) @vi
definition: Liên kết tác phẩm với tác phẩm âm nhạc được sử dụng trong phim điện ảnh, kịch, chương trình truyền hình, v.v... @vi
toolkit label: âm nhạc (tác phẩm) @vi
toolkit definition: Tác phẩm âm nhạc được sử dụng trong phim điện ảnh, kịch, chương trình truyền hình, v.v... @vi
label: hat Musik (Werk) @de
definition: Setzt ein Werk in Beziehung zu einem Musikwerk, das ein Werk ergänzt. @de
toolkit label: Musik (Werk) @de
toolkit definition: Ein Musikwerk, das ein Werk ergänzt. @de
label: a pour musique (œuvre) @fr
definition: Liittää teoksen musiikkiteokseen, joka täydentää teosta. @fi
toolkit label: musiikki (teos) @fi
toolkit definition: Musiikkiteos, joka täydentää teosta. @fi
toolkit label: musikk (verk) @no
toolkit definition: Et musikalsk verk som utfyller et verk. @no
label: té com a obra de música @ca
definition: Relaciona una obra amb una obra que és una obra musical que complementa una obra. @ca
toolkit label: obra de música @ca
toolkit definition: Obra que és una obra musical que complementa una obra. @ca
has element type: 2
label: είναι μουσική (έργο) @el
definition: Συνδέει ένα έργο με ένα μουσικό έργο που χρησιμοποιείται σε μια κινηματογραφική ταινία, ένα θεατρικό έργο, ένα τηλεοπτικό πρόγραμμα κ.λπ. @el
toolkit label: μουσική (έργο) @el
toolkit definition: Ένα μουσικό έργο που χρησιμοποιείται σε μια κινηματογραφική ταινία, ένα θεατρικό έργο, ένα τηλεοπτικό πρόγραμμα κ.λπ. @el
label: zenéje a következő mű: @hu
definition: Hozzákapcsol egy művet egy zeneműhöz, amely kiegészít egy művet. @hu
toolkit label: zenemű @hu
toolkit definition: Egy zenemű, amely kiegészít egy művet. @hu
label: musiikki (teos) @fi
label: har musikk (verk) @no
definition: Relaterer et verk til et musikalsk verk som utfyller et verk. @no
label: heeft muziekwerk @nl
definition: Relateert een werk aan een muziekwerk dat een werk complementeert. @nl
toolkit label: muziekwerk @nl
toolkit definition: Een muziekwerk dat een werk complementeert. @nl
label: له عمل موسيقي @ar
definition: يربط عمل بعمل موسيقي يكمل عملا. @ar
toolkit label: عمل موسيقي @ar
toolkit definition: عمل موسيقي يكمل عملا. @ar
label: muusika (teos) @et
definition: Seostab teose teost täiendava muusikateosega. @et
toolkit label: muusika (teos) @et
toolkit definition: Teost täiendav muusikateos. @et
label: ha come opera in forma di musica @it
definition: Correla un’opera a un’opera musicale che completa un’opera. @it
toolkit label: opera in forma di musica @it
toolkit definition: Opera musicale che completa un’opera. @it
label: darbs: mūzika @lv
definition: Sasaista darbu ar mūzikas darbu, kas papildina citu darbu. @lv
toolkit label: darbs: mūzika @lv
toolkit definition: Mūzikas darbs, kas papildina citu darbu. @lv
label: 有音乐作品 @zh-hans
definition: 将一种作品与作为一种音乐作品并补充一种作品的一种作品关联起来。 @zh-hans
toolkit label: 音乐作品 @zh-hans
toolkit definition: 作为一种音乐作品并补充一种作品的一种作品 @zh-hans
has subproperty: has motion picture music work
has subproperty: has incidental music work
has subproperty: has radio program music work
has subproperty: has television program music work
has subproperty: has video music work
has subproperty: P10237
label: müzik eseri ile ilişkilidir @tr

has numeric designation of musical work
status: Published
definition: Relates a work to a nomen that is a serial number, opus number, or thematic index number assigned to a musical work by a composer, publisher, or musicologist.
type: Property
domain: C10001
lexical alias: numericDesignationOfMusicalWork.en
instruction number: 6.16
toolkit label: numeric designation of musical work
toolkit definition: A nomen that is a serial number, opus number, or thematic index number assigned to a musical work by a composer, publisher, or musicologist.
toolkit label: désignation numérique d’une œuvre musicale @fr
toolkit definition: Nomen qui est un numéro d’ordre, un numéro d’opus ou un numéro de catalogue thématique attribué à une œuvre musicale par un compositeur, un éditeur ou un musicologue. @fr
toolkit label: designación numérica de una obra musical @es
toolkit definition: Un número seriado, número de opus o número de índice temático, asignado a una obra musical por el compositor, el editor o un musicólogo. @es
scope note: A designation includes a caption (e.g., no., op., BWV) and may include dates or other timespans, and alphanumeric or other characters.
label: har numerisk betegnelse for et musikværk @da
definition: Relaterer et værk til et serienummer, opusnummer eller værkfortegnelsesnummer tildelt et musikværk af en komponist, udgiver eller musikforsker. @da
scope note: Betegnelse omfatter en indledning (fx no., op., BWV) og den kan omfatte datoer eller andre tidsperioder, alfanumerisk tegnsæt eller andre skrifttegn. @da
toolkit label: numerisk betegnelse for et musikværk @da
toolkit definition: Serienummer, opusnummer eller værkfortegnelsesnummer tildelt et musikværk af en komponist, udgiver eller musikforsker. @da
definition: Met une œuvre en relation avec un nomen qui est un numéro d’ordre, un numéro d’opus ou un numéro de catalogue thématique attribué à une œuvre musicale par un compositeur, un éditeur ou un musicologue. @fr
label: có định danh số của tác phẩm âm nhạc @vi
definition: Liên kết tác phẩm với chỉ số tùng thư, chỉ số tác phẩm nghệ thuật, hoặc chỉ mục đề tài được người soạn, nhà xuất bản, hoặc nhà âm nhạc học gán cho tác phẩm âm nhạc , @vi
scope note: Định danh số của tác phẩm âm nhạc bao gồm cả đầu đề như là e.g., no., op., BWV, và có thể bao gồm chữ số, chữ cái, hoặc ký tự bất kỳ khác, hoặc tổ hợp của chúng. @vi
toolkit label: định danh số của tác phẩm âm nhạc @vi
toolkit definition: Chỉ số tùng thư, chỉ số tác phẩm nghệ thuật, hoặc chỉ mục đề tài được người soạn, nhà xuất bản, hoặc nhà âm nhạc học gán cho tác phẩm âm nhạc , @vi
label: ist numerische Bezeichnung eines Musikwerks @de
definition: Setzt ein Werk in Beziehung zu einer laufenden Nummer, einer Opus-Nummer oder einer Werkverzeichnisnummer, die einem Musikwerk durch eine Komponistin/einen Komponisten, einen Verlag oder eine Musikwissenschaftlerin/einen Musikwissenschaftler zugewiesen wird. @de
scope note: Darunter fallen einleitende Begriffe (zum Beispiel Nr., op., BWV) sowie gegebenenfalls Datumsangaben oder andere Zeiträume und alphanumerische oder andere Zeichen. @de
toolkit label: Numerische Bezeichnung eines Musikwerks @de
toolkit definition: Eine laufende Nummer, eine Opus-Nummer oder eine Werkverzeichnisnummer, die einem Musikwerk durch eine Komponistin/einen Komponisten, einen Verlag oder eine Musikwissenschaftlerin/einen Musikwissenschaftler zugewiesen wird. @de
label: a pour désignation numérique d’une œuvre musicale @fr
definition: Liittää teoksen nomeniin, joka on järjestysnumero, opusnumero tai temaattisen teosluettelon numero, jonka säveltäjä, kustantaja tai musiikintutkija on antanut musiikkiteokselle. @fi
toolkit label: musiikkiteoksen numerointi @fi
toolkit definition: Nomen, joka on järjestysnumero, opusnumero tai temaattisen teosluettelon numero, jonka säveltäjä, kustantaja tai musiikintutkija on antanut musiikkiteokselle. @fi
toolkit label: numerisk betegnelse for musikalsk verk @no
toolkit definition: Et serienummer, opusnummer eller nummer for tematisk verkfortegnelse som en komponist, utgiver eller musikkviter har gitt et musikalsk verk. @no
label: té com a designació numèrica d’una obra musical @ca
definition: Relaciona una obra amb un nomen que és un número d’ordre, número d’opus o número d’índex temàtic assignat a una obra musical per un compositor, un editor o un musicòleg. @ca
scope note: Una designació inclou una llegenda (per exemple, núm., op., BWV) i pot incloure dates o altres intervals de temps i caràcters alfanumèrics o altres caràcters. @ca
toolkit label: designació numèrica d’una obra musical @ca
toolkit definition: Nomen que és un número d’ordre, número d’opus o número d’índex temàtic assignat a una obra musical per un compositor, un editor o un musicòleg. @ca
scope note: Une désignation comprend un libellé (par exemple, no, op., BWV) et peut inclure des dates ou d’autres laps de temps ainsi que des caractères alphanumériques ou autres. @fr
sub property of: has identifier for work
has element type: 3
label: έχει αριθμητικό προσδιορισμό του μουσικού έργου @el
definition: Συνδέει ένα έργο με έναν σειριακό αριθμό, αριθμό έργου ή αριθμό θεματικού ευρετηρίου που ανατίθεται σε ένα μουσικό έργο από έναν συνθέτη, εκδότη ή μουσικολόγο. @el
scope note: Ένας αριθμητικός προσδιορισμός ενός μουσικού έργου περιλαμβάνει μια επικεφαλίδα όπως π.χ., no., op., BWV και μπορεί να περιλαμβάνει ένα αριθμητικό, ένα γράμμα, μια λέξη, οποιονδήποτε άλλο χαρακτήρα ή τον συνδυασμό τους. @el
toolkit label: αριθμητικός προσδιορισμός του μουσικού έργου @el
toolkit definition: Ένας σειριακός αριθμός, αριθμός έργου ή αριθμός θεματικού ευρετηρίου που ανατίθεται σε ένα μουσικό έργο από έναν συνθέτη, εκδότη ή μουσικολόγο. @el
label: zenemű számjelzése a következő: @hu
definition: Hozzákapcsol egy művet egy nomenhez, egy sorozati számhoz, opusszámhoz vagy tematikus indexszámhoz, amelyet egy zeneszerző, egy kiadó vagy egy zenetudós rendel hozzá egy zeneműhöz. @hu
scope note: Egy zenemű számjelzése magában foglalja az olyan feliratozást, mint például a pl., a no. az op., a BWV, és magába foglalhat egy számot, betűt, szót, bármely más karaktert, vagy ezek kombinációját. @hu
toolkit label: zeneműhöz tartozó számjelzés: @hu
toolkit definition: Egy nomen, egy sorozati szám, opusszám vagy tematikus indexszám, amelyet egy zeneszerző, egy kiadó vagy egy zenetudós rendel hozzá egy zeneműhöz. @hu
scope note: Numerointi sisältää otsikon (esim. nro, op., BWV) ja voi sisältää ajankohtia tai muita ajanjaksoja sekä aakkosnumeerisia tai muita merkkejä. @fi
label: musiikkiteoksen numerointi @fi
label: har numerisk betegnelse for musikalsk verk @no
definition: Relaterer et verk til et serienummer, opusnummer eller nummer for tematisk verkfortegnelse som en komponist, utgiver eller musikkviter har gitt et musikalsk verk. @no
scope note: En betegnelse inkluderer en tekst (f.eks. no., op., BWV) og kan inneholde datoer eller andre tidsspenn og alfanumeriske eller andre tegn. @no
label: heeft numerieke aanduiding van muziekwerk @nl
definition: Relateert een werk aan een nomen dat is een serienummer, opusnummer of thematische indexnummer toegekend aan een muziekwerk door een componist, uitgever of musicoloog. @nl
scope note: Een aanduiding omvat een opschrift (bijv. nr., op. BWV) en kan data of andere tijdspannes omvatten, en alfanumerieke of andere tekens. @nl
toolkit label: numerieke aanduiding van muziekwerk @nl
toolkit definition: Een nomen dat is een serienummer, opusnummer of thematische indexnummer toegekend aan een muziekwerk door een componist, uitgever of musicoloog. @nl
label: له تعيين رقمي لعمل موسيقي @ar
definition: يربط بين عمل وتسمية عبارة عن رقم تسلسلي، أو رقم قطعة موسيقية، أو رقم كشاف موضوعي مخصص لعمل موسيقي لملحن، أو ناشر، أو عالم موسيقى. @ar
scope note: يتضمن التعيين تعليقًا (مثل رقم، أو مرجع سابق، أو BWV) وقد يتضمن تواريخ أو فترات زمنية أخرى، وتمثيلات هجائية-رقمية أو تمثيلات أخرى. @ar
toolkit label: تعيين رقمي لعمل موسيقي @ar
toolkit definition: تسمية عبارة عن رقم تسلسلي، أو رقم قطعة موسيقية، أو رقم كشاف موضوعي مخصص لعمل موسيقي لملحن، أو ناشر، أو عالم موسيقى. @ar
label: muusikateose numbriline tähistus @et
definition: Seostab teose järjenumbri, oopuse numbri või temaatilise kataloogi numbriga, mille on muusikateosele määranud helilooja, kirjastaja või muusikateadlane. @et
scope note: Tähistus sisaldab vastavat täheühendit (nt nr, op., BWV) ja võib sisaldada daatumeid või muid ajavahemikke ning tähtnumbrilisi või muid märke @et
toolkit label: muusikateose numbriline tähistus @et
toolkit definition: Järjenumber, oopuse number või temaatilise kataloogi number, mille on muusikateosele määranud helilooja, kirjastaja või muusikateadlane. @et
label: ha come designazione numerica di opera musicale @it
definition: Correla un’opera a un numero sequenziale, numero di opera o numero di catalogo tematico assegnato a un'opera musicale da un compositore, un editore o un musicologo. @it
toolkit label: designazione numerica di opera musicale @it
toolkit definition: Numero sequenziale, numero di opera o numero di catalogo tematico assegnato a un'opera musicale da un compositore, un editore o un musicologo. @it
label: mūzikas darba numerācija @lv
definition: Sasaista darbu ar nomenu, kas ir mūzikas darba kārtas numurs, opusa numurs vai tematiskā rādītāja numurs, kuru piešķīris komponists, izdevējs vai muzikologs. @lv

is music for radio program work
status: Published
definition: Relates a work to a work that is a radio program that is complemented by a musical work.
type: Property
domain: C10001
sub property of: is music for work
lexical alias: musicForRadioProgramWork.en
toolkit label: music for radio program work
toolkit definition: A work that is a radio program that is complemented by a musical work.
toolkit label: musique pour une émission de radio (œuvre) @fr
toolkit definition: Œuvre qui consiste en une émission de radio qui est complétée par une œuvre musicale. @fr
toolkit label: música para programa radial (obra) @es
toolkit definition: Una obra que utiliza la obra musical en un programa de radio. @es
instruction number: 24.5
label: er musik til radioprogramværk @da
definition: Relaterer et værk til et værk, som er et radioprogram, som er komplementeres af et musikværk. @da
toolkit label: musik til radioprogramværk @da
toolkit definition: Værk, som er et radioprogram, som er komplementeres af et musikværk. @da
definition: Met une œuvre en relation avec une œuvre qui consiste en une émission de radio qui est complétée par une œuvre musicale. @fr
label: âm nhạc cho tác phẩm âm nhạc truyền thanh @vi
definition: Liên kết tác phẩm với tác phẩm sử dụng tác phẩm âm nhạc trong chương trình truyền thanh. @vi
toolkit label: âm nhạc cho tác phẩm âm nhạc truyền thanh @vi
toolkit definition: Tác phẩm sử dụng tác phẩm âm nhạc trong chương trình truyền thanh. @vi
label: ist Musik für Hörfunksendung (Werk) @de
definition: Setzt ein Werk in Beziehung zu einer Hörfunksendung (Werk), die durch ein Musikwerk vervollständigt wird. @de
toolkit label: Musik für Hörfunksendung (Werk) @de
toolkit definition: Eine Hörfunksendung (Werk), die durch ein Musikwerk vervollständigt wird. @de
label: est une musique pour une émission de radio (œuvre) @fr
definition: Liittää teoksen teokseen, joka on radio-ohjelma, jota musiikkiteos täydentää. @fi
toolkit label: musiikki radio-ohjelmaan (teos) @fi
toolkit definition: Teos, joka on radio-ohjelma, jota musiikkiteos täydentää. @fi
toolkit label: radiomusikk for verk @no
toolkit definition: Et verk som er et radioprogram som utfylles av et musikalsk verk. @no
label: és música per a una obra de programa radiofònic @ca
definition: Relaciona una obra amb una obra que és un programa radiofònic que es complementa amb una obra musical. @ca
toolkit label: música per a una obra de programa radiofònic @ca
toolkit definition: Obra que és un programa radiofònic que es complementa amb una obra musical. @ca
has element type: 2
label: είναι μουσική για ραδιοφωνικό πρόγραμμα (έργο) @el
definition: Συνδέει ένα έργο με ένα έργο το οποίο χρησιμοποιεί ένα μουσικό έργο σε ένα ραδιοφωνικό πρόγραμμα. @el
toolkit label: μουσική για ραδιοφωνικό πρόγραμμα (έργο) @el
toolkit definition: Ένα έργο το οποίο χρησιμοποιεί ένα μουσικό έργο σε ένα ραδιοφωνικό πρόγραμμα. @el
label: rádióműsor zenéje a következőnek: @hu
definition: Hozzákapcsol egy művet egy rádióműsor-műhöz, amelyet egy zenemű egészít ki. @hu
toolkit label: zenével ellátott rádióműsormű @hu
toolkit definition: Egy rádióműsor-mű, amelyet egy zenemű egészít ki. @hu
label: musiikki radio-ohjelmaan (teos) @fi
label: er radiomusikk for verk @no
definition: Relaterer et verk til et verk som er et radioprogram som utfylles av et musikalsk verk. @no
label: is muziek voor radioprogrammawerk @nl
definition: Relateert een werk aan een werk dat is een radioprogramma dat is gecomplementeerd door een muziekwerk. @nl
toolkit label: muziek voor radioprogrammawerk @nl
toolkit definition: Een werk dat is een radioprogramma dat is gecomplementeerd door een muziekwerk. @nl
label: هو موسيقى لعمل برنامج إذاعي @ar
definition: يربط عمل بعمل عبارة عن برنامج إذاعي يكمله عمل موسيقي. @ar
toolkit label: موسيقى لعمل برنامج إذاعي @ar
toolkit definition: عمل عبارة عن برنامج إذاعي يكمله عمل موسيقي. @ar
label: muusika raadiosaatele (teos) @et
definition: Seostab teose teosega, mis on muusikateosega täiendatud raadiosaade. @et
toolkit label: muusika raadiosaatele (teos) @et
toolkit definition: Teos, mis on muusikateosega täiendatud raadiosaade. @et
label: è musica per programma radiofonico opera @it
definition: Correla un’opera a un’opera che è un programma radiofonico che è completato da un’opera musicale. @it
toolkit label: musica per opera programma radiofonico @it
toolkit definition: Opera che è un programma radiofonico che è completato da un’opera musicale. @it
label: ir mūzika radio raidījuma darbam @lv
definition: Sasaista darbu ar darbu, kas ir radio raidījums, kurā izmantots mūzikas darbs. @lv
toolkit label: mūzika radio raidījuma darbam @lv
toolkit definition: Darbs, kas ir radio raidījums, kurā izmantots mūzikas darbs. @lv
label: 是用于广播节目作品的音乐 @zh-hans
definition: 将一种作品与作为一种广播节目并被一种音乐作品补充的一种作品关联起来。 @zh-hans
toolkit label: 用于广播节目作品的音乐 @zh-hans
toolkit definition: 作为一种广播节目并被一种音乐作品补充的一种作品 @zh-hans
has subproperty: P10244
label: radyo programı eseri müziğidir @tr
definition: Bir eseri, bir müzik eseriyle tamamlanan bir radyo programı olan bir eserle ilişkilendirir. @tr
toolkit label: radyo programı çalışmasının müziği @tr
toolkit definition: Bir müzikal eserle tamamlanan bir radyo programı olan bir çalışma @tr

is adapted as musical theatre work
status: Published
definition: Relates a work to a work that is a musical theatre work based on another work.
type: Property
domain: C10001
sub property of: is adapted as work
lexical alias: adaptedAsMusicalTheatreWork.en
toolkit label: adapted as musical theatre work
toolkit definition: A work that is a musical theatre work based on another work.
toolkit label: adapté au théâtre musical (œuvre) @fr
toolkit definition: Œuvre de théâtre musical basée sur une autre œuvre. @fr
toolkit label: adaptada como teatro musical (obra) @es
toolkit definition: Una obra de teatro musical basada en la obra fuente. @es
instruction number: 24.5
label: er bearbejdet til musikteaterværk @da
definition: Relaterer et værk til et musikteaterværk, baseret på et oprindeligt værk. @da
toolkit label: bearbejdet til musikteaterværk @da
toolkit definition: Musikteaterværk, baseret på et oprindeligt værk. @da
definition: Met une œuvre en relation avec une œuvre de théâtre musical basée sur une autre œuvre. @fr
label: được phỏng theo như là kịch bản âm nhạc (tác phẩm) @vi
definition: Liên kết tác phẩm với tác phẩm nhà hát âm nhạc dựa trên tác phẩm nguồn. @vi
toolkit label: được phỏng theo như là kịch bản âm nhạc (tác phẩm) @vi
toolkit definition: Tác phẩm nhà hát âm nhạc dựa trên tác phẩm nguồn. @vi
label: ist bearbeitet als Musiktheaterstück (Werk) @de
definition: Setzt ein Werk in Beziehung zu einem Musiktheaterwerk, das auf einem anderen Werk basiert. @de
toolkit label: Bearbeitet als Musiktheaterstück (Werk) @de
toolkit definition: Ein Musiktheaterwerk, das auf einem anderen Werk basiert. @de
label: est adapté au théâtre musical (œuvre) @fr
definition: Liittää teoksen toiseen teokseen perustuvaan musikaaliteokseen. @fi
toolkit label: musikaaliversio (teos) @fi
toolkit definition: Toiseen teokseen perustuva musikaaliteos. @fi
toolkit label: bearbeidet som musikal (verk) @no
toolkit definition: Et musikalverk basert på et kildeverk. @no
label: és adaptat com a obra de teatre musical @ca
definition: Relaciona una obra amb una obra que és una obra de teatre musical basada en una altra obra. @ca
toolkit label: adaptat com a obra de teatre musical @ca
toolkit definition: Una obra que és una obra de teatre musical basada en una altra obra. @ca
has element type: 2
label: είναι προσαρμοσμένο ως μουσικό θέατρο (έργο) @el
definition: Συνδέει ένα έργο με ένα μουσικοθεατρικό έργο βασισμένο σε ένα έργο-πηγή. @el
toolkit label: προσαρμοσμένο ως μουσικό θέατρο (έργο) @el
toolkit definition: Ένα μουσικοθεατρικό έργο βασισμένο σε ένα έργο-πηγή. @el
label: feldolgozva zeneszínházi műként: @hu
definition: Hozzákapcsol egy művet egy zeneszínházi műhöz, amely egy másik művön alapul. @hu
toolkit label: feldolgozva zeneszínházi műként: @hu
toolkit definition: Egy zeneszínházi mű, amely egy másik művön alapul. @hu
label: musikaaliversio (teos) @fi
label: er bearbeidet som musikal (verk) @no
definition: Relaterer et verk til et musikalverk basert på et kildeverk. @no
alternative label: adapted as musical theater work
label: is bewerkt als muziektheaterwerk @nl
definition: Relateert een werk aan een muziektheaterwerk gebaseerd op een ander werk. @nl
toolkit label: bewerkt als muziektheaterwerk @nl
toolkit definition: Een muziektheaterwerk gebaseerd op een ander werk. @nl
label: هو معالج كعمل مسرحي موسيقي @ar
definition: يربط عمل بعمل مسرحي موسيقي قائم على عمل آخر. @ar
toolkit label: معالج كعمل مسرحي موسيقي @ar
toolkit definition: عمل مسرحي موسيقي قائم على عمل آخر. @ar
label: adapteeritud muusikalina (teos) @et
definition: Seostab teose allikteosel põhineva muusikaliga. @et
toolkit label: adapteeritud muusikalina (teos) @et
toolkit definition: Allikteosel põhinev muusikal. @et
label: è adattata come opera teatro musicale @it
definition: Correla un’opera a un’opera in forma di teatro musicale basata su un’opera di partenza. @it
toolkit label: adattata come opera teatro musicale @it
toolkit definition: Opera in forma di teatro musicale basata su un’opera di partenza. @it
label: ir adaptēts kā muzikāls iestudējums (darbs) @lv
definition: Sasaista darbu ar muzikāls iestudējumu, kas veidots pēc cita darba. @lv
toolkit label: adaptēts kā darbs: muzikāls iestudējums @lv
toolkit definition: Muzikāls iestudējums veidots pēc cita darba. @lv
alternative label: معالج كعمل مسرحي موسيقي @ar
alternative label: sovitettu teoksen musikaaliversioksi @fi
label: 被改编为音乐戏剧作品 @zh-hans
definition: 将一种作品与作为基于另一种作品的一种音乐戏剧作品的一种作品关联起来。 @zh-hans
toolkit label: 被改编为音乐戏剧作品 @zh-hans
toolkit definition: 作为基于另一种作品的一种音乐戏剧作品的一种作品 @zh-hans
has subproperty: P10235
alternative label: müzik sahnesi eseri olarak uyarlanan @tr
label: müzikal tiyatro eseri olarak uyarlanmıştır @tr
definition: Bir eseri, başka bir eserden uyarlanan müzikal tiyatro eseri olan bir eserle ilişkilendirir. @tr

is music for television program work
status: Published
definition: Relates a work to a work that is a television program that is complemented by a musical work.
type: Property
domain: C10001
sub property of: is music for work
lexical alias: musicForTelevisionProgramWork.en
toolkit label: music for television program work
toolkit definition: A work that is a television program that is complemented by a musical work.
toolkit label: musique pour une émission de télévision (œuvre) @fr
toolkit definition: Œuvre qui consiste en une émission de télévision qui est complétée par une œuvre musicale. @fr
toolkit label: música para programa de televisión (obra) @es
toolkit definition: Una obra que utliza la obra musical en un programa de televisión. @es
instruction number: 24.5
label: er musik til tv-programværk @da
definition: Relaterer et værk til et værk, som er et tv-program, som komplementeres af et musikværk. @da
toolkit label: musik til tv-programværk @da
toolkit definition: Værk, som er et tv-program, som komplementeres af et musikværk. @da
definition: Met une œuvre en relation avec une œuvre qui consiste en une émission de télévision qui est complétée par une œuvre musicale. @fr
label: là âm nhạc cho chương trình truyền hình (tác phẩm) @vi
definition: Liên kết tác phẩm với tác phẩm sử dụng tác phẩm âm nhạc trong chương trình truyền hình. @vi
toolkit label: âm nhạc cho chương trình truyền hình (tác phẩm) @vi
toolkit definition: Tác phẩm sử dụng tác phẩm âm nhạc trong chương trình truyền hình. @vi
label: ist Musik für Fernsehsendung (Werk) @de
definition: Setzt ein Werk in Beziehung zu einer Fernsehsendung (Werk), die durch ein Musikwerk vervollständigt wird. @de
toolkit label: Musik für Fernsehsendung (Werk) @de
toolkit definition: Eine Fernsehsendung (Werk), die durch ein Musikwerk vervollständigt wird. @de
label: est une musique pour une émission de télévision (œuvre) @fr
definition: Liittää teoksen teokseen, joka on televisio-ohjelma, jota musiikkiteos täydentää. @fi
toolkit label: musiikki televisio-ohjelmaan (teos) @fi
toolkit definition: Teos, joka on televisio-ohjelma, jota musiikkiteos täydentää. @fi
toolkit label: fjernsynsmusikk for verk @no
toolkit definition: Et verk som er et fjernsynsprogram som utfylles av et musikalsk verk. @no
label: és música per a una obra de programa de televisió @ca
definition: Relaciona una obra amb una obra que és un programa de televisió que es complementa amb una obra musical. @ca
toolkit label: música per a una obra de programa de televisió @ca
toolkit definition: Obra que és un programa de televisió que es complementa amb una obra musical. @ca
has element type: 2
label: είναι μουσική για τηλεοπτικό πρόγραμμα (έργο) @el
definition: Συνδέει ένα έργο με ένα έργο το οποίο χρησιμοποιεί ένα μουσικό έργο σε ένα τηλεοπτικό πρόγραμμα. @el
toolkit label: μουσική για τηλεοπτικό πρόγραμμα (έργο) @el
toolkit definition: Ένα έργο το οποίο χρησιμοποιεί ένα μουσικό έργο σε ένα τηλεοπτικό πρόγραμμα. @el
label: tévéműsor zenéje a következőnek: @hu
definition: Hozzákapcsol egy művet egy televízióműsor-műhöz, amelyet egy zenemű egészít ki. @hu
toolkit label: zenével ellátott tévéműsormű @hu
toolkit definition: Egy televízióműsor-mű, amelyet egy zenemű egészít ki. @hu
label: musiikki televisio-ohjelmaan (teos) @fi
label: er fjernsynsmusikk for verk @no
definition: Relaterer et verk til et verk som er et fjernsynsprogram som utfylles av et musikalsk verk. @no
label: is muziek voor televisieprogrammawerk @nl
definition: Relateert een werk aan een werk dat is een televisieprogramma dat is gecomplementeerd door een muziekwerk. @nl
toolkit label: muziek voor televisieprogrammawerk @nl
toolkit definition: Een werk dat is een televisieprogramma dat is gecomplementeerd door een muziekwerk. @nl
label: هو موسيقى لعمل برنامج تليفزيوني @ar
definition: يربط عمل بعمل عبارة عن برنامج تليفزيوني يكمله عمل موسيقي. @ar
toolkit label: موسيقى لعمل برنامج تليفزيوني @ar
toolkit definition: عمل عبارة عن برنامج تليفزيوني يكمله عمل موسيقي. @ar
label: muusika telesaatele (teos) @et
definition: Seostab teose teosega, mis on muusikateosega täiendatud telesaade. @et
toolkit label: muusika telesaatele (teos) @et
toolkit definition: Teos, mis on muusikateosega täiendatud telesaade. @et
label: è musica per programma televisivo opera @it
definition: Correla un’opera a un’opera che è un programma televisivo che è completato da un’opera musicale. @it
toolkit label: musica per programma televisivo opera @it
toolkit definition: Opera che è un programma televisivo che è completato da un’opera musicale. @it
label: ir mūzika televīzijas raidījuma darbam @lv
definition: Sasaista darbu ar darbu, kas ir televīzijas raidījums, kurā izmantots mūzikas darbs. @lv
toolkit label: mūzika televīzijas raidījuma darbam @lv
toolkit definition: Darbs, kas ir televīzijas raidījums, kurā izmantots mūzikas darbs. @lv
label: 是用于电视节目作品的音乐 @zh-hans
definition: 将一种作品与作为一种电视节目并被一种音乐作品补充的一种作品关联起来。 @zh-hans
toolkit label: 用于电视节目作品的音乐 @zh-hans
toolkit definition: 作为一种电视节目并被一种音乐作品补充的一种作品 @zh-hans
has subproperty: P10242
label: televizyon programı eseri müziğidir @tr
definition: Bir eseri, bir müzik eseri tarafından tamamlanan bir televizyon programı olan bir eserle ilişkilendirir. @tr
toolkit label: televizyon programı çalışmasının müziği @tr
toolkit definition: Bir müzikal eser tarafından tamamlanan bir televizyon programı olan bir çalışma. @tr

is music for video work
status: Published
definition: Relates a work to a work that is a video that is complemented by a musical work.
type: Property
domain: C10001
sub property of: is music for work
lexical alias: musicForVideoWork.en
toolkit label: music for video work
toolkit definition: A work that is a video that is complemented by a musical work.
toolkit label: musique pour une vidéo (œuvre) @fr
toolkit definition: Œuvre qui consiste en une vidéo qui est complétée par une œuvre musicale. @fr
toolkit label: música para video (obra) @es
toolkit definition: Una obra que utiliza la obra musical en un video. @es
instruction number: 24.5
label: er musik til videoværk @da
definition: Relaterer et værk til et værk, som er en video, som komplementeres af et musikværk. @da
toolkit label: musik til videoværk @da
toolkit definition: Værk, som er en video, som komplementeres af et musikværk. @da
definition: Met une œuvre en relation avec une œuvre qui consiste en une vidéo qui est complétée par une œuvre musicale. @fr
label: là âm nhạc cho video (tác phẩm) @vi
definition: Liên kết tác phẩm với tác phẩm sử dụng tác phẩm âm nhạc trong video. @vi
toolkit label: âm nhạc cho video (tác phẩm) @vi
toolkit definition: Tác phẩm sử dụng tác phẩm âm nhạc trong video. @vi
label: ist Musik für Video (Werk) @de
definition: Setzt ein Werk in Beziehung zu einem Video (Werk), das durch ein Musikwerk vervollständigt wird. @de
toolkit label: Musik für Video (Werk) @de
toolkit definition: Ein Video (Werk), das durch ein Musikwerk vervollständigt wird. @de
label: est une musique pour une vidéo (œuvre) @fr
definition: Liittää teoksen teokseen, joka on video, jota musiikkiteos täydentää. @fi
toolkit label: musiikki videoon (teos) @fi
toolkit definition: Teos, joka on video, jota musiikkiteos täydentää. @fi
toolkit label: videomusikk for verk @no
toolkit definition: Et verk som er en video som utfylles av et musikalsk verk. @no
label: és música per a una obra de vídeo @ca
definition: Relaciona una obra amb una obra que és un vídeo que es complementa amb una obra musical. @ca
toolkit label: música per a una obra de vídeo @ca
toolkit definition: Obra que és un vídeo que es complementa amb una obra musical. @ca
has element type: 2
label: είναι μουσική για βίντεο (έργο) @el
definition: Συνδέει ένα έργο με ένα έργο το οποίο χρησιμοποιεί ένα μουσικό έργο σε ένα βίντεο. @el
toolkit label: μουσική για βίντεο (έργο) @el
toolkit definition: Ένα έργο το οποίο χρησιμοποιεί ένα μουσικό έργο σε ένα βίντεο. @el
label: videózenéje a következőnek: @hu
definition: Hozzákapcsol egy művet egy videóműhöz, amelyet egy zenemű egészít ki. @hu
toolkit label: zenével ellátott videómű @hu
toolkit definition: Egy mű, amelyet egy zenemű egészít ki. @hu
label: musiikki videoon (teos) @fi
label: er videomusikk for verk @no
definition: Relaterer et verk til et verk som utfylles av et musikalsk verk i en video. @no
label: is muziek voor videowerk @nl
definition: Relateert een werk aan een werk dat een video is dat is gecomplementeerd door een muziekwerk. @nl
toolkit label: muziek voor videowerk @nl
toolkit definition: Een werk dat een video is dat is gecomplementeerd door een muziekwerk. @nl
label: هو موسيقى لعمل فيديوي @ar
definition: يربط عمل بعمل فيديوي مكمل بعمل موسيقي. @ar
toolkit label: موسيقى لعمل فيديوي @ar
toolkit definition: عمل فيديوي يكمله عمل موسيقي. @ar
label: muusika videofilmile (teos) @et
definition: Seostab teose teosega, mis on muusikateosega täiendatud videofilm. @et
toolkit label: muusika videofilmile (teos) @et
toolkit definition: Teos, mis on muusikateosega täiendatud videofilm. @et
label: è musica per video opera @it
definition: Correla un’opera a un’opera che è un video che è completato da un’opera musicale. @it
toolkit label: musica per video opera @it
toolkit definition: Opera che è un video che è completato da un’opera musicale. @it
label: ir mūzika video darbam @lv
definition: Sasaista darbu ar darbu, kas ir video, kurā izmantots muzikāls darbs. @lv
toolkit label: mūzika video darbam @lv
toolkit definition: Darbs, kas ir video, kurā izmantots muzikāls darbs. @lv
label: 是用于视频作品的音乐 @zh-hans
definition: 将一种作品与作为一种视频并被一种音乐作品补充的一种作品关联起来。 @zh-hans
toolkit label: 用于视频作品的音乐 @zh-hans
toolkit definition: 作为一种视频并被一种音乐作品补充的一种作品 @zh-hans
has subproperty: P10240
label: video eseri müziğidir @tr
definition: Bir eseri, bir müzik eseriyle tamamlanan bir video olan bir eserle ilişkilendirir. @tr
toolkit label: video çalışması müziği @tr
toolkit definition: Bir müzik eseriyle tamamlanan video olan bir çalışma. @tr

Published
type: Concept

Deprecated
type: Concept

has collection accrual method
status: Published
definition: Relates a work to a method of transfer of custodianship of the items that are added to a manifestation of a collection work.
type: Property
domain: C10001
lexical alias: collectionAccrualMethod.en
has element type: 4
toolkit label: collection accrual method
toolkit definition: A method of transfer of custodianship of the items that are added to a manifestation of a collection work.
toolkit definition: Kokoelmateoksen manifestaatioon lisättävien kappaleiden haltijuuden siirron menetelmä. @fi
toolkit label: kokoelman kartuntamenetelmä @fi
definition: Liittää teoksen kokoelmateoksen manifestaatioon lisättävien kappaleiden haltijuuden siirron menetelmään. @fi
label: kokoelman kartuntamenetelmä @fi
label: 有收藏增加方法 @zh-hans
definition: 将一种作品与被增加到一种收藏作品的一种载体表现中去的单件的保管权转移的方法关联起来。 @zh-hans
toolkit label: 收藏增加方法 @zh-hans
toolkit definition: 被增加到一种收藏作品的一种载体表现中去的单件的保管权转移的方法 @zh-hans
label: té mètode d’acumulació de col·lecció de recursos @ca
definition: Relaciona una obra amb un mètode de transferència de custòdia dels ítems que s’afegeixen a una manifestació d’una obra de col·lecció de recursos. @ca
toolkit label: mètode d’acumulació de col·lecció de recursos @ca
toolkit definition: Mètode de transferència de custòdia dels ítems que s’afegeixen a una manifestació d’una obra de col·lecció de recursos. @ca
label: a pour méthode d’enrichissement d’une collection de ressources @fr
definition: Met une œuvre en relation avec une méthode de transfert de la garde des items ajoutés à une manifestation d’une œuvre de collection de ressources. @fr
toolkit label: méthode d’enrichissement d’une collection de ressources @fr
toolkit definition: Méthode de transfert de la garde des items ajoutés à une manifestation d’une œuvre de collection de ressources. @fr
has subproperty: P10608
label: koleksiyon sağlama yöntemi ile ilişkilidir @tr
definition: Bir eseri, bir koleksiyon eserinin gösterimine eklenen kopyaların gözetim aktarma yöntemiyle ilişkilendirir. @tr
toolkit label: koleksiyon tahakkuk yöntemi @tr
toolkit definition: Bir koleksiyon eserinin gösterimine eklenen kopyaların gözetimin devrine ilişkin bir yöntem. @tr

has collection accrual policy
status: Published
definition: Relates a work to a policy for selecting items that are added to a manifestation of a collection work.
type: Property
domain: C10001
lexical alias: collectionAccrualPolicy.en
has element type: 4
toolkit label: collection accrual policy
toolkit definition: A policy for selecting items that are added to a manifestation of a collection work.
toolkit definition: Kokoelmateoksen manifestaatioon lisättävien kappaleiden valitsemisen linja. @fi
toolkit label: kokoelman kartuttamisen linja @fi
definition: Liittää teoksen kokoelmateoksen manifestaatioon lisättävien kappaleiden valitsemisen linjaan. @fi
label: kokoelman kartuttamisen linja @fi
label: 有收藏增加政策 @zh-hans
definition: 将一种作品与被增加到一种收藏作品的一种载体表现中去的单件的选择政策关联起来。 @zh-hans
toolkit label: 收藏增加政策 @zh-hans
toolkit definition: 被增加到一种收藏作品的一种载体表现中去的单件的选择政策 @zh-hans
label: té política d’acumulació de col·lecció de recursos @ca
definition: Relaciona una obra amb una política de selecció d’ítems que s’afegeixen a una manifestació d’una obra de col·lecció de recursos. @ca
toolkit label: política d’acumulació de col·lecció de recursos @ca
toolkit definition: Política de selecció d’ítems que s’afegeixen a una manifestació d’una obra de col·lecció de recursos. @ca
label: a pour politique d’enrichissement d’une collection de ressources @fr
definition: Met une œuvre en relation avec une politique de sélection des items ajoutés à une manifestation d’une œuvre de collection de ressources. @fr
toolkit label: politique d’enrichissement d’une collection de ressources @fr
toolkit definition: Politique de sélection des items ajoutés à une manifestation d’une œuvre de collection de ressources. @fr
has subproperty: P10609
label: koleksiyon sağlama politikası ile ilişkilidir @tr
definition: Bir eseri, koleksiyon çalışmasının gösterimine eklenen kopyaların seçilmesine yönelik bir ilkeyle ilişkilendirir. @tr
toolkit label: koleksiyon tahakkuk politikası @tr
toolkit definition: Bir koleksiyon eserinin gösterimine eklenen kopyaların seçilmesine yönelik bir ilke @tr

is metadata description of agent
status: Published
definition: Relates a work to an agent that is described by a metadata work.
type: Property
domain: C10001
lexical alias: metadataDescriptionOfAgent.en
has element type: 2
toolkit label: metadata description of agent
toolkit definition: An agent that is described by a metadata work.
sub property of: is description of agent
toolkit definition: Metatietoteoksen kuvailema toimija. @fi
toolkit label: metatietokuvailu toimijasta @fi
definition: Liittää teoksen metatietoteoksen kuvailemaan toimijaan. @fi
label: metatietokuvailu toimijasta @fi
label: 是行为者的元数据描述 @zh-hans
definition: 将一种作品与被一种元数据作品描述的一个行为者关联起来。 @zh-hans
toolkit label: 行为者的元数据描述 @zh-hans
toolkit definition: 被一种元数据作品描述的一个行为者 @zh-hans
label: és descripció de metadades d’agent @ca
definition: Relaciona una obra amb un agent que és descrit per una obra de metadades. @ca
toolkit label: descripció de metadades d’agent @ca
toolkit definition: Un agent que és descrit per una obra de metadades. @ca
label: est une description par métadonnées d’un agent @fr
definition: Met une œuvre en relation avec un agent qui est décrit par une œuvre de métadonnées. @fr
toolkit label: description par métadonnées d’un agent @fr
toolkit definition: Agent qui est décrit par une œuvre de métadonnées. @fr
has subproperty: is metadata description of collective agent
has subproperty: is metadata description of person
has subproperty: P10610
label: temsilcinin üstveri tanımlamasıdır @tr
definition: Bir eseri, bir üstveri eseri tarafından açıklanan bir temsilciyle ilişkilendirir. @tr
toolkit label: Temsilcinin üstveri tanımlaması @tr
toolkit definition: Bir üst veri çalışması tarafından tanımlanan bir temsilci @tr

is metadata description of collective agent
status: Published
definition: Relates a work to a collective agent that is described by a metadata work.
type: Property
domain: C10001
lexical alias: metadataDescriptionOfCollectiveAgent.en
has element type: 2
toolkit label: metadata description of collective agent
toolkit definition: A collective agent that is described by a metadata work.
sub property of: is description of collective agent
sub property of: is metadata description of agent
toolkit definition: Metatietoteoksen kuvailema yhteistoimija. @fi
toolkit label: metatietokuvailu yhteistoimijasta @fi
definition: Liittää teoksen metatietoteoksen kuvailemaan yhteistoimijaan. @fi
label: metatietokuvailu yhteistoimijasta @fi
label: 是集体行为者的元数据描述 @zh-hans
definition: 将一种作品与被一种元数据作品描述的一个集体行为者关联起来。 @zh-hans
toolkit label: 集体行为者的元数据描述 @zh-hans
toolkit definition: 被一种元数据作品描述的一个集体行为者 @zh-hans
label: és descripció de metadades d’agent col·lectiu @ca
definition: Relaciona una obra amb un agent col·lectiu que és descrit per una obra de metadades. @ca
toolkit label: descripció de metadades d’agent col·lectiu @ca
toolkit definition: Un agent col·lectiu que és descrit per una obra de metadades. @ca
label: est une description par métadonnées d’un agent collectif @fr
definition: Met une œuvre en relation avec un agent collectif qui est décrit par une œuvre de métadonnées. @fr
toolkit label: description par métadonnées d’un agent collectif @fr
toolkit definition: Agent collectif qui est décrit par une œuvre de métadonnées. @fr
has subproperty: is metadata description of corporate body
has subproperty: is metadata description of family
has subproperty: P10611
label: kolektif temsilcinin üstveri tanımlamasıdır @tr
definition: Bir eseri, üstveri eseri tarafından tanımlanan kolektif temsilci ile ilişkilendirir. @tr
toolkit label: Kolektif temsilcinin üstveri tanımlaması @tr
toolkit definition: bir üst veri çalışması tarafından tanımlanan kolektif bir temsilci @tr

is metadata description of corporate body
status: Published
definition: Relates a work to a corporate body that is described by a metadata work.
type: Property
domain: C10001
lexical alias: metadataDescriptionOfCorporateBody.en
has element type: 2
toolkit label: metadata description of corporate body
toolkit definition: A corporate body that is described by a metadata work.
sub property of: is description of corporate body
sub property of: is metadata description of collective agent
toolkit definition: Metatietoteoksen kuvailema yhteisö. @fi
toolkit label: metatietokuvailu yhteisöstä @fi
definition: Liittää teoksen metatietoteoksen kuvailemaan yhteisöön. @fi
label: metatietokuvailu yhteisöstä @fi
label: 是团体的元数据描述 @zh-hans
definition: 将一种作品与被一种元数据作品描述的一个团体关联起来。 @zh-hans
toolkit label: 团体的元数据描述 @zh-hans
toolkit definition: 被一种元数据作品描述的一个团体 @zh-hans
label: és descripció de metadades d’entitat corporativa @ca
definition: Relaciona una obra amb una entitat corporativa que és descrita per una obra de metadades. @ca
toolkit label: descripció de metadades d’entitat corporativa @ca
toolkit definition: Entitat corporativa que és descrita per una obra de metadades. @ca
label: est une description par métadonnées d’une collectivité @fr
definition: Met une œuvre en relation avec une collectivité qui est décrite par une œuvre de métadonnées. @fr
toolkit label: description par métadonnées d’une collectivité @fr
toolkit definition: Collectivité qui est décrite par une œuvre de métadonnées. @fr
has subproperty: P10612
label: tüzel kişinin üstveri tanımlamasıdır @tr
definition: Bir eseri, bir üstveri eseriyle tanımlanan tüzel kişi ile ilişkilendirir. @tr
toolkit label: Tüzel kişiliğin üstverisinin tanımlaması @tr
toolkit definition: Bir üst veri çalışması tarafından tanımlanan bir tüzel kişilik @tr

is metadata description of family
status: Published
definition: Relates a work to a family that is described by a metadata work.
type: Property
domain: C10001
lexical alias: metadataDescriptionOfFamily.en
has element type: 2
toolkit label: metadata description of family
toolkit definition: A family that is described by a metadata work.
sub property of: is description of family
sub property of: is metadata description of collective agent
toolkit definition: Metatietoteoksen kuvailema suku. @fi
toolkit label: metatietokuvailu suvusta @fi
definition: Liittää teoksen metatietoteoksen kuvailemaan sukuun. @fi
label: metatietokuvailu suvusta @fi
label: 是家族的元数据描述 @zh-hans
definition: 将一种作品与被一种元数据作品描述的一个家族关联起来。 @zh-hans
toolkit label: 家族的元数据描述 @zh-hans
toolkit definition: 被一种元数据作品描述的一个家族 @zh-hans
label: és descripció de metadades de família @ca
definition: Relaciona una obra amb una família que és descrita per una obra de metadades. @ca
toolkit label: descripció de metadades de família @ca
toolkit definition: Família que és descrita per una obra de metadades. @ca
label: est une description par métadonnées d’une famille @fr
definition: Met une œuvre en relation avec une famille qui est décrite par une œuvre de métadonnées. @fr
toolkit label: description par métadonnées d’une famille @fr
toolkit definition: Famille qui est décrite par une œuvre de métadonnées. @fr
has subproperty: P10613
label: ailenin üstveri tanımlasıdır @tr
definition: Bir eseri, bir üstveri eseri tarafından tanımlanan bir aileyle ilişkilendirir. @tr
toolkit label: Ailenin üstveri tanımlaması. @tr
toolkit definition: Bir üst veri çalışması tarafından tanımlanan bir aile @tr

is metadata description of person
status: Published
definition: Relates a work to a person that is described by a metadata work.
type: Property
domain: C10001
lexical alias: metadataDescriptionOfPerson.en
has element type: 2
toolkit label: metadata description of person
toolkit definition: A person that is described by a metadata work.
sub property of: is description of person
sub property of: is metadata description of agent
toolkit definition: Metatietoteoksen kuvailema henkilö. @fi
toolkit label: metatietokuvailu henkilöstä @fi
definition: Liittää teoksen metatietoteoksen kuvailemaan henkilöön. @fi
label: metatietokuvailu henkilöstä @fi
label: 是个人的元数据描述 @zh-hans
definition: 将一种作品与被一种元数据作品描述的一个个人关联起来。 @zh-hans
toolkit label: 个人的元数据描述 @zh-hans
toolkit definition: 被一种元数据作品描述的一个个人 @zh-hans
label: és descripció de metadades de persona @ca
definition: Relaciona una obra amb una persona que és descrita per una obra de metadades. @ca
toolkit label: descripció de metadades de persona @ca
toolkit definition: Persona que és descrita per una obra de metadades. @ca
label: est une description par métadonnées d’une personne @fr
definition: Met une œuvre en relation avec une personne qui est décrite par une œuvre de métadonnées. @fr
toolkit label: description par métadonnées d’une personne @fr
toolkit definition: Personne qui est décrite par une œuvre de métadonnées. @fr
has subproperty: P10614
label: kişinin üstveri tanımlamasıdır @tr
definition: Bir eseri, bir üstveri eseri tarafından tanımlanan bir kişi ile ilişkilendirir. @tr
toolkit label: Kişinin üstveri tanımlaması @tr
toolkit definition: Üst veri çalışması tarafından tanımlanan bir kişidir. @tr

is metadata description of expression
status: Published
definition: Relates a work to an expression that is described by a metadata work.
type: Property
domain: C10001
lexical alias: metadataDescriptionOfExpression.en
has element type: 2
toolkit label: metadata description of expression
toolkit definition: An expression that is described by a metadata work.
sub property of: is description of expression
toolkit definition: Metatietoteoksen kuvailema ekspressio. @fi
toolkit label: metatietokuvailu ekspressiosta @fi
definition: Liittää teoksen metatietoteoksen kuvailemaan ekspressioon. @fi
label: metatietokuvailu ekspressiosta @fi
label: 是内容表达的元数据描述 @zh-hans
definition: 将一种作品与被一种元数据作品描述的一种内容表达关联起来。 @zh-hans
toolkit label: 内容表达的元数据描述 @zh-hans
toolkit definition: 被一种元数据作品描述的一种内容表达 @zh-hans
label: és descripció de metadades d’expressió @ca
definition: Relaciona una obra amb una expressió que és descrita per una obra de metadades. @ca
toolkit label: descripció de metadades d’expressió @ca
toolkit definition: Expressió que és descrita per una obra de metadades. @ca
label: est une description par métadonnées d’une expression @fr
definition: Met une œuvre en relation avec une expression qui est décrite par une œuvre de métadonnées. @fr
toolkit label: description par métadonnées d’une expression @fr
toolkit definition: Expression qui est décrite par une œuvre de métadonnées. @fr
has subproperty: P10615
label: anlatımın üstveri tanımlamasıdır @tr
definition: Bir eseri, bir üst veri eseri tarafından tanımlanan bir anlatımla ilişkilendirir. @tr
toolkit label: İfadenin üstverisinin tanımlaması @tr
toolkit definition: Bir üst veri eseri tarafından tanımlanan bir anlatım. @tr

is metadata description of item
status: Published
definition: Relates a work to an item that is described by a metadata work.
type: Property
domain: C10001
lexical alias: metadataDescriptionOfItem.en
has element type: 2
toolkit label: metadata description of item
toolkit definition: An item that is described by a metadata work.
sub property of: is description of item
toolkit definition: Metatietoteoksen kuvailema kappale. @fi
toolkit label: metatietokuvailu kappaleesta @fi
definition: Liittää teoksen metatietoteoksen kuvailemaan kappaleeseen. @fi
label: metatietokuvailu kappaleesta @fi
label: 是单件的元数据描述 @zh-hans
definition: 将一种作品与被一种元数据作品描述的一个单件关联起来。 @zh-hans
toolkit label: 单件的元数据描述 @zh-hans
toolkit definition: 被一种元数据作品描述的一个单件 @zh-hans
label: és descripció de metadades d’ítem @ca
definition: Relaciona una obra amb un ítem que és descrit per una obra de metadades. @ca
toolkit label: descripció de metadades d’ítem @ca
toolkit definition: Ítem que és descrit per una obra de metadades. @ca
label: est une description par métadonnées d’un item @fr
definition: Met une œuvre en relation avec un item qui est décrit par une œuvre de métadonnées. @fr
toolkit label: description par métadonnées d’un item @fr
toolkit definition: Item qui est décrit par une œuvre de métadonnées. @fr
has subproperty: P10616
label: kopyanın üstveri tanımlamasıdır @tr
definition: Bir eseri, bir üstveri eseri tarafından tanımlanan bir kopyayla ilişkilendirir. @tr
toolkit label: Kopyanın üstveri tanımlaması @tr
toolkit definition: Bir üst veri eseri tarafından tanımlanan bir kopya. @tr

is metadata description of manifestation
status: Published
definition: Relates a work to a manifestation that is described by a metadata work.
type: Property
domain: C10001
lexical alias: metadataDescriptionOfManifestation.en
has element type: 2
toolkit label: metadata description of manifestation
toolkit definition: A manifestation that is described by a metadata work.
sub property of: is description of manifestation
toolkit definition: Metatietoteoksen kuvailema manifestaatio. @fi
toolkit label: metatietokuvailu manifestaatiosta @fi
definition: Liittää teoksen metatietoteoksen kuvailemaan manifestaatioon. @fi
label: metatietokuvailu manifestaatiosta @fi
label: 是载体表现的元数据描述 @zh-hans
definition: 将一种作品与被一种元数据作品描述的一种载体表现关联起来。 @zh-hans
toolkit label: 载体表现的元数据描述 @zh-hans
toolkit definition: 被一种元数据作品描述的一种载体表现 @zh-hans
label: és descripció de metadades de manifestació @ca
definition: Relaciona una obra amb una manifestació que és descrita per una obra de metadades. @ca
toolkit label: descripció de metadades de manifestació @ca
toolkit definition: Manifestació que és descrita per una obra de metadades. @ca
label: est une description par métadonnées d’une manifestation @fr
definition: Met une œuvre en relation avec une manifestation qui est décrite par une œuvre de métadonnées. @fr
toolkit label: description par métadonnées d’une manifestation @fr
toolkit definition: Manifestation qui est décrite par une œuvre de métadonnées. @fr
has subproperty: is finding aid of
has subproperty: P10617
label: gösterimin üstveri tanımlamasıdır @tr
definition: Bir eseri, bir üstveri eseri ile tanımlanan bir gösterimle ilişkilendirir. @tr
toolkit label: Gösterimin üstveri tanımlaması @tr
toolkit definition: Bir üst veri çalışması tarafından tanımlanan bir gösterim @tr

is metadata description of nomen
status: Published
definition: Relates a work to a nomen that is described by a metadata work.
type: Property
domain: C10001
lexical alias: metadataDescriptionOfNomen.en
has element type: 2
toolkit label: metadata description of nomen
toolkit definition: A nomen that is described by a metadata work.
sub property of: is description of nomen
toolkit definition: Metatietoteoksen kuvailema nomen. @fi
toolkit label: metatietokuvailu nomenista @fi
definition: Liittää teoksen metatietoteoksen kuvailemaan nomeniin. @fi
label: metatietokuvailu nomenista @fi
label: 是命名的元数据描述 @zh-hans
definition: 将一种作品与被一种元数据作品描述的一个命名关联起来。 @zh-hans
toolkit label: 命名的元数据描述 @zh-hans
toolkit definition: 被一种元数据作品描述的一个命名 @zh-hans
label: és descripció de metadades de nomen @ca
definition: Relaciona una obra amb un nomen que és descrit per una obra de metadades. @ca
toolkit label: descripció de metadades de nomen @ca
toolkit definition: Nomen que és descrit per una obra de metadades. @ca
label: est une description par métadonnées d’un nomen @fr
definition: Met une œuvre en relation avec un nomen qui est décrit par une œuvre de métadonnées. @fr
toolkit label: description par métadonnées d’un nomen @fr
toolkit definition: Nomen qui est décrit par une œuvre de métadonnées. @fr
has subproperty: P10618
label: ismin üstveri tanımlamasıdır @tr
definition: Bir eseri, bir üstveri eseriyle tanımlanan isim ile ilişkilendirir. @tr
toolkit label: Niteleyici ismin üstveri tanımlaması @tr
toolkit definition: Bir üst veri çalışması tarafından tanımlanan bir isim @tr

is metadata description of place
status: Published
definition: Relates a work to a place that is described by a metadata work.
type: Property
domain: C10001
lexical alias: metadataDescriptionOfPlace.en
has element type: 2
toolkit label: metadata description of place
toolkit definition: A place that is described by a metadata work.
sub property of: is description of place
toolkit definition: Metatietoteoksen kuvailema paikka. @fi
toolkit label: metatietokuvailu paikasta @fi
definition: Liittää teoksen metatietoteoksen kuvailemaan paikkaan. @fi
label: metatietokuvailu paikasta @fi
label: 是地点的元数据描述 @zh-hans
definition: 将一种作品与被一种元数据作品描述的一个地点关联起来。 @zh-hans
toolkit label: 地点的元数据描述 @zh-hans
toolkit definition: 被一种元数据作品描述的一个地点 @zh-hans
label: és descripció de metadades de lloc @ca
definition: Relaciona una obra amb un lloc que és descrit per una obra de metadades. @ca
toolkit label: descripció de metadades de lloc @ca
toolkit definition: Lloc que és descrit per una obra de metadades. @ca
label: est une description par métadonnées d’un lieu @fr
definition: Met une œuvre en relation avec un lieu qui est décrit par une œuvre de métadonnées. @fr
toolkit label: description par métadonnées d’un lieu @fr
toolkit definition: Lieu qui est décrit par une œuvre de métadonnées. @fr
has subproperty: P10619
label: yerin üstveri tanımlamasıdır @tr
definition: Bir eseri, bir üstveri eseri tarafından tanımlanan yer ile ilişkilendirir. @tr
toolkit label: Yerin üstveri tanımlaması @tr
toolkit definition: Bir üst veri çalışmasının tanımlandığı bir yerdir. @tr

is metadata description of timespan
status: Published
definition: Relates a work to a timespan that is described by a metadata work.
type: Property
domain: C10001
lexical alias: metadataDescriptionOfTimespan.en
has element type: 2
toolkit label: metadata description of timespan
toolkit definition: A timespan that is described by a metadata work.
sub property of: is description of timespan
toolkit definition: Metatietoteoksen kuvailema ajanjakso. @fi
toolkit label: metatietokuvailu ajanjaksosta @fi
definition: Liittää teoksen metatietoteoksen kuvailemaan ajanjaksoon. @fi
label: metatietokuvailu ajanjaksosta @fi
label: 是时间段的元数据描述 @zh-hans
definition: 将一种作品与被一种元数据作品描述的一个时间段关联起来。 @zh-hans
toolkit label: 时间段的元数据描述 @zh-hans
toolkit definition: 被一种元数据作品描述的一个时间段 @zh-hans
label: és descripció de metadades d’interval de temps @ca
definition: Relaciona una obra amb un interval de temps que és descrit per una obra de metadades. @ca
toolkit label: descripció de metadades d’interval de temps @ca
toolkit definition: Interval de temps que és descrit per una obra de metadades. @ca
label: est une description par métadonnées d’un laps de temps @fr
definition: Met une œuvre en relation avec un laps de temps qui est décrit par une œuvre de métadonnées. @fr
toolkit label: description par métadonnées d’un laps de temps @fr
toolkit definition: Laps de temps qui est décrit par une œuvre de métadonnées. @fr
has subproperty: P10620
label: zaman aralığının üstveri tanımlamasıdır @tr
definition: Bir eseri, bir üstveri eseri tarafından tanımlanan bir zaman aralığı ile ilişkilendirir. @tr
toolkit label: Zaman aralığının üstveri tanımlamasıdır. @tr
toolkit definition: Bir üstveri çalışması tarafından tanımlanan bir zaman aralığı. @tr

is metadata description of work
status: Published
definition: Relates a work to a work that is described by a metadata work.
type: Property
domain: C10001
lexical alias: metadataDescriptionOfWork.en
has element type: 2
toolkit label: metadata description of work
toolkit definition: A work that is described by a metadata work.
sub property of: is description of work
toolkit definition: Metatietoteoksen kuvailema teos. @fi
toolkit label: metatietokuvailu teoksesta @fi
definition: Liittää teoksen metatietoteoksen kuvailemaan teokseen. @fi
label: metatietokuvailu teoksesta @fi
label: 是作品的元数据描述 @zh-hans
definition: 将一种作品与被一种元数据作品描述的一种作品关联起来。 @zh-hans
toolkit label: 作品的元数据描述 @zh-hans
toolkit definition: 被一种元数据作品描述的一种作品 @zh-hans
label: és descripció de metadades d’obra @ca
definition: Relaciona una obra amb una obra que és descrita per una obra de metadades. @ca
toolkit label: descripció de metadades d’obra @ca
toolkit definition: Obra que és descrita per una obra de metadades. @ca
label: est une description par métadonnées d’une œuvre @fr
definition: Met une œuvre en relation avec une œuvre qui est décrite par une œuvre de métadonnées. @fr
toolkit label: description par métadonnées d’une œuvre @fr
toolkit definition: Œuvre qui est décrite par une œuvre de métadonnées. @fr
has subproperty: P10621
label: eserin üstveri tanımlamasıdır @tr
definition: Bir eseri, bir üstveri eseri tarafından tanımlanan bir eserile ilişkilendirir. @tr
toolkit label: Eserin üstveri tanımlaması @tr
toolkit definition: Bir üst veri çalışması ile tanımlanan bir çalışma @tr

is metadata description of RDA entity
status: Published
definition: Relates a work to an RDA entity that is described by a metadata work.
type: Property
domain: C10001
lexical alias: metadataDescriptionOfRDAEntity.en
has element type: 2
toolkit label: metadata description of RDA entity
toolkit definition: An RDA entity that is described by a metadata work.
sub property of: is description of RDA entity
toolkit definition: Metatietoteoksen kuvailema RDA-entiteetti. @fi
toolkit label: metatietokuvailu RDA-entiteetistä @fi
definition: Liittää teoksen metatietoteoksen kuvailemaan RDA-entiteettiin. @fi
label: metatietokuvailu RDA-entiteetistä @fi
label: 是RDA实体的元数据描述 @zh-hans
definition: 将一种作品与被一种元数据作品描述的一个RDA实体关联起来。 @zh-hans
toolkit label: RDA实体的元数据描述 @zh-hans
toolkit definition: 被一种元数据作品描述的一个RDA实体 @zh-hans
label: és descripció de metadades d’Entitat RDA @ca
definition: Relaciona una obra amb una Entitat RDA que és descrita per una obra de metadades. @ca
toolkit label: descripció de metadades d’Entitat RDA @ca
toolkit definition: Entitat RDA que és descrita per una obra de metadades. @ca
label: est une description par métadonnées d’une entité RDA @fr
definition: Met une œuvre en relation avec une entité RDA qui est décrite par une œuvre de métadonnées. @fr
toolkit label: description par métadonnées d’une entité RDA @fr
toolkit definition: Entité RDA qui est décrite par une œuvre de métadonnées. @fr
has subproperty: P10622
label: RDA varlığının üstveri tanımlamasıdır @tr
definition: Bir eseri, bir üstveri eseri tarafından tanımlanan RDA varlığı ile ilişkilendirir. @tr
toolkit label: RDA varlığının üstveri tanımlaması @tr
toolkit definition: Bir üst veri çalışması tarafından açıklanan bir RDA varlığı @tr

is work described with metadata by
status: Published
definition: Relates a work to a work that is a metadata work for a work.
type: Property
domain: C10001
lexical alias: workDescribedWithMetadataBy.en
has element type: 2
toolkit label: work described with metadata by
toolkit definition: A work that is a metadata work for a work.
sub property of: is work described by
toolkit definition: Teos, joka on teoksen metatietoteos. @fi
toolkit label: teosta metatiedoilla kuvaileva teos @fi
definition: Liittää teoksen teokseen, joka on teoksen metatietoteos. @fi
label: teosta metatiedoilla kuvaileva teos @fi
label: 是被……用元数据描述的作品 @zh-hans
definition: 将一种作品与作为一种作品的元数据作品的一种作品关联起来。 @zh-hans
toolkit label: 被……用元数据描述的作品 @zh-hans
toolkit definition: 作为一种作品的元数据作品的一种作品 @zh-hans
label: és obra descrita amb metadades per @ca
definition: Relaciona una obra amb una obra que és una obra de metadades per a una obra. @ca
toolkit label: obra descrita amb metadades per @ca
toolkit definition: Obra que és una obra de metadades per a una obra. @ca
label: est une œuvre décrite avec des métadonnées par @fr
definition: Met une œuvre en relation avec une œuvre qui consiste en une œuvre de métadonnées pour une œuvre. @fr
toolkit label: œuvre décrite avec des métadonnées par @fr
toolkit definition: Œuvre qui consiste en une œuvre de métadonnées pour une œuvre. @fr
has subproperty: P10623
label: Üst veriler ile tanımlanan eserdir @tr
definition: Bir eseri, bir eser için metaveri eseri olan bir eserle ilişkilendirir. @tr
toolkit label: tarafından üstverilerle tanımlanan eser @tr
toolkit definition: Bir eser için üstveri çalışması olan bir eser. @tr

is finding aid of
status: Published
definition: Relates a work to a manifestation that is a collection manifestation that is described by a metadata description set.
type: Property
domain: C10001
lexical alias: findingAidOf.en
has element type: 2
toolkit label: finding aid of
toolkit definition: A manifestation that is a collection manifestation that is described by a metadata description set.
sub property of: is metadata description of manifestation
toolkit definition: Manifestaatio, joka on kokoelmamanifestaatio, jota metatietokokonaisuus kuvailee. @fi
toolkit label: luettelo manifestaatiolle @fi
definition: Liittää teoksen manifestaatioon, joka on kokoelmamanifestaatio, jota metatietokokonaisuus kuvailee. @fi
label: luettelo manifestaatiolle @fi
label: 是……的查询工具 @zh-hans
definition: 将一种作品与作为一种收藏载体表现并被一种元数据描述集合描述的一种载体表现关联起来。 @zh-hans
toolkit label: ……的查询工具 @zh-hans
toolkit definition: 作为一种收藏载体表现并被一种元数据描述集合描述的一种载体表现 @zh-hans
label: és instrument de descripció de @ca
definition: Relaciona una obra amb una manifestació que és una manifestació de col·lecció de recursos que és descrita per un conjunt de descripció de metadades. @ca
toolkit label: instrument de descripció de @ca
toolkit definition: Manifestació que és una manifestació de col·lecció de recursos que és descrita per un conjunt de descripció de metadades. @ca
label: est un instrument de recherche de @fr
definition: Met une œuvre en relation avec une manifestation qui consiste en une manifestation de collection de ressources décrite par un ensemble de métadonnées descriptives. @fr
toolkit label: instrument de recherche de @fr
toolkit definition: Manifestation qui consiste en une manifestation de collection de ressources décrite par un ensemble de métadonnées descriptives. @fr
has subproperty: is catalogue of
has subproperty: is hierarchic finding aid of
has subproperty: P10624
label: rehber bilgisidir @tr
definition: Bir eseri, bir üstveri seti tarafından tanımlanmış bir koleksiyon gösterimi olan bir gösterimle ilişkilendirir. @tr
toolkit label: rehber bilgi @tr
toolkit definition: Bir üst veri tanımlama kümesi tarafından tanımlanan bir koleksiyon gösterimi olan bir gösterim @tr

is catalogue of
status: Published
definition: Relates a work to a manifestation that is a collection manifestation that has a metadata description set for the items that it holds.
type: Property
domain: C10001
lexical alias: catalogueOf.en
has element type: 2
toolkit label: catalogue of
toolkit definition: A manifestation that is a collection manifestation that has a metadata description set for the items that it holds.
alternative label: analytic finding aid of
alternative label: finding aid of, analytic
sub property of: is finding aid of
toolkit definition: Manifestaatio, joka on kokoelmamanifestaatio, jolla on siihen kuuluvia kappaleita koskeva metatietokokonaisuus. @fi
toolkit label: kokoelmaluettelo manifestaatiolle @fi
definition: Liittää teoksen manifestaatioon, joka on kokoelmamanifestaatio, jolla on siihen kuuluvia kappaleita koskeva metatietokokonaisuus. @fi
label: kokoelmaluettelo manifestaatiolle @fi
label: 是……的目录 @zh-hans
definition: 将一种作品与作为一种收藏载体表现并有所收入的各种单件的元数据描述集合的一种载体表现关联起来。 @zh-hans
toolkit label: ……的目录 @zh-hans
toolkit definition: 作为一种收藏载体表现并有所收入的各种单件的元数据描述集合的一种载体表现 @zh-hans
alternative label: 分析查询工具 @zh-hans
alternative label: 查询工具（分析的） @zh-hans
label: és catàleg de @ca
definition: Relaciona una obra amb una manifestació que és una manifestació de col·lecció de recursos que té un conjunt de descripció de metadades per als ítems que aplega. @ca
toolkit label: catàleg de @ca
toolkit definition: Manifestació que és una manifestació de col·lecció de recursos que té un conjunt de descripció de metadades per als ítems que aplega. @ca
alternative label: instrument de recherche analytique de @fr
label: est un catalogue de @fr
definition: Met une œuvre en relation avec une manifestation qui consiste en une manifestation de collection de ressources possédant un ensemble de métadonnées descriptives pour les items qu’elle conserve. @fr
toolkit label: catalogue de @fr
toolkit definition: Manifestation qui consiste en une manifestation de collection de ressources possédant un ensemble de métadonnées descriptives pour les items qu’elle conserve. @fr
has subproperty: P10625
alternative label: analitik rehber bilgisi @tr
alternative label: analitik rehber bilgi @tr
label: kataloğudur @tr
definition: Bir çalışmayı, sahip olduğu kopyalar için ayarlanmış bir üstveti setine sahip bir koleksiyon gösterimi olan bir gösterimle ilişkilendirir. @tr
toolkit label: katalog @tr
toolkit definition: Tuttuğu kopyalar için ayarlanmış bir üst veri açıklamasına sahip bir koleksiyon gösterimi olan bir gösterim. @tr

is hierarchic finding aid of
status: Published
definition: Relates a work to a manifestation that is a collection manifestation that has a metadata description set for the sub-collections and items that it holds.
type: Property
domain: C10001
lexical alias: hierarchicFindingAidOf.en
has element type: 2
toolkit label: hierarchic finding aid of
toolkit definition: A manifestation that is a collection manifestation that has a metadata description set for the sub-collections and items that it holds.
alternative label: finding aid of, hierarchic
scope note: A collection includes an archival collection.
sub property of: is finding aid of
scope note: Kokoelmaan kuuluu arkistokokoelma. @fi
alternative label: luettelo manifestaatiolle, hierarkkinen @fi
toolkit definition: Manifestaatio, joka on kokoelmamanifestaatio, jolla on siihen kuuluvia alakokoelmia ja kappaleita koskeva metatietokokonaisuus. @fi
toolkit label: hierarkkinen luettelo manifestaatiolle @fi
definition: Liittää teoksen manifestaatioon, joka on kokoelmamanifestaatio, jolla on siihen kuuluvia alakokoelmia ja kappaleita koskeva metatietokokonaisuus. @fi
label: hierarkkinen luettelo manifestaatiolle @fi
alternative label: 查询工具（分级的） @zh-hans
label: 是……的分级查询工具 @zh-hans
definition: 将一种作品与作为一种收藏载体表现并有所收入的分收藏和各种单件的元数据描述集合的一种载体表现关联起来。 @zh-hans
toolkit label: ……的分级查询工具 @zh-hans
toolkit definition: 作为一种收藏载体表现并有所收入的分收藏和各种单件的元数据描述集合的一种载体表现 @zh-hans
scope note: 收藏包括档案收藏。 @zh-hans
label: és instrument de descripció jeràrquic de @ca
definition: Relaciona una obra amb una manifestació que és una manifestació de col·lecció de recursos que té un conjunt de descripció de metadades per a les subcol·leccions de recursos i els ítems que aplega. @ca
toolkit label: instrument de descripció jeràrquic de @ca
toolkit definition: Manifestació que és una manifestació de col·lecció de recursos que té un conjunt de descripció de metadades per a les subcol·leccions de recursos i els ítems que aplega. @ca
scope note: Una col·leció de recursos inclou una col·lecció de recursos arxivístics. @ca
label: est un instrument de recherche hiérarchique de @fr
definition: Met une œuvre en relation avec une manifestation qui consiste en une manifestation de collection de ressources possédant un ensemble de métadonnées descriptives pour les sous-collections de ressources et les items qu’elle conserve. @fr
toolkit label: instrument de recherche hiérarchique de @fr
toolkit definition: Manifestation qui consiste en une manifestation de collection de ressources possédant un ensemble de métadonnées descriptives pour les sous-collections de ressources et les items qu’elle conserve. @fr
scope note: Une collection de ressources comprend une collection ou un fonds d’archives. @fr
has subproperty: P10626
alternative label: hiyerarşik rehber bilgi @tr
label: hiyerarşik rehber bilgisidir @tr
definition: Bir eseri, sahip olduğu alt koleksiyonlar ve kopyalar için bir üstveri setine sahip bir koleksiyon gösterimi olan bir gösterimle ilişkilendirir. @tr
toolkit label: hiyerarşik rehber bilgisi ile ilişkilidir @tr
toolkit definition: Tuttuğu alt koleksiyonlar ve kopyalar için ayarlanmış bir üst veri tanımlamasına sahip bir koleksiyon gösterimi olan bir gösterim. @tr
scope note: Arşiv koleksiyonu içeren bir koleksiyon @tr

is index for
status: Published
definition: Relates a work to a manifestation of a textual work that is the basis of a systematic guide of the content of the manifestation.
type: Property
domain: C10001
lexical alias: indexFor.en
has element type: 2
toolkit label: index for
toolkit definition: A manifestation of a textual work that is the basis of a systematic guide of the content of the manifestation.
sub property of: has related manifestation of work
toolkit definition: Manifestaation sisällön systemaattisen oppaan perustana olevan tekstiteoksen manifestaatio. @fi
toolkit label: hakemisto manifestaatiolle @fi
definition: Liittää teoksen manifestaation sisällön systemaattisen oppaan perustana olevan tekstiteoksen manifestaatioon. @fi
label: hakemisto manifestaatiolle @fi
label: 是……的索引 @zh-hans
definition: 将一种作品与作为其载体表现的内容的索引的基础的一种文字作品的一种载体表现关联起来。 @zh-hans
toolkit label: ……的索引 @zh-hans
toolkit definition: 作为其载体表现的内容的索引的基础的一种文字作品的一种载体表现 @zh-hans
label: és índex de @ca
definition: Relaciona una obra amb una manifestació d’una obra textual que és la base d’una guia sistemàtica del contingut de la manifestació. @ca
toolkit label: índex per @ca
toolkit definition: Manifestació d’una obra textual que és la base d’una guia sistemàtica del contingut de la manifestació. @ca
label: est un index de @fr
definition: Met une œuvre en relation avec une manifestation d’une œuvre textuelle qui constitue la base d’un guide systématique du contenu de la manifestation. @fr
toolkit label: index de @fr
toolkit definition: Manifestation d’une œuvre textuelle qui constitue la base d’un guide systématique du contenu de la manifestation. @fr
has subproperty: P10627
label: dizinidir @tr
definition: Bir eseri, gösterim içeriğinin sistematik bir rehberinin temeli olan metinsel bir eseri bir gösterim ile ilişkilendirir. @tr
toolkit label: dizinidir @tr
toolkit definition: Gösterim içeriğinin sistematik bir rehberin temeli olan metinsel bir çalışmanın gösterimi. @tr

is concordance work for
status: Published
definition: Relates a work to an expression of a textual work that is the basis of a systematic guide of all or selected words that occur in the expression.
type: Property
domain: C10001
lexical alias: concordanceWorkFor.en
has element type: 2
toolkit label: concordance work for
toolkit definition: An expression of a textual work that is the basis of a systematic guide of all or selected words that occur in the expression.
sub property of: has related expression of work
toolkit definition: Kaikkien tai valikoitujen ekspressiossa esiintyvien sanojen systemaattisen oppaan perustana olevan tekstiteoksen ekspressio. @fi
toolkit label: konkordanssihakemisto ekspressiolle @fi
definition: Liittää teoksen kaikkien tai valikoitujen ekspressiossa esiintyvien sanojen systemaattisen oppaan perustana olevan tekstiteoksen ekspressioon. @fi
label: konkordanssihakemisto (teos) ekspressiolle @fi
label: 是……的词语索引作品 @zh-hans
definition: 将一种作品与是所出现的所有或所选词语的索引之基础的一种文字作品的一种内容表达关联起来。 @zh-hans
toolkit label: ……的词语索引作品 @zh-hans
toolkit definition: 是所出现的所有或所选词语的索引之基础的一种文字作品的一种内容表达 @zh-hans
label: és obra de concordança per @ca
definition: Relaciona una obra amb una expressió d’una obra textual que és la base d’una guia sistemàtica de totes les paraules o de paraules seleccionades que apareixen en una expressió. @ca
toolkit label: obra de concordança per @ca
toolkit definition: Expressió d’una obra textual que és la base d’una guia sistemàtica de totes les paraules o de paraules seleccionades que apareixen en una expressió. @ca
label: est une concordance (œuvre) pour @fr
definition: Met une œuvre en relation avec une expression d’une œuvre textuelle qui constitue la base d’un guide systématique d’une partie ou de la totalité des mots figurant dans l’expression. @fr
toolkit label: concordance (œuvre) pour @fr
toolkit definition: Expression d’une œuvre textuelle qui constitue la base d’un guide systématique d’une partie ou de la totalité des mots figurant dans l’expression. @fr
has subproperty: P10628
label: dizin eşleştirmesi eseridir @tr
definition: Bir eseri, anlatımda geçen tüm veya seçilmiş sözcüklerin sistematik bir rehberinin temeli olan metinsel bir eseri bir anlatımla ilişkilendirir. @tr
toolkit label: uyum eseri @tr
toolkit definition: Anlatımda geçen tüm veya seçilmiş kelimelerin sistematik bir rehberin temeli olan metinsel bir çalışmanın anlatımı. @tr

has collector agent
status: Published
definition: Relates a work to an agent who is responsible for creating a collection work by selecting and arranging items that exemplify the embodiment of other works.
type: Property
domain: C10001
lexical alias: collectorAgent.en
has element type: 2
toolkit label: collector agent
toolkit definition: An agent who is responsible for creating a collection work by selecting and arranging items that exemplify the embodiment of other works.
sub property of: has creator agent of work
toolkit definition: Toimija, joka vastaa kokoelmateoksen luomisesta valitsemalla ja järjestämällä kappaleita, jotka edustavat muiden teosten ilmentymää. @fi
toolkit label: kokoelman muodostaja (toimija) @fi
definition: Liittää teoksen toimijaan, joka vastaa kokoelmateoksen luomisesta valitsemalla ja järjestämällä kappaleita, jotka edustavat muiden teosten ilmentymää. @fi
label: kokoelman muodostaja (toimija) @fi
label: 有收藏者行为者 @zh-hans
definition: 将一种作品与通过选择和整理作为其他作品的具体化之例证的单件而对创建一种收藏作品负责的一个行为者关联起来。 @zh-hans
toolkit label: 收藏者行为者 @zh-hans
toolkit definition: 通过选择和整理作为其他作品的具体化之例证的单件而对创建一种收藏作品负责的一个行为者 @zh-hans
label: té agent col·leccionista @ca
definition: Relaciona una obra amb un agent que és responsable de la creació d’una obra de col·lecció de recursos d’ítems que exemplifiquen la materialització d’altres obres mitjançant la selecció i arranjament. @ca
toolkit label: agent col·leccionista @ca
toolkit definition: Agent que és responsable de la creació d’una obra de col·lecció de recursos d’ítems que exemplifiquen la materialització daltres obres mitjançant la selecció i arranjament. @ca
label: a pour agent collectionneur @fr
definition: Met une œuvre en relation avec un agent qui est responsable de la création d’une œuvre de collection de ressources par la sélection et l’organisation d’items exemplifiant la matérialisation d’autres œuvres. @fr
toolkit label: agent collectionneur @fr
toolkit definition: Agent qui est responsable de la création d’une œuvre de collection de ressources par la sélection et l’organisation d’items exemplifiant la matérialisation d’autres œuvres. @fr
has subproperty: has collector collective agent
has subproperty: has collector person
has subproperty: P10629
label: koleksiyon oluşturucu temsilci ile ilişkilidir @tr
definition: Bir eseri, diğer eserlerin somutlaşmasını örnekleyen kopyaları seçip düzenleyerek bir koleksiyon eseri oluşturmaktan sorumlu olan bir temsilci ile ilişkilendirir. @tr
toolkit label: koleksiyoncu temsilci @tr
toolkit definition: Diğer eserlerin somutlaşmasını örnek teşkil eden öğeleri seçip düzenleyerek bir koleksiyon eseri oluşturulmasından sorumlu bir temsilci. @tr

has collector collective agent
status: Published
definition: Relates a work to a collective agent who is responsible for creating a collection work by selecting and arranging items that exemplify the embodiment of other works.
type: Property
domain: C10001
lexical alias: collectorCollectiveAgent.en
has element type: 2
toolkit label: collector collective agent
toolkit definition: A collective agent who is responsible for creating a collection work by selecting and arranging items that exemplify the embodiment of other works.
sub property of: has creator collective agent of work
sub property of: has collector agent
toolkit definition: Yhteistoimija, joka vastaa kokoelmateoksen luomisesta valitsemalla ja järjestämällä kappaleita, jotka edustavat muiden teosten ilmentymää. @fi
toolkit label: kokoelman muodostaja (yhteistoimija) @fi
definition: Liittää teoksen yhteistoimijaan, joka vastaa kokoelmateoksen luomisesta valitsemalla ja järjestämällä kappaleita, jotka edustavat muiden teosten ilmentymää. @fi
label: kokoelman muodostaja (yhteistoimija) @fi
label: 有收藏者集体行为者 @zh-hans
definition: 将一种作品与通过选择和整理作为其他作品的具体化之例证的单件而对创建一种收藏作品负责的一个集体行为者关联起来。 @zh-hans
toolkit label: 收藏者集体行为者 @zh-hans
toolkit definition: 通过选择和整理作为其他作品的具体化之例证的单件而对创建一种收藏作品负责的一个集体行为者 @zh-hans
label: té agent col·lectiu col·leccionista @ca
definition: Relaciona una obra amb un agent col·lectiu que és responsable de la creació d’una obra de col·lecció de recursos d’ítems que exemplifiquen la materialització d’altres obres mitjançant la selecció i arranjament. @ca
toolkit label: agent col·lectiu col·leccionista @ca
toolkit definition: Agent col·lectiu que és responsable de la creació d’una obra de col·lecció de recursos d’ítems que exemplifiquen la materialització d’altres obres mitjançant la selecció i arranjament. @ca
label: a pour agent collectif collectionneur @fr
definition: Met une œuvre en relation avec un agent collectif qui est responsable de la création d’une œuvre de collection de ressources par la sélection et l’organisation d’items exemplifiant la matérialisation d’autres œuvres. @fr
toolkit label: agent collectif collectionneur @fr
toolkit definition: Agent collectif qui est responsable de la création d’une œuvre de collection de ressources par la sélection et l’organisation d’items exemplifiant la matérialisation d’autres œuvres. @fr
has subproperty: has collector corporate body
has subproperty: has collector family
has subproperty: P10630
label: koleksiyon oluşturucu kolektif temsilci ile ilişkilidir @tr
definition: Bir eseri, diğer eserlerin somutlaşmasına örnek teşkil eden kopyaları seçip düzenleyerek bir koleksiyon eseri oluşturmaktan sorumlu olan kolektif bir temsilci ile ilişkilendirir. @tr
toolkit label: koleksiyoncu kolektif temsilci @tr
toolkit definition: Diğer eserlerin somutlaşmasını örnek teşkil eden kopyaları seçip düzenleyerek bir koleksiyon eseri oluşturmaktan sorumlu olan kolektif bir temsilci. @tr

has collector corporate body
status: Published
definition: Relates a work to a corporate body who is responsible for creating a collection work by selecting and arranging items that exemplify the embodiment of other works.
type: Property
domain: C10001
lexical alias: collectorCorporateBody.en
has element type: 2
toolkit label: collector corporate body
toolkit definition: A corporate body who is responsible for creating a collection work by selecting and arranging items that exemplify the embodiment of other works.
sub property of: has creator corporate body of work
sub property of: has collector collective agent
toolkit definition: Yhteisö, joka vastaa kokoelmateoksen luomisesta valitsemalla ja järjestämällä kappaleita, jotka edustavat muiden teosten ilmentymää. @fi
toolkit label: kokoelman muodostaja (yhteisö) @fi
definition: Liittää teoksen yhteisöön, joka vastaa kokoelmateoksen luomisesta valitsemalla ja järjestämällä kappaleita, jotka edustavat muiden teosten ilmentymää. @fi
label: kokoelman muodostaja (yhteisö) @fi
label: 有收藏者团体 @zh-hans
definition: 将一种作品与通过选择和整理作为其他作品的具体化之例证的单件而对创建一种收藏作品负责的一个团体关联起来。 @zh-hans
toolkit label: 收藏者团体 @zh-hans
toolkit definition: 通过选择和整理作为其他作品的具体化之例证的单件而对创建一种收藏作品负责的一个团体 @zh-hans
label: té entitat corporativa col·leccionista @ca
definition: Relaciona una obra amb una entitat corporativa que és responsable de la creació d’una obra de col·lecció de recursos d’ítems que exemplifiquen la materialització d’altres obres mitjançant la selecció i arranjament. @ca
toolkit label: entitat corporativa col·leccionista @ca
toolkit definition: Entitat corporativa que és responsable de la creació d’una obra de col·lecció de recursos d’ítems que exemplifiquen la materialització d’altres obres mitjançant la selecció i arranjament. @ca
label: a pour collectivité collectionneuse @fr
definition: Met une œuvre en relation avec une collectivité qui est responsable de la création d’une œuvre de collection de ressources par la sélection et l’organisation d’items exemplifiant la matérialisation d’autres œuvres. @fr
toolkit label: collectivité collectionneuse @fr
toolkit definition: Collectivité qui est responsable de la création d’une œuvre de collection de ressources par la sélection et l’organisation d’items exemplifiant la matérialisation d’autres œuvres. @fr
has subproperty: P10631
label: koleksiyon oluşturucu tüzel kişi ile ilişkilidir @tr
definition: Bir eseri, diğer eserlerin somutlaşmasını örnek teşkil eden kopyaları seçip düzenleyerek bir koleksiyon eseri oluşturmaktan sorumlu olan tüzel kişi ile ilişkilendirir. @tr
toolkit label: koleksiyoncu tüzel kişi @tr
toolkit definition: Diğer eserlerin somutlaşmasını örnek teşkil eden kopyaları seçip düzenleyerek bir koleksiyon eseri oluşturmakla sorumlu olan tüzel kişi. @tr

has collector family
status: Published
definition: Relates a work to a family who is responsible for creating a collection work by selecting and arranging items that exemplify the embodiment of other works.
type: Property
domain: C10001
lexical alias: collectorFamily.en
has element type: 2
toolkit label: collector family
toolkit definition: A family who is responsible for creating a collection work by selecting and arranging items that exemplify the embodiment of other works.
sub property of: has creator family of work
sub property of: has collector collective agent
toolkit definition: Suku, joka vastaa kokoelmateoksen luomisesta valitsemalla ja järjestämällä kappaleita, jotka edustavat muiden teosten ilmentymää. @fi
toolkit label: kokoelman muodostaja (suku) @fi
definition: Liittää teoksen sukuun, joka vastaa kokoelmateoksen luomisesta valitsemalla ja järjestämällä kappaleita, jotka edustavat muiden teosten ilmentymää. @fi
label: kokoelman muodostaja (suku) @fi
label: 有收藏者家族 @zh-hans
definition: 将一种作品与通过选择和整理作为其他作品的具体化之例证的单件而对创建一种收藏作品负责的一个家族关联起来。 @zh-hans
toolkit label: 收藏者家族 @zh-hans
toolkit definition: 通过选择和整理作为其他作品的具体化之例证的单件而对创建一种收藏作品负责的一个家族 @zh-hans
label: té família col·leccionista @ca
definition: Relaciona una obra amb una família que és responsable de la creació d’una obra de col·lecció de recursos d’ítems que exemplifiquen la materialització d’altres obres mitjançant la selecció i arranjament. @ca
toolkit label: família col·leccionista @ca
toolkit definition: Família que és responsable de la creació d’una obra de col·lecció de recursos d’ítems que exemplifiquen la materialització d’altres obres mitjançant la selecció i arranjament. @ca
label: a pour famille collectionneuse @fr
definition: Met une œuvre en relation avec une famille qui est responsable de la création d’une œuvre de collection de ressources par la sélection et l’organisation d’items exemplifiant la matérialisation d’autres œuvres. @fr
toolkit label: famille collectionneuse @fr
toolkit definition: Famille qui est responsable de la création d’une œuvre de collection de ressources par la sélection et l’organisation d’items exemplifiant la matérialisation d’autres œuvres. @fr
has subproperty: P10632
label: koleksiyon oluşturucu aile ile ilişkilidir @tr
definition: Bir eseri, diğer eserlerin somutlaşmasını örnek teşkil eden kopyaları seçip düzenleyerek bir koleksiyon eseri oluşturmaktan sorumlu olan bir aileyle ilişkilendirir. @tr
toolkit label: koleksiyoncu aile @tr
toolkit definition: Diğer eserlerin somutlaşmasını örnek teşkil eden kopyaları seçip düzenleyerek bir koleksiyon eseri oluşturmakla sorumlu olan aile. @tr

has collector person
status: Published
definition: Relates a work to a person who is responsible for creating a collection work by selecting and arranging items that exemplify the embodiment of other works.
type: Property
domain: C10001
lexical alias: collectorPerson.en
has element type: 2
toolkit label: collector person
toolkit definition: A person who is responsible for creating a collection work by selecting and arranging items that exemplify the embodiment of other works.
sub property of: has creator person of work
sub property of: has collector agent
toolkit definition: Henkilö, joka vastaa kokoelmateoksen luomisesta valitsemalla ja järjestämällä kappaleita, jotka edustavat muiden teosten ilmentymää. @fi
toolkit label: kokoelman muodostaja (henkilö) @fi
definition: Liittää teoksen henkilöön, joka vastaa kokoelmateoksen luomisesta valitsemalla ja järjestämällä kappaleita, jotka edustavat muiden teosten ilmentymää. @fi
label: kokoelman muodostaja (henkilö) @fi
label: 有收藏者个人 @zh-hans
definition: 将一种作品与通过选择和整理作为其他作品的具体化之例证的单件而对创建一种收藏作品负责的一个个人关联起来。 @zh-hans
toolkit label: 收藏者个人 @zh-hans
toolkit definition: 通过选择和整理作为其他作品的具体化之例证的单件而对创建一种收藏作品负责的一个个人 @zh-hans
label: té persona ol·leccionista @ca
definition: Relaciona una obra amb una persona que és responsable de la creació d’una obra de col·lecció de recursos d’ítems que exemplifiquen la materialització d’altres obres mitjançant la selecció i arranjament. @ca
toolkit label: persona col·leccionista @ca
toolkit definition: Persona que és responsable de la creació d’una obra de col·lecció de recursos d’ítems que exemplifiquen la materialització d’altres obres mitjançant la selecció i arranjament. @ca
label: a pour personne collectionneuse @fr
definition: Met une œuvre en relation avec une personne qui est responsable de la création d’une œuvre de collection de ressources par la sélection et l’organisation d’items exemplifiant la matérialisation d’autres œuvres. @fr
toolkit label: personne collectionneuse @fr
toolkit definition: Personne qui est responsable de la création d’une œuvre de collection de ressources par la sélection et l’organisation d’items exemplifiant la matérialisation d’autres œuvres. @fr
has subproperty: P10633
label: koleksiyon oluşturucu ile ilişkilidir @tr
definition: Bir eseri, diğer eserlerin somutlaşmasına örnek teşkil eden kopyaları seçip düzenleyerek bir koleksiyon eseri oluşturmaktan sorumlu olan bir kişiyle ilişkilendirir. @tr
toolkit label: koleksiyoncu @tr
toolkit definition: Diğer eserlerin somutlaşmasını örnek teşkil eden kopyaları seçip düzenleyerek bir koleksiyon eseri oluşturmakla sorumlu olan kişi. @tr

has collection registrar agent
status: Published
definition: Relates a work to an agent who is responsible for creating an analytic finding aid.
type: Property
domain: C10001
lexical alias: collectionRegistrarAgent.en
has element type: 2
toolkit label: collection registrar agent
toolkit definition: An agent who is responsible for creating an analytic finding aid.
alternative label: cataloguer agent
alternative label: collection registrar
sub property of: has compiler agent
toolkit definition: Toimija, joka vastaa analyyttisen luettelon luomisesta. @fi
toolkit label: kokoelman luetteloija (toimija) @fi
definition: Liittää teoksen toimijaan, joka vastaa analyyttisen luettelon luomisesta. @fi
label: kokoelman luetteloija (toimija) @fi
label: 有收藏登记者行为者 @zh-hans
definition: 将一种作品与负责创建一种分析查询工具的一个行为者关联起来。 @zh-hans
toolkit label: 收藏登记者行为者 @zh-hans
toolkit definition: 负责创建一种分析查询工具的一个行为者 @zh-hans
alternative label: 编目员行为者 @zh-hans
alternative label: 收藏登记者 @zh-hans
label: té agent conservador de col·lecció de recursos @ca
definition: Relaciona una obra amb un agent que és responsable de la creació d’un instrument de descripció analític. @ca
toolkit label: agent conservador de col·lecció de recursos @ca
toolkit definition: Agent que és responsable de la creació d’un instrument de descripció analític. @ca
label: a pour agent catalogueur d’une collection de ressources @fr
definition: Met une œuvre en relation avec un agent qui est responsable de la création d’un instrument de recherche analytique. @fr
toolkit label: agent catalogueur d’une collection de ressources @fr
toolkit definition: Agent qui est responsable de la création d’un instrument de recherche analytique. @fr
alternative label: agent conservateur d’une collection de ressources @fr
alternative label: conservateur de collection @fr
has subproperty: has collection registrar collective agent
has subproperty: has collection registrar person
has subproperty: P10634
alternative label: katalogcu temsilcisi @tr
alternative label: koleksiyon kayıt görevlisi @tr
label: koleksiyon kayıt görevlisi temsilcisi ile ilişkilidir @tr
definition: Bir eseri, analitik rehber bilgisi oluşturmaktan sorumlu olan bir temsilci ile ilişkilendirir. @tr
toolkit label: koleksiyon kayıt görevlisi temsilcisi @tr
toolkit definition: Analitik bulgu yardımı oluşturulmasından sorumlu bir temsilci. @tr

has collection registrar collective agent
status: Published
definition: Relates a work to a collective agent who is responsible for creating an analytic finding aid.
type: Property
domain: C10001
lexical alias: collectionRegistrarCollectiveAgent.en
has element type: 2
toolkit label: collection registrar collective agent
toolkit definition: A collective agent who is responsible for creating an analytic finding aid.
alternative label: cataloguer collective agent
sub property of: has compiler collective agent
sub property of: has collection registrar agent
alternative label: luetteloija (yhteistoimija) @fi
toolkit definition: Yhteistoimija, joka vastaa analyyttisen luettelon luomisesta. @fi
toolkit label: kokoelman luetteloija (yhteistoimija) @fi
definition: Liittää teoksen yhteistoimijaan, joka vastaa analyyttisen luettelon luomisesta. @fi
label: kokoelman luetteloija (yhteistoimija) @fi
alternative label: 编目员集体行为者 @zh-hans
label: 有收藏登记者集体行为者 @zh-hans
definition: 将一种作品与负责创建一种分析查询工具的一个集体行为者关联起来。 @zh-hans
toolkit label: 收藏登记者集体行为者 @zh-hans
toolkit definition: 负责创建一种分析查询工具的一个集体行为者 @zh-hans
alternative label: agent col·lectiu catalogador @ca
label: té agent col·lectiu conservador de col·lecció de recursos @ca
definition: Relaciona una obra amb un agent col·lectiu que és responsable de la creació d’un instrument de descripció analític. @ca
toolkit label: agent col·lectiu conservador de col·lecció de recursos @ca
toolkit definition: Agent col·lectiu que és responsable de la creació d’un instrument de descripció analític. @ca
label: a pour agent collectif catalogueur d’une collection de ressources @fr
definition: Met une œuvre en relation avec un agent collectif qui est responsable de la création d’un instrument de recherche analytique. @fr
toolkit label: agent collectif catalogueur d’une collection de ressources @fr
toolkit definition: Agent collectif qui est responsable de la création d’un instrument de recherche analytique. @fr
alternative label: agent collectif conservateur d’une collection de ressources @fr
has subproperty: has collection registrar corporate body
has subproperty: has collection registrar family
has subproperty: P10635
alternative label: katalogcu kollektif temsilcisi @tr
label: koleksiyon kayıt görevlisi kolektif temsilcisi ile ilişkilidir @tr
definition: Bir eseri, analitik rehber bilgisi oluşturmaktan sorumlu olan kolektif bir temsilci ile ilişkilendirir. @tr
toolkit label: koleksiyon kayıt görevlisi kolektif temsilcisi @tr
toolkit definition: Analitik bir bulgu yardımı oluşturmaktan sorumlu kolektif bir temsilci. @tr

has collection registrar corporate body
status: Published
definition: Relates a work to a corporate body who is responsible for creating an analytic finding aid.
type: Property
domain: C10001
lexical alias: collectionRegistrarCorporateBody.en
has element type: 2
toolkit label: collection registrar corporate body
toolkit definition: A corporate body who is responsible for creating an analytic finding aid.
alternative label: cataloguer corporate body
sub property of: has compiler corporate body
sub property of: has collection registrar collective agent
alternative label: luetteloija (yhteisö) @fi
toolkit definition: Yhteisö, joka vastaa analyyttisen luettelon luomisesta. @fi
toolkit label: kokoelman luetteloija (yhteisö) @fi
definition: Liittää teoksen yhteisöön, joka vastaa analyyttisen luettelon luomisesta. @fi
label: kokoelman luetteloija (yhteisö) @fi
alternative label: 编目员团体 @zh-hans
label: 有收藏登记者团体 @zh-hans
definition: 将一种作品与负责创建一种分析查询工具的一个团体关联起来。 @zh-hans
toolkit label: 收藏登记者团体 @zh-hans
toolkit definition: 负责创建一种分析查询工具的一个团体 @zh-hans
alternative label: entitat corporativa catalogadora @ca
label: té entitat corporativa conservadora de col·lecció de recursos @ca
definition: Relaciona una obra amb una entitat corporativa que és responsable de la creació d’un instrument de descripció analític. @ca
toolkit label: entitat corporativa conservadora de col·lecció de recursos @ca
toolkit definition: Entitat corporativa que és responsable de la creació d’un instrument de descripció analític. @ca
label: a pour collectivité catalogueuse d’une collection de ressources @fr
definition: Met une œuvre en relation avec une collectivité qui est responsable de la création d’un instrument de recherche analytique. @fr
toolkit label: collectivité catalogueuse d’une collection de ressources @fr
toolkit definition: Collectivité qui est responsable de la création d’un instrument de recherche analytique. @fr
alternative label: collectivité conservatrice d’une collection de ressources @fr
has subproperty: P10636
alternative label: katalogcu tüzel kişisi @tr
label: koleksiyon kayıt görevlisi tüzel kişisi ile ilişkilidir @tr
definition: Bir eseri, analitik rehber bilgisi oluşturmaktan sorumlu olan tüzel kişi ile ilişkilendirir. @tr
toolkit label: koleksiyon kayıt görevlisi tüzel kişisi @tr
toolkit definition: Analitik bulgu yardımı oluşturmaktan sorumlu bir tüzel kişi. @tr

has collection registrar family
status: Published
definition: Relates a work to a family who is responsible for creating an analytic finding aid.
type: Property
domain: C10001
lexical alias: collectionRegistrarFamily.en
has element type: 2
toolkit label: collection registrar family
toolkit definition: A family who is responsible for creating an analytic finding aid.
alternative label: cataloguer family
sub property of: has compiler family
sub property of: has collection registrar collective agent
alternative label: luetteloija (suku) @fi
toolkit definition: Suku, joka vastaa analyyttisen luettelon luomisesta. @fi
toolkit label: kokoelman luetteloija (suku) @fi
definition: Liittää teoksen sukuun, joka vastaa analyyttisen luettelon luomisesta. @fi
label: kokoelman luetteloija (suku) @fi
alternative label: 编目员家族 @zh-hans
label: 有收藏登记者家族 @zh-hans
definition: 将一种作品与负责创建一种分析查询工具的一个家族关联起来。 @zh-hans
toolkit label: 收藏登记者家族 @zh-hans
toolkit definition: 负责创建一种分析查询工具的一个家族 @zh-hans
alternative label: família catalogadora @ca
label: té família conservadora de col·lecció de recursos @ca
definition: Relaciona una obra amb una família que és responsable de la creació d’un instrument de descripció analític. @ca
toolkit label: família conservadora de col·lecció de recursos @ca
toolkit definition: Família que és responsable de la creació d’un instrument de descripció analític. @ca
label: a pour famille catalogueuse d’une collection de ressources @fr
definition: Met une œuvre en relation avec une famille qui est responsable de la création d’un instrument de recherche analytique. @fr
toolkit label: famille catalogueuse d’une collection de ressources @fr
toolkit definition: Famille qui est responsable de la création d’un instrument de recherche analytique. @fr
alternative label: famille conservatrice d’une collection de ressources @fr
has subproperty: P10637
alternative label: katalogcu ailesi @tr
label: koleksiyon kayıt görevlisi ailesi ile ilişkilidir @tr
definition: Bir eseri, analitik rehber bilgisi oluşturmaktan sorumlu olan bir aileyle ilişkilendirir. @tr
toolkit label: koleksiyon kayıt görevlisi ailesi @tr
toolkit definition: Bir analitik rehber bilgi oluşturmaktan sorumlu bir aile. @tr

has collection registrar person
status: Published
definition: Relates a work to a person who is responsible for creating an analytic finding aid.
type: Property
domain: C10001
lexical alias: collectionRegistrarPerson.en
has element type: 2
toolkit label: collection registrar person
toolkit definition: A person who is responsible for creating an analytic finding aid.
alternative label: cataloguer person
sub property of: has compiler person
sub property of: has collection registrar agent
alternative label: luetteloija (henkilö) @fi
toolkit definition: Henkilö, joka vastaa analyyttisen luettelon luomisesta. @fi
toolkit label: kokoelman luetteloija (henkilö) @fi
definition: Liittää teoksen henkilöön, joka vastaa analyyttisen luettelon luomisesta. @fi
label: kokoelman luetteloija (henkilö) @fi
alternative label: 编目员个人 @zh-hans
label: 有收藏登记者个人 @zh-hans
definition: 将一种作品与负责创建一种分析查询工具的一个个人关联起来。 @zh-hans
toolkit label: 收藏登记者个人 @zh-hans
toolkit definition: 负责创建一种分析查询工具的一个个人 @zh-hans
alternative label: persona catalogadora @ca
label: té persona conservadora de col·lecció de recursos @ca
definition: Relaciona una obra amb una persona que és responsable de la creació d’un instrument de descripció analític. @ca
toolkit label: persona conservadora de col·lecció de recursos @ca
toolkit definition: Persona que és responsable de la creació d’un instrument de descripció analític. @ca
label: a pour personne catalogueuse d’une collection de ressources @fr
definition: Met une œuvre en relation avec une personne qui est responsable de la création d’un instrument de recherche analytique. @fr
toolkit label: personne catalogueuse d’une collection de ressources @fr
toolkit definition: Personne qui est responsable de la création d’un instrument de recherche analytique. @fr
alternative label: personne conservatrice d’une collection de ressources @fr
has subproperty: P10638
alternative label: katalogcu @tr
label: koleksiyon kayıt görevlisi ile ilişkilidir @tr
definition: Bir eseri, analitik rehber bilgisi oluşturmaktan sorumlu bir kişiyle ilişkilendirir. @tr
toolkit label: koleksiyon kayıt görevlisi @tr
toolkit definition: Analitik rehber bilgi oluşturmaktan sorumlu kişi. @tr