software application
type: Class

web service
type: Class
subclass of: software application
description: A web service is a software application that can be accessed over a network, such as the Internet, and executed on a remote system hosting the requested services.