pair
type: Ontology
imports: ns
imports: core
has version: http://xls2rdf.sparna.fr/rest/convert
has version: https://docs.google.com/spreadsheets/d/1PMAB6WCNzRUrmxLwNvdSYrrrVESIwIP1QXT5FSwMS8g/export
comment: Ontologie PAIR - Projet Acteur Idée Ressource

affilié par
type: ObjectProperty
sub property of: interSubjectProperty
inverse of: affilie
domain: Individu
range: Organisation
label: affiliated by @en

affilie
type: ObjectProperty
sub property of: interSubjectProperty
domain: Organisation
range: Individu
label: affiliate @en

agentResourceProperty
type: ObjectProperty
sub property of: interSubjectProperty
comment: Catégorie de propriétés reliant un Agent à une Ressource

aimedBy
type: ObjectProperty
sub property of: pairIntentionProperty
inverse of: aims
domain: Finalité
range: PAIR
term status: unstable

aims
type: ObjectProperty
sub property of: pairIntentionProperty
domain: PAIR
range: Finalité
term status: unstable

assignedTo
type: ObjectProperty
sub property of: implique
inverse of: assigneeOf
domain: Tâche
range: Acteur
comment: Sens plus fort que "involves" pour les responsables de tâches

assigneeOf
type: ObjectProperty
sub property of: impliqué dans
domain: Acteur
range: Tâche
comment: Sens plus fort que "involved in" pour les responsables de tâches

associationProperties
type: ObjectProperty
sub property of: interSubjectProperty
comment: Catégorie de propriétés utilisées pour structurer des Associations

concrétise
type: ObjectProperty
sub property of: interSubjectProperty
inverse of: concrétisé par
domain: Activité
range: Idée
label: concretizes @en

imaginé par
type: ObjectProperty
sub property of: interSubjectProperty
inverse of: imagine
domain: Idée
range: Acteur
label: brainstormed by @en

imagine
type: ObjectProperty
sub property of: interSubjectProperty
domain: Acteur
range: Idée
label: brainstorms @en

challengeOf
type: ObjectProperty
sub property of: pairIntentionProperty
inverse of: hasChallenge
domain: Enjeu
range: PAIR
term status: unstable

concrétisé par
type: ObjectProperty
sub property of: interSubjectProperty
domain: Idée
range: Activité
label: concretized by @en

documenté par
type: ObjectProperty
sub property of: objectSubjectProperty
inverse of: documente
domain: Sujet
range: Objet
label: documented by @en

documente
type: ObjectProperty
sub property of: objectSubjectProperty
domain: Objet
range: Sujet
comment: Indicates that a document "somehow documents" a business subject, e.g. a brochure "documents" the company it is about. @en
label: documents @en

finalityOf
type: ObjectProperty
sub property of: interIntentionProperty
inverse of: hasFinality
domain: Finalité
range: Enjeu
term status: unstable

hasChallenge
type: ObjectProperty
sub property of: pairIntentionProperty
domain: PAIR
range: Enjeu
term status: unstable

hasConceptType
type: ObjectProperty
sub property of: à pour type
inverse of: typeOfConcept
domain: Concept
range: Type de concept
comment: Links a Concept to a ConceptType, for "loose typing". @en

hasFinality
type: ObjectProperty
sub property of: interIntentionProperty
domain: Enjeu
range: Finalité
term status: unstable

hasMean
type: ObjectProperty
sub property of: interIntentionProperty
inverse of: meanOf
domain: Enjeu
range: Mean
term status: unstable

hasObjectType
type: ObjectProperty
sub property of: à pour type
inverse of: typeOfObject
domain: Objet
range: Type d'objet
comment: Links an Object to an ObjectType, for "loose typing". @en

adresse postale
type: ObjectProperty
sub property of: interSubjectProperty
domain: Endroit
range: Adresse postale
label: postal address @en

hasSolution
type: ObjectProperty
sub property of: interIntentionProperty
inverse of: isSolutionFor
domain: Finalité
range: Mean
term status: unstable

hasSubjectType
type: ObjectProperty
sub property of: à pour type
inverse of: typeOfSubject
domain: Sujet
range: Type de sujet
comment: Links a Subject to a SubjectType, for "loose typing". @en

à pour type
type: ObjectProperty
sub property of: entityConceptProperty
inverse of: type de
domain: Entité Pair
range: Type
label: has type @en

hébergé dans
type: ObjectProperty
sub property of: hasLocation
inverse of: héberge
domain: PAIR
range: Lieu
label: hosted in @en

héberge
type: ObjectProperty
sub property of: locationOf
domain: Lieu
range: PAIR
label: hosts @en

interIntentionProperty
type: ObjectProperty
sub property of: interSubjectProperty
comment: Catégorie de propriétés reliant des intentions entre elles

interObjectProperty
type: ObjectProperty
domain: Objet
range: Objet
comment: Relie les Objects entre eux

interSubjectProperty
type: ObjectProperty
domain: Sujet
range: Sujet
comment: Relie les Subjects entre eux

impliqué dans
type: ObjectProperty
sub property of: interSubjectProperty
inverse of: implique
domain: Acteur
range: Activité
label: involved in @en

implique
type: ObjectProperty
sub property of: interSubjectProperty
domain: Activité
range: Acteur
label: involves @en

isSolutionFor
type: ObjectProperty
sub property of: interIntentionProperty
domain: Mean
range: Finalité
term status: unstable

meanOf
type: ObjectProperty
sub property of: interIntentionProperty
domain: Mean
range: Enjeu
term status: unstable

mobilizes
type: ObjectProperty
sub property of: pairIntentionProperty
inverse of: moblizedBy
domain: PAIR
range: Mean
term status: unstable

moblizedBy
type: ObjectProperty
sub property of: pairIntentionProperty
domain: Mean
range: PAIR
term status: unstable

nécessité par
type: ObjectProperty
sub property of: agentResourceProperty
inverse of: nécessite
domain: Ressource
range: Agent
label: needed by @en

nécessite
type: ObjectProperty
sub property of: agentResourceProperty
domain: Agent
range: Ressource
label: needs @en

objectSubjectProperty
type: ObjectProperty
sub property of: topObjectProperty
comment: Relie les Subjects et les Objects

proposé par
type: ObjectProperty
sub property of: agentResourceProperty
inverse of: propose
domain: Ressource
range: Acteur
label: offered by @en

propose
type: ObjectProperty
sub property of: agentResourceProperty
domain: Acteur
range: Ressource
label: offers @en

exploité par
type: ObjectProperty
sub property of: interSubjectProperty
inverse of: exploite
domain: Lieu
range: Acteur
label: operated by @en

exploite
type: ObjectProperty
sub property of: interSubjectProperty
domain: Acteur
range: Lieu
label: operates @en

pairIntentionProperty
type: ObjectProperty
sub property of: interSubjectProperty
comment: Catégorie de propriétés reliant un PAIR à une intentaion

délivré par
type: ObjectProperty
sub property of: agentResourceProperty
inverse of: produit
domain: Ressource
range: Agent
label: delivered by @en

produit
type: ObjectProperty
sub property of: agentResourceProperty
domain: Agent
range: Ressource
label: produces @en

référencé par
type: ObjectProperty
sub property of: interObjectProperty
inverse of: rérérence
domain: Document
range: Document
label: referenced by @en

rérérence
type: ObjectProperty
sub property of: interObjectProperty
domain: Document
range: Document
label: references @en

représenté par
type: ObjectProperty
sub property of: documenté par
inverse of: représente
domain: Sujet
range: Document
label: represented by @en

représente
type: ObjectProperty
sub property of: documente
domain: Document
range: Sujet
comment: Indicates that an document "strongly denotes" a business subject, e.g. an invoice "represents" a commercial deal. @en
label: represents @en

subjectConceptProperties
type: ObjectProperty
sub property of: topObjectProperty
comment: Relie les PairEntity aux Concepts

type de
type: ObjectProperty
sub property of: entityConceptProperty
domain: Type
range: Entité Pair
label: type of @en

depictedBy
type: ObjectProperty
sub property of: représenté par
inverse of: depicts
domain: Sujet
range: Image
comment: indique qu'un Sujet a une représentation principale sous forme d'image

depicts
type: ObjectProperty
sub property of: représente
domain: Image
range: Sujet
comment: Used to indicate an image gives a visual representation of any subject @en

experienceGrade
type: ObjectProperty
sub property of: subjectConceptProperties
domain: ExperienceAssociation
range: Grade
comment: Indique le niveau de l'expérience

has interest
type: ObjectProperty
sub property of: subjectConceptProperties
domain: Agent
range: Topic
comment: Indique l'intérêt d'un Agent pour un sujet, un topic particulier

interest of
type: ObjectProperty
sub property of: subjectConceptProperties
domain: Topic
range: Agent

page "à propos de"
type: DatatypeProperty
sub property of: page web
domain: Entité Pair
label: about page @en

adresse
type: DatatypeProperty
domain: Endroit
range: string
label: adress @en

pays
type: DatatypeProperty
domain: Adresse postale
range: string
label: country @en

ville
type: DatatypeProperty
domain: Adresse postale
range: string
label: locality @en

numéro et nom de rue
type: DatatypeProperty
domain: Adresse postale
range: string
label: street address (number and street name) @en

code postal
type: DatatypeProperty
type: FunctionalProperty
domain: Adresse postale
range: string
label: zip code @en

label alternatif
type: DatatypeProperty
sub property of: libellé
domain: Entité Pair
label: alternative label @en
label: libellé alternatif

commentaire
type: DatatypeProperty
domain: Entité Pair
range: string
label: comment @en

description
type: DatatypeProperty
type: FunctionalProperty
domain: Entité Pair
range: string

mel
type: DatatypeProperty
domain: Acteur
range: string
label: e-mail @en

date de fin
type: DatatypeProperty
sub property of: date
type: FunctionalProperty
domain: Activité
range: dateTime
label: end date @en

prénom
type: DatatypeProperty
sub property of: libellé
type: FunctionalProperty
domain: Individu
label: first name @en

page "de référence"
type: DatatypeProperty
sub property of: page web
type: FunctionalProperty
domain: Entité Pair
label: home page @en

identifiant
type: DatatypeProperty
domain: Entité Pair
range: string
label: identifier @en

libellé
type: DatatypeProperty
domain: Entité Pair
range: string
label: label

nom de famille
type: DatatypeProperty
sub property of: libellé
type: FunctionalProperty
domain: Individu
label: family name @en
label: last name @en

latitude
type: DatatypeProperty
domain: Endroit

longitude
type: DatatypeProperty
domain: Endroit

horaires d'ouverture
type: DatatypeProperty
domain: Endroit
range: string
label: opening hours @en

téléphone
type: DatatypeProperty
domain: Acteur
range: string
label: phone @en

label préféré
type: DatatypeProperty
sub property of: libellé
type: FunctionalProperty
domain: Entité Pair
range: string
label: libellé préféré
label: prefered label @en

date de départ
type: DatatypeProperty
sub property of: date
type: FunctionalProperty
domain: Activité
range: dateTime
label: start date @en

page web
type: DatatypeProperty
range: string
label: web page @en

documentDate
type: DatatypeProperty
sub property of: date
domain: Document
range: dateTime
comment: Une date associée à un document

Activité
type: Class
subclass of: Agent
subclass of: Restriction
  on property: hasStatus
  some values from: Statut d'activité
subclass of: Restriction
  on property: hasPart
  all values from: Activité
subclass of: Restriction
  on property: hasSubjectType
  all values from: Type d'activité
comment: Activité @en
comment: Une activité est entendue au sens très générique comme toute action entreprise par un Acteur avec une certaine finalité, à un certain moment, en un certain lieu. Ce n'est _PAS_ une catégorie socio-économique au sens "La ferme de la petite bourdaisière a pour activité Permaculture".
label: Activity @en

Champ d'activité
type: Class
subclass of: Concept
comment: A high-level class of sectors, fields and branches of activity. @en
comment: Classe de haut niveau rassemblant les secteurs, domaines et branches d'activité.
label: Activity field @en

Association d'implication
type: Class
subclass of: Association
comment: Implication d'un Acteur dans une Activité
label: Involvement association @en

Statut d'activité
type: Class
subclass of: Statut

Type d'activité
type: Class
subclass of: Type de sujet

Acteur
type: Class
subclass of: Agent
subclass of: Restriction
  on property: hasPart
  all values from: Acteur
subclass of: Restriction
  on property: hasStatus
  all values from: ActorStatus
comment: Un Acteur est entendu comme une personne morale ou physique.
label: Actor @en
label: Personnality @en
label: Personnalité

Agent
type: Class
subclass of: PAIR
comment: un Agent est "tout ce qui agit", en particulier tout ce qui peut entretenir des liens avec des Ressources. A ce titre, les Activités, typiquement les Projets, sont considérées comme des sous-classes d'Agent.

Type d'agent
type: Class
subclass of: Type de sujet

Association
type: Class
subclass of: Sujet
comment: Classe abstraite générique permettant de réifier les relations binaires.

Bien ou Service
type: Class
subclass of: Ressource
label: Good or Service @en

Bien intangible
type: Class
subclass of: Ressource
comment: Des biens n'yant pas vraiment de réalité matérielle. Logiciels, méthodologies par exemple.
label: Intangible good @en

Branche
type: Class
subclass of: Champ d'activité
subclass of: Restriction
  on property: hasPart
  all values from: Branche
comment: A branch specifies the sector of activity concerned. Example: Agriculture sector has viticulture as its branch. @en
comment: Une branche spécifie le secteur d'activité concerné. Exemple : Secteur Agriculture a pour branche Viticulture.
label: Branch @en

Enjeu
type: Class
subclass of: Intention
comment: A challenge is an issue to be tackled @en
comment: Un enjeu est un défi à relever
label: Challenge @en
term status: unstable

Concept
type: Class
equivalent class: Concept
subclass of: Entité Pair
comment: Un Concept est entendu au sens de SKOS comme une entrée dans un système de classification.

Bien tangible
type: Class
subclass of: Ressource
comment: Biens ayant une réalité matérielle : Un vidéo-projecteur, un vélo par exemple
label: Tangible good @en

Type de concept
type: Class
subclass of: Type
comment: Types applicable to concepts for "loose typing" @en
label: Concept type @en

Débat
type: Class
subclass of: Idée
comment: A debate brings together several positions around an idea or a divide @en
comment: Un débat fait interagir plusieurs positionnements autour d'une idée ou d'un clivage
label: Debate @en

Lieu numérique
type: Class
subclass of: Lieu
comment: A digital place is a space where actors can come together to carry out activities @en
comment: Un lieu numérique est un espace au sein duquel des acteurs peuvent se retrouver pour mener à bien des activités
label: Digital place @en

Document
type: Class
subclass of: Bien tangible
subclass of: Objet
subclass of: Restriction
  on property: hasObjectType
  all values from: Type de document
subclass of: Restriction
  on property: hasStatus
  all values from: Statut de document
subclass of: Restriction
  on property: hasObjectType
  cardinality: 1
comment: Un document est un support scriptural destiné à documenter un ou plusieurs sujets au sens de PAIR

Statut de document
type: Class
subclass of: Statut
label: Document status @en

Type de document
type: Class
subclass of: Type d'objet
subclass of: Restriction
  on property: type de
  all values from: Document
label: Document type @en

Domaine
type: Class
subclass of: Champ d'activité
subclass of: Restriction
  on property: hasPart
  all values from: Domaine
comment: Subdivision du champ des activités socio-économiques. Les domaines d'activités (ex : Production agricole, Commerce, Conseil etc.) permettent de caractériser la nature d'une activité relative à un secteur (ex: Agriculture) et à une branche (ex : Viticulture).
label: Domain @en

Ecosystème
type: Class
subclass of: Organisation
comment: An ecosystem involves the interaction of several actors. It is more than the sum of its parts. @en
comment: Un écosystème fait interagir plusieurs acteurs. Il est plus que la somme de ses parties.
label: Ecosystem @en

Evénement
type: Class
subclass of: Activité
subclass of: Restriction
  on property: hasStatus
  some values from: Statut d'événement
subclass of: Restriction
  on property: délivré par
  all values from: Projet
comment: Un événement est ici une manifestation organisée par des personnes et / ou des organisations, qui se déroule à un certain endroit, à un certain moment.
label: Event @en

Event involvement association
type: Class
subclass of: Association d'implication
subclass of: Restriction
  on property: involvementActivity
  all values from: Evénement
subclass of: Restriction
  on property: involvementRole
  all values from: Event involvement role

Event involvement role
type: Class
subclass of: Involvement role

Statut d'événement
type: Class
subclass of: Statut d'activité
label: Event status @en

Type d'événement
type: Class
subclass of: Type d'activité
label: Event type @en

Finalité
type: Class
subclass of: Intention
comment: A purpose is a goal in itself, an objective to be achieved @en
comment: Une finalité est un but en soi, un objectif à atteindre
label: Finality @en
term status: unstable

Dossier
type: Class
subclass of: Objet
comment: Folders allow documents to be arranged according to an arbitrary logic @en
comment: Les dossiers permettent de ranger les documents selon une logique arbitraire
label: Folder @en

Type de dossier
type: Class
subclass of: Type d'objet
label: Folder type @en

Groupe
type: Class
subclass of: Organisation
comment: A group is a subdivision of an organisation @en
comment: Un groupe est une subdivision d'une organisation
label: Group @en

Type de groupe
type: Class
subclass of: Type d'organisation
label: Group type @en

Idée
type: Class
subclass of: PAIR
subclass of: Restriction
  on property: hasPart
  all values from: Idée
subclass of: Restriction
  on property: hasStatus
  all values from: Statut d'idée
subclass of: Restriction
  on property: hasSubjectType
  all values from: Type d'idée
comment: An idea is a new and adapted solution to the interlocutor's problem @en
comment: Une idée est une solution nouvelle et adaptée à un problème identifié
label: Idea @en
alternative label: Pensée
alternative label: Thought @en

Statut d'idée
type: Class
subclass of: Statut
label: Idea status @en

Type d'idée
type: Class
subclass of: Type de sujet
label: Idea type @en

Intention
type: Class
subclass of: Sujet
comment: Abstract class allowing to group the classes intended to specify the problems, means, purposes of the PAIRs @en
comment: Classe abstraite permettant de regrouper les classes destinées à spécifier les problèmes, moyens, finalités des PAIRs

Involvement role
type: Class
subclass of: Role

Moyen
type: Class
subclass of: Intention
comment: Le moyen est l'instrument de la réalisation de la finalité
comment: The means is the instrument for the realization of the finality @en
label: Mean @en
deprecated: true
alternative label: méthode
alternative label: processus

Association d'appartenance
type: Class
subclass of: Association
comment: Appartenance d'un Acteur dans une Organisation
comment: Membership of an Actor in an Organization @en
label: Membership association @en

Membership role
type: Class
subclass of: Role
comment: Role of an actor in an organization @en
comment: Rôle d'un acteur dans une organisation

Objet
type: Class
subclass of: Entité Pair
comment: Abstract class allowing to group the classes intended for the management of the documents relating to the subjects of the PAIR ontology @en
comment: Classe abstraite permettant de regrouper les classes destinées à la gestion des documents relatifs aux sujets de l'ontologie PAIR
label: Object @en

Type d'objet
type: Class
subclass of: Type
comment: Classe permettant un typage souple des objets
comment: Types applicable to objects for "loose typing" @en
label: Object type @en

Organisation
type: Class
subclass of: Acteur
subclass of: Restriction
  on property: hasStatus
  all values from: OrganizationStatus
subclass of: Restriction
  on property: hasSubjectType
  all values from: Type d'organisation
comment: Organisation désigne un groupe d'individus s'étant rassemblés autour d'un objectif commun. Une organisation peut être formelle (structure juridique) ou informelle (groupe).
comment: Organization means a group of individuals who have come together for a common purpose. An organization can be formal (legal structure) or informal (group). @en
label: Organization @en

Type d'organisation
type: Class
subclass of: Type d'agent
subclass of: Restriction
  on property: type de
  all values from: Organisation
comment: Type d'organisation permet de caractériser les organisations : Par exemple, Entreprise / SARL ou Association ...
comment: Type of organization allows to characterize the organizations: For example, Company or Association ... @en
label: Organization type @en

PAIR
type: Class
subclass of: Sujet
comment: A PAIR is an element of an ecosystem: Project, Actor, Idea or Resource. But also, a task, or an event etc. @en
comment: Un PAIR est un élément d'un écosystème : Projet, Acteur, Idée ou Ressource.
comment: Un PAIR est un élément d'un écosystème : Projet, Acteur, Idée ou Ressource. Mais également, une tâche, ou un événement etc.

Entité Pair
type: Class
comment: Classe abstraite ayant pour unique rôle de définir des propriétes communes à l'ensemble des classes de l'ontologie PAIR
label: Pair entity @en

Individu
type: Class
subclass of: Acteur
subclass of: Restriction
  on property: affilié par
  all values from: Organisation
subclass of: Restriction
  on property: hasStatus
  all values from: PersonStatus
subclass of: Restriction
  on property: hasSubjectType
  all values from: PersonType
comment: A human being @en
comment: Un être humain
label: Person @en
alternative label: Individual @en
alternative label: Personne

Endroit
type: Class
subclass of: Lieu
subclass of: Restriction
  on property: à pour type
  all values from: Type d'endroit
subclass of: Restriction
  on property: délivré par
  all values from: Projet
comment: A place with an address somewhere in the physical world @en
comment: Un endroit avec une adresse quelque part dans le monde physique
label: Place @en
alternative label: Lieu

Lieu
type: Class
subclass of: Sujet
subclass of: Restriction
  on property: hasPart
  all values from: Lieu
comment: A place with an address somewhere in the physical or digital world @en
comment: Un endroit avec une adresse quelque part dans le monde physique ou numérique
label: Place @en

Type d'endroit
type: Class
subclass of: Type de sujet
subclass of: Restriction
  on property: type de
  all values from: Endroit
comment: Classe permettant un typage souple des lieux
comment: Types applicable to places for "loose typing" @en
label: Place type @en

Adresse postale
type: Class
subclass of: Sujet
comment: Allows you to enter the mailing address of a PAIR @en
comment: Permet de renseigner l'adresse postale d'un PAIR
label: Postal address @en

Projet
type: Class
subclass of: Activité
subclass of: Restriction
  on property: hasStatus
  some values from: Statut de projet
subclass of: Restriction
  on property: implique
  all values from: Class
    union of: Organisation
    union of: Individu
subclass of: Restriction
  on property: nécessite
  all values from: Class
    union of: Bien ou Service
    union of: Compétence
subclass of: Restriction
  on property: produit
  all values from: Class
    union of: Bien ou Service
    union of: Evénement
    union of: Endroit
comment: A project is a temporary action initiated to achieve defined objectives. @en
comment: Un projet est une action temporaire entreprise pour atteindre des objectifs définis.
label: Project @en

Statut de projet
type: Class
subclass of: Statut d'activité
comment: Class allowing to define project statuses in a flexible way. Ex : In progress / Completed @en
comment: Classe permettant de définir de manière souple des statuts de projet. Ex : En cours / Terminé
label: Project status @en

Type de projet
type: Class
subclass of: Type d'activité
comment: Class allowing to define project types in a flexible way. Ex : IT / Territorial @en
comment: Classe permettant de définir de manière souple des types de projet. Ex : Informatique / Territorial
label: Project type @en

Ressource
type: Class
subclass of: PAIR
subclass of: Restriction
  on property: hasPart
  all values from: Ressource
subclass of: Restriction
  on property: hasSubjectType
  all values from: Type de ressource
comment: Ensemble de choses dont on dispose pour agir avec efficacité
comment: Set of things available for effective action @en
label: Resource @en

Type de ressource
type: Class
subclass of: Type de sujet
comment: Class allowing to define in a flexible way types of resources. Ex : software / documentary resources ... @en
comment: Classe permettant de définir de manière souple des types de ressources. Ex : logiciels / ressources documentaires ...
label: Resource type @en

Role
type: Class
subclass of: Concept
comment: un Role d'Agent. "... en tant que ..."

Secteur
type: Class
subclass of: Champ d'activité
subclass of: Restriction
  on property: hasPart
  all values from: Secteur
comment: Subdivision du champ des activités socio-économiques. Un secteur (ex : Agriculture) peut avoir plusieurs branches (ex : Viticulture). Les notions de Secteur et de Branche sont orthogonales avec les domaines d'activités (ex : Production agricole, Commerce, Conseil etc.)

Compétence
type: Class
subclass of: HumanBasedResource
comment: Aptitude d’une personne physique (voire d’une personne morale) dans un domaine particulier
label: Skill @en

Statut
type: Class
subclass of: Concept
label: Status @en

Sujet
type: Class
subclass of: Entité Pair
comment: Les sujets regroupent les concepts clés de l'ontologie PAIR
comment: Classe abstraite permettant de regrouper les classes directement concernées par le domaine de connaissance de l'ontologie PAIR
label: Subject @en

Type de sujet
type: Class
subclass of: Type
comment: Types applicable to subjects for "loose typing" @en
label: Subject type @en

Tâche
type: Class
subclass of: Activité
subclass of: Restriction
  on property: hasStatus
  some values from: Statut de tâche
comment: A task is an action to be carried out in order to complete an activity @en
comment: Une tâche est une action à réaliser en vue de mener à bien une activité
label: Task @en

Statut de tâche
type: Class
subclass of: Statut d'activité

Type de tâche
type: Class
subclass of: Type d'activité

Thème
type: Class
equivalent class: Topic
subclass of: Concept
comment: Cet identifiant est déprécié en faveur de pair:Topic
comment: Thème réfère à ce dont on parle, au sujet qui nous anime. Les thèmes rassemblent les notions, les concepts, les centres d'intérêts, les "tags".
label: Topic @en
deprecated: true

Topic
type: Class
subclass of: Concept
comment: Thème réfère à ce dont on parle, au sujet qui nous anime. Les thèmes rassemblent les notions, les concepts, les centres d'intérêts, les "tags".

Ville
type: Class
subclass of: Endroit
label: City @en
alternative label: Town @en

Type
type: Class
subclass of: Concept
comment: Les types sont utilisés pour spécifier de manière souple la nature des entités concernées
comment: Types are used to specify the nature of the entities concerned @en

ExperienceAssociation
type: Class
subclass of: Association
comment: Expérience d'un individu dans une compétence, avec un certain niveau ("grade"). Un lien direct entre une personne et une compétence existe également, mais sans possibilité de préciser le niveau.

Grade
type: Class
subclass of: Concept
comment: Un niveau d'expérience d'une personne dans une compétence (débutant, confirmé, avancé, expert, etc...)

Mean
type: Class
subclass of: Intention
term status: unstable

Statut d'agent
label: Agent status @en