AcademicResearch
type: Class
created: 2018-12-10
creator: Harshvardhan J. Pandit, Javier Fernandez, Axel Polleres, Elmar Kiesling, Fajar Ekaputra, Simon Steyskal
date-accepted: 2019-04-05
description: Research conducted in an academic context e.g. within universities
subclass of: ResearchAndDevelopment
term status: accepted

Accent
type: Class
created: 2019-04-04
creator: Elmar; Harshvardhan J. Pandit, Fajar
date-accepted: 2019-06-04
description: Information about an individualâs accent.
subclass of: Language
term status: accepted

AccessControl
type: Class
created: 2018-12-10
creator: Harshvardhan J. Pandit, Javier Fernandez, Axel Polleres, Elmar Kiesling, Fajar Ekaputra, Simon Steyskal
date-accepted: 2019-04-05
description: To conduct or enforce access control
subclass of: Security
term status: accepted

AccessControlMethod
type: Class
created: 2019-04-04
creator: Axel Polleres, Rob Brennan, Harshvardhan J. Pandit, Mark Lizar
date-accepted: 2019-04-05
description: methods which restrict access to a place or resource
subclass of: TechnicalMeasure
term status: accepted

AccountIdentifier
type: Class
created: 2019-04-04
creator: Elmar; Harshvardhan J. Pandit, Fajar
date-accepted: 2019-06-04
description: Information about an individual's financial account identifier.
subclass of: FinancialAccount
term status: accepted

Acquantaince
type: Class
created: 2019-04-04
creator: Elmar; Harshvardhan J. Pandit, Fajar
date-accepted: 2019-06-04
description: Information about acquaintainces in a social network.
subclass of: SocialNetwork
term status: accepted

Acquire
type: Class
created: 2019-04-04
date-accepted: 2019-05-07
description: to come into possession or control of the data
subclass of: Obtain
term status: accepted

Adapt
type: Class
created: 2019-04-04
date-accepted: 2019-05-07
description: to modify the data, often rewritten into a new form for a new use
subclass of: Transform
term status: accepted

Age
type: Class
created: 2019-04-04
creator: Elmar; Harshvardhan J. Pandit, Fajar
date-accepted: 2019-06-04
description: Information about an individual's age
subclass of: PhysicalCharacteristic
term status: accepted

Align
type: Class
created: 2019-04-04
date-accepted: 2019-05-07
description: to adjust the data to be in relation to another data
subclass of: Transform
term status: accepted

Alter
type: Class
created: 2019-04-04
date-accepted: 2019-05-07
description: to change the data withouth changing it into something else
subclass of: Transform
term status: accepted

Analyse
type: Class
created: 2019-04-04
date-accepted: 2019-05-07
description: to study or examine the data in detail
subclass of: Use
term status: accepted

Anonymise
type: Class
created: 2019-04-04
date-accepted: 2019-05-07
description: to irreversibly alter personal data in such a way that a unique data subject can no longer be identified directly or indirectly or in combination with other data
subclass of: Transform
term status: accepted

Anonymization
type: Class
created: 2019-04-04
creator: Axel Polleres, Rob Brennan, Harshvardhan J. Pandit, Mark Lizar
date-accepted: 2019-04-05
description: process by which personal data is irreversibly altered in such a way that a data subject can no longer be identified directly or indirectly, either by the data controller alone or in collaboration with any other party
subclass of: PseudoAnonymization
term status: accepted

ApartmentOwned
type: Class
created: 2019-04-04
creator: Elmar; Harshvardhan J. Pandit, Fajar
date-accepted: 2019-06-04
description: Information on the apartement(s) owned by an individual.
subclass of: HouseOwned
term status: accepted

Association
type: Class
created: 2019-04-04
creator: Elmar; Harshvardhan J. Pandit, Fajar
date-accepted: 2019-06-04
description: Information about associations in a social network with other individuals, groups, or entities e.g. friend of a friend
subclass of: SocialNetwork
term status: accepted

Attitude
type: Class
created: 2019-04-04
creator: Elmar; Harshvardhan J. Pandit, Fajar
date-accepted: 2019-06-04
description: Information that relates to an individual's attitude.
subclass of: Behavioral
term status: accepted

Authenticating
type: Class
created: 2019-04-04
creator: Elmar; Harshvardhan J. Pandit, Fajar
date-accepted: 2019-06-04
description: Information used to authenticate an individual with something they know
subclass of: Internal
term status: accepted

AuthenticationProtocols
type: Class
created: 2019-04-04
creator: Axel Polleres, Rob Brennan, Harshvardhan J. Pandit, Mark Lizar
date-accepted: 2019-04-05
description: protocols involving validation of identity i.e. authentication of a person or information
subclass of: TechnicalMeasure
term status: accepted

AuthorisationProcedure
type: Class
created: 2019-04-04
creator: Axel Polleres, Rob Brennan, Harshvardhan J. Pandit, Mark Lizar
date-accepted: 2019-04-05
description: Specifies procedures for determining permission or authority
subclass of: OrganisationalMeasure
term status: accepted

BankAccount
type: Class
created: 2019-04-04
creator: Elmar; Harshvardhan J. Pandit, Fajar
date-accepted: 2019-06-04
description: Information related to an individual's bank account.
subclass of: FinancialAccount
term status: accepted

Behavioral
type: Class
created: 2019-04-04
creator: Elmar; Harshvardhan J. Pandit, Fajar
date-accepted: 2019-06-04
description: Information that describes an individualâs behavior or activity, on-line or off
subclass of: External
term status: accepted

Beneficiary
type: Class
created: 2019-05-23
description: self.DataSubject, self.DataController, society ? ( --- under consideration ---)
term status: proposed

Biometric
type: Class
created: 2019-04-04
creator: Elmar; Harshvardhan J. Pandit, Fajar
date-accepted: 2019-06-04
description: Biometric information on an individual.
subclass of: Identifying
subclass of: SpecialCategoryPersonalData
term status: accepted

BloodType
type: Class
created: 2019-04-04
creator: Elmar; Harshvardhan J. Pandit, Fajar
date-accepted: 2019-06-04
description: Information about an individual's blood type.
subclass of: MedicalHealth
term status: accepted

BrowserFingerprint
type: Class
created: 2019-04-04
creator: Elmar; Harshvardhan J. Pandit, Fajar
date-accepted: 2019-06-04
description: Information that characterizes the browser used by an individual, which in turn can be used to uniquely identify a user.
subclass of: DeviceBased
term status: accepted

BrowsingBehavior
type: Class
created: 2019-04-04
creator: Elmar; Harshvardhan J. Pandit, Fajar
date-accepted: 2019-06-04
description: Information that relates to an individual's browsing behaviour.
subclass of: Behavioral
term status: accepted

CallLog
type: Class
created: 2019-04-04
creator: Elmar; Harshvardhan J. Pandit, Fajar
date-accepted: 2019-06-04
description: Information on the calls that an individual has made.
subclass of: Behavioral
term status: accepted

CarOwned
type: Class
created: 2019-04-04
creator: Elmar; Harshvardhan J. Pandit, Fajar
date-accepted: 2019-06-04
description: Information about cars owned by an individual.
subclass of: Ownership
term status: accepted

Certification
type: Class
created: 2019-04-04
creator: Axel Polleres, Rob Brennan, Harshvardhan J. Pandit, Mark Lizar
creator: Elmar; Harshvardhan J. Pandit, Fajar
date-accepted: 2019-04-05
date-accepted: 2019-06-04
description: Information about professional certifications associated with an individual
description: certification mechanisms, seals, and marks for the purpose of demonstrating compliance
subclass of: CertificationSeal
subclass of: Professional
term status: accepted

CertificationSeal
type: Class
created: 2019-04-04
creator: Axel Polleres, Rob Brennan, Harshvardhan J. Pandit, Mark Lizar
date-accepted: 2019-04-05
description: Category of certifications, seals, and marks indicating compliance to regulations or practices
subclass of: OrganisationalMeasure
term status: accepted

Character
type: Class
created: 2019-04-04
creator: Elmar; Harshvardhan J. Pandit, Fajar
date-accepted: 2019-06-04
description: Information about an individual's character in the public sphere
subclass of: PublicLife
term status: accepted

Child
type: Class
created: 2019-06-06
creator: Harshvardhan J. Pandit
description: A 'child' is a natural legal person who is below a certain legal age depending on the legal jurisdiction.
comment: A 'child' is distinct from a 'minor'. For example, the legal age for a 'minor' in most countries is 18, whereas a 'child' can be a minor below the age of 14.
subclass of: DataSubject
term status: proposed

CodeOfConduct
type: Class
created: 2019-04-04
creator: Axel Polleres, Rob Brennan, Harshvardhan J. Pandit, Mark Lizar
date-accepted: 2019-04-05
description: A set of rules or procedures outlining the norms and practices for conducting activities
subclass of: GuidelinesPrinciple
term status: accepted

Collect
type: Class
created: 2019-04-04
date-accepted: 2019-05-07
description: to gather data from someone
subclass of: Obtain
term status: accepted

Combine
type: Class
created: 2019-04-04
date-accepted: 2019-05-07
description: to join or merge data
subclass of: Transform
term status: accepted

CommercialInterest
type: Class
created: 2018-12-10
creator: Harshvardhan J. Pandit, Javier Fernandez, Axel Polleres, Elmar Kiesling, Fajar Ekaputra, Simon Steyskal
date-accepted: 2019-04-05
description: For purposes of commercial activities i.e. of profit or benefit to the Controller
subclass of: Purpose
term status: accepted

CommercialResearch
type: Class
created: 2018-12-10
creator: Harshvardhan J. Pandit, Javier Fernandez, Axel Polleres, Elmar Kiesling, Fajar Ekaputra, Simon Steyskal
date-accepted: 2019-04-05
description: Research conducted in a commercial setting e.g. in a company
subclass of: ResearchAndDevelopment
term status: accepted

Communication
type: Class
created: 2019-04-04
creator: Elmar; Harshvardhan J. Pandit, Fajar
date-accepted: 2019-06-04
description: Information communicated from or to an individual
subclass of: Social
term status: accepted

CommunicationsMetadata
type: Class
created: 2019-04-04
creator: Elmar; Harshvardhan J. Pandit, Fajar
date-accepted: 2019-06-04
description: Information about communication metadata in the public sphere
subclass of: PublicLife
term status: accepted

Connection
type: Class
created: 2019-04-04
creator: Elmar; Harshvardhan J. Pandit, Fajar
date-accepted: 2019-06-04
description: Information about and including connections of an individual in a social network
subclass of: SocialNetwork
term status: accepted

Consent
type: Class
created: 2019-04-04
creator: Harshvardhan J. Pandit, Mark Lizar, Bud Bruegger
date-accepted: 2019-04-05
description: Consent as defined by Article 4(11) of the GDPR
term status: accepted

Consult
type: Class
created: 2019-04-04
date-accepted: 2019-05-07
description: to consult or query data
subclass of: Use
term status: accepted

Contact
type: Class
created: 2019-04-04
creator: Elmar; Harshvardhan J. Pandit, Fajar
date-accepted: 2019-06-04
description: Information that can be used for contacting an individual e.g. email address or phone number
subclass of: Tracking
term status: accepted

Context
type: Class
created: 2019-04-04
date-accepted: 2019-04-05
description: Used to scope the purpose, e.g. restriction to a certain business sector
term status: accepted

Contract
type: Class
created: 2019-04-04
creator: Axel Polleres, Rob Brennan, Harshvardhan J. Pandit, Mark Lizar
date-accepted: 2019-04-05
description: Contractual terms governing data handling within the data controller
subclass of: LegalAgreement
term status: accepted

Copy
type: Class
created: 2019-04-04
date-accepted: 2019-05-07
description: to produce an exact reprodution of the data
subclass of: Processing
term status: accepted

Country
type: Class
created: 2019-04-04
creator: Elmar; Harshvardhan J. Pandit, Fajar
date-accepted: 2019-06-04
description: Information about an individualâs country e.g. residence, travel.
subclass of: Location
term status: accepted

CreateEventRecommendations
type: Class
created: 2019-11-25
creator: Harshvardhan J. Pandit, Rudy Jacob
description: Create and provide personalised recommendations for events to the individual.
subclass of: CreatePersonalizedRecommendations
term status: proposed

CreatePersonalizedRecommendations
type: Class
created: 2019-11-25
creator: Harshvardhan J. Pandit, Rudy Jacob
description: Create and provide personalised recommendations to the individual.
subclass of: ServicePersonalization
term status: proposed

CreateProductRecommendations
type: Class
created: 2018-12-10
creator: Harshvardhan J. Pandit, Javier Fernandez, Axel Polleres, Elmar Kiesling, Fajar Ekaputra, Simon Steyskal
date-accepted: 2019-04-05
modified: 2019-11-25
description: To create product recommendations e.g. suggest similar products
subclass of: CreatePersonalizedRecommendations
term status: accepted

Credit
type: Class
created: 2019-04-04
creator: Elmar; Harshvardhan J. Pandit, Fajar
date-accepted: 2019-06-04
description: Information about an individualâs reputation with regards to money
subclass of: Financial
subclass of: Transactional
term status: accepted

CreditCapacity
type: Class
created: 2019-04-04
creator: Elmar; Harshvardhan J. Pandit, Fajar
date-accepted: 2019-06-04
description: Information relating to an individual's credit capacity.
subclass of: Credit
term status: accepted

CreditCardNumber
type: Class
created: 2019-04-04
creator: Elmar; Harshvardhan J. Pandit, Fajar
date-accepted: 2019-06-04
description: Information about an individual's credit card number
subclass of: AccountIdentifier
term status: accepted

CreditRecord
type: Class
created: 2019-04-04
creator: Elmar; Harshvardhan J. Pandit, Fajar
date-accepted: 2019-06-04
description: Information relating to an individual's credit record.
subclass of: Credit
term status: accepted

CreditScore
type: Class
created: 2019-04-04
creator: Elmar; Harshvardhan J. Pandit, Fajar
date-accepted: 2019-06-04
description: Information relating to an individual's credit score.
subclass of: CreditWorthiness
term status: accepted

CreditStanding
type: Class
created: 2019-04-04
creator: Elmar; Harshvardhan J. Pandit, Fajar
date-accepted: 2019-06-04
description: Information relating to an individual's credit standing.
subclass of: Credit
term status: accepted

CreditWorthiness
type: Class
created: 2019-04-04
creator: Elmar; Harshvardhan J. Pandit, Fajar
date-accepted: 2019-06-04
description: Information relating to an individual's credit worthiness.
subclass of: Credit
term status: accepted

Criminal
type: Class
created: 2019-04-04
creator: Elmar; Harshvardhan J. Pandit, Fajar
date-accepted: 2019-06-04
description: Information about an individualâs criminal activity e.g. criminal convictions or jail time
subclass of: Social
term status: accepted

CriminalCharge
type: Class
created: 2019-04-04
creator: Elmar; Harshvardhan J. Pandit, Fajar
date-accepted: 2019-06-04
description: Information on an individual's criminal charges.
subclass of: Criminal
term status: accepted

CriminalConviction
type: Class
created: 2019-04-04
creator: Elmar; Harshvardhan J. Pandit, Fajar
date-accepted: 2019-06-04
description: Information on an individual's criminal convictions.
subclass of: Criminal
term status: accepted

CriminalPardon
type: Class
created: 2019-04-04
creator: Elmar; Harshvardhan J. Pandit, Fajar
date-accepted: 2019-06-04
description: Information on an individual's criminal pardons.
subclass of: Criminal
term status: accepted

CustomerCare
type: Class
created: 2018-12-10
creator: Harshvardhan J. Pandit, Javier Fernandez, Axel Polleres, Elmar Kiesling, Fajar Ekaputra, Simon Steyskal
date-accepted: 2019-04-05
description: Processes related to providing assistance for customer satisfaction
subclass of: ServiceProvision
term status: accepted

DNACode
type: Class
created: 2019-04-04
creator: Elmar; Harshvardhan J. Pandit, Fajar
date-accepted: 2019-06-04
description: Information about an individual's DNA.
subclass of: MedicalHealth
term status: accepted

DataController
type: Class
created: 2019-04-04
creator: Axel Polleres, Javier Ferenandez
date-accepted: 2019-04-05
description: The class of Data Controllers that control this particular data handling, any legal entity that is defined by article 4.7 of GDPR.
term status: accepted

DataProcessor
type: Class
created: 2019-06-04
creator: Harshvardhan J. Pandit
date-accepted: 2019-06-04
description: âprocessorâ means a natural or legal person, public authority, agency or other body which processes personal data on behalf of the controller;
subclass of: Recipient
term status: approved

DataSubject
type: Class
created: 2019-04-04
creator: Axel Polleres, Javier Ferenandez
date-accepted: 2019-04-05
description: The class of Data Subject that this particular data handling applies to, any legal entity that is defined by article 4.1 of GDPR.
term status: accepted

DeIdentification
type: Class
created: 2019-04-04
creator: Axel Polleres, Rob Brennan, Harshvardhan J. Pandit, Mark Lizar
date-accepted: 2019-04-05
description: Process by identifiable personal data (PII) is converted to un-identifiable personal data
subclass of: PseudoAnonymization
term status: accepted

DeliveryOfGoods
type: Class
created: 2018-12-10
creator: Harshvardhan J. Pandit, Javier Fernandez, Axel Polleres, Elmar Kiesling, Fajar Ekaputra, Simon Steyskal
date-accepted: 2019-04-05
description: To deliver goods and services
subclass of: ServiceProvision
term status: accepted

Demeanor
type: Class
created: 2019-04-04
creator: Elmar; Harshvardhan J. Pandit, Fajar
date-accepted: 2019-06-04
description: Information that relates to an individual's demeanor.
subclass of: Behavioral
term status: accepted

Demographic
type: Class
created: 2019-04-04
creator: Elmar; Harshvardhan J. Pandit, Fajar
date-accepted: 2019-06-04
description: Information that describes an individualâs characteristics shared with others
subclass of: External
term status: accepted

Derive
type: Class
created: 2019-04-04
date-accepted: 2019-05-07
description: to create new derivative data from the original data
subclass of: Transform
term status: accepted

DerivedPersonalData
type: Class
created: 2019-05-07
creator: Elmar; Harshvardhan J. Pandit, Fajar
date-accepted: 2019-05-07
description: Derived data is data that has not been directly provided by the DataSubject, but has been derived from other collected or externally obtained data.
subclass of: PersonalDataCategory
term status: accepted

DesignStandard
type: Class
created: 2019-04-04
creator: Axel Polleres, Rob Brennan, Harshvardhan J. Pandit, Mark Lizar
date-accepted: 2019-04-05
description: A set of rules or guidelines outlining criterias for design
subclass of: GuidelinesPrinciple
term status: accepted

Destruct
type: Class
created: 2019-04-04
date-accepted: 2019-05-07
description: to process data in a way it no longer exists or cannot be repaired
subclass of: Remove
term status: accepted

DeviceBased
type: Class
created: 2019-04-04
creator: Elmar; Harshvardhan J. Pandit, Fajar
date-accepted: 2019-06-04
description: Information about a device that an individual uses for personal use (even part-time or with others)
subclass of: Tracking
term status: accepted

Dialect
type: Class
created: 2019-04-04
creator: Elmar; Harshvardhan J. Pandit, Fajar
date-accepted: 2019-06-04
description: Information about an individualâs dialect.
subclass of: Language
term status: accepted

Disability
type: Class
created: 2019-04-04
creator: Elmar; Harshvardhan J. Pandit, Fajar
date-accepted: 2019-06-04
description: Information about an individual's disabilities.
subclass of: MedicalHealth
term status: accepted

DisciplinaryAction
type: Class
created: 2019-04-04
creator: Elmar; Harshvardhan J. Pandit, Fajar
date-accepted: 2019-06-04
description: Information about disciplinary actions associated with an individual
subclass of: Professional
term status: accepted

Disclose
type: Class
created: 2019-04-04
date-accepted: 2019-05-07
description: to make data known
subclass of: Processing
term status: accepted

DiscloseByTransmission
type: Class
created: 2019-04-04
date-accepted: 2019-05-07
description: to disclose data by means of transmission
subclass of: Disclose
term status: accepted

Dislike
type: Class
created: 2019-04-04
creator: Elmar; Harshvardhan J. Pandit, Fajar
date-accepted: 2019-06-04
description: Information relating to a user's dislikes.
subclass of: Interest
term status: accepted

Disseminate
type: Class
created: 2019-04-04
date-accepted: 2019-05-07
description: to spread data throughout
subclass of: Disclose
term status: accepted

Divorce
type: Class
created: 2019-04-04
creator: Elmar; Harshvardhan J. Pandit, Fajar
date-accepted: 2019-06-04
description: Information about an individual's divorce(s).
subclass of: FamilyStructure
term status: accepted

DrugTestResult
type: Class
created: 2019-04-04
creator: Elmar; Harshvardhan J. Pandit, Fajar
date-accepted: 2019-06-04
description: Information about an individual's drug test results.
subclass of: MedicalHealth
term status: accepted

EmailAddress
type: Class
created: 2019-04-04
creator: Elmar; Harshvardhan J. Pandit, Fajar
date-accepted: 2019-06-04
description: Information about an individual's Email address.
subclass of: Contact
term status: accepted

EmailContent
type: Class
created: 2019-04-04
creator: Elmar; Harshvardhan J. Pandit, Fajar
date-accepted: 2019-06-04
description: The contents of Emails that an individual sends or receives.
subclass of: Communication
term status: accepted

EmploymentHistory
type: Class
created: 2019-04-04
creator: Elmar; Harshvardhan J. Pandit, Fajar
date-accepted: 2019-06-04
description: Information about an individual's employment history
subclass of: Professional
term status: accepted

EncryptionInRest
type: Class
created: 2019-04-04
creator: Axel Polleres, Rob Brennan, Harshvardhan J. Pandit, Mark Lizar
date-accepted: 2019-04-05
description: Encryption of data when being stored (persistent encryption)
subclass of: PseudonymisationEncryption
term status: accepted

EncryptionInTransfer
type: Class
created: 2019-04-04
creator: Axel Polleres, Rob Brennan, Harshvardhan J. Pandit, Mark Lizar
date-accepted: 2019-04-05
description: Encryption of data in transit e.g. when being transferred from one location to another, including sharing
subclass of: PseudonymisationEncryption
term status: accepted

Erase
type: Class
created: 2019-04-04
date-accepted: 2019-05-07
description: to delete data
subclass of: Remove
term status: accepted

EthnicOrigin
type: Class
created: 2019-04-04
creator: Elmar; Harshvardhan J. Pandit, Fajar
date-accepted: 2019-06-04
description: Information related to an individual's ethnic origin.
subclass of: Ethnicity
subclass of: SpecialCategoryPersonalData
term status: accepted

Ethnicity
type: Class
created: 2019-04-04
creator: Elmar; Harshvardhan J. Pandit, Fajar
date-accepted: 2019-06-04
description: Information that describes an individualâs origins and lineage
subclass of: External
term status: accepted

External
type: Class
created: 2019-04-04
creator: Elmar; Harshvardhan J. Pandit, Fajar
date-accepted: 2019-06-04
description: Personal Data that can be observed by another person i.e. has external characteristics that make it visible
subclass of: PersonalDataCategory
term status: accepted

Family
type: Class
created: 2019-04-04
creator: Elmar; Harshvardhan J. Pandit, Fajar
date-accepted: 2019-06-04
description: Information about an individualâs family and relationships
subclass of: Social
term status: accepted

FamilyHealthHistory
type: Class
created: 2019-04-04
creator: Elmar; Harshvardhan J. Pandit, Fajar
date-accepted: 2019-06-04
description: Information related to an individual's family health history.
subclass of: HealthHistory
term status: accepted

FamilyStructure
type: Class
created: 2019-04-04
creator: Elmar; Harshvardhan J. Pandit, Fajar
date-accepted: 2019-06-04
description: Information that describes an individual's family structure.
subclass of: Family
term status: accepted

Favorite
type: Class
created: 2019-04-04
creator: Elmar; Harshvardhan J. Pandit, Fajar
date-accepted: 2019-06-04
description: Information about an individual's favorites
subclass of: Preference
term status: accepted

FavoriteColor
type: Class
created: 2019-04-04
creator: Elmar; Harshvardhan J. Pandit, Fajar
date-accepted: 2019-06-04
description: Information about an individual's favorite color.
subclass of: Favorite
term status: accepted

FavoriteFood
type: Class
created: 2019-04-04
creator: Elmar; Harshvardhan J. Pandit, Fajar
date-accepted: 2019-06-04
description: Information about an individual's favorite food.
subclass of: Favorite
term status: accepted

FavoriteMusic
type: Class
created: 2019-04-04
creator: Elmar; Harshvardhan J. Pandit, Fajar
date-accepted: 2019-06-04
description: Information about an individual's favorite music.
subclass of: Favorite
term status: accepted

Fetish
type: Class
created: 2019-04-04
creator: Elmar; Harshvardhan J. Pandit, Fajar
date-accepted: 2019-06-04
description: Information an individual's sexual fetishes
subclass of: Sexual
term status: accepted

Financial
type: Class
created: 2019-04-04
creator: Elmar; Harshvardhan J. Pandit, Fajar
date-accepted: 2019-06-04
description: Personal data regarding finance or monetary information
subclass of: PersonalDataCategory
term status: accepted

FinancialAccount
type: Class
created: 2019-04-04
creator: Elmar; Harshvardhan J. Pandit, Fajar
date-accepted: 2019-06-04
description: Information that identifies an individualâs financial account
subclass of: Financial
term status: accepted

FinancialAccountNumber
type: Class
created: 2019-04-04
creator: Elmar; Harshvardhan J. Pandit, Fajar
date-accepted: 2019-06-04
description: Information about an individual's financial account number
subclass of: AccountIdentifier
term status: accepted

Fingerprint
type: Class
created: 2019-04-04
creator: Elmar; Harshvardhan J. Pandit, Fajar
date-accepted: 2019-06-04
description: Information related to an individual's fingerprint used for biometric purposes.
subclass of: Biometric
term status: accepted

FraudPreventionAndDetection
type: Class
created: 2018-12-10
creator: Harshvardhan J. Pandit, Javier Fernandez, Axel Polleres, Elmar Kiesling, Fajar Ekaputra, Simon Steyskal
date-accepted: 2019-04-05
description: To detect and prevent fraud
subclass of: Security
term status: accepted

Friend
type: Class
created: 2019-04-04
creator: Elmar; Harshvardhan J. Pandit, Fajar
date-accepted: 2019-06-04
description: Information about friends of the individual in a social network. Includes aspects of friendships such as years together or nature of friendship.
subclass of: SocialNetwork
term status: accepted

GPSCoordinate
type: Class
created: 2019-04-04
creator: Elmar; Harshvardhan J. Pandit, Fajar
date-accepted: 2019-06-04
description: Global position system coordinates of a user's location.
subclass of: Location
term status: accepted

Gender
type: Class
created: 2019-04-04
creator: Elmar; Harshvardhan J. Pandit, Fajar
date-accepted: 2019-06-04
description: Information about an individual's gender
subclass of: PhysicalCharacteristic
term status: accepted

GeneralReputation
type: Class
created: 2019-04-04
creator: Elmar; Harshvardhan J. Pandit, Fajar
date-accepted: 2019-06-04
description: Information about an individual's reputation in the public sphere
subclass of: PublicLife
term status: accepted

Geographic
type: Class
created: 2019-04-04
creator: Elmar; Harshvardhan J. Pandit, Fajar
date-accepted: 2019-06-04
description: Geographic information relating to an individual (e.g., home address)
subclass of: Demographic
term status: accepted

GroupMembership
type: Class
created: 2019-04-04
creator: Elmar; Harshvardhan J. Pandit, Fajar
date-accepted: 2019-06-04
description: Information about groups the individual is included or associated with in a social network
subclass of: SocialNetwork
term status: accepted

GuidelinesPrinciple
type: Class
created: 2019-04-04
creator: Axel Polleres, Rob Brennan, Harshvardhan J. Pandit, Mark Lizar
date-accepted: 2019-04-05
description: Guidelines or Principles regarding processing and operational measures
subclass of: OrganisationalMeasure
term status: accepted

HairColor
type: Class
created: 2019-04-04
creator: Elmar; Harshvardhan J. Pandit, Fajar
date-accepted: 2019-06-04
description: Information about an individual's hair colour
subclass of: PhysicalCharacteristic
term status: accepted

Health
type: Class
created: 2019-04-04
creator: Elmar; Harshvardhan J. Pandit, Fajar
date-accepted: 2019-06-04
description: Information about an individual's health.
subclass of: MedicalHealth
term status: accepted

HealthHistory
type: Class
created: 2019-04-04
creator: Elmar; Harshvardhan J. Pandit, Fajar
date-accepted: 2019-06-04
description: Information about an individual's health history.
subclass of: MedicalHealth
term status: accepted

HealthRecord
type: Class
created: 2019-04-04
creator: Elmar; Harshvardhan J. Pandit, Fajar
date-accepted: 2019-06-04
description: Information about an individual's health record.
subclass of: MedicalHealth
term status: accepted

Height
type: Class
created: 2019-04-04
creator: Elmar; Harshvardhan J. Pandit, Fajar
date-accepted: 2019-06-04
description: Information about an individual's physical height
subclass of: PhysicalCharacteristic
term status: accepted

Historical
type: Class
created: 2019-04-04
creator: Elmar; Harshvardhan J. Pandit, Fajar
date-accepted: 2019-06-04
description: Historical personal data is that which is related to or relevant for history or past events in the context of the person or their life.
subclass of: PersonalDataCategory
term status: accepted

HouseOwned
type: Class
created: 2019-04-04
creator: Elmar; Harshvardhan J. Pandit, Fajar
date-accepted: 2019-06-04
description: Information about house(s) owned by an individual.
subclass of: Ownership
term status: accepted

IPAddress
type: Class
created: 2019-04-04
creator: Elmar; Harshvardhan J. Pandit, Fajar
date-accepted: 2019-06-04
description: An Internet protocol (IP) address of a device used by an individual.
subclass of: DeviceBased
term status: accepted

Identifying
type: Class
created: 2019-04-04
creator: Elmar; Harshvardhan J. Pandit, Fajar
date-accepted: 2019-06-04
description: Information that uniquely or semi-uniquely identifies a specific individual
subclass of: External
term status: accepted

IdentityVerification
type: Class
created: 2018-12-10
creator: Harshvardhan J. Pandit, Javier Fernandez, Axel Polleres, Elmar Kiesling, Fajar Ekaputra, Simon Steyskal
date-accepted: 2019-04-05
description: To verify and authorise identity
subclass of: Security
term status: accepted

ImproveExistingProductsAndServices
type: Class
created: 2018-12-10
creator: Harshvardhan J. Pandit, Javier Fernandez, Axel Polleres, Elmar Kiesling, Fajar Ekaputra, Simon Steyskal
date-accepted: 2019-04-05
description: To improve existing products and services
subclass of: OptimisationForController
term status: accepted

ImproveInternalCRMProcesses
type: Class
created: 2018-12-10
creator: Harshvardhan J. Pandit, Javier Fernandez, Axel Polleres, Elmar Kiesling, Fajar Ekaputra, Simon Steyskal
date-accepted: 2019-04-05
description: To improve customer-relationship management (CRM) processes
subclass of: OptimisationForController
term status: accepted

Income
type: Class
created: 2019-04-04
creator: Elmar; Harshvardhan J. Pandit, Fajar
date-accepted: 2019-06-04
description: Information about financial income e.g. for individual or household or family
subclass of: Transactional
term status: accepted

IncomeBracket
type: Class
created: 2019-04-04
creator: Elmar; Harshvardhan J. Pandit, Fajar
date-accepted: 2019-06-04
description: Information about an individual's income bracket.
subclass of: Demographic
term status: accepted

IncreaseServiceRobustness
type: Class
created: 2018-12-10
creator: Harshvardhan J. Pandit, Javier Fernandez, Axel Polleres, Elmar Kiesling, Fajar Ekaputra, Simon Steyskal
date-accepted: 2019-04-05
description: To improve the robustness and resilience of services
subclass of: OptimisationForController
term status: accepted

IndividualHealthHistory
type: Class
created: 2019-04-04
creator: Elmar; Harshvardhan J. Pandit, Fajar
date-accepted: 2019-06-04
description: Information related to an individual's information health history.
subclass of: HealthHistory
term status: accepted

Intention
type: Class
created: 2019-04-04
creator: Elmar; Harshvardhan J. Pandit, Fajar
date-accepted: 2019-06-04
description: Information about an individual's intentions
subclass of: Preference
term status: accepted

Interaction
type: Class
created: 2019-04-04
creator: Elmar; Harshvardhan J. Pandit, Fajar
date-accepted: 2019-06-04
description: Information about an individual's interactions in the public sphere
subclass of: PublicLife
term status: accepted

Interest
type: Class
created: 2019-04-04
creator: Elmar; Harshvardhan J. Pandit, Fajar
date-accepted: 2019-06-04
description: Information about an individual's interests
subclass of: Preference
term status: accepted

Internal
type: Class
created: 2019-04-04
creator: Elmar; Harshvardhan J. Pandit, Fajar
date-accepted: 2019-06-04
description: Personal data about characteristics of an individual that are internal i.e. cannot be seen or observed
subclass of: PersonalDataCategory
term status: accepted

InternalResourceOptimisation
type: Class
created: 2018-12-10
creator: Harshvardhan J. Pandit, Javier Fernandez, Axel Polleres, Elmar Kiesling, Fajar Ekaputra, Simon Steyskal
date-accepted: 2019-04-05
description: Optimisation of internal resources used by the organisation e.g. resource usage
subclass of: OptimisationForController
term status: accepted

Job
type: Class
created: 2019-04-04
creator: Elmar; Harshvardhan J. Pandit, Fajar
date-accepted: 2019-06-04
description: Information about an individual's professional jobs
subclass of: Professional
term status: accepted

KnowledgeBelief
type: Class
created: 2019-04-04
creator: Elmar; Harshvardhan J. Pandit, Fajar
date-accepted: 2019-06-04
description: Information about what a person knows or believes
subclass of: Internal
term status: accepted

Language
type: Class
created: 2019-04-04
creator: Elmar; Harshvardhan J. Pandit, Fajar
date-accepted: 2019-06-04
description: Information related to an individual's language.
subclass of: Ethnicity
term status: accepted

LegalAgreement
type: Class
created: 2019-04-04
creator: Axel Polleres, Rob Brennan, Harshvardhan J. Pandit, Mark Lizar
date-accepted: 2019-04-05
description: A legally binding agreement
subclass of: OrganisationalMeasure
term status: accepted

LegalBasis
type: Class
created: 2019-04-04
date-accepted: 2019-04-05
description: A particular legal Basis, which permits personal Data handling (e.g. Consent, etc.)
term status: accepted

LegalEntity
type: Class
created: 2019-04-04
creator: Harshvardhan J. Pandit, Mark Lizar, Bud Bruegger
date-accepted: 2019-04-05
description: A Person or Organisation, including Data Subjects, that constitute as a legal entity.
subclass of: Agent
term status: accepted

LifeHistory
type: Class
created: 2019-04-04
creator: Elmar; Harshvardhan J. Pandit, Fajar
date-accepted: 2019-06-04
description: Information about an individualâs personal history (e.g., events that happened in a personâs life, either to them or just around them which might have influenced them (WWII, 9/11)).
subclass of: Historical
term status: accepted

Like
type: Class
created: 2019-04-04
creator: Elmar; Harshvardhan J. Pandit, Fajar
date-accepted: 2019-06-04
description: Information relating to a user's likes.
subclass of: Interest
term status: accepted

LinkClicked
type: Class
created: 2019-04-04
creator: Elmar; Harshvardhan J. Pandit, Fajar
date-accepted: 2019-06-04
description: Information on the links that an individual has clicked.
subclass of: Behavioral
term status: accepted

LoanRecord
type: Class
created: 2019-04-04
creator: Elmar; Harshvardhan J. Pandit, Fajar
date-accepted: 2019-06-04
description: Information about loans provided or related to the individual
subclass of: Transactional
term status: accepted

Location
type: Class
created: 2019-04-04
creator: Elmar; Harshvardhan J. Pandit, Fajar
date-accepted: 2019-06-04
description: Information about an individualâs location
subclass of: Tracking
term status: accepted

MACAddress
type: Class
created: 2019-04-04
creator: Elmar; Harshvardhan J. Pandit, Fajar
date-accepted: 2019-06-04
description: A Media Access Control (MAC) address of a device used by an individual.
subclass of: DeviceBased
term status: accepted

MakeAvailable
type: Class
created: 2019-04-04
date-accepted: 2019-05-07
description: to transform or publish data to be used
subclass of: Disclose
term status: accepted

MaritalStatus
type: Class
created: 2019-04-04
creator: Elmar; Harshvardhan J. Pandit, Fajar
date-accepted: 2019-06-04
description: Information about an individual's marital status and history
subclass of: PublicLife
term status: accepted

Marriage
type: Class
created: 2019-04-04
creator: Elmar; Harshvardhan J. Pandit, Fajar
date-accepted: 2019-06-04
description: Information about an individual's marriage(s).
subclass of: FamilyStructure
term status: accepted

MedicalHealth
type: Class
created: 2019-04-04
creator: Elmar; Harshvardhan J. Pandit, Fajar
date-accepted: 2019-06-04
description: Information that describes an individualâs health, medical conditions or health care
subclass of: External
subclass of: SpecialCategoryPersonalData
term status: accepted

MentalHealth
type: Class
created: 2019-04-04
creator: Elmar; Harshvardhan J. Pandit, Fajar
date-accepted: 2019-06-04
description: Information related to an individual's mental health.
subclass of: Health
term status: accepted

Move
type: Class
created: 2019-04-04
date-accepted: 2019-05-07
description: to move data from one location to another including deleting the original copy
subclass of: Transfer
term status: accepted

NDA
type: Class
created: 2019-04-04
creator: Axel Polleres, Rob Brennan, Harshvardhan J. Pandit, Mark Lizar
date-accepted: 2019-04-05
description: Non-disclosure Agreements e.g. preserving confidentiality of information
subclass of: LegalAgreement
term status: accepted

Name
type: Class
created: 2019-04-04
creator: Elmar; Harshvardhan J. Pandit, Fajar
date-accepted: 2019-06-04
description: A name associated with an individual e.g. given name, nickname.
subclass of: Identifying
term status: accepted

NonCommercialResearch
type: Class
created: 2018-12-10
creator: Harshvardhan J. Pandit, Javier Fernandez, Axel Polleres, Elmar Kiesling, Fajar Ekaputra, Simon Steyskal
date-accepted: 2019-04-05
description: Research conducted in a non-commercial setting e.g. for a non-profit-organisation (NGO)
subclass of: ResearchAndDevelopment
term status: accepted

Obtain
type: Class
created: 2019-04-04
date-accepted: 2019-05-07
description: to solicit or gather data from someone
subclass of: Processing
term status: accepted

OfficialID
type: Class
created: 2019-04-04
creator: Elmar; Harshvardhan J. Pandit, Fajar
date-accepted: 2019-06-04
description: Information on an official identification document used by an individual.
subclass of: Identifying
term status: accepted

Offspring
type: Class
created: 2019-04-04
creator: Elmar; Harshvardhan J. Pandit, Fajar
date-accepted: 2019-06-04
description: Information about an individual's offspring(s).
subclass of: FamilyStructure
term status: accepted

Opinion
type: Class
created: 2019-04-04
creator: Elmar; Harshvardhan J. Pandit, Fajar
date-accepted: 2019-06-04
description: Information about an individual's opinions
subclass of: Preference
term status: accepted

OptimisationForConsumer
type: Class
created: 2018-12-10
creator: Harshvardhan J. Pandit, Javier Fernandez, Axel Polleres, Elmar Kiesling, Fajar Ekaputra, Simon Steyskal
date-accepted: 2019-04-05
description: Optimisation of activities and services for the consumer or user
subclass of: ServiceOptimization
term status: accepted

OptimisationForController
type: Class
created: 2018-12-10
creator: Harshvardhan J. Pandit, Javier Fernandez, Axel Polleres, Elmar Kiesling, Fajar Ekaputra, Simon Steyskal
date-accepted: 2019-04-05
description: Optimisation of activities and services for the Controller
subclass of: ServiceOptimization
term status: accepted

OptimiseUserInterface
type: Class
created: 2018-12-10
creator: Harshvardhan J. Pandit, Javier Fernandez, Axel Polleres, Elmar Kiesling, Fajar Ekaputra, Simon Steyskal
date-accepted: 2019-04-05
description: Optimisation of interfaces presented to the user
subclass of: OptimisationForConsumer
term status: accepted

OrganisationalMeasure
type: Class
created: 2019-04-04
creator: Axel Polleres, Rob Brennan, Harshvardhan J. Pandit, Mark Lizar
date-accepted: 2019-04-05
description: Organisational measures required/followed when processing data of the declared category
subclass of: TechnicalOrganisationalMeasure
term status: accepted

Organise
type: Class
created: 2019-04-04
date-accepted: 2019-05-07
description: to organize data for arranging or classifying
term status: accepted

Ownership
type: Class
created: 2019-04-04
creator: Elmar; Harshvardhan J. Pandit, Fajar
date-accepted: 2019-06-04
description: Information about things an individual has owned, rented, borrowed, possessed
subclass of: Financial
term status: accepted

PINCode
type: Class
created: 2019-04-04
creator: Elmar; Harshvardhan J. Pandit, Fajar
date-accepted: 2019-06-04
description: An individual's Personal identification number (PIN) used in the process of authenticating the individual as a user accessing a system.
subclass of: Authenticating
term status: accepted

Parent
type: Class
created: 2019-04-04
creator: Elmar; Harshvardhan J. Pandit, Fajar
date-accepted: 2019-06-04
description: Information about an individual's parent(s).
subclass of: FamilyStructure
term status: accepted

Password
type: Class
created: 2019-04-04
creator: Elmar; Harshvardhan J. Pandit, Fajar
date-accepted: 2019-06-04
description: An individual's password used in the process of authenticating the individual as a user accessing a system.
subclass of: Authenticating
term status: accepted

PersonalDataCategory
type: Class
created: 2019-04-04
creator: Harshvardhan Pandit, Axel Polleres
date-accepted: 2019-04-05
description: A category of personal data (as defined by GDPR article 4.1) from the personal data categories taxonomy, i.e. for instance denoting the category of an object/field or data item that is used for processing
comment: Harsh: Change name to PersonalDataCategory since DataCategory can be non-personal data. Axel: Ageed
term status: accepted

PersonalDataHandling
type: Class
created: 2019-04-04
creator: Axel Polleres, Javier Ferenandez
date-accepted: 2019-04-05
description: Top Class to describe a concrete instance of legal personal Data Handling of a defined class of Data Subjects, meaning that a personal Data Category is undergoing specified processing by a specific data controller and/or transferred to some recipient for a particular purpose, based on a specific legal ground, with specified security measures and restrictions (e.g. storage locations and storage durations).
term status: accepted

PersonalPossession
type: Class
created: 2019-04-04
creator: Elmar; Harshvardhan J. Pandit, Fajar
date-accepted: 2019-06-04
description: Information about an individual's personal possessions.
subclass of: Ownership
term status: accepted

PersonalisedBenefits
type: Class
created: 2018-12-10
creator: Harshvardhan J. Pandit, Javier Fernandez, Axel Polleres, Elmar Kiesling, Fajar Ekaputra, Simon Steyskal
date-accepted: 2019-04-05
description: Personalisation of benefits received by the user
subclass of: ServicePersonalization
term status: accepted

Personality
type: Class
created: 2019-04-04
creator: Elmar; Harshvardhan J. Pandit, Fajar
date-accepted: 2019-06-04
description: Information that relates to an individual's personality (e.g., categorization in terms of the Big Five personality traits)
subclass of: Behavioral
term status: accepted

PhilosophicalBelief
type: Class
created: 2019-04-04
creator: Elmar; Harshvardhan J. Pandit, Fajar
date-accepted: 2019-06-04
description: Information about an individualâs philosophical beliefs.
subclass of: KnowledgeBelief
subclass of: SpecialCategoryPersonalData
term status: accepted

PhysicalAddress
type: Class
created: 2019-04-04
creator: Elmar; Harshvardhan J. Pandit, Fajar
date-accepted: 2019-06-04
description: Information about an individual's physical address.
subclass of: Contact
term status: accepted

PhysicalCharacteristic
type: Class
created: 2019-04-04
creator: Elmar; Harshvardhan J. Pandit, Fajar
date-accepted: 2019-06-04
description: Information that describes an individualâs physical characteristics
subclass of: External
term status: accepted

PhysicalHealth
type: Class
created: 2019-04-04
creator: Elmar; Harshvardhan J. Pandit, Fajar
date-accepted: 2019-06-04
description: Information related to an individual's physical health.
subclass of: Health
term status: accepted

PhysicalTrait
type: Class
created: 2019-04-04
creator: Elmar; Harshvardhan J. Pandit, Fajar
date-accepted: 2019-06-04
description: Information on defining traits or features about an individuals body.
subclass of: Demographic
term status: accepted

Picture
type: Class
created: 2019-04-04
creator: Elmar; Harshvardhan J. Pandit, Fajar
date-accepted: 2019-06-04
description: A visual representation or image of an individual e.g. profile photo.
subclass of: Identifying
term status: accepted

Piercing
type: Class
created: 2019-04-04
creator: Elmar; Harshvardhan J. Pandit, Fajar
date-accepted: 2019-06-04
description: Information about an individual's piercings
subclass of: PhysicalCharacteristic
term status: accepted

PoliticalAffiliation
type: Class
created: 2019-04-04
creator: Elmar; Harshvardhan J. Pandit, Fajar
date-accepted: 2019-06-04
description: Information about an individual's political affiliation and history
subclass of: PublicLife
subclass of: SpecialCategoryPersonalData
term status: accepted

Preference
type: Class
created: 2019-04-04
creator: Elmar; Harshvardhan J. Pandit, Fajar
date-accepted: 2019-06-04
description: Information about an individualâs preferences or interests
subclass of: Internal
term status: accepted

Prescription
type: Class
created: 2019-04-04
creator: Elmar; Harshvardhan J. Pandit, Fajar
date-accepted: 2019-06-04
description: Information about prescriptions made for an individual.
subclass of: MedicalHealth
term status: accepted

PrivacyByDefault
type: Class
created: 2019-04-04
creator: Axel Polleres, Rob Brennan, Harshvardhan J. Pandit, Mark Lizar
date-accepted: 2019-04-05
description: Practices regarding selecting appropriate data protection and privacy measures as the 'default' in an activity or service
subclass of: GuidelinesPrinciple
term status: accepted

PrivacyByDesign
type: Class
created: 2019-04-04
creator: Axel Polleres, Rob Brennan, Harshvardhan J. Pandit, Mark Lizar
date-accepted: 2019-04-05
description: Practices regarding incorporating data protection and privacy in the design of information and services
subclass of: RiskManagementProcedure
term status: accepted

PrivacyPreference
type: Class
created: 2019-04-04
creator: Elmar; Harshvardhan J. Pandit, Fajar
date-accepted: 2019-06-04
description: Information about an individual's privacy preferences
subclass of: Preference
term status: accepted

Processing
type: Class
created: 2019-04-04
creator: Axel Polleres, Javier Ferenandez
date-accepted: 2019-04-05
description: A type of processing from one of the processing categories in the processing Taxonomy
term status: accepted

Proclivitie
type: Class
created: 2019-04-04
creator: Elmar; Harshvardhan J. Pandit, Fajar
date-accepted: 2019-06-04
description: Information about an individual's proclivities in a sexual context
subclass of: Sexual
term status: accepted

Professional
type: Class
created: 2019-04-04
creator: Elmar; Harshvardhan J. Pandit, Fajar
date-accepted: 2019-06-04
description: Information about an individualâs educational or professional career
subclass of: Social
term status: accepted

ProfessionalEvaluation
type: Class
created: 2019-04-04
creator: Elmar; Harshvardhan J. Pandit, Fajar
date-accepted: 2019-06-04
description: Information about professional evaluations associated with an individual
subclass of: Professional
term status: accepted

ProfessionalInterview
type: Class
created: 2019-04-04
creator: Elmar; Harshvardhan J. Pandit, Fajar
date-accepted: 2019-06-04
description: Information about professional interviews associated with an individual
subclass of: Professional
term status: accepted

Profiling
type: Class
created: 2019-04-04
date-accepted: 2019-05-07
description: to create a profile that describes or represents a person
subclass of: Use
term status: accepted

PseudoAnonymise
type: Class
created: 2019-04-04
date-accepted: 2019-05-07
description: to replace personal identifiable information by artificial identifiers
subclass of: Transform
term status: accepted

PseudoAnonymization
type: Class
created: 2019-04-04
creator: Axel Polleres, Rob Brennan, Harshvardhan J. Pandit, Mark Lizar
date-accepted: 2019-04-05
description: PseudoAnonmyization or 'pseudonymisationâ means the processing of personal data in such a manner that the personal data can no longer be attributed to a specific data subject without the use of additional information, provided that such additional information is kept separately and is subject to technical and organisational measures to ensure that the personal data are not attributed to an identified or identifiable natural person;
subclass of: PseudonymisationEncryption
term status: accepted

PseudonymisationEncryption
type: Class
created: 2019-04-04
creator: Axel Polleres, Rob Brennan, Harshvardhan J. Pandit, Mark Lizar
date-accepted: 2019-04-05
description: Category of technical measures consisting of pseudoanonymization and encryption
subclass of: TechnicalMeasure
term status: accepted

PublicLife
type: Class
created: 2019-04-04
creator: Elmar; Harshvardhan J. Pandit, Fajar
date-accepted: 2019-06-04
description: Information about an individualâs public life
subclass of: Social
term status: accepted

Purchase
type: Class
created: 2019-04-04
creator: Elmar; Harshvardhan J. Pandit, Fajar
date-accepted: 2019-06-04
description: Information about purchases such as items bought e.g. grocery or clothing
subclass of: Transactional
term status: accepted

PurchasesAndSpendingHabit
type: Class
created: 2019-04-04
creator: Elmar; Harshvardhan J. Pandit, Fajar
date-accepted: 2019-06-04
description: Information about analysis of purchases made and money spent expressed as a habit e.g. monthly shopping trends
subclass of: Transactional
term status: accepted

Purpose
type: Class
created: 2019-04-04
creator: Axel Polleres, Javier Ferenandez
date-accepted: 2019-04-05
description: The purpose of Data Handling, from the purposes Taxonomy
term status: accepted

Race
type: Class
created: 2019-04-04
creator: Elmar; Harshvardhan J. Pandit, Fajar
date-accepted: 2019-06-04
description: Information related to an individual's race.
subclass of: Ethnicity
subclass of: SpecialCategoryPersonalData
term status: accepted

Recipient
type: Class
created: 2019-04-04
creator: Axel Polleres, Javier Ferenandez
date-accepted: 2019-04-05
description: The entities that can access the result of a data handling action/processing, any legal entity that is defined by article 4.9 of GDPR, which states - 'recipient' means a natural or legal person, public authority, agency or another body, to which the personal data are disclosed, whether a third party or not.
term status: accepted

Record
type: Class
created: 2019-04-04
date-accepted: 2019-05-07
description: to make a record (especially media)
subclass of: Obtain
term status: accepted

Reference
type: Class
created: 2019-04-04
creator: Elmar; Harshvardhan J. Pandit, Fajar
date-accepted: 2019-06-04
description: Information about an individual's references in the professional context
subclass of: Professional
term status: accepted

RegularityOfRecertification
type: Class
created: 2019-04-04
creator: Axel Polleres, Rob Brennan, Harshvardhan J. Pandit, Mark Lizar
date-accepted: 2019-04-05
description: Specifies policy regarding repetition or renewal of existing certification(s)
subclass of: RiskManagementProcedure
term status: accepted

Relationship
type: Class
created: 2019-04-04
creator: Elmar; Harshvardhan J. Pandit, Fajar
date-accepted: 2019-06-04
description: Information that characterizes an individual's relationships with other individuals.
subclass of: Family
term status: accepted

Religion
type: Class
created: 2019-04-04
creator: Elmar; Harshvardhan J. Pandit, Fajar
date-accepted: 2019-06-04
description: Information about an individual's religion, religious inclinations, and religious history.
subclass of: PublicLife
subclass of: SpecialCategoryPersonalData
term status: accepted

ReligiousBelief
type: Class
created: 2019-04-04
creator: Elmar; Harshvardhan J. Pandit, Fajar
date-accepted: 2019-06-04
description: Information about an individualâs religious beliefs.
subclass of: KnowledgeBelief
subclass of: SpecialCategoryPersonalData
term status: accepted

Remove
type: Class
created: 2019-04-04
date-accepted: 2019-05-07
description: to destruct or erase data
subclass of: Processing
term status: accepted

ResearchAndDevelopment
type: Class
created: 2018-12-10
creator: Harshvardhan J. Pandit, Javier Fernandez, Axel Polleres, Elmar Kiesling, Fajar Ekaputra, Simon Steyskal
date-accepted: 2019-04-05
description: Performing research and developing new methods,products, or services
subclass of: Purpose
term status: accepted

Restrict
type: Class
created: 2019-04-04
date-accepted: 2019-05-07
description: to apply a restriction on the processsing of specific records
subclass of: Transform
term status: accepted

Retina
type: Class
created: 2019-04-04
creator: Elmar; Harshvardhan J. Pandit, Fajar
date-accepted: 2019-06-04
description: Information related to an individual's retina used for biometric purposes.
subclass of: Biometric
term status: accepted

Retrieve
type: Class
created: 2019-04-04
date-accepted: 2019-05-07
description: to retrieve data, often in an automated manner
subclass of: Use
term status: accepted

RiskManagementProcedure
type: Class
created: 2019-04-04
creator: Axel Polleres, Rob Brennan, Harshvardhan J. Pandit, Mark Lizar
date-accepted: 2019-04-05
description: Risk management refers to a coordinated set of activities and methods that is used to direct an organization and to control the many risks that can affect its ability to achieve objectives. The term risk management also refers to the programme that is used to manage risk. This programme includes risk management principles, a risk management framework, and a risk management process.
comment: Data Protection Impact Assessments as per GDPR art 35, other Privacy Impact Assessments, threat severity assessment https://www.cnil.fr/en/privacy-impact-assessment-pia
subclass of: OrganisationalMeasure
term status: accepted

RoomNumber
type: Class
created: 2019-04-04
creator: Elmar; Harshvardhan J. Pandit, Fajar
date-accepted: 2019-06-04
description: Room number of a location associated with an individual.
subclass of: Location
term status: accepted

Salary
type: Class
created: 2019-04-04
creator: Elmar; Harshvardhan J. Pandit, Fajar
date-accepted: 2019-06-04
description: Information about an individual's salary
subclass of: Professional
term status: accepted

Sale
type: Class
created: 2019-04-04
creator: Elmar; Harshvardhan J. Pandit, Fajar
date-accepted: 2019-06-04
description: Information about sales e.g. selling of goods or services
subclass of: Transactional
term status: accepted

School
type: Class
created: 2019-04-04
creator: Elmar; Harshvardhan J. Pandit, Fajar
date-accepted: 2019-06-04
description: Information about an individual's school such as name of school, conduct, or grades obtained.
subclass of: Professional
term status: accepted

Seal
type: Class
created: 2019-04-04
creator: Axel Polleres, Rob Brennan, Harshvardhan J. Pandit, Mark Lizar
date-accepted: 2019-04-05
description: a seal or a mark indicating proof of certification to some certification or standard
subclass of: CertificationSeal
term status: accepted

SecretText
type: Class
created: 2019-04-04
creator: Elmar; Harshvardhan J. Pandit, Fajar
date-accepted: 2019-06-04
description: An individual's secret text used in the process of authenticating the individual as a user accessing a system, e.g., when recovering a lost password.
subclass of: Authenticating
term status: accepted

Sector
type: Class
created: 2019-04-04
date-accepted: 2019-04-05
description: Used to indicate the sector of a purpose e.g. Agriculture, Advertising (specified e.g. in the form of NACE codes)
term status: accepted

Security
type: Class
created: 2018-12-10
creator: Harshvardhan J. Pandit, Javier Fernandez, Axel Polleres, Elmar Kiesling, Fajar Ekaputra, Simon Steyskal
date-accepted: 2019-04-05
description: Security of data
subclass of: Purpose
term status: accepted

SellDataToThirdParties
type: Class
created: 2018-12-10
creator: Harshvardhan J. Pandit, Javier Fernandez, Axel Polleres, Elmar Kiesling, Fajar Ekaputra, Simon Steyskal
date-accepted: 2019-04-05
description: To sell data or information to third parties
subclass of: CommercialInterest
term status: accepted

SellInsightsFromData
type: Class
created: 2018-12-10
creator: Harshvardhan J. Pandit, Javier Fernandez, Axel Polleres, Elmar Kiesling, Fajar Ekaputra, Simon Steyskal
date-accepted: 2019-04-05
description: To sell or commercially provide insights obtained from analysis of data
subclass of: CommercialInterest
term status: accepted

SellProductsToDataSubject
type: Class
created: 2018-12-10
creator: Harshvardhan J. Pandit, Javier Fernandez, Axel Polleres, Elmar Kiesling, Fajar Ekaputra, Simon Steyskal
date-accepted: 2019-04-05
description: To sell products or services to the data subject or user
subclass of: CommercialInterest
term status: accepted

SellTargettedAdvertisements
type: Class
created: 2018-12-10
creator: Harshvardhan J. Pandit, Javier Fernandez, Axel Polleres, Elmar Kiesling, Fajar Ekaputra, Simon Steyskal
date-accepted: 2019-04-05
description: To sell or provide targetted advertisements about the user to Third Parties
subclass of: CommercialInterest
term status: accepted

ServiceConsumptionBehavior
type: Class
created: 2019-11-25
creator: Harshvardhan J. Pandit, Rudy Jacob
subclass of: ServicePersonalization
description: Information about the consumption of a service by an individual. Examples: time and duration of consumption.
term status: proposed

ServiceOptimization
type: Class
created: 2018-12-10
creator: Harshvardhan J. Pandit, Javier Fernandez, Axel Polleres, Elmar Kiesling, Fajar Ekaputra, Simon Steyskal
date-accepted: 2019-04-05
description: Optimization of service or activity
subclass of: Purpose
term status: accepted

ServicePersonalization
type: Class
created: 2018-12-10
creator: Harshvardhan J. Pandit, Javier Fernandez, Axel Polleres, Elmar Kiesling, Fajar Ekaputra, Simon Steyskal
date-accepted: 2019-04-05
description: Personalization of service or activity for the user
subclass of: Purpose
term status: accepted

ServiceProvision
type: Class
created: 2018-12-10
creator: Harshvardhan J. Pandit, Javier Fernandez, Axel Polleres, Elmar Kiesling, Fajar Ekaputra, Simon Steyskal
date-accepted: 2019-04-05
description: Provision of service or activity
subclass of: Purpose
term status: accepted

Sexual
type: Class
created: 2019-04-04
creator: Elmar; Harshvardhan J. Pandit, Fajar
date-accepted: 2019-06-04
description: Information that describes an individualâs sexual life
subclass of: External
subclass of: SpecialCategoryPersonalData
term status: accepted

SexualHistory
type: Class
created: 2019-04-04
creator: Elmar; Harshvardhan J. Pandit, Fajar
date-accepted: 2019-06-04
description: Information about an individual's sexual history
subclass of: Sexual
term status: accepted

SexualPreference
type: Class
created: 2019-04-04
creator: Elmar; Harshvardhan J. Pandit, Fajar
date-accepted: 2019-06-04
description: Information about an individual's sexual preferences
subclass of: Sexual
term status: accepted

Share
type: Class
created: 2019-04-04
date-accepted: 2019-05-07
description: to give data (or a portion of it) to others
subclass of: Disclose
term status: accepted

Sibling
type: Class
created: 2019-04-04
creator: Elmar; Harshvardhan J. Pandit, Fajar
date-accepted: 2019-06-04
description: Information about an individual's sibling(s).
subclass of: FamilyStructure
term status: accepted

SkinTone
type: Class
created: 2019-04-04
creator: Elmar; Harshvardhan J. Pandit, Fajar
date-accepted: 2019-06-04
description: Information about an individual's skin tone
subclass of: PhysicalCharacteristic
term status: accepted

Social
type: Class
created: 2019-04-04
creator: Elmar; Harshvardhan J. Pandit, Fajar
date-accepted: 2019-06-04
description: Personal data about the social aspects such as for family, public life, or professional networks.
subclass of: PersonalDataCategory
term status: accepted

SocialMediaCommunication
type: Class
created: 2019-04-04
creator: Elmar; Harshvardhan J. Pandit, Fajar
date-accepted: 2019-06-04
description: Information relating to an individual's social media communication, including the communication itself and metadata.
subclass of: Communication
term status: accepted

SocialNetwork
type: Class
created: 2019-04-04
creator: Elmar; Harshvardhan J. Pandit, Fajar
date-accepted: 2019-06-04
description: Information about an individualâs friends or connections expressed as a social network
subclass of: Social
term status: accepted

SocialStatus
type: Class
created: 2019-04-04
creator: Elmar; Harshvardhan J. Pandit, Fajar
date-accepted: 2019-06-04
description: Information about an individual's social status
subclass of: PublicLife
term status: accepted

SpecialCategoryPersonalData
type: Class
created: 2019-04-04
creator: Elmar; Harshvardhan J. Pandit, Fajar
date-accepted: 2019-05-07
description: Special category or personal data as per GDPR Art. 9 (1)
subclass of: PersonalDataCategory
term status: accepted

StaffTraining
type: Class
created: 2019-04-04
creator: Axel Polleres, Rob Brennan, Harshvardhan J. Pandit, Mark Lizar
date-accepted: 2019-04-05
description: Practices and policies regarding training of staff members
subclass of: RiskManagementProcedure
term status: accepted

StorageDeletion
type: Class
created: 2019-04-04
creator: Axel Polleres, Rob Brennan, Harshvardhan J. Pandit, Mark Lizar
date-accepted: 2019-04-05
description: Defines how secure deletion is guaranteed
subclass of: StorageRestriction
term status: accepted

StorageDuration
type: Class
created: 2019-04-04
creator: Axel Polleres, Rob Brennan, Harshvardhan J. Pandit, Mark Lizar
date-accepted: 2019-04-05
description: A duration or temporal entity denoting limitation on storage of personal data
subclass of: StorageRestriction
term status: accepted

StorageLocation
type: Class
created: 2019-04-04
creator: Axel Polleres, Rob Brennan, Harshvardhan J. Pandit, Mark Lizar
date-accepted: 2019-04-05
description: Defines a location or goespatial scope, where the data is (physically) stored
subclass of: StorageRestriction
term status: accepted

StorageRestoration
type: Class
created: 2019-04-04
creator: Axel Polleres, Rob Brennan, Harshvardhan J. Pandit, Mark Lizar
date-accepted: 2019-04-05
description: Regularity and temporal span of data restoration/backup mechanisms that guarantee that data is preserved
subclass of: StorageRestriction
term status: accepted

StorageRestriction
type: Class
created: 2019-04-04
creator: Axel Polleres, Rob Brennan, Harshvardhan J. Pandit, Mark Lizar
date-accepted: 2019-04-05
description: Restrictions required or followed regarding storage of data
subclass of: TechnicalMeasure
term status: accepted

Store
type: Class
created: 2019-04-04
date-accepted: 2019-05-07
description: to keep data for future use
subclass of: Processing
term status: accepted

Structure
type: Class
created: 2019-04-04
date-accepted: 2019-05-07
description: to arrange data according to a structure
subclass of: Organise
term status: accepted

Tattoo
type: Class
created: 2019-04-04
creator: Elmar; Harshvardhan J. Pandit, Fajar
date-accepted: 2019-06-04
description: Information about an individual's tattoos
subclass of: PhysicalCharacteristic
term status: accepted

Tax
type: Class
created: 2019-04-04
creator: Elmar; Harshvardhan J. Pandit, Fajar
date-accepted: 2019-06-04
description: Information about financial tax e.g. tax records or tax due
subclass of: Transactional
term status: accepted

TechnicalMeasure
type: Class
created: 2019-04-04
creator: Axel Polleres, Rob Brennan, Harshvardhan J. Pandit, Mark Lizar
date-accepted: 2019-04-05
description: Technical measures required/followed when processing data of the declared category
subclass of: TechnicalOrganisationalMeasure
term status: accepted

TechnicalOrganisationalMeasure
type: Class
created: 2019-04-04
creator: Bud Bruegger
date-accepted: 2019-04-05
description: Technical and organisational measures, for instance security measure, storage restrictions etc. required/followed when processing data of the declared category
comment: Bud: rename according to GDPR: Technical/Organisational measures
term status: accepted

TelephoneNumber
type: Class
created: 2019-04-04
creator: Elmar; Harshvardhan J. Pandit, Fajar
date-accepted: 2019-06-04
description: Information about an individual's telephone number.
subclass of: Contact
term status: accepted

ThirdParty
type: Class
created: 2019-06-04
creator: Harshvardhan J. Pandit
date-accepted: 2019-06-04
description: âthird partyâ means a natural or legal person, public authority, agency or body other than the data subject, controller, processor and persons who, under the direct authority of the controller or processor, are authorised to process personal data;
subclass of: Recipient
term status: approved

Thought
type: Class
created: 2019-04-04
creator: Elmar; Harshvardhan J. Pandit, Fajar
date-accepted: 2019-06-04
description: Information about an individual's thoughts
subclass of: KnowledgeBelief
term status: accepted

Tracking
type: Class
created: 2019-04-04
creator: Elmar; Harshvardhan J. Pandit, Fajar
date-accepted: 2019-06-04
description: Personal data that can be used to track an individual or used as an identifier e.g. location or email
subclass of: PersonalDataCategory
term status: accepted

Transaction
type: Class
created: 2019-04-04
creator: Elmar; Harshvardhan J. Pandit, Fajar
date-accepted: 2019-06-04
description: Information about financial transactions e.g. bank transfers
subclass of: Transactional
term status: accepted

Transactional
type: Class
created: 2019-04-04
creator: Elmar; Harshvardhan J. Pandit, Fajar
date-accepted: 2019-06-04
description: Information about an individualâs purchasing, spending or income
subclass of: Financial
term status: accepted

Transfer
type: Class
created: 2019-04-04
date-accepted: 2019-05-07
description: to move data from one place to another
subclass of: Processing
term status: accepted

Transform
type: Class
created: 2019-04-04
date-accepted: 2019-05-07
description: to change the form or nature of data
subclass of: Processing
term status: accepted

Transmit
type: Class
created: 2019-04-04
date-accepted: 2019-05-07
description: to send out data
subclass of: Disclose
term status: accepted

TVViewingBehavior
type: Class
created: 2019-11-25
description: Information that relates to an individual's TV viewing behavior, such as timestamps of channel change, duration of viewership, content consumed.
creator: Harshvardhan J. Pandit, Rudy Jacob
subclass of: ServiceConsumptionBehavior
term status: proposed

UID
type: Class
created: 2019-04-04
creator: Elmar; Harshvardhan J. Pandit, Fajar
date-accepted: 2019-06-04
description: An unique identifier used to identify an individual.
subclass of: Identifying
term status: accepted

Use
type: Class
created: 2019-04-04
date-accepted: 2019-05-07
description: to use data
subclass of: Processing
term status: accepted

UserInterfacePersonalisation
type: Class
created: 2018-12-10
creator: Harshvardhan J. Pandit, Javier Fernandez, Axel Polleres, Elmar Kiesling, Fajar Ekaputra, Simon Steyskal
date-accepted: 2019-04-05
description: Personalisation of interfaces presented to the user
subclass of: ServicePersonalization
term status: accepted

Username
type: Class
created: 2019-04-04
creator: Elmar; Harshvardhan J. Pandit, Fajar
date-accepted: 2019-06-04
description: A username used to identify an individual.
subclass of: Identifying
term status: accepted

VoiceCommunicationRecording
type: Class
created: 2019-04-04
creator: Elmar; Harshvardhan J. Pandit, Fajar, Axel Polleres
date-accepted: 2019-06-04
description: Recording of an individual's recorded communication (e.g. telephony, VoIP)
subclass of: Communication
term status: accepted

VoiceMail
type: Class
created: 2019-04-04
creator: Elmar; Harshvardhan J. Pandit, Fajar
date-accepted: 2019-06-04
description: Information about an individual's voice mail messages.
subclass of: Communication
term status: accepted

Weight
type: Class
created: 2019-04-04
creator: Elmar; Harshvardhan J. Pandit, Fajar
date-accepted: 2019-06-04
description: Information about an individual's physical weight
subclass of: PhysicalCharacteristic
term status: accepted

WorkHistory
type: Class
created: 2019-04-04
creator: Elmar; Harshvardhan J. Pandit, Fajar
date-accepted: 2019-06-04
description: Information about an individual's work history in a professional context
subclass of: Professional
term status: accepted

consentNotice
type: Property
created: 2019-04-04
creator: Harshvardhan J. Pandit, Mark Lizar, Bud Bruegger
date-accepted: 2019-04-05
description: Links consent to the notice displayed for requesting consent
comment: The actual notice that the Data Subject received to consent to, either a text or link to a document, which should be usable to decide whether the form or consent was compliant to legislation, e.g. documenting how the user has been informed about rights and implications (such as, right to data portability,right to recitffy, right to erasure, right to restrict processing, right to object, rights regarding automated decision making or profiling, processors, third parties, sub-processors, outside-EEA transfers, automated decision-making, or other necessary details of the privacy-policy). Can be TextOrDocumentOrURI.
domain: Consent
term status: accepted

duration
type: Property
created: 2019-04-04
creator: Axel Polleres, Rob Brennan, Harshvardhan J. Pandit, Mark Lizar
date-accepted: 2019-04-05
description: Specifies duration for storage of personal data
domain: StorageRestriction
range: StorageDuration
term status: accepted

expiry
type: Property
created: 2019-04-04
creator: Harshvardhan J. Pandit, Mark Lizar, Bud Bruegger
date-accepted: 2019-04-05
description: Generic property specifying when or under which condition(s) the consent will expire
domain: Consent
term status: accepted

expiryCondition
type: Property
created: 2019-04-04
creator: Harshvardhan J. Pandit, Mark Lizar, Bud Bruegger
date-accepted: 2019-04-05
description: Specifies the condition or event that determines the expiry of consent
comment: Can be TextOrDocumentOrURI
domain: Consent
term status: accepted

expiryTime
type: Property
created: 2019-04-04
creator: Harshvardhan J. Pandit, Mark Lizar, Bud Bruegger
date-accepted: 2019-04-05
description: Specifies the expiry time or duration for consent
domain: Consent
range: TemporalEntity
term status: accepted

hasBeneficiary
type: Property
created: 2019-05-23
description: Cui bono? Who is the ultimate beneficiary of this purpose, here a stakeholder can be declared, e.g. the DataSubjects themselves or the Data Controller. ( --- under consideration --- )
domain: Context
range: Beneficiary
term status: proposed

hasContext
type: Property
created: 2019-04-04
date-accepted: 2019-04-05
description: Restricts a purpose to the specified context(s)
domain: Purpose
range: Context
term status: accepted

hasDataController
type: Property
created: 2019-04-04
creator: Axel Polleres, Javier Ferenandez, Harshvardhan J. Pandit, Mark Lizar, Bud Bruegger
date-accepted: 2019-04-05
description: This property associates a data controller with an instance of legal data handling or consent
comment: We replicate all the properties except Legalbasis of personal data handling for consent, to declare what kinds of personal data handling are consented to
domain:
  union of: PersonalDataHandling
  union of: Consent
range: DataController
term status: accepted

hasDataSubject
type: Property
created: 2019-04-04
creator: Axel Polleres, Javier Ferenandez, Harshvardhan J. Pandit, Mark Lizar, Bud Bruegger
date-accepted: 2019-04-05
description: This property associates a data subject with an instance of legal data handling or consent
comment: We replicate all the properties except Legalbasis of personal data handling for consent, to declare what kinds of personal data handling are consented to
domain:
  union of: PersonalDataHandling
  union of: Consent
range: DataSubject
term status: accepted

hasLegalBasis
type: Property
created: 2019-04-04
creator: Axel Polleres, Javier Ferenandez
date-accepted: 2019-04-05
description: This property associates an instance of legal data handling with its underlying legal basis
domain: PersonalDataHandling
range: LegalBasis
term status: accepted

hasPersonalDataCategory
type: Property
created: 2019-04-04
creator: Axel Polleres, Javier Ferenandez, Harshvardhan J. Pandit, Mark Lizar, Bud Bruegger
date-accepted: 2019-04-05
description: This property associates a personal data category with an instance of legal data handling or consent
comment: We replicate all the properties except Legalbasis of personal data handling for consent, to declare what kinds of personal data handling are consented to
domain:
  union of: PersonalDataHandling
  union of: Consent
range: PersonalDataCategory
term status: accepted

hasProcessing
type: Property
created: 2019-04-04
creator: Axel Polleres, Javier Ferenandez, Harshvardhan J. Pandit, Mark Lizar, Bud Bruegger
date-accepted: 2019-04-05
description: This property associates a data processing category with an instance of legal data handling or consent
comment: We replicate all the properties except Legalbasis of personal data handling for consent, to declare what kinds of personal data handling are consented to
domain:
  union of: PersonalDataHandling
  union of: Consent
range: Processing
term status: accepted

hasPurpose
type: Property
created: 2019-04-04
creator: Axel Polleres, Javier Ferenandez, Harshvardhan J. Pandit, Mark Lizar, Bud Bruegger
date-accepted: 2019-04-05
description: This property associates a purpose with an instance of legal data handling or consent
comment: We replicate all the properties except Legalbasis of personal data handling for consent, to declare what kinds of personal data handling are consented to
domain:
  union of: PersonalDataHandling
  union of: Consent
range: Purpose
term status: accepted

hasRecipient
type: Property
created: 2019-04-04
creator: Axel Polleres, Javier Ferenandez, Harshvardhan J. Pandit, Mark Lizar, Bud Bruegger
date-accepted: 2019-04-05
description: This property associates a recipient with an instance of legal data handling or consent
comment: We replicate all the properties except Legalbasis of personal data handling for consent, to declare what kinds of personal data handling are consented to
domain:
  union of: PersonalDataHandling
  union of: Consent
range: Recipient
term status: accepted

hasSector
type: Property
created: 2019-04-04
date-accepted: 2019-04-05
description: Indicates the purpose is associated with activities in the indicated (Economic) Sector(s)
domain: Context
range: Sector
term status: accepted

hasTechnicalOrganisationalMeasure
type: Property
created: 2019-04-04
creator: Axel Polleres, Javier Ferenandez, Harshvardhan J. Pandit, Mark Lizar, Bud Bruegger
date-accepted: 2019-04-05
description: This property associates a technical/organisational measure with an instance of legal data handling or consent
comment: We replicate all the properties except Legalbasis of personal data handling for consent, to declare what kinds of personal data handling are consented to
domain:
  union of: PersonalDataHandling
  union of: Consent
range: TechnicalOrganisationalMeasure
term status: accepted

innovativeUseOfNewSolutions
type: Property
created: 2019-04-04
date-accepted: 2019-05-07
description: Indicates the processing comprises of innovative uses of new or radical solutions
comment: e.g. combining fingerprint & face scan for access control. What is concidered new/innovative is of course subject to change over time.
domain: Processing
range: boolean
term status: accepted

isAutomatedDecisionMaking
type: Property
created: 2019-04-04
date-accepted: 2019-05-07
description: Indicates whether the processing comprises of or is part of or results in automated decision making
domain: Processing
range: boolean
term status: accepted

isEvaluationScoring
type: Property
created: 2019-04-04
date-accepted: 2019-05-07
description: Indicates whether the processing ir part of or results in evaluation or scoring of an individual or their personal data
comment: including profiling and predicting,
domain: Processing
range: boolean
term status: accepted

isExplicit
type: Property
created: 2019-04-04
creator: Harshvardhan J. Pandit, Mark Lizar, Bud Bruegger
date-accepted: 2019-04-05
description: Indicates consent is explicit as explained in GDPR Article 9.2a and Article 22.2c
domain: Consent
range: boolean
term status: accepted

isLargeScale
type: Property
created: 2019-04-04
date-accepted: 2019-05-07
description: Indicates the processing is carried out at large scale in terms of size of data or individuals associated
comment: Involves large amounts of personal data or data subjects. The WP29 recommends that the following factors, in particular, be considered when determining whether the processing is carried out on a large scale (WP29 Guidelines on Data Protection Officer 16/EN WP 243): a. the number of data subjects concerned, either as a specific number or as a proportion of the relevant population; b. the volume of data and/or the range of different data items being processed; c. the duration, or permanence, of the data processing activity; d. the geographical extent of the processing activity.
domain: Processing
range: boolean
term status: accepted

isMatchingCombining
type: Property
created: 2019-04-04
date-accepted: 2019-05-07
description: Indicates whether the processing comprises of matching or combining existing data
comment: originating from two or more data processing operations performed for different purposes and/or by different data controllers in a way that would exceed the reasonable expectations of the data subject (WP29 Opinion on Purpose limitation 13/EN WP 203, p.24). For instance Integration/Enrichment with other data (not necessarily personal only)
domain: Processing
range: boolean
term status: accepted

isSystematicMonitoring
type: Property
created: 2019-04-04
date-accepted: 2019-05-07
description: Indicates whether the processing comprises of systematic monitoring of data subjects or their personal data
domain: Processing
range: boolean
term status: accepted

location
type: Property
created: 2019-04-04
creator: Axel Polleres, Rob Brennan, Harshvardhan J. Pandit, Mark Lizar
date-accepted: 2019-04-05
description: Specifies location for storage of personal data
domain: StorageRestriction
range: StorageLocation
term status: accepted

measureImplementedBy
type: Property
created: 2019-04-23
creator: Axel Polleres
date-accepted: 2019-05-07
description: a generic ObjectProperty to describe how the measure is implemented. For the values of this property we either allow a blank node with a single rdfs:comment to describe the measure, or a URI to a standard or best practice followed, i.e. a well-known identifier for that standard or a URL where the respective document describes the standard.
domain: TechnicalOrganisationalMeasure
range: Resource
term status: accepted

provisionBy
type: Property
created: 2019-04-04
creator: Harshvardhan J. Pandit, Mark Lizar, Bud Bruegger
date-accepted: 2019-04-05
description: Specifies the entity that provisioned or provided consent
comment: Normally this would be the dataSubject, but in some exceptional cases, the consent might be given on behalf by someone else, e.g. parents of minors.
domain: Consent
range: LegalEntity
term status: accepted

provisionByJustification
type: Property
created: 2019-04-04
creator: Harshvardhan J. Pandit, Mark Lizar, Bud Bruegger
date-accepted: 2019-04-05
description: Specifies the justification for entity providing consent
comment: This field can be used to proivde a justification why the provision was provided by another DataSubject or legal entity, e.g. declariing the relationship (parent, guardian), in combination with the field provisionBy
domain: Consent
term status: accepted

provisionMethod
type: Property
created: 2019-04-04
creator: Harshvardhan J. Pandit, Mark Lizar, Bud Bruegger
date-accepted: 2019-04-05
description: Specifies the method by which consent was provisioned or provided
comment: Can be used to record information of how consent was provided e.g. by a click to a form, in writing, etc., by logging into a system and confirm per email, or with some additional authentication, etc.
domain: Consent
term status: accepted

provisionTime
type: Property
created: 2019-04-04
creator: Harshvardhan J. Pandit, Mark Lizar, Bud Bruegger
date-accepted: 2019-04-05
description: Specifies the instant in time when consent was given
domain: Consent
range: Instant
term status: accepted

storage
type: Property
created: 2019-04-04
creator: Axel Polleres, Rob Brennan, Harshvardhan J. Pandit, Mark Lizar
date-accepted: 2019-04-05
description: Specifies restriction on the storage of personal data
domain: TechnicalOrganisationalMeasure
range: StorageRestriction
term status: accepted

withdrawalBy
type: Property
created: 2019-04-04
creator: Harshvardhan J. Pandit, Mark Lizar, Bud Bruegger
date-accepted: 2019-04-05
description: Specifies the entity that withdrew consent
comment: Normally this would be the dataSubject, but in some exceptional cases, the consent might be withdraawn on behalf by someone else, e.g. parents of minors.
domain: Consent
range: LegalEntity
term status: accepted

withdrawalByJustification
type: Property
created: 2019-04-04
creator: Harshvardhan J. Pandit, Mark Lizar, Bud Bruegger
date-accepted: 2019-04-05
description: Specifies the justification for entity withdrawing consent
comment: This field can be used to proivde a justification why the weithdrawal was done by another DataSubject or legal entity, e.g. declariing the relationship (parent, guardian), in combination with the field withdrawalBy
domain: Consent
term status: accepted

withdrawalMethod
type: Property
created: 2019-04-04
creator: Harshvardhan J. Pandit, Mark Lizar, Bud Bruegger
date-accepted: 2019-04-05
description: Specifries the method by which consent can be/has been withdrawn
comment: Can be used to record information of how to withdraw consent, e.g. by a click to a form, in writing, etc., by logging into a system and confirm per email, or with some additional authentication, etc.
domain: Consent
term status: accepted

withdrawalTime
type: Property
created: 2019-04-04
creator: Harshvardhan J. Pandit, Mark Lizar, Bud Bruegger
date-accepted: 2019-04-05
description: Specifies the instant in time when consent was withdrawn
domain: Consent
range: Instant
term status: accepted

Data Privacy Vocabulary
type: Ontology
abstract: The Data Privacy Vocabulary provides terms (classes and properties) to annotate and categorize instances of legally compliant personal data handling according to the EU General Data Protection Regulation. This scope could be extended by later versions to other data and privacy protection regulations. The vocabulary provides terms to describe which personal data Categories are undergoing a specified kind of processing by a specific data controller and/or transferred to some recipient for a particular purpose , based on a specific legal ground (e.g. consent, or other legal grounds such as legitimate interest, etc.), with specified technical and organisational measures and restrictions (e.g. storage locations and storage durations) in place.
contributor: Bert Bos
contributor: Bud Bruegger
contributor: Elmar Kiesling
contributor: Eva Schlehahn
contributor: Fajar J. Ekaputra
contributor: Javier D. Fernández
contributor: Mark Lizar
contributor: Ramisa Gachpaz Hamed
contributor: Rigo Wenning
contributor: Rob Brennan
contributor: Simon Steyskal
created: 2019-06-18
creator: Axel Polleres
creator: Harshvardhan J. Pandit
description: The Data Privacy Vocabulary provides terms (classes and properties) to annotate and categorize instances of legally compliant personal data handling. These terms are intended to annotate Legal Personal Data Handling in a machine-readable fashion, by specifying which personal data categories are undergoing a specific kind of processing, by a specific data controller and/or shared with some recipient for a particular purpose , based on a specific legal ground (e.g. consent or legitimate interest), with specific technical and organisational measures and restrictions (e.g. storage location and storage duration) in place.
source: dpvcg
status: draft
preferred namespace prefix: dpv
preferred namespace uri: https://w3.org/ns/dpv
version info: 0.1