Lexicon Model for Ontologies - Core
type: Ontology
version info: 1.0
modified: 2016-01-10
issued: 2016-01-10
preferred namespace prefix: ontolex
preferred namespace uri: http://www.w3.org/ns/lemon/ontolex#
rights: CC-Zero
description: A model for the representation of lexical information relative to ontologies. Core module.
contributor: fiorelli
contributor: stellato
contributor: web
creator: john.mccr.ae
contributor: 52-emontiel
creator: www.cimiano.de
contributor: ~declerck
contributor: anas-fahad-khan
contributor: aldo-gangemi
contributor: 53-lupe
contributor: www.paulbuitelaar.net
publisher: ontolex
license: https://creativecommons.org/publicdomain/zero/1.0/
contributor: francescafrontini

in scheme
type: ObjectProperty

canonical form
type: ObjectProperty
type: FunctionalProperty
label: kanoniese vorm @af
label: kanonische Form @de
label: forma canónica @es
label: forme canonique @fr
label: forma canonica @it
label: canonieke vorm @nl
label: formă canonică @ro
label: kanonisk form @sv
label: каноническая форма @ru
comment: The 'canonical form' property relates a lexical entry to its canoncical or dictionary form. This usually indicates the "lemma" form of a lexical entry.
comment: Свойство 'каноническая форма' связывает словарную единицу с ее канонической или словарной формой. Она обычно обозначает "лемму" словарной единицы. @ru
range: form
domain: lexical entry
sub property of: lexical form

concept
type: ObjectProperty
label: konsep @af
label: Konzept @de
label: concepto @es
label: concetto @it
label: begrip @nl
label: conceito @pt
label: begrepp @sv
label: понятие @ru
comment: The 'concept' property relates an ontological entity to a lexical concept that represents the corresponding meaning.
comment: Свойство 'понятие' связывает сущность в онтологии с лексическим понятием, которое представляет соответствующее значение. @ru
range: lexical concept
inverse of: is concept of

denotes
type: ObjectProperty
label: dui aan @af
label: bezeichnet @de
label: denota @es
label: dénote @fr
label: duidet aan @nl
label: denotă @ro
label: betecknar @sv
label: обозначает @ru
comment: The 'denotes' property relates a lexical entry to a predicate in a given ontology that represents its meaning and has some denotational or model-theoretic semantics.
comment: Свойство 'обозначает' связывает словарную единицу с предикатом в онтологии, который представляет ее значение и обладает денотативной или теоретико-модельной семантикой. @ru
sub property of: denotes
domain: lexical entry
range: Resource
property chain axiom: sense
property chain axiom: reference

evokes
type: ObjectProperty
label: roep op @af
label: ruft hervor @de
label: evoca @es
label: évoque @fr
label: lokt uit @nl
label: evocă @ro
label: framkallar @sv
label: порождает @ru
comment: The 'evokes' property relates a lexical entry to one of the lexical concepts it evokes, i.e. the mental concept that speakers of a language might associate when hearing the lexical entry.
comment: Свойство 'порождает' связывает словарную единицу с одним из лексических понятий, которую она порождает, то есть мыслительное понятие, которое возникает в сознании говорящих, когда они слышат данную словарную единицу. @ru
range: lexical concept
domain: lexical entry
property chain axiom: sense
property chain axiom: is lexicalized sense of

is concept of
type: ObjectProperty
label: is konsep van @af
label: ist Konzept von @de
label: es concepto de @es
label: est un concept pour @fr
label: è concetto di @it
label: is concept van @nl
label: é conceito de @pt
label: este concept a(l) @ro
label: är begrepp för @sv
label: является понятием @ru
comment: This property formalizes the meaning of a Lexical Concept by linking it to a particular ontological meaning.
comment: Это свойство формализует значение 'Лексического Понятия', связывая его с отдельным значением в онтологии. @ru
domain: lexical concept

is denoted by
type: ObjectProperty
label: word aangedui deur @af
label: wird bezeichnet von @de
label: es denotado por @es
label: est dénoté par @fr
label: è denotato da @it
label: wordt aangeduidet door @nl
label: é denotado por @pt
label: este denotat cu @ro
label: betecknas av @sv
label: обозначается @ru
comment: The object property isDenotedBy is the inverse of the object property denotes.
comment: Свойство объекта 'обозначается' является обратным к свойству объекта 'обозначает'. @ru
range: lexical entry
domain: Resource
inverse of: denotes

is evoked by
type: ObjectProperty
label: word opgeroep deur @af
label: wird hervorgerufen von @de
label: es evocado por @es
label: est évoqué par @fr
label: è evocato da @it
label: wordt uitgelokt door @nl
label: este evocat de @ro
label: framkallas av @sv
label: порождается @ru
comment: The inverse relation to evokes.
comment: Отношение обратное к 'порождает'. @ru
domain: lexical concept
range: lexical entry
inverse of: evokes

is lexicalized sense of
type: ObjectProperty
label: is geleksikaliseerde sin van @af
label: ist lexikalisierter Sinn von @de
label: es l'acepción lexicalizado de @es
label: est le sens lexicalisé de @fr
label: è il senso lessicalizzato di @it
label: is lexikaal zin van @nl
label: este sens lexicalizat de @ro
label: är lexikaliserad betydelse för @sv
label: является лексикализованным смыслом @ru
comment: The object property isLexicalizedSenseOf is the inverse property of lexicalized sense.
comment: Свойство объекта 'является лексикализованным смыслом' представляет собой свойство, обратное к свойству 'лексикализованный смысл'. @ru
domain: lexical sense
range: lexical concept
inverse of: lexicalized sense

is reference of
type: ObjectProperty
type: InverseFunctionalProperty
label: is verwysing van @af
label: ist Referenz von @de
label: es referencia de @es
label: est référence de @fr
label: è riferimento di @it
label: is referentie van @nl
label: é referência de @pt
label: este referință a(l) @ro
label: är referens för @sv
label: является референцией @ru
comment: The object property isReferenceOf is the inverse property of reference.
comment: Свойство объекта 'является референцией' представляет собой свойство, обратное к свойству 'референция'. @ru
inverse of: reference
domain: Resource
range: Class
  union of: lexical sense
  union of: OntoMap

is sense of
type: ObjectProperty
type: FunctionalProperty
label: is sin van @af
label: ist Sinn von @de
label: es acepción de @es
label: est signification de @fr
label: è il senso di @it
label: is zin van @nl
label: é sentido de @pt
label: este sens a(l) @ro
label: är betydelse för @sv
label: является смыслом @ru
comment: The property isSenseOf is the inverse property of sense.
comment: Свойство 'является смыслом' представляет собой свойство, обратное к свойству 'смысл'. @ru
range: lexical entry
domain: lexical sense

lexical form
type: ObjectProperty
label: leksikale vorm @af
label: lexikalische Form @de
label: forma léxica @es
label: forme lexicale @fr
label: forma lessicale @it
label: lexikaal vorm @nl
label: formă lexicală @ro
label: lexikonform @sv
label: лексическая форма @ru
comment: The 'lexical form' property relates a lexical entry to one grammatical form variant of the lexical entry.
comment: Свойство 'лексическая форма' соотносит словарную единицу с одним вариантом грамматической формы словарной единицы. @ru
range: form
domain: lexical entry

lexicalized sense
type: ObjectProperty
label: geleksikaliseerde Sin @af
label: lexikalisierter Sinn @de
label: acepción lexicalizada @es
label: signification lexicalisé @fr
label: senso lessicalizzato @it
label: lexikaal zin @nl
label: sens lexicalizat @ro
label: lexikaliserad betydelse @sv
label: лексикализованный смысл @ru
comment: The 'lexicalized sense' property relates a lexical concept to a corresponding lexical sense that lexicalizes the concept.
comment: Свойство 'лексикализованный смысл' связывает лексическое понятие с соответствующим лексическим смыслом, который лексикализует понятие. @ru
domain: lexical concept
range: lexical sense

morphological pattern
type: ObjectProperty
label: morfologiese patroon @af
label: morphologisches Muster @de
label: patrón morfológico @es
label: patron morphologique @fr
label: motivo morfologico @it
label: morfologische patroon @nl
label: model morfologic @ro
label: morfologiskt mönster @sv
label: морфологическая модель @ru
comment: The 'morphological pattern' property indicates the morphological class of a word.
comment: Свойство 'морфологическая модель' обозначает морфологический класс слова. @ru
domain: lexical entry

other form
type: ObjectProperty
label: ander form @af
label: andere Form @de
label: otra forma @es
label: autre forme @fr
label: altra forma @it
label: andere vorm @nl
label: outra forma @pt
label: altă formă @ro
label: annan form @sv
label: другая форма @ru
comment: The 'other form' property relates a lexical entry to a non-preferred ("non-lemma") form that realizes the given lexical entry.
comment: Свойство 'другая форма' связывает словарную единицу с малоупотребительной формой ("не леммой"), которая является реализацией данной словарной единицы @ru
range: form
domain: lexical entry
sub property of: lexical form

reference
type: ObjectProperty
type: FunctionalProperty
label: verwysing @af
label: Referenz @de
label: referencia @es
label: référence @fr
label: riferimento @it
label: referntie @nl
label: referência @pt
label: referință @ro
label: referens @sv
label: референция @ru
comment: The 'reference' property relates a lexical sense to an ontological predicate that represents the denotation of the corresponding lexical entry.
comment: Свойство 'референция' соотносит лексический смысл с предикатом в онтологии, который уточняет значение денотата (соответствующей словарной единицы). @ru
range: Resource
domain: Class
  union of: lexical sense
  union of: OntoMap

sense
type: ObjectProperty
type: InverseFunctionalProperty
label: sinne @af
label: Sinn @de
label: acepción @es
label: signification @fr
label: senso @it
label: zin @nl
label: sentido @pt
label: sens @ro
label: betydelse @sv
label: смысл @ru
comment: The 'sense' property relates a lexical entry to one of its lexical senses.
comment: Свойство 'смысл' связывает словарную единицу с одним из ее лексических смыслов. @ru
domain: lexical entry
range: lexical sense
inverse of: is sense of

usage
type: ObjectProperty
label: Gebrauch @de
label: uso @es
label: gebruik @nl
label: употребление @ru
comment: The 'usage' property indicates usage conditions or pragmatic implications when using the lexical entry to refer to the given ontological meaning.
comment: Свойство 'употребление' обозначает условия использования или прагматическое значение при употреблении словарной единицы для соотнесения с определенным значением в онтологии. @ru
domain: lexical sense
range: Resource

phonetic representation
type: DatatypeProperty
label: fonetiese voorstelling @af
label: phonetische Darstellung @de
label: representación fonética @es
label: représentation phonétique @fr
label: rappresentazione fonetica @it
label: fonetische voorstelling @nl
label: reprezentare fonetică @ro
label: fonetisk representation @sv
label: фонетическое представление @ru
comment: The 'phonetic representation' property indicates one phonetic representation of the pronunciation of the form using a scheme such as the International Phonetic Alphabet (IPA).
comment: Свойство 'фонетическое представление' обозначает фонетическое представление произношения формы с использованием какой-либо схемы, например, Международного фонетического алфавита (IPA, МФА). @ru
range: langString
domain: form
sub property of: representation

representation
type: DatatypeProperty
label: voorstelling @af
label: Darstellung @de
label: representación @es
label: représentation @fr
label: rappresentazione @it
label: representação @pt
label: reprezentare @ro
label: представление @ru
comment: The 'representation' property indicates a string by which the form is represented according to some orthography.
comment: Свойство 'представление' обозначает некую последовательность, с помощью которой форма может быть представлена средствами орфографии. @ru
range: langString
domain: form

written representation
type: DatatypeProperty
label: geskrewe voorstelling @af
label: schriftliche Darstellung @de
label: representación escrita @es
label: représentation écrite @fr
label: rappresentazione scritta @it
label: schriftlijke voorstelling @nl
label: representação escrita @pt
label: reprezentare scrisă @ro
label: skriven form @sv
label: письменное представление @ru
comment: The 'written representation' property indicates the written representation of a form.
comment: Свойство 'письменное представление' обозначает письменное представление формы. @ru
range: langString
domain: form
sub property of: representation

expression
type: Class

meaning
type: Class

concept
type: Class

concept scheme
type: Class

affix
type: Class
label: affiks @af
label: Affix @de
label: afijo @es
label: affixe @fr
label: affisso @it
label: aplică @ro
label: аффикс @ru
subclass of: lexical entry
comment: An affix is a lexical entry that represents a morpheme (suffix, prefix, infix, circumfix) that is attached to a word stem to form a new word.
comment: 'Аффикс' - это словарная единица, которая представляет морфему (суффикс, префикс, инфикс, циркумфикс), добавляемую к основе слова для образования нового слова. @ru

concept set
type: Class
label: Konzeptsatz @de
label: conjunto de conceptos @es
label: banque de conepts @fr
label: banca concetti @it
label: verzameling van begrippen @nl
label: набор понятий @ru
equivalent class: Restriction
  on property: in scheme
  on class: lexical concept
  min qualified cardinality: 1
subclass of: concept scheme
comment: A concept set represents a collection of lexical concepts.
comment: 'Набор понятий' представляет собой совокупность лексических понятий. @ru

form
type: Class
label: vorm @af
label: Form @de
label: forma @es
label: forme @fr
label: Forma @pt
label: formă @ro
label: форма @ru
subclass of: Thing
subclass of: Restriction
  on property: written representation
  min qualified cardinality: 1
  on data range: langString
comment: A form represents one grammatical realization of a lexical entry.
comment: 'Форма' представляет одну грамматическую реализацию словарной единицы. @ru

lexical concept
type: Class
label: leksikale konsep @af
label: lexikalisches Konzept @de
label: concepto lexicalizado @es
label: concept lexical @fr
label: concetto lessicale @it
label: lexikaal concept @nl
label: conceito léxico @pt
label: lexikaliskt begrepp @sv
label: лексическое понятие @ru
subclass of: meaning
subclass of: concept
comment: A lexical concept represents a mental abstraction, concept or unit of thought that embodies the meaning of one or more lexical entries.
comment: 'Лексическое понятие' представляет элемент абстрактного мышления, понятие или единицу мысли, которая может быть лексикализована определенным набором смыслов. @ru

lexical entry
type: Class
label: leksikale inskrywing @af
label: Lexikoneintrag @de
label: entrada léxica @es
label: entrée lexicale @fr
label: entrata lessicale @it
label: lexikaal item @nl
label: înregistrare lexicală @ro
label: lexikoningång @sv
label: словарная единица @ru
subclass of: expression
subclass of: Thing
subclass of: Restriction
  on property: canonical form
  on class: form
  max qualified cardinality: 1
subclass of: Restriction
  on property: lexical form
  on class: form
  min qualified cardinality: 1
comment: A lexical entry represents a unit of analysis of the lexicon that consists of a set of forms that are grammatically related and a set of base meanings that are associated with all of these forms. Thus, a lexical entry is a word, multiword expression or affix with a single part-of-speech, morphological pattern, etymology and set of senses.
comment: 'Словарная единица' представляет собой единицу анализа словаря, которая состоит из совокупности грамматически связанных форм и совокупности основных значений, ассоциирующихся со всеми этими формами. 'Словарная единица' - это слово, словосочетание или аффикс одной части речи, морфологической модели, этимологии и набора значений. @ru

lexical sense
type: Class
label: leksikale sin @af
label: lexikalischer Sinn @de
label: acepción léxica @es
label: signification lexicale @fr
label: senso lessicale @it
label: lexikaal zin @nl
label: sens lexical @ro
label: lexikonbetydelse @sv
label: лексический смысл @ru
subclass of: meaning
subclass of: Restriction
  on property: is sense of
  on class: lexical entry
  qualified cardinality: 1
subclass of: Restriction
  on property: reference
  cardinality: 1
comment: A lexical sense represents the lexical meaning of a lexical entry when interpreted as referring to the corresponding ontology element. A lexical sense thus represents a reification of a pair of a uniquely determined lexical entry and a uniquely determined ontology entity it refers to. A link between a lexical entry and an ontology entity via a Lexical Sense object implies that the lexical entry can be used to refer to the ontology entity in question.
comment: 'Лексический смысл' обозначает лексическое значение словарной единицы, когда оно понимается как относящееся к соответствующему элементу онтологии. 'Лексический смысл' представляет собой овеществление пары, состоящей из однозначно определяемой словарной единицы и однозначно определяемой сущности отнологии, к которой относится данный лексический смысл. Связь между словарной единицей и сущностью в онтологии посредством объекта 'Лексический Смысл' подразумевает, что словарная статья может быть использована для отсылки к соответствующей сущности в онтологии. @ru

multi-word expression
type: Class
label: multiwoorduitdrukking @af
label: Mehrwortausdruck @de
label: expresión multipalabra @es
label: expression à mots multiples @fr
label: espressione di gruppi di parole @it
label: mutliwoorduitdrukking @nl
label: expresie din mai multe cuvinte @ro
label: flerordsuttryck @sv
label: словосочетание @ru
subclass of: lexical entry
comment: A multiword expression is a lexical entry that consists of two or more words.
comment: 'Словосочетание' - это словарная единица, состоящая из двух или более слов. @ru

word
type: Class
label: woord @af
label: Wort @de
label: palabra @es
label: mot @fr
label: parola @it
label: cuvânt @ro
label: ord @sv
label: слово @ru
subclass of: lexical entry
comment: A word is a lexical entry that consists of a single token.
comment: 'Слово' - это словарная единица, представяющая собой единичную реализацию лексемы. @ru