Ontologia della Descrizione Denotativa (ArCo network)
type: Ontology
imports: core
reuses pattern as template: collectionentity.owl
creator: Aldo Gangemi (ISTC-CNR, STLab)
creator: Andrea Nuzzolese (ISTC-CNR, STLab)
creator: Chiara Veninata (MiBAC, ICCD)
creator: Ludovica Marinucci (ISTC-CNR, STLab)
creator: Marialetizia Mancinelli (MiBAC, ICCD)
creator: Valentina Carriero (ISTC-CNR, STLab)
creator: Valentina Presutti (ISTC-CNR, STLab)
description: Questo modulo, detto della descrizione denotativa (denotazione è inteso come l'atto di indicare una cosa attraverso segni esteriori), modella le caratteristiche di un bene culturale, individuabili e/o individuate durante il processo di catalogazione e misurabili in accordo con un sistema di riferimento. Esempi includono misure es. lunghezza, materia es. argilla, tecniche es. fusione, stato di conservazione es. buono, discreto, cattivo.
description: The Denotative Description module encodes the characteristics of a cultural property, as detectable and/or detected during the cataloguing process and measurable according to a reference system. Examples include measurements e.g. length, constituting materials e.g. clay, employed techniques e.g. melting, conservation status e.g. good, decent, bad. @en
language: ENG
language: ITA
title: Denotative Description Ontology (ArCo network) @en
issued: 2018-03-07
license: https://creativecommons.org/licenses/by-sa/4.0/
license: A31 CCBYSA40
modified: 2019-06-01
reuses pattern as template: classification.owl
reuses pattern as template: descriptionandsituation.owl
reuses pattern as template: situation.owl
comment: Questo modulo, detto della descrizione denotativa (denotazione è inteso come l'atto di indicare una cosa attraverso segni esteriori), modella le caratteristiche di un bene culturale, individuabili e/o individuate durante il processo di catalogazione e misurabili in accordo con un sistema di riferimento. Esempi includono misure es. lunghezza, materia es. argilla, tecniche es. fusione, stato di conservazione es. buono, discreto, cattivo. In questo modulo si riusano come template i seguenti Ontology Design Patterns: - http://www.ontologydesignpatterns.org/cp/owl/collectionentity.owl - http://www.ontologydesignpatterns.org/cp/owl/classification.owl - http://www.ontologydesignpatterns.org/cp/owl/descriptionandsituation.owl - http://www.ontologydesignpatterns.org/cp/owl/situation.owl
comment: The Denotative Description module encodes the characteristics of a cultural property, as detectable and/or detected during the cataloguing process and measurable according to a reference system. Examples include measurements e.g. length, constituting materials e.g. clay, employed techniques e.g. melting, conservation status e.g. good, decent, bad. In this module the following Ontology Design Patterns have been used: - http://www.ontologydesignpatterns.org/cp/owl/collectionentity.owl - http://www.ontologydesignpatterns.org/cp/owl/classification.owl - http://www.ontologydesignpatterns.org/cp/owl/descriptionandsituation.owl - http://www.ontologydesignpatterns.org/cp/owl/situation.owl @en
version info: Version 1.1 @en
version info: Versione 1.1

sono note producibili di
type: ObjectProperty
sub property of: è caratteristica tecnica di
inverse of: ha note producibili
domain: Caratteristica tecnica
range: Thing
comment: Questa è la proprietà inversa di "ha note producibili".
comment: This is the inverse property of "has available notes". @en
label: are available notes of @en
version info: stabile
version info: stable @en

classifica caratteristica tecnica
type: ObjectProperty
sub property of: isConceptOf
inverse of: è caratteristica tecnica classificata da
domain: Concetto tecnico
range: Caratteristica tecnica
is native to: technical-characteristic
comment: Questa proprietà, inversa a "è caratteristica classificata da", collega un concetto tecnico a una caratteristica tecnica di un'entità - come un bene culturale.
comment: This property connects a techical concept to an entity's technical characteristic. It is the inverse property of isCharacteristicClassifiedBy. @en
label: classifies technical characteristic @en
version info: stabile
version info: stable @en

ha accessorio
type: ObjectProperty
inverse of: è accessorio di
domain: CulturalEntity
range: Accessorio
comment: Questa proprietà collega un bene musicale a un suo accessorio, ovvero un oggetto collegabile al bene musicale, sia nel caso in cui sia funzionale alla produzione del suono, sia nel caso in cui sia di supporto alla produzione del suono o alla conservazione o alla prassi musicale del bene.
comment: This property relates a musical good to one of its accessories. In other words, it is an object linkable to a musical object, whether it is functional to the sound production, or if it is the sound's production or conservation medium. @en
label: has accessory @en
version info: stabile
version info: stable @en
iccd norm tag: ICCD Normativa SM 4.00: AS/ASS/ASST

ha elemento apposto sul bene
type: ObjectProperty
inverse of: è elemento apposto su
domain: CulturalEntity
range: Elemento apposto su bene culturale
comment: Questa proprietà collega un bene culturale a un elemento apposto sul bene (es.: emblema, timbro, iscrizione, etc.)
comment: This property relates a cultural property to an element affixed on it (e.g. inscription, stamp, etc.) @en
label: has element affixed to cultural property @en
version info: stabile
version info: stable @en
iccd norm tag: ICCD Normativa Trasversale 4.00: DA/ISE - ICCD versioni precedenti alla 4.00: DA/ISR; DA/STM - ICCD Normativa A: LI/LSI - ICCD Normativa MI: AU/DDC

ha tipo di elemento apposto
type: ObjectProperty
sub property of: hasType
inverse of: è tipo di elemento apposto
domain: Elemento apposto su bene culturale
range: Tipo di elemento apposto
comment: Questa proprietà collega un'iscrizione, un emblema, un timbro, uno stemma, etc., al suo tipo (es.: gentilizio, civile, religioso, etc.)
comment: This property relatesan inscription (or an emblem, a mark, etc.) to its type. @en
label: has affixed element type @en
version info: stabile
version info: stable @en
iccd norm tag: ICCD Normativa Trasversale 4.00: DA/ISE/ISEE - Normative di versioni precedenti: DA/STM/STMQ

ha note producibili
type: ObjectProperty
sub property of: ha caratteristica tecnica
domain: Thing
range: Caratteristica tecnica
comment: Questa proprietà collega uno strumento musicale, dal grave all'acuto, alle note producibili dallo strumento.
comment: This property relates a musical instrument to the playable notes by it, from low to high. @en
label: has available notes @en
version info: stabile
version info: stable @en

ha modalità comunicativa
type: ObjectProperty
sub property of: hasCulturalEntityCharacteristic
inverse of: è modalità comunicativa
domain: CulturalEntity
range: Modalità comunicativa
comment: Questa proprietà collega un bene culturale immateriale a una modalità comunicativa mediante la quale il bene viene veicolato.
comment: This property relates an intangible cultural property to a communication medium. @en
label: has communication medium @en
version info: stabile
version info: stable @en
iccd norm tag: ICCD Normativa BDI: CU

ha tipo di modalità comunicativa
type: ObjectProperty
sub property of: hasType
inverse of: è tipo di modalità comunicativa
domain: Modalità comunicativa
range: Tipo di modalità comunicativa
comment: Questa proprietà collega una modalità comunicativa di un oggetto al tipo di modalità comunicativa (verbale, strumentale, etc.)
comment: This property relates a communication medium to its type (e.g.: verbal, singing, etc.) @en
label: has communication medium type @en
version info: stabile
version info: stable @en
iccd norm tag: ICCD Normativa BDI: CU

ha stato di conservazione
type: ObjectProperty
sub property of: hasSituation
inverse of: è stato di conservazione di
domain: CulturalEntity
range: Stato di Conservazione
comment: Questa proprietà associa il bene culturale al suo stato di conservazione.
comment: This property relates the cultural property with its conservation status. @en
label: has conservation status @en
version info: stabile
version info: stable @en
iccd norm tag: CO/STC

ha tipo di stato di conservazione
type: ObjectProperty
sub property of: hasType
inverse of: è tipo di stato di conservazione
domain: Stato di Conservazione
range: Tipo di stato di conservazione
comment: Questa proprietà associa lo stato di conservazione a uno dei valori del tipo di stato di conservazione.
comment: This property relates a conservation status to one of its type's values. @en
label: has conservation status type @en
version info: stabile
version info: stable @en
iccd norm tag: CO/STC/STCC

ha accessibilità
type: ObjectProperty
sub property of: hasCulturalEntityCharacteristic
inverse of: è accessibilità di bene culturale
domain: CulturalEntity
range: Accessibilità del bene culturale
comment: Questa proprietà collega il bene culturale alla sua accessibilità, ovvero la possibilità di accedere al bene, in tutto o in parte, per esempio per effettuare un esame diretto finalizzato alla catalogazione (es.: un bene immobile posto in un luogo recintato non accessibile, un bene mobile che non si può osservare da vicino perché posto troppo in alto su una parete; un bene totalmente accessibile, etc.).
comment: This property relates the cultural property to its accessibility, that is the possibility to reach or enter that cultural property, for example for cataloguing activities (e.g.: an immovable cultural property located in a walled area, a movable cultural property located on the top shelf, a totally accessible cultural property, etc.) @en
label: has cultural property accessibility @en
version info: stabile
version info: stable @en
iccd norm tag: ICCD Normativa Trasversale 4.00: LC/ACB

ha disponibilità materiale
type: ObjectProperty
sub property of: hasCulturalEntityCharacteristic
inverse of: è disponibilità materiale di bene culturale
domain: CulturalEntity
range: Disponibilità materiale del bene culturale
comment: Questa proprietà collega il bene culturale alla sua disponibilità materiale, ovvero se il bene è materialmente disponibile, per esempio per attività di catalogazione, o se non è disponibile (es.: furto, distruzione)
comment: This class relates the cultural property to its availability, that is wheter the cultural property is available or not (e.g.: theft, destruction) for example for cataloguing activities. @en
label: has cultural property availability @en
version info: stabile
version info: stable @en
iccd norm tag: ICCD Normativa Trasversale 4.00: OG/OGR

ha definizione del bene culturale
type: ObjectProperty
inverse of: è definizione di bene culturale
domain: Tipo di bene culturale
range: Definizione del bene culturale
comment: Questa proprietà collega la tipologia di un bene culturale a una delle sue componenti, cioè la definizione.
comment: This property relates a cultural entity's typology to one of its components, i.e. its definition. @en
label: has cultural property definition @en
version info: stabile
version info: stable @en
iccd norm tag: OG/OGT/OGTD

ha specifiche del bene culturale
type: ObjectProperty
inverse of: sono specifiche del bene culturale
domain: Tipo di bene culturale
range: Specifiche del bene culturale
comment: Questa proprietà collega la tipologia di un bene culturale a una delle sue componenti, cioè alle specifiche morfologiche e funzionali.
comment: This property relates a cultural entity's typology to its components, i.e. morphological and functional specifications. @en
label: has cultural property specification @en
version info: stabile
version info: stable @en
iccd norm tag: OG/OGT/OGTT

ha tipo di bene culturale
type: ObjectProperty
sub property of: hasType
inverse of: è tipo di bene culturale
domain: CulturalEntity
range: Tipo di bene culturale
comment: Questa proprietà collega un bene culturale al tipo di bene, per permettere la corretta e precisa individuazione del bene.
comment: This property relates a cultural property to its type. @en
label: has cultural property type @en
version info: stabile
version info: stable @en
iccd norm tag: OG/OGT

ha dedicatario
type: ObjectProperty
inverse of: è dedicatario di
domain: Dedica
range: Agent
comment: Questa proprietà collega una dedica al dedicatario, cioè alla persona o ente cui è rivolta la dedica.
comment: This property connects a dedication to its dedicaatee, which is the person or institution to whom the dedication is addressed. @en
label: has dedicatee @en
version info: stabile
version info: stable @en
iccd norm tag: ICCD Normativa MI 3.00: AU/DDC/DDCM

ha designazione nel tempo
type: ObjectProperty
sub property of: hasSituation
inverse of: è denominazione nel tempo di
domain: CulturalEntity
range: Denominazione nel tempo
comment: Questa proprietà associa un bene culturale alla sua denominazione e/o dedicazione o, per la normativa FF, titolo, nel corso del tempo.
comment: This property connects a cultural entity to its denomination and/or dedication, or title (for FF legislation) over time. @en
label: has designation in time @en
version info: stabile
version info: stable @en
iccd norm tag: ICCD Normativa Trasversale 4.00: OG/OGD. - Normativa BNB: OG/OGT/OGTE e OG/OGT/OGTC

ha tipo di denominazione
type: ObjectProperty
sub property of: hasType
inverse of: è tipo di denominazione
domain: Denominazione nel tempo
range: Tipo di denominazione
comment: This property relates a cultural entity designation to its type. @en
label: has designation type @en
version info: Questa proprietà collega una denominazione o dedicazione o, per la normativa FF, titolo nel tempo al tipo di denominazione del bene (altra lingua, attribuita, attuale, dialettale, etc.)
version info: stabile
version info: stable @en
iccd norm tag: ICCD Normativa Trasversale 4.00: OG/OGD/OGDT

ha corista
type: ObjectProperty
sub property of: ha caratteristica tecnica
inverse of: è corista di
domain: Thing
range: Caratteristica tecnica
comment: Questa proprietà collega uno strumento musical al corista rilevato (nota, temperatura ed eventualmente umidità ambientale al momento della rilevazione).
comment: This property relates a musical instrument to the identified diapason (note, temperature and eventually humidity during the detection). @en
label: has diapason @en
version info: stabile
version info: stable @en

ha estensione
type: ObjectProperty
sub property of: ha caratteristica tecnica
inverse of: è estensione di
domain: Thing
range: Caratteristica tecnica
comment: Questa proprietà collega uno strumento musicale alla sua estensione musicale.
comment: This property relates a musical instrument to its extension. @en
label: has extension @en
version info: stabile
version info: stable @en

ha formato di estensione/compressione del file
type: ObjectProperty
sub property of: ha caratteristica tecnica
inverse of: è formato di estensione/compressione del file di
domain: Thing
range: Caratteristica tecnica
comment: Questa proprietà collega una risorsa digitale su supporto informatico al formato utilizzato per la scrittura della risorsa.
comment: This property relates a digital resource to the format used to write it on a data medium. @en
label: has file format @en
version info: stabile
version info: stable @en

ha filigrana
type: ObjectProperty
sub property of: ha caratteristica tecnica
inverse of: è filigrana di
domain: Thing
range: Caratteristica tecnica
comment: Questa proprietà collega un'opera d'arte, un disegno, una fotografia, una stampa alla sua filigrana.
comment: This property relates an artwork, painting, photography, print to its filigree. @en
label: has filigree @en
version info: stabile
version info: stable @en

ha tipo di caratteri
type: ObjectProperty
inverse of: è tipo di caratteri di
domain: Elemento apposto su bene culturale
range: Tipo di caratteri
comment: Questa proprietà collega un'iscrizione, uno stemma, un timbro, etc., al tipo di caratteri che viene adottato (es.: corsivo, grassetto, caratteri gotici, etc.).
comment: This property connects an inscription or emblem, postmark, crest, etc. to the font style which has been adopted (e.g.: italic, bold, gothic etc). @en
label: has font style @en
version info: stabile
version info: stable @en
iccd norm tag: ICCD Normativa Traversale 4.00: DA/ISE/ISET - Normative di versioni precedenti: DA/ISR/ISRT. Normativa BNB: SB/SBE/SBEC

ha scopo funzionale
type: ObjectProperty
sub property of: hasCharacteristic
inverse of: è scopo funzionale di
domain: Thing
range: Scopo funzionale
comment: Questa proprietà collega un oggetto (es bene culturale, apparato iconografico/decorativo o elemento apposto su un bene culturale come un'iscrizione) al suo scopo funzionale (decorativo, religioso, simbolico, magico-offensivo, etc.), inteso come funzione che deve svolgere.
comment: This property realtes an object (e.g. cultural entity, iconographic/decorative apparatus, affixed element like an inscription) to its functional purpose, intended as the function the object has to perform (decorative, religious, symbolic, magic-offensive etc.). @en
label: has functional purpose @en
version info: stabile
version info: stable @en
iccd norm tag: ICCD Normativa Trasversale: DA/ISE/ISEC - Normative di versioni precedenti: DA/ISR/ISRC; DA/APF/APFF

ha analisi del vestimento
type: ObjectProperty
sub property of: ha caratteristica tecnica
inverse of: è analisi del vestimento
domain: Thing
range: Caratteristica tecnica
comment: Questa proprietà collega un vestimento antico o contemporaneo alla definizione tecnica completa dei tessuti, secondo le norme fornite dal C.I.E.T.A., o dei merletti, oppure rappresenta la distinzione fra tessuto unito e tessuto operato.
comment: This property relates an ancient or contemporary garment to the technical definition of textured fabrics, according to the standard provided by C.I.E.T.A., or laces. It can represent the dinstinction between plain fabric and textured fabric. @en
label: has garment analysis @en
version info: stabile
version info: stable @en

ha colore del vestimento
type: ObjectProperty
sub property of: ha caratteristica tecnica
inverse of: è colore del vestimento
domain: Thing
range: Caratteristica tecnica
comment: Questa proprietà collega un vestimento antico o contemporaneo al colore dominante, di solito quello del fondo del tessuto, o quello risultante dall'intreccio.
comment: This property relates an ancient and contemporary garment to its dominant color, usually it is base fabric's color, or the interlaced decoration's color. @en
label: has garment colour @en
version info: stabile
version info: stable @en

ha apparato iconografico e decorativo
type: ObjectProperty
sub property of: hasDescription
inverse of: è apparato iconografico e decorativo di
domain: CulturalEntity
range: Apparato iconografico e decorativo
comment: Questa proprietà collega un bene culturale al suo apparato iconografico e/o decorativo, inteso come l'insieme, che può essere più o meno complesso, delle rappresentazioni iconografiche e/o delle decorazioni presenti sul bene.
comment: This property relates a cultural enitity to its iconographic or decorative apparatus. @en
label: has iconographic or decorative apparatus @en
version info: stabile
version info: stable @en
iccd norm tag: ICCD Normativa Trasversale 4.00: DA/AID - ICCD Normative PST e BDM: DA/APF

ha tipo di apparato iconografico e decorativo
type: ObjectProperty
sub property of: hasType
inverse of: è tipo di apparato iconografico e decorativo
type: FunctionalProperty
domain: Apparato iconografico e decorativo
range: Tipo di apparato iconografico e decorativo
comment: Questa proprietà collega un apparato iconografico e decorativo di un bene culturale al tipo di apparato (iconografico, decorativo, iconografico-decorativo).
comment: This property relates a iconographic or decorative apparatus to its type. @en
label: has iconographic or decorative apparatus type @en
version info: stabile
version info: stable @en

ha modalità esecutiva
type: ObjectProperty
inverse of: è modalità esecutiva di
domain: Modalità comunicativa
range: Modalità esecutiva
comment: Questa proprietà collega una modalità comunicativa verbale o musicale vocale o musicale strumentale alla modalità esecutiva associata (es.: polifonica).
comment: This property relates a verbal or singing or instrumental communication medium to its implementation method (e.g.: polyphonic) associated to it. @en
label: has implementation method @en
version info: stabile
version info: stable @en
iccd norm tag: ICCD Normativa BDI: CU/CUM/CUMD; CU/CUS/CUSD

ha leggibilità
type: ObjectProperty
sub property of: hasCharacteristic
inverse of: è leggibilità di
domain: Stato di Conservazione
range: Leggibilità
comment: Questa proprietà collega lo stato di conservazione di un bene numismatico al suo stato di leggibilità.
comment: This property relates a numismatic entity's conservation status to its legibility status. @en
label: has legibility @en
version info: stabile
version info: stable @en
iccd norm tag: ICCD Normativa NU: CO/STC/STCL

ha localizzazione rappresentata
type: ObjectProperty
inverse of: è localizzazione rappresentata da
domain: CulturalEntity
range: TimeIndexedTypedLocation
comment: Questa proprietà rappresenta l'area rappresentata come soggetto di un bene culturale.
comment: This property represent the location as a subject of a cultural entity. @en
label: has location as subject @en
version info: stabile
version info: stable @en
iccd norm tag: se 4.00 LA/TLC o versioni precedenti a 4.00 LA/TCL = "area rappresentata"

ha memoria di massa
type: ObjectProperty
sub property of: ha caratteristica tecnica
inverse of: è memoria di massa di
domain: Thing
range: Caratteristica tecnica
comment: Questa proprietà collega una risorsa digitale alla memoria di massa nella quale è stata memorizzata la fotografia digitale.
comment: This property relates a digital photograph to the mass storage where a digital photograph is stored. @en
label: has mass storage @en
version info: stabile
version info: stable @en

ha materia
type: ObjectProperty
sub property of: ha materia e tecnica
inverse of: è materia di
domain: Thing
range: Caratteristica tecnica
comment: Questa proprietà collega un oggetto (per esempio un bene culturale) alla materia con cui è realizzato.
comment: This property relates an object to its material. @en
label: has material @en
version info: stabile
version info: stable @en

ha materia e tecnica
type: ObjectProperty
sub property of: ha caratteristica tecnica
inverse of: è materia e tecnica di
domain: Thing
range: Caratteristica tecnica
comment: Questa proprietà collega un oggetto alla materia e/o la tecnica con cui è realizzato l'oggetto, per esempio un bene culturale. Nel dominio delle normative ICCD per la catalogazione dei beni culturali, si rende necessaria nei casi in cui materia e tecnica sono registrate nello stesso campo, nella forma "materia/ tecnica".
comment: This property relates an object to the material or technique through which an object has been realized, e.g. a cultural entity. In ICCD standards for cataloguing cultural entities, this label is necessary when material and technique are registered in the same field. @en
label: has material or technique @en
version info: stabile
version info: stable @en

ha misura
type: ObjectProperty
inverse of: è misura in collezione
domain: Collezione di misure
range: Misura
is native to: object-collection
comment: Questa proprietà collega un insieme di misure osservate per un oggetto a una delle misure.
comment: This property connects a set of observed measures on an object to one of those measures. @en
label: has measurement @en
version info: stabile
version info: stable @en
iccd norm tag: MT/MIS - Normativa VeAC: anche MT/MIM

ha collezione di misure
type: ObjectProperty
inverse of: è collezione di misure di
domain: Thing
range: Collezione di misure
comment: Questa proprietà collega un oggetto all'insieme delle misure osservate per quell'oggetto.
comment: This property connects an object to the collection of observed measures on it. @en
label: has measurement collection @en
version info: stabile
version info: stable @en
iccd norm tag: MT/MIS - Normativa VeAC: anche MT/MII e MT/MIM - Normativa BNB: LR/LRI/LRIT, LRIH, LRIO)

ha tipo di misura
type: ObjectProperty
sub property of: hasType
inverse of: è tipo di misura
domain: Misura
range: Tipo di Misura
comment: Questa proprietà collega una misura al tipo di misura (altezza, larghezza, diametro, etc.)
comment: This property relates a measurement to its type. @en
label: has measurement type @en
version info: stabile
version info: stable @en
iccd norm tag: ICCD Normativa Trasversale: MT/MIS/MISZ; MT/MNR - Per versioni di normativa precedenti alla 4.00: MT/MIS/MISA; MT/MIS/MISD; MT/MIS/MISL; MT/MIS/MISN; MT/MIS/MISG; MT/MIS/MISP; MT/MIS/MISS; MT/MIS/MISR; MT/MIS/MISV - ICCD scheda VeAC: MT/MII/MIIA; MT/MII/MIIL; MT/MII/MIIP; MT/MIS/MISR; MT/MIS/MISD; MT/MIS/MISS; MT/MIS/MISP; MT/MIS/MISV; MT/MIS/MISF; MT/MIS/MISO

ha orientamento
type: ObjectProperty
inverse of: è orientamento di
domain: Thing
range: Orientamento
comment: Questa proprietà collega un oggetto al suo orientamento, secondo l'asse principale individuato.
comment: This property connects an object to its orientation, considering its major axis. @en
label: has orientation @en
version info: stabile
version info: stable @en
iccd norm tag: ICCD Normativa Trasversale: MT/ORT - ICCD Schede CA e MA: MT/ORT - Normativa BNB: LR/LRI/LRIP

ha motivo decorativo
type: ObjectProperty
inverse of: è motivo decorativo di
domain: Apparato iconografico e decorativo
range: Motivo decorativo
comment: Questa proprietà collega l'apparato iconografico e decorativo di un bene culturale al motivo decorativo (antropomorfo, zoomorfo, geometrico) rappresentato.
comment: This property connects a cultural entity's iconographic or decorative apparatus to its ornamental motif (anthropomorphic, zoomorphic, geometric). @en
label: has ornamental motif @en

ha colore della foto
type: ObjectProperty
sub property of: ha caratteristica tecnica
inverse of: è colore della foto
domain: Thing
range: Caratteristica tecnica
comment: Questo individuo collega una fotografia digitale al colore della fotografia digitale, ovvero se trattasi di fotografia in bianco/nero o a colori.
comment: This property relates a digital photograph to its colour, i.e. black and white or colours. @en
label: has photo colour @en
version info: stabile
version info: stable @en

ha programma per foto
type: ObjectProperty
sub property of: ha caratteristica tecnica
inverse of: è programma per foto di
domain: Thing
range: Caratteristica tecnica
comment: Questa proprietà collega una fotografia digitale al programma di visualizzazione, memorizzazione ed elaborazione utilizzato per la fotografia digitale.
comment: This property relates a digital photograph to the visualization, storage and processing program used for the digital photograph. @en
label: has photo program @en
version info: stabile
version info: stable @en

ha dimensioni della foto
type: ObjectProperty
sub property of: ha caratteristica tecnica
inverse of: è dimensione della foto
domain: Thing
range: Caratteristica tecnica
comment: Questa proprietà collega una risorsa digitale al formato della risorsa, inteso come la dimensione standardizzata (es.: per i materiali fotografici negativi, positivi, ecc.).
comment: This property relates a digital photograph to its format, intended as the photographic material's standardised size (e.g. negative, positives). @en
label: has photo size @en
version info: stabile
version info: stable @en

ha dimensioni in pixel
type: ObjectProperty
sub property of: ha caratteristica tecnica
inverse of: è dimensione in pixel di
domain: Thing
range: Caratteristica tecnica
comment: Questa proprietà collega un'immagine digitale (es.: fotografia) alle dimensioni, in pixel, dell'immagine.
comment: This property relates a digital resource to its size in pixels. @en
label: has pixel dimension @en
version info: stabile
version info: stable @en

ha livello di qualità
type: ObjectProperty
sub property of: ha caratteristica tecnica
inverse of: è livello di qualità di
domain: Thing
range: Caratteristica tecnica
comment: Questa proprietà collega una risorsa digitale al livello di qualità della risorsa (es.: alta risoluzione, bassa risoluzione, preview)
comment: This property relates a digital resource to its quality level, e.g. high-resolution, low-resolution, preview. @en
label: has quality level @en
version info: stabile
version info: stable @en

ha risoluzione
type: ObjectProperty
sub property of: ha caratteristica tecnica
inverse of: è risoluzione di
domain: Thing
range: Caratteristica tecnica
comment: Questa proprietà collega una fotografia alla risoluzione e al valore specifico utilizzati per la memorizzazione di una fotografia digitale.
comment: This property relates a digital resource to theresolution used for storing it. @en
label: has resolution @en
version info: stabile
version info: stable @en

ha campione prelevato
type: ObjectProperty
inverse of: è campione prelevato da
domain: CulturalEntity
range: Campione prelevato
comment: Questa proprietà collega un bene archeologico a un campione prelevato da esso.
comment: This property connects a archaeological entity to a sample collected from it. @en
label: has sample collected @en
version info: stabile
version info: stable @en
iccd norm tag: ICCD Normativa MA, CA, SI, SAS: MC/CMN

ha tipo di campione prelevato
type: ObjectProperty
sub property of: hasType
inverse of: è tipo di campione prelevato
type: FunctionalProperty
domain: Campione prelevato
range: Tipo di campione prelevato
comment: Questa proprietà collega un campione prelevato da un bene archeologico al tipo di campione (es.: intonaco, carbone, etc.)
comment: This property relates a sample collected to its type. @en
label: has sample collected type @en
version info: stabile
version info: stable @en
iccd norm tag: ICCD Normativa MA, CA, SI, SAS: MC/CMN/CMNT

ha forma
type: ObjectProperty
sub property of: ha caratteristica tecnica
inverse of: è forma di
domain: Thing
range: Caratteristica tecnica
comment: Questa proprietà collega un oggetto al formato dell'oggetto, per oggetti bidimensionali (es.: ottagonale, tondo)
comment: This property relates an object to its shape. It is used for bidimensional objects, e.g. octagonal or round shape. @en
label: has shape @en
version info: stabile
version info: stable @en

ha metodo di memorizzazione e profondità del colore
type: ObjectProperty
sub property of: ha caratteristica tecnica
inverse of: è metodo di memorizzazione e profondità del colore di
domain: Thing
range: Caratteristica tecnica
comment: Questa proprietà collega una fotografia al metodo e alla profondità di colore con cui è stata memorizzata la fotografia digitale.
comment: This property relates a digital photograph to the method and color depth through which a digital photograph has been stored. @en
label: has storage method or colour depth @en
version info: stabile
version info: stable @en

ha supporto
type: ObjectProperty
inverse of: è supporto di
domain: Elemento apposto su bene culturale
range: Supporto
comment: Questa proprietà collega una iscrizione, un timbro, un emblema, etc., rappresentato su un bene culturale al supporto su cui si trova l'elemento.
comment: This property connects an inscription, stamp, emblem etc., represented on a cultural entity to the support on which the entity is located. @en
label: has support @en
version info: stabile
version info: stable @en
iccd norm tag: ICCD Normativa Trasversale 4.00: DA/ISE/ISES

ha qualificazione di caratteristica tecnica
type: ObjectProperty
comment: Questa proprietà collega una caratteristica tecnica alla sua qualificazione
comment: This property relates a technical characteristic to a aqualification. @en
label: has technical caracteristic qualification @en
version info: instabile
version info: unstable @en

ha caratteristica tecnica
type: ObjectProperty
sub property of: hasCharacteristic
inverse of: è caratteristica tecnica di
domain: Thing
range: Caratteristica tecnica
property chain axiom: ha stato tecnico
property chain axiom: include caratteristica tecnica
comment: Questa proprietà collega un'entità a una caratteristica tecnica (es.: materia, tecnica, colore, livello di qualità, formato).
comment: This property relates an entity to a technical characteristic (e.g. material, technique, colour, quality level). @en
label: has technical characteristic @en
version info: stabile
version info: stable @en

ha stato tecnico
type: ObjectProperty
sub property of: hasSituation
inverse of: è stato tecnico di
domain: Thing
range: Stato tecnico di entità culturale
comment: Questa proprietà collega un'entità culturale al suo stato tecnico, valido fino a determinato momento, che è rappresentato dalle caratteristiche tecniche che il bene culturale ha in quel momento.
comment: This property connects a cultural entity to its technical status, valid until a specific moment, that is represented by the technical characteristics that a cultural entity has in that moment. @en
label: has technical status @en
version info: stabile
version info: stable @en
iccd norm tag: ICCD Normativa Trasversale 4.00: MT/MTC/MTCM; MT/MTC/MTCT - Normativa OA, D, F, S, MI: MT/FRM - Normativa OA, D, F, S: MT/FIL - Normativa VeAC: MT/MTC/MTCC; MT/MTC/MTCF - Normativa F: MT/FVC/FVCC; MT/FVC/FVCF; MT/FVC/FVCP; MT/FVC/FVCU; MT/FVC/FVCM; MT/FVM;

ha tecnica
type: ObjectProperty
sub property of: ha materia e tecnica
inverse of: è tecnica di
domain: Thing
range: Caratteristica tecnica
comment: Questa proprietà collega un oggetto alla tecnica di esecuzione dell'oggetto, per esempio un bene culturale.
comment: This property relates an object to its execution technique. @en
label: has technique @en
version info: stabile
version info: stable @en

ha temperamento
type: ObjectProperty
sub property of: ha caratteristica tecnica
inverse of: è temperamento di
domain: Thing
range: Caratteristica tecnica
comment: Questa proprietà collega uno strumento al temperamento adottato, soprattutto in caso di oggetto in condizioni originali, o dopo un restauro, dello strumento musicale. Per gli idiofoni a tasti fissi (come xilofoni, litofoni, metallofoni) rappresenta la successione degli intervalli.
comment: This property relates a musical instrument to the adopted temperament, especially in relation to an object in its original conditions, or after its restoration. For idiophones with fixed keys (e.g. xylophone, litophone, metallophone) the temperament represents the succession of intervals. @en
label: has temperament @en
version info: stabile
version info: stable @en

ha accordatura
type: ObjectProperty
sub property of: ha caratteristica tecnica
inverse of: è accordatura di
domain: Thing
range: Caratteristica tecnica
comment: Questa proprietà collega uno strumento all'accordatura dello strumento musicale.
comment: This property relates a musical instrument to its tuning. @en
label: has tuning @en
version info: stabile
version info: stable @en

ha valore
type: ObjectProperty
inverse of: è valore di
domain: Misura
range: Value
comment: Questa proprietà collega una misura al suo valore.
comment: This property relates a measurement to its value. @en
label: has value @en
version info: stabile
version info: stable @en

ha lunghezza vibrante
type: ObjectProperty
sub property of: ha caratteristica tecnica
inverse of: è lunghezza vibrante di
domain: Thing
range: Caratteristica tecnica
comment: Questa proprietà collega un uno strumento alla lunghezza vibrante dello strumento, in particolare di un cordofono.
comment: This property relates a musical instrument to its vibrating length, in particular a chordophone. @en
label: has vibrating lenght @en
version info: stabile
version info: stable @en

ha misura di imgombro
type: ObjectProperty
sub property of: ha misura
inverse of: è misura di ingombro di
domain: Collezione di misure
range: Misura
is native to: object-collection
comment: Questa proprietà collega un insieme di misure osservate per un oggetto a una dell misure, quando questa sia relativa all'ingombro di un vestimento antico o contemporaneo. Le misure ingombro determinano l'ingombro per l'immagazzinaggio e si possono quindiconsiderare le coordinate ortogonali dell'oggetto.
comment: This property connects a collection of observed measures on an object to one of these measures, when the latter is relative to an ancient or contemporary apparel's size. The volumetric dimensions measurements determine the size for storage and can be considered as the object's orthogonal coordinates. @en
label: has volumetric dimensions measurement
version info: stabile
version info: stable @en
iccd norm tag: Normativa VeAC: MT/MII

ha sistema di scrittura
type: ObjectProperty
inverse of: è sistema di scrittura di
domain: Elemento apposto su bene culturale
range: Sistema di scrittura
comment: Questa proprietà collega una iscrizione, un timbro, uno stemma, etc., al sistema di scrittura/alfabeto adottati.
comment: This property connects an inscription, stamp, crest etc., to the adopted writing system or alphabet. @en
label: has writing system @en
version info: stabile
version info: stable @en
iccd norm tag: ICCD Normativa Trasversale 4.00: DA/ISE/ISEF

include caratteristica tecnica
type: ObjectProperty
inverse of: è inclusa in stato tecnico
domain: Stato tecnico di entità culturale
range: Caratteristica tecnica
is native to: technical-characteristic
comment: Questa proprietà collega lo stato tecnico di un'entità culturale a una delle caratteristiche tecniche dell'entità relativamente a quello stato.
comment: This property connects a technical status, with respect to a specific entity (as a cultural entity) to one of the technical characteristics related to that status. @en
label: includes technical characteristic @en
version info: stabile
version info: stable @en

coinvolge fascia d'età
type: ObjectProperty
inverse of: è fascia d'età coinvolta in
domain: Modalità comunicativa
range: Fascia d'età
comment: Questa proprietà collega una modalità comunicativa (prossemica, cinesica) alla fascia d'età delle persone che attuano la comunicazione.
comment: This property relates a communication medium (proxemics, kinesic) to the age range of the participants to the communication. @en
label: involves age range @en
version info: stabile
version info: stable @en
iccd norm tag: ICCD Normativa BDI: CU/CUC/CUCE; CU/CUP/CUPE

è accessorio di
type: ObjectProperty
domain: Accessorio
range: CulturalEntity
comment: Questa è la proprietà inversa di "ha accessorio".
comment: This is the inverse property of "has accessory". @en
label: is accessory of @en
version info: stabile
version info: stable @en

è tipo di elemento apposto
type: ObjectProperty
sub property of: isTypeOf
domain: Tipo di elemento apposto
range: Elemento apposto su bene culturale
comment: Questa è la proprietà inversa di "ha tipo di elemento apposto".
comment: This is the inverse property of "has affixed element type". @en
label: is affixed element type of @en
version info: stabile
version info: stable @en

è fascia d'età coinvolta in
type: ObjectProperty
domain: Fascia d'età
range: Modalità comunicativa
comment: Questa è la proprietà inversa di "coinvolge fascia d'età".
comment: This is the inverse property of "involves age range". @en
label: is age range involved in @en
version info: stabile
version info: stable @en

è agente cui si riferisce
type: ObjectProperty
inverse of: si riferisce ad agente
domain: Agent
range: Elemento apposto su bene culturale
comment: Questa è la proprietà inversa a "si riferisce ad agente".
comment: This is the inverse property of "refers to agent". @en
label: is agent referred to by @en
version info: stabile
version info: stable @en

è caratteristica tecnica classificata da
type: ObjectProperty
sub property of: hasConcept
domain: Caratteristica tecnica
range: Concetto tecnico
is native to: technical-characteristic
comment: Questa proprietà collega una caratteristica tecnica di un'entità - come un bene culturale - a un concetto tecnico, che la classifica.
comment: This property connects an entity's techincal characteristic to a technical concept, which classifies that characteristic. @en
label: is technical characteristic classified by @en
version info: stabile
version info: stable @en

è modalità comunicativa
type: ObjectProperty
sub property of: isCulturalEntityCharacteristicOf
domain: Modalità comunicativa
range: CulturalEntity
comment: Questa è la proprietà inversa di "ha modalità comunicativa".
comment: This is the inverse property of "has communication medium". @en
label: is communication medium of @en
version info: stabile
version info: stable @en

è tipo di modalità comunicativa
type: ObjectProperty
sub property of: isTypeOf
domain: Tipo di modalità comunicativa
range: Modalità comunicativa
comment: Questa è la proprietà inversa di "ha tipo di modalità comunicativa".
comment: This is the inverse property of "has communication medium type". @en
label: is communication medium type of @en
version info: stabile
version info: stable @en

è stato di conservazione di
type: ObjectProperty
sub property of: isSituationOf
domain: Stato di Conservazione
range: CulturalEntity
comment: Questa proprietà collega uno stato di conservazione al bene culturale che si trova in quello stato.
comment: This property relates a conservation status of a cultural property to that cultural property. @en
label: is conservation status of @en
version info: stabile
version info: stable @en

è tipo di stato di conservazione
type: ObjectProperty
sub property of: isTypeOf
domain: Tipo di stato di conservazione
range: Stato di Conservazione
comment: Questa è la proprietà inversa di "ha tipo di stato di conservazione".
comment: This is the inverse property of "has conservation status type". @en
label: is conservation status type of @en
version info: stabile
version info: stable @en

è accessibilità di bene culturale
type: ObjectProperty
sub property of: isCulturalEntityCharacteristicOf
domain: Accessibilità del bene culturale
range: CulturalEntity
comment: Questa è la proprietà inversa di "ha accessibilità".
comment: This is the inverse property of "has cultural property accessibility". @en
label: is cultural property accessibility of @en
version info: stabile
version info: stable @en

è disponibilità materiale di bene culturale
type: ObjectProperty
sub property of: isCulturalEntityCharacteristicOf
domain: Disponibilità materiale del bene culturale
range: CulturalEntity
comment: Questa è la proprietà inversa di "ha disponibilità materiale".
comment: This is the inverse property of "has cultural property availability". @en
label: is cultural property availability of @en
version info: stabile
version info: stable @en

è definizione di bene culturale
type: ObjectProperty
domain: Definizione del bene culturale
range: Tipo di bene culturale
comment: Questa è la proprietà inversa di "ha definizione di bene culturale".
comment: This is the inverse property of "has cultural property definition". @en
label: is cultural property definition of @en
version info: stabile
version info: stable @en

sono specifiche del bene culturale
type: ObjectProperty
domain: Specifiche del bene culturale
range: Tipo di bene culturale
comment: Questa è la proprietà inversa di "ha specifiche del bene culturale".
comment: This is the inverse property of "has cultural property specification". @en
label: is cultural property specification @en
version info: stabile
version info: stable @en

è tipo di bene culturale
type: ObjectProperty
sub property of: isTypeOf
domain: CulturalEntity
range: Tipo di bene culturale
comment: Questa è la proprietà inversa di "ha tipo di bene culturale".
comment: This is the inverse property of "has cultural property type". @en
label: is cultural property type of @en
version info: stabile
version info: stable @en

è dedicatario di
type: ObjectProperty
domain: Agent
range: Dedica
comment: Questa è la proprietà inversa a "ha dedicatario".
comment: This is the inverse property of "has dedicatee". @en
label: is dedicatee of @en
version info: stabile
version info: stable @en

è denominazione nel tempo di
type: ObjectProperty
sub property of: isSituationOf
domain: Denominazione nel tempo
range: CulturalEntity
comment: Questa è la proprietà inversa di "ha designazione nel tempo".
comment: This is the inverse property of "has designation in time". @en
label: is designation in time of @en
version info: stabile
version info: stable @en

è tipo di denominazione
type: ObjectProperty
sub property of: isTypeOf
domain: Tipo di denominazione
range: Denominazione nel tempo
comment: Questa è la proprietà inversa di "ha tipo di denominazione".
comment: This is the inverse property of "has designation type". @en
label: is designation type of @en
version info: stabile
version info: stable @en

è corista di
type: ObjectProperty
sub property of: è caratteristica tecnica di
domain: Caratteristica tecnica
range: Thing
comment: Questa è la proprietà inversa di "ha corista".
comment: This is the inverse property of "has diapason". @en
label: is diapason of @en
version info: stabile
version info: stable @en

è elemento apposto su
type: ObjectProperty
domain: Elemento apposto su bene culturale
range: CulturalEntity
comment: Questa è la proprietà inversa a "ha elemento affisso".
comment: This is the inverse property of "has affixed element". @en
label: is element affixed on @en
version info: stabile
version info: stable @en

è estensione di
type: ObjectProperty
sub property of: è caratteristica tecnica di
domain: Caratteristica tecnica
range: Thing
comment: Questa è la proprietà inversa di "ha estensione".
comment: This is the inverse property of "has extension". @en
label: is extension of @en
version info: stabile
version info: stable @en

è formato di estensione/compressione del file di
type: ObjectProperty
sub property of: è caratteristica tecnica di
domain: Caratteristica tecnica
range: Thing
comment: Questa è la proprietà inversa a "ha formato di estensione/compressione del file"
comment: This is the inverse property of "has file format" @en
label: is file format of @en
version info: stabile
version info: stable @en

è filigrana di
type: ObjectProperty
sub property of: è caratteristica tecnica di
domain: Caratteristica tecnica
range: Thing
comment: Questa è la proprietà inversa di "ha filigrana".
comment: This is the inverse property of "has filigree". @en
label: is filigree of @en
version info: stabile
version info: stable @en

è tipo di caratteri di
type: ObjectProperty
domain: Tipo di caratteri
range: Thing
comment: Questa è la proprietà inversa a "ha tipo di caratteri".
comment: This is the inverse property of "has font style". @en
label: is font style of @en
version info: stabile
version info: stable @en

è scopo funzionale di
type: ObjectProperty
sub property of: isCharacteristicOf
domain: Scopo funzionale
range: Thing
comment: Questa è la proprietà inversa di "ha scopo funzionale".
comment: This is the inverse property of "has functional purpose". @en
label: is functional purpose of @en
version info: stabile
version info: stable @en

è analisi del vestimento
type: ObjectProperty
sub property of: è caratteristica tecnica di
domain: Caratteristica tecnica
range: Thing
comment: Questa è la proprietà inversa di "ha analisi del vestimento".
comment: This is the inverse property of "has garment analysis". @en
label: is garment analysis of @en
version info: stabile
version info: stable @en

è colore del vestimento
type: ObjectProperty
sub property of: è caratteristica tecnica di
domain: Caratteristica tecnica
range: Thing
comment: Questa è la proprietà inversa di "ha colore del vestimento".
comment: This is the inverse property of "has garment colour". @en
label: is garment colour of @en
version info: stabile
version info: stable @en

è apparato iconografico e decorativo di
type: ObjectProperty
domain: Apparato iconografico e decorativo
range: CulturalEntity
comment: Questa è la proprietà inversa di "ha apparato iconografico e decorativo".
comment: This is the inverse property of "has iconographic or decorative apparatus". @en
label: is iconographic or decorative apparatus of @en
version info: stabile
version info: stable @en

è tipo di apparato iconografico e decorativo
type: ObjectProperty
sub property of: isTypeOf
domain: Tipo di apparato iconografico e decorativo
range: Apparato iconografico e decorativo
comment: Questa è la proprietà inversa di "ha tipo di apparato iconografico e decorativo".
comment: This is the inverse property of "has iconographic or decorative apparatus type". @en
label: is iconographic or decorative apparatus type of @en
version info: stabile
version info: stable @en

è modalità esecutiva di
type: ObjectProperty
domain: Modalità esecutiva
range: Modalità comunicativa
comment: Questa è la proprietà inversa di "ha modalità esecutiva".
comment: This is the inverse property of "has implementation method". @en
label: is implementation method of @en
version info: stabile
version info: stable @en

è inclusa in stato tecnico
type: ObjectProperty
domain: Caratteristica tecnica
range: Stato tecnico di entità culturale
is native to: technical-characteristic
comment: Questa proprietà, inversa a "include caratteristica tecnica", collega una caratteristica tecnica specifica (es.: marmo) allo stato di un'entità culturale che ha quella caratteristica.
comment: This property relates a technical characteristic (e.g. marble) to the status of a cultural entity that includes that characteristic. @en
label: is included in technical status @en
version info: stabile
version info: stable @en

è leggibilità di
type: ObjectProperty
sub property of: isCharacteristicOf
domain: Leggibilità
range: Stato di Conservazione
comment: Questa è la proprietà inversa di "ha leggibilità".
comment: This is the inverse property of "has legibility". @en
label: is legibility of @en
version info: stabile
version info: stable @en

è localizzazione rappresentata da
type: ObjectProperty
domain: TimeIndexedTypedLocation
range: CulturalEntity
comment: Questa è la proprietà inversa di "ha localizzazione rappresentata".
comment: This is the inverse property of "has location subject". @en
label: is location subject of @en
version info: stabile
version info: stable @en

è memoria di massa di
type: ObjectProperty
sub property of: è caratteristica tecnica di
domain: Caratteristica tecnica
range: Thing
comment: Questa è la proprietà inversa di "ha memoria di massa".
comment: This is the inverse property of "has mass storage". @en
label: is mass storage of @en
version info: stabile
version info: stable @en

è materia di
type: ObjectProperty
sub property of: è materia e tecnica di
domain: Caratteristica tecnica
range: Thing
comment: Questa è la proprietà inversa di "ha materia e tecnica"
comment: This is the inverse property of "has material" @en
label: is material of @en
version info: stabile
version info: stable @en

è materia e tecnica di
type: ObjectProperty
sub property of: è caratteristica tecnica di
domain: Caratteristica tecnica
range: Thing
comment: Questa è la proprietà inversa di "ha materia e tecnica"
comment: This is the inverse property of "has material or technique" @en
label: is material or technique of @en
version info: stabile
version info: stable @en

è collezione di misure di
type: ObjectProperty
domain: Collezione di misure
range: Thing
comment: Questa è la proprietà inversa di "ha collezione di misure".
comment: This is the inverse property of "has measurement collection". @en
label: is measurement collection of @en
version info: stabile
version info: stable @en

è misura in collezione
type: ObjectProperty
domain: Misura
range: Collezione di misure
is native to: object-collection
comment: Questa proprietà, inversa a "ha misura", collega una misura di un oggetto all'insieme di misure osservate per l'oggetto.
comment: This property connects an object's measure to the observed measures' collection of that object. It is the inverse property of hasMeasurement. @en
label: is measurement in collection @en
version info: stabile
version info: stable @en
iccd norm tag: MT/MIS - Normativa VeAC: anche MT/MIM

è tipo di misura
type: ObjectProperty
sub property of: isTypeOf
domain: Tipo di Misura
range: Misura
comment: Questa è la proprietà inversa di "ha tipo di misura".
comment: This is the inverse property of "has measurement type". @en
label: is measurement type of @en
version info: stabile
version info: stable @en

è orientamento di
type: ObjectProperty
domain: Orientamento
range: Thing
comment: Questa è la proprietà inversa di "ha orientamento".
comment: This is the inverse property of "has orientation". @en
label: is orientation of @en
version info: stabile
version info: stable @en

è motivo decorativo di
type: ObjectProperty
domain: Motivo decorativo
range: Apparato iconografico e decorativo
comment: Questa è la proprietà inversa di "ha motivo decorativo".
comment: This is the inverse property of "has ornamental motif". @en
label: is ornamental motif of @en
version info: stabile
version info: stable @en

è colore della foto
type: ObjectProperty
sub property of: è caratteristica tecnica di
domain: Caratteristica tecnica
range: Thing
comment: Questa è la proprietà inversa a "ha colore della foto"
comment: This is the inverse property of "has photo colour" @en
label: is photo colour of @en
version info: stabile
version info: stable @en

è programma per foto di
type: ObjectProperty
sub property of: è caratteristica tecnica di
domain: Caratteristica tecnica
range: Thing
comment: Questa è la proprietà inversa di "ha programma per foto".
comment: This is the inverse property of "has photo program". @en
label: is photo program of @en
version info: stabile
version info: stable @en

è dimensione della foto
type: ObjectProperty
sub property of: è caratteristica tecnica di
domain: Caratteristica tecnica
range: Thing
comment: Questa è la proprietà inversa a "ha dimensioni della foto"
comment: This is the inverse property of "has photo size" @en
label: is photo size of @en
version info: stabile
version info: stable @en

è dimensione in pixel di
type: ObjectProperty
sub property of: è caratteristica tecnica di
domain: Caratteristica tecnica
range: Thing
comment: Questa è la proprietà inversa di "ha dimensioni in pixel"
comment: This is the inverse property of "has pixel dimension" @en
label: is pixel dimension of @en
version info: stabile
version info: stable @en

è livello di qualità di
type: ObjectProperty
sub property of: è caratteristica tecnica di
domain: Caratteristica tecnica
range: Thing
comment: Questa è la proprietà inversa di "ha livello di qualità"
comment: This is the inverse property of "has quality level" @en
label: is quality level of @en
version info: stabile
version info: stable @en

è risoluzione di
type: ObjectProperty
sub property of: è caratteristica tecnica di
domain: Caratteristica tecnica
range: Thing
comment: Questa è la proprietà inversa a "ha risoluzione"
comment: This is the inverse property of "has resolution" @en
label: is resolution of @en
version info: stabile
version info: stable @en

è campione prelevato da
type: ObjectProperty
domain: Campione prelevato
range: CulturalEntity
comment: Questa è la proprietà inversa di "ha campione prelevato".
comment: This is the inverse property of "has sample collected". @en
label: is sample collected from @en
version info: stabile
version info: stable @en

è tipo di campione prelevato
type: ObjectProperty
sub property of: isTypeOf
domain: Tipo di campione prelevato
range: Campione prelevato
comment: Questa è la proprietà inversa di "ha tipo di campione prelevato".
comment: This is the inverse property of "has sample collected type". @en
label: is sample collected type of @en
version info: stabile
version info: stable @en

è forma di
type: ObjectProperty
sub property of: è caratteristica tecnica di
domain: Caratteristica tecnica
range: Thing
comment: Questa è la proprietà inversa di "ha forma"
comment: This is the inverse property of "has shape" @en
label: is shape of @en
version info: stabile
version info: stable @en

è metodo di memorizzazione e profondità del colore di
type: ObjectProperty
sub property of: è caratteristica tecnica di
domain: Caratteristica tecnica
range: Thing
comment: Questa è la proprietà inversa di "ha metodo di memorizzazione e profondità del colore".
comment: This is the inverse property of "has storage method or colour depth". @en
label: is storage method or colour depth of @en
version info: stabile
version info: stable @en

è supporto di
type: ObjectProperty
domain: Supporto
range: Elemento apposto su bene culturale
comment: Questa proprietà, inversa di "ha supporto", collega un supporto (es.: "etichetta di carta") all'elemento (timbro, emblema, iscrizione, marchio) che vi viene rappresentato.
comment: This property connects a support (e.g. "paper label") to an element (stamp, embelem, inscription, mark) which has been represented on it. It is the inverse property of hasSupport. @en
label: is support of @en
version info: stabile
version info: stable @en
iccd norm tag: ICCD Normativa Trasversale 4.00: DA/ISE/ISES

è qualificazione di carattestica tecnica
type: ObjectProperty
comment: Questa proprietà collega una qualificazione a una caratteristica tecnica
comment: This property relates an qualification to a technical characteristic @en
label: is technical caracteristic qualification of @en
version info: instabile
version info: unstable @en

è caratteristica tecnica di
type: ObjectProperty
sub property of: isCharacteristicOf
domain: Caratteristica tecnica
range: Thing
comment: Questa proprietà collega una caratteristica tecnica all'entità che ha quella caratteristica.
comment: This property relates a technical characteristic to an entity. @en
label: is technical characteristic of @en
version info: stabile
version info: stable @en

è concetto tecnico usato in
type: ObjectProperty
inverse of: usa concetto tecnico
domain: Concetto tecnico
range: Descrizione tecnica di entità culturale
comment: Questa proprietà collega un concetto tecnico (es.: materia) usato nella descrizione tecnica di un bene culturale.
comment: This property relates a technical concept (e.g. material) used in the technical description of a cultural property. @en
label: is technical concept used in @en
version info: stabile
version info: stable @en

è descrizione di entità culturale soddisfatta da
type: ObjectProperty
inverse of: soddisfa descrizione tecnica
domain: Descrizione tecnica di entità culturale
range: Stato tecnico di entità culturale
comment: This property relates a technical description of a cultural entity to a situation that satisfies that description. @en
label: is cultural entity description satisfied by @en
version info: stabile
version info: stable @en

è stato tecnico di
type: ObjectProperty
sub property of: isSituationOf
domain: Stato tecnico di entità culturale
range: Thing
comment: Questa proprietà collega uno stato tecnico di un'entità culturale a un'entità culturale. Lo stato è valido fino a determinato momento ed è rappresentato dalle caratteristiche tecniche che il bene culturale ha in quel momento.
comment: This property connects a technical status to a cultural entity. This status is valid until a specific moment and is represented by the technical characteristics that a cultural entity has in that moment. @en
label: is technical status of @en
version info: stabile
version info: stable @en

è stato tecnico di entità culturale valido fino a
type: ObjectProperty
inverse of: è intervallo di tempo valido per
domain: Stato tecnico di entità culturale
range: TimeInterval
comment: Questa proprietà collega uno stato tecnico di un'entità culturale all'intervallo temporale entro il quale è valido, relativamente al momento in cui quelle caratteristiche sono state rilevate.
comment: This property relates a cultural entity technical status to the time interval until which that status is valid, with regard to the moment in which the characteristics are observed. @en
label: is cultural entity technical status valid at @en
version info: stabile
version info: stable @en

è tecnica di
type: ObjectProperty
sub property of: è materia e tecnica di
domain: Caratteristica tecnica
range: Thing
comment: Questa è la proprietà inversa di "ha materia e tecnica"
comment: This is the inverse property of "has technique" @en
label: is technique of @en
version info: stabile
version info: stable @en

è temperamento di
type: ObjectProperty
sub property of: è caratteristica tecnica di
domain: Caratteristica tecnica
range: Thing
comment: Questa è la proprietà inversa di "ha temperamento".
comment: This is the inverse property of "has temperament". @en
label: is temperament of @en
version info: stabile
version info: stable @en

è intervallo di tempo valido per
type: ObjectProperty
domain: TimeInterval
range: Stato tecnico di entità culturale
comment: Questa proprietà collega un intervallo temporale entro il quale è valido uno stato tecnico di un'entità culturale allo stato tecnico stesso, relativamente al momento in cui quelle caratteristiche sono state rilevate.
comment: This property relates the time interval, at which a cultural entity technical status is valid, to that technical status, with regard to the moment in which the characteristics are observed. @en
label: is time interval valid for @en
version info: stabile
version info: stable @en

è accordatura di
type: ObjectProperty
sub property of: è caratteristica tecnica di
domain: Caratteristica tecnica
range: Thing
comment: Questa è la proprietà inversa di "ha accordatura".
comment: This is the inverse property of "has tuning". @en
label: is tuning of @en
version info: stabile
version info: stable @en

è unità di misura di
type: ObjectProperty
range: Misura
comment: Questa classe collega l'unità di misura ad una misura
comment: This property relates a unit of measurement to a measurement @en
label: is unit of measurement of @en
version info: instabile
version info: unstable @en

è valore di
type: ObjectProperty
domain: Value
range: Misura
comment: Questa è la proprietà inversa di "ha valore".
comment: This is the inverse property of "has value". @en
label: is value of @en
version info: stabile
version info: stable @en

è lunghezza vibrante di
type: ObjectProperty
sub property of: è caratteristica tecnica di
domain: Caratteristica tecnica
range: Thing
comment: Questa è la proprietà inversa di "ha lunghezza vibrante".
comment: This is the inverse property of "has vibrating lenght". @en
label: is vibrating lenght of @en
version info: stabile
version info: stable @en

è misura di ingombro di
type: ObjectProperty
sub property of: è misura in collezione
domain: Misura
range: Collezione di misure
comment: Questa è la proprietà inversa di "ha misura di ingombro".
comment: This is the inverse property of "has volumetric dimensions measurement". @en
label: is volumetric dimensions measurement in @en
version info: stabile
version info: stable @en

è sistema di scrittura di
type: ObjectProperty
domain: Sistema di scrittura
range: Elemento apposto su bene culturale
comment: Questa è la proprietà inversa di "ha sistema di scrittura".
comment: This is the inverse property of "has writing system". @en
label: is writing system of @en
version info: stabile
version info: stable @en

si riferisce ad agente
type: ObjectProperty
domain: Elemento apposto su bene culturale
range: Agent
comment: Questa proprietà collega un uno stemma, un emblema, un timbro, etc., presente su un bene culturale, all'agente (la famiglia, la fabbrica, la cava, l'argentiere, etc.) a cui si riferisce l'elemento.
comment: This property connects a crest, emblem, postmark etc., located on a cultural entity to the agent (e.g. family, factory, cave, silversmith) to which it refers. @en
label: refers to agent @en
version info: stabile
version info: stable @en
iccd norm tag: ICCD Normativa Trasversale 4.00: DA/ISE/ISES - Normative di versioni precedenti: DA/STM/STMI

soddisfa descrizione tecnica
type: ObjectProperty
domain: Stato tecnico di entità culturale
range: Descrizione tecnica di entità culturale
comment: This property relates a technical status (intended as a situaiton) of a cultural entity to the technical description satisfied by that situation. @en
label: satisfies technical description @en
version info: stabile
version info: stable @en

usa concetto tecnico
type: ObjectProperty
domain: Descrizione tecnica di entità culturale
range: Concetto tecnico
comment: Questa proprietà collega una descrizione tecnica di un bene culturale a uno dei concetti usati in quella descrizione.
comment: This property relates a technical description of a cultural property to one of the concepts used in that description. @en
label: uses technical concept @en
version info: stabile
version info: stable @en

morfologia di reperto antropologico
type: DatatypeProperty
type: FunctionalProperty
domain: CulturalEntity
range: Literal
comment: Questa proprietà rappresenta la morfologia di un reperto antropologico (es.: morfologia naturale; morfologia alterata intra-vitam per cause naturali e/o per intervento antropico; morfologia/ struttura alterata post-mortem per cause naturali).
comment: This property represents the morphology of an anthropological material. @en
label: anthropological material morphology @en
version info: stabile
version info: stable @en
iccd norm tag: ICCD Normativa AT 3.01: OG/OGT/OGTM

trascrizione del corpo
type: DatatypeProperty
sub property of: trascrizione
range: Literal
comment: Questa proprietà rappresenta il testo scritto nel corpo dell'etichetta
comment: This property represents the text written in the body of the label @en
label: body transcript @en
version info: instabile
version info: unstable @en
iccd norm tag: ICCD Normativa BNB: SB/SBE/SBET

data di creazione
type: DatatypeProperty
type: FunctionalProperty
domain: Accessorio
range: Literal
comment: Questa proprietà rappresenta la data di costruzione di un accessorio di uno strumento musicale.
comment: This property represents the date of construction of a musical instrument's accessory. @en
label: creation date @en
version info: stabile
version info: stable @en
iccd norm tag: ICCD Normativa SM 4.00: AS/ASS/ASSD

simboli grafici
type: DatatypeProperty
range: Literal
comment: Questa proprietà rappresenta i simboli grafici scritti nell'etichetta
comment: This property represents graphic symbols written in the label @en
label: graphic symbols @en
version info: instabile
version info: unstable @en
iccd norm tag: ICCD Normativa BNB: SB/SBE/SBEG

autografa
type: DatatypeProperty
range: boolean
label: handwriting @en
version info: instabile
version info: unstable @en
iccd norm tag: ICCD Normativa BNB: SB/SBE/SBEA
iccd norm tag: Questa proprietà indica se l'etichetta è autografa o meno
iccd norm tag: This property indicates if the label is handwritten or not @en

trascrizione dell'intestazione
type: DatatypeProperty
sub property of: trascrizione
range: Literal
comment: Questa proprietà rappresenta il testo scritto nell'intestazione dell'etichetta
comment: This property represents the heading of the label @en
label: heading transcript @en
version info: instabile
version info: unstable @en
iccd norm tag: ICCD Normativa BNB: SB/SBE/SBEI

traduzione italiana
type: DatatypeProperty
domain: Elemento apposto su bene culturale
range: Literal
comment: Questa proprietà rappresenta la traduzione italiana della trascrizione di un testo contenuto in un'iscrizione, un'emblema, etc.
comment: This property represents the italian translation of a text transcription contained in an inscription, emblem etc. @en
label: italian translation @en
version info: stabile
version info: stable @en
iccd norm tag: ICCD Normativa Trasversale 4.00: DA/ISE/ISEB

numero di partecipanti infantili
type: DatatypeProperty
type: FunctionalProperty
domain: Modalità comunicativa
range: integer
comment: Questa proprietà rappresenta il numero dei bambini che attuano una comunicazione (verbale, musicale vocale).
comment: This property represents the number of the child participants to a communication (verbal, singing, kinesic). @en
label: number of child participants @en
version info: stabile
version info: stable @en
iccd norm tag: ICCD Normativa BDI: CU/CUV/CUVI; CU/CUM/CUMI

numero di buste
type: DatatypeProperty
domain: CulturalEntity
range: positiveInteger
comment: Questa proprietà rappresenta il numero di buste che contengono il campione o sue parti se conservate assieme al campione, e non in collezioni ancillari
comment: This property represents the numebr of envelopes, containing the specimen or its parts, if they are preserved with the specimen itself and not in ancillar collections @en
label: numbers of envelopes @en
version info: instabile
version info: unstable @en
iccd norm tag: ICCD Normativa BNB: SB/CBP/CBPB

numero di partecipanti femminili
type: DatatypeProperty
type: FunctionalProperty
domain: Modalità comunicativa
range: integer
comment: Questa proprietà rappresenta il numero delle persone di sesso femminile che attuano una comunicazione (verbale, musicale vocale, cinesica).
comment: This property represents the number of the male participants to a communication (verbal, singing, kinesic). @en
label: number of female participants @en
version info: stabile
version info: stable @en
iccd norm tag: ICCD Normativa BDI: CU/CUV/CUVF; CU/CUM/CUMF; CU/CUC/CUCF

numero di etichette
type: DatatypeProperty
domain: CulturalEntity
range: positiveInteger
comment: Questa proprietà rappresenta etichette presenti assieme al campione
comment: This property represents the number of labels with the specimen @en
label: number of labels @en
version info: instabile
version info: unstable @en
iccd norm tag: ICCD Normativa BNB: SB/CBP/CBPE

numero di partecipanti maschili
type: DatatypeProperty
type: FunctionalProperty
domain: Modalità comunicativa
range: integer
comment: Questa proprietà rappresenta il numero delle persone di sesso maschile che attuano una comunicazione (verbale, musicale vocale, cinesica)
comment: This property represents the number of the male participants to a communication (verbal, singing, kinesic). @en
label: number of male participants @en
version info: stabile
version info: stable @en
iccd norm tag: ICCD Normativa BDI: CU/CUV/CUVM; CU/CUM/CUMM; CU/CUC/CUCM

occorrenze
type: DatatypeProperty
type: FunctionalProperty
domain: Elemento apposto su bene culturale
range: Literal
comment: Questa proprietà rappresenta le occorrenze di un emblema, marchio, iscrizione, etc., su uno stesso bene culturale, cioè quante volte l'elemento descritto compare sul bene.
comment: This property represents the occurrences of an affixed element on a cultular entity, that is how many times the outlined element appears on the cultual entity. @en
label: occurrences @en
version info: stabile
version info: stable @en
iccd norm tag: ICCD Normativa Trasversale 4.00: DA/ISE/ISEQ - Normative di versioni precedenti: DA/STM/STMU

posizione rispetto al bene culturale complesso
type: DatatypeProperty
type: FunctionalProperty
domain: CulturalEntity
range: Literal
comment: Questa proprietà rappresenta la posizione di un bene rispetto al bene complesso di cui è parte componente.
comment: This property represents a cultural entity's position with respect to a complex entity to which it belongs. @en
label: position in complex cultural property @en
version info: stabile
version info: stable @en
iccd norm tag: ICCD Normative OA e RA: OG/OGT/OGTP

posizione su bene culturale
type: DatatypeProperty
domain: Thing
range: Literal
comment: Questa proprietà rappresenta la posizione di un oggetto (es.: elementi come stemmi, emblemi, timbri, etc., oppure i soggetti rappresentati) rispetto all'intero bene o a una sua specifica parte.
comment: This property represents a cultural entity's postion (e.g. elements like crests, emblems, stamps or the depicted subjects), with respect to the whole entity or to its specific part. @en
label: position on cultural property @en
version info: stabile
version info: stable @en
iccd norm tag: ICCD Normativa Trasversale 4.00: DA/ISE/ISEP - Normative di versioni precedenti: DA/STM/STMP; DA/ISR/ISRP - Normativa A: LI/LSI/LSIU - Normativa PST: OG/SGT/SGTP - ICCD Normative MA, CA, SI, SAS: MC/CMN/CMNP

proposte di interventi
type: DatatypeProperty
domain: CulturalEntity
range: Literal
comment: Questa proprietà rappresenta eventuali proposte per interventi conservativi, dopo aver valutato le condizioni del bene al momento della sua catalogazione.
comment: This property represents potential proposals for conservative interventions after evaluating the cultual entity's conditions at time of its cataloguing. @en
label: proposed intervention @en
version info: stabile
version info: stable @en
iccd norm tag: CO/STP

identificativo del campione prelevato
type: DatatypeProperty
sub property of: identifier
type: FunctionalProperty
domain: Campione prelevato
range: Literal
comment: Questa proprietà rappresenta il numero che identifica il campione.
comment: This property represents the seample collected identifier. @en
label: sample collected identifier @en
version info: stabile
version info: stable @en
iccd norm tag: ICCD Normativa MA, CA, SI, SAS: MC/CMN

modalità di conservazione
type: DatatypeProperty
domain: CulturalEntity
range: Literal
comment: Questa proprietà rappresenta informazioni sulle condizioni ambientali e microclimatiche in cui si trova il bene al momento della catalogazione ed eventuali indicazioni per una sua corretta conservazione.
comment: This property represents informations about the storage conditions of a cultural property. @en
label: storage conditions @en
version info: stabile
version info: stable @en
iccd norm tag: CO/STD

trascrizione
type: DatatypeProperty
type: FunctionalProperty
domain: Thing
range: Literal
comment: Questa proprietà collega un'iscrizione, un emblema, etc., alla trascrizione del testo, utilizzando scioglimenti e integrazioni scientificamente accettati.
comment: This property connects an inscription, emblem etc., to the text's transcription, using scientifically accepted integrations. @en
label: transcript @en
version info: stabile
version info: stable @en
iccd norm tag: ICCD Normativa Trasversale 4.00: DA/ISE/ISEI - Normative di versioni precedenti: DA/ISR/ISRI

validità
type: DatatypeProperty
domain: Collezione di misure
range: Literal
comment: Questa proprietà rappresenta la validità, intesa come livello di accuratezza, di una misura osservata per un oggetto.
comment: This property represents the validity, intended as accurancy level, of an observed measure for an object. @en
label: validity @en
version info: stabile
version info: stable @en

Accessorio
type: Class
subclass of: Object
subclass of: Restriction
  on property: è accessorio di
  some values from: CulturalEntity
subclass of: Restriction
  on property: data di creazione
  all values from: Literal
comment: Questa classe rappresenta un accessorio di un bene musicale, ovvero un oggetto collegabile al bene musicale, sia nel caso in cui sia funzionale alla produzione del suono, sia nel caso in cui sia di supporto alla produzione del suono o alla conservazione o alla prassi musicale del bene.
comment: This class represents an accessory of a musical property, both if it is functional to the sound production, or if it is the sound's production or conservation medium. @en
label: Accessory @en
version info: stabile
version info: stable @en
iccd norm tag: ICCD Normativa SM 4.00: AS/ASS/ASST

Elemento apposto su bene culturale
type: Class
subclass of: Object
subclass of: Restriction
  on property: è elemento apposto su
  some values from: CulturalEntity
subclass of: Restriction
  on property: hasAuthor
  all values from: Agent
subclass of: Restriction
  on property: ha tipo di caratteri
  all values from: Tipo di caratteri
subclass of: Restriction
  on property: ha scopo funzionale
  all values from: Scopo funzionale
subclass of: Restriction
  on property: ha supporto
  all values from: Supporto
subclass of: Restriction
  on property: ha stato tecnico
  all values from: Stato tecnico di entità culturale
subclass of: Restriction
  on property: ha sistema di scrittura
  all values from: Sistema di scrittura
subclass of: Restriction
  on property: description
  all values from: Literal
subclass of: Restriction
  on property: traduzione italiana
  all values from: Literal
subclass of: Restriction
  on property: trascrizione
  all values from: Literal
description: An example of usage of one of the subclasses of the class 'Affixed element' is the following: resource:Inscription/1200865151-inscription-1 a dd:Inscription ; rdfs:label "Inscription 1 of cultural property 1200865151"@en ; dd:hasFontStyle resource:FontStyle/lettere-capitali ; dd:hasTechnicalDetailOccurrence resource:TechnicalDetailOccurrence/1200865151-inscription-1-material-technique-1 ; dd:positionOnCulturalProperty "in the middle" ; dd:transcript "PAVLVS VENETVS PAPA SECVNDVS SVIS IMPENSIS FIERI FECIT ANNO CRISTI MCCCLXVII" ; language:hasLanguage resource:Language/latino . @en
description: Un esempio d'uso di una delle sottoclassi della classe "Elemento apposto su bene culturale" è il seguente: resource:Inscription/1200865151-inscription-1 a dd:Inscription ; rdfs:label "Iscrizione 1 del bene culturale 1200865151"@en ; dd:hasFontStyle resource:FontStyle/lettere-capitali ; dd:hasTechnicalDetailOccurrence resource:TechnicalDetailOccurrence/1200865151-inscription-1-material-technique-1 ; dd:positionOnCulturalProperty "al centro" ; dd:transcript "PAVLVS VENETVS PAPA SECVNDVS SVIS IMPENSIS FIERI FECIT ANNO CRISTI MCCCLXVII" ; language:hasLanguage resource:Language/latino .
comment: Questa classe rappresenta un elemento (stemma, marchio, timbro, emblema, logo, iscrizione, etc.) apposto su un bene culturale.
comment: This class represents an element (i.e. crest, trademark, postmark, inscription) which is affixed on a cultural property. @en
label: Element affixed on cultural property @en
version info: stabile
version info: stable @en
iccd norm tag: ICCD Normativa Trasversale 4.00: DA/ISE - ICCD versioni precedenti alla 4.00: DA/ISR; DA/STM - ICCD Normativa A: LI/LSI

Tipo di elemento apposto
type: Class
subclass of: Type
subclass of: Restriction
  on property: è tipo di elemento apposto
  some values from: Elemento apposto su bene culturale
comment: Questa classe rappresenta il tipo (es.: gentilizio, civile, religioso, etc.) di un'iscrizione, un emblema, un timbro, uno stemma, etc.
comment: This class represents the type (i.e. civil, religious) of an inscription, emblem, postmark, crest, etc. @en
label: Affixed element type @en
version info: stabile
version info: stable @en
iccd norm tag: ICCD Normativa Trasversale 4.00: DA/ISE/ISEE - Normative di versioni precedenti: DA/STM/STMQ

Fascia d'età
type: Class
subclass of: Characteristic
subclass of: Restriction
  on property: è fascia d'età coinvolta in
  some values from: Modalità comunicativa
comment: Questa classe rappresenta la fascia d'età (bambino, ragazzo, adulto anziano) di una persona.
comment: This class represents the age range (child, teenager, adult, old person) of a person. @en
label: Age range @en
version info: stabile
version info: stable @en
iccd norm tag: ICCD Normativa BDI: CU/CUC/CUCE; CU/CUP/CUPE

Marchio
type: Class
subclass of: Elemento apposto su bene culturale
comment: Questa classe rappresenta un marchio, ovvero un segno, figura, simbolo impresso o applicato su qualcosa a scopo di distinzione e riconoscimento.
comment: This class represents a brand, that is a sign, an image, a symbol affixed on an object for identification. @en
label: Brand @en
version info: stabile
version info: stable @en
iccd norm tag: ICCD Normativa Trasversale 4.00: se DA/ISE/ISED = 'marchio' - ICCD versioni precedenti: DA/STM/STMC = 'marchio' - ICCD Normativa A: LI/LSI/LSIG = 'marchio'

Stemma
type: Class
subclass of: Elemento apposto su bene culturale
comment: Questa classe rappresenta uno stemma, ovvero un insieme di figure e simboli che, in araldica, vengono rappresentati secondo determinate regole per contrassegnare persone o enti.
label: Coat of arms @en
version info: stabile
version info: stable @en
iccd norm tag: ICCD Normativa Trasversale 4.00: se DA/ISE/ISED = 'stemma' - ICCD versioni precedenti: DA/STM/STMC = 'stemma' - ICCD Normativa A: LI/LSI/LSIG = 'stemma'

Raffigurazione su moneta
type: Class
subclass of: Elemento apposto su bene culturale
disjoint with: Legenda della moneta
comment: Questa classe rappresenta la raffigurazione presente sul dritto o sul rovescio di un bene numismatico, intesa come l'insieme degli elementi grafici, che, uniti a una legenda (lettere e parole), fa parte dell'impronta della moneta.
comment: This class represents the design on the reverse or the obverse of a numismatic property, as the graphical part of what is represented on a side of a coin, together with the legend (lettering and wording). @en
label: Coin design @en
version info: stabile
version info: stable @en
iccd norm tag: ICCD Normativa NU 4.00: DA/DES/DESA; DA/DES/DESM

Legenda della moneta
type: Class
subclass of: Iscrizione
comment: Questa classe rappresenta l'insieme di lettere e parole presenti sul dritto o sul rovescio di un bene numismatico, che, unito alla raffigurazione, fa parte dell'impronta della moneta.
comment: This class represents the lettering and wording on the reverse or the obverse of a numismatic property. @en
label: Coin legend @en
version info: stabile
version info: stable @en
iccd norm tag: ICCD Normativa NU 4.00: DA/DES/DELS; DA/DES/DESN; DA/DES/DESF; DA/DES/DESG; DA/DES/DESR; DA/DES/DEST.

Modalità comunicativa
type: Class
subclass of: CulturalEntityCharacteristic
subclass of: Restriction
  on property: ha tipo di modalità comunicativa
  some values from: Tipo di modalità comunicativa
subclass of: Restriction
  on property: è modalità comunicativa
  some values from: CulturalEntity
subclass of: Restriction
  on property: ha modalità esecutiva
  all values from: Modalità esecutiva
subclass of: Restriction
  on property: coinvolge fascia d'età
  all values from: Fascia d'età
subclass of: Restriction
  on property: numero di partecipanti infantili
  all values from: integer
subclass of: Restriction
  on property: numero di partecipanti femminili
  all values from: integer
subclass of: Restriction
  on property: numero di partecipanti maschili
  all values from: integer
comment: Questa classe rappresenta la modalità comunicativa di un oggetto, definita dal tipo di modalità (es.: verbale, scritta, strumentale), la modalità esecutiva, il numero di voci e strumenti coinvolti, etc.
comment: This class represents the communication medium of an object, defined by the communication medium type (e.g.: verbal, written, instrumental), the implementation method, the number of voices or instruments involved, etc. @en
label: Communication medium @en
version info: stabile
version info: stable @en
iccd norm tag: ICCD Normativa BDI: CU

Tipo di modalità comunicativa
type: Class
subclass of: Type
subclass of: Restriction
  on property: è tipo di modalità comunicativa
  some values from: Modalità comunicativa
comment: Questa classe rappresenta il tipo di modalità comunicativa.
comment: This class represents the type of communication medium. @en
label: Communication medium type @en
version info: stabile
version info: stable @en
iccd norm tag: ICCD Normativa BDI: CU

Stato di Conservazione
type: Class
subclass of: Situation
subclass of: Restriction
  on property: è stato di conservazione di
  some values from: CulturalEntity
subclass of: Restriction
  on property: ha tipo di stato di conservazione
  all values from: Tipo di stato di conservazione
subclass of: Restriction
  on property: ha leggibilità
  all values from: Leggibilità
description: An example of usage of the class 'Conservation status' is the following: resource:ConservationStatus/0900750201-conservation-status-1 a dd:ConservationStatus ; rdfs:label "Conservation status 1 of cultural property: 0900750201"@en ; core:specifications "Stains at the lining, along the neckline." ; dd:hasConservationStatusType dd:GoodConservationStatus ; tiapit:time "2014" . @en
description: Un esempio d'uso della classe "Stato di conservazione" è il seguente: resource:ConservationStatus/0900750201-conservation-status-1 a a-dd:ConservationStatus ; rdfs:label "Stato di conservazione 1 del bene: 0900750201"@it ; core:specifications "Macchie in corrispondenza della fodera, lungo lo scollo." ; a-dd:hasConservationStatusType a-dd:GoodConservationStatus ; tiapit:time "2014" .
comment: Questa classe rappresenta lo stato di conservazione di un bene culturale.
comment: This class represents the conservation status of the cultural property. @en
label: Conservation Status @en
version info: stabile
version info: stable @en
iccd norm tag: CO/STC

Tipo di stato di conservazione
type: Class
subclass of: Type
subclass of: Restriction
  on property: è tipo di stato di conservazione
  some values from: Stato di Conservazione
label: Conservation Status Type @en
version info: stabile
version info: stable @en
iccd norm tag: CO/STC/STCC

Contromarca
type: Class
subclass of: Elemento apposto su bene culturale
subclass of: Restriction
  on property: hasCoinIssuance
  all values from: CoinIssuance
comment: Questa classe rappresenta una contromarca, ovvero una lettera o un altro segno punzonato su una moneta. Una contromarca viene apposta tramite un apposito punzone. La maggior parte delle monete vengono contromarcate per cambiarne il valore in seguito a una riforma monetaria. La contromarca è quindi un segno apposto dall'autorità emittente nel dritto o nel rovescio della moneta in epoca posteriore alla sua emissione, per aumentarne o diminuirne il valore e, in caso di necessità, per rimettere in circolazione monete già ritirate.
comment: This class represent a counterstamp (or countermark), that is a partial or complete over-stamping of a coin, generally affixed in order to change its value or issuing authority. @en
label: Counterstamp @en
version info: stabile
version info: stable @en
iccd norm tag: ICCD Normativa NU 4.00: DA/CON

Descrizione tecnica di entità culturale
type: Class
subclass of: Description
subclass of: Restriction
  on property: è descrizione di entità culturale soddisfatta da
  all values from: Stato tecnico di entità culturale
subclass of: Restriction
  on property: usa concetto tecnico
  all values from: Concetto tecnico
comment: Questa classe rappresenta la descrizione tecnica di un'entità culturale, la quale utilizza tutti i concetti tecnici che possono classificare caratteristiche tecniche possedute da un'entità culturale. Questa classe è un tipo particolare di Description, la classe degli oggetti costruiti socialmente (testi, valori, categorie, relazioni, contesti), usati per descrivere qualcos'altro in modo strutturato.
comment: This class represents the technical description of a cultural entity, which uses all the technical concepts classifying the technical characteristics that a cultural entity can have. This class is a particular type of the class Description, which is the class for socially constructed objects (i.e. texts, values, categories, relations, contexts) used to describe other objects in a structured manner. @en
label: Cultural entity technical description @en
version info: stabile
version info: stable @en

Stato tecnico di entità culturale
type: Class
subclass of: Situation
subclass of: Restriction
  on property: include caratteristica tecnica
  some values from: Caratteristica tecnica
subclass of: Restriction
  on property: è stato tecnico di
  some values from: CulturalEntity
is native to: technical-characteristic
description: An example of usage of the class 'Cultural entity technical status' is the following: resource:CulturalEntityTechnicalStatus/0900281817-4 a a-dd:CulturalEntityTechnicalStatus ; rdfs:label "Technical status of cultural property 0900281817-4"@en ; a-dd:includesTechnicalCharacteristic resource:TechnicalCharacteristic/centinato, resource:TechnicalCharacteristic/stone-sculpture . resource:TechnicalCharacteristic/stone-sculpture a a-dd:TechnicalCharacteristic ; rdfs:label "stone/ sculpture" ; a-dd:isClassifiedBy a-dd:MaterialOrTechnique . @en
description: Un esempio d'uso della classe "Stato tecnico di entità culturale" è il seguente: resource:CulturalEntityTechnicalStatus/0900281817-4 a a-dd:CulturalEntityTechnicalStatus ; rdfs:label "Stato tecnico del bene culturale 0900281817-4"@it ; a-dd:includesTechnicalCharacteristic resource:TechnicalCharacteristic/centinato, resource:TechnicalCharacteristic/pietra-scultura . resource:TechnicalCharacteristic/pietra-scultura a a-dd:TechnicalCharacteristic ; rdfs:label "pietra/ scultura" ; a-dd:isClassifiedBy a-dd:MaterialOrTechnique .
comment: Questa classe rappresenta lo stato tecnico di un'entità culturale, cioè una situazione in cui un'entità culturale ha associate una serie di caratteristiche tecniche. Lo stato di un'entità ha associata una validità temporale, relativa al momento in cui quelle caratteristiche sono state rilevate. Per esempio, una occorrenza di un dettaglio tecnico è: "bene culturale X realizzato con la materia terracotta e di forma cilindrica".
comment: This class represents the technical status of a cultural entity, that is a situation in which the cultural entity is associated to technical characteristics. The technical status has a temporal validity, related to the moment when the characteristics were observed. For instance, a cultural property techncal status is: "the cultural property X realized with pottery material and cylindrical in shape". @en
label: Technical status of cultural entity @en
version info: stabile
version info: stable @en
iccd norm tag: ICCD Normativa Trasversale 4.00: MT/MTC/MTCM; MT/MTC/MTCT - Normativa OA, D, F, S, MI: MT/FRM - Normativa OA, D, F, S: MT/FIL - Normativa VeAC: MT/MTC/MTCC; MT/MTC/MTCF - Normativa F: MT/FVC/FVCC; MT/FVC/FVCF; MT/FVC/FVCP; MT/FVC/FVCU; MT/FVC/FVCM; MT/FVM;

Accessibilità del bene culturale
type: Class
subclass of: CulturalEntityCharacteristic
subclass of: Restriction
  on property: è accessibilità di bene culturale
  some values from: CulturalEntity
comment: Questa classe rappresenta l'accessibilità di un bene culturale, ovvero la possibilità di accedere al bene, in tutto o in parte, per esempio per effettuare un esame diretto finalizzato alla catalogazione (es.: un bene immobile posto in un luogo recintato non accessibile, un bene mobile che non si può osservare da vicino perché posto troppo in alto su una parete; un bene totalmente accessibile, etc.).
comment: This class represents the cultural property accessibility, that is the possibility to reach or enter that cultural property, for example for cataloguing activities (e.g.: an immovable cultural property located in a walled area, a movable cultural property located on the top shelf, a totally accessible cultural property, etc.) @en
label: Cultural property accessibility @en
version info: stabile
version info: stable @en
iccd norm tag: ICCD Normativa Trasversale 4.00: LC/ACB

Disponibilità materiale del bene culturale
type: Class
subclass of: CulturalEntityCharacteristic
subclass of: Restriction
  on property: è disponibilità materiale di bene culturale
  some values from: CulturalEntity
comment: Questa classe rappresenta la disponibilità materiale di un bene culturale, ovvero se il bene è materialmente disponibile, per esempio per attività di catalogazione, o se non è disponibile (es.: furto, distruzione)
comment: This class represents the availability of a cultural property, wheter the cultural property is available or not (e.g.: theft, destruction) for example for cataloguing activities. @en
label: Cultural Property Availability @en
version info: stabile
version info: stable @en
iccd norm tag: ICCD Normativa Trasversale 4.00: OG/OGR

Definizione del bene culturale
type: Class
subclass of: Description
subclass of: Restriction
  on property: è definizione di bene culturale
  some values from: Tipo di bene culturale
comment: Questa classe rappresenta la definizione di un bene culturale, cioè il termine o la locuzione che individua il bene che si sta catalogando.
comment: This class represents the definition of a cultural property. It is the term or expression which identifies the property that is being catalogued. @en
label: Cultural Property Definition @en
version info: stabile
version info: stable @en
iccd norm tag: OG/OGT/OGTD

Specifiche del bene culturale
type: Class
subclass of: Description
subclass of: Restriction
  on property: sono specifiche del bene culturale
  some values from: Tipo di bene culturale
comment: Questa classe rappresenta specifiche morfologiche o funzionali, utili a completare la definizione del bene per una sua più puntuale individuazione.
comment: This class represents the morphological or functional specification, which are useful to define a cultural property for a more precise individuation. @en
label: Cultural Property Specification @en
version info: stabile
version info: stable @en
iccd norm tag: OG/OGT/OGTT

Tipo di bene culturale
type: Class
subclass of: Type
subclass of: Restriction
  on property: ha definizione del bene culturale
  some values from: Definizione del bene culturale
subclass of: Restriction
  on property: è tipo di bene culturale
  some values from: CulturalEntity
subclass of: Restriction
  on property: ha specifiche del bene culturale
  all values from: Specifiche del bene culturale
comment: Questa classe rappresenta il tipo di bene culturale, cioè il termine o la locuzione che individua il bene che si sta catalogando ed eventuali ulteriori specifiche sulla definizione del bene.
comment: This class represents a cultural property's type, that is the term or expression which specifies the cultural propery that is being catalogued and additional information on the cultural property's definition. @en
label: Cultural property Type @en
version info: stabile
version info: stable @en
iccd norm tag: OG/OGT

Dedica
type: Class
subclass of: Iscrizione
subclass of: Restriction
  on property: hasCircumstance
  all values from: Circumstance
subclass of: Restriction
  on property: hasSource
  all values from: Source
comment: Questa classe rappresenta una dedica, intesa come iscrizione dell'autore (dedicante) su un bene culturale contenente un testo che ha lo scopo di offrire l'oggetto a una persona o un ente (dedicatario).
label: Dedication @en
version info: stabile
version info: stable @en
iccd norm tag: ICCD Normativa MI 3.00: AU/DDC

Denominazione nel tempo
type: Class
subclass of: Situation
subclass of: Restriction
  on property: è denominazione nel tempo di
  some values from: CulturalEntity
subclass of: Restriction
  on property: ha tipo di denominazione
  all values from: Tipo di denominazione
subclass of: Restriction
  on property: name
  some values from: Literal
subclass of: Restriction
  on property: note
  all values from: Literal
comment: Questa classe rappresenta una denominazione e/o dedicazione attestata nel corso del tempo per il bene in esame. Per la normativa FF, la classe rappresenta nello specifico la denominazione o il titolo del fondo attestati nel corso del tempo per il bene in esame; uno stesso fondo può avere più denominazioni/titoli nel corso del tempo.
comment: This class represents a certain cultural property's designation/denomination attested over time. @en
label: Designation In Time @en
version info: stabile
version info: stable @en
iccd norm tag: ICCD Normativa Trasversale 4.00: OG/OGD - Normative A, BDM, PG 3: OG/OGA. - Normativa BNB: OG/OGT/OGTE e OG/OGT/OGTC

Tipo di denominazione
type: Class
subclass of: Type
subclass of: Restriction
  on property: è tipo di denominazione
  some values from: Denominazione nel tempo
comment: Questa classe rappresenta il tipo di denominazione o dedicazione o, per la normativa FF, titolo, del bene (altra lingua, attribuita, attuale, dialettale, etc.)
comment: This class represents a cultural property's denomination or dedication type, or its title (i.e. other language, current, attributed, dialectal). @en
label: Designation Type @en
version info: stabile
version info: stable @en
iccd norm tag: ICCD Normativa Trasversale 4.00: OG/OGD/OGDT - Normative A, BDM, PG 3: OGA/OGAG.

Emblema
type: Class
subclass of: Elemento apposto su bene culturale
comment: Questa classe rappresenta un emblema, ovvero una figura o un'immagine simbolica, talvolta accompagnata da un testo scritto (motto, testo in versi, ecc.)
label: Emblem @en
version info: stabile
version info: stable @en
iccd norm tag: ICCD Normativa Trasversale 4.00: se DA/ISE/ISED = 'emblema' - ICCD versioni precedenti: DA/STM/STMC = 'emblema' - ICCD Normativa A: LI/LSI/LSIG = 'emblema'

Tipo di caratteri
type: Class
subclass of: Characteristic
comment: Questa classe rappresenta il tipo di caratteri utilizzato in un testo (es.: corsivo, grassetto, caratteri gotici, etc.)
comment: This class represents the font style used in a text (i.e. italic, bold, gothic) @en
label: Font style @en
version info: stabile
version info: stable @en
iccd norm tag: ICCD Normativa Traversale 4.00: DA/ISE/ISET - Normative di versioni precedenti: DA/ISR/ISRT. Normativa BNB: SB/SBE/SBEC

Scopo funzionale
type: Class
subclass of: CulturalEntityCharacteristic
subclass of: Restriction
  on property: è scopo funzionale di
  some values from: Thing
comment: Questa classe rappresenta lo scopo funzionale (decorativo, religioso, simbolico, magico-offensivo, etc.), inteso come funzione che deve svolgere, di un oggetto (es bene culturale, apparato iconografico/decorativo o elemento apposto su un bene culturale come un'iscrizione).
comment: This class represents the functional purpose (i.e. decorative, religious, symbolic, magic-offensive) of an object (i.e. culural property or iconographic/decorative apparatus or affixed element on a cultural property like an inscription). The functional purpose is intended as the function that an object has to perform. @en
label: Functional purpose @en
version info: stabile
version info: stable @en
iccd norm tag: ICCD Normativa Trasversale: DA/ISE/ISEC - Normative di versioni precedenti: DA/ISR/ISRC; DA/APF/APFF - Normative MA e CA: OG/OGT/OGTF

Lapide
type: Class
subclass of: Elemento apposto su bene culturale
comment: Questa classe rappresenta una lapide, intesa come una lastra di pietra o marmo recante iscrizioni, figure, simboli, a scopo commemorativo, celebrativo, ecc.
label: Historical Plaque @en
version info: stabile
version info: stable @en
iccd norm tag: ICCD Normativa A: LI/LSI/LSIG = 'lapide'

Apparato iconografico e decorativo
type: Class
subclass of: Description
subclass of: Restriction
  on property: ha tipo di apparato iconografico e decorativo
  some values from: Tipo di apparato iconografico e decorativo
subclass of: Restriction
  on property: è apparato iconografico e decorativo di
  some values from: CulturalEntity
subclass of: Restriction
  on property: ha scopo funzionale
  all values from: Scopo funzionale
subclass of: Restriction
  on property: ha motivo decorativo
  all values from: Motivo decorativo
comment: Questa classe rappresenta l'apparato iconografico e/o decorativo di un bene culturale, inteso come l'insieme, che può essere più o meno complesso, delle rappresentazioni iconografiche e/o delle decorazioni presenti sul bene.
comment: This class represents the iconographic or decorative apparaturs of a cultural property. It is intended as the more or less complex set of iconographic or decorative representations on the cultural property. @en
label: Iconographic or Decorative Apparatus @en
version info: stabile
version info: stable @en
iccd norm tag: ICCD Normativa Trasversale 4.00: DA/AID - ICCD Normative PST e BDM: DA/APF

Tipo di apparato iconografico e decorativo
type: Class
subclass of: Type
subclass of: Restriction
  on property: è tipo di apparato iconografico e decorativo
  some values from: Apparato iconografico e decorativo
comment: Questa classe rappresenta il tipo (iconografico, decorativo, iconografico-decorativo) di apparato iconografico e decorativo di un bene culturale.
comment: This class represents the iconographic or decorative apparatus' type (iconographic, decorative, iconographic-decorative) of a cultual property. @en
label: Iconographic Or Decorative Apparatus Type @en
version info: stabile
version info: stable @en
iccd norm tag: ICCD Normativa Trasversale 4.00: DA/AID/AIDO

Modalità esecutiva
type: Class
subclass of: Method
subclass of: Restriction
  on property: è modalità esecutiva di
  some values from: Modalità comunicativa
comment: Questa classe rappresenta la modalità esecutiva (es.: alternanza, polifonia) associata a una modalità comunicativa (verbale, musicale vocale, musicale strumentale).
comment: This class represents the implementation method (e.g.: polyphonic) associated to a verbale or singing or instrumental communication medium. @en
label: Implementation method @en
version info: stabile
version info: stable @en
iccd norm tag: ICCD Normativa BDI: CU/CUM/CUMD; CU/CUS/CUSD

Iscrizione
type: Class
subclass of: Elemento apposto su bene culturale
comment: Questa classe rappresenta un'iscrizione, ovvero qualsiasi scritta o segno grafico volontario, realizzati con qualsiasi tecnica (incisione, pittura, stampa, ecc.)
label: Inscription @en
version info: stabile
version info: stable @en
iccd norm tag: ICCD Normativa Trasversale 4.00: se DA/ISE/ISED = 'iscrizione' - ICCD versioni precedenti: DA/ISR - ICCD Normativa A: LI/LSI/LSIG = 'iscrizione'

Leggibilità
type: Class
subclass of: CulturalEntityCharacteristic
subclass of: Restriction
  on property: è leggibilità di
  some values from: Stato di Conservazione
comment: Questa classe rappresenta lo stato di leggibilità (totale, buona, discreta, ridotta, assente) di un bene numismatico, relativamente al suo stato di conservazione.
comment: This class represents the legibility status (complete, decent, good, lowered, impossible) of a numinsmatic property. It is related to the property's conservation status. @en
label: Legibility @en
version info: stabile
version info: stable @en
iccd norm tag: ICCD Normativa NU: CO/STC/STCL

Logo
type: Class
subclass of: Elemento apposto su bene culturale
comment: Questa classe rappresenta un logo, ovvero, in ambito commerciale e pubblicitario, scritta e/o simbolo grafico che identifica un prodotto, un'azienda, ecc.
version info: stabile
version info: stable @en
iccd norm tag: ICCD Normativa Trasversale 4.00: se DA/ISE/ISED = 'logo' - ICCD versioni precedenti: DA/STM/STMC = 'logo' - ICCD Normativa A: LI/LSI/LSIG = 'logo'

Misura
type: Class
subclass of: Situation
subclass of: Restriction
  on property: ha tipo di misura
  some values from: Tipo di Misura
subclass of: Restriction
  on property: ha valore
  some values from: Value
subclass of: Restriction
  on property: è misura in collezione
  some values from: Collezione di misure
description: An example of usage of the class 'Measurement' is the following: resource:Measurement/0500212021-1-height a dd:Measurement ; rdfs:label "Measurement of cultural property 0500212021: 795mm."@en ; dd:hasMeasurementType dd:Height ; dd:hasValue resource:Value/0500212021-1-height-795 . @en
description: Un esempio d'uso della classe "Misura" è il seguente: resource:Measurement/0500212021-1-height a dd:Measurement ; rdfs:label "Misura del bene culturale 0500212021: 795mm."@it ; dd:hasMeasurementType dd:Height ; dd:hasValue resource:Value/0500212021-1-height-795 .
comment: Questa classe rappresenta una misura osservata per un oggetto. Le misure sono relative alle dimensioni del bene in esame. Per la normativa F, le misure possono essere relative anche a supporti secondari, custodie, cornici, singoli fotogrammi, ecc. Per la normativa VeAC, le misure possono essere relative all'ingombro per l'immagazzinaggio; alla base (individuano l'oggetto e la conformazione fisica del proprietario e sono fondamentali per l'allestimento museale, per individuare i tipi di supporti necessari per l'esposizione); alle maniche.
comment: This class represents a measurement of an object. Measurements realte to the cultural property's dimensions. @en
label: Measurement @en
version info: stabile
version info: stable @en
iccd norm tag: MT/MIS

Collezione di misure
type: Class
subclass of: Collection
subclass of: Restriction
  on property: ha misura
  some values from: Misura
subclass of: Restriction
  on property: è collezione di misure di
  some values from: Thing
is native to: object-collection
description: An example of usage of the class 'Measurement collection' is the following: resource:MeasurementCollection/1200865132-1 a dd:MeasurementCollection ; rdfs:label "Measurements of cultural property 1200865132 7"@en ; dd:hasMeasurement resource:Measurement/1200865132-1-width , resource:Measurement/1200865132-1-height , resource:Measurement/1200865132-1-depth . @en
description: Un esempio d'uso della classe "Collezione di misure" è il seguente: resource:MeasurementCollection/1200865132-1 a dd:MeasurementCollection ; rdfs:label "Misure del bene culturale 1200865132 7"@it ; dd:hasMeasurement resource:Measurement/1200865132-1-width , resource:Measurement/1200865132-1-height , resource:Measurement/1200865132-1-depth .
comment: Questa classe rappresenta l'insieme delle misurazioni osservate per un oggetto. Per la normativa F, le misure possono essere relative anche a supporti secondari, custodie, cornici, singoli fotogrammi, ecc. Per la normativa VeAC, le misure possono essere relative all'ingombro per l'immagazzinaggio; alla base (individuano l'oggetto e la conformazione fisica del proprietario e sono fondamentali per l'allestimento museale, per individuare i tipi di supporti necessari per l'esposizione); alle maniche.
comment: This class represents the set of measurments observed for an object. @en
label: Measurement collection @en
version info: stabile
version info: stable @en
iccd norm tag: MT/MIS - Normativa VeAC: anche MT/MII e MT/MIM

Tipo di Misura
type: Class
subclass of: Type
subclass of: Restriction
  on property: è tipo di misura
  some values from: Misura
comment: Questa classe rappresenta il tipo di misura osservata (larghezza, altezza, diametro, etc.)
comment: This class represents the observed measurement type (width, height, diameter, etc). @en
label: Measurement Type @en
version info: stabile
version info: stable @en
iccd norm tag: ICCD Normativa Trasversale: MT/MIS/MISZ; MT/MNR - Per versioni di normativa precedenti alla 4.00: MT/MIS/MISA; MT/MIS/MISD; MT/MIS/MISL; MT/MIS/MISN; MT/MIS/MISG; MT/MIS/MISP; MT/MIS/MISS; MT/MIS/MISR; MT/MIS/MISV - ICCD scheda VeAC: MT/MII/MIIA; MT/MII/MIIL; MT/MII/MIIP; MT/MIS/MISR; MT/MIS/MISD; MT/MIS/MISS; MT/MIS/MISP; MT/MIS/MISV; MT/MIS/MISF; MT/MIS/MISO

Orientamento
type: Class
subclass of: Characteristic
subclass of: Restriction
  on property: è orientamento di
  some values from: Thing
comment: Questa classe rappresenta l'orientamento di un oggetto (NO, SE, etc.), secondo l'asse principale individuato.
comment: This class represents the orientation of an object (i.e. N.W., S.E.), considering the main axis. @en
label: Orientation @en
version info: stabile
version info: stable @en
iccd norm tag: ICCD Normativa Trasversale: MT/ORT - ICCD Schede CA e MA: MT/ORT - Normativa BNB: LR/LRI/LRIP

Motivo decorativo
type: Class
subclass of: Concept
subclass of: Restriction
  on property: è motivo decorativo di
  some values from: Apparato iconografico e decorativo
comment: Questa classe rappresenta il motivo decorativo (antropomorfo, zoomorfo, geometrico) rappresentato da un apparato iconografico e decorativo di un bene culturale.
comment: This class represents the ornamental motif (anthropomorphous, zoomorphic, geometric) represented by a cultural property's iconographic and decorative apparatus. @en
label: Ornamental Motif @en
version info: stabile
version info: stable @en

Campione prelevato
type: Class
subclass of: Collection
subclass of: Restriction
  on property: è campione prelevato da
  some values from: CulturalEntity
subclass of: Restriction
  on property: ha tipo di campione prelevato
  all values from: Tipo di campione prelevato
subclass of: Restriction
  on property: posizione su bene culturale
  all values from: Literal
subclass of: Restriction
  on property: identificativo del campione prelevato
  all values from: Literal
comment: Questa classe rappresenta un campione prelevato da un bene archeologico.
comment: This class represents a sample collected from an archeological property. @en
label: Sample collected @en
version info: stabile
version info: stable @en
iccd norm tag: ICCD Normativa MA, CA, SI, SAS: MC/CMN

Tipo di campione prelevato
type: Class
subclass of: Type
subclass of: Restriction
  on property: è tipo di campione prelevato
  some values from: Campione prelevato
comment: Questa classe rappresenta il tipo di campione prelevato da un bene archeologico (es.: carbone, ceramica, intonaco, etc.)
comment: This class represents the sample type collected from an archaeologiacal property (i.e. coal, pottery, grout) @en
label: Sample collected type @en
version info: stabile
version info: stable @en
iccd norm tag: ICCD Normativa MA, CA, SI, SAS: MC/CMN/CMNT

Timbro
type: Class
subclass of: Elemento apposto su bene culturale
comment: Questa classe rappresenta il segno impresso con un timbro, ovvero uno strumento di gomma o di metallo per imprimere segni a inchiostro oppure a secco.
label: Stamp @en
version info: stabile
version info: stable @en
iccd norm tag: ICCD Normativa Trasversale 4.00: se DA/ISE/ISED = 'timbro' - ICCD versioni precedenti: DA/STM/STMC = 'timbro' - ICCD Normativa A: LI/LSI/LSIG = 'timbro'

Supporto
type: Class
subclass of: Object
subclass of: Restriction
  on property: è supporto di
  some values from: Elemento apposto su bene culturale
comment: Questa classe rappresenta il supporto sul quale può trovarsi un elemento, per esempio un'iscrizione, un emblema, un timbro, etc., rappresentati su un bene culturale (es. "etichetta di carta").
comment: This class represents the support on which an element can be located, for instance an inscription, emblem, postmark represented on a cultural property (i.e. "paper label"). @en
label: Support @en
version info: stabile
version info: stable @en
iccd norm tag: ICCD Normativa Trasversale 4.00: DA/ISE/ISES

Caratteristica tecnica
type: Class
subclass of: Characteristic
subclass of: Restriction
  on property: è caratteristica tecnica classificata da
  all values from: Concetto tecnico
subclass of: Restriction
  on property: è inclusa in stato tecnico
  all values from: Stato tecnico di entità culturale
is native to: technical-characteristic
comment: Questa classe rappresenta una caratteristica tecnica relativa a un bene culturale. Per esempio, può rappresentare una particolare materia di cui è composto, la tecnica con cui è stato realizzato, la sua forma, il suo colore. Ogni caratteristica tecnica utilizza è definito da un concetto (es.: "terracotta" è una caratteristica tecnica definita dal concetto "materia", relativamente a un bene culturale). Per ogni tipologia di bene culturale possono essere rilevati e registrate caratteristiche tecnice specifiche.
comment: This class represents a characteristic of a cultural property. For example it can represent a cultural property's particular costituent material or the technique with which it was made or its shape or color. Each technical characteristic is classified by a concept (i.e. "clay" is a techical characteristic classified by the technical concept "material" related to a cultural property). For each cultural property typology can be registered some specific technical characteristics. @en
label: Technical Characteristic @en
version info: stabile
version info: stable @en
iccd norm tag: ICCD Normativa Trasversale 4.00: MT/MTC/MTCM; MT/MTC/MTCT - Normativa OA, D, F, S, MI: MT/FRM - Normativa OA, D, F, S: MT/FIL - Normativa VeAC: MT/MTC/MTCC; MT/MTC/MTCF - Normativa F: MT/FVC/FVCC; MT/FVC/FVCF; MT/FVC/FVCP; MT/FVC/FVCU; MT/FVC/FVCM; MT/FVM;

Qualificazione di caratteristica tecnica
type: Class
subclass of: Characteristic
comment: Questa classe rappresenta la qualificazione di una caratteristica tecnica relativa a un bene culturale
comment: This class represents the qualification of a characteristic of a cultural property. @en
label: Technical characteristic qualification @en
version info: instabile
version info: unstable @en

Concetto tecnico
type: Class
subclass of: Concept
is native to: technical-characteristic
comment: Questa classe rappresenta un concetto tecnico, inteso come tipo particolare di concetto che fornisce una classificazione a una caratteristica tecnica di un'entità, es. un bene culturale. Per esempio, "materia" è un concetto tecnico che può essere utilizzato per classificare la caratteristica tecnica "terracotta" relativa a un bene culturale.
comment: This class represents a technical concept, a particular type of concept that classifies a technical characteristic of an entity, e.g. cultural property. For instance, "material" is a techincal concept that classifies the technical characteristic "pottery" related to a cultural property. @en
label: Technical concept @en
version info: stabile
version info: stable @en
iccd norm tag: ICCD Normativa Trasversale 4.00: MT/MTC/MTCM; MT/MTC/MTCT - Normativa OA, D, S, MI: MT/FRM - Normativa OA, D, F, S: MT/FIL - Normativa VeAC: MT/MTC/MTCC; MT/MTC/MTCF - Normativa F: MT/FVC/FVCC; MT/FVC/FVCF; MT/FVC/FVCP; MT/FVC/FVCU; MT/FVC/FVCM; MT/FVM; MT/MTX; MT/FVM; MT/FRM;

Sistema di scrittura
type: Class
subclass of: System
subclass of: Restriction
  on property: è sistema di scrittura di
  some values from: Elemento apposto su bene culturale
comment: Questa classe rappresenta il sistema di scrittura/alfabeto adottati in una iscrizione, un timbro, uno stemma, etc.
comment: This class represents the writing system or alphabet of an inscription, postmark, crest etc. @en
label: Writing system @en
version info: stabile
version info: stable @en
iccd norm tag: ICCD Normativa Trasversale 4.00: DA/ISE/ISEF

Accessibile
type: NamedIndividual
type: Accessibilità del bene culturale
label: Accessible @en

Altitudine
type: NamedIndividual
label: Altitude @en
version info: instabile
version info: unstable @en
iccd norm tag: Normativa BNB: LR/LRI/LRIA

Area
type: NamedIndividual
type: Tipo di Misura
version info: stabile
version info: stable @en

Denominazione attribuita
type: NamedIndividual
type: Tipo di denominazione
comment: Questo individuo rappresenta una denominazione attribuita.
comment: This individual represents an attributed denomination. @en
label: Assigned designation @en
version info: stabile
version info: stable @en
iccd norm tag: ICCD Normativa Trasversale: OGD/OGDT - Normative A, BDM, PG 3: OGA/OGAG.

Disponibile
type: NamedIndividual
type: Disponibilità materiale del bene culturale
label: Available @en

Note produbicili
type: NamedIndividual
type: Concetto tecnico
comment: Questo individuo rappresenta le note producibili da uno strumento musicale, dal grave all'acuto.
comment: This individual represents playable notes by a musical instrument, from low to high. @en
label: Available notes @en
version info: stabile
version info: stable @en
iccd norm tag: ICCD Normativa SM 4.00: AA/AAN

Lunghezza totale parte posteriore
type: NamedIndividual
type: Tipo di Misura
label: Back total length @en
version info: stabile
version info: stable @en

Larghezza dorso
type: NamedIndividual
type: Tipo di Misura
label: Back Width @en
version info: stabile
version info: stable @en

Stato di conservazione cattivo
type: NamedIndividual
type: Tipo di stato di conservazione
label: Bad conservation status @en
version info: stabile
version info: stable @en

Capacità
type: NamedIndividual
type: Tipo di Misura
label: Capacity @en
version info: stabile
version info: stable @en

Circonferenza petto
type: NamedIndividual
type: Tipo di Misura
label: Chest Circumference @en
version info: stabile
version info: stable @en

Circonferenza
type: NamedIndividual
type: Tipo di Misura
label: Circumference @en
version info: stabile
version info: stable @en

Leggibilità totale
type: NamedIndividual
type: Leggibilità
label: Complete legibility @en

Area coperta
type: NamedIndividual
type: Tipo di Misura
label: Covered area @en
version info: stabile
version info: stable @en

Denominazione attuale
type: NamedIndividual
type: Tipo di denominazione
comment: Questo individuo rappresenta la denominazione attuale.
comment: This individual represents the current designation. @en
label: Current designation @en
version info: stabile
version info: stable @en
iccd norm tag: ICCD Normativa Trasversale: OGD/OGDT - Normativa A 3: OGA/OGAG.

Denominazione consuetudinaria
type: NamedIndividual
type: Tipo di denominazione
comment: Questo individuo rappresenta una denominazione consuetudinaria.
comment: This individual represents the usual designation. @en
label: Customary designation @en
version info: stabile
version info: stable @en
iccd norm tag: ICCD Normativa Trasversale: OGD/OGDT - Normative A e PG 3: OGA/OGAG.

Stato di conservazione discreto
type: NamedIndividual
type: Tipo di stato di conservazione
label: Decent conservation status @en
version info: stabile
version info: stable @en

Leggibilità decente
type: NamedIndividual
type: Leggibilità
label: Decent Legibility @en

Apparato decorativo
type: NamedIndividual
type: Tipo di apparato iconografico e decorativo
label: Decorative apparatus @en

Profondità
type: NamedIndividual
type: Tipo di Misura
label: Depth @en
version info: stabile
version info: stable @en

Profondità / Altezza
type: NamedIndividual
type: Tipo di Misura
label: Depth / Height @en
version info: stabile
version info: stable @en

Denominazione dialettale
type: NamedIndividual
type: Tipo di denominazione
comment: Questo individuo rappresenta una denominazione dialettale.
comment: This individual represents the dialect designation. @en
label: Dialectal designation @en
version info: stabile
version info: stable @en
iccd norm tag: ICCD Normativa Trasversale: OGD/OGDT - Normative A e BDM 3: OGA/OGAG.

Diametro
type: NamedIndividual
type: Tipo di Misura
label: Diameter @en
version info: stabile
version info: stable @en

Corista
type: NamedIndividual
type: Concetto tecnico
comment: Questo individuo rappresenta il corista rilevato (nota, temperatura ed eventualmente umidità ambientale al momento della rilevazione).
comment: This individual represents the identified diapason (note, temperature and eventually humidity during the detection). @en
label: Diapason @en
version info: stabile
version info: stable @en
iccd norm tag: ICCD Normativa SM 4.00: AA/AAC

Durata temporale
type: NamedIndividual
type: Tipo di Misura
label: Duration @en
version info: stabile
version info: stable @en

Circonferenza orlo
type: NamedIndividual
type: Tipo di Misura
label: Edge circumference @en
version info: stabile
version info: stable @en

Estensione
type: NamedIndividual
type: Concetto tecnico
comment: Questo individuo rappresenta l'estensione musicale di uno strumento musicale.
comment: This individual represents a musical instrument's musical extension. @en
label: Extension @en
version info: stabile
version info: stable @en
iccd norm tag: ICCD Normativa SM 4.00: AA/AAE

Lunghezza esterna / interna
type: NamedIndividual
type: Tipo di Misura
label: External / Internal length @en
version info: stabile
version info: stable @en

Formato di compressione/estensione file
type: NamedIndividual
type: Concetto tecnico
comment: Questo individuo rappresenta il formato utilizzato per la scrittura di una risorsa digitale su supporto informatico.
comment: This individual represents the format used to write a digital resource on a data medium. @en
label: File Format @en
version info: stabile
version info: stable @en
iccd norm tag: ICCD Normativa F: MT/FVC/FVCF

Filigrana
type: NamedIndividual
type: Concetto tecnico
comment: Questo individuo rappresenta la filigrana di un'opera d'arte, un disegno, una fotografia, una stampa.
comment: This individual represents the filigree of an artwork, painting, photography, print. @en
label: Filigree @en
version info: stabile
version info: stable @en
iccd norm tag: ICCD Normative OA, D, F, S: MT/FIL

Lunghezza totale parte anteriore
type: NamedIndividual
type: Tipo di Misura
label: Front total length @en
version info: stabile
version info: stable @en

Analisi del vestimento
type: NamedIndividual
type: Concetto tecnico
comment: Questo individuo rappresenta la definizione tecnica completa dei tessuti, secondo le norme fornite dal C.I.E.T.A., o dei merletti, oppure rappresenta la distinzione fra tessuto unito e tessuto operato.
comment: This individual represents the techincal definition of textured fabrics of an ancient or contemporary garment, according to the standard provided by C.I.E.T.A., or laces. It can also represent the dinstrinction between plain fabric and textured fabric. @en
label: Garment analysis @en
version info: stabile
version info: stable @en
iccd norm tag: ICCD Normativa VeAC: MT/MTC/MTCA

Colore del vestimento
type: NamedIndividual
type: Concetto tecnico
comment: Questo individuo rappresenta il colore dominante, di solito quello del fondo del tessuto, o quello risultante dall'intreccio, di un vestimento antico o contemporaneoi.
comment: This individual represents the dominant color of a ancient and contemporary garment, usually it is base fabric's color, or the interlaced decoration's color. @en
label: Garment colour @en
version info: stabile
version info: stable @en
iccd norm tag: ICCD Normativa VeAC: MT/MTC/MTCC

Stato di conservazione buono
type: NamedIndividual
type: Tipo di stato di conservazione
label: Good conservation status @en
version info: stabile
version info: stable @en

Buona leggibilità
type: NamedIndividual
type: Leggibilità
label: Good legibility @en

Altezza
type: NamedIndividual
type: Tipo di Misura
label: Height @en
version info: stabile
version info: stable @en

Altezza x Lunghezza
type: NamedIndividual
type: Tipo di Misura
label: Height x Length @en
version info: stabile
version info: stable @en

Altezza x Lunghezza x Larghezza
type: NamedIndividual
type: Tipo di Misura
label: Height x Length x Width @en
version info: stabile
version info: stable @en

Altezza x Larghezza x Spessore
type: NamedIndividual
type: Tipo di Misura
label: Height x Width x Thickness @en
version info: stabile
version info: stable @en

Circonferenza fianchi
type: NamedIndividual
type: Tipo di Misura
label: Hip circumference @en
version info: stabile
version info: stable @en

Denominazione storica
type: NamedIndividual
type: Tipo di denominazione
comment: Questo individuo rappresenta una denominazione storica.
comment: This individual represents a historical designation. @en
label: Historical designation @en
version info: stabile
version info: stable @en
iccd norm tag: ICCD Normativa Trasversale: OGD/OGDT - Normative A e PG 3: OGA/OGAG.

Apparato iconografico e decorativo
type: NamedIndividual
type: Tipo di apparato iconografico e decorativo
label: Iconographic and Decorative apparatus @en

Apparato iconografico
type: NamedIndividual
type: Tipo di apparato iconografico e decorativo
label: Iconographic apparatus @en

Denominazione idiomatica
type: NamedIndividual
type: Tipo di denominazione
comment: Questo individuo rappresenta una denominazione idiomatica.
comment: This individual represents an idiomatic designation. @en
label: Idiomatic designation @en
version info: stabile
version info: stable @en
iccd norm tag: ICCD Normativa Trasversale: OGD/OGDT - Normative A e PG 3: OGA/OGAG.

Leggibilità assente
type: NamedIndividual
type: Leggibilità
label: Impossible legibility @en

Inaccessibile
type: NamedIndividual
type: Accessibilità del bene culturale
label: Inaccessible @en

Comunicazione musicale strumentale
type: NamedIndividual
type: Tipo di modalità comunicativa
label: Instrumental communication @en

Comunicazione cinesica
type: NamedIndividual
type: Tipo di modalità comunicativa
label: Kinesic communication @en

Lunghezza
type: NamedIndividual
type: Tipo di Misura
label: Length @en
version info: stabile
version info: stable @en

Denominazione locale
type: NamedIndividual
type: Tipo di denominazione
comment: Questo individuo rappresenta una denominazione locale.
comment: This individual represents an local designation. @en
label: Local designation @en
version info: stabile
version info: stable @en
iccd norm tag: ICCD Normativa Trasversale: OGD/OGDT - Normative A e BDM 3: OGA/OGAG.

Leggibilità ridotta
type: NamedIndividual
type: Leggibilità
label: Lowered legibility @en

Memoria di massa
type: NamedIndividual
type: Concetto tecnico
comment: Questo individuo rappresenta la memoria di massa nella quale è stata memorizzata una fotografia digitale.
comment: This individual represents the mass storage where a digital photograph is stored. @en
label: Mass storage @en
version info: stabile
version info: stable @en
iccd norm tag: ICCD Normativa F: MT/FVM

Materia
type: NamedIndividual
type: Concetto tecnico
comment: Questo individuo rappresenta la materia con cui è realizzato un oggetto, per esempio un bene culturale.
comment: This individual represents the material through which an object has been realized, e.g. a cultural entity. @en
label: Material @en
version info: stabile
version info: stable @en
iccd norm tag: ICCD Normativa Trasversale 4.00: MT/MTC/MTCM; ICCD Normativa VeAC: MT/MTC/MTCF

Materia o tecnica
type: NamedIndividual
type: Concetto tecnico
comment: Questo individuo rappresenta la materia e/o la tecnica con cui è realizzato un oggetto, per esempio un bene culturale. Nel dominio delle normative ICCD per la catalogazione dei beni culturali, si rende necessario nei casi in cui materia e tecnica sono registrate nello stesso campo, nella forma "materia/ tecnica".
comment: This individual represents the material or technique through which an object has been realized, e.g. a cultural entity. In ICCD standard for cataloguing cultural entities, this label is necessary when material and techinque are registered in the same field. @en
label: Material or Technique @en
version info: stabile
version info: stable @en
iccd norm tag: MT/MTC (come campo semplice)

Larghezza massima / minima
type: NamedIndividual
type: Tipo di Misura
label: Maximum / minimum width @en
version info: stabile
version info: stable @en

Lunghezza totale massima
type: NamedIndividual
type: Tipo di Misura
label: Maximum total length @en
version info: stabile
version info: stable @en

Larghezza totale massima
type: NamedIndividual
type: Tipo di Misura
label: Maximum total width @en
version info: stabile
version info: stable @en

Stato di conservazione mediocre
type: NamedIndividual
type: Tipo di stato di conservazione
label: Mediocre conservation status @en
version info: stabile
version info: stable @en

Non più disponibile
type: NamedIndividual
type: Disponibilità materiale del bene culturale
label: No longer available @en

Memoria occupata
type: NamedIndividual
type: Tipo di Misura
label: Occupied storage space @en
version info: stabile
version info: stable @en

Denominazione originaria
type: NamedIndividual
type: Tipo di denominazione
comment: Questo individuo rappresenta una denominazione originaria.
comment: This individual represents original designation. @en
label: Original designation @en
version info: stabile
version info: stable @en
iccd norm tag: ICCD Normativa Trasversale: OGD/OGDT - Normative A e PG 3: OGA/OGAG.

Denominazione in altra lingua
type: NamedIndividual
type: Tipo di denominazione
comment: Questo individuo rappresenta una denominazione in altra lingua.
comment: This individual represents a designation in other language. @en
label: Other language designation @en
version info: stabile
version info: stable @en
iccd norm tag: ICCD Normativa Trasversale: OGD/OGDT - Normative A, BDM, PG 3: OGA/OGAG.

Parzialmente accessibile
type: NamedIndividual
type: Accessibilità del bene culturale
label: Partially accessible @en

Perimetro
type: NamedIndividual
type: Tipo di Misura
label: Perimeter @en
version info: stabile
version info: stable @en

Ph
type: NamedIndividual
type: Tipo di Misura
version info: Instabile
version info: unstable @en

Colore della fotografia
type: NamedIndividual
type: Concetto tecnico
comment: Questo individuo rappresenta il colore della fotografia digitale, ovvero se trattasi di fotografia in bianco/nero o a colori.
comment: This individual represents a digital photograph's colour, i.e. black and white or colours. @en
label: Photo colour @en
version info: stabile
version info: stable @en
iccd norm tag: ICCD Normativa F: MT/MTX

Programma per la fotografia digitale
type: NamedIndividual
type: Concetto tecnico
comment: Questo individuo rappresenta il programma di visualizzazione, memorizzazione ed elaborazione utilizzato per la fotografia digitale.
comment: This individual represents the visualization, storage and processing program used for a digital photograph. @en
label: Photo program @en
version info: stabile
version info: stable @en
iccd norm tag: ICCD Normativa F: MT/FVC/FVCP

Dimensioni della foto (Formato)
type: NamedIndividual
type: Concetto tecnico
comment: Questo individuo rappresenta il formato di una fotografia digitale, inteso come la dimensione standardizzata dei materiali fotografici (negativi, positivi, ecc.).
comment: This individual represents a digital photograph format, intended as the photogrphic material's standardised size (e.g. negative, positives). @en
label: Photo size @en
version info: stabile
version info: stable @en
iccd norm tag: ICCD Normativa F: MT/FRM

Dimensioni in pixel
type: NamedIndividual
type: Concetto tecnico
comment: Questo individuo rappresenta le dimensioni, in pixel, di una fotografia digitale.
comment: This individual represents a digital photograph size in pixels. @en
label: Pixel dimension @en
version info: stabile
version info: stable @en
iccd norm tag: ICCD Normativa F: MT/FVC/FVCM

Potenza
type: NamedIndividual
type: Tipo di Misura
label: Power @en
version info: stabile
version info: stable @en

Comunicazione prossemica
type: NamedIndividual
type: Tipo di modalità comunicativa
label: Proxemics communication @en

Livello di qualità
type: NamedIndividual
type: Concetto tecnico
comment: Questo individuo rappresenta il livello di qualità di una risorsa digitale (es.: alta risoluzione, bassa risoluzione, preview)
comment: This individual represents a digital resource's quality level, e.g. high-resolution, low-resolution, preview. @en
label: Quality level @en

Risoluzione
type: NamedIndividual
type: Concetto tecnico
comment: Questo individuo rappresenta la risoluzione e il valore specifico utilizzati per la memorizzazione di una fotografia digitale.
comment: This individual represents the specific value and resolution used for storing a digital photograph. @en
label: Resolution @en
version info: stabile
version info: stable @en
iccd norm tag: ICCD Normativa F: MT/FVC/FVCU

Formato
type: NamedIndividual
type: Concetto tecnico
comment: Questo individuo rappresenta la forma di un oggetto, per oggetti bidimensionali (es.: ottagonale, tondo)
comment: This individual represents an object's shape. It is used for bidimensional objects, e.g. octagonal or round shape. @en
label: Shape @en
version info: stabile
version info: stable @en
iccd norm tag: ICCD Normative OA, D, S, MI: MT/FRM

Comunicazione musicale vocale
type: NamedIndividual
type: Tipo di modalità comunicativa
label: Singing communication @en

Denominazione gergale
type: NamedIndividual
type: Tipo di denominazione
comment: Questo individuo rappresenta una denominazione gergale.
comment: This individual represents a slang designation. @en
label: Slang designation @en
version info: stabile
version info: stable @en
iccd norm tag: ICCD Normativa Trasversale: OGD/OGDT - Normative A e BDM 3: OGA/OGAG.

Capacità di memoria
type: NamedIndividual
type: Tipo di Misura
label: Storage capacity @en
version info: stabile
version info: stable @en

Metodo di memorizzazione e profondità di colore
type: NamedIndividual
type: Concetto tecnico
comment: Questo individuo rappresenta il metodo e la profondità di colore con cui è stata memorizzata la fotografia digitale.
comment: This individual represents the method and color depth through which a digital photograph has been stored. @en
label: Storage method and colour depth @en
version info: stabile
version info: stable @en
iccd norm tag: ICCD Normativa F: MT/FVC/FVCC

Tecnica
type: NamedIndividual
type: Concetto tecnico
comment: Questo individuo rappresenta la tecnica di esecuzione di un oggetto, per esempio un bene culturale.
comment: This individual represents an object's execution technique. @en
label: Technique @en
version info: stabile
version info: stable @en
iccd norm tag: ICCD Normativa Trasversale 4.00: MT/MTC/MTCT

Temperamento
type: NamedIndividual
type: Concetto tecnico
comment: Questo individuo rappresenta il temperamento adottato, soprattutto in caso di oggetto in condizioni originali, o dopo un restauro, di uno strumento musicale. Per gli idiofoni a tasti fissi (come xilofoni, litofoni, metallofoni) rappresenta la successione degli intervalli.
comment: This individual represents a musical instrument adopted temperament, especially in relation to an object in its original conditions, or after its restoration. For idiophones with fixed keys (e.g. xylophone, litophone, metallophone) the temperament represents the succession of intervals. @en
label: Temperament @en
version info: stabile
version info: stable @en
iccd norm tag: ICCD Normativa SM 4.00: AA/AAP

Temperatura
type: NamedIndividual
type: Tipo di Misura
label: Temperature @en
version info: instabile
version info: unstable @en

Spessore
type: NamedIndividual
type: Tipo di Misura
label: Thickness @en
version info: stabile
version info: stable @en

Accordatura
type: NamedIndividual
type: Concetto tecnico
comment: Questo individuo rappresenta l'accordatura di uno strumento musicale.
comment: This individual represents a musical instrument tuning. @en
label: Tuning @en
version info: stabile
version info: stable @en
iccd norm tag: ICCD Normativa SM 4.00: AA/AAA

Dato sullo stato di conservazione non disponibile
type: NamedIndividual
type: Tipo di stato di conservazione
label: Data on conservation status unavailable @en
version info: stabile
version info: stable @en

UndetectedMeasurements
type: NamedIndividual
type: Tipo di Misura
version info: Misure non rilevate
version info: Undetected Measurements @en
version info: stabile
version info: stable @en

Misure varie
type: NamedIndividual
type: Tipo di Misura
label: Various misurements @en
version info: stabile
version info: stable @en

Comunicazione verbale
type: NamedIndividual
type: Tipo di modalità comunicativa
label: Verbal communication @en

Lunghezza vibrante
type: NamedIndividual
type: Concetto tecnico
comment: Questo individuo rappresenta la lunghezza vibrante di uno strumento, in particolare di un cordofono.
comment: This individual represents a musical instrument vibrating length, in particular a chordophone. @en
label: Vibrating lenght @en
version info: stabile
version info: stable @en
iccd norm tag: ICCD Normativa SM 4.00: AA/AAL

Volume
type: NamedIndividual
type: Tipo di Misura
version info: stabile
version info: stable @en

Ingombro
type: NamedIndividual
type: Tipo di Misura
label: Volumetric dimensions @en
version info: stabile
version info: stable @en

Circonferenza vita
type: NamedIndividual
type: Tipo di Misura
label: Waist Circumference @en
version info: stabile
version info: stable @en

Peso
type: NamedIndividual
type: Tipo di Misura
label: Weight @en
version info: stabile
version info: stable @en

Larghezza
type: NamedIndividual
type: Tipo di Misura
label: Width @en
version info: stabile
version info: stable @en

Comunicazione scritta
type: NamedIndividual
type: Tipo di modalità comunicativa
label: Written communication @en