Chemical Entity
type: Class
definition source: ChEBI ontology https://www.ebi.ac.uk/chebi/searchId.do?chebiId=CHEBI:24431#

example to be eventually removed
editor preferred term: example to be eventually removed
type: curation status specification
type: NamedIndividual

curation status specification
editor preferred term: curation status specification
has curation status: pending final vetting
definition: The curation status of the term. The allowed values come from an enumerated list of predefined terms. See the specification of these instances for more detailed definitions of each enumerated value.
type: Class
equivalent class: Class
  one of: example to be eventually removed
  one of: metadata complete
  one of: organizational term
  one of: ready for release
  one of: metadata incomplete
  one of: uncurated
  one of: pending final vetting
  one of: to be replaced with external ontology term
  one of: requires discussion

editor preferred term
has curation status: ready for release
definition: The concise, meaningful, and human-friendly name for a class or property preferred by the ontology developers. (US-English)
type: AnnotationProperty

has curation status
editor preferred term: has curation status
type: AnnotationProperty

definition
has curation status: ready for release
definition: The official definition, explaining the meaning of a class or property. Shall be Aristotelian, formalized and normalized. Can be augmented with colloquial definitions.
type: AnnotationProperty

editor note
has curation status: ready for release
definition: An administrative note intended for its editor. It may not be included in the publication version of the ontology, so it should contain nothing necessary for end users to understand the ontology.
type: AnnotationProperty

term editor
has curation status: ready for release
definition: Name of editor entering the term in the file. The term editor is a point of contact for information regarding the term. The term editor may be, but is not always, the author of the definition, which may have been worked upon by several people
type: AnnotationProperty

definition source
has curation status: ready for release
definition: Formal citation, e.g. identifier in external database to indicate / attribute source(s) for the definition. Free text indicate / attribute source(s) for the definition. EXAMPLE: Author Name, URI, MeSH Term C04, PUBMED ID, Wiki uri on 31.01.2007
type: AnnotationProperty

metadata complete
editor preferred term: metadata complete
definition: Class has all its metadata, but is either not guaranteed to be in its final location in the asserted IS_A hierarchy or refers to another class that is not complete.
type: curation status specification
type: NamedIndividual

organizational term
editor preferred term: organizational term
definition: Term created to ease viewing/sort terms for development purpose, and will not be included in a release
type: curation status specification
type: NamedIndividual

ready for release
editor preferred term: ready for release
definition: Class has undergone final review, is ready for use, and will be included in the next release. Any class lacking "ready_for_release" should be considered likely to change place in hierarchy, have its definition refined, or be obsoleted in the next release. Those classes deemed "ready_for_release" will also derived from a chain of ancestor classes that are also "ready_for_release."
type: curation status specification
type: NamedIndividual

metadata incomplete
editor preferred term: metadata incomplete
definition: Class is being worked on; however, the metadata (including definition) are not complete or sufficiently clear to the branch editors.
type: curation status specification
type: NamedIndividual

uncurated
editor preferred term: uncurated
definition: Nothing done yet beyond assigning a unique class ID and proposing a preferred term.
type: curation status specification
type: NamedIndividual

pending final vetting
editor preferred term: pending final vetting
definition: All definitions, placement in the asserted IS_A hierarchy and required minimal metadata are complete. The class is awaiting a final review by someone other than the term editor.
type: curation status specification
type: NamedIndividual

to be replaced with external ontology term
editor preferred term: to be replaced with external ontology term
definition: Terms with this status should eventually replaced with a term from another ontology.
term editor: Alan Ruttenberg
definition source: group:OBI
type: curation status specification
type: NamedIndividual

requires discussion
definition: A term that is metadata complete, has been reviewed, and problems have been identified that require discussion before release. Such a term requires editor note(s) to identify the outstanding issues.
type: curation status specification
type: NamedIndividual

has role
type: ObjectProperty

DataCite Identifier
type: Class
equivalent class: Class
  intersection of: DataCite Metadata
  intersection of: Value Object
  intersection of: Restriction
    on property:
      inverse of: hasIdentifier
    some values from: Class
      union of: Project
      union of: Value Object

Digital Material Identifier
type: Class
definition: A dmi:DigitalMaterialIdentifier is a resource identifier (IRI) that represents the specification of a material (in the sense of a material class) described in a specification document. The specification document can be, e.g., a standard, a datasheet, or any other citable document. Typically, a specification document requires some qualities that a material (in the sense of a portion of matter) has to comply with. Typical requirements include chemical compositions or physical properties.

Fragment Selector
type: Class
example: oa#

Platform Material Digital Core Ontology (PMDco)
creator: Jörg Waitelonis
creator: Bernd Bayerlein
creator: Markus Schilling
creator: Henk Birkholz
creator: Thomas Hanke
creator: https://orcid.org/0000-0003-4971-3645
creator: Sascha Fliegener
creator: Jannis Grundmann
bibliographic citation: Bernd Bayerlein, Henk Birkholz, Sascha Fliegener, Jannis Grundmann, Thomas Hanke, Philipp von Hartrott, Markus Schilling, Jörg Waitelonis. (September 20th, 2023) PMDco: platform material digital ontology. Version 2.0.5, https://w3id.org/pmd/co/
created: 2023-09-20
license: http://creativecommons.org/licenses/by/4.0/
type: Ontology
comment: The PMD Core Ontology (PMDco) is a comprehensive framework for representing knowledge that encompasses fundamental concepts from the domains of materials science and engineering (MSE). The PMDco has been designed as a mid-level ontology to establish a connection between specific MSE application ontologies and the domain neutral concepts found in established top-level ontologies. The primary goal of the PMDco is to promote interoperability between diverse domains. PMDco's class structure is both understandable and extensible, making it an efficient tool for organizing MSE knowledge. It serves as a semantic intermediate layer that unifies MSE knowledge representations, enabling data and metadata to be systematically integrated on key terms within the MSE domain. With PMDco, it is possible to seamlessly trace data generation. The design of PMDco is based on the W3C Provenance Ontology (PROV-O), which provides a standard framework for capturing the generation, derivation, and attribution of resources. By building on this foundation, PMDco facilitates the integration of data from various sources and the creation of complex workflows. In summary, PMDco is a valuable tool for researchers and practitioners in the MSE domains. It provides a common language for representing and sharing knowledge, allowing for efficient collaboration and promoting interoperability between diverse domains. Its design allows for the systematic integration of data and metadata, enabling seamless traceability of data generation. Overall, PMDco is a crucial step towards a unified and comprehensive understanding of the MSE domain. PMDco at GitHub: https://github.com/materialdigital/core-ontology
imports: prov-o-inverses-20130430
version IRI: https://w3id.org/pmd/co/2.0.5
version info: 2.0.5

2D Pixel Coordinates
type: Class
label: 2D Pixel Koordinaten @de
subclass of: Coordinates
equivalent class: Restriction
  on property: relates to
  some values from: Pixel
definition: A pixel can be identified by a pair of integers indicating the column and row number, here the 2D pixel coordinates. For example, a pixel with coordinates (1,2) would be in column number 1 and row number 2. Typically, columns are numbered starting with zero from left to right.
definition: Ein Pixel kann durch ein Paar von Ganzzahlen identifiziert werden, die die Spalten- und Zeilennummer angeben, hier die 2D Pixel Koordinaten. Zum Beispiel würde ein Pixel mit den Koordinaten (1,2) in der Spalte Nummer 1 und der Zeile Nummer 2 liegen. Üblicherweise werden Spalten beginnend mit Null von links nach rechts nummeriert. @de

Accreditation Document
type: Class
label: Akkreditierungsdokument @de
subclass of: Document
definition: Diese Entität beschreibt ein Dokument, welches aussagt, dass einer Organisation, Person oder Einrichtung eine offizielle Konformität mit einer Norm anerkannt wurde. Dies kann z. B. Prozesse, Ausrüstungen oder ganze Laboratorien umfassen. @de
definition: This entity describes a document used to state that an official authorization or approval to recognize or vouch for a conformation with a standard was granted to an organization, person, or entity. This may include, e.g., processes, (sets of) equipment, or entire laboratories.
definition source: https://www.merriam-webster.com/dictionary/accreditation

Acoustical
type: Class
label: Akustisch @de
subclass of: Material Property
definition: Acoustical is relating to the sense or organs of hearing, to sound, or to the science of sounds. Here specifically on the acoustic properties of a material.
definition: Akustisch bezieht sich auf den Hörsinn oder die Hörorgane, auf Schall oder auf die Wissenschaft vom Schall. Hier spezifisch auf die akustischen Eigenschaften eines Materials. @de
definition source: “Acoustic.” Merriam-Webster.com Dictionary, Merriam-Webster, https://www.merriam-webster.com/dictionary/acoustic. Accessed 13 Jan. 2023.

Address
type: Class
label: Adresse @de
subclass of: Value Object
definition: A place where a person or organization may be communicated with.
definition: Ein Ort, an dem mit einer Person oder Organisation kommuniziert werden kann. @de
definition source: “Address.” Merriam-Webster.com Dictionary, Merriam-Webster, https://www.merriam-webster.com/dictionary/address. Accessed 16 Jan. 2023.

Aging Interval
type: Class
label: Alterungsintervall @de
subclass of: Aging Time
definition: Timespan a Temperature during an Aging Process is hold.

Aging Process
type: Class
label: Alterungsprozess @de
subclass of: Process
definition: Das Aging oder Auslagern ist ein Anlassvorgang, der den Martensit (Härtungsgefüge) wieder duktil und verformbar macht. Dabei wird ein Agingvorgang genutzt, nämlich die Bildung von Ausscheidungen in Form von FeXCY - Carbiden @de
definition: The process of hardening an alloy by a method that causes a constituent to precipitate from solid solution.
example: The Process of austenitizing and quenching a steel alloy to achieve a martensitic microstructure for hardness increase.

Aging Temperature
type: Class
label: Alterungstemperatur @de
subclass of: Temperature
definition: Variable Temperature during an Aging Process depending on the desired deposition formations.

Aging Time
type: Class
label: Alterungszeit @de
subclass of: Time
definition: The timespan that an Aging Process executes to completion.

Algorithm
type: Class
label: Algorithmus @de
subclass of: Method
definition: A procedure for solving a mathematical problem (as of finding the greatest common divisor) in a finite number of steps that frequently involves repetition of an operation.
definition source: “Algorithm.” Merriam-Webster.com Dictionary, Merriam-Webster, https://www.merriam-webster.com/dictionary/algorithm. Accessed 24 Nov. 2022.

Amorphous Structure
type: Class
label: Amorphe Struktur @de
subclass of: Material Structure
definition: Amorphe Materialien haben eine innere Struktur, die aus miteinander verbundenen Strukturblöcken besteht, die den grundlegenden Struktureinheiten in der entsprechenden kristallinen Phase der gleichen Verbindung ähnlich sein können. Anders als bei kristallinen Materialien besteht jedoch keine langfristige Ordnung. Amorphe Materialien können daher nicht durch eine bestimmte Einheitszelle definiert werden. @de
definition: Amorphous materials have an internal structure consisting of interconnected structural blocks that can be similar to the basic structural units found in the corresponding crystalline phase of the same compound. Unlike in crystalline materials, however, no long-range order exists. Amorphous materials therefore cannot be defined by a finite unit cell.
definition source: “Amorphous solid - Structure.” Wikipedia The Free Encyclopedia, https://en.wikipedia.org/wiki/Amorphous_solid. Accessed 13 Jan. 2023.

Analysing Process
type: Class
label: Analyseprozess @de
subclass of: Process
definition: A process that is driven by the primary intent to gain new measurements An analysis process is either a transformative process or a non-transformative process.

Area
type: Class
label: Fläche @de
subclass of: Value Object
definition: The extent or measurement of a surface.

Assembling Process
type: Class
label: Assemblierungsprozess @de
subclass of: Process
definition: A process to mount or demount a component.

Base fraction
type: Class
label: Basisanteil @de
subclass of: Fraction
definition: The assumed base material of the objects or the remainder of the composition, e.g. for nickel-based alloy, iron-based alloy.

Base Material
type: Class
label: Ausgangsmaterial @de
subclass of: Engineered Material
definition: This entity is used to describe the material that was taken as granted as such and used in the beginning of a process chain under consideration.

Biological
type: Class
label: Biologisch @de
subclass of: Material Property
definition: Biological is relating to biology or to life and living processes. Here specifically to the biological properties of a material.
definition: Biologisch bezieht sich auf die Biologie oder auf das Leben und lebende Prozesse. Hier speziell auf die biologischen Eigenschaften eines Materials. @de
definition source: “Biological.” Merriam-Webster.com Dictionary, Merriam-Webster, https://www.merriam-webster.com/dictionary/biological. Accessed 13 Jan. 2023.

Blank
type: Class
label: Rohling @de
subclass of: Engineered Material
definition: A piece of material prepared to be made into something by a further operation.
definition source: “Blank.” Merriam-Webster.com Dictionary, Merriam-Webster, https://www.merriam-webster.com/dictionary/blank. Accessed 25 Nov. 2022.

BondingType
type: Class
label: Bindungstyp @de
subclass of: Material Related
definition: Any of several forces, especially the ionic bond, covalent bond, and metallic bond, by which atoms or ions are bound in a molecule or crystal.
definition: Eine von mehreren Bindungen, insbesondere die Ionenbindung, die kovalente Bindung und die Metallbindung, durch die Atome oder Ionen in einem Molekül oder Kristall gebunden sind. @de
definition source: "Bond types.” American Heritage® Dictionary of the English Language, Fifth Edition, https://www.thefreedictionary.com/Bond+Types. Accessed 13 Jan. 2023.

Calibration Document
type: Class
label: Kalibrierschein @de
label: Kalibrierungsdokument @de
subclass of: Document
definition: Diese Entität beschreibt ein Dokument, welches Abweichungen eines Messgerätes oder einer Maßverkörperung gegenüber einem anderen Gerät oder einer anderen Maßverkörperung feststellt und dokumentiert. Typischerweise ist die Person, welche die Kalibrierung durchführte, angegeben. @de
definition: This entity describes a document used to state that a set of graduations to indicate values or positions has been performed. Typically, the calibration operator is included.
definition source: https://www.merriam-webster.com/dictionary/calibration

Calibration range
type: Class
label: Kalibrierbereich @de
subclass of: Value Object
definition: Diese Eigenschaft beschreibt den Bereich zwischen den Grenzen, innerhalb derer eine Größe gemessen, empfangen oder übertragen wird (typischerweise von einem Prozessknoten, z. B. einer Maschine), ausgedrückt durch die Angabe des unteren und oberen Bereichswertes. @de
definition: This property describes the region between the limits within which a quantity is measured, received or transmitted (typically by a process node, e.g. a machine), expressed by stating the lower and upper range values.

Caliper
type: Class
label: Messschieber @de
subclass of: Measuring Device
definition: any of various measuring instruments having two usually adjustable arms, legs, or jaws used especially to measure the dimensions of objects, such as diameters or thicknesses
definition: ein Messgerät mit zwei in der Regel verstellbaren Armen, Schenkeln oder Klemmbacken, das vor allem zur Messung der Abmessungen von Gegenständen, wie z. B. des Durchmessers oder der Dicke, verwendet wird @de
definition source: https://www.merriam-webster.com/dictionary/caliper

Chemical
type: Class
label: Chemisch @de
subclass of: Material Property
definition: Chemical is relating to, used in, or produced by chemistry or the phenomena of chemistry Here specifically to the chemical properties of a material.
definition: Chemisch ist ein Begriff, der sich auf die Chemie oder die chemischen Phänomene bezieht, in der Chemie verwendet wird oder durch sie erzeugt wird. Hier geht es speziell um die chemischen Eigenschaften eines Materials. @de
definition source: “Chemical.” Merriam-Webster.com Dictionary, Merriam-Webster, https://www.merriam-webster.com/dictionary/chemical. Accessed 13 Jan. 2023.

Chemical Composition
type: Class
label: Chemische Zusammensetzung @de
subclass of: Value Object
equivalent class: Restriction
  on property:
    inverse of: isPartOf
  some values from: Chemical Object
definition: Chemical composition refers to the arrangement, type, and ratio of atoms in molecules of chemical substances. Chemical composition varies when chemicals are added or subtracted from a substance, when the ratio of substances changes, or when other chemical changes occur in chemicals.
example: ex:proc1 a pmd:Process . ex:proc1 pmd:chacteristic ex:vo1 . ex:vo1 a ValueObject . ex:vo1 pmd:resource ex:chemComp1 . ex:chemComp1 a pmd:ChemicalComposition . ex:vo2 dcterm:partOf ex:chemComp1 . ex:vo2 a pmd:ChemicalElement . ex:vo2 pmd:relatesToElement CHEBI:28984 . ex:vo2 pmd:relatesTo ex:vo3 . pmd:MassFraction rdf:subClassOf ValueObject . ex:vo3 a pmd:MassFraction . ex:vo3 qudt:upperBound "0.3" . ex:vo3 qudt:lowerBound "0" . ex:vo3 qudt:unit qudt:PERCENT . ex:vo4 a pmd:MassFraction . ex:vo4 pmd:resource pmd:NotDetected .
definition source: https://chem.libretexts.org/Courses/College_of_Marin/CHEM_114%3A_Introductory_Chemistry/06%3A_Chemical_Composition

Chemical Object
type: Class
label: Chemisches Objekt @de
subclass of: Value Object
equivalent class: Class
  intersection of: Value Object
  intersection of: Restriction
    on property: relates to
    some values from: Chemical Entity
definition: Value object that describes the quantity (e.g. mass fraction) of a specific chemical object.

Circular
type: Class
label: Kreisförmig @de
subclass of: Shape
definition: Geformt wie ein Kreis. @de
definition: Having the form of a circle.
definition source: “Circular.” Merriam-Webster.com Dictionary, Merriam-Webster, https://www.merriam-webster.com/dictionary/circular. Accessed 13 Jan. 2023.

Clamping Pressure
type: Class
label: Klemmdruck @de
subclass of: Stress
definition: Diese Eigenschaft beschreibt als quantitativer Wert die Kraft pro Fläche (Druck), die beim Einbau einer Probe, eines Prüfkörpers oder eines Prüfstücks aufgebracht wird. Typischerweise ist das Aufbringen eines Klemmdrucks mit einer Art von Klemm- oder Spannzubehör (Grips) oder Ähnlichem verbunden. @de
definition: This property describes the force per area (pressure) that is used during the mounting process of a sample, specimen, or test piece as a quantitative value. Typically, this process involves some sort of grips or the like.

Classification Document
type: Class
label: Klassifzierungsdokument @de
subclass of: Document
definition: Diese Entität beschreibt ein Dokument, das dazu dient, den Arbeits- oder Anwendungsbereich eines Prozessknotens in Übereinstimmung mit genormten Abstufungen zu definieren. @de
definition: This entity describes a document used to define the working or application range of a process node in accordance with standardized graduations.

Coating Designation
type: Class
label: Beschichtungsbezeichnung @de
subclass of: Material Related
definition: Diese Eigenschaft ist ein Name oder Bezeichner eines Materialtyps, welcher den obersten Teil eines Bauteils (Beschichtung) bedeckt. @de
definition: This property is a name or identifier of a material type which designates the most upper part of a component (coating).

Collection Interface Hint
type: Class
label: Datenschnittstellenhinweis @de
subclass of: Node Info
definition: A label in support of identifying a network interface and/or address used by a process node to provide primary data stored in ontologies

Commission Time
type: Class
label: Kommissionszeit @de
subclass of: Time
definition: Date and time an order or plan has been dispatched at.

Component
type: Class
label: Komponente @de
subclass of: Object
definition: An object that serves a specific technical application. Constituent part of a compound of parts that builds a technical application

Computing Node
type: Class
label: Computerknoten @de
subclass of: Processing Node
definition: A computing system that provides an execution environment for, e.g., simulation processes or prediction models. A Computing Node can be virtual (e.g., a container or virtual machine) or physical (e.g., a bare-metal servers), uses digital represenations of objects as inputs and produces digital measurements, such as simulation results or predictions, as outputs.
definition: Ein Rechnersystem, das eine Ausführungsumgebung bspw. für Simulationsprozesse oder Vorhersagemodelle bereitstellt. Ein Rechenknoten kann virtuell (bspw. ein Container oder eine virtuelle Maschine) oder physisch (z. B. ein Bare-Metal-Server) ausgestaltet sein und verwendet in der Regel digitale Repräsentationen von Objekten als Eingaben und erzeugt digitale Messungen, wie z.B. Simulationsergebnisse oder Vorhersagen, als Ausgaben. @de

Conditioning Process
type: Class
label: Konditionierungsprozess @de
subclass of: Process
definition: Diese Aktivität beschreibt den Prozess und die Maßnahmen, die ergriffen werden, um einen materiellen Gegenstand auf vordefinierte Umgebungsbedingungen einzustellen. @de
definition: This activity describes the process of and the measures taken to set a tangible object to pre-defined environmental conditions.

Coordinates
type: Class
label: Koordinaten @de
subclass of: Value Object
definition: Any of a set of numbers used in specifying the location of a point on a line, on a surface, or in space.
definition source: “Coordinate.” Merriam-Webster.com Dictionary, Merriam-Webster, https://www.merriam-webster.com/dictionary/coordinate. Accessed 5 Dec. 2022.

Covalent Bond
type: Class
label: Kovalente Bindung @de
subclass of: BondingType
definition: Covalent bond is a chemical bond formed between atoms by the sharing of electrons.
definition: Eine kovalente Bindung ist eine chemische Verbindung zwischen Atomen, die durch die gemeinsame Nutzung von Elektronen entsteht. @de
definition source: "Covalent bond.” Merriam-Webster.com Dictionary, Merriam-Webster, https://www.merriam-webster.com/dictionary/covalent%20bond. Accessed 13 Jan. 2023.

Creep Stress
type: Class
label: Kriechspannung @de
subclass of: Stress
definition: Is the strain occuring with time, when a constant force is applied to a physical body.

Cross Section Area
type: Class
label: Querschnittsfläche @de
subclass of: Area
definition: Diese Eigenschaft beschreibt die Fläche eines Schnittes oder eines rechtwinklig geschnittenen oder gebrochenen Stücks eines Objektes in Bezug auf eine Achse. @de
definition: This property describes the area of a cutting or piece of an object cut off or broken at right angles or related to an axis.
definition source: https://www.merriam-webster.com/dictionary/cross%20section

Cross Section Determination
type: Class
label: Querschnittsermittlung @de
subclass of: Method
definition: Cross section is a cutting or piece of something cut off at right angles to an axis also : a representation of such a cutting.
example: Using the density of the test piece.
definition source: “Cross section.” Merriam-Webster.com Dictionary, Merriam-Webster, https://www.merriam-webster.com/dictionary/cross%20section. Accessed 24 Nov. 2022.

Crystalline Structure
type: Class
label: Kristalline Struktur @de
subclass of: Material Structure
definition: In crystallography, crystal structure is a description of the ordered arrangement of atoms, ions or molecules in a crystalline material. Ordered structures occur from the intrinsic nature of the constituent particles to form symmetric patterns that repeat along the principal directions of three-dimensional space in matter.
definition: In der Kristallographie ist die Kristallstruktur eine Beschreibung der geordneten Anordnung von Atomen, Ionen oder Molekülen in einem kristallinen Material. Geordnete Strukturen ergeben sich aus der intrinsischen Natur der konstituierenden Teilchen, die symmetrische Muster bilden, die sich entlang der Hauptrichtungen des dreidimensionalen Raums in der Materie wiederholen. @de
definition source: “Crystal structure.” Wikipedia The Free Encyclopedia, https://en.wikipedia.org/wiki/Crystal_structure. Accessed 13 Jan. 2023.

Data Acquisition Rate
type: Class
label: Datenerfassungsrate @de
subclass of: Value Object
definition: Diese Eigenschaft bezeichnet die Anzahl der Messungen / Abfragen pro Zeiteinheit bei einer betrachteten Messung einer Messgröße (Abtast-/Abfragerate bei der Datenerfassung). @de
definition: This property denotes the number of measurements / queries per time period for a considered measurement of a measurement parameter (sampling / query rate during data acquisition).

DataCite Metadata
type: Class
label: Data Cite Metadaten @de
subclass of: Value Object
definition: This value object refers to metadata which can be provided as DataCite element.
example: For example, to refer to a ISBN number, following triples might be created: :p1 a pmd:Process . :p1 pmd:characteristic :doc_vo1 . :doc_vo1 a pmd:Document . :doc_vo1 pmd:characteristic :isbn_vo1 . :doc_vo1 pmd:resource "http://example.org/book.pdf" . :isbn_vo1 a pmd:DataCiteMetadata . :isbn_vo1 pmd:relatesTo <http://purl.org/spar/datacite/isbn> . :isbn_vo1 pmd:value "9780262012423". "a document related to process :p1 has a ISBN number 9780262012423"

Data Scope
type: Class
label: Datenkategorie @de
subclass of: Entity
definition: This property is used to categorize data with respect to their intended usage in accordance with a regarded object or process.

Dataset
type: Class
comment: A collection of data published in one or more files. Usually instances of this class are also instances of DCAT dataset (see https://www.w3.org/TR/vocab-dcat-2/).
label: Datensatz @de
subclass of: Digital Entity

Date
type: Class
label: Datum @de
subclass of: Time
definition: A statement of the day of execution or making. Based on an the gregorian calender system.
definition: Eine Erklärung über den Tag der Ausführung oder Herstellung. Basierend auf dem gregorianischen Kalendersystem. @de

Demounting Process
type: Class
label: Demontageprozess @de
subclass of: Assembling Process
definition: This property is used to describe the process of removing or disassembling a test piece or specimen from a test machine. This may include the usage of other process nodes (e.g. grips).

Department
type: Class
label: Abteilung @de
subclass of: Organization
equivalent class: Class
  intersection of: Organization
  intersection of: Restriction
    on property: has role
    some values from: DepartmentRole
definition: A sub section of an organization [FIXME]

Description
type: Class
label: Beschreibung @de
subclass of: Value Object
definition: A descriptive text qualifying the nature of a thing (e.g. agent, activity, entity, object, ...).
definition: Ein beschreibender Text, der die Natur / Beschaffenheit / Informationen zu einer Entität qualifiziert (z.B. Aktivitäten, Entitäten, Objekten, ...). @de

Diameter
type: Class
label: Durchmesser @de
subclass of: Value Object
definition: The length of a straight line through the center of an object or space.
constraints: TesileTest
definition source: “Diameter.” Merriam-Webster.com Dictionary, Merriam-Webster, https://www.merriam-webster.com/dictionary/diameter. Accessed 5 Dec. 2022.

Digital Entity
type: Class
comment: Platform Material Digital Core Ontology (PMDco)
subclass of: Entity
definition: An entity with digital representation.

Digital Material Identifier
type: Class
subclass of: Identifier
equivalent class: Class
  intersection of: Identifier
  intersection of: Restriction
    on property: resource
    some values from: Digital Material Identifier
definition: The DigitalMaterialIdentifier value object refers to a dmi:DigitalMaterialIdentifier. A dmi:DigitalMaterialIdentifier is a resource identifier (IRI) that represents the specification of a material (in the sense of a material class) described in a specification document. The specification document can be, e.g., a standard, a datasheet, or any other citable document. Typically, a specification document requires some qualities that a material (in the sense of a portion of matter) has to comply with. Typical requirements include chemical compositions or physical properties.

Dimension Measuring Device
type: Class
label: Dimensionsmesswerkzeug @de
subclass of: Measuring Device
definition: Diese Entität beschreibt allgemein jedes Werkzeug, das für die Messung der Abmessungen eines greifbaren Objekts verwendet wird, z. B. eines Messschiebers. @de
definition: This entity generically describes any tool that is used for the measurement of the dimensions of a tangible object, e.g., a caliper.

Distance
type: Class
label: Abstand @de
subclass of: Value Object
definition: Spatial remoteness.
definition source: “Distance.” Merriam-Webster.com Dictionary, Merriam-Webster, https://www.merriam-webster.com/dictionary/distance. Accessed 5 Dec. 2022.

Document
type: Class
label: Dokument @de
subclass of: Value Object
definition: An original or official paper relied on as the basis, proof, or support of something
definition: Ein Original oder offizielles Papier, auf das man sich als Grundlage, Beweis oder Unterstützung von etwas stützt. @de
definition source: “Document.” Merriam-Webster.com Dictionary, Merriam-Webster, https://www.merriam-webster.com/dictionary/document. Accessed 16 Jan. 2023.

Duration
type: Class
label: Dauer @de
subclass of: Time
definition: A period of time with its own timescale and an epoch anchored in another timescale. A duration can be expressed via a single value as the first value of the period of time is always zero.
definition: Eine Zeitspanne mit einer eigenen Zeitskala und einer in einer anderen Zeitskala verankerten Epoche. Eine Dauer kann mit einem einzigen Wert ausgedrückt werden, da der erste Wert der Zeitspanne immer Null ist. @de

Electrical
type: Class
label: Elektrisch @de
subclass of: Material Property
definition: Electrical is relating to electricity or something that is powered by electricity. Here specifically to the electrical properties of a material.
definition: Elektrisch bezieht sich auf Elektrizität oder etwas, das mit Elektrizität betrieben wird. Hier speziell auf die elektrischen Eigenschaften eines Materials. @de
definition source: “Electric.” Merriam-Webster.com Dictionary, Merriam-Webster, https://www.merriam-webster.com/dictionary/electric. Accessed 13 Jan. 2023.

Electron Microscope
type: Class
label: Elektronenmikroskop @de
subclass of: Microscope
definition: An electron-optical instrument in which a beam of electrons is used to produce an enlarged image of a minute object.
definition source: “Electron microscope.” Merriam-Webster.com Dictionary, Merriam-Webster, https://www.merriam-webster.com/dictionary/electron%20microscope. Accessed 24 Nov. 2022.

Electron Microscopy
type: Class
label: Elektronenmikroskopie @de
subclass of: Microscopy Process
definition: Die Verwendung eines elektronenoptischen Instruments, bei dem ein Strahl beschleunigter Elektronen als Beleuchtungsquelle eingesetzt wird, um ein vergrößertes Bild eines kleinen Objekts zu erzeugen. @de
definition: The act of using an electron-optical instrument in which a beam of accelerated electrons as a source of illumination is applied to produce a magnified image of a tiny object.
definition source: “Electron microscope.” Merriam-Webster.com Dictionary, Merriam-Webster, https://www.merriam-webster.com/dictionary/electron%20microscope. Accessed 13 Jan. 2023.

Elliptical
type: Class
label: Elliptisch @de
subclass of: Shape
definition: Geformt wie eine Ellipse. @de
definition: Shaped like an ellipse.
definition source: “Elliptical.” Merriam-Webster.com Dictionary, Merriam-Webster, https://www.merriam-webster.com/dictionary/elliptical. Accessed 13 Jan. 2023.

End Time
type: Class
label: Endzeit @de
subclass of: Time
definition: The date and time when the plan/recipe is supposed to have been finished

Engineered Material
type: Class
subclass of: Object
definition: A material that is synthesized within a manufacturing process.
definition: Ein Material, das im Rahmen eines Herstellungsprozesses synthetisiert wird. @de

Environmental Temperature
type: Class
label: Umgebungstemperatur @de
subclass of: Temperature
definition: Diese Eigenschaft beschreibt die beobachtete Temperatur in der Umgebung eines betrachteten materiellen Objekts. Dazu können die Raumtemperatur und die in Prüfkammern gemessenen Temperaturen gehören. @de
definition: This property describes the observed temperature surrounding a tangible object considered. This may include room temperature and temperatures measured in test chambers.

Error Report Document
type: Class
label: Fehlerberichtdokument @de
subclass of: Document
definition: Diese Entität beschreibt ein Dokument, das Informationen über Fehler bereitstellt, die während der Anwendung eines Prozessknotens aufgetreten sind, wie z. B. eine Überschreitung des Arbeitsbereichs eines Messgeräts. @de
definition: This entity describes a document used to provide information on errors that occurred during the application of a process node, such as, e.g., an overshooting exceeding the working range of a measurement device.

Extension
type: Class
label: Verlängerung (der Extensometer-Messlänge) @de
subclass of: Value Object
definition: Dimensional analysis: L Unit (e.g. SI): mm
definition: Increase in the extensometer gauge length at any moment during the test
definition: Note: The extension might be measured using different channels (e.g. when using one or two extensometer channels); usually, the mean average value of involved channels is given as extension value, if applicable. Note: Optical extensometry may require a specific data storage method.
definition: Zunahme der Extensometer-Messlänge zu einem beliebigen Zeitpunkt des Versuchs @de
definition source: DIN EN ISO 6892-1:2019

Extensometer
type: Class
subclass of: Measuring Device
definition: An instrument for measuring minute deformations of test specimens caused by tension, compression, bending, or twisting.
definition source: “Extensometer.” Merriam-Webster.com Dictionary, Merriam-Webster, https://www.merriam-webster.com/dictionary/extensometer. Accessed 5 Dec. 2022.

Feret diameter
type: Class
label: Äquivalentdurchmesser @de
subclass of: Diameter
definition: The Feret diameter or Feret's diameter is a measure of an object size along a specified direction. In general, it can be defined as the distance between the two parallel planes restricting the object perpendicular to that direction. (cf. Wikipedia: https://en.wikipedia.org/wiki/Feret_diameter)

Filter
type: Class
subclass of: Algorithm
definition: A filter is a computer program or subroutine to process a stream, producing another stream. While a single filter can be used individually, they are frequently strung together to form a pipeline.
example: Smoothing algorithm
definition source: https://en.wikipedia.org/wiki/Filter_%28software%29

Force
type: Class
label: Kraft @de
subclass of: Value Object
definition: Strength or energy exerted or brought to bear : cause of motion or change : active power.
definition source: “Force.” Merriam-Webster.com Dictionary, Merriam-Webster, https://www.merriam-webster.com/dictionary/force. Accessed 5 Dec. 2022.

Furnace
type: Class
label: Ofen @de
subclass of: Processing Node
definition: An enclosed structure in which heat is produced (as for heating a house or for reducing ore).
definition: Eine geschlossene Struktur, in der Wärme erzeugt wird (z. B. zum Heizen eines Hauses oder zum Einschmelzen von Erz). @de
definition source: “Furnace.” Merriam-Webster.com Dictionary, Merriam-Webster, https://www.merriam-webster.com/dictionary/furnace. Accessed 13 Jan. 2023.

Furnace Characteristic
type: Class
label: Ofencharakteristik @de
subclass of: Value Object
equivalent class: Restriction
  on property: characteristic of
  some values from: Furnace
definition: Properties that describe the functions and capabilities of a heat treatment process node.

Geometry Changing Process
type: Class
subclass of: Process
definition: A process that is modifing the geometry of an object.

Grips
type: Class
label: Halterungsklemmen @de
subclass of: Processing Node
definition: Diese Entität beschreibt ein Bauelement / Teil, mit dem etwas, normalerweise ein materielles Objekt, fest gegriffen oder eingespannt wird. Typischerweise sind Halterungen, Klemm- bzw. Spannsysteme Teil eines Befestigungssystems (Prozessknoten), das sich auf ein Prüfsystem bezieht. @de
definition: This entity describes a part by which something, usually a tangible object, is grasped. Typically, grips are part of a mounting system (processing node) referring to a testing system.
definition source: https://www.merriam-webster.com/dictionary/grips

Grips Alignment
type: Class
label: Ausrichtung Der Halterungen @de
subclass of: Assembling Process
definition: Diese Eigenschaft beschreibt den Prozess der Ausrichtung von Halterungen, die zum Fest-/Einspannen eines materiellen Objekts, wie z. B. einer Probe, eines Prüfkörpers oder eines Prüfstücks, verwendet werden. Dieser Vorgang ist in der Regel Teil des Montageprozesses während der Prüfung, falls ein solcher durchgeführt wird. @de
definition: This property describes the process of forming in line of the grips used to grasp a tangible object, such as a sample, specimen, or test piece. This process is typically part of the mounting process during testing, if applicable.

Heat Capacity
type: Class
label: Wärmekapazität @de
subclass of: Furnace Characteristic
definition: Heat capacity or thermal capacity is a physical property of matter, defined as the amount of heat to be supplied to an object to produce a unit change in its temperature.
definition source: https://en.wikipedia.org/wiki/Heat_capacity

Heat Treatment Process
type: Class
label: Wärmebehandlung @de
subclass of: Conditioning Process
definition: The process of heat treatment means a defined temperature change and a holding to achieve a change in the microstructure, residual stresses, defect distribution or local chemical composition of a material.
definition: To treat (a material, such as metal) by heating and cooling in a way that will produce desired properties.
definition source: “Heat-treat.” Merriam-Webster.com Dictionary, Merriam-Webster, https://www.merriam-webster.com/dictionary/heat-treat. Accessed 24 Nov. 2022.

Hydrogen Bond
type: Class
label: Wasserstoffbindung @de
subclass of: BondingType
definition: Eine Wasserstoffbindung ist eine elektrostatische Anziehung zwischen einem Wasserstoffatom in einem polaren Molekül (z. B. Wasser) und einem kleinen elektronegativen Atom (z. B. Sauerstoff, Stickstoff oder Fluor) in einem anderen Molekül der gleichen oder einer anderen polaren Substanz. @de
definition: Hydrogen bond is an electrostatic attraction between a hydrogen atom in one polar molecule (as of water) and a small electronegative atom (as of oxygen, nitrogen, or fluorine) in usually another molecule of the same or a different polar substance.
definition source: "Hydrogen bond.” Merriam-Webster.com Dictionary, Merriam-Webster, https://www.merriam-webster.com/dictionary/hydrogen%20bond. Accessed 13 Jan. 2023.

Identifier
type: Class
label: Identifikator @de
subclass of: Value Object
definition: A named value intended to distinguish between entities.

Image
type: Class
label: Bild @de
subclass of: Digital Entity
definition: A visual representation of something
definition source: “Image.” Merriam-Webster.com Dictionary, Merriam-Webster, https://www.merriam-webster.com/dictionary/image. Accessed 25 Nov. 2022.

Index
type: Class
subclass of: Value Object
definition: Some running number.

Initiator
type: Class
equivalent class: Class
  intersection of: Person
  intersection of: Restriction
    on property: has role
    some values from: InitiatorRole
definition: The person that commisioned the process.

Insert Surface
type: Class
label: Oberfläche Eines Einsatzstücks @de
subclass of: Qualifying Node Annotation
definition: Diese Entität beschreibt den Zustand und die Qualität des Außenbereichs des Einsatzes eines Prozessknotens, z. B. die in Klemm- und Spannsystemen verwendeten Einsätze. @de
definition: This entity describes the state and quality of the exterior of the insert of a processing node, e.g., the inserts used in grips.
definition source: https://www.merriam-webster.com/dictionary/surface

Inspection Document
type: Class
label: Inspektionsdokument @de
subclass of: Document
definition: Diese Entität beschreibt ein Dokument, das Informationen über die Prüfung eines materiellen Objekts enthält, in der Regel versehen mit einem Prüfungsdatum, einem typischen Prüfungsintervall und dem Zustand des geprüften Objekts. Typischerweise wird ein solches Dokument für Prozessknoten verwendet. @de
definition: This entity describes a document used to give information on the examination of a tangible object, usually including an examination date, a typical examination interval and the state of the examined object. Typically, this is used for processing nodes.

Ionic Bond
type: Class
label: Ionische Bindung @de
subclass of: BondingType
definition: Eine Ionenbindung ist eine chemische Bindung, die zwischen entgegengesetzt geladenen Stoffen aufgrund ihrer gegenseitigen elektrostatischen Anziehung entsteht. @de
definition: Ionic bond is a chemical bond formed between oppositely charged species because of their mutual electrostatic attraction.
definition source: "Ionic bond.” Merriam-Webster.com Dictionary, Merriam-Webster, https://www.merriam-webster.com/dictionary/ionic%20bond. Accessed 13 Jan. 2023.

Laboratory
type: Class
label: Labor @de
subclass of: Organization
equivalent class: Class
  intersection of: Organization
  intersection of: Restriction
    on property: has role
    some values from: LaboratoryRole
definition: A place equipped for experimental study in a science or for testing and analysis.
definition source: “Laboratory.” Merriam-Webster.com Dictionary, Merriam-Webster, https://www.merriam-webster.com/dictionary/laboratory. Accessed 24 Nov. 2022.

Length
type: Class
label: Länge @de
subclass of: Value Object
definition: A measured distance or dimension of an object, usually the longer or longest dimension of the object.
definition: Eine gemessene Entfernung oder Abmessung eines Objekts, normalerweise die längere oder längste Abmessung des Objekts. @de
definition source: https://www.merriam-webster.com/dictionary/length

Length Changing Process
type: Class
subclass of: Geometry Changing Process
definition: A process which changes the length characteristic of an object. This class is used as an example of SWRL based reasoning. An instance belongs to the class if there are two embracing processes (previous and next) that determine different values after a length measurement (see SWRL rule).

Load Cell
type: Class
label: Kraftmessdose @de
subclass of: Processing Node
definition: A load cell converts a force such as tension, compression, pressure, or torque into an electrical signal that can be measured and standardized. It is a force transducer. As the force applied to the load cell increases, the electrical signal changes proportionally. The most common types of load cell are pneumatic, hydraulic, and strain gauges.
definition source: https://en.wikipedia.org/wiki/Load_cell

Load cell capacity
type: Class
subclass of: Value Object
subclass of: Restriction
  on property: characteristic of
  some values from: Load Cell

Location
type: Class
label: Ort @de
subclass of: Value Object
definition: A position or site occupied or available for occupancy or marked by some distinguishing feature.
definition: Eine Position oder ein Ort, der besetzt ist oder besetzt werden kann oder durch ein bestimmtes Merkmal gekennzeichnet ist. @de
definition source: “Location.” Merriam-Webster.com Dictionary, Merriam-Webster, https://www.merriam-webster.com/dictionary/location. Accessed 17 Jan. 2023.

Magnetic
type: Class
label: Magnetisch @de
subclass of: Material Property
definition: Magnetic is relating relating to a magnet or to magnetism. Here specifically to the magnetic properties of a material.
definition: Magnetisch bezieht sich auf einen Magneten oder auf Magnetismus. Hier speziell auf die magnetischen Eigenschaften eines Materials. @de
definition source: “Magnetic.” Merriam-Webster.com Dictionary, Merriam-Webster, https://www.merriam-webster.com/dictionary/magnetic. Accessed 13 Jan. 2023.

Minor axis diameter
type: Class
label: Halbachsendurchmesser @de
subclass of: Diameter
definition: The shortest diameter of an ellipse.

Manufacturer
type: Class
label: Hersteller @de
equivalent class: Class
  intersection of: Organization
  intersection of: Restriction
    on property: has role
    some values from: ManufacturerRole
definition: Processing Node's manufacturer name, e.g.: "Ipsen", "UPC" or "Bosch"

Manufacturing Node
type: Class
label: Herstellungsknoten @de
subclass of: Processing Node
definition: A processing node that implements transformative processes as well as consumes and creates tangible objects and typically requires inputs In general but not necessarily, a manufacture node includes intrinsic analysis nodes that create corresponding measurements with respect to the process implemented by the manufacture node.

Manufacture Process
type: Class
label: Herstellungsprozess @de
subclass of: Process
definition: A process that is driven by the primary intent to transform objects A manufacture process is always a transformative process.

Mass Fraction
type: Class
label: Masse Anteil @de
subclass of: Fraction
definition: This value object describes one of several portions of the property of a body that is a measure of the amount of material it contains and causes it to have weight in a gravitational field.

Material Designation
type: Class
label: Materialbezeichnung @de
subclass of: Material Related
definition: It is a name or identifier of a material type. It designates a material. E.g. "steel", "aluminium", "wood", "plastic", "rubber".
editorial note: former "Material" : "It is a substance or mixture of substances that constitutes an object. represented by the sum of material properties and material structure"

Material Property
type: Class
label: Materialeigenschaft @de
subclass of: Material Related
definition: A materials property is an intensive property of a material, i.e., a physical property that does not depend on the amount of the material. These quantitative properties may be used as a metric by which the benefits of one material versus another can be compared, thereby aiding in materials selection.
definition: Eine Materialeigenschaft ist eine intensive Eigenschaft eines Materials, d. h. eine physikalische Eigenschaft, die nicht von der Menge des Materials abhängt. Diese quantitativen Eigenschaften können als Maßstab verwendet werden, um die Vorteile eines Materials mit denen eines anderen zu vergleichen und so die Materialauswahl zu erleichtern. @de
definition source: “List of materials properties.” Wikipedia The Free Encyclopedia, https://en.wikipedia.org/wiki/List_of_materials_properties. Accessed 13 Jan. 2023.

Material Quality
type: Class
label: Materialqualität @de
subclass of: Material Related
definition: i.e. Materialgüte @de

Material Related
type: Class
label: Materialbezug @de
subclass of: Value Object
definition: Diese Klasse dient der qualitativen und quantitativen Beschreibung eines Materials, indem sie Informationen über ein Material angibt, z. B. durch die Einbeziehung von Materialeigenschaften, Materialstruktur usw. @de
definition: This property is used to qualitatively and quantitatively describe a material by providing information on a material, e.g., by including material properties, material structure, etc.

Material Structure
type: Class
label: Materialstruktur @de
subclass of: Material Related
definition: Die relevante Struktur von Materialien hat je nach Material eine unterschiedliche Längenskala. Die Struktur und Zusammensetzung eines Materials kann durch Mikroskopie oder Spektroskopie bestimmt werden. @de
definition: The relevant structure of materials has a different length scale depending on the material. The structure and composition of a material can be determined by microscopy or spectroscopy.
definition source: “Material - Classification by structure.” Wikipedia The Free Encyclopedia, https://en.wikipedia.org/wiki/Material#Classification_by_structure. Accessed 13 Jan. 2023.

Measurement
type: Class
label: Messwert @de
subclass of: Value Scope
definition: Measurement is the quantification of attributes of an object or event, which can be used to compare with other objects or events.
definition source: https://en.wikipedia.org/wiki/Measurement

Measuring Device
type: Class
label: Messgerät @de
subclass of: Processing Node
definition: A processing node capable of determining a specific quality.

Measuring Process
type: Class
label: Messprozess @de
subclass of: Analysing Process
definition: A measurement process acquires data (usually expressed in numbers) by using tools.

Mechanical
type: Class
label: Mechanisch @de
subclass of: Material Property
definition: Mechanical is relating to, governed by, or in accordance with the principles of mechanics. Here specifically to the mechanical properties of a material.
definition: Mechanisch bedeutet, sich auf die Prinzipien der Mechanik zu beziehen, von ihnen beherrscht zu werden oder sie zu befolgen. Hier speziell auf die mechanischen Eigenschaften eines Materials. @de
definition source: “Mechanical.” Merriam-Webster.com Dictionary, Merriam-Webster, https://www.merriam-webster.com/dictionary/mechanical. Accessed 13 Jan. 2023.

Mechanical Testing Process
type: Class
label: Mechanischer Testprozess @de
subclass of: Analysing Process
definition: Determinization of a mechanical property.
definition source: “Mechanical test.” Merriam-Webster.com Dictionary, Merriam-Webster, https://www.merriam-webster.com/dictionary/mechanical%20test. Accessed 24 Nov. 2022.

Media Movement
type: Class
label: Medienbewegung @de
subclass of: Furnace Characteristic
definition: Displacement of media surrounding objects inside the system boundaries of a processing node.
example: Circulation of a gaseous media within the systems boundaries.

Medium
type: Class
subclass of: Object
definition: Substance that surrounds an object inside the system boundaries of a processing node.

Metadata
type: Class
label: Metadaten @de
subclass of: Data Scope
subclass of: Value Object
disjoint with: Primary Data
disjoint with: Secondary Data
definition: Attributes and additional data (provenance) concerning the factory, laboratory, the process system and the objects which allow the evaluation of the quality / reliability of the measurements and a systematic search task of a database.

Metallic Bond
type: Class
label: Metallbindung @de
subclass of: BondingType
definition: Metallic bond is the chemical bond typical of the metallic state and characterized by mobile valence electrons that hold the atoms together usually in crystal lattices and are responsible for the good electrical and heat conductivity of metals.
definition: Metallische Bindung ist die für den metallischen Zustand typische chemische Bindung, die durch bewegliche Valenzelektronen gekennzeichnet ist, die die Atome in der Regel in Kristallgittern zusammenhalten und für die gute elektrische und Wärmeleitfähigkeit von Metallen verantwortlich sind. @de
definition source: "Metallic bond.” Merriam-Webster.com Dictionary, Merriam-Webster, https://www.merriam-webster.com/dictionary/metallic%20bond. Accessed 13 Jan. 2023.

Method
type: Class
label: Methode @de
subclass of: Value Object
disjoint with: Process
definition: A way, technique, or process of or for doing something
definition source: “Method.” Merriam-Webster.com Dictionary, Merriam-Webster, https://www.merriam-webster.com/dictionary/method. Accessed 5 Dec. 2022.

Micrometer Gauge
type: Class
label: Bügelmessschraube @de
subclass of: Measuring Device
definition: Diese Entität beschreibt ein Werkzeug zur Durchführung präziser Messungen mit einer Spindel, die durch eine Feingewindeschraube bewegt wird. @de
definition: This entity describes a tool for making precise measurements having a spindle moved by a finely threaded screw.
definition source: https://www.merriam-webster.com/dictionary/micrometer%20caliper

Microscope
type: Class
label: Mikroskop @de
subclass of: Processing Node
definition: An optical instrument consisting of a lens or combination of lenses for making enlarged images of minute objects.
definition source: “Microscope.” Merriam-Webster.com Dictionary, Merriam-Webster, https://www.merriam-webster.com/dictionary/microscope. Accessed 5 Dec. 2022.

Microscopy Process
type: Class
label: Mikroskopie @de
subclass of: Analysing Process
definition: The use of or investigation with a microscope.
definition source: “Microscopy.” Merriam-Webster.com Dictionary, Merriam-Webster, https://www.merriam-webster.com/dictionary/microscopy. Accessed 24 Nov. 2022.

Major axis diameter
type: Class
label: Hauptachsendurchmesser @de
subclass of: Diameter
definition: The longest diameter of an ellipse.

Modulus Of Elasticity
type: Class
label: Elastizitätsmodul @de
subclass of: Value Object
alternative label: E-Modul @de
definition: Quotient der Änderung der Spannung ΔR und Änderung der prozentualen Dehnung Δe in dem untersuchten Bereich multipliziert mit 100 % Anmerkung: Es wird empfohlen, den Wert in GPa, gerundet auf 0,1 GPa, und nach ISO 80000-1 anzugeben. @de
definition: quotient of change of stress ΔR and change of percentage extension Δe in the range of evaluation, multiplied by 100 % Note: It is recommended to report the value in GPa rounded to the nearest 0.1 GPa and according to ISO 80000-1.
definition source: DIN EN ISO 6892-1:2019
symbol: E

Mounting Process
type: Class
label: Montageprozess @de
subclass of: Assembling Process
disjoint with: Temperature Changing Process
definition: This property is used to describe the process of installing, assembling oder otherwise incorporating a test piece or specimen into a test machine. This may include the usage of other processing nodes (e.g. grips).

Node Info
type: Class
label: Knoteninformation @de
subclass of: Value Object
definition: Descriptive values to specify a processing node.

Node Model
type: Class
label: Knotenmodell @de
subclass of: Node Info
definition: Processing Node short description, e.g. "Vacuum Furnace"

Node Name
type: Class
label: Knotenname @de
subclass of: Node Info
subclass of: Provided Identifier
definition: A human-generated identifier associated with a discernible, tangible or simulated entity intended to be unique in a given scope

Node Serial Number
type: Class
label: Knoten-Seriennummer @de
subclass of: Node Info
subclass of: Provided Identifier
definition: A unique identifier of a processing node, typically provided by the manufacturer (manufacturer serial number, s/n).

Node Series
type: Class
label: Serie @de
subclass of: Node Info
alternative label: Knotentyp @de
alternative label: Node Type
definition: Processing Node typename, e.g. "ProTherm500"

Node Version
type: Class
label: Knotenversion @de
subclass of: Node Info
definition: Processing Node Version Number, e.g. "2.24"

Non Transformative Analysis Process
type: Class
label: Nicht-transformativer Analyseprozess @de
subclass of: Analysing Process
disjoint with: Transformative Analysis Process
definition: An analysis process that is also a non-transformative process

Norm
type: Class
subclass of: Method
definition: An authoritative standard.
example: Technical standard issued by the German Institute for Standardisation Registered Association (Deutsches Institut für Normung e.V. - DIN)
definition source: “Norm.” Merriam-Webster.com Dictionary, Merriam-Webster, https://www.merriam-webster.com/dictionary/norm. Accessed 24 Nov. 2022.

Not Detected
type: Class
label: Nicht nachgewiesen @de
subclass of: Fraction
definition: Indicates that an chemical element has not been detected in a corresponding experiment.

Note
type: Class
label: Bemerkung @de
label: Notiz @de
subclass of: Value Object
definition: Additional information & knowledge for and by humans. Not expected to be parsable

Object
type: Class
label: Objekt @de
subclass of: Entity
definition: A discernable, tangible or simulated entity that is processed in a process by a processing node.

Operator
type: Class
equivalent class: Class
  intersection of: Person
  intersection of: Restriction
    on property: has role
    some values from: OperatorRole
definition: A person that operates a machine or device.
definition source: “Operator.” Merriam-Webster.com Dictionary, Merriam-Webster, https://www.merriam-webster.com/dictionary/operator. Accessed 24 Nov. 2022.

Optical
type: Class
label: Optisch @de
subclass of: Material Property
definition: Optical is relating to the science of optics. Here specifically to the optical properties of a material.
definition: Optisch bezieht sich auf die Wissenschaft der Optik. Hier speziell auf die optischen Eigenschaften eines Materials. @de
definition source: “Optical.” Merriam-Webster.com Dictionary, Merriam-Webster, https://www.merriam-webster.com/dictionary/optical. Accessed 13 Jan. 2023.

Optical Microscopy
type: Class
label: Optische Mikroskopie @de
subclass of: Microscopy Process
definition: A microscopy done with a microscope in which light rays are seen directly by the observer as distinguished from one (as an electron microscope) in which some transformation or system of indirect viewing is use.
definition source: “Optical microscope.” Merriam-Webster.com Dictionary, Merriam-Webster, https://www.merriam-webster.com/dictionary/optical%20microscope. Accessed 24 Nov. 2022.

Particle Number
type: Class
label: Partikelnummer @de
subclass of: Index
definition: Die Partikelnummer ermöglicht die eindeutige Zuordnung der gemessenen Eigenschaften zu einem bestimmten Partikel. @de
definition: The particle number enables the explicit assignment of measured properties to a specific particle.

Percentage Extension
type: Class
label: Extensometer-Dehnung @de
subclass of: Extension
alternative label: (engineering) strain
alternative label: technische Dehnung @de
definition: extension expressed as a percentage of the extensometer gauge length Note: The percentage extension is commonly called engineering strain.
definition: in Prozent angegebene Verlängerung der Extensometer-Messlänge Anmerkung: Die Extensometer-Dehnung wird oftmals auch als technische Dehnung bezeichnet. @de
definition source: DIN EN ISO 6892-1:2019

Perimeter
type: Class
label: Umfang @de
subclass of: Value Object
definition: Der Durchmesser einer zweidimensionalen Form. @de
definition: The perimeter of a two-dimensional shape is defined as the path or boundary that encloses the shape.

Pixel
type: Class
subclass of: Digital Entity
definition: Any of the small discrete elements that together constitute an image.
definition source: “Pixel.” Merriam-Webster.com Dictionary, Merriam-Webster, https://www.merriam-webster.com/dictionary/pixel. Accessed 1 Dec. 2022.

Pixel density
type: Class
label: Pixeldichte @de
subclass of: Value Object
definition: The pixel density of an electronic image device.

Pixel Per Nanometer
type: Unit
type: NamedIndividual
label: Pixel pro Nanometer @de
definition: Einheit der gezählten Pixel pro Nanometer. (Es handelt sich nicht um eine offizielle Einheit.) @de
definition: Unit of counted pixels per nanometer. (It is not an official unit.)

Pixel Unit
type: Unit
type: NamedIndividual
label: Pixeleinheit @de
definition: In der digitalen Bildgebung ist ein Pixel (abgekürzt px), ein Pel oder ein Bildelement das kleinste adressierbare Element in einem Rasterbild oder der kleinste Punkt in einem alle Punkte adressierbaren Anzeigegerät. Bei den meisten digitalen Anzeigegeräten sind Pixel das kleinste Element, das durch Software manipuliert werden kann. Hier wird es als eine Einheit von gezählten Pixeln bezeichnet. (Es handelt sich nicht um eine offiziell anerkannte Einheit.) @de
definition: In digital imaging, a pixel (abbreviated px), pel, or picture element is the smallest addressable element in a raster image, or the smallest point in an all points addressable display device. In most digital display devices, pixels are the smallest element that can be manipulated through software. Here it is referred to as a unit of counted pixels. (It is not an officially recognized unit).
definition source: “Pixel” Wikipedia The Free Encyclopedia, https://en.wikipedia.org/wiki/Pixel. Accessed 13 Jan. 2023.

Precision
type: Class
label: Genauigkeit @de
subclass of: Value Object
definition: Der Grad der Verfeinerung, mit dem eine Operation durchgeführt oder eine Messung angegeben wird. @de
definition: The degree of refinement with which an operation is performed or a measurement stated.
definition source: “Precision.” Merriam-Webster.com Dictionary, Merriam-Webster, https://www.merriam-webster.com/dictionary/precision. Accessed 13 Jan. 2023.

Primary Data
type: Class
label: Primärdaten @de
subclass of: Data Scope
disjoint with: Secondary Data
definition: Data acquired before / after a process either refering to the geometry of the object (e.g. ao, bo, do, au, bu, du, Lu) or as a register of the complete setup (e.g. sketches, photos or videos)
definition: Data directly acquired during a process by sensors (time, force, length, temperature)

Process
type: Class
label: Prozess @de
subclass of: Activity
definition: A series of actions or operations conducing to an end In PMD, a process is conducted via processing nodes and has a discernable duration as part of a workflow. A process consumes objects and parameters. A process potentially generates new objects and measurements. A process is either a transformative process or a non-transformative process with respect to objects processed via a processing node. There are primarily two types of distinguishable processes: manufacture process, analysis process. A process is a series of operations that are subordinate processes.

Process Description
type: Class
label: Prozessbeschreibung @de
subclass of: Description
equivalent class: Class
  intersection of: Description
  intersection of: Restriction
    on property: characteristic of
    some values from: Process
definition: A descriptive text qualifying the nature of a process instance used as an identifier that is not strictly intended to be unique, e.g. "1050°C30 840°C10/ÖL".
definition: A human readable order of steps. Might include additional information that likes sketches and notes.

Process Duration
type: Class
label: Prozessdauer @de
subclass of: Value Object
definition: A length of an interval of time in which a process is conducted.

Process Identifier
type: Class
label: Prozessidentifikator @de
subclass of: Identifier
equivalent class: Class
  intersection of: Identifier
  intersection of: Restriction
    on property: characteristic of
    some values from: Process
definition: A colloquial, human-generated, descriptive text qualifying the nature of a process instance used as an identifier that is not strictly intended to be unique, e.g. “1050°C30 840°C10/ÖL”.
definition: Ein umgangssprachlicher, von Menschen erstellter, beschreibender Text, der die Art einer Prozessinstanz qualifiziert, die als Kennung verwendet wird, die nicht unbedingt eindeutig sein muss, z.B. “1050°C30 840°C10/ÖL”. @de

Processing Node
type: Class
label: Prozessknoten @de
subclass of: Agent
definition: Processing nodes are tools, equipment and accessories as well as software that are relevant for the performance of processes, such as e.g. mechanical and chemical test as well as simulation, prediction, and machine learning. Accordingly, processing nodes may be machines, parts of machines, software applications as well as human extremities.
definition: Prozessknoten sind Werkzeuge, Geräte und Zubehör sowie Software, die für die Durchführung von Prozessen relevant sind, wie z. B. mechanische und chemische Tests sowie Simulationen, Vorhersagen und maschinelles Lernen. Dementsprechend können Prozessknoten Maschinen, Teile von Maschinen, Softwareanwendungen sowie menschliche Gliedmaßen sein. @de

Project
type: Class
label: Projekt @de
subclass of: Activity
definition: A series of goal-orientated (intent) activities and interactions to achieve a specific outcome.
definition: Eine Reihe von zielorientierten (absichtlichen) Aktivitäten und Interaktionen, um ein bestimmtes Ergebnis zu erzielen. @de

Project Identifier
type: Class
label: Projektidentifikator @de
subclass of: Identifier
equivalent class: Class
  intersection of: Identifier
  intersection of: Restriction
    on property: characteristic of
    some values from: Project
definition: A colloquial, human-generated, descriptive text qualifying the nature of a project.
definition: Ein umgangssprachlicher, von Menschen erstellter, beschreibender Text, der die Art eines Projekts qualifiziert. @de

Provided Identifier
type: Class
label: Bereitgestellter Identifikator @de
subclass of: Identifier
definition: A colloquial, human-generated descriptor.

Qualifying Node Annotation
type: Class
label: Qualifizierende Knotenannotation @de
subclass of: Node Info
definition: Description for Processing Node's utility, e.g. "Rear Vacuum Furnace Oil Quenching"

Radiological
type: Class
label: Radiologisch @de
subclass of: Material Property
definition: Radiological is relating to radiology. Here specifically to the radiological properties of a material.
definition: Radiologisch bezieht sich auf die Radiologie. Hier speziell auf die radiologischen Eigenschaften eines Materials. @de
definition source: “Radiological.” Merriam-Webster.com Dictionary, Merriam-Webster, https://www.merriam-webster.com/dictionary/radiological. Accessed 13 Jan. 2023.

Radius
type: Class
subclass of: Value Object
definition: A line segment extending from the center of a circle or sphere to the circumference or bounding surface.
definition source: “Radius.” Merriam-Webster.com Dictionary, Merriam-Webster, https://www.merriam-webster.com/dictionary/radius. Accessed 5 Dec. 2022.

Rectangular
type: Class
label: Rechteckig @de
subclass of: Shape
definition: Geformt wie ein Rechteck. @de
definition: Shaped like a rectangle.
definition source: “Rectangular.” Merriam-Webster.com Dictionary, Merriam-Webster, https://www.merriam-webster.com/dictionary/rectangular. Accessed 13 Jan. 2023.

Region of Interest
type: Class
label: Betrachteter Bereich @de
subclass of: Digital Entity
equivalent class: Class
  intersection of: Restriction
    on property: hasSelector
    some values from: Fragment Selector
  intersection of: Restriction
    on property: hasSource
    some values from: Image
definition: Some region of interest (ROI) in an image. Describe the ROI by use of Web Annotation Vocabulary (https://www.w3.org/TR/annotation-vocab/). The ROI is understood as the target of a (body-less) annotation. The web annotation model suggests the use of different fragment specifications (https://www.w3.org/TR/annotation-model/#fragment-selector), however we suggest to prefer media fragments (https://www.w3.org/TR/media-frags/).
example: :image1 a pmd:Image :roi1 a pmd:RegionOfInterest . :roi1 oa:hasSource :image1 ; oa:hasSelector [ a oa:FragmentSelector ; dcterms:conformsTo <http://www.w3.org/TR/media-frags/> ; rdf:value "xywh=160,120,320,240" ] ] .

Regression
type: Class
subclass of: Algorithm
definition: A functional relationship between two or more correlated variables that is often empirically determined from data and is used especially to predict values of one variable when given values of the others. Specifically : a function that yields the mean value of a random variable under the condition that one or more independent variables have specified values.
example: Regression of y on x is linear
definition source: “Regression.” Merriam-Webster.com Dictionary, Merriam-Webster, https://www.merriam-webster.com/dictionary/regression. Accessed 24 Nov. 2022.

Related Project Identifier
type: Class
label: Identifikation Eines Verbundenen Projektes @de
subclass of: Identifier
definition: Diese Eigenschaft beschreibt einen benannten Wert, der dazu dient, zwischen Projekten zu unterscheiden, die mit dem betrachteten Projekt in Relation stehen. Zwei in Relation stehende Projekte könnten zum Beispiel ein Messprojekt sein, das Teil eines Projekts mit einem breiteren Betrachtungsbereich ist. @de
definition: This property describes a named value intended to distinguish between projects that are related to the project considered. For instance, two related projects could be a measurement project that is part of project with a broader scope.

Retort Type
type: Class
label: Retortentyp @de
subclass of: Furnace Characteristic
definition: Geometry and and orientation of the inner system boundaries of the heat treatment processing node.

Roughness
type: Class
label: Oberflächenrauheit @de
subclass of: Value Object
definition: Die Oberflächenrauheit, oft abgekürzt als Rauheit, ist eine Komponente zur Beschreibung der Oberflächenbeschaffenheit (Oberflächentextur). Sie wird durch die Abweichungen in der Richtung des Normalenvektors einer realen Oberfläche von ihrer idealen Form quantifiziert. Sind diese Abweichungen groß, ist die Oberfläche rau (große Rauheit), sind sie klein, ist die Oberfläche glatt (geringe Rauheit). @de
definition: Surface roughness, often shortened to roughness, is a component of surface finish (surface texture). It is quantified by the deviations in the direction of the normal vector of a real surface from its ideal form. If these deviations are large, the surface is rough; if they are small, the surface is smooth.
definition source: https://en.wikipedia.org/wiki/Surface_roughness

Sample
type: Class
label: Probe @de
subclass of: Engineered Material
definition: Portion of material, usually selected from a larger quantity of material, collected and taken away for testing
definition source: ISO 18589-1:2019-11 (international standardization committee: ISO/TC 85/SC 2/WG 17)

Secondary Data
type: Class
label: Sekundärdaten @de
subclass of: Data Scope
definition: Characteristic values (e.g. test results) determined by equations or algorithms using primary data and metadata for a process

Semi Crystalline Structure
type: Class
label: Semikristalline Struktur @de
subclass of: Material Structure
definition: Feststoffe, die eine teilkristalline Struktur aufweisen, enthalten sowohl kristalline als auch amorphe Bereiche (Domänen). Kristalline Stoffe, die keine Einkristalle, sondern Polykristalle sind, werden nicht als teilkristallin bezeichnet, auch wenn sich zwischen den Kristalliten ein dünner amorpher Film befindet. @de
definition: Solid materials exhibiting a semi-crystalline structure contain both crystalline and amorphous sections (domains). Crystalline substances that are polycrystals rather than single crystals are not designated as semicrystalline, even if there is a thin amorphous film between the crystallites.

Sequence Number
type: Class
label: Sequenznummer @de
subclass of: Identifier
definition: Strict monotonically increasing integer that indicates the position in an ordered list.

Set Point
type: Class
label: Sollwert @de
subclass of: Value Scope
definition: In cybernetics and control theory, a setpoint (SP;[1] also set point) is the desired or target value for an essential variable, or process value (PV) of a control system.
definition: Sollwert bezeichnet allgemein den angestrebten Wert eines quantitativen Merkmales eines Systems, von dem der tatsächliche Istwert so wenig wie möglich abweichen soll. Der Sollwert wird von einem anderen System (z. B. Technik, Mensch) vorgegeben. @de
definition source: https://de.wikipedia.org/wiki/Sollwert
definition source: https://en.wikipedia.org/wiki/Setpoint_(control_system)

Shape
type: Class
label: Form @de
subclass of: Value Object
definition: Das sichtbare Ausstattungsmerkmal (räumliche Form oder Kontur) eines bestimmten Objektes oder einer Art von Objekt. @de
definition: The visible makeup characteristic (spatial form or contour) of a particular item or kind of item.
definition source: “Shape.” Merriam-Webster.com Dictionary, Merriam-Webster, https://www.merriam-webster.com/dictionary/shape. Accessed 13 Jan. 2023.

Simulation Node
type: Class
label: Simulationsknoten @de
subclass of: Computing Node
definition: A processing node that implements foo as well as consumes and creates simulation objects and parameters.

Simulation Process
type: Class
label: Simulationsprozess @de
subclass of: Process
definition: An analysis process that is used for a simulation

Slide
type: Class
label: Schlitten @de
subclass of: Processing Node
definition: A moving piece that is guided by a part along its path, providing the mount for objects.

Specimen
type: Class
label: Prüfling @de
subclass of: Sample
disjoint with: Test Piece
definition: An object designed for a specific analysis.

Specimen Name
type: Class
label: Prüfstück Name @de
subclass of: Identifier
equivalent class: Class
  intersection of: Identifier
  intersection of: Restriction
    on property: characteristic of
    some values from: Specimen
definition: Diese Eigenschaft beschreibt die Bezeichnung eines Prüfstücks, die in der Regel von Menschen als von Menschen lesbarer Identifikator vergeben wird. @de
definition: This property describes the designation of a specimen, usually given as human-readable identifier by humans. @de

Squared
type: Class
label: Quadratisch @de
subclass of: Shape
definition: Geformt mit vier gleichen Seiten und vier rechten Winkeln. @de
definition: Having four equal sides and four right angles.
definition source: “Square.” Merriam-Webster.com Dictionary, Merriam-Webster, https://www.merriam-webster.com/dictionary/square. Accessed 13 Jan. 2023.

Start Time
type: Class
label: Startzeit @de
subclass of: Time
definition: The date and time when the plan/recipe is supposed to be executed.

Stiffness
type: Class
label: Steifigkeit @de
subclass of: Value Object
definition: Die Steifigkeit ist das Maß, bis zu dem ein Objekt einer Verformung als Reaktion auf eine einwirkende Kraft widersteht. @de
definition: Stiffness is the extent to which an object resists deformation in response to an applied force.

Stress
type: Class
label: Spannung @de
subclass of: Value Object
equivalent class: Class
  intersection of: Restriction
    on property: relates to
    some values from: Area
  intersection of: Restriction
    on property: relates to
    some values from: Force
definition: At any moment during the test, force divided by the original cross-sectional area, S_o, of the test piece Note: Here, all references to stress are to engineering stress.
definition: Dimensional Analysis: ML*-1T*-2
definition: Kraft zu einem beliebigen Zeitpunkt während des Versuchs dividiert durch den Anfangsquerschnitt (S_o) der Probe Anmerkung: Mit dem Begriff Spannung ist hier die technische Spannung ('Ingenieur-Spannung') gemeint. @de
definition: Units: Pa (SI), psi
definition source: DIN EN ISO 6892-1:2019
symbol: R

Temperature
type: Class
label: Temperatur @de
subclass of: Value Object
definition: The degree of hotness or coldness measured on a definite scale.
definition source: “Temperature.” Merriam-Webster.com Dictionary, Merriam-Webster, https://www.merriam-webster.com/dictionary/temperature. Accessed 25 Nov. 2022.

Temperature Change Device
type: Class
label: Temperaturänderungswerkzeug @de
subclass of: Temperature Measuring Device
definition: Diese Entität beschreibt allgemein jedes Werkzeug, das zur Änderung und Einstellung der Temperatur eines materiellen Objekts oder der Umgebung verwendet wird, z. B. einen Ofen und Kühlmittel. @de
definition: This entity generically describes any tool that is used for the alteration and adjustment of the temperature of a tangible object or the environment, e.g., a furnace and cooling media.

Temperature Changing Process
type: Class
label: Temperaturänderungsprozess @de
subclass of: Conditioning Process
definition: This properpy is used to describe a process which is run to increase or decrease the temperature of an object or a space. Usually, this involves heating or cooling devices such as furnaces or cooling media.

Temperature Measuring Device
type: Class
label: Temperaturmesswerkzeug @de
subclass of: Measuring Device
definition: Diese Entität beschreibt allgemein jedes Werkzeug, das zur Messung der Temperatur eines materiellen Objekts oder der Umgebung verwendet wird, z. B. ein Thermoelement und Thermometer. @de
definition: This entity generically describes any tool that is used for the measurement of the temperature of a tangible object or the environment, e.g., a thermocouple and thermometers.

Test Piece
type: Class
label: Prüfkörper @de
subclass of: Sample
definition: Part of a sample with specified dimensions, machined or un-machined, brought to a required condition for submission to a given test.
definition: Teil einer Probe mit bestimmten Dimensionen, bearbeitet oder unbearbeitet, der in einen erforderlichen Zustand gebracht wird, um einer bestimmten Prüfung unterzogen zu werden. @de
definition source: EN 10021:2006-12 (European standardization committee: CEN/TC 459/SC 12/WG 4)

Test Piece Classification
type: Class
label: Prüfkörperklassifizierung @de
subclass of: Test Piece Info
definition: Diese Eigenschaft wird verwendet, um Informationen über einen Prüfkörper bezüglich seiner Einordnung gemäß entsprechender Normen zu liefern. @de
definition: This property is used to provide information on a test piece concerning its graduation in accordance with corresponding standards.

Test Piece Info
type: Class
label: Prüfkörperinformationen @de
subclass of: Value Object
definition: Diese Eigenschaft wird verwendet, um Informationen über einen Prüfkörper zu liefern, wie z. B. seine geometrische Form, seine Klassifizierung und andere Parameter, einschließlich von Spezifikationen und Nennwerte. Die Informationen werden in Bezug auf die entsprechenden Normen bereitgestellt. @de
definition: This property is used to provide information on a test piece such as its geometric shape, classification, and other parameters, including specifications and nominal values. The information is provided with respect to corresponding standards.

Test Piece Name
type: Class
label: Prüfkörpername @de
subclass of: Identifier
equivalent class: Class
  intersection of: Identifier
  intersection of: Restriction
    on property: characteristic of
    some values from: Test Piece
definition: Diese Eigenschaft beschreibt die Bezeichnung eines Prüfkörpers, die in der Regel als menschenlesbarer Identifikator von Menschen vergeben wird. @de
definition: This property describes the designation of a test piece, usually given as human-readable identifier by humans.

Testing Machine
type: Class
label: Prüfmaschine @de
subclass of: Processing Node
definition: Diese Entität beschreibt einen Prozessknoten, der für die Durchführung eines bestimmten Tests verwendet wird. Eine Prüfmaschine kann technisch komplex sein und aus mehreren Teilen bestehen. @de
definition: This entity describes a processing node that is used to perform a defined test. A testing machine may be technically complex and contain several parts.

Testing Rate
type: Class
label: Prüfgeschwindigkeit @de
subclass of: Value Object
definition: rate (resp. rates) used during the test
definition: während des Versuchs verwendete Geschwindigkeit(en) @de
definition source: DIN EN ISO 6892-1:2019

Thermal
type: Class
label: Thermisch @de
subclass of: Material Property
definition: Thermal is relating to, or caused by heat. Here specifically to the thermal properties of a material.
definition: Thermisch bedeutet in Bezug auf oder verursacht durch Wärme. Hier speziell auf die thermischen Eigenschaften eines Materials. @de
definition source: “Thermal.” Merriam-Webster.com Dictionary, Merriam-Webster, https://www.merriam-webster.com/dictionary/thermal. Accessed 13 Jan. 2023.

Thermal Insulation
type: Class
label: Thermische Isolierung @de
subclass of: Furnace Characteristic
definition: Thermal insulation is the reduction of heat transfer (i.e., the transfer of thermal energy between objects of differing temperature) between objects in thermal contact or in range of radiative influence. Thermal insulation can be achieved with specially engineered methods or processes, as well as with suitable object shapes and materials.
definition source: https://en.wikipedia.org/wiki/Thermal_insulation

Thermocouple
type: Class
label: Thermoelement @de
subclass of: Measuring Device
definition: A device for measuring temperature in which a pair of wires of dissimilar metals (such as copper and iron) are joined and the free ends of the wires are connected to an instrument (such as a voltmeter) that measures the difference in potential created at the junction of the two metals.
definition: Ein Gerät zur Temperaturmessung, bei dem ein Paar Drähte aus unterschiedlichen Metallen (z. B. Kupfer und Eisen) verbunden und die freien Enden der Drähte mit einem Instrument (z. B. einem Voltmeter) verbunden werden, das die an der Verbindungsstelle erzeugte der beiden Metalle Potentialdifferenz misst . @de
definition source: “Thermocouple.” Merriam-Webster.com Dictionary, Merriam-Webster, https://www.merriam-webster.com/dictionary/thermocouple. Accessed 13 Jan. 2023.

Thickness
type: Class
label: Dicke @de
subclass of: Value Object
definition: Diese Entität beschreibt die gemessene Dimension in einer Richtung eines Prüfstücks. @de
definition: This entity describes the measured dimension in one direction of a test piece.

Time
type: Class
label: Zeit @de
subclass of: Value Object
definition: A nonspatial continuum that is measured in terms of events which succeed one another from past through present to future.
definition source: “Time.” Merriam-Webster.com Dictionary, Merriam-Webster, https://www.merriam-webster.com/dictionary/time. Accessed 25 Nov. 2022.

Transformative Analysis Process
type: Class
label: Transformativer Analyseprozess @de
subclass of: Analysing Process
definition: An analysis process that is also a transformative process

Value Object
type: Class
label: Wertobjekt @de
subclass of: Entity
equivalent class: Class
  union of: Metadata
  union of: Class
    intersection of: Class
      union of: Measurement
      union of: Set Point
    intersection of: Class
      union of: Primary Data
      union of: Secondary Data
definition: A :ValueObject is a simple entity which represents a specific value. This value can be a numerical, textual, or a more complex data structure. If a literal value is to be specified, the :value datatype property has to be used. In cases where the value is represented by a resource (e.g. URI), the :resource object property has to be used. A value object, respectively its value, is always associated with an entity of type :Process, :ProcessingNode, or :Object (e.g. :Specimen). The value is meant to be a charactaristic of the associated entity. To express this association it is indended to use the :participant object property. A value object might also refer to a certain unit. The :unit property might be used (e.g. with QUDT ontology). Instances of a value object might be specified as a specific Parameter, namely a SetPoint (nominal value), or Measurement. With :Setpoint the intend is to express, that the value is meant to be some preset, setting or nominal value. :Measurement expresses, that the value has been measured or determined somehow (see example). Instances of a value object might also be specified in a specific DataScope (:Metadata, :PrimaryData, :SecondaryData).
example: - the length of a specimen - the model number of a machine - a person involved in a process - a force on an object
example: :Length rdfs:subClass :ValueObject . ex:vo1 a :Length . ex:vo1 a :Measurement . ex:vo1 a :PrimaryData . ex:vo1 :unit qudt:MilliM . ex:vo1 :value "123.45" ex:p1 a :LengthMeasuringProcess . ex:p1 :characteristic ex:vo1 .
example: The length of a specimen, which has been measured as primary data. Its actual value is 123.45 millimeters.

Value Scope
type: Class
label: Wertekategorie @de
subclass of: Entity
definition: Any of a set of physical properties whose values determine the characteristics or behavior of something.
definition source: “Parameter.” Merriam-Webster.com Dictionary, Merriam-Webster, https://www.merriam-webster.com/dictionary/parameter. Accessed 25 Nov. 2022.

Vanderwaals Bond
type: Class
label: Van der Waals Bindung @de
subclass of: BondingType
definition: Die Van-der-Waals-Bindung ist durch die relativ schwachen Anziehungskräfte gegeben, die auf neutrale Atome und Moleküle wirken und die aufgrund der elektrischen Polarisierung entstehen, die in jedem der Teilchen durch die Anwesenheit anderer Teilchen induziert wird. @de
definition: Van der Waals bond is given by the relatively weak attractive forces that act on neutral atoms and molecules and that arise because of the electric polarization induced in each of the particles by the presence of other particles.
definition source: “Van der Waals forces.” Merriam-Webster.com Dictionary, Merriam-Webster, https://www.merriam-webster.com/dictionary/van%20der%20Waals%20forces. Accessed 13 Jan. 2023.

Volume Fraction
type: Class
label: Volumen Anteil @de
subclass of: Fraction
definition: This value object describes one of several portions of the property of a body that is a measure of the amount of material it contains and causes it to have volume.

Voxel
type: Class
subclass of: Digital Entity
definition: An element representing a value on a grid in three dimensional space. In PMD, an infinitesimal part of an object which is made of a homogenuous material. Size depends on the observed material level. For now, geometrically, a cubus is assumed. Made of a material Different Voxels can have different material properties and material structure A (partial) logical object that describes (a part of) a physical object

Weight
type: Class
label: Gewicht @de
subclass of: Value Object
definition: The force with which a body is attracted toward the earth or a celestial body by gravitation and which is equal to the product of the mass and the local gravitational acceleration.
definition source: “Weight.” Merriam-Webster.com Dictionary, Merriam-Webster, https://www.merriam-webster.com/dictionary/weight. Accessed 5 Dec. 2022.

Weighted X coordinate
type: Class
label: Gewichtete X Koordinate @de
subclass of: X Coordinate
definition: Mass center of grey values in one direction

Weighted Y coordinate
type: Class
label: Gewichtete Y Koordinate @de
subclass of: Y Coordinate
definition: Mass center of grey values in the other direction

Width
type: Class
label: Breite @de
subclass of: Value Object
definition: Diese Entität bezeichnet eine horizontale Messung, die im rechten Winkel zur Länge eines Objekts vorgenommen wird. @de
definition: This entity describes a horizontal measurement of an object taken at right angles to the length of the object.
definition source: https://www.merriam-webster.com/dictionary/width

Working Range
type: Class
label: Arbeitsbereich @de
subclass of: Value Object
equivalent class: Restriction
  on property: from value
  some values from: Literal
equivalent class: Restriction
  on property: to value
  some values from: Literal
definition: Diese Eigenschaft beschreibt den Bereich zwischen den Grenzen, innerhalb derer ein Prozessknoten (z. B. eine Maschine) für ihren vorgesehenen Zweck verwendet werden kann, ausgedrückt durch die Angabe der in Rede stehenden unteren und oberen Bereichswerte. @de
definition: This property describes the region between the limits within which a processing node (e.g., a machine) is capable of being used for its intended purpose, expressed by stating the lower and upper range values of interest.

X Coordinate
type: Class
label: X Korrdinate @de
subclass of: 2D Pixel Coordinates
definition: Die X-Koordinate ist eine Koordinate, deren Wert durch Messung parallel zu einer X-Achse bestimmt wird. @de
definition: X-coordinate is a coordinate whose value is determined by measuring parallel to an x-axis.
definition source: “X-coordinate.” Merriam-Webster.com Dictionary, Merriam-Webster, https://www.merriam-webster.com/dictionary/x-coordinate. Accessed 13 Jan. 2023.

Y Coordinate
type: Class
label: Y Koordinate @de
subclass of: 2D Pixel Coordinates
definition: Die Y-Koordinate ist eine Koordinate, deren Wert durch Messung parallel zu einer Y-Achse bestimmt wird. @de
definition: Y-coordinate is a coordinate whose value is determined by measuring parallel to a y-axis.
definition source: “Y-coordinate.” Merriam-Webster.com Dictionary, Merriam-Webster, https://www.merriam-webster.com/dictionary/y-coordinate. Accessed 13 Jan. 2023.

belongsToProject
type: ObjectProperty
comment: Association between a process and a project.
comment: belongs to process
domain: Process
range: Project
sub property of: wasInformedBy
inverse of: process

characteristic
type: ObjectProperty
domain: Class
  union of: Digital Entity
  union of: Object
  union of: Process
  union of: Processing Node
  union of: Project
  union of: Value Object
range: Value Object
sub property of: topObjectProperty
inverse of: characteristic of
alternative label: has characteristic

characteristic of
type: ObjectProperty
sub property of: topObjectProperty
alternative label: is characteristic of

component
type: ObjectProperty
domain: Processing Node
range: Processing Node
alternative label: has component
definition: An object property associating a process node with its (potentially modular) components, e.g. the chambers of a heat treatment furnace.

composed of
type: ObjectProperty
inverse of: composes
definition: This property is used to describe which voxels and materials an object is composed of.

composes
type: ObjectProperty
domain: Object
range: Object
definition: This property is used to describe which objects a voxel or a material contributes to compose.

definitionSource
type: AnnotationProperty
definition: Indicates the source of the definition.

executed by
type: ObjectProperty
domain: Process
range: Processing Node
sub property of: wasAssociatedWith
inverse of: executes
definition: This property represents which process is executed by which process node.

executes
type: ObjectProperty
domain: Processing Node
range: Process
definition: This property represents which process node executes a process

fragment path
type: DatatypeProperty
sub property of: topDataProperty
definition: A path expression that addresses a specific element in a document.

from value
type: DatatypeProperty
sub property of: value
definition: refers to the begin of a value range

input
type: ObjectProperty
sub property of: used
sub property of: participant
inverse of: input of
alternative label: has input
definition: This property is used to link the processes to their input objects

input of
type: ObjectProperty
sub property of: wasUsedBy
sub property of: participant of
alternative label: is input of

is resource of
type: ObjectProperty
inverse of: resource

json path
type: DatatypeProperty
sub property of: fragment path
definition: A path expression that allows the elements of a JSON document to be specifically addressed.

max value
type: DatatypeProperty
sub property of: value
definition: refers to all values equal or smaller than the given one

min value
type: DatatypeProperty
sub property of: value
definition: refers to all values equal or larger than the given one

next process
type: ObjectProperty
domain: Process
range: Process
sub property of: wasInformedBy
inverse of: previous process
alternative label: has next process
definition: This property is used to indicate the process that was run after the current process.

output
type: ObjectProperty
sub property of: generated
sub property of: participant
inverse of: output of
alternative label: has output
definition: This property is used to link the processes to their output objects

output of
type: ObjectProperty
sub property of: participant of
alternative label: is output of

participant
type: ObjectProperty
domain: Process
range: Class
  union of: Digital Entity
  union of: Object
  union of: Value Object
inverse of: participant of
alternative label: has participant
definition: A relation between a process and an object, in which the objects is somehow involved in the process.

participant of
type: ObjectProperty
sub property of: topObjectProperty
alternative label: is participant of

previous process
type: ObjectProperty
domain: Process
range: Process
alternative label: has previous process
definition: This property is used to indicate that which process was previously run.

process
type: ObjectProperty
comment: Describes that a process is associated with a project.
domain: Project
range: Process
alternative label: has process

relates to
type: ObjectProperty
domain: Value Object
definition: Describes a general relationship between domain objects.

relates to element
type: ObjectProperty
domain: Chemical Object
range: Chemical Entity
sub property of: relates to

resource
type: FunctionalProperty
type: ObjectProperty
domain: Value Object
alternative label: has resource

state
type: ObjectProperty
domain: Class
  union of: Specimen
  union of: Test Piece

subordinate process
type: ObjectProperty
domain: Process
range: Process
inverse of: superordinate process
alternative label: has subordinate process
definition: This property is used to link a process to its subordinate processes.

superordinate process
type: ObjectProperty
sub property of: topObjectProperty
alternative label: has superordinate process
definition: This property is used to link a process to its super ordinated processes.

to value
type: DatatypeProperty
sub property of: value
definition: refers to the end of a value range

unit
type: ObjectProperty
domain: Value Object
alternative label: has unit
definition: Unit of measurement. Examples for rdsf:range are units from qudt or wikidata or own defindes units.

value
type: DatatypeProperty
domain: Value Object
label: hat Wert @de
range: Literal
sub property of: topDataProperty
definition: Provides the actual value a value object is referring to.

x path
type: DatatypeProperty
sub property of: fragment path
definition: A non-XML-based path expression that allows the elements of an XML document to be specifically addressed.

S2
is rule enabled: true
type: Imp
body: IndividualPropertyAtom
  argument1: p1
  argument2: o2
  property predicate: output
body: IndividualPropertyAtom
  argument1: p1
  argument2: o1
  property predicate: input
body: ClassAtom
  argument1: p1
  class predicate: Process
head: IndividualPropertyAtom
  argument1: o2
  argument2: o1
  property predicate: wasDerivedFrom

S1
is rule enabled: true
type: Imp
comment: Detect processes which changes the length of object.
body: DatavaluedPropertyAtom
  argument1: l1
  argument2: v1
  property predicate: value
body: DatavaluedPropertyAtom
  argument1: l2
  argument2: v2
  property predicate: value
body: IndividualPropertyAtom
  argument1: p2
  argument2: o2
  property predicate: input
body: IndividualPropertyAtom
  argument1: p3
  argument2: o3
  property predicate: input
body: ClassAtom
  argument1: o3
  class predicate: Object
body: ClassAtom
  argument1: o2
  class predicate: Object
body: IndividualPropertyAtom
  argument1: p1
  argument2: l1
  property predicate: characteristic
body: IndividualPropertyAtom
  argument1: p3
  argument2: l2
  property predicate: characteristic
body: ClassAtom
  argument1: p3
  class predicate: Process
body: ClassAtom
  argument1: l1
  class predicate: Length
body: IndividualPropertyAtom
  argument1: p1
  argument2: o2
  property predicate: output
body: IndividualPropertyAtom
  argument1: p2
  argument2: o3
  property predicate: output
body: BuiltinAtom
  arguments: v1
  arguments: v2
  builtin: notEqual
body: ClassAtom
  argument1: p1
  class predicate: Process
body: ClassAtom
  argument1: p2
  class predicate: Process
body: ClassAtom
  argument1: l2
  class predicate: Length
head: ClassAtom
  argument1: p2
  class predicate: Length Changing Process