SEO, The Scientific Events Ontology.
type: Ontology
imports: ontology
imports: conference-ontology.owl
imports: http://xmlns.com/foaf/0.1/
version info: 1.1
creator: Soeren Auer
creator: Said Fathalla
preferred namespace prefix: seo
label: Scientific Events Ontology
last modified: 2019-04-10
creator: Sahar Vahdati
see also: See also documentation at http://kddste.sda.tech/SEOontology/Documentation/SEO.html
preferred namespace uri: http://purl.org/seo/
description: SEO is a reference ontology for modelling data about scientific events such as conferences, symposioums and workshops.
created: 2018-02-01
creator: Christoph Lange
license: http://creativecommons.org/licenses/by/3.0/

belongsToSeries
type: ObjectProperty
inverse of: hasEvent
domain: OrganisedEvent
range: EventSeries
comment: This property shows the series which an event belongs to.

colocatedWith
type: ObjectProperty
type: SymmetricProperty
domain: OrganisedEvent
range: OrganisedEvent
comment: This property links an event to another one which is co-located with.

hasEvent
type: ObjectProperty
domain: EventSeries
range: OrganisedEvent
comment: an event series has an event edition

hasPublisher
type: ObjectProperty
inverse of: isPublisherOf
domain: Class
  union of: AcademicEvent
  union of: Proceedings
range: Publisher
comment: This propoerty shows the publisher of a proceedings.

hasSponsor
type: ObjectProperty
inverse of: isSponsorOf
domain: OrganisedEvent
range: Sponsor
comment: This propoerty shows the sponsor of an event.

hasTrack
type: ObjectProperty
inverse of: isTrackOf
domain: AcademicEvent
range: Track
comment: This propoerty shows the available tracks of an event.

abstractDeadline
type: DatatypeProperty
domain: AcademicEvent
range: date
comment: The deadline of abstract submission.

acceptanceRate
type: DatatypeProperty
domain: AcademicEvent
range: decimal
comment: The acceptance rate of the event in a particular year.

acceptedPapers
type: DatatypeProperty
domain: AcademicEvent
range: unsignedInt
comment: The number of accepted papers in the event.

eventWebsite
type: DatatypeProperty
domain: AcademicEvent
range: anyURI
comment: The webpage of the event.

hasTwitter
type: DatatypeProperty
domain: EventSeries
range: anyURI
comment: The twitter account of the event.

Paper Acceptance Notification
type: DatatypeProperty
domain: AcademicEvent
range: date
comment: The date of the paper acceptance notification.

submissionDeadline
type: DatatypeProperty
domain: AcademicEvent
range: date
comment: The deadline of paper submission.

submissionWebPage
type: DatatypeProperty
domain: OrganisedEvent
range: anyURI
comment: The webpage of the submission to event.

submittedPapers
type: DatatypeProperty
domain: AcademicEvent
range: unsignedInt
comment: The number of submitted papers to the event.

Agent
type: Class
type: NamedIndividual
type: AgentClass
comment: A resource that acts or has the power to act.
issued: 2008-01-14
description: Examples of Agent include person, organization, and software agent.
has version: Agent-001

Publication
type: Class
description: an article issued for public sale

Author
type: Class
subclass of: Person
comment: The one who write the article.

Author registration
type: Class
comment: At least one of the authors must register at the full rate in order for the paper to be published in the Proceedings.

Award
type: Class
comment: A price for the highest quality research.

Best applications paper award
type: Class
subclass of: Best paper award
comment: This award for the best application paper presented.

Best paper award
type: Class
subclass of: Award
comment: This award recognizes the best paper presented.

Best poster award
type: Class
subclass of: Award
comment: This award highlight good quality posters presented.

Best student paper award
type: Class
subclass of: Best paper award
comment: This award recognizes the best paper authored primarily by a student and presented by the student.

Bronze sponsorship
type: Class
subclass of: Sponsorship
comment: A Sponsorship Package.

Chair
type: Class
subclass of: Person
comment: The Chair person must ensure that the Management Committee functions properly, that there is full participation during meetings, that all relevant matters are discussed and that effective decisions are made and carried out.

Challenge track
type: Class
subclass of: Track
comment: The idea of the challenge track is to provide participants with a set of case studies and challenge the state of the art.

Demo chair
type: Class
subclass of: Chair
comment: A person responsible for assembling the system demonstration papers to be presented in the main conference program.

Demos track
type: Class
subclass of: Track
comment: Offer an opportunity for presenting late-breaking research results, on-going research projects, and speculative or innovative work in progress.

Doctoral consortium
type: Class
subclass of: AcademicEvent
comment: Provide PhD students an opportunity to share and develop their research ideas in a critical but supportive environment.

Doctoral consortium chair
type: Class
subclass of: Chair
comment: The event member who leads the doctoral consortium.

Early bird registration
type: Class
subclass of: Registration
disjoint with: Late registration
comment: Registration before a specific date.

Event reception
type: Class
subclass of: SocialEvent
comment: The reception event within a scientific event .

Flyer
type: Class
comment: An announcement or advertisement that is printed on a sheet of paper and given to people.

General chair
type: Class
subclass of: Chair
comment: A person responsible for overseeing and coordinating the whole conference. .

Get together event
type: Class
subclass of: SocialEvent
comment: Socially gather two or more people in one event .

Gold sponsorship
type: Class
subclass of: Sponsorship
comment: Sponsorship Package.

Honor chair
type: Class
subclass of: Chair
comment: Chair of the conference .

Important dates
type: Class
comment: Important dates to be noticed such as, abstract deadline, submission deadline, ...etc .

In-use track
type: Class
subclass of: Track
comment: In-Use track provides researchers to discuss novel research taken to the market.

Industrial conference
type: Class
subclass of: NonAcademicEvent
comment: A business conference is held for people working in the same company or industry.

Industry track
type: Class
subclass of: Track
comment: The industry track seeks to present research contributions in industrial settings.

Invited speakers
type: Class
subclass of: Person
comment: Invited person to give a speech in an event.

Keynote speech
type: Class
comment: A talk that establishes a main underlying the theme of the event.

Keynote speaker
type: Class
subclass of: Invited speakers
comment: Someone who gives the main address at a formal gathering such as a conference .

Late registration
type: Class
subclass of: Registration
comment: Registration after a specific deadline .

Local organisation chair
type: Class
subclass of: Chair
comment: The chair of the local organizers of the event.

On site registration
type: Class
subclass of: Registration
comment: Process of signing up for an event on the day of, or at the site of, the event.

Organizer
type: Class
subclass of: Person
comment: A person who arranges an event or activity. .

PHD symposium
type: Class
subclass of: Symposium
comment: Event for PHD student to present and receive feedback on their ongoing work.

Past events
type: Class
comment: Events happened or existed before the present time.

Platinum sponsorship
type: Class
subclass of: Sponsorship
comment: Sponsorship Package.

Poster chair
type: Class
subclass of: Chair
comment: The poster chair is responsible for recruiting and selecting poster fair organizers for the fairs that fall under the shared interest category.

Posters track
type: Class
subclass of: Track
comment: Present research contributions as posters.

Program chair
type: Class
subclass of: Chair
comment: The Program Chair is responsible for working to develop the annual program budget, manage chapter-programming delivery, monitor program quality, manage member satisfaction with programs, and manage all speaker communications.

Program committee member
type: Class
subclass of: Person
comment: The program committee is responsible for objectively and thoroughly reviewing all submissions, for submitting timely, informative reviews that provide authors with feedback about their submissions, and for attending the program committee meetings.

Program schedule
type: Class
comment: A plan for carrying out a process or procedure, giving lists of intended events and times.

Publisher
type: Class
subclass of: Organization
comment: The publisher of the event proceedings.

Registration
type: Class
comment: The action or process of registering or of being registered.

Regular registration
type: Class
subclass of: Author registration
disjoint with: Student registration
comment: Normal registration

Research field
type: Class
comment: Area of interest.

Research track
type: Class
subclass of: Track
comment: The track for fundamental research, innovative technology, and applications concerning the research topic of the event.

Resource track
type: Class
subclass of: Track
comment: The Resources Track aims to promote the sharing of resources including: datasets, ontologies, vocabularies, ... etc

Reviewer
type: Class
subclass of: Person
comment: A person who reviews the submissions and give feedback about the submitted articles.

Silver sponsorship
type: Class
subclass of: Sponsorship
comment: Sponsorship Package.

Sponsor
type: Class
subclass of: Organization
comment: The Sponsor of the event (i.e. company, university ... etc.).

Sponsorship
type: Class
comment: Refer to a person or organization with some sort of responsibility for another person or organisation.

Sponsorship chair
type: Class
subclass of: Chair
comment: A person responsible for collecting funding from two kinds of sources: granting institutions and corporations.

Student
type: Class
subclass of: Person
comment: A person enrolled in a school or other educational institution.

Student registration
type: Class
subclass of: Author registration
comment: Students full-time enrolled in a college or university can register as a student for the reduced early career rate.

Submission guidelines
type: Class
comment: Instructions for the submission process .

Symposium
type: Class
subclass of: AcademicEvent
comment: A conference or meeting to discuss a particular subject.

Symposiums series
type: Class
subclass of: EventSeries
comment: A series of symposiums.

Travel information
type: Class
comment: The information about the travel: date, place, ...etc .

Tutorial chair
type: Class
subclass of: Chair
comment: A person responsible for requesting tutorial proposals and making final selections.

Workshop chair
type: Class
subclass of: Chair
comment: The one responsible for collaborating with the workshop chairs for other ACL-affiliated conferences in the given year, in preparing and circulating the Call for Proposals, and in reviewing submissions.

DCMI Metadata Terms - other
type: NamedIndividual
modified: 2012-06-14
publisher: DCMI

S3
is rule enabled: true
type: Imp
body: IndividualPropertyAtom
  property predicate: holdsRoleIn
  argument1: a
  argument2: e
body: ClassAtom
  class predicate: Agent
  argument1: a
head: IndividualPropertyAtom
  property predicate: participatesIn
  argument1: a
  argument2: e

S4
is rule enabled: true
type: Imp
body: BuiltinAtom
  builtin: equal
  arguments: l1
  arguments: l2
body: BuiltinAtom
  builtin: equal
  arguments: ed1
  arguments: ed2
body: IndividualPropertyAtom
  property predicate: hasLocation
  argument1: e1
  argument2: l1
body: IndividualPropertyAtom
  property predicate: hasLocation
  argument1: e2
  argument2: l2
body: DatavaluedPropertyAtom
  property predicate: startDate
  argument1: e1
  argument2: sd1
body: DatavaluedPropertyAtom
  property predicate: endDate
  argument1: e1
  argument2: ed1
body: DatavaluedPropertyAtom
  property predicate: startDate
  argument1: e2
  argument2: sd2
body: DatavaluedPropertyAtom
  property predicate: endDate
  argument1: e2
  argument2: ed2
body: BuiltinAtom
  builtin: equal
  arguments: sd1
  arguments: sd2
head: IndividualPropertyAtom
  property predicate: colocatedWith
  argument1: e1
  argument2: e2

S5
is rule enabled: true
type: Imp
body: IndividualPropertyAtom
  property predicate: hasLocation
  argument1: e1
  argument2: l1
body: IndividualPropertyAtom
  property predicate: colocatedWith
  argument1: e1
  argument2: e2
head: IndividualPropertyAtom
  property predicate: hasLocation
  argument1: e2
  argument2: l1

S6
is rule enabled: true
type: Imp
body: IndividualPropertyAtom
  property predicate: hasLocation
  argument1: e2
  argument2: http://rdfs.org/sioc/ns#l
body: IndividualPropertyAtom
  property predicate: colocatedWith
  argument1: e1
  argument2: e2
head: IndividualPropertyAtom
  property predicate: hasLocation
  argument1: e1
  argument2: http://rdfs.org/sioc/ns#l